##TITLE=1H_Pr 43-M
 200.13MHz, CDCl3,
 8 sc
 
 11.3.2025
##JCAMPDX= 6.0         $$ Bruker NMR JCAMP-DX V2.0
##DATA TYPE= NMR FID
##DATA CLASS= NTUPLES
##ORIGIN= UXNMR, Bruker Analytische Messtechnik GmbH
##OWNER= pz
$$ XWIN-NMR		Version 3.5
$$ Tue Mar 11 16:32:08 2025 Russian Standard Time (UT+4h)  she@DPX200
##.OBSERVE FREQUENCY= 200.1313
##.OBSERVE NUCLEUS= ^1H
##.DELAY= (6, 6)
##.ACQUISITION MODE= SIMULTANEOUS
##.ACQUISITION SCHEME= undefined
##.AVERAGES= 8
##.DIGITISER RES= 18
##SPECTROMETER/DATA SYSTEM= spect
##.PULSE SEQUENCE= zg30
##.SOLVENT NAME= CDCl3
##.SHIFT REFERENCE= (INTERNAL, CDCl3, 0, 14.3821)
##AUDIT TRAIL= $$ (NUMBER, WHEN, WHO, WHERE, WHAT)
$$ ##TITLE= Audit trail, XWIN-NMR		Version 3.5
$$ ##JCAMPDX= 5.01
$$ ##ORIGIN= Bruker BioSpin GmbH
$$ ##OWNER= she
$$ F:/spectra/data/she/nmr/H-C/1/audita.txt
$$ ##AUDIT TRAIL=  $$ (NUMBER, WHEN, WHO, WHERE, WHAT)
(   1,<2025-03-11 16:30:59.50 +0400>,<she>,<DPX200>,
      <created by zg, POWCHK disabled, PULCHK disabled
       configuration hash MD5:
       00 E9 B6 7A A2 85 ED C7 34 08 36 98 17 FE 4E 26
       data hash MD5: 16K
       35 4C 81 FF 9A CD 0C CC 47 CB B3 2D 89 36 9D 7A>)
$$ ##END=
$$ 
$$ hash MD5
$$ CD 99 81 C0 88 98 41 B9 2D 9E DE AE DE C4 01 66
##$RELAX= 
##$RELAX= 
##$RELAX= 
##$RELAX= 
##$RELAX= 
##$RELAX= 
$$ Bruker specific parameters
$$ --------------------------
##$DU= <F:/spectra>
##$EXPNO= 1
##$NAME= <H-C>
##$PROCNO= 1
##$TYPE= <nmr>
##$USER= <she>
##$AMP= (0..31)
100 100 100 100 100 100 100 100 100 100 100 100 100 100 100 100 100 100 
100 100 100 100 100 100 100 100 100 100 100 100 100 100 
##$AQSEQ= 0
##$AQ_mod= 1
##$AUNM= <au_zg>
##$AUTOPOS= <>
##$BF1= 200.13
##$BF2= 200.13
##$BF3= 200.13
##$BF4= 200.13
##$BF5= 200.13
##$BF6= 200.13
##$BF7= 200.13
##$BF8= 200.13
##$BYTORDA= 1
##$CFDGTYP= 0
##$CFRGTYP= 5
##$CHEMSTR= <none>
##$CNST= (0..31)
1 1 145 1 1 1 1 1 1 1 1 1 1 1 1 1 1 1 1 1 1 1 1 1 1 1 1 1 1 1 1 1 
##$CPDPRG= <>
##$CPDPRG1= <>
##$CPDPRG2= <>
##$CPDPRG3= <>
##$CPDPRG4= <mlev>
##$CPDPRG5= <mlev>
##$CPDPRG6= <mlev>
##$CPDPRG7= <mlev>
##$CPDPRG8= <mlev>
##$CPDPRGB= <>
##$CPDPRGT= <>
##$D= (0..31)
0 0.7 0 0 0 0 0 0 0 0 0 0.03 0 0 0 0 0 0 0 0 0 0 0 0 0 0 0 0 0 0 0 0 
##$DATE= 1741696258
##$DBL= (0..7)
120 120 120 120 120 120 120 120 
##$DBP= (0..7)
150 150 150 150 150 150 150 150 
##$DBP07= 0
##$DBPNAM0= <>
##$DBPNAM1= <>
##$DBPNAM2= <>
##$DBPNAM3= <>
##$DBPNAM4= <>
##$DBPNAM5= <>
##$DBPNAM6= <>
##$DBPNAM7= <>
##$DBPOAL= (0..7)
0.5 0.5 0.5 0.5 0.5 0.5 0.5 0.5 
##$DBPOFFS= (0..7)
0 0 0 0 0 0 0 0 
##$DE= 6
##$DECBNUC= <off>
##$DECIM= 32
##$DECNUC= <off>
##$DECSTAT= 4
##$DIGMOD= 1
##$DIGTYP= 9
##$DL= (0..7)
0 120 120 120 120 120 120 120 
##$DP= (0..7)
150 150 150 150 150 150 150 150 
##$DP07= 0
##$DPNAME0= <>
##$DPNAME1= <>
##$DPNAME2= <>
##$DPNAME3= <>
##$DPNAME4= <>
##$DPNAME5= <>
##$DPNAME6= <>
##$DPNAME7= <>
##$DPOAL= (0..7)
0.5 0.5 0.5 0.5 0.5 0.5 0.5 0.5 
##$DPOFFS= (0..7)
0 0 0 0 0 0 0 0 
##$DQDMODE= 0
##$DR= 18
##$DS= 0
##$DSLIST= <SSSSSSSSSSSSSSS>
$$ [...]
##$SUBNAM0= <"">
##$SUBNAM1= <"">
##$SUBNAM2= <"">
##$SUBNAM3= <"">
##$SUBNAM4= <"">
##$SUBNAM5= <"">
##$SUBNAM6= <"">
##$SUBNAM7= <"">
##$SUBNAM8= <"">
##$SUBNAM9= <"">
##$SW= 18.0517328524113
##$SWIBOX= (0..15)
0 0 2 0 0 0 0 0 0 0 0 0 0 0 0 0 
##$SW_h= 3612.71676300578
##$TD= 16384
##$TD0= 1
##$TE= 0
##$TE2= 300
##$TE3= 300
##$TEG= 300
##$TL= (0..7)
0 120 120 120 120 120 120 120 
##$TP= (0..7)
150 150 150 150 150 150 150 150 
##$TP07= 0
##$TPNAME0= <>
##$TPNAME1= <>
##$TPNAME2= <>
##$TPNAME3= <>
##$TPNAME4= <>
##$TPNAME5= <>
##$TPNAME6= <>
##$TPNAME7= <>
##$TPOAL= (0..7)
0.5 0.5 0.5 0.5 0.5 0.5 0.5 0.5 
##$TPOFFS= (0..7)
0 0 0 0 0 0 0 0 
##$TUNHIN= 0
##$TUNHOUT= 0
##$TUNXOUT= 0
##$USERA1= <user>
##$USERA2= <user>
##$USERA3= <user>
##$USERA4= <user>
##$USERA5= <user>
##$V9= 5
##$VALIST= <valist>
##$VCLIST= <CCCCCCCCCCCCCCC>
##$VD= 0
##$VDLIST= <DDDDDDDDDDDDDDD>
##$VPLIST= <PPPPPPPPPPPPPPP>
##$VTLIST= <TTTTTTTTTTTTTTT>
##$WBST= 1024
##$WBSW= 4
##$XGAIN= (0..3)
0 0 0 0 
##$XL= 0
##$YL= 0
##$YMAX_a= 689720
##$YMIN_a= -855738
##$ZGOPTNS= <>
##$ZL1= 120
##$ZL2= 120
##$ZL3= 120
##$ZL4= 120
##$ABSF1= 10
##$ABSF2= 0
##$ABSG= 5
##$ABSL= 3
##$ALPHA= 0
##$AQORDER= 0
##$ASSFAC= 0
##$ASSFACI= 0
##$ASSFACX= 0
##$ASSWID= 0
##$AUNMP= <proc_1d>
##$AZFE= 0.1
##$AZFW= 0.1
##$BCFW= 1
##$BC_mod= 2
##$BYTORDP= 1
##$COROFFS= 0
##$CY= -3
##$DATMOD= 1
##$DC= 2
##$DFILT= <>
##$DTYPP= 0
##$F1P= 0
##$F2P= 0
##$FCOR= 0.5
##$FTSIZE= 0
##$FT_mod= 4
##$GAMMA= 1
##$GB= 0.15
##$INTBC= 1
##$INTSCL= 1
##$ISEN= 128
##$LB= 0.25
##$LEV0= 0
##$LPBIN= 0
##$MAXI= 10000
##$MC2= 0
##$MEAN= 0
##$ME_mod= 0
##$MI= 1.114404
##$NCOEF= 0
##$NC_proc= 0
##$NLEV= 6
##$NOISF1= 3.799351
##$NOISF2= 2.8
##$NSP= 1
##$NTH_PI= 0
##$NZP= 0
##$OFFSET= 14.38212
##$PC= 1
##$PHC0= -466.7471
##$PHC1= 8.59221
##$PH_mod= 1
##$PKNL= yes
##$PPARMOD= 0
##$PSCAL= 0
##$PSIGN= 0
##$REVERSE= no
##$SF= 200.129724274929
##$SI= 16384
##$SIGF1= 3
##$SIGF2= 2
##$SINO= 400
##$SIOLD= 16384
##$SREGLST= <1H.CDCl3>
##$SSB= 0
##$STSI= 0
##$STSR= 0
##$SW_p= 3205.1282051282
##$SYMM= 0
##$S_DEV= 0
##$TDeff= 0
##$TDoff= 0
##$TI= <>
##$TILT= no
##$TM1= 0
##$TM2= 0
##$TOPLEV= 0
##$USERP1= <user>
##$USERP2= <user>
##$USERP3= <user>
##$USERP4= <user>
##$USERP5= <user>
##$WDW= 1
##$XDIM= 8192
##$YMAX_p= 0
##$YMIN_p= 0
$$ End of Bruker specific parameters
$$ ---------------------------------
##NTUPLES= NMR FID
##VAR_NAME=  TIME,          FID/REAL,        FID/IMAG
##SYMBOL=    X,             R,               I
##VAR_TYPE=  INDEPENDENT,   DEPENDENT,       DEPENDENT
##VAR_FORM=  AFFN,          ASDF,            ASDF
##VAR_DIM=   8192,          8192,            8192
##UNITS=     SECONDS,       ARBITRARY UNITS, ARBITRARY UNITS
##FACTOR=    0.0002768,     1,               1
##FIRST=     0,             0,               0
##LAST=      2.2672688,     0,               0
##MIN=       0,             -855738,         0
##MAX=       2.2672688,     689720,          0
$$ Real data points
##PAGE= N=1
##DATA TABLE= (X++(R..R)), XYDATA
$$ plain form
0 0 0 0 0 0 0 0 0 0 0 0 0 -8 0 -8 8 -8 8 -8 13 -16 16 -21 24 -29 35 -40 47 -53 61 -69 81 -92 104 -118 133
35 133 -149 167 -187 208 -232 259 -286 319 -353 388 -428 473 -521 575 -635 699 -771 848 -937
54 -937 1035 -1149 1276 -1425 1600 -1805 2056 -2364 2765 -3293 4033 -5145 7000 -10673 20774
69 20774 -110626 -356757 -193695 31348 237609 484944 689720 632986 453784 308794
79 308794 206225 123448 39906 -159568 -363726 -347836 -180768 -111982 -114723 -100315 -129389
90 -129389 -174618 -94469 39769 105646 165199 238566 172666 -4126 -69204 20573 121389
101 121389 144738 39193 -163928 -271242 -210888 -178180 -237692 -218805 -119163 -90937 -78545
112 -78545 26283 128982 171074 221732 239549 169555 126998 164458 173639 131085 67461 -62230
$$ packed form
0@%%%%%%%%%%%qQqJ6j6J6j6K1k9L2l7M5n3O4p5Q7j00J14j30J50j73J96k22K51
35A33k82L16l54L95m40M91n45O05o72P41q16R01r94J096j210J334j470J619j785
54i37J972k184K425k701L025l405L861m420N129o058P326r178J2145j7673L1447
69B0774j31400k46131J63062K25043K06261K47335K04776n6734j79202j44990
79C08794j02569q2777q3542j99474k04158J5890J67068O8786k741J4408k9074
90a29389m5229Q0149J34238O5877N9553P3367o5900j76792o5078Q9777J00816
101A21389K3349j05545k03121j07314O0354L2708n9512J8887R9642K8226J2392
112g8545J04828J02699M2092N0658J7817o9994m2557L7460R181m2554o3624j29691
$$ plain form
124 -62230 -180716 -116146 48256 102726 77558 62345 -18918 -154084 -194389 -157165 -140091
135 -140091 -85049 37744 104638 79966 47200 14708 -37822 -87339 -160208 -246709 -196785 9406
147 9406 149518 132441 108292 117121 71592 18208 32977 56413 55492 69135 51834 -28028 -67032
160 -67032 -28355 -8451 -16579 -4540 -17250 -50620 -16820 32961 -5126 -48252 -3458 43769
172 43769 49324 90565 141423 112613 39640 -26790 -105196 -152892 -124256 -95980 -106532 -87683
184 -87683 -61013 -90484 -88446 10040 82246 64724 61864 100798 104426 82182 75481 58164 44266
197 44266 70737 81545 40530 17746 17233 -38436 -123961 -168749 -188817 -175116 -72864 44318
209 44318 64378 50129 85495 99846 52153 18594 18491 14033 21208 36077 15896 -5487 12173
$$ packed form
124f2230j18486O4570J64402N4470k5168j5213q1263j35166m0305L7224J7074
135a40091N5042J22793O6894k4672l2766l2492n2530m9517p2869q6501M9924K06191
147I406J40112j7077k4149Q829m5529n3384J4769K3436r21J3643j7301p9862l9004
160f7032L8677J9904q128J2039j2710l3370L3800M9781l8087m3126M4794M7227
172D3769N555M1241N0858k8810p2973o6430p8406m7696K8636K8276j0552J8849
184h7683K6670k9471K038R8486P2206j7522k860L8934L628k2244o701j7317j3898
197D4266K6471J0808m1015k2784n13n5669q5525m4788k0068J3701J02252J17182
209D4318K0060j4249L5366J4351m7693l3559j03m458P175J4869k0181k1383J7660
$$ plain form
222 12173 3309 -54267 -75486 -55678 -64329 -69877 -29377 -11968 -39621 -34279 10282 41918 75308
235 75308 113734 105991 69593 55024 24910 -38473 -60818 -36001 -33834 -34663 2340 19030 -8254
248 -8254 -13450 -1382 -31308 -63561 -42746 -10439 1374 16794 25245 17853 33153 55145 32128
261 32128 8393 30364 29061 -27019 -55655 -37762 -34768 -35597 -1742 26083 27223 37808 41033
274 41033 3681 -30091 -32856 -41169 -45381 -13284 15748 16621 32685 54063 28679 -7429 -3764
287 -3764 -2904 -26586 -25065 -3583 -5886 -7896 12340 18963 12563 23258 22453 -4770 -12027 -3396
301 -3396 -29446 -56734 -32217 -1557 -2900 6405 34202 37672 26637 21783 1800 -24261 -19879
314 -19879 -6900 -10714 51 25594 22772 10323 22298 19530 -13526 -23235 -10693 -26043 -45728
$$ packed form
222A2173q864n7576k1219J9808q651n548M0500J7409k7653N342M4561L1636L3390
235G5308L8426p743l6398j4569l0114o3383k2345K4817K167q29L7003J6690k7284
248h254n196J2068k9926l2253K0815L2307J1813J5420Q451p392J5300K1992k3017
261C2128k3735K1971j303n6080k8636J7893K994q29L3855K7825J140J0585L225
274D1033l7352l3772k765q313m212L2097K9032Q73J6064K1378k5384l6108L665
287c764Q60k3682J521K1482k303k010K0236O623o400J0695q05k7223p257Q631
301c396k6050k7288K4517L0660j343R305K7797L470j1035m854j9983k6061M382
314a9879J2979l814J0765K5543k822j2449J1975k768l3056r709J2542j5350j9685
$$ plain form
327 -45728 -28318 -8049 -8237 2163 21356 22491 21825 26658 11452 -6671 -2399 -7888 -31004 -19951
341 -19951 16593 22482 11600 20887 19923 -7305 -21494 -20435 -31237 -33662 -15436 -6831 -2278 24760
355 24760 44742 33407 27613 31483 10616 -13563 -6031 3095 -8561 -8094 4477 -2046 -10200 -198
369 -198 -679 -18032 -24573 -30109 -42370 -32164 -5435 -1671 -6067 12545 23941 11074 14203 33293
383 33293 27384 8349 5300 -440 -14502 -9125 6198 6783 7261 14408 7472 -33 12044 13718
397 13718 -10492 -22174 -14528 -16167 -11226 17026 32276 19755 13019 9772 -10213 -25114 -20153
410 -20153 -22499 -32599 -26279 -17185 -16365 1616 26651 20069 -2413 -6814 -10866 -22729 -14299 7109
424 7109 11198 11150 23554 28023 25467 31831 27236 771 -13732 -9315 -12508 -9436 17960 33039
$$ packed form
327d5728J7410K0269j88J0400J9193J135o66M833j5206j8123M272n489k3116J1053
341a9951L6544N889j0882R287r64k7228j4189J059j0802k425J8226Q605M553K7038
355B4760J9982j1335n794L870k0867k4179P532R126j1656M67J2571o523q154J0002
369a98m81j7353o541n536j2261J0206K6729L764m396J8612J1396j2867L129J9090
383C3293n909j9035l049n740j4062N377J5323N85M78P147o936p505J2077J674
397A3718k4210j1682P646j639M941K8252J5250j2521o736l247j9985j4901M961
410b0153k346j0100O320R094Q20J7981K5035o582k2482m401m052j1863Q430K1408
424G109M089m8J2404M469k556O364m595k6465j4503M417l193L072K7396J5079
$$ plain form
438 33039 15886 1297 467 -8028 -14149 -4899 -3876 -16533 -18999 -16662 -22955 -18655 -4971 -9181
452 -9181 -20383 -11877 -1994 -2570 7283 17790 395 -21315 -14719 108 7540 24689 40230 32907
466 32907 21191 16801 2804 -10285 -2182 1748 -13154 -15029 3549 13110 16165 26556 21357
479 21357 -3267 -15768 -13565 -15193 -11805 -1316 -4794 -12222 -1090 8426 58 -3731 -2448 -20223
493 -20223 -42754 -40908 -29927 -21894 -655 22416 20358 8811 13417 19944 17171 15066 11355 4005
507 4005 12273 28007 25162 16356 21600 16244 -10285 -21144 -9338 -4434 -6657 -2866 -8471 -24841
521 -24841 -26205 -15124 -9082 1525 16373 13315 2774 6210 5040 -11835 -18234 -12280 -17778 -21462
535 -21462 -4282 11218 9287 7412 5280 -9297 -17967 -9295 -644 6566 19589 22133 12881 19145
$$ packed form
438C3039j7153j4589q30q495o121R250J023j2657k466K337o293M300J3684m210
452i181j1202Q506R883n76R853J0507j7395k1710O596J4827P432J7149J5541p323
466C2907j1716m390j3997j3089Q103L930j4902j875J8578R561L055J0391n199
479B1357k4624j2501K203j628L388J0489l478p428J1132R516q368l789J283j7775
493b0223k2531J846J0981Q033K1239K3071k058j1547M606O527k773k105l711p350
507D005Q268J5734k845q806N244n356k6529j0859J1806M904k223L791n605j6370
521b4841j364J1081O042J0607J4848l058j0541L436j170j6875o399N954n498l684
535b1462J7180J5500j931j875k132j4577q670Q672Q651P210J3023K544r252O264
$$ plain form
549 19145 34581 27284 10960 12347 11639 -8309 -21222 -15630 -9856 -6857 -2803 -7141 -12544 -4136
563 -4136 1508 -10210 -18809 -16475 -18721 -17323 1247 13511 7716 9452 17085 4750 -12716 -8510
577 -8510 1413 518 1952 5211 946 1602 9397 7530 2887 10133 11547 1462 4872 15376 5126
592 5126 -12523 -10391 -3647 -6320 -3327 6284 8172 7658 6607 -7362 -21039 -15016 -5351 -7268 -4185
607 -4185 5855 4800 712 6260 3374 -12847 -15660 -3795 -3193 -9606 -3980 4778 7237 9353 8923
622 8923 5485 13180 22764 12132 -2420 1689 4183 -8164 -10010 2833 4866 -1375 393 -1179
636 -1179 -12541 -16345 -13774 -15755 -11016 1816 6086 6205 14929 18310 7308 3399 7994 2210 -4368
651 -4368 1628 1807 -10405 -12041 -3444 -5483 -10862 -6521 -1590 123 4257 1152 -8813 -4131 10055
$$ packed form
549A9145J5436p297j6324J387p08j9948j2913N592N774K999M054m338n403Q408
563d136N644j1718q599K334k246J398J8570J2264n795J736P633j2335j7466M206
577h510R923q95J434L259m265O56P795j867m643P246J414j0085L410J0504j0250
592E126j7649K132O744k673K993R611J888n14j051j3969j3677O023R665j917L083
607d185J0040j055m088N548k886j6221k813J1865O02o413N626Q758K459K116m30
622H923l438P695R584j0632j4552M109K494j2347j846J2843K033o241J768j572
636a179j1362l804K571j981M739J2832M270J19Q724L381j1002l909M595n784o578
651d368N996J79j2212j636Q597k039n379M341M931J713M134l105r965M682J4186
$$ plain form
666 10055 9081 2368 12274 23424 16974 7872 3499 -5447 -12282 -9244 -9768 -14528 -9328 -1288 -3270
681 -3270 -4066 223 -3920 -7471 2210 7566 328 1874 11548 7985 -522 4503 10110 5124 3758
696 3758 6236 1102 -5632 -9116 -15276 -17028 -6006 -108 -5715 -1004 12574 10210 -2145 -2331 892
711 892 -2772 -2248 3771 3742 4891 11420 9036 -913 -701 2571 -2969 -5505 -2259 -6540 -11510 -4201
727 -4201 4 -6149 -4031 7771 8414 1160 491 915 -2390 -1359 -522 -3646 1920 12897 10070 1165
743 1165 4143 5951 -5290 -10760 -4207 -3453 -7368 -3575 912 -1268 -343 2253 -918 -1093 5110 3597
759 3597 -2818 -64 3025 -1991 -1598 4868 2694 -1052 6247 8826 -2159 -8293 -3933 -3798 -7358
774 -7358 -5775 -3308 -713 6931 8573 -95 -1420 5441 2350 -5925 -1755 5606 2564 610 4804
$$ packed form
666A0055r74o713R906J1150o450r102m373q946o835L038n24m760N200Q040j982
681c270p96M289m143l551R681N356p238J546R674l563q507N025N607m986j366
696C758K478n134o734l484o160j752J1022N898n607M711J3578k364j2355j86L223
711H92l664N24O019k9J149O529k384r949K12L272n540k536L246m281m970P309
727d201M205o153K118J1802O43p254o69M24l305J031Q37l124N566J0977k827q905
743A165K978J808j1241n470O553P54l915L793M487k180R25K596l171j75O203j513
759C597o415K754L089n016L93O466k174l746P299K579j0985o134M360J35l560
774g358J583K467K595P644J642q668j325O861l091q275M170P361l042j954M194
$$ plain form
789 4804 3560 68 2488 2486 -1915 -965 -307 -6664 -8476 -3489 -4663 -8059 -1575 3575 -1449 -1560 5600
806 5600 2702 -5923 -3814 1692 718 1271 5845 6846 7574 8160 2184 -3096 1599 3279 -6160 -8272
822 -8272 -1 328 -5551 -1742 4581 2795 1092 2550 40 -2015 1333 1193 -3194 -759 2945 311
838 311 146 3737 -1359 -8993 -6777 -4718 -11040 -11219 -1493 1979 -700 1452 5058 4615 6628 7555
854 7555 4157 4469 8375 4953 -23 4858 8133 -431 -5241 -77 417 -4604 -3578 -1416 -4532 -5673
870 -5673 -3542 -4534 -3353 2347 3244 550 2511 2872 -3153 -3649 945 -3570 -10825 -6384 613 -1700
886 -1700 -2646 2980 4418 1454 759 938 1277 5085 6484 2034 3279 9959 8452 2412 4691 6725
902 6725 -1105 -6917 -4671 -4439 -6260 -3372 -989 -2890 -1828 496 -1128 -1990 486 -1988 -6501 -2747
$$ packed form
789D804j244l492K420km401R50O58o357j812M987j174l396O484N150n024j11P160
806E600k898q625K109N506r74N53M574J001P28N86n976n280M695J680r439k112
822h272Q271L29n879L809O323j786j703J458k510k055L348j40m387K435L704k634
838C11j65L591n096p634K216K059o322j79R726L472k679K152L606m43K013R27
854G555l398L12L906l422m976M881L275q564m810N164M94n021J026K162l116j141
870e673K131r92J181N700Q97k694J961L61o025m96M594m515p255M441O997k313
886a700r46N626J438k964o95J79L39L808J399m450J245O680j507o040K279K034
902F725p830n812K246K32j821K888K383j901J062K324j624q62K476k474m513L754
$$ plain form
918 -2747 825 -3059 -3368 2715 1515 -4434 -2547 1507 -195 -1296 919 1062 1037 3801 3648 3039 7974
935 7974 9537 3057 882 5740 4486 -1856 -1608 384 -3557 -5642 -1964 -1028 -2649 -717 -579 -2865
951 -2865 -2653 -2172 -4711 -4033 -2 -1500 -4426 453 4926 879 -1540 1920 546 -4356 -3527 323
967 323 768 1705 3426 2676 3622 6865 4274 46 2353 4260 -812 -2927 2037 2513 -1350 -417 1681
984 1681 -959 -1998 -509 -1869 -3522 -2209 -2967 -4751 -1669 870 -1792 -1683 2764 1319 -3682 -1575
1000 -1575 1502 -1754 -3433 23 1749 718 2029 2998 2004 3206 3408 228 -237 3021 1664 -2366
1016 -2366 -202 2655 -710 -2081 1771 2092 -1474 -1284 -53 -2209 -2477 -988 -1955 -1867 1724 1702 -753
1033 -753 779 1860 -2214 -3611 74 -459 -3772 -1465 2107 681 -601 1438 1498 669 1966 892
$$ packed form
918b747L572l884l09O083j200n949J887M054j702j101K215J43k5K764j53o09M935
935G974J563o480k175M858j254o342K48J992l941k085L678R36j621J932J38k286
951b865K12M81k539O78M031j498k926M879M473m047k419L460j374m902Q29L850
967C23M45R37J721p50R46L243k591m228K307J907n072k115M964M76l863R33K098
984A681k640j039J489j360j653J313p58j784L082K539k662J09M447j445n001K107
1000a575L077l256j679L456J726j031J311R69r94J202K02l180m65L258j357m030
1016b366K164K857l365j371L852L21l566J90J231k156k68J489r67Q8L591k2k455
1033g53J532J081m074j397L685n33l313K307L572j426j282K039O0q29J297j074
$$ plain form
1049 892 -1058 992 2646 -669 -1273 2714 2224 -1031 834 3489 -28 -2814 -1456 -1290 -2942 -1922
1065 -1922 -362 -387 1211 2285 -308 -1281 1261 155 -3305 -952 1862 -193 -838 2556 2553 -762 -410
1082 -410 906 -491 -982 477 -542 -1280 367 -310 -2299 265 3038 93 -1146 1511 1253 -2054
1098 -2054 -981 1183 -307 -691 1212 1261 70 1504 797 -1683 -1113 42 -2033 -2498 978 674 -2345
1115 -2345 -631 1800 481 -26 2352 1738 -659 -255 469 -1183 -917 784 -197 300 2332 800 -2068
1132 -2068 -598 1086 -2672 -4101 -506 1327 150 1356 2682 985 42 775 -745 -1429 423 368
1148 368 -1483 -172 1300 -1060 -1744 1066 488 -2000 -852 1016 -482 -1125 734 261 -987 520
1164 520 1781 875 1358 2146 -445 -1528 555 219 -2279 -266 2177 279 -1127 439 646 -756
$$ packed form
1049H92j950K050J654l315o04L987m90l255J865K655l517k786J358J66j652J020
1065a922J560k5J598J074k593r73K542j106l460K353K814k055o45L394ll315L52
1082d10J316j397m91J459j019p38J647o77j989K564K773k945j239K657k58l307
1098b054J073K164j490l84J903M9j191J434p07k480N70J155k075m65L476l04l019
1115b345J714K431j319n07K378o14k397M04P24j652K66J701r81M97K032j532k868
1132b068J470J684l758j429L595J833j177J206J326j697r43P33j520o84J852n5
1148C68j851J311J472k360o84K810n78k488J148J868j498o43J859m73j248J507
1164E20J261r06M83P88k591j083K083l36k498K013K443j898j406J566K07j402
$$ plain form
1180 -756 -183 -81 -1636 -993 852 -758 -1760 484 1006 -799 -22 1526 -161 -854 719 -507 -2703
1197 -2703 -1247 1159 237 214 1958 1410 67 978 462 -1278 120 2087 375 -33 2309 2102 -169
1214 -169 232 1180 -1061 -1922 -452 -902 -2061 -796 -716 -2995 -1711 510 -518 -1518 420 903 -808
1231 -808 -200 593 -757 -580 1747 1378 -321 757 1615 40 -508 432 -633 -1082 1376 1548 12
1248 12 1426 3252 1423 187 1641 1615 -26 185 345 -1700 -1701 -643 -1923 -3024 -1047 -449 -2921
1265 -2921 -2496 -902 -1608 -2094 -505 431 -152 1378 2548 875 576 1906 975 -818 608 1527 140
1282 140 354 2007 656 -463 1469 1779 -20 513 2156 735 -346 193 -156 -920 271 75 -2041
1299 -2041 -1458 158 -1441 -3393 -2032 -954 -2331 -1815 -246 -367 -366 1264 1075 -744 147 1039 -269
$$ packed form
1180g56N73J02j555O43J845j610j002K244N22j805P77J548j687o93J573j226k196
1197b703J456K406r22k3J744n48j343R11n16j740J398J967j712m08K342k07k271
1214a69M01R48k241q61J470m50j159J265Q0k279J284K221j028j000J938M83j711
1231h08O08P93j350J77K327l69j699J078Q58j575n48R40j065m49K458J72j536
1248A2J414J826j829j236J454k6j641K11J60k045jJ058j280j101J977N98k472
1265b921M25J594p06m86J589R36n83J530J170j673k99J330r31j793J426R19j387
1282A40K14J653j351j119J932L10j799N33J643j421j081N39l49p64J191j96k116
1299b041N83J616j599j952J361J078j377N16J569j21JJ630j89j819Q91Q92j308
$$ plain form
1316 -269 -278 1425 885 62 1608 2085 619 1025 2662 1284 59 1598 2044 390 308 951 146 -565
1334 -565 -75 -1411 -2477 -1086 -1677 -4220 -3869 -1198 -1472 -2340 -379 965 70 583 1693 948 689
1351 689 1716 1280 97 765 1050 -626 -469 451 -800 -1365 534 1294 -560 -332 2008 1655 698 1818
1369 1818 2703 1852 1940 1390 -412 -595 -150 -2311 -3944 -2363 -1603 -3556 -3516 -1206 -1220 -2234 -622 340
1387 340 -87 1265 2295 1705 1828 3127 2427 1332 1950 1791 -263 -437 281 -1227 -2703 -840 110
1404 110 -1596 -1468 649 963 529 846 918 537 1413 1261 -356 274 1375 154 -1916 -788 -149 -1955
1422 -1955 -2251 -962 -1113 -1882 -656 -83 -481 413 1249 483 747 1803 1258 434 1746 1439 -611 -235
1440 -235 1694 506 -1145 123 983 -423 -1063 -391 -520 -551 -219 -991 -1126 385 830 -817 -659 1072
$$ packed form
1316b69rJ703n40q23J546M77j466M06J637j378j225J539M46j654q2O43q05p11
1334e65M90j336j066J391n91k543L51K671k74q68J961J344q95N13J110p45k59
1351F89J027m36j183O68K85j676J57R20j251n65J899P60j854K28K340l53r57J120
1369A818Q85q51Q8n50j802j83M45k161j633J581P60j953M0K310j4j014J612R62
1387C40m27J352J030n90J23J299p00j095O18j59k054j74P18j508j476J863R50
1404A10j706J28K117L14m34L17P2l81Q76j52j617O30J101j221k070J128O39j806
1422a955k96J289j51p69J226N73l98Q94Q36p66K64J056n45q24J312l07k050L76
1440b35J929j188j651J268Q60j406o40O72j29l1L32p72j35J511M45j647J58J731
$$ plain form
1458 1072 309 -1325 -210 886 -61 -232 1043 529 48 1059 1052 -35 319 115 -1026 -794 124 -703
1476 -703 -1546 163 704 -1065 -984 967 602 -599 269 1082 673 923 1047 855 832 1213 -197 -1223 -115
1495 -115 30 -1708 -1891 -434 -793 -1845 -638 181 -449 -211 914 943 492 1545 1283 937 1255 986
1513 986 -100 186 1292 -278 -1986 -842 10 -1881 -2404 -801 -722 -1409 -682 28 229 1230 1412 664
1531 664 1126 2089 1007 -156 1023 1536 -73 -610 338 -335 -1621 -940 -575 -1914 -1722 -965 -763 -322
1549 -322 703 473 257 1503 1689 430 609 2067 1114 -412 233 1126 -512 -1006 -502 -598 -1358 -1226
1567 -1226 -1295 -1451 -354 178 -865 -442 1122 910 -154 1129 1793 342 96 1095 725 -445 -179 118
1585 118 -643 -920 -411 -841 -634 240 -351 -1242 68 805 -515 -489 1461 1154 -163 429 1239 486 130
$$ packed form
1458A072p63j634J115J096r47j71J275n14m81J011pj087L54k04j141K32R18q27
1476g03q43J709N41j769Q1J951l65j201Q68Q13m09K50J24j92k3L81j410j026J108
1495a15J45j738j83J457l59j052J207Q19o30K38J125K9m51J053k62l46L18k69
1513I86j086K86J106j570j708J144Q52j891n23J603P9o87P27P10K01J001J82p48
1531F64M62R63j082j163J179N13j609n37R48o73j286O81L65j339J92P57K02M41
1549c22J025k30k16J246J86j259J79J458r53j526O45Q93j638m94N04r6p60J32
1567a226o9j56J097N32j043M23J564k12j064J283O64j451k46R99l70j170K66K97
1585A18p61k77N09m30K07Q74n91q91J310P37j320K6J950l07j317N92Q10p53l56
$$ plain form
1604 130 87 -317 -615 -36 -557 -1086 104 296 -900 -943 218 -183 -1126 -195 468 -750 -512 285 262 -80
1624 -80 433 568 224 519 784 88 280 1369 738 -484 505 1248 -151 -764 272 122 -843 -723 -627
1643 -627 -727 -519 -150 -647 -487 337 59 -410 576 941 -196 -328 787 204 -965 -194 268 -483 -816
1662 -816 -44 -372 -760 -80 -177 -485 409 1056 440 723 2040 1422 321 1097 1600 563 -111 478 120
1681 120 -745 -584 -707 -1343 -1235 -985 -1640 -1353 -610 -683 -1216 16 622 -230 -114 1140 1101 329 600 950
1701 950 320 128 332 64 -127 344 76 -627 107 703 -232 -437 731 597 -112 247 952 232 114 407
1721 407 271 -277 44 -110 -821 -647 -374 -1236 -1342 -179 -255 -1125 -423 392 -391 -590 301 84 -91 373
1741 373 543 385 631 1238 436 473 1175 887 26 395 951 209 -158 413 74 -622 -229 28 -539 -854
$$ packed form
1604A30m3m04k98N79n21n29J190J92j196m3J161m01r43R31O63j218K38P97k3l42
1624h0N13J35l44K95K65o96J92J089o31j222R89P43j399o13J036j50r65J20R6
1643f27j00K08L69m97J60Q24k78m69R86L65j137j32J115n83j169P71M62p51l33
1662h16P72l28l88O80r7l08Q94O47o16K83J317o18j101P76N03j037o74N89l58
1681A20q65J61j23o36J08K50o55K87P43p3n33J232O06q52J16J254l9p72K71L50
1701I50o30j92K04k68j91M71k68p03P34N96r35k05J168j34p09L59P05p20j18K93
1721D07j36n48L21j54p11J74K73q62j06J163p6q70P02Q15p83j99Q91k17j75M64
1741C73J70j58K46O07q02L7P02k88q61L69N56p42l67N71l39o96L93K57n67l15
$$ plain form
1761 -854 -445 -789 -913 -285 -396 -880 -64 376 -456 -381 567 580 -321 35 466 70 -137 332 123 -322 197
1782 197 -7 -249 39 313 -306 -117 962 601 -108 472 1220 596 256 934 570 -29 100 -28 -483 -573
1802 -573 -387 -936 -966 -393 -667 -1480 -917 -171 -671 -733 263 418 -44 657 1176 821 615 853 441 227 580
1823 580 532 -371 -143 291 -658 -679 135 -215 -684 -134 283 -77 -297 413 277 229 627 528 62 52 385 -335
1845 -335 -504 -11 -429 -1128 -627 -314 -513 -748 -54 22 -343 -18 399 255 443 858 367 191 872 670
1865 670 201 520 540 -109 -310 286 -207 -856 -599 -105 -402 -320 -44 -169 -79 294 8 -193 110 574 -131
1886 -131 -4 499 490 -157 -72 354 -227 -225 187 -157 -368 109 -9 -327 -207 382 -23 -322 207 188 -418 75
1908 75 408 -116 -85 460 414 116 99 399 23 -68 250 -54 -290 162 2 -591 -325 311 -401 -525 -14 -47
$$ packed form
1761h54M09l44j24O28j11m84Q16M40q32P5R48J3r01L56M31l96k07M69k09m45N19
1782A97k04k42K88K74o19J89J079l61p09N80P48o24l40O78l64n99J29j28m55r0
1802e73J86n49l0N73k74q13N63P46n00o2R96J55m62P01N19l55k06K38m12k14L53
1823E80m8r03K28M34r49k1Q14l50m69N50M17l60k20P10j36m8L98r9m66j0L33p20
1845c35j69M93m18o99N01L13j99k35O94P6l65L25M17j44J88M15m91j76O81k02
1865F70m69L19K0o49k01N96m93o49K57M94k97Q2K76j25R0L73k86k01L03M64p05
1886a31J27N03ro47Q5M26n81KM12l44k11M77j18l18J20N89m05k99N29j9o06M93
1908G5L33n24L1N45m6k98j7L00l76r1L18l04k36M52j60n93K66O36p12j24N11l3
$$ plain form
1930 -47 -234 129 386 -49 168 567 357 111 426 473 -269 60 201 -333 -350 -66 -244 -642 -388 66 -459
1951 -459 -348 222 65 -31 222 373 133 411 638 306 -8 412 318 -287 -225 104 -663 -617 -324 -334 -535 -110
1973 -110 98 -109 -49 377 195 -125 625 398 100 205 307 -59 -179 345 220 -91 -188 4 -159 -279 -44
1994 -44 -121 -261 -41 -11 -329 -100 446 104 -92 179 185 -43 175 258 -36 -14 313 70 -274 13 147 -291
2016 -291 -185 -12 -161 -208 73 170 -275 14 172 -168 -220 -20 147 -178 30 395 31 206 230 53 -139
2037 -139 209 92 -514 -445 327 -245 -685 -108 -244 -345 -162 301 -157 -76 421 430 194 550 805 84 164 339
2059 339 269 -183 147 17 -392 -411 -91 -361 -456 -16 -158 -213 -42 318 -187 52 387 -31 -253 184 212 -194
2081 -194 -295 136 -241 -198 46 -129 -358 -228 61 -348 -161 234 221 -23 268 304 -12 270 415 139 15
$$ packed form
1930d7j87L63K57m35K17L99k10k46L15M7p42L29J41n34j7K84j78l98K54M54n25
1951d59J11N70j57r6K53J51k40K78K27l32l14M20r4o05O2L29p67M6K93j0k01M25
1973a10K08k07O0M26j82l20P50k27k98J05J02l66j20N24j25l11r7J92j63j20K35
1994d4p7j40K20L0l18K29N46l42j96K71Ok28K18Q3k94K2L27k43l44K87J34m38
2016b91J06J73j49m7K81R7m45K89J58l40n2K00J67l25K08L65l64J75K4j77j92
2037a39L48j17o06O9P72n72m40N77j36j01J83M63m58Q1M97Rk36L56K55p21Q0J75
2059C39p0m52L30j30m09j9L20k70r5M40j42n5J71L60n05K39L35m18k22M37K8m06
2081a94j01M31l77M3K44j75k29J30K89m09J87L95j3k44K91L6l16K82J45k76j24
$$ plain form
2102 15 196 286 -133 -72 277 136 -188 5 -84 -588 -10 -61 -570 -476 24 -367 -395 -180 156 -250 -54 311
2124 311 21 8 493 462 65 482 585 134 -12 432 265 -355 109 168 -352 -183 77 -174 -128 -3 108
2145 108 -84 125 173 -57 28 368 83 -381 -117 -23 -289 -612 -97 -516 -640 -483 -197 -481 -139 181 281
2166 281 41 462 557 323 549 830 191 386 671 458 -19 270 46 -104 -176 -68 -286 -307 -254 -303 -493 -164
2188 -164 94 -462 -143 288 152 -227 -129 257 -151 -301 98 -75 -269 88 -69 -195 23 377 -29 146
2208 146 331 55 -59 209 212 87 40 284 349 -84 240 365 47 -109 226 -140 -22 238 -143 -511 -151
2229 -151 105 -458 -530 -246 -383 -682 -294 -101 -263 -111 75 -143 117 563 263 9 506 338 194 244 391
2250 391 209 -347 113 78 -294 -293 -185 -295 -381 -262 -313 -121 160 152 0 262 528 287 -132 141 248 -77
$$ packed form
2102A5J81R0m19O1L49j41l24J93q9n04N78n1n09R4N00l91k8K15L36m06J96L65
2124C11k90j3M85l1l97M17J03m51j46M44j67o20M64N9n20J69K60k51M6J25J11
2145A08j92K09M8k30Q5L40k85m64K64R4k66l23N15m19j24J57K86k84L42L20J00
2166B81k40M21R5k34K26K81o39J95K85k13m77K89k24j50p2J08k18k1N3m9j90L29
2188a64K58n56L19M31j36l79R8L86m08j50L99j73j94L57j57j26K18L54m06J75
2208A46J85k76j14K68Lj25m7K44O5m33L24J25l18j56L35l66J18K60l81l68L60
2229a51K56n63p2K84j37k99L88J93j62J52J86k18K60M46l00k54M97j68j44N0J47
2250C91j82n56M60l5l72JJ08j10q6J19n1J92K81qj52K62K66k41m19K73J07l25
$$ plain form
2272 -77 -334 -126 -264 -445 -301 -335 -379 -294 -112 -313 -88 225 125 155 525 636 248 173 587 140 -160 167
2294 167 63 -424 -312 -53 -210 -425 -81 -187 -317 -45 266 -244 -342 188 102 -167 126 407 123 -181 132
2315 132 -6 -98 0 49 -213 -64 26 -111 61 137 27 -373 138 172 -69 -142 254 83 -208 -182 212 47 -46
2338 -46 -56 -159 148 284 60 -195 61 139 -140 -67 215 -95 -309 -20 -45 -281 -236 86 -50 -259 12 12 78
2361 78 303 405 -7 176 408 59 -106 114 323 -185 -101 112 3 -192 -92 -104 -200 44 20 -27 0 426
2383 426 323 -145 104 354 5 103 251 -31 -175 59 90 -167 -291 8 -223 -293 -60 -216 -190 -1 190
2404 190 -104 -140 285 67 -112 176 489 -27 -91 142 60 10 -24 -153 -232 -3 83 -2 -190 55 14 -186 24
2427 24 212 19 -56 147 111 -98 86 342 -124 -156 23 65 96 90 -88 -77 155 144 -259 -222 248 -32 -53 -47 158
$$ packed form
2272g7k57K08j38j81J44l4m4Q5J82k01K25L13j00L0L70J11l88p5M14m47l00L27
2294A67j04m87J12K59j57k15L44j06j30K72L11n10r8N30q6k69K93K81k84l04L13
2315A32j38r2R8M9k62J49R0j37J72P6j10m00N11L4k41p3L96j71k91K6L94j65r3
2338d6j0j03L07J36k24k55K56P8k79P3K82l10k14K89k5k36M5L22j36k09K71%O6
2361G8K25J02m12J83K32l49j65K20K09n08Q4K13j09j95J00j2r6K44k4m7K7M26
2383D26j03m68K49K50l49R8J48k82j44K34L1k57j24K99k31p0K33j56K6J89J91
2404A90k94l6M25k18j79K88L13n16o4K33q2n0l4j29p9K29Q6q5j88K45m1k00K10
2427B4J88j93p5K03l6k09J84K56m66l2J79M2L1oj78J1K32j1m03L7M70k80k1OK05
$$ plain form
2452 158 38 37 232 113 77 194 91 -75 290 320 -231 -208 224 34 -158 -42 -66 -59 -429 -50 -16 -334 -113
2475 -113 4 -80 74 154 -122 241 314 130 48 343 208 101 -163 229 208 -234 -197 195 -91 -242 -173 -108 -87
2498 -87 10 -165 -144 107 223 30 155 326 196 -56 109 320 9 -60 -86 -205 10 75 -150 -63 -74 34 -201
2521 -201 -17 134 21 -101 204 264 212 30 113 349 -36 191 -46 -82 -112 -89 -269 -97 17 -148 -287 -141
2543 -141 -44 -354 -177 154 -122 -121 305 286 176 159 200 32 229 121 -38 124 -124 12 -128 -148 103 99 -148
2566 -148 4 239 -28 -300 206 93 -27 -21 36 -91 -113 100 -199 44 -30 -126 -346 6 24 -317 -245 28 -57
2589 -57 -140 -120 42 -98 148 106 64 222 173 89 -55 137 163 30 -106 162 -17 -173 -167 183 -206 -252 84 18
2613 18 -202 -14 -99 -129 -33 -69 -112 90 206 56 -42 8 85 -105 -1 243 -21 -116 -15 78 -220 138 48 -1
$$ packed form
2452A58j20jJ95j19l6J17j03j66L65L0n51K3M32j90j92J16k4Pl70L79L4l18K21
2475a13J17q4J54Q0k76L63P3j84q2K95j35j07k64L92k1m42L7L92k86j51O9O5K1
2498h7R7j75K1K51J16j93J25J71j30k52J65K11l11o9k6j19K15O5k25Q7j1J08k35
2521b01J84J51j13j22L05O0n2j82Q3K36l85K27k37l6l0K3j80J72J14j65j39J46
2543a41R7l10J77L31k76JM26j9j10j7M1j68J97j08j59J62k48J36j40k0K51mk47
2566a48J52K35k67k72N06j13j20ON7j27k2K13k99K43p4r6k20L52J8l41P2K73q5
2589e7q3K0J62j40K46m2m2J58m9q4j44J92K6j33j36K68j79j56OL50l89m6L36o6
2613A8k20J88q5l0R6l6m3K02J16j50r8N0P7j90J04K44k64r5J01R3k98L58r0m9
$$ plain form
2637 -1 -65 123 26 -225 73 240 -47 -121 216 68 -151 -63 226 51 -86 -155 -22 -185 79 -74 -250 -25
2659 -25 40 -297 -139 148 -115 -307 -59 153 -125 140 278 67 12 24 -36 31 142 -4 60 -17 -44 123 -167
2682 -167 88 8 -102 -45 43 102 -251 -136 254 -178 -120 15 -105 29 174 -134 -199 -70 -40 -179 -158 -86 177
2705 177 5 -136 209 -59 -30 108 64 76 -10 128 -91 -40 29 72 -21 194 -73 79 -11 30 -85 -77 112 -30
2729 -30 -65 44 -15 -187 -114 -174 -27 -165 78 -119 -216 118 -22 -127 45 98 -73 123 30 258 -49 -39 79
2752 79 -105 136 157 87 74 204 74 -28 -154 90 -132 -51 135 112 -76 -78 89 -8 33 153 -64 -117 -43 -110
2776 -110 -148 9 161 94 -50 -112 -68 -119 -62 -94 -38 -144 205 -25 -17 117 55 -21 -161 122 156 -59 -151 107 -177
2801 -177 -104 38 -59 -186 105 51 -132 211 59 55 -67 66 201 -222 16 82 -26 -135 64 2 -360 31
$$ packed form
2637ao4J88r7k51K98J67k87p4L37j48k19Q8K89j75j37o9J33j63K64j53j76K25
2659b5O5l37J58K87k63j92K48K12k78K65J38k11n5J2o0O7J11j46O4p7k7J67k90
2682a67K55q0j10N7Q8N9l53J15L90m32N8J35j20J34J45l08o5J29L0j39K1P2K63
2705A77j72j41L45k68K9J38m4J2q6J38k19N1O9M3r3K15k67J52r0M1j15QJ89j42
2729c0l5J09n9j72P3o0J47j38K43j97r7L34j40j05J72N3j71J96r3K28l07J0J18
2752G9j84K41K1p0j3J30j30j02j26K44k22Q1J86k3j88kJ67r7M1J20k17n3P4o7
2776a10l8J57J52o7j44o2M4n1N7l2N6j06L49k30QJ34o2p6j40K83L4k15r2K58k84
2801a77P3J42r7j27K91n4j83L43j52mj22J33J35m23K38O6j08j09J99o2l62L91
$$ plain form
2823 31 41 -246 -222 113 -24 -130 197 -28 -108 102 -69 -32 160 -54 -32 -32 178 145 -83 113 113 119 -103 153
2847 153 58 -117 -101 113 -48 -56 7 31 -56 -43 -145 -249 -4 10 161 -80 198 6 -69 60 104 8 -121 59
2871 59 3 68 -72 -17 88 34 80 219 -200 -72 81 114 -67 140 30 -104 94 106 -106 110 58 17 -52 -116
2895 -116 -73 -189 87 -55 -163 -35 227 -67 -137 226 213 -183 -54 170 45 -35 152 108 -91 111 -30 -53
2917 -53 254 -5 -139 -151 -44 32 -202 -84 20 -70 -178 46 -57 -125 -61 68 -28 54 -50 83 -79 58 -1
2940 -1 -128 -18 43 -59 -287 112 -86 -63 63 -66 9 172 -31 18 -25 34 67 38 125 -12 -18 -156 111 51 -217
2965 -217 -83 108 -23 -57 3 134 -174 -297 -84 -28 124 -56 -184 8 30 -127 66 -45 144 111 -67 -31
2987 -31 91 44 62 -213 -85 -73 43 82 -46 5 2 89 -16 41 61 -243 -13 64 -160 -291 -180 140 11 85
$$ packed form
2823C1J0k87K4L35j37j06L27k25q0K10j71L7J92k14K2%K10l3k28J96%Ok22K56
2847A53r5j75J6K14j61qO3K4q7J3j02j04K45J4J51k41K78j92p5J29M4r6j29J80
2871E9n6O5j40N5J05n4M6J39m19J28J53L3j81K07j10j34J98J2k12K16n2m1o9o4
2895a16M3j16K76j42j08J28K62k94p0L63j3l96J29K24j25q0J87m4j99K02j41k3
2917e3L07k59j34j2J07P6k34J18J04r0j08K24j03o8O4J29r6Q2j04J33j62J37n9
2940aj27J10O1j02k28L99j98K3J26j29P5J63k03M9m3N9L3k9Q7j37oj38K67o0k68
2965b17J34J91j31l4O0J31l08j23K13N6J52j80j28J92K2j57J93j11J89l3j78L6
2987c1J22m7J8k75J28J2J16L9j28N1lQ7j05N7K0l04K30P7k24j31J11L20j29P4
$$ plain form
3011 85 36 -119 -91 -4 -272 30 96 -110 31 310 106 -6 -16 56 37 -96 78 -144 -144 -85 86 -67 106 7
3035 7 -165 59 86 -19 -92 -90 245 111 -8 65 -135 54 37 74 58 -134 35 -37 57 68 131 -23 62 292 -122
3060 -122 -77 278 9 -179 -131 -210 167 196 62 16 -84 122 -27 -113 143 233 -181 -79 74 96 -200 23 -21
3083 -21 -87 -74 21 24 43 -154 69 63 41 226 47 131 6 40 -126 35 114 -47 -36 25 71 -79 -24 127 -62 52
3109 52 198 -52 -45 -21 -73 -57 21 -21 -8 -150 108 19 -40 -10 30 87 -84 150 -41 -90 2 29 51 -104 89 27
3135 27 -70 200 132 -24 181 -188 -1 -150 1 63 -77 -36 6 68 -50 -58 48 61 139 -52 -264 -119 16 18
3159 18 3 68 15 -208 -235 56 102 141 53 -77 -55 34 73 -74 27 -51 37 -81 -162 71 -32 102 -23 -55 -157
3184 -157 17 24 60 19 -61 -57 -71 41 -5 -32 109 141 -84 -144 237 -22 12 2 126 31 -39 -110 -149 -114 166 164 65
$$ packed form
3011H5m9j55K8Q7k68L02O6k06J41K79k04j12j0P2j9j33J74k22%N9J71j53J73r9
3035Gj72K24K7j05p3KL35j34j19P3k00J89j7L7j6j92J69p2R4J1O3j54Q5K30m14
3060a22M5L55k69j88M8p9L77K9j34m6j00K06j49q6K56R0m14J02J53K2k96K23m4
3083b1o6J3R5LJ9j97K23ok2J85j79Q4j25L4j66J61P9j61J1O1M6j50N5J51j89J14
3109E2J46k50PK4n2J6P8m2J3j42K58q9n9L0M0N7j71K34j91m9R2K7K2j55J93o2
3135B7r7K70o8j56K05l69J87j49J51O2j40M1M2O2j18qJ06J3P8j91k12J45J35K
3159A8j5O5n3k23k7K91M6L9q8j30K2Q9L9j47J01p8Q8j18q1K33j03J34j25l2j02
3184a57J74PL6m1q0Mj4J12m6k7J41L2k25o0L81k59L4j0J24r5p0p1l9L5K80kr9
$$ plain form
3211 65 48 -46 -40 -77 73 82 86 -2 -101 -36 -131 110 30 -38 -78 -5 -66 -59 44 -318 91 26 -236 -69 -100 51 129 -53
3239 -53 -50 -168 -61 93 91 97 -81 24 73 186 11 60 20 -41 18 -28 -67 194 89 63 -82 -28 -81 -15 -27 61 -127
3266 -127 -10 -179 91 38 11 -1 -49 32 -95 -124 -86 170 -153 19 75 22 -116 125 2 -119 -112 117 -146 -70
3290 -70 27 61 70 -9 -34 -42 175 56 -93 24 99 -62 -23 109 -113 91 93 78 -40 -182 36 1 -13 185 96 27
3316 27 -26 -29 68 -266 -8 1 34 -67 -63 -52 -143 106 -132 -45 300 102 -57 -5 156 92 44 150 14 21 -23 216
3342 216 -13 -200 90 33 -212 -20 -54 -93 -194 54 67 -67 -73 -51 -144 55 -8 -39 -48 -88 -104 119 101 -105 -11
3367 -11 154 6 66 -1 -25 171 -89 52 -27 -119 5 5 -39 65 61 3 10 124 -44 95 -86 43 104 -66 54
3392 54 105 54 -41 -188 -32 -94 -26 35 -50 131 99 -56 118 99 -36 49 6 184 -206 -106 -83 58 -70 -31 67
$$ packed form
3211F5j7r4Ol7J50RMq8r9O5r5K41q0o8m0P3o1PJ03l62M09o5k62J67l1J51P8j82
3239e3Lj18J07J54kOj78J05M9J13j75M9m0o1N9m6l9K61j05k6j45N4n3O6j2Q8j88
3266a27J17j69K70n3k7j2m8Q1j27k9L8K56l23J72N6n3j38K41j23j21PK29k63P6
3290g0R7L4Rp9k5qK17j19j49J17P5j61L9J32k22K04Kj5j18j42K18l5j4J98q9o9
3316B7n3lR7l34K58RL3j01MJ1r1K49k38Q7L45j98j59N2J61o4m8J06j36Pm4K39
3342B16k29j87K90n7k45J92l4l9j01K48J3j34oK2r3J99o3l1rm0j6K23j8k06R4
3367a1J65j48O0o7k4J96k60J41p9r2J24%m4J04mn8PJ14j68J39j81J29O1j70J20
3392E4N1n1r5j47J56o2O8O1q5J81l2j55J74j9j35Q5m3J78l90J00K3J41j28L9R8
$$ plain form
3417 67 30 -47 119 4 105 -31 -31 144 -131 190 136 90 115 75 172 20 -120 -48 -235 -23 87 67 86 -61
3441 -61 -103 -204 -107 82 74 40 -33 90 -126 -31 127 81 27 47 -150 -232 42 -107 -5 178 47 -27 85 68 73
3466 73 1 -68 -29 1 17 21 -25 -51 -50 40 -43 -199 -49 2 121 4 106 3 100 106 -56 0 -72 -113 57 49 -155 164
3494 164 -101 -22 26 13 68 3 68 61 -112 -115 -71 43 131 163 -81 -26 -66 -128 -36 208 -147 -19 173 -12 31 41
3520 41 -122 -76 -67 128 -79 186 102 26 -63 151 28 175 106 113 310 -81 72 196 -31 22 -20 -9 41 -53 21
3545 21 154 -136 -216 26 -144 -48 -39 -37 42 62 62 -55 79 56 -46 92 -115 -16 -27 -150 73 -85 60 -103 25
3570 25 -95 -284 -30 86 148 -78 80 21 -31 85 -204 92 51 17 -107 -142 53 38 -15 -66 126 66 -50 -58
3594 -58 -35 -146 -97 -115 10 -14 -20 145 -115 -72 -71 115 -41 67 -217 -116 166 -126 -60 82 10 -110 -51 98
$$ packed form
3417F7l7p7J66j15J01j36%J75k75L21n4m6K5m0R7j52j40P2j87K12J10k0J9j47
3441f1m2j01R7J89ql4p3J23k16R5J58m6n4K0j97q2K74j49J02J83j31p4J12j7N
3466G3p2o9L9L0J6Mm6k6JR0q3j56J50N1J19j17J02j03R7Oj62N6p2m1J70qk04L19
3494A64k65P9M8j3N5o5O5pj73lM4J14Q8L2k44N5m0o2R2K44l55J28J92j85M3J0
3520D1j63M6RJ95k07K65q4p6q9K14j23J47o9PJ97l91J53J24k27N3m2J1N0r4P4
3545B1J33k90q0K42j70R6RKP9K0%j17J34k3j02J38k07R9j1j23K23j58J45j63J28
3570B5j20j89K54J16O2k26J58n9n2J16k89K96m1l4j24l5J95j5n3n1J92o0j16q
3594e8K3j11M9j8J25k4oJ65k60M3JJ86j56J08k84J01K82k92O6J42p2j20N9J49
$$ plain form
3618 98 163 -99 -6 98 33 -43 39 38 -12 -174 -178 -57 -68 -14 -39 -145 58 10 -41 -30 -11 -140 -73 -12 -105 115 19
3645 19 -95 -136 -19 222 -129 -174 91 112 76 -45 35 239 -39 33 -1 86 -86 0 -5 -44 -6 -87 5 -52 -102 -37
3671 -37 97 241 -26 87 -4 18 -27 -19 39 -13 -119 19 -8 172 54 -89 -12 -74 90 -113 -146 -11 -85 -74 85
3696 85 75 20 -33 -64 -2 178 -4 -83 47 73 149 28 42 67 229 -126 -28 -99 19 92 -19 -108 -18 -68 122 29
3722 29 -72 -25 -78 -95 -6 8 16 -8 104 -88 -60 112 -120 18 -85 -85 -65 40 -102 100 47 -16 -15 41 193 -69
3748 -69 -102 219 2 -102 -3 89 -76 -42 6 -118 60 -1 91 -105 -147 -28 9 64 -43 181 65 -1 -71 -46 48
3773 48 -92 -16 63 -137 7 -120 141 74 2 -51 21 39 -59 -13 5 -8 -41 -163 -54 51 -150 -29 17 15 116
3798 116 100 37 104 52 42 48 4 -82 -68 144 -130 -96 -88 26 76 -124 135 55 -47 -78 93 -38 -99 -69 18 53 33
$$ packed form
3618I8O5k62R3J04o5p6Q2jn0j62mJ21j1N4k5j06K03m8n1J1J9j29O7O1r3K20r6
3645A9j14m1J17K41l51m5K65K1l6j21Q0K04k78P2l4Q7j72Q6nl9L8q1R2n7n0O5
3671c7J34J44k67J13r1K2m5QN8n2j06J38k7J80j18j43P7o2J64k03l3J35p4J1J59
3696H5j0n5n3l1O2J80j82p9J30K6P6j21J4K5J62l55R8p1J18P3j11q9R0n0J90r3
3722B9j01M7n3j7Q9J4Qk4J12j92K8J72k32J38j03%K0J05j42K02n3o3JN6J52k62
3748f9l3L21k17j04R9R2j65L4M8j24J78o1R2j96m2J19L7N5j07K24j16o6p0K5R4
3773D8j40P6P9k00J44j27K61o7p2n3P2J8r8M6J8j3l3j22J09J05k01J21M6kJ01
3798A16j6o3O7n2j0Om4q6J4K12k74L4QJ14N0k00K59q0j02l1J71j31o1L0Q7L5k0
$$ plain form
3825 33 -39 20 -62 7 5 -24 22 175 -15 12 45 -80 190 55 -70 -20 84 25 56 -72 101 89 -10 -23 -69 156
3851 156 -97 55 -188 106 -30 27 91 26 -45 77 30 -141 39 -24 58 -107 22 -24 47 -8 -49 21 -20 -75 189
3876 189 133 -108 -66 -36 -59 -80 48 51 -65 -67 -87 -50 66 158 99 55 189 -67 -30 19 28 -69 -4 -148 -69 -18 99
3903 99 -212 -16 51 -109 74 206 5 -72 -81 130 56 -49 -144 -109 50 -5 -52 103 -116 36 62 63 -3 12 -26
3928 -26 144 150 47 -158 -14 -34 -93 -36 47 -76 -48 -20 -84 -45 -69 -30 -34 -31 -145 48 -16 -113 138 74 43 -65 -25
3955 -25 -86 96 -87 43 66 260 47 30 36 -114 -98 -34 5 -1 18 -67 23 -15 46 -121 -63 -114 -154 -99 -30 -48 -120 -4
3983 -4 136 22 -71 -132 21 -52 -49 129 53 61 -6 -28 -113 -110 -84 49 -67 -94 33 92 18 -146 -12 -108 121 -85 -224
4010 -224 -111 87 193 -92 73 -4 -83 3 -21 30 -5 -65 -7 -95 21 35 18 -4 -89 27 -31 44 24 -79 -57 -147
$$ packed form
3825C3p2N9q2O9kk9M6J53j90K7L3j25K70j35j25N0J04n9L1j28J73j2r9j3m6K25
3851A56k53J52k43K94j36N7O4o5p1J22m7j71J80o3Q2j65J29m6P1n5m1P0m1n5K64
3876A89n6k41M2L0k3k1J28Lj16kk0L7J16R2n9m4J34k56L7M9Rr7O5j44P9N1J17
3903I9l11J96O7j60J83J32k01p7rK11p4j05r5L5J59n5m7J55k19J52K6Jo6J5l8
3928b6J70Oj03k05J44k0n9N7Q3j23K8K8o4L9k4L9mLj14J93o4r7K51o4l1j08M0
3955b5o1J82j83J30K3J94k13j7Oj50J6O4L9oJ9q5R0l8O1j67N8n1m0N5O9j8p2J16
3983dJ40j14r3o1J53p3LJ78p6Qo7k2q5LK6J33j16k7J27N9p4j64J34r6K29k06j39
4010b24J13J98J06k85J65p7p9Q6k4N1l5o0N8q8J16J4j7k2q5J16n8P5k0j03K2r0
$$ plain form
4036 -147 -14 11 42 54 50 -14 140 151 61 -21 -181 -4 31 -139 163 -91 -163 -100 -88 33 128 -13 -182 38 -224
4061 -224 110 -13 -108 -157 -40 -70 35 14 -56 -41 49 -3 12 -61 7 -90 29 35 -60 5 14 159 136 88 149 -66 12
4088 12 11 75 -42 -73 61 106 124 130 203 -128 112 34 -141 -90 -40 -78 271 0 -34 -145 -152 114 -75 38 132 7
4114 7 -40 12 -57 68 32 62 187 91 -70 -62 -147 9 -29 142 -107 -38 134 -13 -68 17 -27 -141 114 37 -111 -118
4140 -118 52 153 -40 60 39 -78 40 12 -52 -34 -93 116 6 -161 67 -27 61 12 41 -92 52 42 -106
4163 -106 -127 -28 165 -62 35 77 67 53 13 53 -63 78 -141 -99 -74 12 38 -18 28 56 -8 30 18 -14 3 -66 -141
4190 -141 -33 48 -100 -47 -16 -41 121 47 39 -25 -66 38 38 24 116 -73 -97 -5 -35 -76 -63 8 -51 -108 -92 11 8 -127
4218 -127 -44 -134 84 -8 -29 -151 -17 46 -40 -87 80 -104 -5 -33 -79 -77 18 44 -169 113 -100 109 89 -16 -43
$$ packed form
4036a47J33K5L1J2mo4J54J1r0q2j60J77L5j70L02k54p2O3J2J21R5j41j69K20k62
4061b24L34j23r5m9J17l0J05k1p0J5R0n2J5p3O8r7J19Or5O5RJ45k3m8O1k15P8
4088A2jO4j17l1J34M5J8OP3l31K40p8j75N1N0l8L49k71l4j11pK66j89J13R4j25
4114Gm7N2o9J25l6L0J25r6j61Qq5J56l8J71k49O9J72j47n5Q5m4j14K55p7j48p
4140a18J70J01j93J00k1j17J18k8o4J8n9K09j10j67K28r4Q8m9K9j33J44j0j48
4163a06k1R9J93k27R7M2j0j4m0M0j16J41k19M2K5Q6K6n6M6K8o4L8j2l2J7o9p5
4190a41J08Q1j48N3L1k5J62p4qo4m1J04%j4R2j89k4R2l0m1J3P1n9n7J6J03lj35
4218a27Q3r0K18r2k1j22J34O3q6m7J67j84R9k8m6KR5K6k13K82k13K09k0j05k7
$$ plain form
4243 -43 139 -74 58 90 -9 130 -141 0 80 -52 28 -147 61 -125 32 -6 104 -100 11 70 111 112 42 73
4267 73 -30 -96 -36 160 -56 -46 173 -73 -182 40 76 -28 -60 -136 -198 -20 -5 188 97 156 -14 5 -41 -193
4291 -193 -27 -35 -52 -182 96 147 78 17 -43 13 11 -126 53 -132 57 15 -86 -162 -92 -157 18 -112 209 -69 35
4316 35 84 -159 104 32 47 -53 -71 3 62 49 9 98 157 -89 -40 -8 -16 44 -155 15 -89 10 -85 -47 17 120 244
4343 244 103 151 3 183 -85 -91 111 -78 -277 95 94 35 -119 43 -170 -2 41 30 28 -123 -101 45 -87 59
4367 59 61 43 51 -175 59 74 -12 -96 -149 154 58 84 51 128 -112 -5 183 -45 147 -10 30 -56 85 7 12 -8 -21
4394 -21 27 -122 -38 -126 6 -76 5 -43 138 137 54 25 172 -2 -123 115 54 103 -108 57 160 83 80 -186 16
4419 16 -118 -139 87 -55 -236 -74 -150 -22 56 175 -56 154 83 37 4 61 112 54 49 28 -63 65 -53 -85 -156
$$ packed form
4243d3J82k13J32L2r9J39k71J41Q0j32Q0j75K08j86J57l8J10k04J11N9M1Jp0L1
4267G3j03o6O0J96k16J0K19k46j09K22L6j04l2p6o2J78J5J93r1N9j70J9m6j52
4291a93J66qj7j30K78N1o9o1o0N6kj37J79j85J89m2j01p6P0o5J75j30L21k78J04
4316C5M9k43K63p2J5j00j8P4N9j3m0Q9N9k46M9L2qO0j99J70j04R9r5L8O4J03J24
4343B44j41M8j48J80k68oK02j89j99L72jn9j54J62k13J68M3j1kj51K2J46j32J46
4367E9Kj8Qk26K34J5q6q4n3L03r6K6l3P7k40J07J88k28J92j57M0q6J41p8Nk0j3
4394b1M8j49Q4q8J32q2Q1m8J81jq3k9J47j74j21K38o1M9k11J65J03p7lk66K02
4419A6j34k1K26j42j81J62p6J28P8J19k31K10p1m6l3N7N1n8nk1r1J28j18l2p1
$$ plain form
4444 -156 -51 117 -41 -17 -20 -43 -34 119 -84 -31 22 80 -159 49 36 -158 140 248 16 43 -18 -51 -7 -59 5
4469 5 54 -59 33 -62 152 -44 95 -155 -163 15 -59 79 -7 -137 6 -5 -78 -104 5 75 52 33 -57 62 113 -140
4495 -140 65 29 58 -11 -74 53 -15 -127 6 -10 28 -38 -13 168 127 103 37 46 26 -38 57 -78 81 40 94 22 51
4522 51 -65 -15 -61 -42 9 -22 90 145 27 120 -74 57 -53 -56 110 48 -69 -17 -122 -33 100 7 56 -83 -44
4547 -44 -125 -112 -59 84 111 -78 42 72 8 -39 113 -111 116 -115 46 -1 -15 102 122 -62 -59 -5 42 -75 -60
4572 -60 -69 -147 137 -57 35 -33 -172 19 23 -50 -13 -13 38 -33 89 -1 107 11 -3 -7 -17 -6 -222 0 -77 58 -171
4599 -171 -24 103 -22 69 -9 -119 -17 34 33 236 -79 -116 20 141 11 -157 -74 -22 124 38 -36 -51 -53 -78 -76
4624 -76 17 1 124 51 104 159 124 -74 -112 82 65 57 85 22 50 115 -108 -18 139 61 -134 50 118 -62 -15 -2 -68
$$ packed form
4444a56J05J68j58K4lk3RJ53k03N3N3N8k39K08j3j94K98J08k32K7o1l3M4n2O4
4469EM9j13R2r5K14j96J39k50qJ78p4J38q6j30J43j1p3k6J09P0k3j9r0J19N1k53
4495a40K05l6K9o9o3J27o8j12J33j6L8o6K5J81m1k4o6Rk0o4R5j35J59m1N4p2K9
4522E1j16N0m6J9N1l1J12N5j18R3j94J31j10lJ66o2j17N2j05Q9J33r3M9j39L9
4547d4q1J3N3J43K7j89J20L0o4m7J52k24K27k31J61m7j4J17K0j84LN4M7j17J5
4572f0rp8K84j94R2o8j39J91Mp3L7%N1p1J22r0J08r6j4mj0J1k16K22p7J35k29
4599a71J47J27j25R1p8j10J02N1jK03l15l7J36J21j30j68Q3N2J46q6p4j5kk5K
4624g6R3j6J23p3N3N5l5j98l8J94j7qK8o3K8O5k23R0J57p8j95J84O8j80M7J3o6
$$ plain form
4651 -68 65 168 96 -53 -39 -97 -228 -70 53 87 -20 -40 -148 -159 40 5 7 54 -35 169 -5 121 42 -36 43
4676 43 -36 74 59 77 150 -23 33 -18 -37 -95 136 -28 14 -47 -213 -142 126 2 -118 -24 -179 -19 28 -114 -59
4701 -59 148 -50 -150 -83 133 83 93 137 126 146 34 -11 114 96 -36 85 115 -124 43 -203 -26 -13 15 29
4725 29 -51 15 33 8 -2 -51 -51 77 -139 47 43 -122 13 -91 -8 75 57 17 116 -75 -165 -103 -55 -150 14 -25 -89
4752 -89 26 88 -181 37 98 -14 114 -104 27 -113 -11 150 50 -89 -18 147 101 87 -7 10 -64 165 0
4775 0 23 -37 31 -178 -17 -140 -245 -101 -62 98 240 61 171 14 -182 16 17 -47 -104 -40 2 29 -105 110
4799 110 -30 79 -158 -23 -48 34 -129 -19 -49 -152 88 66 173 -95 73 56 32 -52 -131 152 114 -21 -128
4822 -128 -38 25 28 101 52 69 7 36 20 128 62 70 -63 -174 144 -40 -8 296 74 2 -75 47 15 29 90 -34
$$ packed form
4651f8J33J03p2j49J4n8j31J58J23L4j07k0j08j1J99l5KM7q9K04j74J26p9p8P9
4676D3p9J10j5J8P3j73N6n1j9n8K31j64M2o1j66P1K68j24j20R4j55J60M7j42N5
4701e9K07j98j00O7K16n0J0M4j1K0j12m5J25j8j32J21L0k39J67k46J77J3K8J4
4725B9q0O6J8k5j0m9%J28k16J86mj65J35j04Q3Q3j8m0R9j91r0O2M8r5J64l9o4
4752h9J15O2k69K18O1j12J28k18J31j40J02J61j00j39P1J65m6j4r4J7p4K29j65
4775@K3o0O8k09J61j23j05J44L9J60J42j79J10j57j96J98Jo4n7O4M2K7j34K15
4799A10j40J09k37J35k5Q2j63J10l0j03K40k2J07k68J68j7k4q4p9K83l8j35j07
4822a28R0O3LP3m9J7o2K9j6J08o6Qj33j11L18j84L2L04k22p2p7J22l2J4O1j24
$$ plain form
4848 -34 63 -26 11 -104 20 84 -41 -167 152 154 92 -74 -160 18 150 -34 83 3 59 -41 78 39 -27 26 208
4873 208 149 -8 4 -33 197 9 90 46 -87 19 -188 200 52 95 -18 -24 -120 -112 165 105 -73 -5 -179 61
4897 61 -15 -87 -41 13 -158 130 -2 160 -61 -31 -30 -11 87 37 25 -78 -27 113 56 -108 -14 104 22 83 -59 164
4923 164 14 -73 40 18 26 -89 -6 64 96 72 -7 -26 8 -163 -106 95 72 80 -118 180 39 55 -116 10 114
4948 114 61 -2 15 -56 -4 -162 38 117 -128 31 185 93 -12 171 38 140 16 -11 37 34 24 61 -43 292
4972 292 -46 -120 -91 28 5 -87 66 -20 -130 -175 8 195 56 -110 -99 -33 -236 -111 -168 -12 -32 14 -50 -83
4996 -83 -9 -122 66 51 28 74 15 18 -130 0 -5 97 114 32 -73 123 110 -218 -119 79 -48 -15 151 -92 -114
5021 -114 101 -34 -33 -140 84 34 167 99 -20 0 45 -37 -42 -25 -56 -76 17 9 1 -65 9 -67 85 52 88 -159 8
$$ packed form
4848c4R7q9L7j15J24O4j25j26L19Ko2j66q6J78J32j84J17q0N6j00J19l9o6N3J82
4873B08n9j57J2l7K30j88Q1m4j33J06k07L88j48M3j13or6QK77o0j78O8j74K40
4897F1p6p2M6N4j71K88j32J62k21L0JJ9R8n0j2j03N1J40n7j64R4J18q2O1j42K23
4923A64j50q7J13k2Qj15Q3P0L2k4p9j9L4j71N7K01k3Qj98K98j41J6j71J26J04
4948A14n3o3J7p1N2j58K00P9k45J59J54r2j05J83j33J02j24k7M8lj0L7j04L35
4972B92l38p4K9J19k3r2J53q6j10m5J83J87j39j66J1O6k03J25n7J56k0M6o4l3
4996h3P4j13J88j5k3M6n9Lj48J30nJ02J7q2j05J96j3l28R9J98j27L3J66k43k2
5021a14K15j35Jj07K24n0J33o8j19K0M5q2nJ7l1k0R3qqo6P4p6J52l3L6k47J67
$$ plain form
5048 8 37 -20 97 188 15 -20 185 -22 97 210 -37 -66 -39 -149 41 -91 -8 9 177 80 179 -53 81 -39
5072 -39 1 -12 201 74 2 -100 -57 103 -132 0 19 3 38 123 63 -45 -59 161 -92 3 37 194 -52 3 -134
5097 -134 -85 -84 -33 -10 65 182 123 50 -11 -25 -133 -43 -65 213 83 42 93 -73 -8 110 18 -42 81 143 -9 43
5123 43 89 115 -81 125 -16 115 -35 -42 73 -67 -113 -186 197 198 113 -10 23 29 11 78 -273 -127 -70 104 126 -4
5149 -4 -18 189 -91 20 -63 -136 -77 -106 97 165 231 -79 137 64 -116 60 -34 -70 -35 -139 84 -24 22 56 -9
5174 -9 8 -87 166 90 62 -165 -181 96 0 72 -82 144 -69 30 -66 136 -41 -11 130 -24 -43 95 -77 128
5198 128 18 -55 29 73 -24 -3 25 -9 -5 150 -59 91 -150 80 -47 -17 -28 72 -69 92 -84 -114 -65 -10 106
5223 106 28 13 76 50 -90 124 168 171 -81 34 150 100 -30 -4 29 88 25 26 -41 -5 -80 93 94 150 234 -128 -170
$$ packed form
5048HK9n7J17R1j73l5K05k07J19J13k47k9K7j10J90j32Q3J7J68r7R9k32J34j20
5072c9M0j3K13j27p2j02M3J60k35J32J9j6L5Q5o0j08j4K20k53R5L4J57k46N5j37
5097a34M9JN1K3P5J17n9p3o1j4j08R0k2K78j30m1N1j66O5J18r2o0J23O2j52N2
5123D3M6K6j96K06j41J31j50pJ15j40m6p3L83Jq5j23L3Oj8O7l51J46N7J74K2j30
5149dj4K07k80J11q3p3N9k9K03O8O6l10K16p3j80J76r4l6L5j04K23j08M6L4o5
5174iJ7r5K53p6k8k27j6K77r6P2j54K26k13R9r6K02j77L0J41j54j9J38j72K05
5198A28j10p3Q4M4r7K1K8l4MJ55k09J50k41K30j27L0j1J00j41J61j76l0M9N5J16
5223A06p8j5O3k6j40K14M4Lk52J15J16n0j30K6L3N9o3Jo7L6p5J73JN6Q4l62m2
$$ plain form
5250 -170 4 39 204 -42 200 81 42 -43 36 -24 2 -65 42 -30 108 115 -25 -39 -70 35 111 115 -68 -109 44
5275 44 -50 46 -12 23 52 -143 -63 20 2 123 -78 -178 149 -193 104 71 -103 122 53 12 -71 60 11 -76 31
5300 31 52 85 -85 -24 -92 -37 -139 49 -123 59 -168 -61 67 -105 25 -139 -16 -160 195 33 -12 -120
5322 -120 115 -174 -53 -26 92 121 -73 70 31 69 63 175 -3 -127 82 -143 10 -22 -55 59 -27 103 -32
5345 -32 -38 103 -74 35 -120 52 143 -46 -94 -98 -64 13 54 -12 20 46 -68 -50 -56 -94 -143 -10 34 -197 -54 5 26
5372 26 -141 17 -45 -89 -55 -63 152 129 185 -44 -133 -80 17 -62 96 137 68 112 -57 18 -13 137 46 77 -19 5 8 -54
5400 -54 39 -34 -53 -52 -90 14 65 22 0 20 220 169 212 175 29 -55 21 43 129 12 128 -38 -29 0 69 55 74 95
5428 95 7 -63 79 70 -42 135 -148 77 -18 72 -93 43 81 -119 112 -137 20 71 62 -105 22 135 -134 104
$$ packed form
5250a70J74L5J65k46K42j19l9q5P9o0K6o7J07p2J38Pj40j4l1J05P6Mj83m1J53
5275D4r4R6n8L5K9j95Q0Q3j8J21k01j00L27l42K97l3j74K25o9m1q3J31m9q7J07
5300C1K1L3j70O1o8N5j02J88j72J82k27J07J28j72J30j64J23j44L55j62m5j08
5322a20K35k89J21K7J18K9j94J43l9L8oJ12j78j24K09k25J53l2l3J14q6J30j35
5345c2oJ41j77J09j55J72R1j89m8mL4P7M1o6L2K6j14J8ol8m9J33M4k31J43N9K1
5372B6j67J58o2m4L4qK15k3N6k29q9N3R7p9J58M1o9M4j69P5l1J50r1L1r6K4Lo2
5400e4R3p3j9Jl8J04N1m3k2K0K00n1M3l7j46q4P6K2Q6j17J16j66RK9O9j4J9K1
5428I5q8p0J42rj12J77k83K25r5R0j65J36L8k00K31k49J57N1rj67J27J13k69K38
$$ plain form
5452 104 1 25 -24 -46 -178 19 -11 89 -91 132 -68 167 -14 32 51 -59 103 50 89 -165 126 212 49
5475 49 42 158 -114 49 120 -69 -15 -52 -93 -61 -70 110 -23 4 -3 -23 -101 84 -52 119 11 -45 42 72 3 -54 -69
5502 -69 6 -85 186 4 -47 28 -49 -45 -11 63 71 59 13 190 43 -54 -152 -36 56 61 -47 133 -101 -30 57 -70 -121
5529 -121 20 1 -9 126 -58 123 42 78 -110 -7 42 -163 17 -75 -17 49 25 -16 -100 -38 26 -55 83 192 31
5554 31 134 -105 -47 170 -125 8 -26 8 -111 10 66 97 68 -12 -19 -39 116 12 -71 -137 -6 -124 37 -213
5578 -213 49 47 -13 -49 -67 -120 -60 94 33 86 1 -24 -142 57 79 42 -22 -55 91 -151 129 62 -17 20 64 27 43
5605 43 89 29 119 -153 -8 -32 57 -66 -60 90 120 -44 70 -22 37 67 47 100 -19 61 65 64 -32 -98 65 104 -111
5632 -111 109 -66 -115 3 -102 0 -66 -40 129 192 -180 88 69 55 30 -9 -65 -87 -93 -105 -123 23 -44 -13 100
$$ packed form
5452A04j03K4m9k2j32J97l0J00j80K23k00K35j81M6J9j10J62n3L9k54K91Q6j63
5475D9pJ16k72J63P1j89N4l7m1L2rJ80j33K7pk0p8J85j36J71j08n6Q7L0o9n7j5
5502f9P5r1K71j82n1P5p7ML4P4Qj2m6J77j47r7r8J16R2Nj08J80k34P1Q7j27n1
5529a21J41j9j0J35j84J81q1L6j88J03M9k05J80r2N8O6k4m1q4O2O4q1J38J09j61
5554C1J03k39N8K17k95J33l4L4j19J21N6L1k9q0pk0J55j04q3o6J31j18J61k50
5578b13K62ko0l6j8n3O0J54o1N3q5k5j18J99K2l7o4l3J46k42K80o7p9L7M4l7J6
5605D3M6o0R0k72J45k4Q9j23OJ50L0j64J14r2N9L0k0N3j19Q0Mjr6o6J63L9k15
5632a11K20j75m9J18j05J02o6K6J69O3l72K68j9j4k5l9n6k2oj2j8J46o7L1J13
$$ plain form
5657 100 31 21 -38 103 103 110 -53 -52 -55 -97 75 138 -77 -187 56 174 16 75 -100 82 24 55 152 54 103 120 -31
5684 -31 137 -16 25 30 -21 37 33 -30 -1 6 0 -108 -19 -47 2 31 36 61 162 -67 -115 32 -6 -53 -6 -78 -8 -50 175
5713 175 -6 -159 45 -23 -47 158 162 48 60 12 -92 -182 -27 -45 -52 -157 -107 -53 4 -119 -213 -74 -120 -48 -161
5738 -161 93 1 -82 124 31 -64 4 -1 51 50 5 84 94 -185 -64 -78 -112 -103 -56 -53 54 12 63 2 9 -6 -179 -138 -92
5767 -92 194 -22 13 -29 -9 102 -42 59 20 -35 72 28 95 -78 -48 -80 15 72 -40 -70 -2 -36 -17 -160 -31
5792 -31 29 -167 -248 -2 -77 -48 143 53 4 7 50 -109 101 -85 -5 56 39 -119 113 46 -12 114 81 -157 95
5817 95 82 9 -33 23 -125 -106 136 -142 9 -216 -63 64 48 51 287 43 14 117 -7 -48 -91 -187 46 31 107
5842 107 -46 -64 8 -29 13 10 -108 84 51 74 -26 49 80 -33 53 166 -20 -151 -36 -26 78 185 30 165
$$ packed form
5657A00o9j0n9J41%Pj63Jlm2J72O3k15j10K43J18j58N9j75J82n8L1R7r8M9J7j51
5684c1J68j53M1Nn1N8mo3K9Poj08Q9k8M9K9NK5J01k29m8J47l8m7M7p2P0m2K25
5713A75j81j53K04o8k4K05Mj14J2m8j04r0J55j8pj05N0N4N7j23r4J39m6P2j13
5738a61K54r2q3K06r3r5O8nN2jm5P9J0k79J21j4l4RM7LJ07m2N1o1Pj5j73M1M6
5767i2K86k16L5m2K0J11j44J01l9n5J07m4O7j73L0l2R5N7j12l0O8l4J9j43J29
5792c1O0j96q1K46p5K9J91r0m9LM3j59K10j86Q0O1j7j58K32o7n8J26l3k38K52
5817I5j3p3m2N6j48J9K42k78J51k25J53J27j6LK36k44k9J03j24m1m3r6K33j5P6
5842A07j53j8P2l7M2lj18J92l3K3j00P5L1j13Q6J13j86j31J15J0J04J07j55J35
$$ plain form
5866 165 50 32 -3 153 34 125 -32 -6 3 -103 111 34 -65 17 129 -20 87 130 -47 -60 85 94 -10 -49 -134
5891 -134 68 118 16 58 174 101 82 71 -16 -98 31 51 -236 -34 1 -46 3 -125 80 -35 70 27 120 31 31
5916 31 14 -30 80 -128 -211 -92 -35 21 -3 -23 60 61 70 34 101 -41 -13 -7 5 51 151 -5 84 46 14 95 -95 -95 9
5945 9 -123 100 175 -12 -51 -37 -137 179 10 -82 -13 37 77 -161 229 -13 -129 -72 188 148 270 15 -70 -83
5969 -83 8 -160 93 -19 10 -89 -23 38 152 -52 -76 13 152 -44 -106 125 -20 -16 -188 47 128 -97 -22 -91 22
5994 22 -14 -101 34 37 87 104 -18 145 32 -34 17 33 56 143 -50 -28 25 64 27 -1 128 -35 -38 -134 95 -84 -23
6021 -23 -68 -82 18 -77 -107 69 -13 -152 -82 83 81 -91 177 -137 -25 -213 -84 64 52 -34 44 92 -46 137
6045 137 -50 50 256 26 -1 -59 -75 -22 -100 99 81 -37 74 17 -1 -110 88 164 14 -118 -193 -141 84 226
$$ packed form
5866A65j15j8l5J56j19R1j57K6Rj06K14p7r9Q2J12j49J07M3j77j3J45Rj04l9q5
5891a34K02N0j02M2J16p3j9j1q7q2J29K0k87K02L5m7M9j28K05j15J05m3R3q9%
5916C1j7m4J10k08q3J19N7N6k4k0Q3JRl6O7j42K8OJ2M6J00j56Q9l8l2Q1j90%J04
5945Ij32K23P5j87l9J4j00L16j69r2O9N0M0k38L90k42j16N7K60m0J22k55q5j3
5969h3R1j68K53j12K9r9O6O1J14k04k4Q9J39j96o2K31j45Mj72K35Q1k25P5o9J13
5994B2l6q7J35LN0J7j22J63j13o6N1J6K3Q7j93K2N3L9l7k8J29j63lr6K29j79O1
6021b3m5j4J00r5l0J76q2j39P0J65kj72K68l14J12j88J29J48j2q6P8M8j38J83
6045A37j87J00K06k30k7n8j6N3p8J99j8j18J11n7j8j09J98P6j50j32p5N2K25J42
$$ plain form
6069 226 99 -107 190 -111 -115 -95 -52 45 -57 56 17 -19 150 31 217 75 31 58 -88 117 194 176 -19 -17
6093 -17 -54 -15 77 36 -50 -7 -17 83 -59 31 -63 69 -107 -191 -175 -210 46 145 86 -26 138 -29 -128 81 -43
6118 -43 -7 113 -106 -9 118 -124 -10 58 27 -63 78 -3 59 69 -68 7 -61 -116 59 -48 -3 138 -77 -17 172
6143 172 93 47 19 55 12 -62 -213 -58 -14 -55 -168 -102 -52 97 48 112 101 -27 -66 -3 -10 17 -22 2 20 -153 -10
6170 -10 -39 107 7 44 46 198 -2 163 46 106 81 116 11 -162 -212 1 296 22 6 8 31 -116 -162 -89 77
6195 77 27 30 -127 15 178 51 80 46 72 -171 -173 -63 30 86 -16 1 79 20 -21 83 120 130 -34 185 44 84
6221 84 78 78 161 19 -42 104 -188 102 -115 -37 171 -85 49 -133 12 -50 44 96 -49 -107 81 15 79 -43 90
6246 90 -104 68 70 -200 50 -74 140 -94 -121 20 72 22 165 151 22 49 -61 -110 134 -157 -68 50 -26 -237
$$ packed form
6069B26j27k06K97l01mK0M3R7j02J13l9l6J69j19J86j42m4K7j46K05P7j8j95K
6093a7l7L9R2m1q6M3j0J00j42R0r4J32j76q4J6l5K56R9n9j12J64j67r9K09j24
6118d3L6J20k19R7J27k42J14O8l1r0J41q1O2J0j37P5o8n5J75j07M5J41k15O0J89
6143A72p9m6k8L6m3p4j51J55M4m1j13O6N0J49m9O4j1j28l9O3pK7l9K4J8j73J43
6170a0k9J46j00L7KJ52k00J65j17O0k5L5j05j73n0K13K95k74j6KK3j47m6P3J66
6195G7n0Lj57J42J63j27K9l4K6k43kJ10R3N6j02J7P8n9m1J04L7J0j64K19j41M0
6221H4o%Q3j42o1J46k92K90k17P8K08k56J34j82J45o2R4N2j45n8J88o6O4j22J33
6246I0j94J72Kk70K50j24K14k34k7J41N2n0J43j4j29K7j10m9K44k91Q9J18p6k11
$$ plain form
6270 -237 -150 -137 -118 -70 15 47 -25 37 5 119 -98 147 81 86 -74 15 -56 152 -9 -47 62 -62 129 45 66 -23
6296 -23 127 55 14 62 -9 186 -35 24 -107 63 103 -11 79 -21 -87 -33 -8 -131 202 68 -99 -64 57 -40
6320 -40 -37 -114 94 161 -82 -41 -36 13 -8 -82 3 -79 -41 77 -27 -33 -158 -35 -74 123 -96 132 21 -38 -70 48
6346 48 90 -49 17 -80 -4 -156 31 -120 -73 -119 -112 18 39 -51 -162 87 -176 -93 4 24 62 -33 44 -42 -29 -25 -87
6373 -87 63 38 159 -152 -22 118 161 3 -60 83 -266 -47 52 -118 59 -47 103 -48 -38 82 64 -3 126
6396 126 -101 -168 7 -108 -146 -43 -152 -27 -150 -191 -59 -50 -19 -114 -42 -87 -49 -24 -81 -34 105 108 -77 -36 -30 57
6422 57 -54 261 -89 -79 110 84 117 -2 37 77 -82 -106 27 -60 -86 -165 -65 126 -38 -60 -28 -106 97 71 -62
6447 -62 0 -149 63 -63 -180 87 -43 -125 -56 -31 54 55 -27 94 -101 -124 -104 69 12 36 184 116 -62 92 -69
$$ packed form
6270b37Q7J3J9M8Q5L2p2O2l2J14k17K45o6Nj60Q9p1K08j61l8J09j24J91q4K1q9
6296b3J50p2m1M8p1J95k21N9j31J70M0j14R0j00o6N4K5j23L33j34j67L5J21r7
6320d0Lp7K08O7k43M1NM9k1p4Q5q2L8J18j04oj25J23l9J97k19K28j11n9l2J18
6346D8M2j39O6r7P6j52J87j51M7m6PJ30K1r0j11K49k63Q3R7K0L8r5P7q6J3Mo2
6373h7J50k5J21l11J30J40M3j58o3J43l49K19R9j70J77j06J50j51J0J20j8o7J29
6396A26k27o7J75j15l8J03j09J25j23m1J32RL1r5P2m5L8K5n7M7J39Lj85M1OQ7
6422E7j11L15l50J0J89k6L3j19L9M0j59k4J33q7k6p9J00J91j64k2L2p8K03k6j33
6447f2O2j49K12j26j17K67j30q2O9K5Q5Jq2J21j95k3K0J73n7K4J48o8j78J54j61
$$ plain form
6472 -69 -158 115 -98 30 -3 -83 152 -26 -60 -51 -121 -30 -206 -155 -31 -8 23 -27 -125 181 28 35 63 112 21 5 -45
6499 -45 119 52 15 21 79 14 117 -170 85 -83 122 30 20 29 26 119 -62 -64 100 -11 41 19 -103 114 0 26
6525 26 -15 -66 -56 117 80 33 -35 -35 125 34 47 -30 95 40 -21 -52 141 -31 38 -7 37 192 -91 59 92 -118
6551 -118 78 72 -156 115 31 38 32 24 53 -22 -81 122 -24 -94 126 226 -82 -18 70 -14 -48 -18 33 -59 -96 -36 -68 16
6579 16 -80 -133 -27 122 -39 144 -81 189 56 -56 25 184 70 -7 15 -97 62 24 43 77 -140 -25 -59
6602 -59 -129 25 -42 -46 -48 71 -38 -102 150 -15 88 43 54 157 -40 -110 21 23 -106 1 49 -8 106 -31 -38 126
6628 126 128 -96 -65 70 -91 -1 165 -85 20 -121 141 64 -57 -58 -27 52 73 140 -31 34 112 -77 -121 60 26
6653 26 -173 12 -95 88 -86 103 169 -128 -49 -114 12 116 77 154 26 61 8 -9 -121 112 20 -140 179
$$ packed form
6472f9q9K73k13J28l3q0K35j78l4Rp0R1j76N1J24K3L1n0r8L06j53PK8M9r1j6n0
6499d5J64o7l7ON8o5J03k87K55j68K05r2j0RlR3j81kJ64j11N2k2j22K17j14K6
6525B6m1n1J0J73l7m7o8%J60r1J3p7J25n5o1l1J93j72O9m5M4J55k83J50L3k10
6551a18J96ok28K71q4PoqK9p5n9K03j46p0K20J00l08O4Q8q4l4L0N1r2l7O0l2Q4
6579A6r6n3J06J49j61J83k25K70j33j12Q1J59j14p7K2j12J59l8J9L4k17J15l4
6602e9p0J54o7mkJ19j09o4K52j65J03m5J1J03j97p0J31Kj29J07M8n7J14j37pJ64
6628A26Kk24L1J35j61R0J66k50J05j41K62p7j21jL1P9K1O7j71O5P8j89m4J81l4
6653B6j99J85j07J83j74J89O6k97P9o5J26J04l9P7j28L5n3j7j12K33r2j60L19
$$ plain form
6676 179 -86 -66 51 -10 44 71 88 22 -22 -162 -88 -167 -127 -43 26 67 32 176 -130 71 66 -47 10 -27 98 -67
6702 -67 63 45 10 -118 -122 -122 -262 43 -50 -164 113 59 -36 178 -126 91 69 -79 -113 75 324 -45 115 -126
6726 -126 -186 -92 -98 153 109 -116 52 -71 -27 66 -141 -80 26 -71 -144 -201 -14 -111 54 148 21 87 -43 40 148
6751 148 -48 29 -2 103 -24 -123 -22 125 192 -10 -33 26 102 111 61 -26 106 116 3 -73 93 -64 95 59 -62
6776 -62 31 -59 -60 -79 40 -135 -32 42 -76 -9 -141 117 -99 -117 15 -248 -79 47 -2 -151 134 67 -20 -193
6800 -193 -98 29 11 280 57 143 7 -70 -211 11 150 -74 -6 44 -84 11 -83 29 -81 79 106 13 -97
6823 -97 -49 58 66 -137 -93 -71 -107 -10 212 59 46 -5 -99 2 7 74 80 -13 19 150 89 102 1 -29 12 28 57 67
6851 67 23 66 -104 12 96 -18 76 -24 1 161 230 29 27 8 -61 20 44 31 20 6 -65 -41 -19 2 -70 -31 -70 110
$$ packed form
6676A79k65K0J17o1N4K7J7o6m4j40P4p9M0Q4O9M1l5J44l06K01nj13N7l7J25j65
6702f7J30j8l5j28m%j40L05r3j14K77n4r5K14l04K17k2j48l4J88K49l69J60k41
6726a26o0R4oK51m4k25J68j23M4R3k07O1J06r7p3n7J87r7J65R4j27O6j30Q3J08
6751A48j96P7l1J05j27r9J01J47O7k02k3N9P6Rn0q7J32J0j13p6J66j57J59l6j21
6776f2R3r0jj9J19j75J03P4j18O7j32K58k16j8J32k63J69J26m9j49K85o7q7j73
6800a93R5J27j8K69k23Q6j36p7j41K22J39k24O8N0j28R5r4J12j10J60K7r3j10
6823i7M8J07Qk03M4K2l6R7K22j53j3n1r4J01NO7Or3L2J31o1J3j01l0M1J6K9J0
6851F7m4M3j70J16Q4j14R4j00K5J60O9k01kj9o9Q1K4j3j1j4p1K4K2K1p2L9l9J80
$$ plain form
6879 110 -108 77 19 -146 -37 172 -19 1 74 79 36 -110 33 -39 -68 -13 44 -53 -13 -153 61 87 202 -160
6903 -160 -163 152 -9 75 -9 -220 116 -38 -60 -15 -12 156 -13 31 -37 2 -45 -53 -124 16 -22 90 34 -83 131 -5
6929 -5 1 -59 27 -55 102 -79 56 20 -201 -68 -160 -60 -106 -41 -78 -40 -104 -110 -45 94 -17 1 39 30 97 29 100 7
6957 7 193 97 97 130 -80 25 258 -10 99 58 -5 -26 -86 -154 86 163 -57 24 55 -9 118 198 5 43 -41 90
6983 90 -66 39 31 -235 29 -189 -54 5 -40 -85 49 -92 -142 128 -103 -16 44 7 78 107 116 23 27 42 19 38 130
7010 130 36 -21 46 -100 -81 57 18 -59 26 26 -103 73 77 -105 -57 -68 -130 210 -25 -3 -25 -30 -118 38 12 12 -121
7037 -121 132 -22 12 29 97 74 -67 -16 -109 38 114 74 99 248 -13 63 87 157 69 -32 30 -126 -18 -28 58
7062 58 43 -144 -50 124 -11 20 -46 210 -182 189 149 125 17 -148 -40 142 52 23 -80 118 46 -127 -44 65
$$ packed form
6879A10k18J85n8j65J09K09j91K0P3Nm3j46J43p2k9N5N7r7M0j40K14K6J15l62
6903a60lL15j61Q4q4k11L36j54k2M5LJ68j69M4o8L9m7qp1J40l8J12n6j17K14j36
6929eOo0Q6q2J57j81J35l6k21J33r2J00m6O5l7L8o4oO5J39j11J8L8rO7o8P1r3
6957GJ86r6%L3k10J05K33k68J09m1o3k1o0o8K40P7k20Q1L1o4J27Q0j93L8q4J31
6983I0j56J05qk66K64k18J35N9m5m5J34j41n0K70k31Q7O0l7P1K9Rr3MJ5k3J9R2
7010A30r4n7O7j46J9J38l9p7Q5%j29J76Mj82M8j1o2L40k35K2k2nq8J56k6%j33
7037a21K53j54L4J7O8k3j41N1r3J47P6m0K5J49k61P6K4P0q8j01O2j56J08j0Q6
7062E8j5j87R4J74j35L1o6K56l92L71m0k4j08j65J08J82r0k9j03J98p2j73Q3J09
$$ plain form
7086 65 101 -147 92 -41 104 143 -193 41 116 -231 -186 -10 -95 53 30 19 256 -42 117 49 138 -250 16
7109 16 -190 32 66 -96 75 116 -51 -97 73 -206 -87 9 7 106 -40 89 -38 13 -253 70 -238 -47 33
7132 33 -41 100 92 -74 -78 -98 14 -43 -14 41 13 95 -75 30 -20 -58 -154 32 -72 95 -57 -70 -91 -96 -73 112 -7
7159 -7 91 -6 91 -27 74 -39 -135 14 189 -169 -129 10 -143 11 78 167 101 88 -115 -83 157 -94 39 -24
7183 -24 40 39 -15 76 125 87 56 -51 8 -42 99 37 -60 -62 107 45 -32 82 159 5 93 15 -62 -8 36 26 58 -73
7211 -73 -116 -54 116 -117 146 179 -8 129 -135 -143 32 167 -36 -69 41 48 50 43 -3 -16 -97 -66 -154 153 -72 82
7237 82 -62 132 104 76 56 -148 -36 -45 58 -47 12 -33 -9 76 -63 9 95 5 -105 -48 144 25 -10 145 25
7262 25 104 48 101 -172 44 -2 56 -28 85 -24 -2 -145 73 -66 -31 -27 -128 -56 81 39 -15 -109 -45 56 -9 -15
$$ packed form
7086F5L6k48K39j33J45L9l36K34P5l47M5J76q5J48k3j1K37k98J59o8Q9l88K66
7109A6k06K22L4j62J71M1j67m6J70k79J19R6kR9j46J29j27N1k66L23l08J91Q0
7132C3p4J41qj66mk0J12n7K9N5k8Q2j70J05n0l8r6J86j04J67j52j3k1nK3J85j19
7159gR8r7R7j18J01j13r6J49J75l58M0J39j53J54O7Q9o6j3k03L2K40k51J33o3
7183b4O4jn4R1M9l8l1j07N9n0J41o2r7kJ69o2p7J14P7j54Q8p8p7N4M4j0L2j31
7211g3m3O2J70k33K63L3j87J37k64qJ75J35k03l3J10PKpm6j3q1L1q8L07k25J54
7237H2j44J94k8k8k0k04J12rJ03j05N9m5K4Q5j39P2Q6r0j10N7J92j19l5J55j20
7262B5P9n6N3k73K16m6N8q4J13j09K2j43K18j39L5Mj01P2J37m2n4r4O4J01o5o
$$ plain form
7288 -15 77 87 65 6 -55 119 159 201 -172 -19 -236 -46 35 54 26 114 25 -203 -18 144 36 -112 -44 78 28
7313 28 70 -75 -15 144 -99 25 -75 -60 59 105 8 61 40 -107 53 11 -50 42 -7 5 -30 -341 -177 9 -145
7338 -145 140 9 -74 -206 -33 124 141 33 -66 38 -38 82 -61 65 172 46 -109 3 -40 -124 -41 -39 58
7361 58 40 -28 84 -82 0 14 272 207 -6 -102 -69 107 -12 54 43 -7 -47 82 -46 -183 53 -77 -53 56
7385 56 47 -192 -5 -148 29 64 -55 36 75 -25 66 17 -31 -17 46 -94 -122 9 71 -18 166 52 77 -24 -95
7410 -95 -5 -190 -73 -25 15 -96 -128 50 38 -21 -32 119 32 -80 -29 53 37 134 119 -81 -16 -18 -28 -5 -112 -56 -27
7437 -27 -19 -35 80 13 -68 -56 -4 90 138 78 -47 -48 73 44 -168 49 96 -18 14 57 49 -65 15 24 -173 52 -28 116
7465 116 -182 -124 -83 107 72 -119 190 -178 -30 37 -97 -31 -30 -31 22 -97 -28 -152 -154 -119 -130 81 44 -172 33
$$ packed form
7288a5R2J0k2n9o1J74M0M2l73J53k17J90Q1J9k8Q8q9k28J85J62j08j48O8J22n0
7313B8M2j45O0J59k43J24j00J5J19M6r7N3k1j47J60m2o1R2m9J2l5l11J64J86j54
7338a45K85j31q3j32J73J57J7j08r9J04p6J20j43J26J07j26j55J12m3q4Q3KR7
7361E8j8o8J12j66Q2J4K58o5k13r6L3J76j19O6j1n0m0J29j28j37K36j30K4J09
7385E6rk39J87j43J77L5j19R1L9j00R1m9m8J4O3j40k8J31O2q9J84j14K5j01p1
7410i5R0j85J17M8M0j11l2J78j2n9j1J51q7j12N1Q2j6R7j5k00O5kj0K3j07N6K9
7437b7Qj6J15o7q1J2N2R4M8o0j25jJ21k9k12K17M7j14L2M3qj14Q0Rj97K25q0J44
7465A16k98N8M1J90l5j91L09l68J48O7j34O6JjN3j19O9j24kL5j1K11l7k16K05
$$ plain form
7490 33 -46 -167 8 -34 -24 -38 45 79 -86 -7 132 9 99 -36 -243 -110 -76 46 17 -80 31 -9 -18 44 -53 -39
7516 -39 53 47 1 107 182 26 24 5 269 77 10 168 45 44 93 -23 101 -219 2 -24 3 48 -137 13 40 -205
7542 -205 -101 -3 30 -65 -12 42 -68 64 -59 51 112 16 23 -90 61 -5 -4 -29 26 -81 -61 16 79 -77 -93 -62
7568 -62 4 34 -25 35 282 48 102 -81 109 -133 79 109 5 -55 -22 -76 -12 70 49 -80 31 50 68 -6 4 7
7594 7 37 -41 131 -8 22 37 -95 84 151 149 40 10 85 -45 -2 -12 -61 -19 -54 149 -1 -1 -124 -230 -20 -71
7620 -71 -111 43 7 -76 -61 46 10 -31 71 -168 -68 126 7 33 177 -42 48 69 71 19 42 22 -72 -2 45 19
7646 19 -182 20 -11 -67 177 18 89 -75 -20 24 48 8 -41 52 27 54 92 -137 87 -165 178 88 -78 -1 -96
7671 -96 -107 70 40 -56 -20 -76 28 -204 94 88 25 -48 137 158 120 194 -14 -15 36 63 83 26 182 75 145 49 -7
$$ packed form
7490C3p9j21J75m2J0j4Q3L4j65P9J39j23R0j35k07J33L4J22k9r7J11m0rO2r7J4
7516c9R2om6J06P5j56kj9K64j92o7J58j23jM9j16J24l20K21k6K7M5j85J50K7k45
7542b05J04R8L3r5N3N4j10J32j23J10O1r6Pj13J51o6Jk5N5j07K0P7O3j56j6L1
7568f2O6L0n9O0K47k34N4j83J90k42K12L0j04o0L3n4O4Q2k1j29J11J9J8p4J0L
7594GL0p8J72j39L0J5j32J79O7kj09l0P5j30M3j0m9M2l5K03j50%j23j06K10n1
7620g1m0J54l6q3J5J07l6m1J02k39J00J94j19K6J44k19R0K1Kn2K3k0r4P0M7k6
7646A9k01K02l1n6K44j59P1j64N5M4K4m0m9R3k5K7L8k29K24k52L43r0j66P7r5
7671i6j1J77l0r6L6n6J04k32K98oo3p3J85K1l8P4k08jN1K7K0n7J56j07P0r6n6
$$ plain form
7698 -7 117 -19 -50 25 -117 52 -56 -203 26 4 41 -10 64 -18 -42 -124 -231 -84 52 -133 -108 62 -15 89
7722 89 9 37 118 -130 82 5 73 -21 -15 42 -9 -83 83 -3 67 -45 123 -47 110 5 -62 -34 -24 -3 60 -70
7748 -70 189 66 58 89 20 -13 143 -187 -73 89 -11 -125 -82 270 -32 103 -152 -21 106 22 -100 69 -125
7771 -125 67 63 66 -90 114 77 -18 -1 30 3 -87 -122 -82 -117 75 -42 -13 -32 33 -19 -131 19 -65 5 -51 -8 -50
7798 -50 -50 -45 96 -54 104 -25 -101 -3 165 23 -20 -103 -21 -57 -36 -44 -16 13 240 29 -62 141 -61 78 93 -40
7824 -40 -145 -57 3 -139 -134 -118 -85 153 58 -24 28 34 -31 32 -164 50 -50 88 13 -1 138 -172 -29 28 24 35 98
7851 98 21 42 -60 -144 -47 -61 48 -50 -100 -92 -11 -33 247 -117 12 20 -88 -191 34 -47 202 54 -99 -163 56
7876 56 -12 27 81 3 -131 -80 64 -38 -59 17 -10 -37 133 108 -61 -105 33 -70 -17 -49 -116 -114 141 -135 57 -27
$$ packed form
7698gJ24j36l1P5j42J69j08j47K29k2L7n1P4q2k4q2j07J47J36j85K5J70p7J04
7722H9q0K8Q1k48K12p7O8r4ON7n1p4J66q6P0j12J68j70J57j05o7K8J0K1O3j30
7748g0K59j23qL1o9l3J56l30J14J62j00j14M3L52l02J35k55J31J27q4j22J69j94
7771a25J92mLj56K04l7r5J7L1k7r0l5M0l5J92j17K9j9O5n2j12J50q4P0n6M3m2
7798e0%NJ41j50J58j29p6R8J68j42m3q3Q2l6K1qK8K9K27k11r1K03k02J39J5j33
7824d0j05Q8O0j42NJ6L3K38r5q2N2Oo5O3j96K14j00J38p5j4J39l10J43N7mJ1O3
7851I8p7K1j02q4R7j4J09r8n0QQ1k2K80l64J29Qj08j03K25q1K49j48j53o4K19
7876E6o8L9N4p8j34N1J44j02k1P6k7k7J70k5j69m4J38j03N3l2o7KK55k76J92q4
$$ plain form
7902 -27 45 5 144 -152 -93 21 4 -17 6 -42 -124 36 -193 -163 9 -39 40 -102 184 29 116 -30 -5 115 -40
7927 -40 -134 -147 117 134 39 -5 20 34 -29 9 -62 93 -46 -128 -121 65 -58 72 -152 22 -12 -100 -7 -64 -19 53 71
7954 71 109 -148 -134 129 44 -184 -28 -11 37 67 141 75 8 40 60 -21 1 45 80 182 30 -74 70 124 -41 -60
7980 -60 -11 81 -14 -188 -20 167 -12 -68 -50 -159 43 -72 14 113 -92 98 141 -97 121 -28 153 61 119 5
8004 5 -51 105 -114 50 -7 44 69 50 58 -83 97 42 15 -29 -128 190 -51 -94 -105 4 -41 -40 -21 -46 -4 93 80 -98
8032 -98 -115 8 -95 32 -20 -110 114 -10 -113 -42 13 2 -94 -3 100 -62 -59 21 225 -122 21 151 178 108 -16
8057 -16 25 -94 -76 47 131 94 16 -14 -199 45 56 4 145 76 -83 63 -2 -7 12 168 -21 18 30 57 -39 34
8083 34 -16 -23 43 -75 -118 -112 -52 -108 -5 -22 77 -38 36 62 -32 18 14 94 12 -105 174 -95 -109 100 -176 45 -12
$$ packed form
7902b7P2m0J39k96N9J14j7k1K3m8q2J60k29L0J72m8P9j42K86j55Q7j46K5J20j55
7927d0r4j3K64J7r5m4K5J4o3L8p1J55j39q2PJ86j23J30k24J74l4q8R3n7M5P2J8
7954G1L8k57J4K63q5k28J56J7M8L0P4o6o7L2K0q1K2M4L5J02j52j04J44N4j65j9
7980f0M9R2r5j74J68J87j79n6J8j09K02j15Q6R9k05J90M3k38K18j49J81r2N8j14
8004En6J56k19J64n7N1K5j9Qj41J80n5k7m4r9L18k41m3j1J09m5JJ9k5M2R7j3j78
8032i8j7J23j03J27n2r0K24j24j03P1N5j1r6R1J03j62LQ0K04l47J43J30K7p0j24
8057a6M1j19J8J23Q4l7p8l0j85K44J1n2J41o9j59J46o5nJ9J56j89L9J2K7r6P3
8083C4n0pO6j18m3OO0n6J03j7R9j15P4K6r4N0mQ0q2j17K79k69j4K09k76K21n7
$$ plain form
8110 -12 -36 124 271 -158 -148 3 -46 -76 -101 90 -68 41 116 -187 121 26 -76 -19 -80 -48 1 -124 30 7
8134 7 -47 -34 50 61 32 -35 104 118 58 48 -72 -77 -143 71 -49 -87 -150 57 22 -49 6 5 -22 -185 -61 128 -87
8161 -87 22 58 0 -37 -89 18 -55 94 128 24 -34 223 64 -66 64 -92 -73 107 34 74 -75 40 132 -25
8185 -25 22 46 -196 -160 136 -95
$$ packed form
8110a2k4J60J47m29J0J51m9l0k5J91j58J09P5l03L08r5j02N7o1L2M9j25J54k3
8134Gn4J3Q4J1k9o7J39J4o0j0j20no6K14j20l8o3K07l5p1N5jk7j63J24J89k15
8161h7J09L6n8l7n2J07p3J49L4j04n8K57j59j30J30j56J9J80p3M0j49J15R2j57
8185b5M7K4k42L6K96k31
8191i5
$$ Imaginary data points
##PAGE= N=2
##DATA TABLE= (X++(I..I)), XYDATA
$$ plain form
0 0 0 0 0 0 0 0 8 0 8 -8 8 -16 16 -24 24 -32 40 -56 64 -80 96 -112 136 -160 184 -216 252 -290 336 -385 441
31 441 -500 571 -644 727 -821 920 -1033 1154 -1286 1434 -1592 1765 -1957 2163 -2389 2638
47 2638 -2907 3204 -3529 3890 -4283 4723 -5212 5760 -6379 7082 -7891 8831 -9943 11277
61 11277 -12919 14992 -17710 21438 -26902 35723 -52370 95148 -454331 -855738 -260822
72 -260822 -126096 20669 19729 36184 1985 105965 123442 157556 218739 296152 254661 276609
84 276609 311482 275525 159003 62303 -133003 -320360 -302370 -114683 -49922 -97759 -135418
95 -135418 -138727 -109823 45857 227105 293365 265232 216437 112958 23963 19411 14084 -47343
107 -47343 -59429 -67859 -190083 -291099 -201242 -82521 -108791 -177964 -181242 -142392 -47698 65353
$$ packed form
0@%%%%%%QqQj6J6k4L2m0M8n6P2r6J20j44J76k08K48k96L44m00M68n42O26p21Q26
31D41r41J071j215J371j548J741j953K187k440K720l026L357l722M120m552N027
47B638n545O111o733P419q173R006r935J0972j2139J3461j4973J6722j8774K1220
61A1277k4196K7911l2702L9148m8340O2625q8093J47518n49479m01407N94916
72b60822J34726J46765r40J6455l4199J03980J7477L4114O1183P7413m1491K1948
84B76609L4873l5957j16522r6700j95306j87357J7990J87687O4761m7837l7659
95a35418l309K8904J55680J81248O6260k8133m8795j03479q8995m552n327o1427
107d7343j2086q430j22224j01016Q9857J18721k6270o9173l278L8850R4694J13051
$$ plain form
119 65353 79535 40061 70681 107766 95356 145194 248993 253696 166600 70015 -78538 -222581
131 -222581 -180093 -8889 71678 70660 108370 142277 110738 48549 -36540 -129915 -152416 -118956
143 -118956 -109938 -69817 47743 102258 21750 -62827 -102621 -161599 -171197 -56857 53196 56399
155 56399 35648 43029 47578 73486 113575 90300 35489 36284 30720 -41292 -86011 -71963 -80985
168 -80985 -86477 -30515 10029 10753 68911 148765 118048 20367 -17741 3220 47266 99499 93344
181 93344 25679 2343 11939 -49840 -125618 -107269 -72690 -108218 -137665 -121019 -113834 -93882
193 -93882 -19704 43125 63984 103555 151307 153726 137389 111437 33613 -44237 -44412 -19593 -20184
206 -20184 8835 50873 15024 -58548 -81092 -94273 -126887 -103902 -29041 13519 33864 73284
$$ packed form
119F5353J4182l9474L0620L7085j2410M9838J03799M703q7096r6585j48553j44043
131b22581M2488J71204Q0567j018L7710L3907l1539o2189q5089r3375k2501L3460
143a18956R018M0121J17560N4515q0508q4577l9794n8978r598J14340J10053L203
155E6399k0751P381M549K5908M0089k3275n4811P95n564p2012m4719J4048r022
168h0985n492N5962M0544P24N8158P9854l0717r7681l8108K0961M4046N2233o155
181I3344o7665k3336R596o1779p5778J8349L4579l5528k9447J6646P185J9952
193i3882P4178O2829K0859L9571M7752K419j6337k5952p7824p7850j75K4819n91
206b0184K9019M2038l5849p3572k2544j3181l2614K2985P4861M2560K0345L9420
$$ plain form
218 73284 99093 101774 105845 75534 9388 -5673 23746 -1287 -56482 -56688 -44523 -71943 -80561
231 -80561 -50074 -26298 -1583 31390 17810 -29975 -33500 -8573 -5539 12446 57544 71666
243 71666 68116 90256 81005 10761 -33905 -28557 -44235 -72316 -55564 -22940 -12316 720 10384
256 10384 -3822 -2512 22130 16450 -4005 8924 9404 -29948 -34234 10410 24627 13034 33442
269 33442 53761 32553 6547 -11994 -46412 -63563 -39254 -22199 -17476 15866 47916 38177
281 38177 24856 21380 -9721 -41738 -27520 -10864 -26448 -20974 13510 21457 12364 22588 26571
294 26571 14545 16281 13001 -16048 -25973 -7704 -14246 -30520 -3825 28747 19757 11123 21581
307 21581 8191 -21129 -29886 -34405 -43142 -25599 4182 12175 22243 42996 35226 12157 16020
$$ packed form
218G3284K5809K681M071l0311o6146j5061K9419k5033n5195k06J2165k7420q618
231h0561L0487K3776K4715L2973j3580m7785l525K4927L034J7985M5098J4122
243G1666l550K2140r251p0244m4666N348j5678k8081J6752L2624J0624J3036R664
256A0384j4206J310K4642n680k0455J2929M80l9352m286M4644J4217j1593K0408
269C3442K0319k1208k6006j8541l4418j7151K4309J7055M723L3342L2050r739
281C8177j3321l476l1101l2017J4218J6656j5584N474L4484P947r093J0224L983
294B6571j2026J736l280k9049r925J8269o542j6274K6695L2572q990q634J0458
307B1581j3390k9320q757m519q737J7543K9781P993J0068K0753p770k3069L863
$$ plain form
320 16020 16993 -11513 -21347 -2558 -5936 -20118 -1748 18636 8304 2720 11339 2823 -12971
333 -12971 -15904 -24829 -34286 -19266 -5670 -10640 7707 47172 48899 21949 16138 11949 -15016
346 -15016 -28407 -19079 -20237 -21658 -3806 5199 -430 8782 15246 -6160 -20599 -13015 -18686 -26971
360 -26971 -2355 25832 24249 25204 39935 36225 22552 24464 18310 -6433 -18171 -18070 -24746 -19462
374 -19462 -272 -3187 -18826 -11409 -4023 -19561 -20936 -749 -2750 -20569 -16489 -4655 -3610
387 -3610 8584 27006 24779 15574 16899 8504 -5534 -1938 -1050 -21010 -26582 -6863 3511 9672
401 9672 32229 40649 17339 990 1367 -6875 -12827 -157 5509 -2013 4770 15859 10888 9793
415 9793 15020 -4601 -35521 -40560 -34473 -35898 -21692 4242 7692 -1204 4291 9028 2769 1915
$$ packed form
320A6020R73k8506r834J8789l378j4182J8370K0384j0332n584Q619q516j5794
333a2971k933q925r457J5020J3596m970J8347L9465J727k6950n811m189k6965
346a5016j3391R328j158j421J7852R005n629R212O464k1406j4439P584n671q285
360b6971K4616K8187j583R55J4731l710j3673J912o154k4743j1738J01o676N284
374a9462J9190k915j5639P417P386j5538j375K0187k001j7819M080J1834J045
387c610J2194J8422k227r205J325q395j4038L596Q88j9960n572J9719J0374O161
401I672K2557Q420k3310j6349L77q242n952J2670N666p522O783J1089m971j095
415I793N227j9621l0920n039O087j425J4206K5934L450q896N495M737o259q54
$$ plain form
429 1915 -3306 -22899 -25102 -2157 10750 14369 32534 40124 17417 -764 2922 3001 2138 15099
443 15099 19894 5609 -323 6605 6091 6264 11553 543 -16276 -10352 -911 -10467 -17246 -15289 -28627
458 -28627 -42488 -27392 -4566 2945 13053 21929 6940 -12728 -13360 -11321 -10711 2684 11562 1303
472 1303 3920 26632 31620 17800 11572 4040 -15170 -20620 -8716 -782 7844 22835 22452 11500
486 11500 16695 25967 16005 3534 -2112 -18922 -33748 -20731 -1738 -1488 -367 5424 -7623 -29100
500 -29100 -31897 -26965 -27773 -22576 -13736 -11061 125 21121 26436 19463 21612 18376 1257 2279
514 2279 24756 28820 13251 6884 3232 -9007 -11353 -1863 2005 6610 15045 5186 -14254 -13287
528 -13287 -4245 -9028 -10563 -398 1368 2528 19456 26138 5559 -13777 -18788 -26522 -32347 -24303
$$ packed form
429A915n221j9593k203K2945J2907L619J8165P590k2707j8181L686P9q63J2961
443A5099M795j4285n932O928n14J73N289j1010j6819N924R441r556o779J957j3338
458b8627j3861J5096K2826P511J0108Q876j4989j9668o32K039O10J3395Q878j0259
472A303K617K2712M988j3820o228p532j9210n450J1904P934Q626J4991l83j0952
486A1500N195R272r962j2471n646j6810j4826J3017J8993K50J121N791j3047k1477
500b9100k797M932q08N197Q840K675J1186K0996N315o973K149l236j7119J022
514B279K2477M064j5569o367l652j2239k346R490L868M605Q435r859j9440R67
528a3287R042m783j535J0165J766J160J6928O682k0579j9336n011p734n825Q044
$$ plain form
542 -24303 -15124 -9177 1825 3531 -8622 -6373 12448 14236 1872 3793 9687 3225 4763 22159
556 22159 28819 22305 19741 16415 7466 3598 -1186 -15724 -21159 -12293 -10979 -12970 1505 14341
570 14341 5466 -4352 -4327 -13696 -22079 -8744 4414 -2021 -6277 372 1076 -2521 -1099 -2959 -4692
585 -4692 4929 7830 -4995 -5237 10068 7958 -6587 -4064 7882 10509 14710 19808 11182 -952
599 -952 -3404 -8022 -15757 -9047 2763 4458 7740 15340 7888 -4631 -1481 1832 -10612 -15777 -5541
614 -5541 -2273 -6475 -2528 534 -5969 -8293 -4406 -4435 -2582 1342 -4970 -10411 2528 11969 3292
629 3292 4882 24231 28653 13273 4347 820 -7161 -9455 -7015 -11526 -11461 688 4321 -3608 -5129
644 -5129 -3926 -9174 -6910 3038 1700 -2259 9565 17684 7780 2084 8889 8188 1729 648 -1962
$$ packed form
542b4303R179N947J1002J706j2153K249J8821J788j2364J921N894o462J538J7396
556B2159O660o514k564l326q949l868m784j4538n435Q866J314j991J4475J2836
570A4341q875r818K5r369q383J3335J3158o435m256O649P04l597J422j860j733
585d692R621K901j2825k42J5305k110j4545K523J1946K627M201N098q626j2134
599i52k452m618p735O710J1810J695L282P600p452j2519L150L313j2444n165J0236
614e541L268m202L947L062o503k324L887k9J853L924o312n441J2939R441q677
629C292J590J9349M422j5380q926l527p981k294K440m511O5J2149L633p929j521
644e129J203n248K264R948j338l959J1824Q119r904n696O805p01o459j081k610
$$ plain form
659 -1962 -9263 -10952 -11496 -18755 -17380 -3730 -73 -2808 7135 15766 6402 -1549 3572 4921 1249
674 1249 5438 10310 8871 10649 11720 779 -7371 -4689 -7756 -15837 -11849 -5748 -9488 -7630 1841
689 1841 -832 -7154 3482 15172 9948 3764 6843 6051 1498 -619 -4364 -4641 6623 12157 1439
704 1439 -4208 2236 -1437 -14093 -14460 -8493 -9197 -5509 5256 7030 3629 6630 6471 242 1191 4997
720 4997 418 -1863 4469 3316 -3727 -96 5343 485 -1089 4932 603 -10073 -9338 -5039 -7545
735 -7545 -7217 -2263 553 6047 12986 7211 -3410 909 6622 -2622 -8058 1553 6741 2557 2653 4213
751 4213 -341 -1832 959 -3269 -7248 -2680 -1839 -6516 -3861 232 -2388 -734 7855 7064 456 4262
767 4262 7736 -1545 -7672 -1827 456 -2516 269 3634 2380 3370 2524 -5738 -8486 -2062 -3297 -9402
$$ packed form
659a962p301j689n44p259J375J3650L657k735R943Q631r364p951N121J349l672
674A249M189M872j439J778J071j0941q150K682l067q081L988O101l740J858R471
689A841k673o322J0636J1690n224o184L079p92m553k117l745k77J1264N534j0718
704A439n647O444l673j2656l67N967p04L688J0765J774l401L001j59o229R49L806
720D997m579k281O332j153p043L631N439m858j574O021m329j0676P35M299k506
735g545L28M954K816N494O939n775j0621M319N713r244n436R611N188m184R6J560
751D213m554j491K791m228l979M568Q41m677K655M093k620J654Q589p91o608L806
767D262L474r281o127N845K283k972K785L365j254R90q46q262k748O424j235o105
$$ plain form
783 -9402 -2694 6947 3180 -1264 3723 5414 2041 2999 3833 674 1800 4373 -893 -3528 2829 3938
799 3938 -354 1973 4504 -2750 -6180 -1052 -4324 -13719 -10188 -871 -165 -1216 2243 3531 2599 3204
815 3204 -286 -4241 1398 6238 -399 -2641 5580 6290 -888 849 5712 548 -4796 -3336 -3224 -4829
831 -4829 -1124 1061 -512 2939 8352 6383 3975 6949 3446 -3919 -2580 797 -4393 -5633 1090
846 1090 1266 -6606 -8004 -5117 -6508 -6937 -5397 -6155 -4121 2453 3064 186 6029 11930 5759 961
862 961 6862 8735 2746 1462 3264 -1112 -3668 -1089 -807 -1170 2297 2717 -954 -53 1578 -2770
878 -2770 -3120 2675 983 -5415 -1075 5525 1551 -3592 -1410 -2246 -8414 -9542 -7534 -6220 -3136 -646
894 -646 -2667 -419 7092 6963 1499 3925 8158 2853 -1794 3100 5999 4008 4958 5812 1752 -375
$$ packed form
783i402O708R641l767m444M987J691l373R58Q34l159J126K573n266k635O357J109
799C938m292K327K531p254l430N128l272r395L531R317P06j051L459J288r32O05
815C204l490l955N639M840o637k242Q221P10p178J737M863n164n344J460J12j605
831d829L705K185j573L451N413j969k408K974l503p365J339L377n190j240O723
846A090J76p872j398K887j391m29J540p58K034O574O11k878N843N901o171m798
862I61N901J873n989j284J802m376k556K579K82l63L467M20l671R01J631m348
878b770l50N795j692o398M340O600l974n143K182q36o168j128K008J314L084K490
894f46k021K248P511j29n464K426M233n305m647M894K899j991R50Q54m060k127
$$ plain form
910 -375 1162 -1130 -3866 -2026 -2494 -5104 -981 3708 166 -1475 3294 2149 -5255 -4998 -633 -2835
926 -2835 -6263 -4608 -4246 -4964 -2686 -1297 -2112 1492 3855 -734 -1838 4831 5736 577 2273 6338
942 6338 4085 1703 5517 6349 2748 2000 1422 -2097 -2852 -1353 -2954 -2963 795 433 -2543 1083 4502
959 4502 -726 -4841 -1574 -1771 -6607 -5203 -164 -46 -1253 -114 -1009 -1577 815 -425 -4056 -1297
975 -1297 2981 292 -1010 4953 6534 2160 2567 4992 2239 -23 1424 1233 -1067 -296 -239 -1663
991 -1663 886 3368 -30 -1923 1319 269 -4889 -3466 177 -2589 -4669 -762 1139 -1552 -1540 -91
1007 -91 -972 -1045 132 -2192 -2108 2199 2363 -1159 834 4833 2471 245 2937 3308 -686 -1035 893
1024 893 -869 -2028 492 757 230 2482 2185 -963 -177 1145 -2093 -3638 355 927 -2014 -788
$$ packed form
910c75J537k292k736J840m68k610M123M689l542j641M769j145p404K57M365k202
926b835l428J655L62p18K278J389q15L604K363m589j104O669R05n159J696M065
942F338k253k382L814Q32l601p48n78l519p55J499j601rL758l62k976L626L419
959D502n228m115L267j97m836J404N039J18j207J139q95n68K392j240l631K759
975a297M278k689j302N963J581m374M07K425k753k262J447j91k300P71N7j424
991a663K549K482l398j893L242j050n158J423L643k766k080L907J901k691J2J449
1007i1q81p3J177k324Q4M307J64l522J993L999k362k226K692L71l994l49J928
1024H93j762j159K520K65n27K252k97l148P86J322l238j545L993N72k941J226
$$ plain form
1040 -788 2422 217 -2072 -463 -460 -2506 -1539 -1071 -2383 -609 1481 -716 -889 3291 3356 -574 741
1057 741 3635 730 -2635 -635 895 -520 589 2159 1010 823 1185 -1120 -2860 -714 -871 -3372
1073 -3372 -1103 2550 338 -1478 1834 2234 -1320 -1655 714 -126 -641 935 186 -1225 427 1085
1089 1085 -903 398 2362 -570 -2552 212 386 -2905 -1898 1642 881 -537 1279 1671 549 1410
1105 1410 852 -1466 -1068 1118 -118 -1351 1102 1219 -1825 -802 1699 -322 -2073 398 511 -1938
1121 -1938 -1764 237 19 559 2368 1483 497 2237 1246 -2190 -1293 714 -1700 -2961 793 2324 -190
1138 -190 -101 1216 -495 -2244 -1034 -572 -686 1447 1764 -247 484 2627 443 -1325 892 777 -1756
1155 -1756 -977 696 -1129 -2345 80 673 -1315 -304 1225 461 299 840 -1154 -2443 808 1435
$$ packed form
1040g88L210k205k289J609Lk046R67M68j312J774K090k197j73M180O5l930J315
1057G41K894k905l365K000J530j415J109J570j149j87L62k305j740K146j57k501
1073c372K269L653k212j816L312M00l554l35K369q40n15J576p49j411J652O58
1089A085j988J301J964k932j982K764J74l291J007L540p61j418J816L92j122Q61
1105A410n58k318L98K186j236j233K453J17l044J023K501k021j751K471J13k449
1121a938J74K001k18N40J809q85r86J740r91l436Q97K007k414j261L754J531k514
1138a90Q9J317j711j749J210M62j14K133L17k011P31K143k184j768K217j15k533
1155a756P79J673j825j216K425N93j988J011J529p64j62N41j994j289L251O27
$$ plain form
1171 1435 -796 206 2970 1365 -692 630 811 -878 -509 647 -790 -805 968 -62 -670 978
1187 978 1411 -1145 -689 1405 -271 -2030 -587 -432 -1976 -348 1790 232 -691 886 62 -2064
1203 -2064 -1532 -966 -1637 -371 1608 288 -456 2207 2312 -132 40 2075 945 219 1691 1479 241
1220 241 1041 1488 -793 -972 980 -50 -1891 -905 -496 -2583 -2107 -366 -1051 -1317 1066 1319 -628
1237 -628 -221 711 -850 -1596 -236 -604 -1562 74 1041 -907 -550 1430 -118 -1212 741 2003 587
1254 587 967 2454 1813 1694 2700 1933 463 1970 1876 -1424 -2376 -841 -1396 -2830 -1507 -1032 -1920 -1035
1272 -1035 -182 -1560 -2270 -366 -310 -1664 -194 1384 102 -97 1367 107 -1476 175 1289 -513
1288 -513 -297 1430 900 -139 1343 2079 1218 2034 2670 939 883 2130 833 -1615 -382 577 -1176
$$ packed form
1171A435k231J002K764j605k057J322J81j689L69J156j437j5J773j030o08J648
1187I78M33k556M56K094j676j759J443J55j544J628K138j558r23J577q24k126
1203b064N32N66o71J266J979j320p44K663J05k444J72K035j130p26J472k12j238
1220B41Q00M47k281j79J952j030j841R86M09k087M76J741o85k66K383K53j947
1237f28M07R32j561p46J360l68r58J636R67j948L57J980j548j094J953J262j416
1254E87L80J487o41j19J006p67j470J507r4l300r52J535n55j434J323M75q88Q85
1272a035Q53j378p10J904N6j354J470J578j282j99J464j260j583J651J114j802
1288e13K16J727n30j039J482P36q61Q16O36j731n6J247j297k448J233R59j753
$$ plain form
1305 -1176 -1787 -59 -450 -1406 -1132 -1165 -2563 -1793 -426 -1278 -1513 225 152 -1080 -176 535 -1101 -809
1323 -809 690 -119 -1438 627 2083 888 875 2584 2508 2198 2911 2274 1092 1869 1740 -960 -1334 603
1341 603 -77 -2181 -1703 -967 -2370 -2828 -1587 -1621 -1801 -297 113 -618 402 1820 340 -167 1140 439
1359 439 -1169 -156 139 -2117 -2181 -126 -422 -1603 6 1426 1300 1381 1900 1654 2030 3159 2372 967
1377 967 2355 2846 213 -1149 18 -1074 -3266 -3068 -2367 -3376 -3144 -1850 -1919 -1748 5 615 0
1394 0 1430 2083 1021 932 2246 1432 -133 1062 1664 -769 -1350 -50 -349 -1704 -1349 -713 -1117 65
1412 65 877 235 959 2588 1727 101 1309 2338 329 -800 465 -41 -1650 -837 -466 -1662 -1758 -719
1430 -719 -1480 -1816 -332 -598 -908 243 1019 -536 155 2140 1519 -181 717 1857 470 -320 345 696
$$ packed form
1305a176o11J728l91r56K74l3j398P70J367q52k35J738p3j232R04P11j636K92
1323h09J499q09j319K065J456j195j3J709p6l10P13o37j182P77j29k700l74J937
1341F03o80k104M78P36j403m58J241l4j80J504M10p31J020J418j480n07J307p01
1359D39j608J013K95k256o4K055k96j181J609J420j26Q1N19k46L76J129p87j405
1377I67J388M91k633j362J167j092k192J98P01j009K32J294o9J71J753O10o15
1394@J430O53j062q9J314q14j565J195O02k433n81J300k99j355L55O36m04J182
1412F5Q12o42P24J629q61j626J208J029k009j129J265n06j609Q13L71j196r6J039
1430g19p61l36J484k66l10J151P76j555O91J985o21j700Q98J140j387p90O65L51
$$ plain form
1448 696 -117 57 -81 -578 756 838 -865 -1087 721 -71 -1935 -695 613 -503 -990 269 471 -456
1466 -456 537 664 -51 24 631 -100 27 1399 603 -495 614 1023 -1215 -1582 108 -251 -2043 -1290
1484 -1290 -9 -320 -370 554 456 609 1353 833 -11 1424 1922 138 -201 1285 700 -992 -700 -50 -1343
1503 -1343 -1839 -847 -1026 -1561 -789 -268 -563 367 839 388 1021 2531 1556 119 1374 1975 303 -1017
1521 -1017 527 204 -1286 -1387 -886 -1223 -1112 -908 -1613 -1181 233 -157 -961 925 2123 1105 580 2014
1539 2014 1471 385 508 759 -316 -901 -306 -723 -1021 -860 -1041 -1629 -872 -411 -1339 -924 830 790 -348
1558 -348 860 2366 1453 636 1431 1318 202 162 35 -526 -406 -315 -1496 -1597 -117 -476 -1646 -542
1576 -542 699 -377 -602 918 1050 22 625 1310 523 367 717 213 4 268 -449 -1350 -659 101 -1344
$$ packed form
1448F96q13J74j38m97J334Q2j703k22J808p92j864J240J308j116m87J259K02r27
1466d56R93J27p15P5O07p31J27J372p96j098J109M09k238l67J690l59j792P53
1484a290J281l11n0R24r8J53P44n20q44J435M98j784l39J486n85j692K92O50j293
1503a343m96R92j79n35P72N21k95R30M72m51O33J510r75j437J255O01j672j320
1521a017J544l23j490j01N01l37J11K04p05M32J414l90q04J886J198j018n25J434
1539B014n43j086J23K51j075n85N95m17k98J61j81n88P57M61r28M15J754m0j138
1558c48J208J506r13q17P95j13j116m0j27n61J20R1j181j01J480l59j170J104
1576e42J241j076k25J520J32j028O03O85p87j56L50n04k09K64p17r01O91P60j445
$$ plain form
1595 -1344 -1317 433 370 -884 -191 981 312 -228 463 505 480 1086 694 153 865 1022 -224 -544 575
1614 575 117 -1121 -358 409 -577 -958 -107 94 -706 -499 -415 -802 -362 107 -649 -404 854 458 -546
1633 -546 623 1664 373 30 1114 1078 -88 195 726 279 40 101 -410 -635 20 -160 -956 -252 257
1652 257 -444 -708 787 562 -338 292 1157 424 -226 406 -67 -772 -593 -744 -1361 -721 -380 -1070 -836 332
1672 332 -96 -946 205 1192 492 490 1641 1669 1039 1320 1446 673 637 692 -265 -607 -35 -564 -1772 -1034 -309
1693 -309 -1077 -1491 -300 -181 -945 -541 178 -151 -185 535 315 260 624 430 -364 -4 541 -433 -849 180
1713 180 222 -627 -160 742 420 -50 815 645 280 788 924 140 468 840 101 -364 511 234 -710 -470
1733 -470 -47 -596 -1147 -554 -357 -1138 -542 -287 -750 -420 -83 -227 -739 218 259 -250 167 1109 521 65
$$ packed form
1595a344K7J750o3j254O93J172o69n40O91M2k5O06l92n41P12J57j246l20J119
1614E75m58j238P63P67r86l81Q51K01q00K07Q4l87M40M69p56K45J258l96j004
1633e46J169J041j291l43J084l6j166K83N31m47k39O1n11k25O55j80p96P04N09
1652B57p01k64J495k25r00O30Q65p33o50O32m73p05J79j51o17O40L41o90K34J168
1672C32m28q50J151R87p00kJ151K8o30K81J26p73l6N5r57l42N72n29j208P38P25
1693c09p68m14J191J19p64M04P19l29l4P20k20n5L64j94p94L60N45r74m16J029
1713A80M2q49M67R02l22m70Q65j70l65N08J36p84L28L72p39m65Q75k77r44K40
1733d70M23n49n51N93J97p81N96K55m63L30L37j44n12R57M1n09M17R42n88m56
$$ plain form
1753 65 1236 1005 197 756 922 435 114 547 104 -213 -3 13 -507 -247 127 -601 -997 -59 29 -898 -391
1774 -391 390 -90 -69 271 398 -206 119 32 -281 -251 -79 -404 -747 -131 -158 -769 -95 691 -89 -140 593 858
1796 858 203 722 858 782 729 1061 708 158 642 284 -717 -614 -139 -849 -1289 -473 -776 -1067 -702 -251
1816 -251 -535 -444 63 58 -190 593 742 72 417 918 429 -66 545 349 -602 -231 147 -440 -776 -37 15
1837 15 -266 67 208 188 239 690 349 203 779 748 -152 -36 417 -156 -572 -260 -289 -915 -519 -401 -642 -785
1859 -785 -203 -232 -357 128 342 -7 450 1024 369 93 705 594 -10 166 683 34 -78 264 28 -369
1879 -369 -73 -203 -774 -160 120 -252 -467 304 248 -200 -155 251 65 -49 278 225 -277 46 337 -247 -267
1900 -267 356 -122 -398 145 165 -313 -223 456 -312 -454 366 99 -257 21 311 -7 -37 443 284 -24 425
$$ packed form
1753F5J171k31q08N59J66m87l21M33m43l17K10J6n20K60L74p28l96R38Q8r27N07
1774c91P81m80K1L40J27o04L25q7l13L0J72l25l43O16k7o11O74P86p80n1P33K65
1796H58o55N19J36p6n3L32l53n50M84l58j001J03M75p10m40Q16l03k91L65M51
1816b51k84R1N07nk48P83J49o70L45N01m89m95O11j96r51L71L78n87l36P39N2
1837A5k81L33J41k0N1M51l41j46N76l1r00J16M53n73m16L12k9o26L96J18k41j43
1859g85N82k9j25M85K14l49M57N74o55k76O12j11o04J76N17o49j12L42k36l97
1879c69K96j30n71O14K80l72k15P71n6m48M5M06j86j14L27n3n02L23K91n84k0
1900b67O23m78k76N43K0m78R0O79p68j42Q20k67l56K78K90l18l0M80j59l08M49
$$ plain form
1921 425 434 -234 -31 345 -100 -493 160 -65 -604 -314 -119 -412 -452 19 2 -124 175 308 -20 87 658
1942 658 588 151 574 488 -226 -37 283 -218 -541 -236 -289 -579 -310 -104 -344 90 233 -33 12 337 684
1963 684 130 91 708 309 -207 306 169 -383 -5 -34 -416 -365 -20 -229 -591 -157 114 -369 -288 400 285
1984 285 70 240 411 -28 52 637 202 -118 90 113 -345 -11 61 -283 -123 187 -217 -607 -91 135 -351
2005 -351 -200 -5 54 -151 247 90 -134 147 425 -178 -119 219 28 -176 36 369 -284 -93 155 -172 -455
2026 -455 87 42 -340 -107 238 54 19 445 73 -131 416 383 -23 41 401 273 -265 51 -105 -346 -467
2047 -467 -300 -433 -509 -116 -105 -454 -43 157 -35 141 278 333 44 468 409 -13 -14 346 7 -41 90 148 -317
2070 -317 -94 51 -343 -166 140 -296 -390 55 439 30 -72 364 181 -50 87 18 -215 16 -85 -400 -204
$$ packed form
1921D25Ro68K03L76m45l93O53k25n39K90J95k93m0M71j7j26K99J33l28J07N71
1942F58p0m37M23q6p14J89L20n01l23L05n3k90K69K06k40M34J43k66M5L25L47
1963F84n54l9O17l99n16N13j37n52L78k9l82N1L45k09l62M34K71m83Q1O88j15
1984B85k15J70J71m39Q0N85m35l20K08K3m58L34P2l44J60L10m04l90N16K26m86
2005c51J51J95N9k05L98j57k24K81K78o03N9L38j91k04K12L33o53J91K48l27k83
2026d55N42m5l82K33L45j84l5M26l72k04N47l3m06O4L60j28n38L16j56k41j21
2047d67J67j33p6L93J1l49M11K00j92J76J37N5k89M24n9m22jL60l39m8J31N8m65
2070c17K23J45l94J77L06m36r4M45L84m09j02M36j83k31J37o9k33K31j01l15J96
$$ plain form
2091 -204 109 -19 -477 -166 140 -213 -277 153 104 -191 124 519 -4 120 569 381 92 623 385 -23 212
2112 212 477 -183 -130 387 -24 -381 -221 -1 -675 -284 -362 -578 -549 -171 -40 -395 6 254 -48 -183 560
2133 560 336 13 253 472 227 35 398 82 -106 -11 152 -279 -177 -35 -29 -53 294 209 -70 270 646 198
2155 198 -45 331 136 -59 -78 32 -369 -425 -523 -507 -483 -300 -278 -568 -130 112 -226 -217 489 264 135 387 637
2178 637 274 129 282 254 144 331 -11 -124 -19 221 -361 -294 215 52 -246 -178 324 -293 -188 3 -141
2199 -141 -289 89 -21 -163 -161 45 -348 -414 184 -52 -444 -73 281 -220 -349 76 131 -278 106 336 -51
2220 -51 226 305 157 -34 550 301 129 272 410 -58 -150 413 -13 -272 -101 -124 -434 -422 -171 -389 -476 -273
2242 -273 -122 -365 -110 178 -115 -193 638 243 82 229 589 154 58 421 194 8 -221 43 -310 -163 107
$$ packed form
2091b04L13j28m58L11L06l53o4M30m9k95L15L95n23J24M49j88k89N31k38m08K35
2112B12K65o60N3N17m11l57J60K20o74L91p8k16K9L78J31l55M01K48l02j35P43
2133E60k24l23K40K19k45j92L63l16j88R5J63m31J02J42Ok4L47q5k79L40L76m48
2155A98k43L76j95j95j9J10m01n6r8J6K4J83K2k90M38K42l38RP06k25j29K52K50
2178F37l63j45J53k8j10J87l42j13J05K40n82O7N09j63k98O8N02o17J05J91j44
2199a41j48L78j10j42KK06l93o6N98k36l92L71L54n01j29M25N5m09L84K30l87
2220e1K77P9j48j91N84k49j72J43J38m68r2N63m26k59J71k3l10J2K51k18q7K03
2242b73J51k43K55K88k93p8Q31l95j61J47L60m35r6L63k27j86k29K64l53J47K70
$$ plain form
2263 107 -326 -355 340 -131 -153 108 634 121 -34 425 349 102 -78 94 -226 -205 -196 -344 -343 -123 -431 -755 -182
2286 -182 -31 -261 -84 412 201 -12 113 447 443 29 278 301 85 124 66 -101 93 -31 -427 -285 62 74
2308 74 -390 -97 351 -246 -219 216 239 -162 64 257 -37 159 15 23 34 158 -141 -240 162 252 -299 -216 198
2331 198 76 -176 -72 236 -47 -67 109 27 -63 35 12 -44 -39 190 -205 -50 320 158 -194 -59 258 44 -193
2354 -193 47 26 -90 100 -81 -94 55 18 -328 -114 484 62 -64 -59 393 313 16 397 300 -93 14 -204
2376 -204 -41 -102 55 -220 -289 41 -134 -333 -26 278 -46 -267 315 397 -70 23 388 205 -50 123 80 -96
2398 -96 62 34 -295 -73 92 -323 -262 48 -42 -370 -96 336 -88 -60 212 80 -39 111 259 114 337 10
2420 10 -124 12 248 57 -352 -98 340 -250 -318 95 127 -251 -27 81 -152 -135 -13 118 -73 268 86
$$ packed form
2263A07m33k9O95m71k2K61N26n13j55M59p6k47j80J72l20K1Rj48JK20l08l24N73
2286a82J51k30J77M96k11k13J25L34mm14K49K3k16L9n8j67J94j24l96J42L47J2
2308G4m64K93M48n97K7M35K3m01K26J93k94J96j44QJ1J24k99r9M02R0n51Q3M14
2331A98j22k52J04L08k83k0J76q2r0R8k3n6NK29l95J55L70j62l52J35L17k14k37
2354a93K40k1j16J90j81j3J49l7l46K14N98m22j26NM52q0k97L81r7l93J07k18
2376b04J63o1J57k75o9L30j75j99L07L04l24k21N82Q2m67R3L65j83k55J73m3j76
2398i6J58k8l29K22J65m15O1L10r0l28K74M32m24K8K72j32j19J50J48j45K23l27
2420A0j34J36K36j91m09K54M38n90o8M13L2l78K24J08k33J7J22J31j91L41j82
$$ plain form
2441 86 -231 -5 201 -165 -272 161 -3 -169 -191 17 -135 -90 48 254 -106 278 79 -84 -101 183 -74
2462 -74 -155 313 148 -173 -54 163 131 -107 172 64 -365 -23 -83 -197 -86 35 -182 -153 265 -28 -294 77
2484 77 168 -58 79 332 240 153 155 336 71 125 417 -118 -88 104 -68 -300 83 -33 -244 -311 -49 212 -250
2507 -250 -134 293 195 -94 64 140 27 176 38 -38 -2 97 -161 -275 9 106 -375 -155 205 -193 -199 -60 295
2530 295 128 238 201 165 153 239 225 -65 233 12 -43 -8 -15 -200 -257 -67 14 -335 -313 30 -226 -61 48 144
2554 144 -30 183 155 14 220 160 -45 66 -31 114 -227 -124 167 -45 -8 8 111 -155 84 35 77 173 159
2577 159 33 67 308 130 -24 94 57 -24 -385 82 -69 -96 -104 41 -164 -228 -35 -172 -53 146 25 25 -4
2600 -4 56 -128 -81 192 53 -232 69 361 23 75 81 49 5 100 -14 -29 133 116 -114 -246 -7 25 -228 -32
$$ packed form
2441H6l17K26K06l66j07M33j64j66k2K08j52M5J38K06l60L84j99j63j7K84k57
2462g4q1M68j65l21J19K17l2k38K79j08m29L42o0j14J11J21k17K9M18k93k66L71
2484G7R1k26J37K53r2q7KJ81k65N4K92n35L0J92j72k32L83j16k11o7K62K61m62
2507b50J16M27r8k89J58P6j13J49j38p6L6R9k58j14K84R7m81K20L60l98oJ39L55
2530B95j67J10l7l6j2Q6j4k90K98k21n5L5pj85n7J90Q1l49K2L43k56J65J09R6
2554A44j74K13k8j41K06o0k05J11r7J45l41J03K91k12L7J6J03k66K39m9M2R6j4
2577A59j26L4K41j78j54J18l7q1l61M67j51k7qJ45k05o4J93j37J19J99j21%k9
2600dO0j84M7K73j39k85L01K92l38N2Ol2m4R5j14j5J62j7k30j32K39L2k53J96
$$ plain form
2624 -32 -56 -124 -119 151 61 -45 -40 81 -148 -144 157 -52 -89 -30 43 -171 -127 72 -139 -108 130 6 0 168 191 261
2650 261 140 -11 76 25 206 4 -97 40 190 -68 -198 31 -66 -285 -145 -49 -137 -154 -52 -134 -114 -3 41
2673 41 -54 137 228 49 3 -37 -116 -83 173 134 -115 -107 -74 22 -132 111 -22 -85 -238 -67 66 -37 51 73 -163
2698 -163 -44 86 -61 99 161 -166 -416 -64 12 -44 -175 207 -53 -189 49 -25 -216 21 98 123 40 145
2720 145 174 -14 53 22 -37 -21 332 114 -64 132 64 -101 24 -114 -72 -15 -21 178 -58 124 176 -44 66 103
2744 103 99 -189 -116 0 -208 -152 -28 70 -135 -28 -19 -111 92 -5 -8 38 86 16 -61 24 131 -234 -177 44 41 70 26
2771 26 37 -19 10 91 -154 -111 75 -87 41 113 146 19 -162 195 135 -100 -37 -135 -193 47 182 -129 203 -49
2795 -49 117 -27 21 17 67 31 13 96 -182 128 -12 -168 -172 0 82 62 -101 -105 -41 -32 194 65 -53 257 44 99
$$ packed form
2624c2k4o8NK70r0j06NJ21k29ML01k09l7N9P3k14M4J99k11L1K38j24oJ68K3P0
2650B61j21j51Q7n1J81k02j01J37J50k58j30K29r7k19J40R6q8j7J02q2K0J11M4
2673D1r5J91R1j79m6m0p9L3K56l9k49QL3R6j54K43j33o3j53J71J33j03Q8K2k36
2698a63J19J30j47J60O2l27k50L52P6n6j31L82k60j36K38p4j91K37P7K5q3J05
2720A45K9j88O7l1n9J6L53k18j78J96o8j65J25j38M2N7oJ99k36J82N2k20J10L7
2744A03mk88P3J16k08N6J24R8k05J07Rr2K03r7lM6M8p0p7Q5J07l65N7K21lK9m4
2771B6J1n6K9Q1k45M3J86j62J28P2L3j27j81L57o0k35O3r8n8K40J35l11L32k52
2795d9J66j44M8mN0l6j8Q3k78L10j40j56mJ72Q2k0j63mO4RK26j29j18L10k13N5
$$ plain form
2821 99 -44 45 25 32 241 -93 -107 37 156 -56 -31 -23 -42 -160 14 -94 -185 79 46 -56 -41 59 186 -79
2845 -79 -20 66 57 -194 213 -20 24 -110 -74 -93 20 90 -177 -7 10 -138 -43 -6 91 -34 61 156 16 -142 -62
2870 -62 22 -198 -137 261 116 -7 36 32 -152 -30 -163 -210 -9 -35 -49 -229 -64 -74 -7 -122 25 27 -229 49
2894 49 -5 -103 -169 64 102 -27 15 -11 -70 -59 30 -119 -139 26 -22 -59 -117 131 -44 13 -74 43 -46 -22 6 -74 132
2921 132 198 -52 -260 27 -124 -166 96 -132 -154 -96 96 -90 -23 -41 26 131 65 73 -102 -54 46 -49 -58 42 49
2946 49 27 -17 -35 11 -15 100 131 -4 143 123 -13 249 11 40 39 96 177 -19 47 276 184 -206 28 45 104 62
2972 62 -52 -152 0 -28 -5 -7 -15 -192 35 -139 164 83 -145 84 33 -35 -66 -28 61 22 -46 74 25 50 -36 -39 -158
2999 -158 44 -108 -71 -2 94 -86 88 112 -27 152 -81 -44 -139 68 -1 -119 -96 -147 258 -54 59 13 -175
$$ packed form
2821I9j43Q9k0PK09l34j4J44J19k12K5Qj9j18J74j08r1K64l3j02J5J00J27k65
2845g9N9Q6rk51M07k33M4j34L6j9J13P0k67J70J7j48R5L7R7j25R5R5j40j58Q0
2870f2Q4k20O1L98j45j23M3mj84J22j33m7K01k6j4j80J65j0O7j15J47Kk56K78
2894D9n4r8o6K33L8j29M2k6n9J1Q9j49k0J65m8l7n8K48j75N7q7J17q9K4K8q0K06
2921A32O6k50k08K87j51m2K62k28k2N8J92j86O7j8O7J05o6Qj75M8J00r5rJ00P
2946D9k2m4j8M6k6J15L1j35J47k0j36K62k38K9jN7Q1j96O6K29r2l90K34J7N9m2
2972F2j14j00J52k8K3kqj77K27j74L03q1k28K29n1o8l1L8Q9l9o8J20m9K5q6lj19
2999a58K02j52L7O9R6j80J74K4j39J79k33L7r5K07o9j18K3n1M05l12J13m6j88
$$ plain form
3022 -175 -155 -32 231 -103 155 67 141 -151 77 96 -130 146 100 22 79 75 -19 -56 178 43 -34 146 17 41
3046 41 -94 92 -12 -159 -164 -106 -58 18 141 9 -136 23 26 -206 -103 26 -159 9 -20 -73 -141 86 -92 -13
3070 -13 -62 75 -56 -53 145 39 39 87 25 35 -74 103 -5 -67 253 60 145 -180 -89 96 42 173 53 20 -45
3095 -45 209 -29 -14 -17 1 -55 33 95 -18 -218 50 -216 -69 -8 182 62 16 81 -57 73 40 60 -30 -151 67
3120 67 -84 25 188 -70 -293 -58 140 -177 -44 -88 119 34 -25 -103 -66 -49 48 160 41 76 -203 73 48
3143 48 -3 -64 -134 -46 -20 -100 37 9 147 -124 145 32 55 98 -4 -131 -43 102 22 -96 37 -73 -20 65 -112
3168 -112 118 17 66 37 33 -28 -18 -85 87 122 -50 -55 43 44 170 177 84 -152 4 34 -74 158 -119 -19 9 -15
3194 -15 103 -145 -6 95 -97 -93 -41 2 1 -86 164 -35 29 70 98 88 91 -64 -142 -62 -48 -40 -115 -100 93 0 -83 42
$$ packed form
3022a75K0J23K63l34K58q8P4k92K28J9k26K76m6p8N7mr4l7K34j35p7J80j29K4
3046D1j35J86j04j47nN8M8P6J23j32j45J59Lk32J03J29j85J68k9n3o8K27j78P9
3070a3m9J37j31LJ98j06%M8o2J0j09J77j08o2L20j93Q5l25R1J85n4J31j20l3o5
3095d5K54k38J5lJ8n6Q8O2j13k00K68k66J47O1J90j20m6O5j38J30l3K0r0j21K18
3120F7j51J09J63k58k23K35J98l17J33m4K07q5n9p8L7J7R7J12j19L5k79K76k5
3143D8n1o1p0Q8K6q0J37k8J38k71K69j13K3M3j02j27Q8J45q0j18J33j10N3Q5j77
3168a12K30j01M9k9mo1J0o7J72L5j72nR8JJ26Pr3k36J56L0j08K32k77J00K8k4
3194a5J18k48J39J01j92MN2M3jq7K50j99O4M1K8j0Lj55p8Q0J4Qp5J5J93r3q3J25
$$ plain form
3222 42 -23 -13 47 -82 84 26 -212 -97 96 -188 33 11 10 83 56 -79 56 190 -48 -10 31 44 15 36 90
3247 90 72 61 165 -161 -41 -47 -87 22 -64 -198 86 83 -29 -121 24 174 63 -88 -218 36 -2 -64 43 -46
3271 -46 -90 47 80 -13 5 220 28 149 53 43 -68 -95 -23 40 -26 123 -64 -111 12 -7 -259 16 -32 38 3
3296 3 -42 51 -85 -108 142 98 -43 -57 -106 39 38 -32 -95 73 -23 -79 -179 -71 55 139 72 159 -93 -135 101 -47
3322 -47 19 78 -85 -22 -70 21 29 -108 -53 98 -101 -115 205 8 42 38 -20 13 -145 -36 28 -128 211 -38 62
3347 62 -56 -137 13 136 -10 59 46 104 -3 16 1 79 -41 -79 79 13 73 18 -162 -103 -34 -47 53 -71 -64 -100
3373 -100 42 80 -199 -148 -73 81 25 -61 68 -31 -3 -153 162 -115 -46 -108 117 68 -179 46 -109 52 -98
3396 -98 29 -7 145 122 104 -90 -35 -64 -84 17 -40 2 -18 -144 -46 -200 86 75 -126 5 117 -212 -166 75
$$ packed form
3222D2o5J0O0j29J66n8k38J15J93k84K21k2jP3k7j35J35J34k38L8M1J3k9K1N4
3247I0j8j1J04l26J20om0J09q6j34K84lj12r2J45J50j11j51j30K54l8o2J07q9
3271d6m4J37L3r3J8K15j92J21r6j0j11k7P2O3o6J49j87m7J23j9k52K75m8P0l5
3296Cm5R3j36k3K50m4j41j4m9J45jp0o3J68r6n6j00J08J26Q4o7Q7k52m2K36j48
3322d7O6N9j63O3m8R1Qj37N5J51j99j4L20j97L4mn8L3j58J09O4j56L39k49J00
3347F2j18q1J50J23j46O9j3N8j07J9j5P8j20l8J58o6O0n5j80N9O9j3J00j24Pl6
3373a00J42L8k79N1P5J54n6q6J29r9K8j50L15k77O9o2K25m9k47K25j55J61j50
3396i8J27l6J52k3j8j94N5k9k0J01n7M2k0j26R8j54K86j1k01J31J12l29M6K41
$$ plain form
3420 75 45 -91 -78 -65 115 29 -90 -115 -106 164 -4 52 -4 36 -49 -95 -40 11 -100 32 52 19 -68 49 -47 -76 -86
3447 -86 -38 -42 -91 -63 -19 -1 -96 53 -49 51 -66 -36 -32 -130 45 10 -9 106 -123 32 8 46 -121 44 70 119
3473 119 -37 9 -149 -8 140 -105 -81 -52 -46 -37 -25 -57 91 -24 -3 -83 36 -7 97 124 -3 24 -57 -142 -83 130
3499 130 56 -63 58 -40 -145 -8 33 -158 -11 -122 172 -93 -108 -90 -77 -49 148 36 -39 7 54 -35 194 -13
3523 -13 -1 -61 -120 111 127 -175 -6 -33 34 107 -100 82 47 -32 70 -1 28 131 1 27 101 27 11 -80 93 161
3549 161 -147 71 82 12 77 35 -69 -22 31 32 -203 -176 157 97 -26 -77 -162 -8 -90 192 -55 84 52 -181 -56
3574 -56 -61 -5 5 87 -12 6 -13 107 105 17 -196 -111 15 -166 -145 3 -86 61 149 156 21 0 162 -17 -71 -108 33
$$ packed form
3420G5l0j36J3J3J80q6j19k5RK70j68N6n6M0q5m6N5N1j11J32K0l3q7J17r6k9j0
3447h6M8mm9K8M4J8r5J49j02J00j17L0Mr8J75l5j9J15k29J55k4L8j67J65K6M9
3473A19j56M6j58J41J48k45K4K9ORJ2l2J48j15K1q0J19m3J04K7j27K7q1q5N9K13
3499A30p4j19J21r8j05J37M1j91J47j11K94k65j5J8J3K8J97j12p5M6M7q9K29k07
3523a3J2o0n9K31J6l02J69k7O7P3k07J82l5p9J02p1K9J03j30K6P4p4j6r1J73O8
3549A61l08K18J1p0O5m2j04M7N3Jk35K7L33o0j23n1q5J54q2K82k47J39l2k33J25
3574e6nN6J0Q2r9J8j9J20kq8k13Q5J26j81K1J48q9J47Q8Pj35k1J62j79n4l7J41
$$ [...]
8191A01
##END NTUPLES=NMR FID
##END=
