##TITLE=1H_Pr 43-DM
 200.13MHz,CDCl3,
 8 sc
 
 13.3.2025
##JCAMPDX= 6.0         $$ Bruker NMR JCAMP-DX V2.0
##DATA TYPE= NMR FID
##DATA CLASS= NTUPLES
##ORIGIN= UXNMR, Bruker Analytische Messtechnik GmbH
##OWNER= pz
$$ XWIN-NMR		Version 3.5
$$ Thu Mar 13 14:32:26 2025 Russian Standard Time (UT+4h)  she@DPX200
##.OBSERVE FREQUENCY= 200.1313
##.OBSERVE NUCLEUS= ^1H
##.DELAY= (6, 6)
##.ACQUISITION MODE= SIMULTANEOUS
##.ACQUISITION SCHEME= undefined
##.AVERAGES= 8
##.DIGITISER RES= 18
##SPECTROMETER/DATA SYSTEM= spect
##.PULSE SEQUENCE= zg30
##.SOLVENT NAME= CDCl3
##.SHIFT REFERENCE= (INTERNAL, CDCl3, 0, 14.3821)
##AUDIT TRAIL= $$ (NUMBER, WHEN, WHO, WHERE, WHAT)
$$ ##TITLE= Audit trail, XWIN-NMR		Version 3.5
$$ ##JCAMPDX= 5.01
$$ ##ORIGIN= Bruker BioSpin GmbH
$$ ##OWNER= she
$$ F:/spectra/data/she/nmr/H-C/1/audita.txt
$$ ##AUDIT TRAIL=  $$ (NUMBER, WHEN, WHO, WHERE, WHAT)
(   1,<2025-03-13 14:31:20.48 +0400>,<she>,<DPX200>,
      <created by zg, POWCHK disabled, PULCHK disabled
       configuration hash MD5:
       00 E9 B6 7A A2 85 ED C7 34 08 36 98 17 FE 4E 26
       data hash MD5: 16K
       97 BC 01 9A B9 BA 4B 94 90 0A E4 74 4D 41 3D 52>)
$$ ##END=
$$ 
$$ hash MD5
$$ B0 8C 4A 43 5B 03 5C 7F CD 50 35 61 EB 59 82 C4
##$RELAX= 
##$RELAX= 
##$RELAX= 
##$RELAX= 
##$RELAX= 
##$RELAX= 
$$ Bruker specific parameters
$$ --------------------------
##$DU= <F:/spectra>
##$EXPNO= 1
##$NAME= <H-C>
##$PROCNO= 1
##$TYPE= <nmr>
##$USER= <she>
##$AMP= (0..31)
100 100 100 100 100 100 100 100 100 100 100 100 100 100 100 100 100 100 
100 100 100 100 100 100 100 100 100 100 100 100 100 100 
##$AQSEQ= 0
##$AQ_mod= 1
##$AUNM= <au_zg>
##$AUTOPOS= <>
##$BF1= 200.13
##$BF2= 200.13
##$BF3= 200.13
##$BF4= 200.13
##$BF5= 200.13
##$BF6= 200.13
##$BF7= 200.13
##$BF8= 200.13
##$BYTORDA= 1
##$CFDGTYP= 0
##$CFRGTYP= 5
##$CHEMSTR= <none>
##$CNST= (0..31)
1 1 145 1 1 1 1 1 1 1 1 1 1 1 1 1 1 1 1 1 1 1 1 1 1 1 1 1 1 1 1 1 
##$CPDPRG= <>
##$CPDPRG1= <>
##$CPDPRG2= <>
##$CPDPRG3= <>
##$CPDPRG4= <mlev>
##$CPDPRG5= <mlev>
##$CPDPRG6= <mlev>
##$CPDPRG7= <mlev>
##$CPDPRG8= <mlev>
##$CPDPRGB= <>
##$CPDPRGT= <>
##$D= (0..31)
0 0.7 0 0 0 0 0 0 0 0 0 0.03 0 0 0 0 0 0 0 0 0 0 0 0 0 0 0 0 0 0 0 0 
##$DATE= 1741861879
##$DBL= (0..7)
120 120 120 120 120 120 120 120 
##$DBP= (0..7)
150 150 150 150 150 150 150 150 
##$DBP07= 0
##$DBPNAM0= <>
##$DBPNAM1= <>
##$DBPNAM2= <>
##$DBPNAM3= <>
##$DBPNAM4= <>
##$DBPNAM5= <>
##$DBPNAM6= <>
##$DBPNAM7= <>
##$DBPOAL= (0..7)
0.5 0.5 0.5 0.5 0.5 0.5 0.5 0.5 
##$DBPOFFS= (0..7)
0 0 0 0 0 0 0 0 
##$DE= 6
##$DECBNUC= <off>
##$DECIM= 32
##$DECNUC= <off>
##$DECSTAT= 4
##$DIGMOD= 1
##$DIGTYP= 9
##$DL= (0..7)
0 120 120 120 120 120 120 120 
##$DP= (0..7)
150 150 150 150 150 150 150 150 
##$DP07= 0
##$DPNAME0= <>
##$DPNAME1= <>
##$DPNAME2= <>
##$DPNAME3= <>
##$DPNAME4= <>
##$DPNAME5= <>
##$DPNAME6= <>
##$DPNAME7= <>
##$DPOAL= (0..7)
0.5 0.5 0.5 0.5 0.5 0.5 0.5 0.5 
##$DPOFFS= (0..7)
0 0 0 0 0 0 0 0 
##$DQDMODE= 0
##$DR= 18
##$DS= 0
##$DSLIST= <SSSSSSSSSSSSSSS>
$$ [...]
##$SUBNAM0= <"">
##$SUBNAM1= <"">
##$SUBNAM2= <"">
##$SUBNAM3= <"">
##$SUBNAM4= <"">
##$SUBNAM5= <"">
##$SUBNAM6= <"">
##$SUBNAM7= <"">
##$SUBNAM8= <"">
##$SUBNAM9= <"">
##$SW= 18.0517328524113
##$SWIBOX= (0..15)
0 0 2 0 0 0 0 0 0 0 0 0 0 0 0 0 
##$SW_h= 3612.71676300578
##$TD= 16384
##$TD0= 1
##$TE= 0
##$TE2= 300
##$TE3= 300
##$TEG= 300
##$TL= (0..7)
0 120 120 120 120 120 120 120 
##$TP= (0..7)
150 150 150 150 150 150 150 150 
##$TP07= 0
##$TPNAME0= <>
##$TPNAME1= <>
##$TPNAME2= <>
##$TPNAME3= <>
##$TPNAME4= <>
##$TPNAME5= <>
##$TPNAME6= <>
##$TPNAME7= <>
##$TPOAL= (0..7)
0.5 0.5 0.5 0.5 0.5 0.5 0.5 0.5 
##$TPOFFS= (0..7)
0 0 0 0 0 0 0 0 
##$TUNHIN= 0
##$TUNHOUT= 0
##$TUNXOUT= 0
##$USERA1= <user>
##$USERA2= <user>
##$USERA3= <user>
##$USERA4= <user>
##$USERA5= <user>
##$V9= 5
##$VALIST= <valist>
##$VCLIST= <CCCCCCCCCCCCCCC>
##$VD= 0
##$VDLIST= <DDDDDDDDDDDDDDD>
##$VPLIST= <PPPPPPPPPPPPPPP>
##$VTLIST= <TTTTTTTTTTTTTTT>
##$WBST= 1024
##$WBSW= 4
##$XGAIN= (0..3)
0 0 0 0 
##$XL= 0
##$YL= 0
##$YMAX_a= 561201
##$YMIN_a= -466965
##$ZGOPTNS= <>
##$ZL1= 120
##$ZL2= 120
##$ZL3= 120
##$ZL4= 120
##$ABSF1= 10
##$ABSF2= 0
##$ABSG= 5
##$ABSL= 3
##$ALPHA= 0
##$AQORDER= 0
##$ASSFAC= 0
##$ASSFACI= 0
##$ASSFACX= 0
##$ASSWID= 0
##$AUNMP= <proc_1d>
##$AZFE= 0.1
##$AZFW= 0.1
##$BCFW= 1
##$BC_mod= 2
##$BYTORDP= 1
##$COROFFS= 0
##$CY= -3
##$DATMOD= 1
##$DC= 2
##$DFILT= <>
##$DTYPP= 0
##$F1P= 0
##$F2P= 0
##$FCOR= 0.5
##$FTSIZE= 0
##$FT_mod= 4
##$GAMMA= 1
##$GB= 0.15
##$INTBC= 1
##$INTSCL= 1
##$ISEN= 128
##$LB= 0.25
##$LEV0= 0
##$LPBIN= 0
##$MAXI= 10000
##$MC2= 0
##$MEAN= 0
##$ME_mod= 0
##$MI= 1.114404
##$NCOEF= 0
##$NC_proc= 0
##$NLEV= 6
##$NOISF1= 3.799351
##$NOISF2= 2.8
##$NSP= 1
##$NTH_PI= 0
##$NZP= 0
##$OFFSET= 14.38212
##$PC= 1
##$PHC0= -466.9832
##$PHC1= 6.39221
##$PH_mod= 1
##$PKNL= yes
##$PPARMOD= 0
##$PSCAL= 0
##$PSIGN= 0
##$REVERSE= no
##$SF= 200.129724274929
##$SI= 16384
##$SIGF1= 3
##$SIGF2= 2
##$SINO= 400
##$SIOLD= 16384
##$SREGLST= <1H.CDCl3>
##$SSB= 0
##$STSI= 0
##$STSR= 0
##$SW_p= 3205.1282051282
##$SYMM= 0
##$S_DEV= 0
##$TDeff= 0
##$TDoff= 0
##$TI= <>
##$TILT= no
##$TM1= 0
##$TM2= 0
##$TOPLEV= 0
##$USERP1= <user>
##$USERP2= <user>
##$USERP3= <user>
##$USERP4= <user>
##$USERP5= <user>
##$WDW= 1
##$XDIM= 8192
##$YMAX_p= 0
##$YMIN_p= 0
$$ End of Bruker specific parameters
$$ ---------------------------------
##NTUPLES= NMR FID
##VAR_NAME=  TIME,          FID/REAL,        FID/IMAG
##SYMBOL=    X,             R,               I
##VAR_TYPE=  INDEPENDENT,   DEPENDENT,       DEPENDENT
##VAR_FORM=  AFFN,          ASDF,            ASDF
##VAR_DIM=   8192,          8192,            8192
##UNITS=     SECONDS,       ARBITRARY UNITS, ARBITRARY UNITS
##FACTOR=    0.0002768,     1,               1
##FIRST=     0,             0,               0
##LAST=      2.2672688,     0,               0
##MIN=       0,             -466965,         0
##MAX=       2.2672688,     561201,          0
$$ Real data points
##PAGE= N=1
##DATA TABLE= (X++(R..R)), XYDATA
0 0 0 0 0 0 0 0 0 0 0 0 0 0 0 -8 8 -8 8 -8 13 -13 16 -19 24 -24 32 -37 40 -47 55 -63 69 -81 93 -103 116 -131
36 -131 147 -164 182 -202 227 -251 277 -305 339 -373 410 -453 500 -550 606 -668 738 -814 900
55 900 -1000 1116 -1247 1404 -1590 1819 -2106 2481 -2989 3710 -4821 6741 -10687 22019 -125214
70 -125214 -466965 -89800 328997 163224 -110079 177201 561201 341069 -139429 -82075
80 -82075 288877 178846 -322726 -382807 36695 143109 -229033 -329146 70036 244587
90 244587 -127536 -336032 51743 392493 131211 -202384 -5973 294733 71563 -299897
100 -299897 -135789 268117 159103 -284373 -281287 121742 151244 -239896 -292795 125981 265979
111 265979 -99056 -241904 158335 406296 77697 -202242 70286 358437 102339 -240063
121 -240063 -62168 248641 36691 -379640 -276437 146867 147203 -193474 -163618 216031 228606
132 228606 -184505 -299460 59103 213366 -102384 -261772 72302 318015 55190 -208155
142 -208155 5213 253548 21004 -302600 -130231 236796 166340 -152351 -91358 233857
152 233857 191968 -166668 -193262 153573 228585 -112090 -254505 32005 187134 -87175
162 -87175 -273793 -10967 229587 21337 -223843 -25135 268163 119044 -203819 -130679
172 -130679 162899 106904 -191879 -159648 164158 189066 -134874 -222553 73180 203019 -57162
183 -57162 -201323 51632 233889 5092 -204282 7347 262483 102451 -165413 -46930
193 -46930 221280 114021 -202888 -182647 88020 62999 -231757 -236984 97455 203870 -62592
204 -62592 -171373 89235 223371 -32589 -204603 33564 250065 54503 -178703 -14664
214 -14664 229434 80942 -206235 -124653 147892 88152 -196527 -173916 116863 138224 -141511
225 -141511 -189868 99938 214399 -25162 -139764 99226 242845 5984 -199760 -27346
235 -27346 169302 5400 -218771 -81550 170800 79233 -180074 -125119 135825 114057 -145568
246 -145568 -149503 121512 174634 -77240 -154684 92621 208662 -17833 -163049 38478 200722
257 200722 7150 -200833 -59152 146205 17364 -208939 -103321 158141 115770 -124627
267 -124627 -100623 142966 143510 -109356 -153841 86558 163291 -60667 -161730 51831 185633
278 185633 -7702 -171129 -9139 165701 18582 -182930 -67941 146965 60609 -163636
288 -163636 -103557 137771 125220 -100345 -104722 124247 154322 -81765 -158335 53597 150000
299 150000 -52413 -174651 18036 176160 14771 -158783 -22682 161596 39145 -170318
309 -170318 -82443 137677 83717 -136232 -105710 123174 130292 -88049 -118893 95532 151977
320 151977 -61916 -158039 32760 147782 -29297 -167513 -6340 160119 33128 -139570
330 -139570 -31062 152321 60330 -146846 -95437 111025 87148 -116362 -111608 101109 132976
341 132976 -70176 -127550 66375 145719 -44241 -155800 13559 145188 -4513 -152353
351 -152353 -18922 151031 45817 -133160 -49616 138965 78000 -124421 -98621 101040
361 101040 98688 -99802 -120736 81288 138039 -47341 -123603 50049 144048 -23536 -148424
372 -148424 -7258 130310 5350 -149641 -45889 125494 51683 -120767 -63413 119450
382 119450 84647 -108317 -105387 85395 109612 -72157 -114697 68555 143355 -21089 -111421
393 -111421 41223 145399 -6510 -147776 -30101 119397 22290 -135124 -53797 118171
403 118171 61518 -115131 -79418 104585 93498 -95364 -115864 64272 110524 -55383 -115536
414 -115536 47669 130875 -21196 -127103 8630 133245 14438 -129049 -35812 114588
424 114588 41785 -113325 -53937 116327 83491 -89332 -80460 94498 111625 -58670 -103969
435 -103969 50253 103426 -54100 -132855 15090 119025 -8812 -126535 -13141 118267
445 118267 20477 -127342 -53531 98994 43556 -113082 -69910 105613 101948 -61732 -77150
456 -77150 79738 108773 -51657 -108394 40247 115570 -21816 -114722 10815 121448 13666
467 13666 -110186 -21509 108299 31116 -115578 -64067 87040 58553 -92938 -82236 72688
478 72688 85274 -63850 -94199 52370 101567 -41815 -114343 16765 108038 -6066 -105369
489 -105369 -153 114889 24558 -103473 -29562 112408 62113 -84856 -58032 85862 71509
500 71509 -77800 -84899 64245 92608 -50631 -96546 42562 107419 -23564 -112908 -6490
511 -6490 84974 -15318 -118319 -23247 105905 40289 -92181 -46239 87651 56134 -82562
522 -82562 -69158 73234 80229 -56718 -76322 63799 108192 -24379 -89388 27439 101430
533 101430 -9980 -100775 -3852 95907 6770 -110936 -40051 89221 41868 -86458 -52702
544 -52702 79039 59218 -77714 -77294 60311 80927 -50226 -85559 41893 96183 -22132
555 -22132 -93218 11995 93716 -3461 -98982 -15124 93091 25620 -90187 -39570 82752
566 82752 52414 -66698 -44519 83006 80138 -50433 -73443 43767 74031 -45893 -94343
577 -94343 19408 86434 -14067 -93407 -4720 82106 521 -100919 -33566 79909 34733
588 34733 -75686 -36055 86563 67331 -57531 -57670 63207 76970 -43750 -76689 36890
599 36890 80791 -31500 -94829 5859 84241 -2221 -86572 -7986 88198 23730 -82158
610 -82158 -33836 76152 42572 -71042 -51478 67486 67107 -51136 -68355 42689 68655
621 68655 -43856 -87230 19542 79898 -14834 -85590 1032 84789 11877 -77641 -13257 87485
633 87485 37736 -70573 -37640 71401 48735 -67423 -63048 52583 65968 -43963 -68491
644 -68491 38407 75098 -31344 -87047 7266 75353 -6030 -79480 -3707 83367 21954 -72909
656 -72909 -26186 72342 37205 -66976 -46113 61006 56000 -51867 -62481 41049 64618
667 64618 -34103 -68927 27348 76458 -13498 -77397 -327 70447 1059 -78290 -16058 76115
679 76115 31650 -62898 -29547 68035 44323 -60991 -55277 49044 58377 -42263 -63059 34164
691 34164 66888 -27604 -74603 12723 72222 -6033 -74832 -5920 72562 14382 -70594 -23442
703 -23442 69146 37921 -56436 -34925 62272 52421 -49846 -59964 35133 54263 -37362 -67688
715 -67688 22823 67756 -15478 -70665 5059 70475 3857 -69462 -11655 71003 25657 -61577
727 -61577 -28036 62669 40537 -54769 -45603 49637 53006 -43675 -62336 28307 55881 -31311
739 -31311 -69837 15411 69432 -3769 -64028 3004 72400 14114 -64946 -20248 62662 29181
751 29181 -57160 -35068 53804 42911 -48523 -52485 36543 51257 -35409 -61720 21560 60022
763 60022 -17222 -63597 8786 67267 5252 -59714 -5356 67810 22337 -58211 -27550 53372
775 53372 30717 -54734 -43030 45374 46398 -40807 -53348 31322 54735 -27328 -61625 15767
787 15767 62104 -7317 -60418 3306 66376 11896 -59081 -16048 59240 24986 -55462 -34151
799 -34151 46829 34406 -49072 -47934 36598 49408 -30364 -51226 27149 59853 -13425 -56832
811 -56832 9597 60797 1603 -57747 -6158 60372 16714 -56730 -25272 49707 26157 -53237
823 -53237 -40820 39741 38812 -41249 -49078 31847 53309 -22140 -51633 21254 61580 -5445 -55507
836 -55507 2075 57313 5406 -57875 -14066 55353 22383 -51009 -28367 46298 33101 -44264
848 -44264 -41220 35413 43932 -30147 -47767 25249 53996 -14817 -53368 8287 53629 -2404
860 -2404 -55879 -7367 51289 10119 -54941 -21680 48382 27557 -43907 -30529 42801 39725
872 39725 -34391 -41323 31888 48364 -22581 -49159 18132 54290 -7770 -51708 3390 52830
884 52830 3388 -53559 -13128 49015 16184 -50577 -27487 42267 29758 -40024 -36130 34491
896 34491 40122 -30101 -46262 21145 46569 -16405 -48702 10854 52673 462 -47098 -956
908 -956 52094 12095 -47998 -17651 45277 23305 -42725 -29305 38984 34521 -33982 -39458 28093
921 28093 41884 -23784 -46697 15552 46317 -11380 -50188 3305 49203 2773 -48958 -10217
933 -10217 46662 15253 -46180 -23085 41039 27660 -37444 -32614 34337 39669 -24294 -37525
945 -37525 24613 45554 -13902 -44008 10132 46535 -3737 -47966 -5040 45058 8557 -45794
957 -45794 -16257 41280 19518 -41910 -28586 34366 30024 -32107 -35996 26826 39839 -20269
969 -20269 -40199 17135 44600 -9931 -45721 3293 45730 2515 -45040 -7977 45070 16006
981 16006 -39889 -18418 40375 26100 -34963 -30735 29780 33826 -25868 -37712 19542 39291
993 39291 -15487 -42753 8388 42420 -4199 -45078 -4437 42105 8351 -41538 -13944 39633
1005 39633 20093 -35788 -23087 34338 30317 -28341 -32285 24826 36034 -20230 -38377 15443
1017 15443 41425 -8590 -41076 4476 42726 2025 -43018 -8996 39179 11871 -39508 -18843
1029 -18843 35788 22711 -32635 -27866 28568 31242 -24952 -34969 19281 37011 -14184 -38811
1041 -38811 9664 40618 -2701 -39422 -1157 40616 8344 -38482 -13355 35841 16655 -34400
1053 -34400 -22402 31501 27015 -26927 -29473 23920 33267 -19426 -36527 13322 36925 -9376
1065 -9376 -38732 4001 39379 1295 -38917 -7017 37640 11793 -36023 -16950 33205 20735
1077 20735 -31083 -25617 27016 29440 -22207 -31122 19348 35478 -13070 -36230 8003 36325
1089 36325 -3537 -37491 -1644 37127 7261 -35670 -11976 33621 15353 -32526 -20763 28837
1101 28837 24262 -25687 -27796 22274 30935 -17355 -32564 14066 35754 -7327 -35527 3424
1113 3424 35293 41 -37117 -6699 34916 10574 -33296 -14793 31588 19494 -29446 -23632
1125 -23632 25187 26595 -21366 -28776 18874 33145 -12158 -33278 7927 33679 -4276 -35264
1137 -35264 -1478 33691 4715 -34465 -11039 31558 14572 -29683 -18085 28161 23138 -23571
1149 -23571 -25008 20649 27820 -17242 -30917 12878 32608 -7920 -32697 3730 33003 -308
1161 -308 -34222 -5250 32508 9513 -31425 -13326 29967 18015 -26359 -21018 23972 24657 -20229
1174 -20229 -27269 16208 28725 -13324 -31868 7195 31206 -3327 -31389 22 32242 5397
1186 5397 -30991 -9310 29457 13380 -27415 -16705 26207 21485 -21544 -23259 18453 25589 -16447
1199 -16447 -28530 11555 28966 -8044 -31088 3067 30466 289 -30866 -4524 30499 9112
1211 9112 -28708 -12399 27644 16192 -25312 -19564 22316 23270 -18278 -24191 16027 26940 -12135
1224 -12135 -28931 7536 28983 -3910 -29602 -357 30170 4895 -28727 -8389 27563 12222
1236 12222 -25589 -15806 23260 18423 -21595 -22449 16851 23109 -15057 -25871 11191 27028 -7428
1249 -7428 -28228 3665 28621 628 -27646 -2900 29518 9475 -25514 -9982 25737 14651
1261 14651 -23711 -18523 20184 19811 -18508 -23655 13895 23903 -11857 -26924 7018 27125 -3838
1274 -3838 -27843 -11 27446 3656 -27084 -7759 25508 11303 -23185 -13702 22207 17288
1286 17288 -19669 -19572 16694 22159 -13126 -22877 11407 26311 -6214 -25197 4087 26755 -265
1299 -265 -26618 -3856 25456 6407 -26008 -11101 22125 12259 -22639 -16621 19202 18658 -17280
1312 -17280 -21447 13701 22558 -11316 -24274 7787 26092 -3185 -24940 1234 26617 3641
1324 3641 -24601 -6327 24527 10979 -21690 -12231 20999 15762 -18410 -18468 15666 19552 -13624
1337 -13624 -22948 8943 22235 -7853 -25091 2901 23819 -435 -24048 -2820 24733 6690
1349 6690 -22649 -9087 21503 12227 -20124 -14585 18706 17611 -15896 -19418 12951 21148 -9869
1362 -9869 -22397 7223 24196 -2815 -22712 992 24117 3215 -22892 -6051 21924 8349
1374 8349 -21952 -13413 17358 12841 -18875 -18141 13827 18555 -12396 -19760 10099 22565 -5259
1387 -5259 -21196 4693 23526 895 -21507 -1883 22702 6013 -21896 -8843 19693 10196
1399 10196 -19591 -14328 16311 15098 -15281 -18030 12387 20079 -9074 -19961 7517 21860 -3242
1412 -3242 -21809 562 21178 1158 -22642 -5967 19875 7319 -19910 -10932 17967 13472
1424 13472 -15686 -14825 14536 18309 -10383 -17427 9970 20519 -5524 -20444 3447 20886 -1119
1437 -1119 -21228 -3002 19617 4105 -20963 -8235 18423 10236 -17385 -12238 16325 15026 -13553
1450 -13553 -16478 11221 18066 -8782 -18950 6475 20455 -3605 -20463 878 20334 1960
1462 1960 -20273 -4938 19481 7528 -18348 -10006 16860 12588 -14909 -14107 13107 16046 -10727
1475 -10727 -17210 8454 18307 -5920 -19582 3297 19689 -431 -19326 -2116 19175 4801
1487 4801 -18913 -7621 17608 9497 -16557 -11872 14695 14117 -12744 -15308 11104 17314 -8647
1500 -8647 -17513 6433 19059 -3629 -19271 1043 19021 1561 -19393 -4732 17973 6283
1512 6283 -17979 -9715 15433 11316 -14256 -13218 12469 15357 -9573 -15557 8333 17837 -5319
1525 -5319 -18052 3006 18525 -955 -19018 -2621 17589 3877 -18189 -7148 16252 8972
1537 8972 -15221 -10848 14077 13159 -11457 -13711 10802 15901 -7385 -16614 5981 17379 -3670
1550 -3670 -18333 186 17559 959 -18608 -4284 16733 6034 -16125 -8156 15453 10959
1562 10959 -12863 -11647 12016 14240 -9313 -15020 7446 16203 -5684 -16781 2841 16500 -1387
1575 -1387 -18006 -1874 16369 3975 -16373 -5826 15461 8359 -14129 -9379 13489 11878 -11352
1588 -11352 -12982 9690 14637 -8010 -15910 5347 15714 -3894 -16676 731 16324 650
1600 650 -16755 -3061 16074 5860 -14587 -6961 14700 10107 -12396 -10798 11483 12811 -9679
1613 -9679 -14201 6702 14240 -5665 -16110 2856 15364 -1560 -16075 -1279 15976 3467
1625 3467 -15093 -4940 15022 7540 -13140 -8813 13045 10959 -10666 -11771 9395 13447 -7768
1638 -7768 -14614 5172 14655 -3842 -15736 1852 15674 534 -15391 -2767 14970 4928
1650 4928 -14209 -6793 13414 8460 -12218 -10408 10394 11368 -9590 -12985 7149 13696 -5223
1663 -5223 -14238 3437 14874 -1271 -14708 -331 14988 3044 -14053 -4070 13706 6801 -12674
1676 -12674 -8251 11651 9461 -10561 -10789 8905 11897 -7670 -13516 4995 13504 -3837 -14686
1689 -14686 1532 14333 4 -14444 -1980 14156 4322 -13258 -5748 13264 8098 -11081
1701 -11081 -9026 10403 10617 -8150 -11281 7151 12395 -5414 -13307 3228 13437 -1770 -14121
1714 -14121 -602 13480 1942 -13664 -4117 12851 5716 -11964 -7313 10904 8954 -9800 -10181
1727 -10181 8484 10957 -7192 -12338 5219 12872 -3703 -13241 2222 13797 -4 -13211 -1143
1740 -1143 13578 4076 -12338 -4836 12284 6939 -10857 -8401 9505 9028 -8576 -10892 6510
1753 6510 10648 -6011 -12982 3103 12448 -2254 -13026 -8 12988 1788 -12037 -3058 12507
1766 12507 5582 -11230 -6156 10406 8082 -8944 -9029 7966 10184 -6848 -10981 5119 11563 -3901
1780 -3901 -12037 2180 12501 -507 -12394 -1245 12307 2587 -11744 -4745 10526 5349 -10469
1793 -10469 -7806 9171 8415 -7572 -9470 6773 10822 -5243 -11109 3570 11926 -1826 -11575
1806 -11575 459 12264 1759 -11502 -2517 11066 4448 -10360 -5868 9672 6881 -8728 -8666
1819 -8666 7518 9219 -6252 -10435 4841 10175 -3829 -11557 1710 11150 -743 -11529 -1163
1832 -1163 11314 2820 -10681 -3711 10275 5474 -9493 -6385 9009 7767 -7372 -8688 6413
1845 6413 9673 -4840 -10480 3540 10538 -2088 -11084 180 10983 692 -10715 -2422 10438
1858 10438 4055 -9636 -4860 8930 6206 -8407 -7490 7164 8150 -6030 -9249 4871 9640 -3236
1872 -3236 -10200 2132 10402 -721 -10202 -690 10320 2271 -9692 -3216 9710 4925 -8902
1885 -8902 -6023 8084 6872 -7246 -8131 5513 8426 -4814 -9515 3116 9643 -2071 -9803 856
1899 856 10219 977 -9640 -1862 9938 3710 -8895 -4565 8396 5654 -7480 -6687 6425 7221
1913 7221 -5378 -8469 4708 8647 -3382 -8991 2009 9531 -891 -9618 -640 9904 1523
1926 1523 -9267 -2872 8844 4060 -8371 -5377 7185 6352 -6675 -7030 5734 7802 -4370 -8455
1940 -8455 3430 8938 -2132 -8627 1328 9385 105 -9051 -1518 8666 2947 -8706 -4114 7962
1954 7962 4921 -7179 -5894 6209 6673 -5428 -7777 4413 8078 -3038 -8340 2087 8425 -952
1968 -952 -8589 -197 8954 1507 -8228 -2341 8296 3832 -7344 -4569 6730 5406 -6092 -6445
1982 -6445 5039 6908 -4468 -7603 3133 7845 -2068 -8116 1012 8417 -6 -8178 -1039 8219
1996 8219 2302 -7428 -3455 7046 4502 -6550 -5269 5782 5748 -5091 -6811 3909 7091 -3259
2010 -3259 -7345 2417 7894 -815 -7616 450 7937 1286 -7729 -1891 7348 3051 -7284 -3968 6112
2025 6112 4573 -5861 -5598 5033 6296 -4252 -6545 3169 7232 -1956 -7231 1394 7483 16
2039 16 -7437 -814 7446 2019 -7336 -2756 6376 3719 -6086 -4546 5728 5322 -4773 -5788 4096
2054 4096 6395 -2958 -6457 2109 7089 -1277 -7163 392 6865 734 -6951 -1763 6514 2382 -6647
2069 -6647 -3434 5950 3987 -5390 -4755 4712 5378 -4230 -5932 3220 6445 -2168 -6442 1263 6967
2084 6967 -494 -6535 -435 6666 1108 -6418 -2498 5963 3364 -5665 -3764 5233 4252 -4621 -5038
2099 -5038 3820 5459 -3208 -6316 2039 6050 -1236 -6393 443 6522 147 -6167 -1172 6384 1940
2114 1940 -5841 -2536 5304 3482 -5007 -4001 4573 4998 -3934 -4967 3110 5547 -2516 -5869 1561
2129 1561 6045 -846 -6112 -24 6261 1063 -6287 -1966 5651 2202 -5442 -3599 4960 4144 -4423
2144 -4423 -4410 3813 4871 -2892 -5361 2508 5715 -1453 -5662 945 6033 -139 -5995 -790 5653
2159 5653 1350 -5367 -2213 5065 2588 -4834 -3806 4240 4183 -4044 -4654 3137 4784 -2280 -5399 1673
2175 1673 5521 -751 -5527 174 5656 689 -5487 -1450 5503 2020 -5143 -2528 4723 3350 -3832
2190 -3832 -4000 3784 4349 -2893 -4897 2293 5172 -1610 -5215 685 5100 -331 -5372 -462 5364
2205 5364 980 -5035 -2035 4785 2635 -4568 -3075 4075 3487 -3361 -4002 3075 4506 -2054 -4283
2220 -4283 1929 5064 -1369 -5112 451 4961 -6 -5191 -1159 5038 1636 -4829 -2175 4150 2975
2235 2975 -3804 -3662 3510 4117 -2795 -3983 2297 4602 -1854 -4668 796 4394 -361 -5010 -245
2250 -245 4591 611 -4701 -1341 4353 2082 -3799 -2585 3868 3104 -3190 -3550 2928 3953 -2224 -4225
2266 -4225 2005 4275 -1447 -4508 651 4543 -51 -4760 -887 4301 1109 -4218 -1910 4365 2182
2281 2182 -3552 -2708 3428 3321 -2617 -3507 2359 4117 -1894 -4056 1148 4256 -842 -4347 -58 4343
2297 4343 542 -4283 -1024 3805 1602 -3669 -1980 3521 2429 -3208 -2987 2896 3363 -2549 -3808
2312 -3808 1890 3992 -1418 -3993 692 3986 -499 -3994 -240 4099 1148 -3906 -1382 3510 1808
2327 1808 -3861 -2216 3214 2805 -2819 -3163 2434 3344 -2038 -3734 1092 3652 -996 -4098 398 3625
2343 3625 -19 -3739 -811 3819 1173 -3578 -1554 3527 1988 -3108 -2555 2803 2887 -2044 -2997 2039
2359 2039 3273 -1513 -3689 850 3422 -581 -3765 49 3541 575 -3583 -722 3789 1235 -3401
2374 -3401 -1919 3055 2167 -2868 -2640 2113 2621 -1777 -3129 1656 3424 -918 -3436 685 3242 6
2390 6 -3456 -45 3517 877 -3436 -1141 3343 1537 -2630 -1808 2707 2178 -2333 -2345 2071 2817 -1744
2407 -1744 -2843 1420 3080 -845 -3319 350 3370 -210 -3200 -254 3015 805 -3208 -1260 3204
2422 3204 1440 -2592 -1671 2586 2366 -2166 -2635 1779 2909 -1461 -2940 977 3018 -419 -3327 42
2438 42 3064 268 -3080 -721 3164 997 -2672 -1315 2394 1541 -2452 -1909 2174 2379 -1884 -2515
2454 -2515 1692 2834 -1494 -2714 1002 3056 -420 -3074 71 3005 493 -2912 -875 2940 1192
2469 1192 -2599 -1433 2375 1644 -1744 -2239 1948 2501 -1605 -2687 1136 2791 -983 -2981 410 2993
2485 2993 -169 -2704 -21 2719 638 -2607 -905 2732 984 -2375 -1456 2443 1816 -1898 -1995 1887
2501 1887 2273 -1478 -2786 851 2586 -529 -2717 314 2593 305 -2519 -430 2714 899 -2516
2516 -2516 -1272 2475 1460 -2209 -1750 2026 1731 -1614 -2247 1540 2471 -943 -2475 447 2633 -380
2532 -380 -2626 102 2677 171 -2491 -556 2675 1226 -2464 -1184 1971 1469 -1769 -1916 1913 1919
2548 1919 -1500 -2148 1269 2545 -913 -2621 523 2617 -75 -2489 -204 2265 331 -2557 -967
2563 -967 2284 1246 -2201 -1358 1889 1539 -1742 -1605 1367 1704 -1091 -2114 1072 2283 -355 -2405
2579 -2405 296 2220 9 -2218 -268 2236 490 -2176 -608 2118 1128 -1952 -1413 1792 1677 -1559
2595 -1559 -1900 1528 1822 -824 -1993 948 2405 -299 -2107 310 2188 215 -2323 -702 2170
2610 2170 807 -2207 -936 1764 1160 -1691 -1510 1617 1512 -1288 -2045 1028 1748 -969 -1896 575
2626 575 2332 -123 -2030 -83 2278 477 -2068 -406 2073 701 -1606 -955 1781 1223 -1608 -1404
2642 -1404 1277 1678 -1265 -1796 688 1918 -494 -2225 197 1998 115 -1938 -161 2074 611
2657 611 -2014 -629 2033 928 -1681 -1124 1420 1278 -1101 -1369 1220 1907 -884 -1699 474 1848
2673 1848 -217 -1764 140 2004 -37 -1854 -105 1553 493 -1762 -684 1743 1061 -1565 -1305
2688 -1305 1435 1429 -1342 -1511 1038 1504 -674 -1733 503 1705 -504 -1828 -107 1926 14 -1768
2704 -1768 -448 1747 441 -1578 -845 1612 1054 -1336 -1477 1369 1399 -1208 -1793 1037 1617 -625 -1461
2721 -1461 176 1698 -294 -1709 -92 1687 496 -1494 -400 1554 721 -1531 -1043 1315 1403 -962
2737 -962 -1390 921 1457 -961 -1376 736 1430 -879 -1566 229 1576 -91 -1747 -245 1747 133
2753 133 -1714 -357 1555 642 -1423 -758 1327 770 -1143 -942 951 1265 -764 -1498 714 1726 -254
2770 -254 -1578 86 1485 -67 -1917 -148 1616 495 -1415 -683 1391 932 -1635 -1265 1107 1108 -1161
2787 -1161 -1074 920 1282 -521 -1525 541 1508 -269 -1534 23 1640 203 -1712 -176 1483 660
2803 660 -1213 -884 1287 828 -1175 -910 1248 1272 -1109 -1258 735 1146 -662 -1626 504 1472 -58
2820 -58 -1732 -389 1498 34 -1451 -325 1426 634 -1445 -740 1204 690 -1107 -1007 866 1293 -637
2837 -637 -1332 533 1400 -583 -1297 296 1306 56 -1526 -186 1634 550 -1327 -433 1325 701
2853 701 -1225 -793 1109 997 -1051 -1187 703 1288 -765 -1408 546 1087 -333 -1339 -1 1278 6
2870 6 -1312 -38 1491 369 -1239 -174 1453 743 -1360 -1103 1133 859 -854 -1182 568 1075 -471
2887 -471 -1395 191 1174 -421 -1169 -177 1308 90 -1201 -287 1339 586 -1216 -757 1202 863 -1068
2904 -1068 -801 770 1092 -529 -1187 512 1052 -673 -1432 44 1289 21 -1509 114 1453 261
2920 261 -1057 -478 1319 484 -1033 -1027 1291 574 -885 -823 496 1153 -635 -955 552 1012 -199 -1098
2938 -1098 338 1089 117 -927 -141 899 538 -1225 -594 1177 535 -769 -502 666 1029 -445 -1140
2955 -1140 750 1120 -583 -1176 564 962 -174 -1275 236 868 226 -1089 -115 906 349 -849 -554
2972 -554 1088 688 -901 -702 729 940 -802 -1007 584 800 -431 -913 326 1313 -270 -1225 153
2989 153 1162 36 -1293 -818 1258 420 -1090 -522 982 624 -496 -641 653 908 -469 -679 407
3006 407 1043 -270 -932 249 976 28 -1149 -163 1088 409 -1081 -508 973 711 -1013 -594 1012
3023 1012 420 -834 -973 546 801 -728 -864 515 798 -261 -995 133 923 -70 -956 -171 1131
3040 1131 207 -958 -630 839 508 -970 -776 742 552 -783 -612 626 718 -297 -900 312 1035
3057 1035 -139 -1351 286 929 -188 -1116 -334 984 163 -1039 -192 674 371 -710 -436 648 588
3074 588 -652 -773 490 740 -217 -874 426 948 -70 -889 -16 689 -133 -1043 -117 1059 141 -831
3092 -831 -599 907 368 -657 -559 611 528 -520 -856 483 949 -267 -1054 315 959 -179 -978 -19
3110 -19 726 41 -868 -137 846 532 -796 -315 767 616 -535 -585 531 656 -438 -625 560 694 -257
3129 -257 -590 426 1056 -196 -1213 26 731 -30 -806 -360 847 326 -799 -375 695 677 -911 -484
3147 -484 647 643 -320 -1056 377 736 -545 -867 297 603 -243 -931 -35 772 -169 -970 -227 827 11
3166 11 -934 -258 854 278 -738 -474 940 750 -476 -810 365 671 -429 -943 308 855 -17 -731
3184 -731 -259 756 368 -779 -227 628 278 -471 -604 853 668 -589 -904 660 798 -261 -612 316
3202 316 775 -252 -701 100 1010 107 -1152 -266 893 328 -771 -391 945 374 -630 -550 714 584
3220 584 -285 -603 693 852 -561 -817 363 962 -208 -1108 62 919 -203 -962 -123 902 248 -797
3238 -797 98 998 566 -980 -741 709 754 -477 -605 343 586 -724 -597 255 559 -231 -938 169 919
3257 919 73 -753 -84 971 180 -932 -624 722 627 -780 -570 657 749 -568 -775 423 668 -341
3275 -341 -717 159 1028 -135 -1071 -36 853 146 -906 -299 1040 344 -868 -440 558 402 -571 -493 757
3294 757 691 -787 -1071 706 750 -175 -1072 188 869 -186 -903 120 1026 -119 -1054 -229 835 226
3312 226 -962 -608 501 691 -644 -577 690 472 -565 -959 448 696 -492 -818 224 1108 -365
3329 -365 -711 215 735 259 -717 -305 873 323 -967 -596 584 469 -707 -889 475 851 -385 -926
3347 -926 464 761 -589 -948 280 1173 -85 -1073 315 896 -22 -966 -307 670 513 -900 -378 785
3365 785 767 -759 -484 609 649 -491 -702 362 987 -215 -1067 426 881 -8 -941 28 1176 367
3383 367 -719 -284 855 418 -912 -996 808 660 -857 -776 350 730 -618 -692 328 1045 -202 -880
3401 -880 271 1221 194 -928 -335 925 513 -732 -596 728 681 -1025 -522 743 993 -789 -791 726
3419 726 989 -302 -1199 624 1084 -247 -921 -203 880 204 -1195 -75 881 368 -1002 -616 850
3436 850 669 -927 -702 858 994 -764 -973 604 1208 -183 -907 331 1012 70 -1182 109 885
3453 885 577 -970 -198 1119 491 -910 -712 1256 822 -782 -861 759 863 -837 -1176 129 1005 -413
3471 -413 -1103 101 1026 -96 -1409 -219 1137 375 -1144 -733 1131 580 -1082 -677 1079 755 -835
3488 -835 -871 903 939 -624 -1119 378 1217 -116 -1011 95 1516 -122 -1059 -544 1236 443 -830 -442
3506 -442 805 495 -1216 -939 824 642 -994 -1114 661 842 -522 -1161 176 1103 -178 -1233 26
3523 26 1267 341 -1443 -308 977 832 -1209 -626 1058 902 -982 -1254 814 826 -627 -1129 551
3540 551 1289 -501 -1090 123 1010 138 -1093 -350 1222 187 -1322 -330 1478 496 -1149 -803 956
3557 956 1024 -604 -865 640 1437 -630 -1316 433 1207 -373 -1277 -109 1508 125 -1262 -95 1243
3574 1243 566 -1417 -628 1258 735 -1238 -990 987 1249 -679 -1106 358 1592 -607 -1246 218 1642
3591 1642 -35 -1453 -62 1435 -81 -1031 -280 1425 538 -1089 -623 1274 970 -1106 -1203 982 1283
3608 1283 -746 -1323 551 1226 -191 -1566 -56 1266 41 -1570 -442 1222 427 -1412 -358 1357
3624 1357 913 -1387 -860 1126 1041 -680 -1456 643 1189 -838 -1206 433 1251 -68 -1339 45 1303
3641 1303 597 -1635 -472 1193 204 -1083 -829 1095 1016 -1264 -984 978 1037 -690 -1111 503 1375
3658 1375 -460 -1653 398 1455 -24 -1360 51 1348 376 -1421 -694 987 614 -1369 -912 1057
3674 1057 914 -976 -1168 869 1232 -671 -1372 592 1365 -242 -1480 227 1643 -77 -1436 -212
3690 -212 1628 443 -1403 -627 1640 1028 -1105 -1162 1068 1242 -854 -1196 500 1561 -703 -1546 477
3707 477 1472 -202 -1502 194 1572 364 -1562 -490 1352 692 -1304 -932 1400 1145 -1253 -1454
3723 -1454 898 1278 -622 -1217 417 1370 -341 -1529 253 1720 3 -1551 -162 1876 245 -1488
3739 -1488 -641 1659 952 -1521 -950 1025 1143 -899 -1271 931 1532 -866 -1601 402 1423 -282 -1377
3756 -1377 91 1525 285 -1765 -328 1552 598 -1243 -609 990 853 -1220 -1160 1174 1290 -709
3772 -709 -1428 806 1361 -670 -1698 320 1475 81 -1759 -133 1646 504 -1644 -627 1408 667
3788 667 -1483 -849 992 1313 -1360 -1434 644 1493 -825 -1377 544 1663 -168 -1673 219 1701 -49
3805 -49 -1684 -389 1812 413 -1771 -565 1417 1020 -1225 -1142 1041 1150 -863 -1482 922 1449 -377
3822 -377 -2095 148 1925 57 -1687 -49 1617 435 -1450 -323 1562 531 -1416 -1235 1201
3837 1201 980 -1154 -1157 867 1398 -858 -1334 755 1671 -204 -1798 221 1677 -3 -1729 -237 1678
3854 1678 615 -1574 -546 1499 928 -1340 -1223 1123 1365 -1244 -1571 621 1509 -532 -1618 416
3870 416 1826 -108 -1751 -100 1657 219 -1653 -618 1691 1015 -1502 -1155 1233 943 -1227 -1646
3886 -1646 894 1495 -539 -1664 756 1926 -444 -1652 129 1725 129 -1724 -133 1773 636
3901 636 -1509 -707 1345 850 -1663 -1255 1352 1348 -1144 -1532 915 1878 -519 -1543 474 1815 -67
3918 -67 -1596 34 1748 229 -1808 -478 1658 975 -1818 -969 1383 1220 -1317 -1355 1007 1389 -665
3935 -665 -1586 502 1655 -518 -1590 306 1858 206 -1894 -592 1920 427 -1621 -802 1349 1051
3951 1051 -1282 -1320 1237 1276 -1029 -1818 822 1550 -770 -1751 519 1804 -81 -1894 -130 2006 260
3968 260 -1891 -421 1854 599 -1497 -1048 1330 966 -1368 -1274 934 1326 -959 -1516 909 1553 -500
3985 -500 -1547 216 1692 133 -1748 -429 1699 268 -1698 -852 1204 1038 -1554 -1373 1478 1423
4001 1423 -1047 -1388 1034 1540 -911 -1792 651 1801 87 -1641 -35 2023 172 -1844 -472 1623
4017 1623 930 -1150 -934 1169 1301 -1529 -1276 1085 1341 -671 -1628 623 1759 -537 -1657 610
4033 610 1818 -168 -1669 -88 1846 565 -1775 -645 1592 803 -1480 -1042 1331 1313 -790 -1566
4049 -1566 784 1843 -652 -1513 249 1646 -474 -1790 18 2069 152 -2172 -810 1696 777
4064 777 -1332 -721 1252 1229 -1503 -1232 1187 1492 -863 -1656 742 1599 -268 -1947 291 1740 100
4081 100 -2040 35 1816 498 -1762 -738 1388 832 -1258 -1054 1480 1213 -999 -1499 801 1718
4097 1718 -663 -1844 433 1800 -282 -1543 24 1671 190 -1918 -446 1543 566 -1428 -991
4112 -991 1663 1046 -1294 -1164 1252 1353 -759 -1693 641 1626 -795 -1559 434 1630 -69 -1822 -192
4129 -192 1578 739 -1558 -478 1397 838 -1409 -1309 1582 1229 -909 -1448 755 1674 -572 -1542 316
4146 316 1846 -166 -1619 -149 1716 135 -1878 -343 1741 560 -1565 -905 1495 1197 -1172 -1359
4162 -1359 1154 1459 -1032 -1374 899 1709 -531 -1735 204 1693 -288 -1601 -251 1775 304 -1705
4178 -1705 -732 1297 1006 -1410 -851 1431 1371 -1002 -1476 895 1627 -514 -1492 372 1734 69 -1714
4195 -1714 3 1750 85 -1679 -492 1562 800 -1532 -1125 1303 1102 -1427 -1300 1173 1530 -1005
4211 -1005 -1697 647 1808 -353 -1776 -99 1935 -26 -1829 -392 1606 344 -1816 -638 1509
4226 1509 918 -1373 -694 1252 1376 -1258 -1403 940 1481 -966 -1620 664 1826 1 -1862 -214
4242 -214 1589 199 -1578 -222 1564 681 -1594 -891 1469 1145 -1073 -1336 1503 1754 -829 -1313 483
4259 483 1563 -368 -1657 313 1967 178 -1967 -169 1532 506 -1737 -654 1411 911 -1447
4274 -1447 -1147 1313 1113 -1336 -1450 889 1661 -786 -1737 666 1571 -152 -1830 -158 1669 248
4290 248 -1756 -567 1700 890 -1520 -963 1551 1116 -1420 -1386 1017 1263 -1072 -1627 693 1721 -697
4307 -697 -1647 258 1794 157 -1965 -340 1664 578 -1731 -605 1591 965 -1648 -837 1378 1397
4323 1397 -963 -1657 916 1432 -691 -1628 617 1684 -423 -1629 170 1683 370 -1706 -481 1681
4339 1681 843 -1633 -845 1480 1096 -1550 -1082 969 1116 -1098 -1494 851 1475 -549 -1583 270 1723
4356 1723 -134 -1877 -144 1550 486 -1548 -812 1735 918 -1123 -994 1211 1237 -1131 -1215 1132 1323
4373 1323 -573 -1673 504 1823 -128 -1611 -16 1752 324 -1754 -457 1699 804 -1537 -922
4388 -922 1329 1105 -1181 -901 1320 1728 -1070 -1430 733 1851 -407 -1760 192 1748 -199 -1943
4404 -1943 -306 1799 562 -1744 -688 1465 1017 -1427 -1100 1214 1366 -1157 -1181 1122 1448 -958
4420 -958 -1653 537 1622 -545 -1852 230 1953 302 -1787 -611 1733 743 -1716 -883 1350 900
4436 900 -1518 -1242 1285 1355 -1328 -1444 449 1456 -661 -1567 465 1845 -132 -1754 -53 1755
4452 1755 576 -1883 -487 1661 630 -1693 -940 1618 1096 -1247 -1486 1191 1483 -899 -1310 859
4468 859 2064 -194 -1639 177 1763 294 -1683 -303 1747 661 -1966 -833 1688 870 -1307
4483 -1307 -1293 993 1491 -909 -1318 739 1416 -420 -1694 356 1757 -71 -1829 -146 1629 510
4499 510 -1832 -569 1937 788 -1519 -957 1394 1208 -1492 -1343 1180 1592 -885 -1712 609 1607 -606
4516 -606 -1751 52 1807 8 -1710 -234 1586 600 -1784 -829 1304 997 -1345 -1389 957 1086 -1239
4533 -1239 -1464 786 1646 -492 -1709 498 1575 -234 -1799 -275 1892 330 -1476 -599 1620 589
4549 589 -1684 -544 1339 1113 -1508 -1118 1227 1454 -835 -1455 708 1578 -339 -1542 114 1872
4565 1872 59 -1713 -329 1867 455 -1487 -386 1559 1143 -1484 -1299 1353 1477 -1275 -1246 766
4581 766 1385 -769 -1576 435 1826 -217 -1863 -260 1877 370 -1822 -518 1779 616 -1589 -734
4597 -734 1384 1027 -1606 -1411 1232 1411 -957 -1652 766 1806 -689 -1740 283 1988 88 -1763
4613 -1763 -188 1755 564 -1499 -657 1758 1130 -1343 -1125 1499 1361 -1143 -1348 640 1828 -789
4629 -789 -1609 694 1741 -138 -1900 -124 1825 60 -1703 -545 1672 920 -1429 -1074 1695 1044
4645 1044 -1419 -1435 1109 1508 -1075 -1459 594 1767 -504 -1621 233 1778 375 -2032 -85 1931
4661 1931 198 -1859 -567 1691 843 -1222 -1137 1199 1383 -1047 -1379 1308 1620 -927 -1626 357 1707
4678 1707 -379 -1654 83 1970 100 -1917 -409 1734 642 -1811 -1086 1425 1141 -1189 -1252 1013
4694 1013 1477 -920 -1653 564 1504 -502 -1809 378 1772 101 -1714 -352 1457 640 -1785 -697
4710 -697 1752 1127 -1720 -951 1668 1211 -866 -1458 861 1650 -981 -1704 504 1837 -401 -1700 18
4727 18 1771 32 -1866 -431 1719 861 -1888 -778 1460 1148 -1068 -1017 1014 1397 -896 -1292 921
4744 921 1719 -776 -1695 529 1704 -88 -1981 -70 1805 421 -1861 -579 1440 785 -1613 -932
4760 -932 1460 1362 -1487 -1392 1118 1382 -793 -1724 537 1962 -256 -1707 -114 1799 28 -1834 -101
4777 -101 1741 744 -1730 -454 1245 1082 -1139 -1097 1311 1299 -1080 -1382 763 1824 -653 -1734 459
4794 459 1679 -317 -1437 80 1669 132 -1669 -659 1631 920 -1509 -912 1201 1316 -1401 -1656
4810 -1656 1001 1511 -876 -1534 768 1730 -538 -2066 150 1688 -1 -1580 -191 1771 350 -1951
4826 -1951 -693 1517 848 -1327 -1384 1320 1213 -1090 -1566 896 1848 -898 -1973 325 1837 34
4842 34 -2001 -385 1629 44 -1282 -562 1848 937 -1513 -865 1316 1440 -1498 -1408 1287 1402 -1068
4859 -1068 -1697 831 1533 -739 -2002 207 1727 148 -1802 -325 1694 582 -1764 -844 1810 745
4875 745 -1564 -1298 1390 1336 -1149 -1531 905 1397 -817 -1670 452 1618 -517 -1613 178 1809 278
4892 278 -1639 -507 1760 944 -1260 -1374 1299 1053 -1285 -1310 1382 1665 -932 -1621 697 1693 -447
4909 -447 -1803 237 1938 -60 -1670 -290 1713 538 -1641 -684 1519 848 -1407 -1261 1506 1171
4925 1171 -1232 -1327 656 1524 -748 -1631 432 1735 -297 -1782 -116 1499 93 -1498 -458 1768
4941 1768 639 -1516 -720 1129 939 -1142 -1259 1195 1447 -1081 -1752 649 1631 -518 -1636 173
4957 173 1622 -112 -1584 19 1492 383 -1623 -541 1556 513 -1740 -1099 1451 1124 -1240 -1290
4973 -1290 923 1427 -605 -1627 443 1339 -337 -2005 -18 1701 37 -1804 -343 1563 695 -1415
4989 -1415 -772 1460 1147 -1458 -1473 1086 1307 -971 -1675 999 1531 -554 -1608 97 1708 232 -1653
5006 -1653 132 1503 209 -1735 -581 1566 955 -1266 -1043 1523 1341 -1297 -1430 1167 1688 -731
5022 -731 -1735 810 1369 -335 -1693 150 1513 306 -1757 -512 1545 624 -1379 -806 1521 1091
5038 1091 -1280 -1181 1210 1208 -1196 -1461 957 1659 -676 -1414 154 1578 -206 -1532 -179 1643 83
5055 83 -1692 -472 1529 670 -1401 -958 1139 1043 -1104 -999 1089 1355 -968 -1277 698 1570 -399
5072 -399 -1561 402 1718 220 -1652 -264 1598 286 -1578 -729 1418 682 -1488 -1243 1355 1271
5088 1271 -1021 -1093 916 1497 -514 -1688 210 1542 -228 -1546 -151 1610 330 -1904 -422 1721
5104 1721 673 -1276 -944 1251 863 -1272 -1056 1092 1573 -776 -1467 727 1390 -625 -1532 306 1744
5121 1744 -108 -1582 -213 1738 394 -1672 -774 1623 512 -1341 -712 828 1188 -1098 -1516 488
5137 488 1511 -743 -1672 762 1520 -278 -1346 108 1820 136 -1467 -347 1608 18 -1467 -784
5153 -784 1092 1098 -1422 -1165 1179 1429 -806 -1620 507 1152 -458 -1487 145 1636 81 -1539 -227
5170 -227 1677 395 -1199 -434 1354 827 -1404 -929 1176 847 -896 -1288 712 1221 -530 -1630 369
5187 369 1597 -156 -1754 54 1592 103 -1472 -170 1508 593 -1227 -763 1259 833 -1043 -795
5203 -795 1149 1211 -972 -1358 615 1663 -488 -1572 482 1458 -57 -1524 9 1676 259 -1193
5219 -1193 -458 1370 501 -1331 -1071 1347 1143 -1136 -1094 953 1301 -680 -1150 257 1218 -301 -1414
5236 -1414 -23 1548 -150 -1601 -468 1436 20 -1476 -315 1349 958 -1021 -1060 817 1087 -689
5252 -689 -1078 546 1667 -465 -1290 316 1633 6 -1661 -46 1371 286 -1468 -827 1167 776
5268 776 -1329 -977 1425 984 -1010 -997 741 1256 -611 -1397 678 1397 -337 -1350 59 1335 -23
5285 -23 -1765 -179 1446 545 -1280 -616 1331 755 -1053 -691 1096 1148 -703 -1069 894 1170 -455
5302 -455 -1362 588 1341 -233 -1394 -201 1442 -39 -1403 -313 1467 419 -1016 -625 1276 739
5318 739 -1006 -804 731 870 -796 -1180 505 1356 -649 -1351 252 1300 122 -1395 -327 1404
5334 1404 420 -1339 -649 1358 804 -1143 -950 1029 1148 -976 -969 753 1218 -495 -1213 473 1177 -441
5352 -441 -1467 99 1494 244 -1340 -178 1406 546 -1226 -585 1435 1000 -1063 -1017 967 1228 -438
5369 -438 -1264 571 1138 -583 -1339 533 1316 195 -1201 -12 1422 508 -1283 -542 1315 657 -1028
5386 -1028 -604 1304 710 -963 -1091 880 939 -498 -1260 518 1264 -497 -1019 75 1464 142 -1208
5403 -1208 -76 1359 504 -966 -850 1148 814 -1074 -747 820 870 -850 -663 503 1271 -533 -1253
5420 -1253 165 1424 -271 -1382 114 1363 100 -1269 -327 1170 306 -1038 -801 848 443 -933
5436 -933 -1126 800 926 -636 -951 369 981 -297 -1296 229 1112 -257 -1356 -319 1202 431 -1136
5453 -1136 -514 1338 490 -865 -784 808 931 -942 -1139 568 1231 -522 -1217 142 1175 -260 -1273
5470 -1273 66 1225 153 -1071 -341 1226 543 -1073 -652 961 607 -1076 -771 559 1012 -626
5486 -626 -931 823 1248 -716 -841 109 743 -203 -1029 -217 1447 424 -1154 -412 1011 294 -763 -557
5504 -557 812 607 -776 -831 638 1059 -448 -1154 310 1099 -37 -1161 89 1348 169 -991 -258
5521 -258 1131 306 -1364 -564 1097 608 -849 -783 634 1003 -695 -916 576 938 -487 -1151 252
5538 252 991 -247 -1034 -23 1117 522 -1117 -488 968 725 -873 -632 1004 669 -813 -853 741
5555 741 1039 -550 -1071 381 1039 -144 -1417 4 1243 22 -1315 -313 1131 427 -933 -603
5571 -603 776 873 -749 -786 829 927 -662 -969 548 1146 -492 -1001 198 1236 164 -1165 74
5588 74 1179 91 -1035 -129 946 561 -746 -601 756 738 -764 -730 642 1071 -247 -1045 260 1216
5606 1216 -356 -793 69 853 231 -1002 -73 1126 233 -1145 -255 850 623 -1005 -481 907 696
5623 696 -398 -989 812 946 -446 -1194 501 949 -56 -1205 -65 1229 97 -1117 -443 1141
5639 1141 150 -969 -312 914 397 -906 -674 582 887 -441 -937 511 912 -497 -1118 127 918
5656 918 -212 -1077 -39 904 329 -881 -354 740 511 -1038 -537 638 704 -792 -816 564 878 -318
5674 -318 -811 426 737 11 -942 -168 800 25 -1050 -208 844 118 -730 -368 915 519 -814 -700
5692 -700 499 583 -414 -718 485 806 -309 -1063 378 778 215 -755 1 708 182 -1022 -422 960
5710 960 375 -727 -725 598 615 -567 -731 510 415 -472 -860 77 781 -236 -829 191 977 30 -794
5729 -794 30 936 -53 -631 -420 906 618 -539 -830 440 587 -609 -411 246 978 -335 -827 36
5747 36 1128 -112 -662 -151 697 -129 -711 -242 605 521 -669 -337 564 247 -242 -654 421 674 -254
5766 -254 -791 601 785 -319 -810 -99 873 3 -933 -41 994 213 -617 -351 988 377 -549 -616 490
5785 490 685 -394 -519 483 719 -104 -770 5 965 -90 -974 -14 817 161 -974 -264 593 327 -878
5804 -878 -403 589 401 -250 -416 553 893 -246 -976 505 591 -359 -699 250 733 36 -859 -330 764
5823 764 -35 -763 -252 602 429 -683 -709 478 362 -717 -698 652 471 -607 -496 252 812 -140 -653
5842 -653 15 654 80 -523 9 584 323 -738 -433 629 561 -867 -324 698 420 -312 -383 2 676
5861 676 -338 -647 432 889 -126 -759 -260 789 54 -697 -318 602 473 -765 -126 218 658 -393
5879 -393 -380 425 459 -169 -577 -136 543 49 -618 213 617 62 -405 -76 413 -50 -659 -357 559 48 -579
5900 -579 -140 440 306 -637 -441 321 588 23 -763 77 636 -129 -885 94 502 -54 -702 -163 540 94
5920 94 -646 -335 714 178 -422 -245 384 619 -428 -688 -4 655 -32 -799 96 651 -5 -603 -82 437
5940 437 -109 -614 6 675 418 -356 -578 310 257 -297 -490 272 542 -211 -536 -54 800 -380 -610 -51
5960 -51 627 220 -715 -70 641 4 -465 -340 375 542 -369 -226 421 639 -283 -571 476 568 -203 -333
5980 -333 59 629 -195 -624 35 638 -44 -461 -171 560 -45 -541 -322 285 349 -373 -419 89 151 -106 -594
6001 -594 255 581 37 -754 233 676 -183 -372 137 631 245 -320 -343 436 3 -273 -464 685 555 -425
6021 -425 -273 208 390 -118 -341 213 328 -422 -293 164 446 135 -347 -231 486 237 -418 -281 452 257
6041 257 -492 -229 433 340 -264 -405 12 532 -98 -366 3 625 98 -281 183 367 186 -380 -175 562
6061 562 448 -176 -567 162 443 -219 -439 99 293 -255 -306 142 708 -164 -700 98 543 81 -426 91
6081 91 300 279 -249 -98 176 237 -313 60 243 393 -205 -584 236 275 -145 -499 -67 344 -139 -263 -47
6102 -47 417 380 -664 16 320 7 -401 -65 463 83 -497 -439 376 569 -353 -259 153 191 -267 -164 82
6123 82 246 -30 -509 -128 544 252 -389 215 258 256 -221 -135 96 537 -238 -249 202 274 -162 -289 243 340 100
6146 100 -384 391 407 414 -285 0 370 15 -461 -445 301 134 -197 -28 294 330 -21 -368 295 94 -79 -207
6168 -207 -13 336 -291 -803 163 462 149 -736 -97 201 272 -149 -104 193 460 -512 -104 181 300 -345 -523
6189 -523 331 304 -234 -134 159 164 42 -326 191 242 181 -284 -14 531 125 -142 65 274 131 -374 -77 172
6211 172 17 -142 -316 -13 324 5 -281 47 458 7 -172 -67 420 -7 -478 -104 81 215 -176 47
6231 47 67 462 -274 -132 164 206 10 -216 69 206 98 -234 190 419 -88 -404 -196 219 104 -261 114
6252 114 372 -208 -206 -232 -32 230 -157 -8 265 16 -92 -93 142 383 -147 -108 17 315 -8 -445 -100 128
6274 128 52 -301 -324 110 248 -383 -125 90 232 89 -11 -184 447 248 -199 142 150 244 -142 -83 191 44
6296 44 -50 -24 299 -124 70 -138 -98 318 12 -359 169 11 -151 36 390 108 46 -286 268 40 -131 -362
6318 -362 58 380 -132 -329 -362 409 -53 53 82 -73 -28 59 -152 93 196 -232 147 135 198 -184 -216 277
6340 277 175 -126 65 -58 520 32 -300 -232 329 96 -139 103 352 201 -293 -38 361 199 -297 -84
6360 -84 111 -65 -218 -187 99 249 21 -242 -121 271 103 107 22 190 523 -202 -171 -3 322 -256 -61 -170
6382 -170 193 -143 -314 -32 297 -164 -142 121 155 -237 -305 337 227 66 15 -26 9 48 -254 -361 289 81
6404 81 -121 189 -42 313 105 -68 292 435 115 -138 -243 281 -217 36 66 -64 -5 -218 -456 162 238
6425 238 -188 268 102 2 -202 -84 216 270 -5 -212 217 281 -10 -173 81 87 48 -100 8 229 -39 -337
6447 -337 10 149 75 -385 -62 254 117 13 -246 269 292 -89 47 -44 182 121 3 106 39 -30 79 -6
6469 -6 317 407 -252 -72 376 -76 -221 -31 257 -4 -108 -25 -82 -11 -99 -195 192 300 85 -265 10 467 170
6492 170 -45 -115 72 -137 -338 -254 92 368 -182 -109 236 193 -83 17 44 83 -167 -273 141 239 65 -200
6514 -200 -115 54 -145 -286 41 106 247 -339 -280 81 44 268 -196 203 33 -197 -23 -16 80 -218 -275 -60 253
6537 253 10 -186 -124 244 107 -213 -38 27 233 -171 -4 186 32 28 -216 268 45 -261 -316 10 124 -153
6559 -153 -110 149 239 -61 62 -130 170 -71 17 98 -115 186 -181 -285 71 444 -407 -86 74 82 255 -212
6581 -212 79 381 132 -305 -115 342 -134 -67 -50 158 26 -63 92 46 -187 -136 -219 130 228 -243 -174 -24 -2
6604 -2 -12 -359 -13 40 -74 -217 -109 397 194 68 -299 580 -123 -424 -160 294 92 -182 -111 35 433 97
6626 97 -45 -37 156 -157 -145 -63 326 130 -184 -179 191 -83 -89 350 440 -84 -118 -111 56 306 -159 -255 227 380 -395
6651 -395 -130 -155 96 110 -271 179 472 -125 -268 107 371 94 -60 -45 201 -80 -143 -209 462 147 -97 -94
6673 -94 -165 147 -116 -207 140 236 -215 -3 26 246 15 -153 33 435 176 -137 42 425 179 -114 -359 305
6695 305 67 -48 -331 -39 174 -70 -212 -207 363 -201 -410 6 417 14 -430 -143 145 -27 -186 439 -3
6716 -3 290 -266 -238 8 322 -193 46 129 114 -143 -469 175 316 -44 -231 220 241 -51 -200 75 300 -13
6738 -13 -398 179 -71 111 -288 -9 -3 -100 -274 -215 114 14 8 -204 81 190 -39 -463 75 271 40 -428
6760 -428 -221 247 232 -177 19 234 224 -38 -228 253 290 -73 -261 -161 107 -168 -258 245 402 -43 -244
6781 -244 -365 -31 196 -221 134 203 220 -150 -330 174 172 -196 -473 -151 185 -63 -279 33 329 -93 -447
6802 -447 94 238 207 -245 -45 208 204 -425 -229 117 201 -262 -143 -111 33 -150 -471 127 444 61 -240 327
6824 327 132 -65 -103 170 249 94 -270 5 284 29 107 -150 261 122 -101 -251 46 371 -215 -314 63
6845 63 348 -115 -113 395 184 162 -346 -224 145 102 -265 -33 164 242 -441 -361 253 59 -272 -349 36 259 101
6868 101 -426 -22 254 -66 -158 51 203 -76 -486 -151 164 324 -20 -285 222 173 -154 -304 49 167 73
6889 73 -286 64 -19 -274 -327 82 420 -98 -140 -134 334 184 -27 -265 188 138 -165 -296 269 207 -399 -64 102
6912 102 299 287 -134 94 162 45 -429 -187 299 41 -297 130 185 227 -85 -44 296 123 -189 -139 292 150
6934 150 -44 -247 244 171 -204 -163 30 425 -43 -354 33 319 95 -234 -57 336 266 -256 -362 281 44
6955 44 -365 -91 54 53 41 -271 -2 299 61 -192 -117 221 -178 -183 -14 251 299 -274 -216 136 127 -92 -15 281
6979 281 -27 -367 -176 -23 -7 -336 -119 8 247 -130 -464 163 166 284 -17 162 -3 100 3 -353 277
7000 277 361 -155 -271 369 229 -238 -72 -2 188 10 -354 104 214 176 -326 -104 296 125 -98 -259 146
7021 146 278 -378 -361 19 159 -82 -442 122 249 -158 -175 298 344 -360 -365 15 406 -240 -537 -113 64 360
7043 360 -294 -365 329 149 -293 -208 350 182 -104 -253 198 214 -161 -177 35 318 -110 -383 -245 388 -349
7064 -349 -379 -361 52 197 -85 -68 30 201 -205 -167 1 379 -129 -693 80 121 99 -130 -72 462 -189 -513 241
7087 241 211 402 -165 -344 206 251 -235 -57 405 151 -220 -81 204 259 -34 -195 340 456 -106 -401 -21
7108 -21 359 185 -321 -406 311 43 -266 -111 -39 173 -92 -132 -21 60 -439 -324 133 221 194 -172 -85 111 40
7131 40 -154 87 275 2 -260 -139 272 317 -211 -337 42 260 -366 -441 82 33 -148 -200 155 395 159 -439
7153 -439 -182 154 260 -391 -117 106 129 -311 -257 -80 163 -128 -219 213 96 17 -565 4 282 262 -66 -134
7175 -134 237 181 -377 -205 180 -126 -61 101 90 184 -188 -60 313 255 40 -584 229 336 -310 -348 198 375
7197 375 140 -520 -101 129 -72 -423 -291 271 69 -246 -227 13 293 -95 -667 97 2 -23 -187 276 251
7218 251 -16 -133 47 284 -76 -354 147 167 -13 -467 -382 96 266 -120 -351 227 287 -135 -250 164 454
7239 454 -148 -359 354 209 -95 -185 4 36 -7 -205 -72 209 177 -228 -635 149 261 -33 -239 303 201
7260 201 -370 -269 135 243 -155 -357 -275 226 34 -115 -36 411 16 -126 82 122 378 -520 -324 245 267
7281 267 -308 -420 18 248 -138 -191 -43 237 -125 -344 -95 253 51 -729 -63 216 -80 -417 26 326
7301 326 247 -146 -314 22 313 -166 -199 73 253 53 -282 -28 507 -60 -124 -123 426 113 -364 -106 459 346
7323 346 -286 -132 180 275 -392 -276 5 207 -352 -288 232 132 44 -827 -286 374 45 -450 -166 306 -25
7344 -25 -275 -471 219 123 -603 -205 220 311 -166 -147 241 317 -69 -315 147 318 195 -321 -271 413 38 -142
7366 -142 -221 417 -119 -22 -177 187 70 -48 -117 430 416 -143 -312 62 356 73 -195 42 405 -202 -328
7387 -328 2 -33 60 -403 -135 407 129 -171 -452 409 -3 -296 -468 286 513 -9 -196 -25 339 -126 -232
7408 -232 94 296 99 -371 9 523 202 -284 -40 309 27 -315 -280 32 412 -202 -435 136 388 -95
7428 -95 -362 -294 328 -73 -74 151 184 -122 -528 -240 512 218 -516 -145 -148 216 -66 56 192 356 -109 -458
7450 -458 183 134 -62 -387 -121 291 -14 -471 65 351 330 -214 -290 122 -13 -422 -125 307 143 -600 -351
7471 -351 306 538 -70 -543 118 544 -25 -391 -73 411 423 -214 -228 280 18 -298 -16 187 300 -221 -109
7492 -109 140 397 -82 -319 -22 75 -317 -264 -206 121 -120 -480 131 467 181 -413 -441 233 304 -267 -227 237
7514 237 261 -456 -490 278 388 -240 -352 475 435 95 -323 -224 277 -60 -419 188 214 282 -329 -397 234 325 -368
7537 -368 -195 87 138 -245 -266 104 445 -113 -783 44 342 112 -254 -100 323 64 -447 -217 310 207 -551
7558 -551 -308 386 203 -521 -135 78 249 -147 -134 -65 430 -119 -486 -122 338 70 -605 -215 438 234 -405
7579 -405 -318 550 199 -328 -270 124 417 -287 -237 -151 160 -143 -364 24 147 60 -362 -195 -11 158 -491 -454
7601 -454 254 1 -638 -100 300 113 -289 -325 -29 409 -77 -286 204 507 124 -45 104 253 -157 -205 -316
7622 -316 289 145 -423 -82 660 239 -458 -119 195 393 -51 -159 260 214 166 -445 45 408 56 -292 -107
7643 -107 190 16 -489 67 506 0 24 -339 370 567 -283 -269 107 151 -139 -354 198 432 -76 -360 88
7664 88 301 39 -288 -196 389 286 -129 -508 325 241 -422 -99 40 238 -96 -218 367 534 -5 -415 44
7685 44 542 -186 -356 -43 254 75 5 -72 443 163 -449 -296 152 511 -294 -340 251 313 25 -373 76 358
7707 358 -28 -309 -199 209 127 -414 -326 285 104 -236 -356 196 172 -351 -422 255 382 -361 -341 -275 313 -236
7729 -236 -317 72 221 0 -366 -151 383 261 -407 -239 411 70 -267 -275 77 452 -349 -137 307 444 -68
7750 -68 -421 205 366 -342 -738 43 253 185 -480 -264 388 -61 -188 -256 384 564 -321 -483 118 408 -221
7771 -221 -86 228 180 58 -92 -81 435 179 -499 -114 373 131 -437 -53 408 455 -201 -235 354 443 -425 -315
7793 -315 196 317 -120 -240 -41 514 -67 -417 183 454 -4 -423 -223 597 73 -513 -84 316 395 -529
7813 -529 -193 98 140 -201 -271 354 494 -115 -78 136 597 -98 -239 -14 379 -39 -254 165 370 383 -303
7834 -303 -279 225 124 -312 -311 298 535 62 -239 158 50 -93 -432 -255 344 81 -635 -175 349 268 -251
7855 -251 -428 218 285 -178 -384 79 376 -147 -473 358 171 104 -534 89 352 -153 -343 -131 264 90 -357
7876 -357 6 236 291 -261 -108 28 223 -81 -380 56 246 -247 -185 -9 145 292 -488 266 164 205 -406
7897 -406 -69 353 226 -59 -275 389 362 -265 -313 195 204 -138 -530 346 580 -245 -439 73 354 -80 -71 47
7919 47 210 119 -128 -85 357 132 -511 -139 244 170 66 -600 391 305 -218 -119 225 23 78 -203 -99 456
7941 456 -153 -125 76 224 24 -514 -30 166 -64 -90 -146 431 359 -123 -433 322 163 -138 -528 -54 273
7962 273 -24 -422 24 314 -77 -423 -110 404 66 -493 24 420 497 -135 -67 383 287 -282 -253 167 132 -147
7984 -147 -329 30 400 243 -313 -178 266 132 -198 -322 543 59 -302 -517 130 374 -336 -125 130 368
8004 368 -181 -550 -178 364 128 -471 -22 396 -115 -738 -124 323 301 -212 33 45 367 -309 -686 506
8024 506 170 -54 -291 267 671 -107 -232 188 216 5 -278 -256 326 302 -347 -331 314 273 -156 -362 265 208
8046 208 -233 -307 71 480 -253 -392 447 333 -245 -385 -75 517 -128 -347 -95 429 -49 -407 61 223
8066 223 434 -297 -176 308 483 -282 -538 186 365 73 -59 97 539 86 -61 12 286 -11 -352 -227
8086 -227 363 323 -257 -503 346 220 -391 -51 -1 143 -251 -368 -112 191 145 -384 212 596 -107 -208 -146
8107 -146 533 300 -502 11 305 162 -243 -424 412 377 -81 142 -25 252 -306 -410 2 285 -149 -388
8127 -388 127 336 90 -334 -95 463 333 -318 -193 25 490 -285 -269 -93 175 -11 -431 -38 431 -39
8147 -39 -111 -201 160 261 -396 -116 287 234 -172 -63 238 127 36 -402 268 314 -21 -198 -118 176 51 -194
8169 -194 -183 459 -216 -176 -6 508 14 -281 89 338 345 -386 -304 334 323 -187 -144 173 498 -35 -517 167
8191A67
$$ Imaginary data points
##PAGE= N=2
##DATA TABLE= (X++(I..I)), XYDATA
0 0 0 0 0 0 0 0 0 0 1 -8 8 -8 16 -16 24 -29 32 -41 50 -64 73 -89 105 -123 145 -171 198 -227 261 -301 346
31 346 -393 447 -508 573 -645 721 -811 907 -1010 1124 -1251 1388 -1535 1697 -1876 2071
47 2071 -2282 2516 -2774 3052 -3362 3707 -4092 4522 -5005 5559 -6192 6928 -7797 8841
61 8841 -10121 11737 -13850 16738 -20949 27687 -40235 71634 -327334 -360894 236178 -58328
73 -58328 -330522 -53573 402090 139454 -279425 -102734 409461 301033 -165645 -138693
83 -138693 357209 379397 -93611 -235842 145038 209207 -241761 -427567 7861 278967
93 278967 -60519 -360726 -60805 270571 61687 -223358 37219 413528 225945 -213738
103 -213738 -153978 217059 158142 -258046 -288112 83886 134584 -243054 -333141 60487 247198
114 247198 -77957 -277532 41175 318319 85375 -184861 23209 308387 111208 -228768
124 -228768 -86234 296608 242713 -127765 -149335 147833 120294 -258964 -328734 42063 206761
135 206761 -75914 -218834 88726 299543 22467 -252864 -61493 185217 -15844 -303109
145 -303109 -116257 247943 164908 -176981 -137110 189522 167792 -169571 -177852 186607 265511
156 265511 -84505 -225168 82538 248729 -40111 -241402 22051 252507 9763 -260288
166 -260288 -57321 232985 57965 -269168 -149493 193059 143740 -160312 -109235 220466
176 220466 206032 -152589 -224445 92708 193020 -112618 -257721 14917 181355 -68619
186 -68619 -251189 5873 259663 73980 -177069 -13248 259480 128263 -173106 -103135
196 -103135 183856 138258 -154850 -138566 167433 193687 -128853 -241684 11867 117186
206 117186 -135650 -259155 13459 219668 21318 -174830 19519 252426 93399 -165856
216 -165856 -55418 203963 118103 -164004 -134612 130116 116392 -165914 -199050 81688 168077
227 168077 -79475 -183539 54108 187162 -35971 -200361 5520 213670 59839 -145855
237 -145855 -5342 221741 100715 -169702 -118990 125815 84923 -176990 -174689 92121 133549
248 133549 -116787 -177814 80543 193546 -32560 -163868 50914 209759 10827 -184186
258 -184186 -23421 184418 48165 -174470 -61598 183985 106754 -155560 -131805 109503
268 109503 98977 -151169 -169294 90311 162333 -65096 -149742 76587 197715 -10998 -165814
279 -165814 10409 176971 14920 -179492 -48592 159673 54980 -166325 -89542 147560
289 147560 110279 -124426 -119101 108301 122734 -110965 -160407 69304 159164 -45208 -149587
300 -149587 51751 189833 8217 -161663 -17525 155435 21221 -175810 -68771 147036
310 147036 76890 -140524 -95445 129807 118442 -104106 -123695 91383 133003 -82063 -157269
321 -157269 46254 153381 -27240 -151361 19337 172321 27365 -144325 -31174 142374
331 142374 39560 -156789 -84662 125024 91365 -110777 -95219 113087 126231 -83718 -131757
342 -131757 64524 131683 -61165 -156532 24525 148951 -8799 -147038 -3843 156630
352 156630 36771 -138934 -47289 135307 60960 -136647 -93933 108806 97021 -100639 -108070
363 -108070 94845 134673 -59848 -127653 50811 135255 -36301 -145764 10523 144445
373 144445 12172 -133805 -19156 144039 53219 -123374 -62415 111542 60878 -130951
383 -130951 -112500 81764 95561 -87374 -116590 71269 133017 -39107 -120897 38465 135008
394 135008 -18444 -140435 -3108 145251 38471 -115696 -27312 134197 60664 -117615
404 -117615 -74444 103193 76332 -111859 -115463 72102 108415 -61833 -111966 53501 124537
415 124537 -33178 -128296 15142 128646 -157 -135323 -30934 115920 34268 -117076
425 -117076 -49595 112833 67056 -102968 -80747 94411 100380 -71174 -102292 60247 111056
436 111056 -41596 -105377 47764 139184 -264 -115840 -749 119047 9773 -134291
446 -134291 -51557 98166 36210 -117055 -65835 102859 81569 -89407 -97409 62831 87326
457 87326 -69342 -110611 48198 119185 -21969 -105896 26997 130748 13005 -107908 -12037
468 -12037 114238 29447 -111331 -46807 104666 64833 -88674 -69497 84722 84842 -70499
479 -70499 -94258 53878 92141 -56329 -116835 23055 106563 -17025 -112176 -18 106953
490 106953 7219 -113853 -28014 108595 44646 -100203 -59342 87551 66405 -78032 -70257
501 -70257 81764 98817 -47784 -83456 56717 108350 -30818 -109012 8817 97325 -5387
512 -5387 -99301 -327 112854 28308 -104830 -52376 76556 36198 -97990 -73041 67309
523 67309 66094 -68437 -78878 60302 93138 -40365 -93435 30642 101070 -9881 -90607
534 -90607 11763 106152 13847 -95282 -17758 104288 45572 -85308 -50861 75403 49126
545 49126 -85399 -76461 62081 75906 -55733 -83976 45831 93626 -28218 -93771 16854
556 16854 94691 -6424 -98283 -9803 92967 16790 -98765 -40719 81656 43835 -77657
567 -77657 -50597 75868 65522 -64956 -74707 53454 83736 -33793 -72136 47310 105371
578 105371 -7331 -86441 5122 84835 -6533 -104689 -28801 80238 23210 -88890 -43466
589 -43466 75930 46063 -77380 -63690 63454 71198 -49230 -69407 50174 86363 -29247
600 -29247 -82218 25342 93171 -4113 -85971 -4438 82271 7424 -91844 -33150 75369 35186
612 35186 -72261 -41763 75479 64385 -53350 -61367 49659 68818 -42782 -76899 30576
623 30576 80030 -20923 -86483 2250 77944 -72 -84593 -15676 78924 23703 -78257 -36847
635 -36847 71774 45958 -63564 -49550 65888 71745 -40743 -62836 41400 70709 -36730
646 -36730 -84991 14534 78518 -7049 -78309 -755 80201 12796 -79577 -27068 70523 31572
658 31572 -70149 -42938 64501 53585 -54677 -59159 47731 66914 -34815 -65682 32141
669 32141 74515 -21101 -80113 3839 72840 -798 -76251 -9370 78547 24294 -71167 -32115
681 -32115 64654 35342 -66574 -50143 58246 60645 -42289 -57275 42811 68511 -30125
692 -30125 -70525 21165 72576 -12894 -77613 -3350 69412 4700 -75834 -20907 69512 30094
704 30094 -61634 -33184 62290 45087 -53909 -52760 45625 60206 -32782 -56631 32986 67693
716 67693 -20881 -71491 6181 64581 -6636 -74728 -11625 66933 16814 -65587 -25202 64695
728 64695 37903 -53716 -37489 56699 52833 -43778 -55915 35306 57676 -30487 -64537 20510
740 20510 66378 -12106 -70341 -961 64191 2376 -70881 -18015 64974 28508 -55223 -27697
752 -27697 60432 44425 -46966 -45864 43478 52215 -36907 -59050 25330 57686 -23096 -66209
764 -66209 8760 63328 -3488 -65411 -5967 64966 15205 -61989 -23329 59180 33045 -50578
776 -50578 -32948 54272 47908 -42045 -50690 34681 51613 -33946 -62845 18030 58988 -14305
788 -14305 -63542 5049 64272 4716 -61669 -11184 62366 22943 -55147 -27422 53244 35467
800 35467 -47776 -41422 42344 46865 -36438 -53833 25404 51394 -24386 -60973 9932 58477
812 58477 -2630 -55927 904 64018 16541 -53680 -16385 56329 27726 -50523 -33770 45239
824 45239 37480 -43500 -47749 32279 46923 -30704 -55425 18532 54391 -14343 -59188 3927
836 3927 57625 4176 -54161 -5716 60250 21362 -50768 -24594 48215 29717 -46687 -39178
848 -39178 38122 41944 -33375 -45817 28171 51985 -18835 -52272 12465 55159 -4013 -53889
860 -53889 -1958 53801 8480 -53948 -17304 50313 23069 -48779 -31829 40395 32790 -41394
872 -41394 -42510 31978 44806 -26864 -47544 22666 54193 -10333 -50611 7957 54346 1651
884 1651 -51916 -6736 52698 15775 -49027 -21244 47325 29390 -41101 -33517 36419 36400 -35025
897 -35025 -45929 23054 43880 -21269 -49551 12302 49744 -5962 -50620 -1121 49013 6498
909 6498 -49533 -13760 48303 22462 -41978 -24083 43052 34277 -35338 -36171 31276 40859 -26181
922 -26181 -44812 19433 46338 -13470 -48041 7578 50059 427 -48944 -6531 46961 11625
934 11625 -47907 -20970 41556 23251 -41510 -31700 34281 34473 -30427 -39053 24284 42068 -18458
947 -18458 -43617 13660 47796 -4115 -44436 2764 49825 9089 -43659 -11577 43358 17348
959 17348 -43179 -25691 36717 28007 -34787 -34663 28526 36860 -24161 -41134 17969 41720 -14478
972 -14478 -46126 6021 45564 -604 -45582 -5426 45256 12336 -42479 -17134 40361 22876
984 22876 -37163 -27775 33372 33433 -26287 -34084 24667 40140 -16714 -40267 12381 42384 -7248
997 -7248 -44832 -1253 42295 5083 -42866 -11911 40026 16623 -38435 -22215 34866 25964
1009 25964 -32097 -31849 26460 34181 -22267 -36858 18762 40818 -11016 -40290 7461 42944
1021 42944 -1057 -42554 -4829 41582 11259 -38631 -14977 38132 20887 -34568 -25896 30045
1033 30045 28601 -27862 -33927 21098 35207 -17686 -38229 11729 39425 -6022 -39908 877
1045 877 40066 5032 -39456 -11055 36964 15520 -34870 -19240 33957 25455 -28634 -28037 25644
1058 25644 30710 -21931 -35117 16374 37055 -11004 -37624 7118 39352 -981 -39274 -4821
1070 -4821 38464 9508 -36982 -15107 34413 18787 -32474 -23806 28951 27856 -24697 -30468 20840
1083 20840 33269 -16870 -36145 10487 36547 -5242 -36496 1695 38313 5136 -36031 -9386
1095 -9386 34663 13477 -33455 -18584 30305 22004 -27982 -26325 23703 29008 -19911 -32029 15970
1108 15970 34606 -10618 -35526 6010 35909 -1064 -35759 -2593 36661 9120 -34177 -12991
1120 -12991 31683 16172 -31730 -22735 26159 24642 -23615 -27276 20627 31164 -14928 -32785
1132 -32785 10651 34336 -5335 -34124 1923 34596 3185 -34196 -8383 32366 12144 -31023
1144 -31023 -17178 28344 20174 -26062 -24836 21994 26794 -18542 -28428 16075 32867 -9080 -32168
1157 -32168 5741 33091 -2247 -34051 -2908 32951 7335 -32352 -12038 30321 15559 -28419
1169 -28419 -19793 25783 23397 -21781 -25617 18369 28209 -14830 -30499 10589 31711 -5381 -31816
1182 -31816 1315 31375 1832 -32911 -7942 30167 11560 -28443 -14621 27499 20082 -23511
1194 -23511 -21898 20736 24893 -16927 -26414 14516 29304 -9444 -30138 5654 30234 -2120
1206 -2120 -31270 -2621 30456 6210 -30213 -11181 27588 13679 -26575 -17888 24137 21949
1218 21949 -20023 -23403 17324 25822 -13951 -27970 9717 29119 -5404 -29354 1789 30045
1230 30045 2451 -29233 -6708 28122 10769 -25971 -13698 25027 17616 -21954 -20160 19221
1242 19221 22973 -15928 -24652 12288 25785 -10500 -29295 3854 27244 -2558 -29000 -2120
1254 -2120 28618 6604 -27279 -9403 26647 14000 -23495 -15475 22963 20629 -18394 -21062 16363
1267 16363 24107 -13104 -25881 9166 26599 -6164 -28098 1333 27032 1449 -27690 -5871
1279 -5871 26641 9667 -24427 -12558 23058 15056 -21792 -19718 17731 20544 -15492 -22760 12542
1292 12542 24948 -8751 -25299 5962 26965 -1479 -25812 -662 27413 5865 -24854 -8385
1304 -8385 24848 12024 -22413 -14509 20333 17015 -19061 -21000 14468 21147 -13441 -24220 9049
1317 9049 24571 -6007 -25683 1701 24924 1062 -25887 -5117 24634 8592 -22645 -10711
1329 -10711 22381 15207 -18565 -16006 18230 20262 -13900 -20981 11610 22555 -8614 -23957 4847
1342 4847 23822 -2236 -25070 -2107 23420 3990 -24274 -8442 21807 10897 -20610 -13362
1354 -13362 19738 16616 -17012 -18544 14137 19867 -11995 -22091 8014 22758 -5312 -23636
1366 -23636 2587 24227 2169 -22598 -3324 24219 8786 -20526 -9704 20336 12975 -18169
1378 -18169 -16477 15390 16779 -14849 -21046 9041 19456 -9160 -23104 3948 22127 -1495
1390 -1495 -21899 -185 23762 5248 -20774 -6010 21982 10228 -19308 -12302 17755 14218
1402 14218 -16405 -17698 13000 18250 -11297 -20205 8381 21278 -5102 -21118 2626 22564
1414 22564 1176 -21093 -3015 21356 6686 -20684 -10264 18104 10739 -18072 -15425 14282
1426 14282 15855 -12911 -17768 10685 20025 -7002 -19266 5742 21789 -1279 -20439 -263
1438 -263 21624 3685 -20601 -6741 19111 8826 -18542 -12341 16001 13075 -15141 -16105 12411
1451 12411 17245 -10171 -18229 8382 20061 -4772 -20065 2147 20549 258 -20406 -3341
1463 -3341 19816 5875 -19069 -8726 17484 11365 -16022 -13178 13714 15463 -12021 -16743 9477
1476 9477 17996 -6896 -18993 4638 19531 -1856 -19720 -713 19360 3613 -19214 -5918
1488 -5918 18566 8510 -17356 -10720 15757 12812 -14137 -14788 11449 16013 -10022 -17503 7655
1501 7655 18456 -4292 -18662 2784 19696 781 -18628 -2697 18701 5542 -17859 -8446
1513 -8446 16297 10026 -15596 -12458 12667 13847 -11358 -15741 9260 16693 -6676 -17366 4746
1526 4746 18707 -1255 -18087 -200 18624 3432 -17939 -5679 16555 7373 -16782 -10688
1538 -10688 14207 11705 -13395 -13904 11161 15209 -8492 -15654 7662 17775 -4306 -17425 2659
1551 2659 18042 386 -18037 -2915 16946 4639 -17079 -7966 14970 8847 -14949 -11688 12478
1564 12478 13157 -10504 -13875 9288 16036 -5785 -15852 4600 17308 -1771 -17072 -847 16869
1577 16869 2519 -17170 -5533 15519 6584 -15346 -9133 13693 10625 -12218 -12137 10676 13984
1590 13984 -8461 -14788 7100 16221 -4320 -16336 2491 16663 -685 -17355 -2698 15772
1602 15772 4033 -15929 -6493 14754 8303 -13124 -10093 12471 12414 -9906 -12954 8874 15076
1615 15076 -5993 -15212 4441 15599 -2087 -16157 -290 15675 1477 -16039 -4801 14576
1627 14576 6033 -14238 -8198 13130 10158 -11652 -10997 10585 12918 -8446 -13293 6696 14710
1640 14710 -4188 -15285 2784 15654 -298 -15612 -1739 15157 3454 -14660 -5585 14001
1652 14001 7595 -12713 -8876 11731 11023 -9947 -12182 7888 13321 -6757 -14336 3889 14350
1665 14350 -2670 -15049 162 14647 1488 -14790 -3404 14160 5515 -13145 -7070 12649
1677 12649 9208 -10843 -10037 9978 11814 -7906 -12255 6607 13618 -4664 -14374 2559 14053
1690 14053 -1133 -14957 -1449 14074 2659 -14249 -5419 12757 6633 -11993 -8615 10859
1702 10859 10025 -9383 -10876 8120 12651 -5961 -12938 4592 13769 -2228 -13810 513 13638
1715 13638 1181 -13452 -3067 13291 4717 -12673 -6886 11655 8173 -10051 -9518 8987 10534
1728 10534 -7897 -11724 6269 12228 -4815 -13273 2383 12828 -1264 -13854 -1124 13085
1740 13085 2733 -12866 -4162 12758 6334 -10994 -7149 10960 9527 -8473 -9526 7935 11271
1753 11271 -5994 -12132 4307 12172 -3262 -13355 478 12311 231 -13115 -3030 11843
1765 11843 4171 -11495 -5495 10887 7272 -9639 -8064 8775 9339 -7186 -10396 6176 11229
1778 11229 -4291 -11731 3136 12189 -912 -12334 -173 12373 2118 -11777 -3635 11494
1790 11494 5149 -10527 -6658 9682 7992 -8778 -9206 6643 9651 -6103 -11163 4334 11168
1803 11168 -2984 -11747 1402 11869 676 -11848 -2137 11467 3798 -10835 -4943 10433 7000
1816 7000 -9170 -7512 8320 8955 -6801 -9678 5656 10272 -4372 -11204 2719 11292 -1369
1829 -1369 -11650 -312 11135 1382 -11251 -3187 10335 4562 -9911 -5962 9403 7168 -8082
1842 -8082 -7912 7014 9345 -5464 -9936 4163 10786 -2554 -10974 1381 10543 257 -11017
1855 -11017 -1856 10550 3184 -9898 -4484 9404 5745 -8831 -7029 7625 8001 -6610 -8834
1868 -8834 5499 9810 -4163 -10297 2502 10230 -1785 -10768 -339 10389 1282 -10247 -2665
1881 -2665 10067 4263 -9103 -5146 8780 6906 -7623 -7564 6690 8615 -5584 -9165 3881 9093
1895 9093 -2987 -10192 1119 9921 14 -9880 -1382 9513 2666 -9115 -3910 8980 4896 -7914
1909 -7914 -5618 7113 7079 -5843 -8074 5139 8390 -3982 -9162 2622 9136 -1437 -9522 145
1923 145 9590 1020 -9264 -2386 8841 3777 -8486 -4589 7863 5961 -7285 -6592 5831 7481
1937 7481 -5118 -8129 3839 8632 -2572 -8898 1555 9033 -304 -8902 -840 9109 2491 -8624
1951 -8624 -3282 7852 4762 -7596 -5385 6790 6488 -5787 -6954 4915 7773 -3681 -7819 2322
1965 2322 8318 -1618 -8924 291 8608 830 -8483 -2138 8372 3401 -7659 -4111 7250 5094
1979 5094 -6553 -5712 5476 6662 -4700 -7206 3771 7724 -2606 -8218 1396 8032 -757 -8435
1993 -8435 -772 8193 1706 -7964 -2790 7622 4064 -6601 -4983 6370 5429 -5228 -6443 4536
2007 4536 6780 -3803 -7515 2483 7448 -1973 -8352 472 7906 599 -7633 -1240 7812 2509 -7047
2022 -7047 -3397 6774 4564 -6082 -5148 5098 5532 -4528 -6756 3580 6636 -2944 -7393 1619
2036 1619 7190 -796 -7322 -113 7642 1605 -7111 -2361 7203 3446 -6370 -3959 5479 4784 -5355
2051 -5355 -5646 4024 6064 -3628 -6560 2730 6920 -1700 -6915 1127 7096 294 -6996 -1185 7065
2066 7065 2096 -6751 -2629 6011 3561 -5836 -4470 4977 4805 -4532 -5626 3603 5967 -2288 -6310
2081 -6310 1813 6855 -1110 -6677 115 6718 1126 -6546 -1513 6280 2937 -5881 -3239 5350 4137
2096 4137 -4820 -4830 4013 5222 -3284 -5793 2786 5966 -2151 -6287 828 6597 -298 -6394 -738
2111 -738 6447 1522 -6166 -1942 5488 2711 -5584 -3621 5107 4482 -4317 -5055 3373 5452 -2894 -5883
2127 -5883 2180 6149 -1118 -5888 487 6200 638 -5784 -1219 5683 2051 -5774 -3006 5023 3434
2142 3434 -4832 -4470 3660 4539 -3746 -5132 2756 5339 -1988 -5640 1343 5909 49 -5580 -276
2157 -276 5991 1207 -5378 -1899 5657 2527 -5075 -3297 4401 3875 -4059 -4102 3610 4874 -2823 -5058
2173 -5058 2314 5514 -1317 -5638 638 5762 -174 -5706 -963 5288 1758 -5330 -2335 4734 2996
2188 2996 -4194 -3424 3555 4056 -3063 -4315 2648 5266 -1938 -4926 1408 5403 -508 -5418 -53
2203 -53 5211 840 -5262 -1740 4783 1851 -4964 -2844 3967 2890 -3754 -3821 3246 4196 -2891 -4459
2219 -4459 2207 4936 -1226 -4691 1182 5024 -153 -4952 -825 4979 1515 -4520 -2206 4510 2344
2234 2344 -4186 -3217 3535 3550 -3057 -4036 2498 4246 -1794 -4380 1317 5028 -922 -4870 244 4963
2250 4963 536 -4640 -1205 4611 1925 -4305 -2376 3795 2822 -3540 -3354 3167 3820 -2738 -3773 1983
2266 1983 4168 -1293 -4613 959 4431 -266 -4410 -601 4398 1074 -4514 -1797 3754 2230 -3789
2281 -3789 -2302 3450 2888 -3362 -3429 2423 3671 -1865 -3893 1460 4247 -854 -4416 310 4476 -48
2297 -48 -4292 -909 4155 1244 -3919 -1792 3813 2260 -3412 -2645 2914 3186 -2667 -3568 2119 3943
2313 3943 -1725 -3680 1093 4160 -472 -4208 -15 4163 732 -3858 -1065 3823 1500 -3519 -1874
2328 -1874 3237 2338 -2851 -2721 2699 3329 -2051 -3494 1714 3782 -880 -3712 462 3963 -226 -4107
2344 -4107 -568 3956 773 -3792 -1433 3406 1729 -3218 -2256 2814 2441 -2471 -2935 2231 3070 -1759
2360 -1759 -3260 1347 3361 -845 -3657 462 3735 118 -3502 -599 3534 1032 -3250 -1389 3385
2375 3385 2095 -2758 -2402 2702 2915 -2316 -2771 1834 3105 -1485 -3487 691 3259 -411 -3644 77
2391 77 3486 476 -3444 -1038 3415 1385 -3117 -1588 2755 1945 -2363 -2322 2443 2426 -2024 -2767 1527
2408 1527 3136 -1069 -3393 858 3146 -470 -3316 -244 3324 494 -3480 -1241 3310 1648 -2802
2423 -2802 -1868 2527 2269 -2289 -2240 2016 2502 -1590 -3014 977 3178 -526 -3032 247 3150 316
2439 316 -3073 -418 3166 938 -3153 -1230 2512 1823 -2448 -2022 2125 2201 -1935 -2370 1768 2678 -1331
2456 -1331 -2804 1142 2760 -709 -3042 493 2883 245 -2870 -494 2826 832 -2456 -1027 2397
2471 2397 1522 -2195 -1848 2054 2489 -1770 -2331 1393 2641 -830 -2785 808 2945 -325 -2991 -150
2487 -150 3058 544 -2791 -688 2673 1319 -2616 -1282 2480 1550 -2021 -1553 1665 2137 -1530 -2436
2503 -2436 1234 2574 -718 -2583 685 2626 -70 -2844 -321 2951 858 -2519 -972 2609 1365
2518 1365 -2286 -1441 1993 1698 -1896 -2090 1441 2139 -1371 -2508 871 2659 -460 -2458 114 2621
2534 2621 278 -2696 -289 2637 885 -2292 -929 2284 1701 -1780 -1631 1853 2056 -1844 -1672 1358
2550 1358 2281 -930 -2485 536 2387 -493 -2235 273 2484 418 -2648 -650 2220 1209 -2134
2565 -2134 -1282 1969 1533 -1788 -1969 1638 1834 -1397 -2133 1124 2180 -586 -2331 864 2247 -133
2581 -133 -2474 -119 2338 475 -2199 -881 2067 966 -1997 -1268 1856 1690 -1379 -2022 1245 2049
2597 2049 -1095 -1998 770 2000 -728 -2298 285 2304 126 -2244 -450 2170 732 -1808 -806
2612 -806 1933 1295 -1768 -1401 1422 1601 -1403 -1884 1109 1847 -946 -1848 562 2148 -519 -1873 183
2629 183 2156 247 -2069 -415 1902 612 -1818 -904 1767 852 -1670 -1565 1409 1465 -1420 -1638 1262
2646 1262 1761 -815 -1890 294 2042 -273 -1950 -61 1970 234 -1968 -539 1826 656 -1615
2661 -1615 -762 1451 1092 -1347 -1793 1140 1484 -1305 -1873 672 1781 -849 -1657 83 1657 -138
2677 -138 -2004 -135 1817 692 -1818 -936 1581 800 -1413 -938 1451 1201 -1130 -1549 1224 1456 -1068
2694 -1068 -1767 611 1617 -456 -1837 271 1507 40 -1763 -274 1779 530 -1846 -579 1638
2709 1638 935 -1342 -1103 1451 1391 -1070 -1661 961 1586 -804 -1618 368 1644 -674 -1664 171 1739
2726 1739 315 -1783 -118 1909 589 -1653 -644 1379 1137 -1371 -1251 1163 1283 -825 -1471 779
2742 779 1370 -533 -1760 570 1746 -46 -1571 -60 1825 148 -1474 -594 1892 518 -1555 -889
2758 -889 1123 989 -1366 -1477 1129 1489 -721 -1464 533 1549 -405 -1663 258 1722 -101 -1763
2774 -1763 -59 1547 497 -1503 -533 1472 592 -1366 -1050 1258 1005 -1156 -1406 1132 1172 -855 -1180
2791 -1180 541 1535 -279 -1535 283 1674 73 -1492 -155 1592 494 -1359 -440 1388 1011 -1250
2807 -1250 -820 1198 1044 -1040 -1433 902 1521 -754 -1468 374 1298 -312 -1542 220 1663 -40
2823 -40 -1539 -359 1279 598 -1252 -869 1423 982 -1469 -1178 758 830 -760 -1257 736 1079 -385
2840 -385 -1294 131 1322 -230 -1373 -37 1429 227 -1304 -642 1218 142 -1448 -927 1093 971
2856 971 -1123 -841 1176 1321 -791 -1221 859 1537 -569 -1771 86 1243 -266 -916 -162 1428 496
2873 496 -1095 -723 1098 894 -1087 -637 1055 1005 -910 -832 713 1315 -668 -1171 392 1373 -514 -1445
2891 -1445 208 1200 152 -1222 -363 1385 456 -1357 -738 984 720 -1184 -835 1029 1023 -757 -939
2908 -939 638 1232 -759 -956 523 1016 129 -1352 -67 1299 351 -1006 -422 1298 378 -1174 -610
2925 -610 1300 885 -991 -882 729 967 -1072 -948 452 1014 -190 -1115 431 1386 -342 -1161 -101
2942 -101 1187 463 -1383 -350 1081 756 -1084 -630 1062 827 -607 -772 919 954 -716 -1115 541
2959 541 1126 -419 -1036 178 1092 -23 -1317 156 1206 413 -1066 -596 1053 574 -899 -992 956
2976 956 628 -868 -835 641 1015 -1032 -948 84 883 -157 -940 -59 1131 67 -1145 -207 1305 350
2994 350 -1009 -586 1015 689 -840 -789 680 815 -914 -811 704 1142 -432 -855 195 1001 -359
3011 -359 -1026 53 1379 59 -1010 -22 1185 251 -795 -401 619 692 -699 -693 358 898 -438 -755
3029 -755 508 795 -370 -1098 91 1239 56 -817 149 978 74 -847 -475 809 327 -798 -488 613
3047 613 642 -767 -751 482 725 -290 -1041 554 727 -272 -893 163 1159 106 -978 179 776 263
3065 263 -870 -209 864 409 -863 -639 605 507 -662 -885 710 337 -456 -909 413 823 -132 -797
3083 -797 110 1095 -155 -798 121 910 46 -1008 -272 794 633 -730 -294 803 757 -777 -604 693
3101 693 638 -406 -608 289 1043 -196 -773 215 699 -111 -1163 -96 1001 113 -658 -434 763 431
3119 431 -794 -541 825 763 -508 -570 106 819 -380 -579 442 1190 -123 -754 -180 1038 -109 -870
3137 -870 52 1129 249 -1063 -590 513 497 -568 -531 691 567 -518 -819 145 1041 -561 -769 442
3155 442 921 -309 -1044 -11 984 240 -957 -66 848 383 -942 -254 792 502 -786 -593 495 750
3173 750 -493 -483 680 776 -161 -980 535 805 -33 -892 -31 950 -170 -1102 -202 788 144 -832 -218
3192 -218 640 300 -668 -676 747 589 -227 -766 400 488 -261 -792 388 974 -400 -744 -141 765 489 -775
3212 -775 -150 714 471 -698 -211 799 378 -803 -442 821 828 -418 -777 374 820 -339 -918 389
3230 389 784 -30 -623 -206 888 258 -1004 -240 788 547 -942 -321 555 725 -823 -812 364 606
3248 606 -598 -872 235 814 -259 -914 313 877 -121 -811 -3 950 252 -565 -250 763 734 -450
3266 -450 -442 762 472 -417 -1006 353 565 -638 -770 393 879 -128 -824 138 727 81 -770 -86 833
3285 833 157 -612 -500 627 410 -885 -835 745 596 -407 -739 538 650 -294 -993 -53 699 -138 -979
3304 -979 49 943 -38 -893 -204 573 132 -809 -261 727 548 -886 -560 650 488 -606 -941 546
3322 546 851 -248 -903 228 710 -222 -947 154 791 132 -797 -9 987 4 -917 -434 770 517 -672
3341 -672 -711 814 701 -668 -705 591 860 -551 -1093 241 785 -339 -1079 337 851 4 -711 119
3359 119 936 196 -939 -720 807 450 -924 -563 707 755 -651 -947 501 1030 -394 -1059 388 809
3377 809 -39 -1045 -51 973 275 -854 -154 1009 370 -892 -641 1043 595 -503 -697 820 537
3394 537 -335 -685 428 755 -743 -1226 -102 1137 -173 -1105 57 1275 284 -1176 -457 1078 623
3411 623 -1057 -311 745 818 -723 -789 637 674 -396 -674 420 994 -272 -1154 93 1233 86 -986
3429 -986 6 1170 365 -1210 -165 1338 374 -973 -927 1095 981 -808 -961 378 974 -487 -941
3446 -941 296 1317 -188 -1182 107 1036 -52 -877 -54 914 454 -1035 -733 1018 894 -839 -995
3463 -995 661 986 -585 -1156 381 1340 -410 -1163 491 1273 -180 -1031 105 1415 361 -1143 -396
3480 -396 1360 552 -1101 -776 829 1059 -646 -1044 672 1237 -575 -1069 559 1105 -389 -1224 136
3497 136 1207 12 -1347 -73 1141 381 -1181 -576 974 700 -902 -785 858 736 -754 -1027 446
3514 446 1084 -578 -1114 414 1221 -146 -1281 -69 1452 221 -1223 -250 1136 170 -1187 -579 1006
3531 1006 949 -1083 -981 817 914 -808 -772 709 970 -407 -1248 511 1353 -86 -1394 -105 1308
3548 1308 270 -1264 -194 1181 509 -1114 -927 1012 1018 -914 -902 633 1239 -456 -939 255 1146
3565 1146 -225 -1206 303 1315 100 -1534 -309 1338 339 -1242 -468 1009 581 -1056 -720 983
3581 983 1033 -763 -1136 586 1398 -686 -1477 115 1369 -148 -1396 21 1402 214 -1172 -587 1308
3598 1308 703 -1377 -724 1018 1036 -1141 -948 765 984 -553 -1196 667 1146 -393 -1206 38 1341
3615 1341 -53 -1447 -62 1413 422 -1300 -468 1225 528 -1121 -658 993 910 -990 -1033 596 1301
3632 1301 -689 -1414 607 1390 -191 -1656 86 1480 -220 -1477 -419 1537 528 -1244 -540 1328
3648 1328 969 -1365 -1096 1011 1162 -748 -1061 455 1340 -513 -1573 272 1410 -127 -1546 -271
3664 -271 1617 157 -1415 -507 1272 674 -1174 -921 1371 826 -1232 -1033 654 1222 -799 -1335 666
3681 666 1361 -398 -1479 202 1253 -33 -1757 -251 1603 484 -1507 -367 1648 617 -1063
3696 -1063 -940 1380 1001 -829 -1128 690 1139 -713 -996 560 1303 -182 -1562 -35 1610 173
3712 173 -1570 -286 1310 225 -1413 -730 1369 873 -1028 -1048 1146 1242 -848 -1396 675 1580 -262
3729 -262 -1394 121 1238 0 -1551 -176 1487 476 -1361 -441 1404 765 -1408 -533 1308 984
3745 984 -1102 -1124 1036 1674 -494 -1564 495 1281 -452 -1712 253 1728 300 -1608 -137 1662
3761 1662 804 -1482 -790 1507 820 -1399 -830 1013 1104 -836 -1164 1062 1549 -682 -1677 337 1528
3778 1528 -214 -1531 124 1761 440 -1882 -494 1511 744 -1340 -995 1391 1249 -1218 -1343 1083
3794 1083 1336 -963 -1287 522 1601 -265 -1718 194 1609 -214 -1581 -224 1491 392 -1555
3809 -1555 -747 1768 863 -1437 -1260 1267 1493 -1224 -1440 878 1597 -710 -1518 430 1605 -203 -1649
3826 -1649 81 1785 -89 -1709 -442 1375 553 -1509 -769 1440 1066 -1338 -1405 1063 896 -1078
3842 -1078 -1565 736 1441 -400 -1709 204 1697 -139 -1783 -173 1670 335 -1149 -840 1671 842
3858 842 -1463 -1063 1393 1294 -1132 -1304 679 1625 -643 -1834 319 2098 11 -1529 259 1852
3874 1852 270 -1801 -309 1693 365 -1527 -1054 1430 1127 -1474 -1345 1121 1410 -938 -1668 850
3890 850 1711 -446 -1268 329 1868 32 -1757 -205 1575 473 -1307 -504 1472 700 -1630 -1205
3906 -1205 1401 1259 -1134 -1205 929 1252 -773 -1676 538 1855 20 -1787 111 1908 348 -1818
3922 -1818 -333 1695 505 -1712 -754 1396 1214 -1379 -1158 1218 1237 -1015 -1818 562 1620 -299
3938 -299 -1376 159 1808 -90 -1768 8 1514 564 -1734 -480 1738 966 -1369 -867 1342 1254
3954 1254 -1411 -1401 1211 1044 -630 -1607 456 1785 -240 -2007 56 1963 441 -1932 -453 1816
3970 1816 617 -1358 -1141 1676 1049 -1175 -1250 1196 1827 -942 -1504 609 1628 -452 -1653 390
3986 390 1687 331 -1587 109 1621 175 -1616 -624 1818 993 -1416 -1114 1087 1075 -1341 -1650 928
4003 928 1689 -1016 -1425 773 1662 -388 -1888 -111 2078 330 -1746 -454 1689 879 -1678 -1066
4019 -1066 1363 1028 -1421 -867 1243 1561 -1254 -1573 921 1541 -529 -1519 688 1575 136 -1502 53
4036 53 1902 254 -1849 -545 1632 486 -1572 -1029 1271 1335 -1558 -1317 651 1528 -1008 -1596 519
4053 519 1649 -77 -1679 -8 1809 183 -1849 -377 1612 735 -1842 -608 1594 1162 -1378 -1165
4069 -1165 1073 1344 -956 -1430 747 1670 -524 -1850 692 1659 -136 -1711 -289 1576 470 -1655
4085 -1655 -480 1745 860 -1606 -1227 1468 1062 -1132 -1663 942 1539 -890 -1618 803 1471 -415 -1580
4102 -1580 134 1588 -43 -1740 -220 1678 434 -1620 -792 1593 916 -1227 -1205 1044 1334 -1041
4118 -1041 -1472 785 1486 -602 -1483 443 1682 -106 -1575 -191 1635 399 -1712 -588 1960 800
4134 800 -1430 -968 1244 1444 -1293 -1283 1259 1330 -735 -1405 385 1803 -287 -2155 278 1950 210
4151 210 -1804 -387 1554 431 -1640 -964 1470 812 -1250 -1252 1073 1239 -1030 -1556 889 1474 -488
4168 -488 -1731 425 1833 -23 -1625 -290 1971 640 -1689 -807 1756 887 -1276 -1012 1243 1118
4184 1118 -1150 -1402 1020 1581 -838 -1482 493 1617 -490 -1785 245 2209 222 -1881 -504 1813
4200 1813 651 -1607 -654 1383 958 -1463 -991 1290 1495 -1325 -1517 745 1808 -565 -1577 369
4216 369 1874 -155 -1319 -121 1414 444 -1675 -786 1579 644 -1326 -1050 1399 1364 -1219 -1124 1173
4233 1173 1490 -733 -1655 598 1969 -297 -1615 -38 1508 -18 -1853 -514 1995 389 -1625
4248 -1625 -880 1497 1092 -1334 -979 955 1502 -1135 -1667 910 1338 -448 -1632 539 1858 -236
4264 -236 -1483 -311 1919 351 -1898 -417 1729 628 -1497 -1044 1397 992 -1005 -1151 1195 1375
4280 1375 -489 -1641 222 1916 -564 -1988 87 1647 174 -1760 -434 1550 473 -1762 -827
4295 -827 1761 813 -1659 -1339 1374 1373 -996 -1523 1010 1608 -725 -1891 112 1587 -198 -1856 -71
4312 -71 1816 166 -1614 -878 1930 791 -1573 -857 1538 1224 -1181 -1191 1063 1510 -740 -1760 879
4329 879 1675 -568 -1597 159 1939 368 -1805 -342 1847 511 -1531 -595 1660 903 -1417 -1130
4345 -1130 1269 1458 -821 -1631 1089 1474 -617 -1574 305 1533 -253 -1609 153 1564 534 -1438
4361 -1438 -501 1681 710 -1440 -777 1565 1359 -1220 -1391 998 1131 -720 -1539 822 1483 -196 -1731
4378 -1731 128 1680 70 -1402 -324 1616 319 -1383 -704 1464 907 -1455 -1214 1289 1267 -1016
4394 -1016 -1368 1079 1690 -626 -1467 483 1708 -221 -1952 -176 1807 479 -1718 -642 1826 737
4410 737 -1604 -921 1605 995 -1230 -1175 1312 1540 -847 -1566 588 1540 -525 -1668 186 1911 -150
4427 -150 -1825 -111 1777 725 -1728 -907 1408 878 -1443 -983 1500 1572 -1291 -1620 797 1304 -903
4444 -903 -1456 670 1693 -492 -1592 -57 1885 142 -1567 -397 1268 724 -1522 -846 1449 1315
4460 1315 -1397 -1249 856 1504 -867 -1388 648 1566 -615 -1777 -101 1657 82 -1724 -508 1460
4476 1460 630 -1778 -702 1675 869 -1633 -1022 1670 1321 -1011 -1312 939 1802 -878 -1698 295 1638
4493 1638 -283 -1943 150 1536 305 -1832 -261 2005 734 -1562 -707 1591 1306 -1245 -991 1048
4509 1048 1397 -1029 -1745 593 1727 -480 -1955 534 1894 -313 -1763 -135 1649 363 -1805
4524 -1805 -1020 1760 753 -1451 -837 1321 1301 -998 -1444 768 1494 -760 -1883 478 1843 -635
4540 -635 -1559 73 1682 258 -1568 -267 1566 752 -1524 -669 1335 690 -1048 -1051 1417 1554 -1160
4557 -1160 -1689 723 1748 -363 -1569 436 1771 -44 -1830 -73 1800 418 -1607 -741 1636
4572 1636 773 -1535 -1099 1198 1283 -1216 -1485 843 1744 -563 -1719 809 1703 -559 -1830 218 1890
4589 1890 156 -1764 -184 1942 425 -1624 -1029 1547 855 -1110 -1252 1325 1323 -1056 -1573 762 1769
4606 1769 -765 -1795 612 1756 38 -1727 88 1776 460 -1500 -372 1510 819 -1668 -1045
4621 -1045 1525 1259 -1012 -1512 1126 1813 -845 -1477 428 2002 -413 -2041 47 1748 178 -1795
4637 -1795 -394 1959 700 -1576 -1099 1115 1140 -1633 -1414 974 1350 -771 -1495 880 1448 -661 -1750
4654 -1750 297 1653 5 -1872 -309 1627 364 -1828 -628 1970 628 -1262 -832 1317 1251 -1330
4670 -1330 -1200 677 1485 -844 -1825 435 1692 -498 -1749 260 1466 366 -1931 -268 1654 548
4686 548 -1984 -979 1752 940 -1389 -1156 1030 1394 -1244 -1537 793 1470 -562 -1654 342 1897
4702 1897 -129 -1716 -236 1719 231 -1890 -349 1704 580 -1481 -873 1414 1449 -1321 -1306 1244
4718 1244 1679 -924 -1569 619 1796 -423 -1802 216 1791 -227 -1742 -366 1530 599 -1946 -881
4734 -881 1587 1042 -1604 -1065 1400 1253 -1008 -1589 888 1814 -788 -1798 300 1612 -104 -1730
4750 -1730 103 1901 337 -1643 -371 1535 793 -1717 -960 1499 1185 -1331 -1388 1453 1444 -892 -1509
4767 -1509 597 1837 -680 -1845 544 1976 25 -1941 85 1601 110 -1708 -844 1795 981
4782 981 -1677 -1265 1552 1305 -1161 -1493 1249 1746 -565 -1855 447 1631 -307 -1831 208 1711
4798 1711 219 -1736 -248 1803 765 -1624 -951 1533 1017 -1486 -1287 886 1597 -1045 -1602 1095
4814 1095 1600 -734 -1925 151 1654 32 -1958 -176 1558 598 -1611 -595 1637 774 -1454 -1190
4830 -1190 1566 1195 -1230 -1083 1114 1564 -835 -1658 689 1572 -467 -1760 74 1812 -46 -1817
4846 -1817 -242 1461 543 -1527 -1028 1631 888 -1121 -1293 1352 1446 -777 -1568 1157 1620 -714 -1933
4863 -1933 34 1871 205 -1584 15 1831 409 -2010 -547 1501 930 -1634 -936 1475 1210 -1354
4879 -1354 -1176 1047 1413 -860 -1562 844 1553 -423 -1867 208 1893 8 -1505 -277 1952 866
4895 866 -1348 -969 1641 1132 -1515 -1361 1177 1544 -921 -1582 570 1665 -609 -1888 407 1653
4911 1653 -235 -1812 -50 1854 317 -1559 -463 1700 659 -1479 -1086 1546 1139 -1021 -1258 1123
4927 1123 1443 -838 -1264 292 1613 -549 -1696 -192 1838 204 -1907 -354 1537 514 -1531
4942 -1531 -882 1415 918 -1314 -1229 1304 1410 -970 -1422 755 1481 -602 -1454 363 1825 -157 -1659
4959 -1659 -9 1779 487 -1588 -806 1522 424 -1677 -892 1425 1007 -1187 -945 945 1350 -1072
4975 -1072 -1742 442 1645 -304 -2056 111 1845 -74 -1632 -166 1582 536 -1562 -602 1640
4990 1640 1122 -1285 -998 1011 1221 -991 -1230 901 1579 -442 -1403 633 1888 -73 -1576 -181
5006 -181 1722 318 -1726 -623 1876 492 -1581 -904 1215 1088 -1484 -1346 1259 1725 -828 -1653
5022 -1653 904 1487 -432 -1780 224 1413 -103 -1787 -303 1656 699 -1479 -827 1583 1082 -1424
5038 -1424 -878 1120 1297 -1168 -1425 1033 1396 -647 -1289 480 1814 -379 -1512 311 1745 205
5054 205 -1692 -206 1632 537 -1466 -911 1399 1006 -1262 -1178 1019 1430 -856 -1417 632 1780 -435
5071 -435 -1592 141 1840 -132 -1322 45 1493 119 -1294 -316 1296 423 -1442 -1192 1265 1193
5087 1193 -1063 -1400 770 1463 -788 -1601 693 1612 -531 -1536 142 1662 36 -1258 -358 1312
5103 1312 447 -1522 -850 1394 970 -1117 -963 1129 1347 -923 -1320 741 1510 -509 -1707 522 1283
5120 1283 -616 -1588 -200 1551 577 -1665 -426 1423 765 -1570 -937 1159 1102 -1125 -1329 794 1328
5137 1328 -1020 -1378 495 1600 -283 -1385 47 1639 -67 -1528 -556 1573 505 -1422 -807 1222
5153 1222 1149 -1392 -1090 1208 1270 -958 -1358 720 1562 -594 -1636 468 1602 -257 -1628 -40 1461
5170 1461 316 -1356 -313 1338 814 -1245 -893 1334 801 -1170 -1213 1003 1136 -863 -1616 503 1423
5187 1423 -299 -1284 568 1441 -59 -1494 28 1900 565 -1154 -592 1468 862 -1426 -1004 810
5203 810 1188 -1204 -967 634 1385 -570 -1371 396 1545 -341 -1641 80 1426 228 -1382 -192
5219 -192 1380 599 -1567 -658 1326 1245 -1421 -1466 828 1382 -736 -1458 722 1637 -305 -1441 405
5236 405 1315 73 -1512 -215 1377 269 -1457 -507 1526 820 -1357 -938 1302 1002 -1079 -1167 983
5253 983 1315 -714 -1478 445 1617 -469 -1369 396 1734 77 -1488 -576 1374 532 -1144 -856 1432
5270 1432 930 -1015 -1002 994 1277 -754 -1315 739 1173 -346 -1478 215 1559 -51 -1441 -269
5286 -269 1498 350 -1365 -607 1580 699 -1001 -455 1012 933 -1259 -1050 927 1429 -647 -1255 682
5303 682 1093 -347 -1372 -7 1370 194 -1528 -316 1550 311 -1394 -698 983 635 -951 -792
5319 -792 886 1205 -941 -1020 671 1267 -359 -1557 124 1630 85 -1429 -211 1362 95 -1253
5335 -1253 -197 1303 613 -1439 -739 1054 826 -925 -1025 772 1199 -589 -1397 581 1358 -30 -1455
5352 -1455 180 1445 -197 -1479 -206 1282 89 -1130 -472 1104 543 -1254 -779 1135 1221 -961
5368 -961 -1080 808 1372 24 -1270 531 1145 -113 -1526 -51 1292 234 -1350 -481 1317 407
5384 407 -1180 -423 1164 972 -1265 -1097 949 1170 -873 -1106 644 1490 -181 -1187 289 1153 -186
5401 -186 -1127 -160 1054 499 -1213 -426 1185 663 -1151 -725 1176 1002 -800 -1137 663 1249 -485
5418 -485 -1421 640 1259 -311 -1258 -48 1335 71 -1242 -330 1366 66 -1169 -450 1169 883 -827
5435 -827 -902 811 1086 -935 -1343 448 1219 -504 -1140 181 1132 -166 -1186 7 1123 326 -1296
5452 -1296 -332 1072 459 -719 -722 1051 840 -798 -862 562 1031 -715 -987 219 1153 -249 -1100 41
5470 41 1086 -208 -1485 -264 1032 294 -1303 -835 956 721 -886 -1037 828 1395 -703 -1013 634
5487 634 1194 -396 -1280 7 1410 -132 -1192 79 1183 382 -1132 -236 1095 449 -1072 -683 909
5504 909 833 -590 -955 394 928 -806 -1120 329 1029 -418 -1387 336 1244 124 -994 -412 1003
5521 1003 368 -1083 -558 1116 517 -841 -500 736 652 -625 -1151 413 1129 -565 -1134 342 717
5538 717 -343 -1145 -50 1131 209 -1149 -383 1191 717 -886 -436 1009 697 -707 -877 532 643
5555 643 -658 -714 355 960 -414 -1181 116 1056 134 -1112 -274 1083 251 -1176 -344 1084 725 -958
5573 -958 -957 977 708 -758 -734 433 1084 -544 -1079 279 1125 8 -1033 28 1150 230 -1042 -463
5591 -463 1163 174 -907 -664 856 632 -500 -649 500 851 -531 -863 514 803 -170 -875 238
5608 238 995 -60 -910 -178 1405 300 -954 -450 1088 650 -975 -520 915 684 -967 -678 537
5625 537 665 -504 -925 404 1222 -174 -842 205 1183 136 -1060 -187 916 143 -996 -286 860
5642 860 575 -675 -796 632 844 -602 -814 154 614 -345 -901 239 807 -281 -888 -24 1033 271
5660 271 -921 -327 1000 361 -866 -339 819 496 -870 -917 560 693 -370 -992 482 676 -215 -993
5678 -993 113 817 -79 -813 -336 735 121 -723 -441 796 386 -538 -616 812 747 -544 -820 574 1085
5697 1085 -316 -934 385 860 -58 -624 60 674 16 -1039 -399 829 304 -652 -429 656 652 -827
5715 -827 -790 594 645 -501 -791 112 860 -285 -859 -23 811 258 -922 -13 996 32 -983 -237 928
5734 928 263 -793 -680 462 748 -299 -568 406 723 -531 -873 220 802 -265 -621 53 930 223
5752 223 -730 -179 800 395 -802 -354 784 648 -594 -695 530 448 -496 -603 369 720 -268 -747 175
5771 175 928 -53 -1138 -338 798 299 -681 -153 1178 330 -697 -498 942 586 -460 -349 525 804
5789 804 -583 -616 -29 1165 -278 -930 2 756 25 -665 -367 707 195 -743 -201 692 673 -657 -555
5808 -555 560 784 -513 -326 305 482 -104 -638 505 883 -17 -566 -191 631 111 -710 -213 631 322
5827 322 -567 -493 319 668 -499 -742 470 523 -227 -684 196 886 31 -559 -42 878 177 -837 -103 689
5847 689 108 -777 -553 413 375 -725 -413 467 518 -375 -417 13 858 -568 -659 368 563 27 -928 -283
5867 -283 717 294 -752 -222 808 355 -578 -314 588 178 -628 -475 275 649 -299 -564 230 492 -458
5886 -458 -559 162 589 -53 -490 -38 869 166 -426 -360 558 286 -587 -595 216 578 -135 -363 201 417 -299
5907 -299 -568 440 741 -3 -463 124 597 -430 -698 -31 713 315 -619 -306 635 331 -184 -515 500
5926 500 409 -353 -262 342 553 -306 -358 241 513 -64 -770 80 344 -97 -628 -117 489 181 -626 -281 328
5947 328 361 -523 -536 505 219 -554 -439 83 580 -164 -832 78 690 205 -620 -154 552 161 -641 -189
5967 -189 561 288 -507 -409 504 376 -111 -448 331 435 91 -620 277 574 -29 -462 37 644 66 -800
5987 -800 39 680 383 -419 -376 447 269 -269 -346 358 589 -340 -536 255 522 -167 -474 211 481 -77 -542
6008 -542 -203 559 -65 -626 22 525 176 -533 -414 320 284 -317 -547 148 653 -153 -244 135 645 -430
6028 -430 -461 193 478 -123 -626 105 720 168 -514 -302 191 186 -441 -462 53 506 -246 -164 266 560 -357 -551
6050 -551 111 551 -231 -350 64 342 -71 -726 -364 629 44 -141 -210 546 57 -396 -192 389 284 -268
6070 -268 -349 122 175 239 -424 138 425 29 -453 44 649 232 -293 -233 361 363 -373 -176 313 343 -323 8
6092 8 308 272 -276 -314 -7 269 -2 -497 7 715 -32 -364 -101 584 282 -360 -103 561 376 -322 -79
6113 -79 144 310 -554 -593 394 270 2 -293 114 422 -169 -420 183 411 -18 -306 -194 -45 432 -223 117
6134 117 156 306 -64 -313 113 107 -109 -130 241 451 -136 -368 52 90 141 -357 -574 486 242 -378 -171 265
6156 265 104 -363 -477 -53 120 -203 -421 341 209 -173 -266 91 494 -294 -244 218 88 70 -189 -255 110
6177 110 38 -143 -403 55 458 -191 -331 124 121 -397 -319 202 271 -233 -362 165 164 -96 -590 -87 75 164 -203
6200 -203 -22 262 156 -123 -167 241 63 -133 -170 92 184 -385 -235 194 374 -29 -80 116 167 85 -448 77
6222 77 113 -45 -486 -144 28 318 -159 -279 132 450 -317 -94 146 15 202 -235 -219 406 -176 -226 74
6243 74 -28 -10 -265 -21 416 210 -570 -2 -36 241 -499 -231 80 114 -547 -211 23 120 -348 -206 -30 -90
6265 -90 -202 61 261 303 179 -183 -140 93 -17 -437 136 284 339 -117 -77 -53 96 -209 51 198 90 -95
6287 -95 -222 62 385 72 -297 226 88 -32 -95 138 44 156 -201 148 56 329 13 -194 -179 204 -243 -91
6309 -91 172 2 101 -144 -152 228 -55 -292 -78 331 295 -432 140 418 47 -197 -5 295 -103 46 -69 23
6331 23 -76 -276 -164 71 42 -206 -314 77 107 -191 -67 -145 66 18 -229 236 179 87 -32 -250 217 253 -294
6354 -294 -207 385 136 95 -80 -111 -24 -67 -141 -6 39 -72 -403 -175 10 199 -206 53 465 -33 -170 127
6376 127 238 39 234 44 -84 161 -99 -96 144 125 -20 -76 -113 408 26 -87 -183 295 -146 31 -166 136
6398 136 206 -218 -46 190 -44 -78 -122 -97 196 -215 -91 -72 206 52 -104 57 -2 7 -219 -106 63 144 -370
6421 -370 -3 151 -101 -279 -333 102 -99 -78 -23 220 321 -54 -136 115 178 -27 -316 100 228 42 -104 167
6443 167 150 102 22 -28 86 57 -145 -225 83 338 -6 -140 155 -43 -112 29 -65 224 -48 -261 -9 169 -67
6466 -67 -250 -75 253 -156 -85 89 206 98 -102 -7 254 67 12 -53 -90 -47 110 -307 108 117 -67 -75 23 499
6490 499 24 35 49 4 175 -554 -76 181 75 -98 -85 129 106 -81 -244 150 -50 127 170 93 446 -147
6512 -147 -379 -205 400 33 -400 138 151 -117 -125 86 335 -12 -80 -83 120 392 -407 -165 35 431 -221 -300
6534 -300 33 175 -68 -173 40 165 -175 -205 259 212 279 -179 -332 301 209 -330 -213 150 292 -77 -237
6555 -237 -30 -248 -125 -222 -43 286 356 -454 35 288 -4 -108 -87 218 173 -255 110 -130 122 -203 6
6576 6 -230 141 -161 50 92 49 228 -223 -215 241 199 -85 19 165 140 47 -90 -83 210 -117 -122 132 418 253
6600 253 -185 -52 205 272 87 79 533 -186 69 -236 200 -57 -40 -57 287 53 -226 -19 108 375 6 -160
6622 -160 37 210 -437 -44 -120 77 -50 284 -20 195 -240 -459 -63 145 95 -296 -49 212 -41 -267 -220
6643 -220 87 -151 39 -65 196 313 276 -17 34 227 -71 -247 338 297 7 -215 127 -90 15 -341 32
6664 32 76 166 -162 86 -59 112 -314 -250 75 163 -149 -471 111 76 -28 -38 85 405 -29 -286 48 101 213
6687 213 -15 -99 86 16 -174 75 -18 237 -22 -221 -84 328 136 -193 -22 -129 -30 -340 270 317 -106 -119
6709 -119 -132 260 34 -201 -125 -4 235 -343 259 198 208 -97 -411 244 197 -234 -401 32 315 -10 -130 96
6731 96 270 -115 -449 -94 153 24 -389 -89 351 223 -151 -60 63 136 -161 -161 356 7 -8 -487 80 103
6753 103 187 -265 -249 243 -71 -144 -71 407 259 -89 -20 272 28 80 -111 78 40 45 -387 276 99 -205 -401
6776 -401 80 190 356 -186 -72 305 72 -90 -66 266 307 -226 -179 337 -80 -282 -289 211 615 101 -519 -29
6798 -29 552 -123 -172 -278 151 71 -249 126 162 182 -203 -25 52 204 -179 -181 177 115 -303 -170 -86 155 -69
6821 -69 -293 -146 175 150 -304 -27 252 51 -128 -158 223 -67 -66 -80 17 50 -319 -355 80 145 -346 -171 -41
6844 -41 431 50 -326 -47 243 50 -550 201 419 560 -122 53 14 -258 -161 -78 153 270 -14 -221 239
6865 239 155 -110 -362 -115 256 146 -278 -105 308 62 -420 197 115 91 -192 -33 436 110 -46 -185 276
6886 276 -19 -69 -349 -120 332 -101 -8 214 265 -120 -43 112 232 142 -332 -453 342 111 -138 -17 454 218
6908 218 19 -153 309 374 -70 -270 -148 -181 -281 -182 -21 213 -216 7 -26 452 -143 -42 -364 78 317
6929 317 -79 89 219 351 -178 -299 -41 470 -29 -295 -22 435 -165 -580 -58 489 -14 -241 -15 282
6949 282 251 -276 54 160 204 -187 151 291 136 36 -289 -85 270 191 -222 165 134 -190 -380 1 226
6970 226 69 -463 -229 98 176 -277 -159 500 126 -22 -196 260 491 -250 -379 78 142 -99 -348 111 439
6991 439 -22 -170 19 171 -77 -254 -67 80 -41 -346 27 156 302 -95 -243 -83 76 -215 -387 -105
7011 -105 249 177 -125 -38 433 127 -191 145 367 437 -522 -267 244 271 -143 -146 99 239 38 -381 -8 163
7033 163 -11 -239 167 476 -94 -224 -103 347 -63 -190 -333 2 209 -156 -61 243 524 -453 -478 81 362
7054 362 -87 -367 -207 405 213 -354 -195 150 42 -179 42 308 467 -305 -125 514 274 -112 -210 -186 300
7075 300 41 -425 188 163 -221 -391 279 219 -96 -79 -184 437 -40 -438 -298 47 379 -71 -82 282 207 -91
7097 -91 -81 -75 356 -146 -520 393 342 -410 -389 84 3 -25 -330 -127 -17 257 -26 -313 353 392 -188 -410 201
7120 201 129 -58 -221 87 313 -66 -225 2 319 345 -352 -149 396 4 -366 -280 289 46 -101 -232 -5
7141 -5 244 -254 -301 210 331 -206 -411 203 322 26 -621 -49 246 -28 -184 -21 321 -161 -329 -334 222 -25
7163 -25 -287 -199 128 428 -161 -173 194 28 -311 -465 -4 405 394 -544 -139 280 70 -214 -571 260 -2
7184 -2 -97 42 214 323 -128 -123 11 346 -277 -480 253 320 -132 30 -28 189 264 -538 141 257 -10 -108 -60
7207 -60 408 127 -348 -360 182 320 -75 -371 66 477 -151 -240 136 536 263 -334 47 384 377 -123 -72 184
7229 184 206 -318 -121 230 142 -70 -517 98 339 21 -145 187 478 -188 -406 216 202 59 -215 -95 157
7250 157 284 -31 -424 82 103 -58 -215 361 206 -261 -177 51 -8 -201 -685 256 529 -53 -147 -292 703
7271 703 367 -485 -100 350 200 -405 2 196 166 -247 -338 251 414 -25 -230 311 425 116 -351 -119 221
7292 221 236 86 163 475 193 -156 -276 93 253 -122 -186 246 137 -106 -232 -51 106 11 -733 122 396
7313 396 64 -387 -151 667 128 -246 -551 320 92 -532 -284 228 244 -193 -424 509 349 -164 -641 251
7333 251 372 -230 -227 -3 273 7 -387 -161 377 242 -268 -62 26 63 -216 -188 59 205 -331 -381 248 411
7355 411 -87 -490 65 124 258 -175 -96 301 -201 -403 -134 84 -27 -184 -260 231 324 -120 -142 227 246 -438
7377 -438 -332 308 256 -73 -342 -23 322 -99 -193 -86 379 137 -371 31 339 348 -311 -281 314 29 -185 -144
7399 -144 218 532 -82 -494 261 -66 -40 -361 49 384 311 -817 -26 494 137 -70 -218 360 375 -288 -247
7420 -247 -79 382 13 -335 374 160 -388 -329 -96 190 172 -342 -109 608 -26 -210 -1 17 429 -334 -133
7441 -133 372 261 -78 -365 -26 30 -227 -414 220 478 133 -547 185 287 107 -223 41 71 125 -134 -335
7462 -335 271 473 -501 -209 159 276 -110 -318 291 35 -7 -211 15 312 -35 -327 182 456 -36 -344
7482 -344 -140 332 41 -412 -267 249 265 -304 -239 185 201 -62 -424 -12 583 -67 -432 -89 295 -32 -484
7503 -484 -141 402 -134 -124 -126 317 97 -548 -548 66 317 -187 -575 209 464 -195 -205 36 257 -166 -626 18
7525 18 296 132 -382 -266 428 50 -526 -168 455 285 5 -509 424 315 37 -302 2 374 -166 -198 -167
7546 -167 267 -184 -445 94 552 160 -339 -280 521 54 -247 -214 122 303 -333 -383 346 153 -221 -336 -328 475
7568 475 -153 -492 -55 427 46 -192 47 196 4 -380 -112 294 -24 -158 -128 318 478 -48 -99 48 435
7589 435 -142 -279 128 334 127 -478 -82 240 -299 -268 -211 259 73 -258 -60 220 375 -83 -563 361 452
7610 452 -157 -370 191 543 174 -262 60 537 348 -299 -133 299 169 169 20 261 238 -381 -335 290 400
7631 400 -254 -211 367 364 25 -301 -72 587 103 -411 -66 425 -149 -311 83 611 221 -417 -523 292 290 -264
7653 -264 -169 199 336 -289 -313 -56 367 -38 -329 -89 397 30 -367 -543 359 146 -374 -154 280 347 -414
7674 -414 -238 207 250 -136 -369 212 394 -256 -728 15 553 135 -402 178 246 285 -284 -53 308 -125 -146
7695 -146 42 334 317 -329 -26 197 542 -493 -517 256 362 -20 -189 191 281 78 -81 -217 547 173 -168
7716 -168 -493 170 339 -119 -207 429 485 -289 -390 20 415 -379 -183 103 345 135 -426 -212 175 263 -666
7737 -666 -98 447 235 38 -372 191 317 -261 -174 396 680 152 -327 142 442 -80 -240 164 446 106
7757 106 -185 -171 448 404 -627 -229 535 147 -444 -528 323 466 -297 -530 264 320 -89 -349 -62 198 -17
7778 -17 -224 -125 630 126 -453 -317 327 -56 -162 -59 380 232 -202 -180 79 247 -23 -248 47 374 150
7799 150 -359 -25 448 217 -296 -37 502 214 -180 -522 448 242 -408 -7 307 156 -247 -301 457 462 -113
7820 -113 -382 -111 479 -85 -315 -120 257 330 -387 16 508 226 -292 -252 355 43 -356 -418 288 19 -146
7841 -146 -189 52 416 176 -227 -257 259 263 -308 -176 187 71 -376 -41 387 -11 -535 -578 403 262 -223 -413
7863 -413 227 196 -56 -183 42 263 23 -37 -3 507 8 -490 105 270 283 -357 -183 271 279 -434 -264 305
7885 305 265 107 -515 12 376 31 -177 181 278 -35 -517 -154 284 489 -494 -149 252 146 -159 -308 163
7906 163 105 -203 -365 46 381 -62 -127 165 256 -82 -409 52 528 89 -452 -294 365 240 -239 -183 193
7927 193 302 -301 -120 67 489 -21 -484 10 332 -107 -609 173 257 -107 -400 112 587 -116 -414 -81
7947 -81 101 170 -482 -54 39 252 -326 -602 -25 358 -295 -435 207 331 173 -350 131 485 16 -510 -226
7968 -226 393 69 -177 -305 302 444 -191 -202 361 348 -114 -255 -8 336 -215 -315 64 248 -126 -153 -193
7989 -193 329 268 -182 33 276 177 -312 -192 281 290 -322 -282 398 381 -322 -426 73 294 -56 -335 -292 612
8011 612 146 -531 -130 135 113 -499 -516 204 293 -205 -270 328 188 -82 -366 334 128 -278 -424 128 143 -5
8033 -5 -33 -110 379 38 -385 -158 193 89 -346 -358 154 -256 -158 -298 319 318 91 -232 171 332 -134 -483 189
8056 189 296 -141 -64 40 255 229 -247 -179 285 183 -109 -418 -33 163 -276 -372 384 256 -87 -361 140
8077 140 376 -217 -299 -209 298 100 -182 0 256 171 -415 -84 206 498 127 -32 -109 250 -54 -67 183 -64
8099 -64 2 -292 83 623 -85 -530 -310 557 95 -264 -332 219 431 -85 -343 367 191 -252 -458 59 356
8120 356 -233 -400 161 338 86 -219 -78 498 -71 -433 -114 267 365 -267 -71 302 120 -236 -271 273 143
8141 143 -82 -574 177 90 238 -121 212 329 -1 -269 131 418 -69 -561 -199 316 195 -254 -83 150
8161 150 289 -89 -441 356 140 121 -452 173 383 -172 -456 120 265 244 -417 -22 332 -145 -210 -10 301
8182 301 193 -281 -350 357 266 73 -245 211 37
8191C7
##END NTUPLES=NMR FID
##END=
