##TITLE=1H_Pr 43-D
 200.13MHz, CDCl3,
 8 sc
 
 11.3.2025
##JCAMPDX= 6.0         $$ Bruker NMR JCAMP-DX V2.0
##DATA TYPE= NMR FID
##DATA CLASS= NTUPLES
##ORIGIN= UXNMR, Bruker Analytische Messtechnik GmbH
##OWNER= pz
$$ XWIN-NMR		Version 3.5
$$ Tue Mar 11 16:17:53 2025 Russian Standard Time (UT+4h)  she@DPX200
##.OBSERVE FREQUENCY= 200.1313
##.OBSERVE NUCLEUS= ^1H
##.DELAY= (6, 6)
##.ACQUISITION MODE= SIMULTANEOUS
##.ACQUISITION SCHEME= undefined
##.AVERAGES= 8
##.DIGITISER RES= 18
##SPECTROMETER/DATA SYSTEM= spect
##.PULSE SEQUENCE= zg30
##.SOLVENT NAME= CDCl3
##.SHIFT REFERENCE= (INTERNAL, CDCl3, 0, 14.3821)
##AUDIT TRAIL= $$ (NUMBER, WHEN, WHO, WHERE, WHAT)
$$ ##TITLE= Audit trail, XWIN-NMR		Version 3.5
$$ ##JCAMPDX= 5.01
$$ ##ORIGIN= Bruker BioSpin GmbH
$$ ##OWNER= she
$$ F:/spectra/data/she/nmr/H-C/1/audita.txt
$$ ##AUDIT TRAIL=  $$ (NUMBER, WHEN, WHO, WHERE, WHAT)
(   1,<2025-03-11 16:17:02.73 +0400>,<she>,<DPX200>,
      <created by zg, POWCHK disabled, PULCHK disabled
       configuration hash MD5:
       00 E9 B6 7A A2 85 ED C7 34 08 36 98 17 FE 4E 26
       data hash MD5: 16K
       BF CD 1C 76 9E 0F 22 07 A0 23 D0 56 9E 8D F8 20>)
$$ ##END=
$$ 
$$ hash MD5
$$ 9C 1A FD 05 02 15 83 52 88 48 C0 1F D3 AA 35 3C
##$RELAX= 
##$RELAX= 
##$RELAX= 
##$RELAX= 
##$RELAX= 
##$RELAX= 
$$ Bruker specific parameters
$$ --------------------------
##$DU= <F:/spectra>
##$EXPNO= 1
##$NAME= <H-C>
##$PROCNO= 1
##$TYPE= <nmr>
##$USER= <she>
##$AMP= (0..31)
100 100 100 100 100 100 100 100 100 100 100 100 100 100 100 100 100 100 
100 100 100 100 100 100 100 100 100 100 100 100 100 100 
##$AQSEQ= 0
##$AQ_mod= 1
##$AUNM= <au_zg>
##$AUTOPOS= <>
##$BF1= 200.13
##$BF2= 200.13
##$BF3= 200.13
##$BF4= 200.13
##$BF5= 200.13
##$BF6= 200.13
##$BF7= 200.13
##$BF8= 200.13
##$BYTORDA= 1
##$CFDGTYP= 0
##$CFRGTYP= 5
##$CHEMSTR= <none>
##$CNST= (0..31)
1 1 145 1 1 1 1 1 1 1 1 1 1 1 1 1 1 1 1 1 1 1 1 1 1 1 1 1 1 1 1 1 
##$CPDPRG= <>
##$CPDPRG1= <>
##$CPDPRG2= <>
##$CPDPRG3= <>
##$CPDPRG4= <mlev>
##$CPDPRG5= <mlev>
##$CPDPRG6= <mlev>
##$CPDPRG7= <mlev>
##$CPDPRG8= <mlev>
##$CPDPRGB= <>
##$CPDPRGT= <>
##$D= (0..31)
0 0.7 0 0 0 0 0 0 0 0 0 0.03 0 0 0 0 0 0 0 0 0 0 0 0 0 0 0 0 0 0 0 0 
##$DATE= 1741695422
##$DBL= (0..7)
120 120 120 120 120 120 120 120 
##$DBP= (0..7)
150 150 150 150 150 150 150 150 
##$DBP07= 0
##$DBPNAM0= <>
##$DBPNAM1= <>
##$DBPNAM2= <>
##$DBPNAM3= <>
##$DBPNAM4= <>
##$DBPNAM5= <>
##$DBPNAM6= <>
##$DBPNAM7= <>
##$DBPOAL= (0..7)
0.5 0.5 0.5 0.5 0.5 0.5 0.5 0.5 
##$DBPOFFS= (0..7)
0 0 0 0 0 0 0 0 
##$DE= 6
##$DECBNUC= <off>
##$DECIM= 32
##$DECNUC= <off>
##$DECSTAT= 4
##$DIGMOD= 1
##$DIGTYP= 9
##$DL= (0..7)
0 120 120 120 120 120 120 120 
##$DP= (0..7)
150 150 150 150 150 150 150 150 
##$DP07= 0
##$DPNAME0= <>
##$DPNAME1= <>
##$DPNAME2= <>
##$DPNAME3= <>
##$DPNAME4= <>
##$DPNAME5= <>
##$DPNAME6= <>
##$DPNAME7= <>
##$DPOAL= (0..7)
0.5 0.5 0.5 0.5 0.5 0.5 0.5 0.5 
##$DPOFFS= (0..7)
0 0 0 0 0 0 0 0 
##$DQDMODE= 0
##$DR= 18
##$DS= 0
##$DSLIST= <SSSSSSSSSSSSSSS>
$$ [...]
##$SUBNAM0= <"">
##$SUBNAM1= <"">
##$SUBNAM2= <"">
##$SUBNAM3= <"">
##$SUBNAM4= <"">
##$SUBNAM5= <"">
##$SUBNAM6= <"">
##$SUBNAM7= <"">
##$SUBNAM8= <"">
##$SUBNAM9= <"">
##$SW= 18.0517328524113
##$SWIBOX= (0..15)
0 0 2 0 0 0 0 0 0 0 0 0 0 0 0 0 
##$SW_h= 3612.71676300578
##$TD= 16384
##$TD0= 1
##$TE= 0
##$TE2= 300
##$TE3= 300
##$TEG= 300
##$TL= (0..7)
0 120 120 120 120 120 120 120 
##$TP= (0..7)
150 150 150 150 150 150 150 150 
##$TP07= 0
##$TPNAME0= <>
##$TPNAME1= <>
##$TPNAME2= <>
##$TPNAME3= <>
##$TPNAME4= <>
##$TPNAME5= <>
##$TPNAME6= <>
##$TPNAME7= <>
##$TPOAL= (0..7)
0.5 0.5 0.5 0.5 0.5 0.5 0.5 0.5 
##$TPOFFS= (0..7)
0 0 0 0 0 0 0 0 
##$TUNHIN= 0
##$TUNHOUT= 0
##$TUNXOUT= 0
##$USERA1= <user>
##$USERA2= <user>
##$USERA3= <user>
##$USERA4= <user>
##$USERA5= <user>
##$V9= 5
##$VALIST= <valist>
##$VCLIST= <CCCCCCCCCCCCCCC>
##$VD= 0
##$VDLIST= <DDDDDDDDDDDDDDD>
##$VPLIST= <PPPPPPPPPPPPPPP>
##$VTLIST= <TTTTTTTTTTTTTTT>
##$WBST= 1024
##$WBSW= 4
##$XGAIN= (0..3)
0 0 0 0 
##$XL= 0
##$YL= 0
##$YMAX_a= 116184
##$YMIN_a= -161546
##$ZGOPTNS= <>
##$ZL1= 120
##$ZL2= 120
##$ZL3= 120
##$ZL4= 120
##$ABSF1= 10
##$ABSF2= 0
##$ABSG= 5
##$ABSL= 3
##$ALPHA= 0
##$AQORDER= 0
##$ASSFAC= 0
##$ASSFACI= 0
##$ASSFACX= 0
##$ASSWID= 0
##$AUNMP= <proc_1d>
##$AZFE= 0.1
##$AZFW= 0.1
##$BCFW= 1
##$BC_mod= 2
##$BYTORDP= 1
##$COROFFS= 0
##$CY= -3
##$DATMOD= 1
##$DC= 2
##$DFILT= <>
##$DTYPP= 0
##$F1P= 0
##$F2P= 0
##$FCOR= 0.5
##$FTSIZE= 0
##$FT_mod= 4
##$GAMMA= 1
##$GB= 0.15
##$INTBC= 1
##$INTSCL= 1
##$ISEN= 128
##$LB= 0.25
##$LEV0= 0
##$LPBIN= 0
##$MAXI= 10000
##$MC2= 0
##$MEAN= 0
##$ME_mod= 0
##$MI= 1.114404
##$NCOEF= 0
##$NC_proc= 0
##$NLEV= 6
##$NOISF1= 3.799351
##$NOISF2= 2.8
##$NSP= 1
##$NTH_PI= 0
##$NZP= 0
##$OFFSET= 14.38212
##$PC= 1
##$PHC0= -468.3164
##$PHC1= 11.19221
##$PH_mod= 1
##$PKNL= yes
##$PPARMOD= 0
##$PSCAL= 0
##$PSIGN= 0
##$REVERSE= no
##$SF= 200.129724274929
##$SI= 16384
##$SIGF1= 3
##$SIGF2= 2
##$SINO= 400
##$SIOLD= 16384
##$SREGLST= <1H.CDCl3>
##$SSB= 0
##$STSI= 0
##$STSR= 0
##$SW_p= 3205.1282051282
##$SYMM= 0
##$S_DEV= 0
##$TDeff= 0
##$TDoff= 0
##$TI= <>
##$TILT= no
##$TM1= 0
##$TM2= 0
##$TOPLEV= 0
##$USERP1= <user>
##$USERP2= <user>
##$USERP3= <user>
##$USERP4= <user>
##$USERP5= <user>
##$WDW= 1
##$XDIM= 8192
##$YMAX_p= 0
##$YMIN_p= 0
$$ End of Bruker specific parameters
$$ ---------------------------------
##NTUPLES= NMR FID
##VAR_NAME=  TIME,          FID/REAL,        FID/IMAG
##SYMBOL=    X,             R,               I
##VAR_TYPE=  INDEPENDENT,   DEPENDENT,       DEPENDENT
##VAR_FORM=  AFFN,          ASDF,            ASDF
##VAR_DIM=   8192,          8192,            8192
##UNITS=     SECONDS,       ARBITRARY UNITS, ARBITRARY UNITS
##FACTOR=    0.0002768,     1,               1
##FIRST=     0,             0,               0
##LAST=      2.2672688,     0,               0
##MIN=       0,             -161546,         0
##MAX=       2.2672688,     116184,          0
$$ Real data points
##PAGE= N=1
##DATA TABLE= (X++(R..R)), XYDATA
$$ plain form
0 0 0 0 0 0 0 0 0 0 0 0 0 0 0 0 0 0 0 0 0 0 0 0 7 -8 8 -8 8 -8 8 -12 15 -16 16 -20 23 -24 29 -31 36 -39 44 -49 53
43 53 -60 66 -74 81 -89 98 -109 119 -131 144 -160 177 -194 217 -242 271 -303 346 -397 460 -545
64 -545 661 -837 1118 -1667 3128 -16471 -46352 -39211 -8311 55273 102151 116184 112055 101555
78 101555 67569 29332 8630 -11657 -54684 -85093 -75354 -52889 -43873 -27045 -4649 -8296 -26741
91 -26741 -13896 25113 49547 54266 55863 39307 238 -26876 -22599 -14443 -17575 -19884 -23149 -37042
105 -37042 -42017 -23868 -6008 -4603 -1384 9433 13008 17366 41245 64681 58645 38364 30828
118 30828 26302 12695 5668 6035 -13144 -52973 -77388 -72028 -54552 -29974 5399 32147 30144
131 30144 14747 6429 -762 -13029 -17236 -12098 -10073 -4330 16065 35474 35187 23621 11286 -7916
$$ packed form
0@%%%%%%%%%%%%%%%%%%%%%%Pj5J6j6J6j6J6k0K7l1L2l6M3m7N3o0O7p5Q3r3J02
43E3j13J26j40J55j70J87k07K28k50K75l04L37l71M11m59N13n74O49p43Q57j005
64e45J206j498J955k785M795j9599k9881P141L0900O3584M6878J4033m129j0500
78A01555l3986l8237k0702k0287m3027l0409R739K2465R016J6828K2396l647j8445
91b6741J2845L9009K4434M719J597j6556l9069k7114M277Q156l132k309l265j3893
105c7042m975J8149J7860J405L219J0817L575M358K3879K3436o036k0281p536
118C0828m526j3607p027L67j9179l9829k4415N360J7476K4578L5373K6748k003
131C0144j5397q318p191j2267m207N138K025N743K0395J9409k87j1566j2335j9202
$$ plain form
145 -7916 -26515 -20192 5321 20444 20081 19168 13702 -3933 -14964 -6251 3164 -1548 -6215 -4878
159 -4878 -9619 -18645 -18404 -14096 -17611 -19499 -7239 9862 22514 32774 36107 21900 -1599 -16206
173 -16206 -20356 -22120 -17720 -6523 -1769 -6284 -5754 5433 13231 14963 19266 22307 15004 5091 4033
188 4033 5665 682 -3863 -1995 -1053 -4035 -4149 -3520 -12199 -27040 -35877 -36348 -31214 -16114 7123
203 7123 25063 31811 33832 32375 24042 14399 10838 7959 -945 -7705 -8195 -10593 -17070 -19360 -16243
218 -16243 -14953 -13533 -4298 6895 11459 11062 9587 5064 -1398 -2036 4504 11400 15402 17271 14499
233 14499 4321 -7744 -16606 -23256 -27065 -24753 -16331 -7914 -58 8445 14599 15168 13684 14111 13959
248 13959 10546 7141 5098 349 -6786 -10713 -9953 -8012 -5690 -765 2983 1668 -2155 -5455 -8740
$$ packed form
145g916j8599O323K5513J5123l63r13n466j7635j1031Q713R415m712m667J337
159d878m741r026K41M308l515j888J2260J7101J2652J0260L333j4207k3499j4607
173a6206m150j764M400J1197M754m515N30J1187P798J732M303L041p303r913j058
188D033J632m983m545J868R42k982j14O29q679j4841q837m71N134J5100K3237
203G123J7940O748K021j457q333r643l561k879q904o760m90k398o477k290L117
218a6243J290J420R235J1193M564l97j475m523o462o38O540O896M002J869k772
233A4499j0178j2065q862o650l809K312Q422Q417P856Q503O154N69j484M27j52
248A3959l413l405k043m749p135l927P60J941K322M925L748j315l823l300l285
$$ plain form
263 -8740 -11281 -9505 -3000 3733 10093 15522 17436 14129 8640 3110 -2938 -7748 -9340 -8540 -8257 -7568
279 -7568 -4946 -2422 -1273 717 4579 6710 6132 4794 2772 -939 -4947 -6357 -4996 -1612 2341
294 2341 6724 9374 8875 5423 477 -4593 -8785 -10534 -9472 -6227 -2147 1938 4631 6018 6241 5542
310 5542 3711 1431 -167 -1661 -3782 -4955 -4413 -2229 -694 1563 4575 6670 6210 4569 1994 -2000
326 -2000 -6243 -8918 -8482 -6226 -2410 2004 4945 5689 4930 3014 595 -917 -2191 -3661 -4347 -3498
342 -3498 -1681 633 3034 5316 6340 5600 4535 3487 1775 -703 -4318 -7093 -8607 -7801 -4555 234
358 234 5301 7629 6832 4082 1152 -1887 -4067 -5499 -6003 -5444 -3702 -589 3355 6264 6871 4475
374 4475 158 -3424 -5370 -5312 -3357 -726 922 2133 4179 6782 9032 9033 7231 3527 -1256 -4712
$$ packed form
263h740k541J776O505O733O360N429J914l307n489n530o048m810j592Q00K83O89
279g568K622K524J149J990L862K131n78j338k022l711m008j410J361L384L953
294B341M383K650m99l452m946n070m192j749J062L245M080M085K693J387K23o99
310E542j831k280j598j494k121j173N42K184J535K257L012K095m60j641k575l994
326b000m243k675M36K256L816M414K941P44p59j916k419j512j274j470o86Q49
342c498J817K314K401K282J024p40j065j048j712k478l615k775j514Q06L246M789
358B34N067K328p97k750k930l039k180j432n04N59J742L113L944K909O07k396
374D475m317l582j946N8J955K631J648J211K046K603K250Jj802l704m783l456
$$ plain form
390 -4712 -5282 -4836 -4103 -4626 -5934 -6960 -6091 -2952 372 2623 2810 1152 -1508 -2719 -1680 -173 918
407 918 1350 2102 3752 6241 9233 10278 8009 2097 -4447 -8552 -8772 -5861 -1570 2043 3576 3592 3566
424 3566 4047 3826 1452 -2594 -7634 -11178 -10836 -7029 -2040 1890 3753 2842 321 -460 586 1325 103
441 103 -1104 -2302 -2131 882 6002 9829 9549 6354 3007 -174 -701 1242 3073 2053 -1197 -4527
457 -4527 -6434 -6100 -3880 -1934 -1457 -2620 -2794 -1562 -447 222 -1683 -5188 -9395 -10094 -5471 2165
473 2165 9253 13449 13523 9434 4107 596 -646 -1188 -1800 -1613 -996 440 3547 6655 6503 2518 -2502
490 -2502 -6793 -8961 -7711 -3759 -1102 -1602 -2524 -2644 -1748 169 3013 3887 915 -3109 -4792 -4182 -2439
507 -2439 587 2958 2773 1650 2135 4224 6007 6655 6076 3987 838 -399 736 1373 408 -1369 -3760
$$ packed form
390d712n70M46P33n23j308j026Q69L139L324K251J87j658k660j211J039J507J091
407I18M32P52J650K489K992J045k269n912o544m105k20K911M291L613J533J6k6
424C566M81k21k374m046n040l544L42L807M989L930J863r11k521p81J046P39j222
441A03j207j198J71L013N120L827k80l195l347l181n27J943J831j020l250l330
457d527j907L34K220J946M77j163j74J232J115O69j905l505m207o99M623P636
473B165P088M196P4m089n327l511j242n42o12J87O17J436L107L108j52l985n020
490b502m291k168J250L952K657n00r22j20Q96J917K844Q74k972m024j683O10J743
507b439L026K371j85j123M85K089J783O48n79k089l149j237J135O37r65j777k391
$$ plain form
524 -3760 -5361 -4896 -1476 1888 2087 -538 -4310 -8032 -10584 -8761 -4568 -577 2121 5167 7383 7851
540 7851 6933 5294 2075 -2536 -4939 -3687 -296 3336 7029 7257 4060 27 -1759 -2364 -2848 -2114
556 -2114 -1115 -2164 -3038 -2315 -875 -41 94 688 195 -681 -509 572 8 -2398 -3930 -4654 -4823 -2527
574 -2527 1451 4366 5264 4387 3605 2181 1231 2013 2839 2124 658 205 97 -327 182 1090 650 -1186
592 -1186 -2279 -2616 -3634 -4944 -5291 -4970 -4802 -2740 1353 4997 6407 6503 5099 1452 -1914 -3045 -2286
609 -2286 -1685 -541 1251 2140 1457 1263 1151 42 -1414 -1223 -257 -235 285 1585 1237 -91 -613 94
627 94 746 1012 1731 1800 -316 -2956 -4242 -5172 -5486 -3555 -719 1820 3200 4186 4420 2958 1014 -98
645 -98 -349 -1053 -597 686 1288 668 415 413 -444 -917 -346 197 -122 -1101 -1227 -1779 -2899 -2372 -367 920
$$ packed form
524c760j601M65L420L364J99k625l772l722k552J823M193L991K698L046K216M68
540G851r18j639l219m611k403J252L391L632L693K28l197m033j786o05m84P34
556b114R99j049q74P23J440Q34J35N94m93q76J72J081n64k406j532p24j69K296
574b527L978K915Q98q77p82j424r50P82Q26p15j466m53j08m24N09R08m40j836
592a186j093l37j018j310l47L21J68K062M093L644J410R6j404l647l366j131P59
609b286O01J144J792Q89o83j94j12j109j456J91R66K2N20J300l48j328n22P07
627I4O52K66P19O9k116k640j286r30l14J931K836K539J380R86K34j462j944j112
645i8k51p04M56J283O02o20k53kq57m73N71N43l19r79j26n52j120N27K005J287
$$ plain form
665 920 2182 3490 4067 2226 153 -1164 -2511 -3486 -2750 -682 507 1215 2102 2175 1006 -159 -689
682 -689 -914 -1506 -1322 -415 -245 -488 -144 388 462 1332 2535 3072 2319 986 -766 -2458 -3689 -3375 -1951
701 -1951 -689 676 1784 2120 1165 101 -386 -1010 -1783 -1172 103 1258 1549 2120 2076 660 -129 6
719 6 34 -464 -670 -1028 -1788 -3026 -2850 -2007 -1019 631 2676 3497 3424 2980 1950 79 -1325 -1808 -1910 -1456
739 -1456 -534 892 1192 514 -303 -953 -1689 -2221 -1543 -534 -114 227 838 1289 1348 1625 2146 2157 1709 1049
759 1049 230 -1308 -2498 -3038 -3116 -2607 -1524 126 1270 1469 1660 1376 424 -675 -781 -213 15 571
777 571 1364 1820 1255 1118 585 87 -293 -105 -367 -1225 -1561 -1580 -1521 -1001 -198 900 1505 1758 1502 1071 71
798 71 -829 -1362 -1857 -1870 -879 214 888 1120 913 338 -490 -920 -859 -662 -143 78 116 474 597 1060 1514
$$ packed form
665I20J262J308N77j841k073j317j347r75P36K068J189P08Q87P3j169j165n30
682f89k25n92J84R07J70k43L44N32P4Q70J203N37p53j333j752j692j231L14J424
701a951J262J365J108L36r55j064m87o24p73O11J275J155K91N71m4j416p89J35
719FK8m98k06l58p60j238J76Q43R88J650K045Q21p3m44j030j871j404m83j02M54
739a456R22J426L00o78q17o50p36n32O78J009M20L41O11M51N9K77N21J1m48o60
759A049q19j538j190n40p8N09J083J650J144J99J91k84r52j099j06N68K28N56
777E71P93M56n65j37n33m98l80J88k62q58l36j9N9N20Q03J098O05K53k56m31j000
798G1r00n33m95j3R91J093O74K32k07n75q28m30O1J97N19K21L8L58J23M63M54
$$ plain form
819 1514 2237 2282 1853 1251 163 -494 -1497 -2316 -2949 -2819 -1965 -1140 -109 644 665 -236 -972 -1477 -1334 -658
839 -658 339 1474 2029 2087 2503 2434 1954 1296 310 -810 -1513 -1740 -1598 -1227 -749 -305 -186 -194 735 1189 1522
860 1522 1290 475 -450 -1089 -1329 -947 -917 -805 -982 -1268 -1141 -995 -419 -127 -175 -197 -133 133 810 1683 2556
881 2556 2768 2606 2416 2361 1993 1269 195 -1401 -2719 -3682 -3326 -2336 -1266 -399 275 102 -400 -294 -242
900 -242 -511 -737 -614 -644 -44 658 1576 1773 1447 676 -44 -533 -356 212 425 367 523 580 943 1451 1387 1248
922 1248 857 10 -461 -698 -807 -1137 -1577 -2063 -2471 -2095 -1483 -376 333 609 286 186 -78 -89 146 26
942 26 135 191 599 1132 1917 2193 1984 1267 273 -263 -880 -778 -385 -275 -93 128 334 205 129 -293 -550
963 -550 -1365 -1790 -1954 -1659 -1164 -464 -74 256 726 855 1132 1449 1073 689 108 -84 137 342 562 668
$$ packed form
819A514P23M5m29o02j088o57j003q19o33J30Q54Q25J031P53K1r01p36n05J43O76
839f58R97J135N55N8M16o9m80o58r86j120p03k27J42L71M78M44J19qR29M54L33
860A522k32q15r25o39k40L82L0J12j77k86J27J46N76K92m8k2O4K66O77Q73Q73
881B556K12j62j90n5l68p24j074j596j318r63L56R90J070Q67O74j73n02J06N2
900b42k69k26J23l0O00P02R18J97l26p71p20m89J77N68K13n8J56N7L63N08o4j39
922A248l91q47m71k37j09l30m40m86m08L76O12J107P09K76l23j00k64j1K35j20
942B6J09N6M08N33P85K76k09p17r94n36o17J02L93J10J82K21K06j29p6m22k57
963e50q15m25j64K95M95P00L90L30M70J29K77L17l76l84n81j92K21K05K20J06
$$ plain form
983 668 697 364 37 317 258 8 -185 -631 -775 -774 -830 -530 -288 -317 -150 127 198 -110 -222 -394 -822 -1238 -1227
1006 -1227 -831 -394 557 1201 1596 1335 1322 1053 428 19 -54 -157 -181 -125 298 340 248 41 -85 -483 -444 -469
1028 -469 -698 -596 -794 -618 -722 -363 78 459 699 899 827 324 -120 -456 -636 -579 -379 127 764 1081 1067
1049 1067 789 288 -30 -299 -309 -390 -275 -450 -234 -126 12 67 164 326 133 240 456 160 -122 -372 -527
1070 -527 -767 -387 152 599 824 663 462 -47 -425 -364 -619 -474 -258 -37 225 394 871 821 507 148 31
1091 31 -98 -240 -296 -535 -654 -828 -589 -269 46 664 749 683 154 -109 -545 -474 -191 139 534 688 755 701
1113 701 467 5 -438 -729 -1056 -1002 -521 -140 242 223 93 241 58 458 831 827 783 362 80 -355 -594 -763
1135 -763 -482 -697 -199 109 332 349 322 -191 -657 -734 -345 -58 495 987 1018 805 586 319 142 -43 -359
$$ packed form
983F68K9l33l27K80n9k50j93m46j44Jn6L00K42k9J67K77P1l08j12j72m28m16J1
1006a227L96M37R51O44L95k61j3k69o25m09p3j03k4N6M23M2r2k07j26l98L9k5
1028d69k29J02j98J76j04L59M41L81K40K00p2n03m44l36j80N7K00N06O37L17j4
1049A067k78n01l18k69j0q1J15j75K16J08J38N5R7J62j93J07K16k96k82k50j55
1070e27k40L80N39M47K25j61k01n09l78O1k55J45K16K21K62J69M77n0l14l59j17
1091C1j29j42n6k39j19j74K39L20L15O18Q5o6n29k63m36P1K83L30L95J54O7n4
1113G01k34m62m43k91l27N4M81L81L82j9j30J48j83M00L73mm4m21k82m35k39j69
1135g63K81k15M98L08K23J7k7n13m66p7L89K87N53M92L1k13k19k67j77j85l16
$$ plain form
1156 -359 -616 -702 -573 -821 -535 -271 -49 183 383 635 574 582 112 -87 -346 -596 -336 -37 346 544 570 113
1178 113 -122 -479 -530 -88 -74 268 293 435 356 279 234 221 209 218 51 12 -44 -368 -710 -734 -947 -859 -447 286 633
1203 633 650 672 131 -296 -444 -483 -286 17 208 532 501 701 521 320 118 69 65 217 122 57 -118 -287 -381
1226 -381 -336 -280 -352 -155 -197 -382 -539 -711 -981 -728 -426 130 508 705 823 985 669 355 -125 -147 -109 -117 22
1249 22 187 324 -72 192 113 385 334 328 237 233 23 -214 -718 -742 -670 -583 -420 -484 -485 -683 -848 -793 -672 -678 -291 381
1275 381 684 1352 1356 1191 1207 947 466 537 392 104 -187 -349 -546 -858 -641 -659 -561 -41 281 115 192 53
1297 53 -102 -467 -432 -442 -335 -266 -145 -97 -84 -153 -440 -489 -377 -290 73 670 981 1175 1081 1169 1020 819 764 548
1321 548 198 -154 -520 -789 -886 -931 -1144 -1077 -710 -634 -501 -245 -141 -108 -171 -121 51 304 613 580 676 522 245
$$ packed form
1156c59k57q6J29k48K86K64K22K32K00K52o1Qm70j99k59k50K60K99L83J98K6m57
1178A13k35l57n1M42J4L42K5J42p9p7m5j3j2Rj67l9n6l24l42k4k13Q8M12P33L47
1203F33J7K2n41m27j48l9J97L03J91L24l1K00j80k01k02m9mJ52r5o5j75j69r4
1226c81M5N6p2J97m2j85j57j72k70K53L02N56L78J97J18J62l16l14m80k2L8qJ39
1249B2J65J37l96K64p9K72n1or1mk10k37n04k4P2Q7J63o4jj98j65N5J21oL87O72
1275C81L03O68Mj65J6k60m81P1j45k88k91j62j97l12K17j8R8N20L22j66P7j39
1297E3j55l65L5j0J07O9J21M8J3o9k87m9J12Q7L63N97L11J94r4Q8j49k01n5k16
1321E48l50l52l66k69r7m5k13O7L67P6J33K56J04L3o3N0J72K53L09l3R6j54k77
$$ plain form
1344 245 208 240 135 130 72 -71 222 7 150 233 75 417 329 149 295 -11 -360 -624 -906 -923 -915 -703 -261
1367 -261 -182 1 55 -96 -102 -284 -202 -143 158 374 391 673 618 628 649 548 464 410 348 252 267 -129 -313 -327 -334 -483
1393 -483 -515 -242 -383 -388 -329 -650 -348 -353 -151 100 272 657 690 732 570 427 319 245 129 54 -115 -151 -114 -292
1417 -292 -280 3 -34 307 281 466 436 271 163 -19 -101 -241 -77 67 -68 -198 -180 -223 -635 -558 -651 -691 -279
1440 -279 -170 95 350 490 503 574 683 486 366 252 133 13 -59 -83 -272 -297 -238 -242 -356 -241 -411 -308 -397
1463 -397 -320 -247 28 176 266 446 477 350 452 283 103 217 10 -116 -258 -285 -276 -342 -408 -315 -262 -170 -8 68
1487 68 -47 33 0 -26 188 93 502 512 412 296 189 -36 -106 -425 -483 -586 -797 -689 -457 -155 87 244 375
1510 375 249 332 533 765 606 521 288 340 -53 -48 -155 -402 -474 -651 -855 -710 -668 -395 -289 -5 148 375
$$ packed form
1344B45l7L2j05nn8j43K93k15J43Q3j58L42q8j80J46l06l49k64k82j7QK12M42
1367b61P9J83N4j51oj82Q2N9L01K16J7K82n5J0K1j01q4n4o2r6J5l96j84j4pj49
1393d83l2K73j41nN9l21L02nK02K51J72L85L3M2j62j43j08p4j16p5j69l6L7j78
1417b92J2K83l7L41k6J85l0j65j08j82q2j40J64J44j35j30J8m3m12P7r3m0M12
1440b79J09K65K55J40J3P1J09j97j20j14j19j20p2k4j89k5N9mj14J15j70J03q9
1463c97P7P3K75J48R0J80L1j27J02j69j80J14k07j26j42k7Ro6o6R3N3R2J62P6
1487F8j15Q0l3k6K14r5M09J0j00j16j07k25p0l19n8j03k11J08K32L02K42J57J31
1510C75j26Q3K01K32j59q5k33N2l93Nj07k47p2j77k04J45M2K73J06K84J53K27
$$ plain form
1532 375 637 968 931 781 669 432 392 67 -39 -282 -620 -779 -906 -803 -669 -433 -52 -204 -56 215 446
1553 446 459 626 585 673 450 548 282 341 22 -87 -414 -855 -867 -841 -607 -285 -370 -16 116 331 598 599 439
1576 439 543 309 501 147 264 324 59 -158 -181 -282 -449 -231 -473 -341 -299 -298 36 230 -26 135 227 140
1598 140 170 308 255 295 229 -17 -233 -254 -268 -293 -84 10 -119 -11 -10 -64 -76 -85 -135 218 -68 70 -6 382 249
1623 249 439 371 281 1 -137 -213 -301 -420 -463 -523 -443 -479 -366 -245 -253 -285 -190 40 215 248 475 599 603 600 708 518
1649 518 360 426 195 -125 -252 -357 -439 -564 -684 -532 -414 -267 -238 -67 264 475 216 206 114 -41 -88 240
1671 240 61 -151 -140 -196 -303 -143 -329 -400 -303 -235 66 221 282 473 596 594 556 725 458 295 77 -196 -335
1694 -335 -284 -589 -644 -772 -718 -507 -557 -379 -487 -170 -166 192 366 472 476 484 524 605 760 362 406 129 183 -30 -116
$$ packed form
1532C75K62L31l7j50j12k37m0l25j06k43l38j59j27J03J34K36L81j52J48K71K31
1553D46J3J67m1Q8k23R8k66N9l19j09l27m41j2K6K34L22q5L54J32K15K67Jj60
1576D39J04k34J92l54J17O0k65k17k3j01j67K18k42J32M2JL34J94k56J61R2q7
1598A40L0J38n3M0o6k46k16k1j4k5K09R4j29J08Jn4j2rn0L53k86J38p6L88j33
1623B49J90o8r0k80j38p6q8j19m3o0Q0l6J13J21ql2R5K30J75L3K27J24MlJ08j90
1649E18j58O6k31l20j27j05q2j25j20J52J18J47K9J71L31K11k59j0r2j55m7L28
1671B40j79k12J1n6j07J60j86p1R7O8L01J55O1J91J23kl8J69k67j63k18k73j39
1694c35N1l05n5j28N4K11n0J78j08L17ML58J74J06MQM0Q1J55l98M4k77N4k13q6
$$ plain form
1719 -116 -138 -307 -348 -376 -263 -286 -47 -141 -121 -94 105 -132 116 -227 -156 -220 -191 -16 -27 -116 -7 -287 -134 -215
1743 -215 -77 28 -33 383 321 492 377 695 381 379 424 392 227 87 -47 -72 -223 -292 -515 -601 -500 -513 -394
1766 -394 -443 -315 -138 -246 -197 -80 102 260 262 342 405 501 483 352 272 131 121 -32 -103 -43 -137 31 -28 -151 -327
1791 -327 -188 26 -67 -146 -101 -173 -160 -123 -246 213 -218 45 13 -97 21 -182 76 -51 -10 -78 -55 238 58
1814 58 185 307 75 139 63 268 321 105 55 243 -20 11 201 -93 -153 -199 -159 -401 -449 -416 -515 -346 -258 -397
1838 -397 -54 236 237 377 259 463 359 503 287 340 231 172 58 -13 -182 -205 -215 -310 -377 -472 -206 -146 -7 -27
1862 -27 -88 283 274 259 162 252 74 302 -10 -79 -88 -268 -318 -336 -159 -148 -234 -187 40 62 203 318 211 463 408 167
1888 167 146 162 -2 -102 45 50 -293 -183 -250 -399 -343 -257 -248 131 0 -149 267 163 79 93 264 139 153 90
$$ packed form
1719a16k2j69m1k8J13k3K39r4K0K7J99k37K48l43P1o4K9J75j1q9J09k80J53q1
1743b15J38J05o1M16o2J71j15L18l14kM5l2j65j40j34k5j51o9k23q6J01j3J19
1766c94m9J28J77j08M9J17J82J58KQ0O3R6j8j31q0j41j0j53p1O0r4J68n9j23j76
1791c27J39K14r3p9M5p2J3L7j23M59m31K63l2j10J18k03K58j27M1o8K3K93j80
1814E8J27J22k32O4p6K05N3k16n0J88k63L1J90k94o0m6M0k42m8L3r9J69Q8j39
1838c97L43K90JJ40j18K04j04J44k16N3j09n9j14p1j69k3j0r5o7r5K66O0J39k0
1862b7o1L71rj5r7R0j78K28l12o9rj80n0j8J77J1q6M7K27K2J41J15j07K52n5k41
1888A67k1J6j64j00J47Nl43J10o7j49N6Q6RL79j31j49M16j04q4J4J71j25J4o3
$$ plain form
1912 90 -93 84 -34 68 -131 -98 -138 -126 -146 -91 -121 -1 -58 -79 -34 37 103 70 147 101 235 96 51 86 -169 -130
1938 -130 -82 22 62 -109 34 -131 -105 -191 -175 -277 -60 -50 9 204 -114 197 136 195 177 106 150 73 20 -142 -125
1963 -125 -252 -201 -314 -131 -142 -38 -60 19 -195 -12 53 -82 99 148 37 163 77 229 33 -24 -100 -23 -276
1986 -276 -266 -270 -212 -168 -120 -243 -184 34 -9 -75 235 191 214 273 115 112 104 71 74 -3 54 46 -128 -208 -113 -132 -128 -132 44 -175
2016 -175 -72 42 196 243 12 232 142 245 120 -95 -41 -155 -61 -364 -122 -237 -192 -198 -149 -85 -140 -44 80 -110
2040 -110 54 352 305 187 349 326 156 25 22 102 -63 -54 -68 -238 -273 -97 -105 -167 -84 -117 -31 -32 248 250 205 56 66
2067 66 161 118 -91 -61 -114 -126 -152 -141 -145 -152 -133 238 8 154 202 150 102 240 296 122 251 73 -82 -44 -233 -2
2093 -2 -92 -49 -214 -197 -175 -201 -254 -137 -143 -19 100 -75 32 25 -24 86 125 78 47 144 179 63 89 -2 -19 194 89
$$ packed form
1912I0j83J77j18J02j99L3m0J2k0N5l0J20n7k1M5P1O6l3P7m6J34j39m5L5k55L9
1938a30M8J04M0j71J43j65K6q6J6j02K17J0N9J95l18L11o1N9j8p1M4p7n3j62J7
1963a25j27N1j13J83j1J04k2P9k14J83O5j35J81M9j11J26q6J52j96n7p6P7k53
1986b76J0mN8M4M8j23N9K18m3o6L10m4K3N9j58lql3Lp7N7qj74q0R5j9MmJ76k19
2016a75J03J14J54M7k31K20r0J03j25k15N4j14R4l03K42j15M5oM9O4n5R6J24j90
2040a10J64K98m7j18J62k3j70j31lQ0j65Rj4j70l5J76qo2Q3l3Q6jK80Km5j49J0
2067F6R5m3k09L0n3j2k6J1mpJ9L71k30J46M8n2m8J38N6j74J29j78j55L8j89K31
2093br0M3j65J7K2k6n3J17oJ24J19j75J07pm9J10L9m7l1R7L5j16K6r1j7K13j05
$$ plain form
2120 89 112 61 76 -80 -15 -32 -42 -149 -108 -13 -76 -151 -48 77 -70 139 -144 12 -73 124 -3 -55 284 -116
2144 -116 -101 -55 -133 85 53 41 96 170 155 38 76 200 133 190 38 152 43 -171 -207 -147 -362 -192 -416 -404 -358
2169 -358 -294 -207 -106 -77 174 320 258 508 280 297 181 153 157 10 213 -75 -237 33 -156 -189 -157 -74 14 54
2193 54 93 2 34 128 154 -117 11 57 -40 -59 -113 -255 -162 -201 -148 -124 -102 35 36 102 317 57 221 323 361 335 256
2220 256 133 195 107 -10 -132 -40 -224 -294 -272 -204 -165 -83 -23 17 14 198 35 9 241 63 38 -19 56 -5 -29 58
2246 58 -28 9 15 34 10 -20 47 -114 285 -97 -70 -38 -9 -7 -79 -22 -53 103 59 -33 -62 -119 -101 56 115 26 -153 61
2274 61 -59 61 133 169 111 91 73 69 124 -78 173 210 130 143 12 29 -228 146 8 48 -51 -118 120 -82 -202
2299 -202 -44 46 -21 -61 -96 77 41 0 63 109 7 73 196 48 98 121 -117 -112 -47 91 -95 -68 -136 -102 61 -5
$$ packed form
2120H9K3n1J5j56O5j7j0j07M1R5o3p5J03J25j47K09k83J56q5J97j27n2L39m00
2144a16J5M6p8K18l2j2N5P4j5j17L8J24o7N7j52J14j09k14l6O0k15J70k24J2M6
2169c58O4Q7J01K9K51J46o2K50k28J7j16k8Mj47K03k88j62K70j89l3L2Q3Q8M0
2193E4L9r1L2R4K6k71J28M6r7j9n4j42R3l9N3K4K2J37JO6K15k60J64J02L8k6p9
2220B56j23O2q8j17j22R2j84p0K2O8L9Q2O0M0lJ84j63k6K32j78k5n7P5o1k4Q7
2246E8q6L7OJ9k4l0O7j61L99l82K7L2K9Kp2N7l1J56m4r2k9n7J8J57N9q9j79K14
2274F1j20J20P2L6n8k0j8mN5k02K51L7q0J3j31J7k57L74j38M0r9o7K38k02j20
2299b02J58R0o7m0l5J73l6m1O3M6j02O6J23j48N0K3k38NO5J38j86K7o8L4J63o6
$$ plain form
2325 -5 24 104 125 124 52 152 -25 -10 -58 -2 -102 -63 -17 -43 206 48 -145 -87 -70 220 44 74 182 37 -71 -33
2351 -33 148 26 -33 45 -206 -178 -91 -178 8 -116 -214 -148 -37 33 -33 36 15 95 -123 102 123 137 -216 -100 -65
2376 -65 -2 -29 -127 -69 -41 -63 -30 53 -75 151 -160 -127 127 -100 -42 72 24 94 7 67 -54 -13 -27 -316 78 80
2402 80 -80 34 -71 162 129 135 -44 -8 193 32 69 -77 -82 -137 66 -57 -12 32 -9 85 154 -82 -38 -75 3 57
2428 57 104 73 -86 138 -21 -4 -45 -114 -134 -234 -109 -54 45 117 52 -2 -100 -22 113 -89 -77 3 245 -46 68
2453 68 112 -33 -74 182 63 12 -26 -67 -89 -37 -17 97 100 -29 -28 147 -29 246 40 -150 52 101 4 -70 82
2478 82 4 -24 92 90 18 -40 46 -79 67 -50 -66 132 105 42 -150 75 -141 -77 119 -19 -61 118 -8 122
2502 122 -14 148 -12 44 -32 82 -124 61 146 60 74 45 4 44 154 13 -7 136 127 -7 162 156 -65 -23 -139
$$ packed form
2325eK9Q0K1jp2J00j77J5m8N6j00L9M6k6K49j58j93N8J7K90j76L0J08j45j08L8
2351c3J81j22n9P8k51K8Q7q7J86j24r8O6J11P0o6O9k1Q0k18K25K1J4l53J16L5
2376f5O3k7r8N8K8k2L3Q3j28K26l11L3K54k27N8J14m8P0q7O0j21M1j4k89L94K
2402H0j60J14j05K33l3Oj79L6K01j61L7j46nn5K03j23M5M4m1R4O9k36M4l7P8N4
2428E7M7l1j59K24j59J7m1o9k0j00J25N5R9P2o5n4r8P8J35k02J2Q0K42k91J14
2453F8M4j45m1K56j19n1l8m1k2N2K0J14Lj29JJ75j76K75k06j90K02M9r7p4J52
2478H2p8k8J16kp2n8Q6j25J46j17j6J98k7o3j92K25k16O4J96j38m2J79j26J30
2502A22j36J62j60N6p6J14k06J85Q5q6J4k9m1M0J10j41k0J43rj34J69ok21M2j16
$$ plain form
2527 -139 -22 -29 -42 -52 -46 -112 98 -18 -127 -120 21 60 134 13 102 -75 147 112 55 198 86 128 76 -55 47
2552 47 55 16 20 -69 -29 -45 145 -76 105 79 65 -263 83 -6 -73 -34 -54 -36 -10 -36 8 151 114 71 47 -102 -51 46
2580 46 -45 248 90 144 160 55 19 -140 79 88 15 -11 -98 -21 -30 -39 -160 -80 -119 -41 107 -114 75 51 127 -128 61
2607 61 69 -99 -81 31 55 -29 -47 148 32 -32 119 48 -125 44 -75 -255 -46 42 -162 -95 -9 38 -15 125 -52
2632 -52 -125 -84 207 -52 47 11 -143 -192 16 -5 -117 -38 -40 -9 1 61 -91 -175 35 50 127 -134 -138 -25 14 23 -34
2659 -34 69 -192 -98 -28 -65 16 43 -84 93 55 54 -65 -23 34 17 55 -96 -70 -121 117 -141 168 -51 95 -12
2684 -12 64 12 25 97 21 -135 -90 67 62 -18 -15 63 -108 48 19 9 -12 -5 -1 39 107 -129 -13 23 115 -96 -57 44
2712 44 58 -21 99 50 19 -41 -10 -14 60 22 -55 79 152 -191 -83 -17 -3 -169 43 0 64 -21 -70 127 -23 -97 116
$$ packed form
2527a39J17pj3j0Oo6K10j16j09PJ41L9P4j21Q9j77K22l5n7J43j12M2n2j31J02
2552D7Ql9Mq9M0j6J90k21J81k6j4l28L46q9o7L9k0J8K6k6M4J43l7m3k4j49N1R7
2580D6r1K93j58N4J6j05l6j59K19Rp3k6q7P7rrj21Q0l9P8J48k21J89k4P6k55J89
2607F1Qj68J8J12K4q4j8J95j16o4J51p1j73J69j19j80K09Q8k04O7Q6M7n3J40j77
2632e2p3M1K91k59R9l6j54m9K08k1j12P9kL1J0O0j52q4K10J5P7k61mJ13L9Rn7
2659c4J03k61R4P0l7Q1K7j27J77l8jj19M2N7j7L8j51K6n1K38k58L09k19J46j07
2684a2P6n2J3P2p6j56M5J57nq0LP8j71J56k9j0k1PMM0O8k36J16L6R2k11L9J01
2712D4J4p9J20m9l1o0L1mP4l8p7J34P3l43J08O6J4j66K12m3O4q5m9J97j50p4K13
$$ plain form
2739 116 187 -65 84 -74 -59 -89 -101 -23 -10 -17 -84 -48 -18 -11 96 96 184 112 -31 11 -89 -156 146 -102 21 -26 24
2766 24 38 34 71 171 152 127 -28 -19 139 25 18 80 -10 -153 59 2 36 -168 -35 -86 23 109 132 -114 -102 -7 39
2793 39 -61 -68 264 -49 19 220 32 -1 -109 144 95 -74 -11 -86 43 65 17 -12 -41 148 -196 38 -13 -19 238
2818 238 -2 181 11 79 -216 131 -181 -20 172 -119 -29 31 -26 143 143 -15 92 164 35 -54 118 -114 102
2841 102 18 45 140 73 -126 3 13 -123 138 31 0 -14 24 -211 -114 -8 253 -143 98 -63 -44 -9 -185 19
2865 19 80 68 -191 -23 -51 17 -39 -122 -11 1 109 98 -14 -82 30 135 38 -22 -96 48 81 8 -73 -38 -297 -60
2891 -60 139 -4 -119 57 -22 -44 -75 31 -60 55 44 93 31 -160 -46 94 102 -36 -192 142 42 -33 38 -37
2915 -37 -31 -164 -85 -201 101 -74 -51 -67 37 122 93 0 -133 -37 -22 -28 -19 163 -47 -121 -26 -114 9 44 -80 41
$$ packed form
2739A16P1k52J49j58J5l0j2P8J3po7L6L0PJ07%Q8p2j43M2j00o7L02k48J23m7N0
2766B4J4mL7J00j9k5j55RJ58j14pO2r0j43K12n7L4k04J33n1J09Q6K3k46J2R5M6
2793C9j00pL32l13O8K01j88l3j08K53m9j69O3p5J29K2m8k9k9J89l44K34n1oK57
2818B38k40J83j70O8k95L47l12J61J92k91R0O0n7J69%j58J07P2j29q9J72k32K16
2841A02q4K7R5o7j99J29J0j36K61j07l1j4L8k35R7J06K61l96K41j61J9L5j76K04
2865A9O1j2k59J68k8O8n6q3J11J2J08j1j12o8J12J05r7o0p4J44L3p3q1L5k59K37
2891f0J99j43j15J76p9k2l1J06r1J15j1M9o2j91J14J40Qj38j56L34j00p5P1p5
2915c7Oj33P9j16L02j75K3j6J04Q5k9r3j33R6J5oRJ82k10p4R5q8J23L5j24J21
$$ plain form
2941 41 21 100 169 136 -17 -4 -147 82 -1 61 20 -33 -73 -61 -46 -43 34 -189 -171 -97 50 -223 82 6 172 205 -19
2968 -19 -42 -73 -60 47 -62 -63 -83 -56 86 -174 162 8 50 -5 -184 131 25 140 22 12 -46 104 -147 74
2992 74 58 142 32 -61 -70 -74 55 -9 62 56 71 13 100 20 95 -76 60 -12 1 -71 12 -39 35 63 -81 -46 -268 94
3020 94 -81 -105 -16 -18 -131 136 -46 37 -73 3 102 -145 -102 -37 113 48 13 -41 -37 84 271 -4 132 -63 -19
3045 -19 121 82 -10 29 -115 -57 -15 161 98 26 47 -6 64 -48 132 -26 72 -11 -4 -68 6 127 -170 -138 62 -38
3071 -38 -61 -84 83 -8 43 73 -39 177 5 98 81 95 25 -14 61 -74 5 -25 -24 23 17 -92 -187 -10 -81 83 -94
3098 -94 21 30 -5 -101 -1 126 -34 -47 107 272 18 -45 -179 -123 46 -13 -77 129 85 26 -169 38 -12 24 -148
3123 -148 40 -18 -14 -91 -41 -234 -183 68 -55 -40 40 -131 -73 -65 -60 -148 81 -62 24 23 39 -167 -58 -83 -89 -89 -73 45
$$ packed form
2941D1k0P9O9l3j53J3j43K29q3O2m1n3m0J2J5LP7k23J8P4J47k73L05p6J66L3k24
2968a9k3l1J3J07j09jk0K7J42k60L36j54M2n5j79L15j06J15j18j0n8J50k51K21
2992G4j6Q4j10r3rmJ29o4P1oJ5n8Q7q0P5j71J36p2J3p2Q3n1P4K8j44L5k22L62
3020I4j75k4Q9kj13K67j82Q3j10P6R9k47M3O5J50o5l5n4MJ21J87k75J36j95M4
3045a9J40l9r2L9j44N8M2J76o3p2K1n3P0j12J80j58R8q3Po4P4J21k97L2K00j00
3071c8k3k3J67r1N1L0j12K16j72R3j7J4p0l9P5j35P9l0JM7oj09r5J77p1J64j77
3098i4J15Rl5r6J00J27j60j3J54J65k54o3j34N6J69n9o4K06m4n9j95K07n0L6j72
3123a48J88n8Mp7N0j93N1K51j23J5Q0j71N8QNq8K29j43Q6jJ6k06J09k5o%J6J18
$$ plain form
3151 45 69 -24 -69 46 121 -144 -152 16 -148 -129 56 -92 90 4 -8 160 168 73 40 54 71 -74 -172 -3 134 121
3177 121 54 103 76 -45 94 4 -4 27 -43 34 124 -104 53 57 -58 230 29 -3 118 75 38 23 47 -123 -208 148
3203 148 -44 159 -112 -110 32 -176 141 45 11 88 -105 74 67 -20 -55 -100 -40 -51 115 -91 -18 67 63 -105 -14 -7
3229 -7 75 96 76 66 38 102 -18 -43 47 -65 124 -35 -47 88 199 128 -60 81 41 -126 111 14 3 -57 245
3254 245 -42 19 139 24 55 34 -68 -50 8 1 18 -56 15 -66 -47 -14 -12 -6 11 -53 -102 -19 -27 -36 -56 -13 -56 -15 -60 -40
3284 -40 -62 -68 55 -182 36 29 16 140 7 -105 -41 -20 42 -91 79 -3 55 -58 32 88 21 -194 -83 103 22
3309 22 43 -101 55 38 159 -45 132 -151 66 123 -123 -198 100 -30 -44 -32 75 61 175 -10 -58 -103 -136 -165
3333 -165 -92 -43 -84 -88 -22 -114 8 -14 -63 -22 25 150 50 260 108 71 -115 -1 30 82 -117 89 103 78 30 1
$$ packed form
3151D5K4r3m5J15P5k65qJ68j64J9J85j48J82q6j2J68Qr5l3J4J7j45r8J69J37j3
3177A21o7M9k7j21J39r0qL1p0P7R0k28J57Mj15K88k01l2J21m3l7j5K4j70q5L56
3203A48j92K03k71KJ42k08L17r6l4P7j93J79pq7l5m5O0j1J66k06P3Q5mj68R1P
3229gQ2K1k0j0k8O4j20k5R0j12J89j59j2J35J11p1j88J41m0j67K37r7j1o0L02
3254B45k87O1J20j15L1k1j02J8N8pJ7p4P1q1J9L3KOJ7o4m9Q3qrk0M3m3M1m5K0
3284d0k2oJ23k37K18pj3J24j33j12O4K1O2j33J70q2N8j13R0N6o7k15J11J86q1
3309B2K1j44J56j7J21k04J77k83K17N7k46p5K98j30j4J2J07j4J14j85m8m5l3k9
3333a65P3M9m1mO6r2J22k2m9M1M7J25j00K10j52l7j86J14L1N2j99K06J4k5m8k9
$$ plain form
3359 1 109 -63 115 -28 -64 69 -28 -58 -77 -82 254 -68 27 241 21 -35 -90 -123 21 167 90 172 102 -98 -27
3384 -27 -4 -49 -28 42 -32 135 224 26 -169 78 -25 -112 -80 -56 -166 -38 -43 -102 -129 -13 27 -128 -6 43 69 36
3410 36 -58 -11 150 58 78 112 -26 91 16 90 -116 101 -123 -41 27 164 39 153 -89 -116 -108 124 94 144 -75
3435 -75 87 44 56 -57 -50 59 40 -27 45 -52 -101 136 59 49 -35 126 26 -51 159 66 41 134 -47 -76 34 -40
3461 -40 33 -50 -7 30 10 -202 -76 18 59 57 -79 94 -12 -27 -73 2 34 -71 -55 -60 5 60 -12 183 76 56 98
3488 98 -8 -82 -30 -117 32 132 -70 -27 -79 -42 -52 172 197 49 22 -54 -14 -66 -12 -176 129 2 13 13 0 45
3514 45 -164 -42 -32 4 -38 -66 -93 92 87 -21 56 -88 15 182 -83 102 -70 -80 -89 -29 33 -124 -30 -14 -36 -42
3540 -42 4 53 -91 117 -29 96 86 8 -179 152 72 -31 -4 -40 -45 -68 15 -152 -84 246 -201 -112 44 102 116
$$ packed form
3359AJ08j72J78j43l6J33r7l0j9nL36l22R5K14k20n6n5l3J44J46p7Q2p0k00P1
3384b7K3m5K1P0p4J67Q9j98j95K47j03q7L2K4j10J28nn9k7J16M0j55J22M9K6l3
3410C6r4M7J61r2K0L4j38J17p5P4k06K17k24Q2O8J37j25J14k42k7QK32l0N0k19
3435g5J62m3J2j13PJ09j9o7P2r7m9K37p7j0q4J61j00p7K10r3k5R3j81k9J10p4
3461d0P3q3M3L7k0k12J26R4M1kj36J73j06j5m6P5L2j05J6nO5N5p2J95j07k0M2
3488I8j06p4N2q7J49J00k02M3n2L7j0K24K5j48k7p6M0n2N4j64L05j27J1%j3M5
3514D5k09J22J0L6m2k8k7J85nj08P7j44J03J67k65J85j72j0rO0O2j57R4J6k2o
3540d2M6M9j44K08j46J25j0p8j87L31q0j03K7l6nk3Q3j67O8L30m47Q9J56N8J4
$$ plain form
3565 116 15 -149 14 43 89 51 99 -126 -28 -80 -4 7 194 -131 -21 72 61 -15 150 131 46 76 -117 13 -2
3590 -2 -162 -16 -41 47 -61 -134 -50 11 -209 -200 47 22 -141 -88 72 116 18 -35 -62 99 -123 -63 -36 107 -5 181
3616 181 26 65 218 -199 -53 -148 93 -185 53 -53 39 -54 -98 -36 185 -30 50 81 83 80 -125 85 46 3 -15
3641 -15 41 59 68 16 -115 -125 28 28 8 71 44 -13 184 -9 -57 59 157 -116 -23 194 -21 121 -53 -56 -169 -62
3667 -62 -158 40 32 -30 60 -118 -10 77 92 -58 -103 122 118 -106 -224 129 172 194 -101 -171 -26 -54 34 55 -91 55
3693 55 76 -31 -36 -104 -103 -7 123 18 53 98 -114 -92 40 -48 54 -162 8 -61 -30 75 -29 59 -60 71 -88
3718 -88 59 5 41 31 -97 -31 21 22 -71 -23 57 -199 -8 -36 -79 -86 61 -52 -36 -56 67 -76 -90 105 88 67 -116
3745 -116 -70 120 -160 8 14 48 106 -4 -132 -79 193 -267 79 -37 -24 -45 -20 -53 -152 12 3 70 -8 -45 147
$$ packed form
3565A16j01j64J63K9M6l8M8k25R8n2P6J1J87l25J10R3j1p6J65j9q5L0j93J30j5
3590bj60J46k5Q8j08p3Q4O1k20RK47k5j63N3J60M4r8n3k7J61k22O0K7J43j12J86
3616A81j55L9J53m17J46r5K41k78K38j06R2r3m4O2K21k15Q0L1Klk05K10l9m3j8
3641a5N6J8Rn2j31j0J53%k0O3k7n7J97j93m8J16R8k73R3K17k15J42j74lj13J07
3667f2r6J98qo2R0j78J08Q7J5j50m5K25mk24j18L53M3K2k95p0J45k8Q8K1j46J46
3693E5K1j07no8JR6J30j05L5M5k12K2J32q8J02k16J70o9L1J05j04Q8j19J31j59
3718h8J47n4L6j0j28O6N2Jr3M8Q0k56J91k8m3pJ47j13J6k0J23j43j4J95j7k1j83
3745a16M6J90k80J68OL4N8j10j28N3K72m60L46j16J3k1K5l3r9J64rO7p8l7J92
$$ plain form
3770 147 -51 0 96 -92 116 -37 -124 -112 -85 -37 -98 22 163 -111 -1 100 64 -20 45 58 72 64 -22 -26 -146 149
3796 149 -7 44 -268 -161 -105 115 -107 108 21 -135 -119 117 101 165 -24 38 9 -21 213 14 -48 -81 105 -16
3820 -16 -99 -135 -120 -200 -109 41 -62 70 42 -104 107 133 -73 3 6 6 86 55 209 -17 6 -68 -98 30 147 147 61
3847 61 179 -86 66 -40 -19 93 13 56 11 194 -6 -61 131 24 -43 -142 -153 67 -92 -105 63 -126 -15
3870 -15 27 168 -89 -76 145 -28 -142 61 98 -150 -3 61 57 40 -34 33 -36 -17 148 -80 -52 96 147 -193 -25
3895 -25 231 -152 149 -33 -187 -144 55 54 165 -148 148 139 -47 15 -93 164 -104 140 134 -80 -42 -45 99 -67
3919 -67 -12 129 15 -75 -55 230 81 88 53 154 -23 -140 -154 138 106 -54 -34 25 86 -111 -17 -13 93 -179 -8
3944 -8 12 -2 164 -118 -132 13 -42 -94 37 13 -6 -25 -53 109 17 -53 192 5 121 -129 134 138 49 52 64 -126
$$ packed form
3770A47j98N1R6j88K08j53q7J2K7M8o1J20J41k74J10J01l6q4O5J3J4qq6mj20K95
3796A49j56N1l12J07N6K20k22K15q7j56J6K36j6O4j89O2k9l0K34j99o2l3J86j21
3820a6q3l6J5q0R1J50j03J32k8j46K11K6k06P6L%Q0l1J54k26K3p4l0J28J17%q6
3847F1J18k65J52j06K1J12q0M3m5J83k00n5J92j07o7r9j1K20j59j3J68j89J11
3870a5M2J41k57J3K21j73j14K03L7k48J47O4mj7p4O7o9J9J65k28K8J48N1l40J68
3895b5K56l83L01j82j54M3J99jJ11l13K96rj86O2j08K57k68K44ok14L8lJ44j66
3919f7N5J41j14r0K0K85j49Pl5J01j77j17j4K92l2j60K0N9O1j97R4MJ06k72J71
3944hK0j4J66k82j4J45n5n2J31k4j9j9k8J62r2p0K45j87J16k50K63Mq9LJ2j90
$$ plain form
3970 -126 200 34 -50 -69 60 -90 -13 -50 -35 -75 -103 -87 9 61 -2 13 -82 94 135 -39 -29 -39 29 22 -17 -75 -86
3997 -86 136 -117 66 -58 -62 -28 27 -4 147 -89 -52 134 -115 124 148 14 96 -56 237 52 84 -266 -26
4020 -26 -242 -42 -56 45 158 110 -29 -31 -20 101 118 -38 18 87 -55 69 -54 89 88 -47 -128 -134 -137 -31 48 76
4046 76 73 -86 -7 -195 25 130 119 -57 -63 202 -190 -25 -3 -51 139 -103 60 25 34 -52 14 19 158 43 -30 51
4072 51 113 145 -67 -128 -4 64 49 -66 9 -9 90 52 7 -145 84 142 -132 -159 187 150 80 5 -36 59 -64 71
4098 71 66 -5 -23 -37 39 -59 27 -4 -44 206 -35 20 42 18 -103 31 103 18 104 50 -299 63 -39 145 -115 18
4124 18 137 67 142 -67 -117 65 -38 102 -138 93 37 92 11 88 27 -62 158 48 -55 -20 -4 -6 94 98 135 149
4150 149 54 -86 38 -121 127 -140 11 -199 33 -188 -175 83 -4 6 -16 -10 151 111 31 72 -61 151 93 -109
$$ packed form
3970a26L26j66q4j9J29j50P7l7J5m0k8J6R6N2o3J5r5J76M1j74J0j0O8pl9n8j1
3997h6K22k53J83j24mL4N5l1J51k36L7J86k49K39K4j34Q2j52K93j85L2l50K40
4020b6k16K00j4J01J13m8j39kJ1J21J7j56N6O9j42J24j23J43jj35q1olJ06P9K8
4046G6lj59P9j88K20J05j1j76oK65l92J65K2m8J90k42J63l5Rq6O6NJ39j15p3Q1
4072E1O2L2k12o1J24O8j5j15P5j8R9l8m5j52K29N8k74k7L46l7p0p5m1R5j23J35
4098G1np1j8j4P6r8Q6l1m0K50k41N5K2k4j21J34P2q5Q6n4l49L62j02J84k60J33
4124A8J19p0P5k09n0J82j03J40k40K31n6N5q1P7o1q9K20j10j03L5J6kJ00ML7J4
4150A49r5j40J24j59K48k67J51k10K32k21J3K58q7J0k2OJ61m0q0M1j33K12n8k02
$$ plain form
4174 -109 -6 -3 -11 16 77 -56 -116 88 13 -33 -41 -86 -23 -39 -25 42 -128 119 114 30 -49 -62 -34 -99 -8 -40 -146 50
4202 50 72 -27 -196 103 112 -9 -184 -25 50 5 138 91 -148 -81 -169 23 -45 50 85 48 -56 49 118 31 -66 4
4228 4 -34 -152 -123 -45 62 10 -60 -143 0 5 -51 -145 91 -6 8 -92 -61 39 23 -109 -141 -17 22 147 62 115 9
4255 9 7 0 -64 -123 -82 207 -84 142 41 -181 89 9 36 -109 26 109 -130 -23 -25 48 93 47 129 102 -67 -42 57
4282 57 87 -66 107 85 53 -13 -62 67 -32 36 -35 224 -54 52 -76 44 -19 -230 -123 -78 41 -147 -36 -19
4306 -19 -31 38 24 39 176 97 -16 77 63 -100 -67 -39 105 -182 23 -32 -51 18 18 45 -41 -42 134 42 120 16 -82
4333 -82 30 -102 64 39 -7 94 170 1 -33 -54 -77 75 225 5 -2 152 86 -159 -8 -26 154 -73 -58 -46
4357 -46 -61 37 -19 73 -46 -11 -58 -202 -79 13 173 29 -1 51 9 23 -102 90 46 -49 206 -13 -3 88 75 -125
$$ packed form
4174a09J03LqK7O1j33o0K04p5m6qm5O3j6J4O7j70K47nq4p9j3K8o5R1l2j06J96
4202E0K2r9j69K99Rj21j75J59P5m5J33m7k39O7q8J92o8R5L5l7j04J05O9q7r7P0
4228Dl8j18K9P8J07n2p0q3J43Nn6r4K36r7J4j00L1J00j6j32l2J24L9J25q5N3j06
4255Ikpo4n9M1K89k91K26j01k22K70q0K7j45J35Q3k39J07kP3M5m6Q2k7j69K5R9
4282E7L0j53J73k2l2o6m9J29r9O8p1K59k78J06j28J20o3k11J07M5J19j88J11J7
4306a9j2O9j4J5J37p9j13R3j4j63L3K8J44k87K05n5j9O9%K7q6jJ76r2P8j04r8
4333h2J12j32J66k5m6J01P6j69l4k1k3J52J50k20pJ54o6k45J51j8J80k27J5J2
4357d6j5R8n6R2j19L5m7j44J23R2J60j44l0N2m2J4j25J92m4r5K55k19J0R1j3k00
$$ plain form
4383 -125 8 -107 -29 3 -203 11 -87 -88 -51 -22 -15 -53 -30 -63 -42 52 110 1 126 0 -72 -64 74 -141 48 6
4409 6 51 38 76 45 -42 148 -116 14 -94 86 42 72 -16 54 -177 82 8 -159 -37 -61 -61 72 -25 107 82 -135
4435 -135 -38 96 2 -48 155 -121 104 51 96 -83 -258 48 104 55 63 15 -86 -91 -47 18 -24 -93 154 -60 -13 -109
4461 -109 10 -79 68 -49 78 123 65 148 14 58 -196 34 -102 58 42 -14 90 75 170 -30 103 -143 -54
4484 -54 42 -113 167 -62 -87 -57 -28 -39 -160 -33 31 128 -38 105 -91 6 3 -33 75 -53 23 -30 -320 -7 -51
4509 -51 -18 14 -22 -37 -3 -68 29 -139 -58 -131 -11 18 88 66 -52 20 -61 61 78 -111 -192 -30 164 -6 198 39
4535 39 113 61 -9 99 -106 37 -25 -202 -60 -51 65 2 -29 -2 -11 39 -135 -175 1 65 33 -42 -78 68 -127 119
4561 119 -5 -31 -2 -78 -50 -80 -58 39 54 105 -70 -64 57 -20 87 -21 -55 -98 -182 198 -6 28 -4 -33 -97 4
$$ packed form
4383a25J33j15P8L2k06K14r8jL7K9Pl8K3l3K1R4N8j09J25j26p2QJ38k15J89m2
4409FM5j3L8l1q7J90k64J30j08J80m4L0q8P0k31K59p4j67J22k4%J33r7J32k5k17
4435a35R7J34r4n0K03k76K25n3M5j79j75L06N6m9Qm8j01nM4O5m2o9K47k14M7r6
4461a09J19q9J47j17J27M5n8Q3j34M4k54K30j36J60j6n6J04j5R5k00J33k46Q9
4484e4R6j55K80k29k5L0K9j1j21J27O4R7j66J43j96R7ll6J08j28P6n3k90L13m4
4509e1L3L2l6j5L4o5R7j68Q1p3J20K9P0k2j18P2q1J22J7j89q1J62J94j70K04j59
4535C9P4n2p0J08k05J43o2j77J42RJ16o3l1K7rN0j74m0J76O4l2p5l6J46j95K46
4561A19j24k6K9p6K8l0K2R7J5N1j75OJ21p7J07j08l4m3q4L80k04L4l2k9o4J01
$$ plain form
4587 4 -55 81 -77 -11 102 43 115 40 -63 -22 -87 43 -86 -20 54 -100 -97 37 -115 -50 46 -35 98 -82 39
4612 39 -75 -204 -36 3 48 -166 -53 37 -35 158 158 92 -127 77 11 -23 72 -1 -24 -10 41 -35 -14 26 20 -10 -81
4639 -81 -102 16 -28 72 -129 -110 17 27 128 -155 52 62 -4 53 33 50 183 5 -1 -40 -39 66 54 -2 -78 -46
4665 -46 77 -46 -60 -71 93 3 120 -78 36 101 -87 -151 73 -31 -109 2 -81 26 16 38 41 -16 61 28 135
4690 135 -145 -39 110 190 72 7 -35 41 -45 -98 -35 24 46 -91 -98 -6 144 -58 115 89 -164 -35 -147 -116 91
4715 91 -11 124 63 21 -54 103 -11 -76 -43 36 116 -15 -7 38 -104 -64 147 -38 129 -4 -72 142 -41 6 126
4740 126 3 152 76 12 -11 -43 -31 -43 -118 -79 67 50 -9 -10 -64 23 -105 -19 -10 133 107 -15 -54 -55 -69 70 91 91
4768 91 20 -114 -139 99 -82 -72 23 -143 48 18 108 83 -41 86 -70 -134 50 26 -127 -78 -45 54 -136 72
$$ packed form
4587Dn9J36j58O6J13n9P2p5j03M1o5J30j29O6P4j54LJ34j52O5R6q1J33j80J21
4612C9j14j29J68L9M5k14J13R0p2J93%o6k19K04o6l4R5p3k3J4N1p6K1M0ol0p1
4639h1k1J18m4J00k01J9J27J0J01k83K07J0o6N7k0J7J33j78ol9JJ05j2n6p6L2
4665d6J23j23j4j1J64r0J17j98J14O5j88o4K24j04p8J11q3J07j0K2Ln7P7l3J07
4690A35k80J06J49Q0j18o5m2P6q6n3O3N9K2j37pR2J50k02J73k6k53J29j12L1K07
4715I1j02J35o1m2p5J57j14o5L3P9Q0j31QM5j42M0K11j85J67j33o8K14j83M7J20
4740A26j23J49p6o4k3l2J2j2p5L9J46j7n9jn4Q7j28Q6RJ43k6j22l9jj4J39K1%
4768I1p1j34k5K38j81J0R5j66J91l0R0k5j24J27j56o4J84k4j53M9L3R9j90K08
$$ plain form
4792 72 -47 -50 -95 12 110 -11 113 -10 -203 -69 -34 28 88 117 52 -72 64 -205 -54 10 23 294 -57 45
4816 45 35 -141 -1 -42 -39 69 48 -11 -114 85 -97 73 15 -237 44 -108 -186 24 -191 -115 23 -87 -48 -99
4840 -99 -125 115 -51 6 -62 65 68 68 -33 58 -44 -78 45 -11 114 203 -23 -57 -57 121 59 -135 -75 46 39 -132
4866 -132 -131 -34 -38 103 106 -47 188 -190 -196 45 75 36 -71 12 -2 -261 -30 -60 -58 132 -229 39 -58 -187 22 -12
4892 -12 -175 -66 -37 -106 -126 -166 132 41 -89 15 -18 151 -125 -127 139 -22 -6 36 4 -69 -102 -25 88 9 12 -69
4918 -69 163 6 -57 112 73 66 179 -14 -92 -32 -44 -96 6 -61 140 54 57 -11 -6 -67 102 -163 -64 32 -167 -58
4944 -58 6 -92 24 53 -94 -16 38 -19 -14 -24 49 -119 -34 16 78 -94 -38 15 75 -35 -126 -94 -70 99 6 -15 -13 131
4972 131 -25 -168 -33 -108 -64 33 -42 61 -135 68 69 117 38 -102 86 -111 -49 -237 94 12 -128 50 49 -88
$$ packed form
4792G2j19lm5J07R8j21J24j23j93J34L5O2O0K9o5j24J36k69J51O4J3K71l51J02
4816D5j0j76J40m1LJ08k1n9j03J99j82J70n8k52K81j52p8K10k15P6J38j10L9n1
4840i9k6K40j66N7o8J27L%j01R1j02l4J23n6J25Q9k26l4%J78o2j94O0J21pj71
4866a32JR7mJ41Lj53K35l78oK41L0l9j07Q3j4k59K31l0KJ90l61K68r7j29K09l4
4892a2j63J09K9o9k0m0K98r1j30J04l3J69k76kK66j61J6M2l2p3l3P7J13p9Lq1
4918f9K32j57o3J69l9pJ13j93p8O0j2n2J02o7K01q6Lo8No1J69k65R9R6j99J09
4944e8O4r8J16K9j47P8N4n7Nj0P3j68Q5N0O2j72N6N3O0j10r1L2K4J69r3k1KJ44
4972A31j56j43J35p5M4R7p5J03j96K03JM8p9j40J88j97O2j88L31q2j40J78jj37
$$ plain form
4996 -88 28 131 19 126 -46 18 183 108 -197 -64 -9 157 76 77 95 34 1 -13 -47 -77 8 -3 114 -47 -106
5021 -106 56 74 -40 100 94 230 -24 -79 56 47 51 -152 11 -63 -2 -1 -135 53 191 2 18 -107 28 132
5045 132 12 13 88 0 32 67 -35 212 105 -50 58 22 269 5 147 147 57 -64 -123 -116 103 -195 47 30 -63
5070 -63 62 104 33 9 -40 81 -68 -108 64 -68 114 198 -31 -19 -67 -65 129 -68 -4 10 -102 -63 128 -71 45
5095 45 -38 -79 -91 128 97 73 8 -7 174 -108 29 69 38 102 25 -68 33 -59 -2 -50 -161 -47 -45 118 -90 -109
5121 -109 65 62 -67 -67 -116 -36 -115 22 1 -181 -17 -23 -40 57 74 -41 90 73 126 -82 9 28 -142 25 -79 56
5147 56 94 158 -21 54 53 -18 -128 -56 -73 1 74 -83 -72 -103 50 -8 -163 -14 -23 -17 105 70 204 -146 -69 14 61
5174 61 -31 -80 39 21 -145 -122 54 38 173 73 -75 -51 -129 -128 81 14 37 26 68 51 -104 -78 -17 -16 -36 -7 47
$$ packed form
4996h8J16J03j12J07j72O4J65p5l05J33N5J66q1JJ8o1l3j4l4l0Q5j1J17j61n9
5021a06J62J8j14J40oJ36k54n5J35rMk03J63p4O1Jj34J88J38j89J6j25J35J04
5045A32j20JP5q8L2L5j02K47j07j55J08l6K47k64J42%r0j21n9PK19k98K42j7r3
5070f3J25M2p1k4m9J21j49m0J72j32J82Q4k29J2m8KJ94j97O4J4j12L9J91j99J16
5095D5q3m1j2K19l1k4o5j5J81k82J37M0l1O4p7r3J01r2N7m8j11J14KJ63k08j9
5121a09J74lj29%m9Q0p9J37k1j82J64oj7R7J7j15J31j7N3k08R1J9j70J67j04J35
5147E6L8O4j79P5jp1j10P2j7P4P3j57J1l1J53n8j55J49rOJ22l5J34l50P7Q3M7
5174F1r2m9J19j8j66K3J76j6J35j00j48K4p8JK09o7K3j1M2j7j55K6O1Jk0K9N4
$$ plain form
5201 47 -32 7 -11 140 -56 51 35 -105 9 -67 -105 -19 -88 -1 26 -116 -119 -58 -1 -48 165 -113 -130 -108 -165 22
5227 22 25 20 -4 40 -110 -146 10 0 -57 -55 154 -59 -98 -40 -89 -6 -160 29 -105 -151 -48 -58 26 -97 -143 -70 128
5254 128 96 -64 110 84 -48 191 -136 -8 13 -26 -63 72 -48 138 -26 87 -172 60 -4 37 46 106 32 119
5278 119 43 64 30 -110 -71 -103 94 222 153 17 80 -7 154 -108 -45 -16 13 40 45 -91 -247 -117 -61 -97 32
5303 32 -82 -104 39 108 -63 -101 82 -69 136 137 -6 29 117 103 4 -19 72 -98 -55 -91 -1 57 -76 53 109 31
5329 31 -50 203 -122 43 -82 327 -11 -147 -20 -167 -53 14 -40 -99 -136 -61 -208 -10 -28 -53 50 -56 -71
5352 -71 2 -99 73 -80 -193 151 -115 -41 -43 -54 19 -139 -154 65 32 44 -22 42 126 186 39 19 -85 -11 -62 109
5378 109 -127 15 75 -29 -219 -79 -16 62 103 -196 8 127 162 -55 -18 86 35 15 13 152 64 -27 -30 117 -110
$$ packed form
5201D7p9L9j8J51j96J07j6j40J14p6l8Q6o9Q7K7j42lO1N7m7K13k78j7K2n7J87
5227B2Lnk4M4j50l6J56j0n7KK09k13l9N8m9Q3j54J89j34m6J03j0Q4j23m6P3J98
5254A28l2j60J74k6j32K39l27J28K1l9l7J35j20J86j64J13k59K32o4M1RO0p4Q7
5278A19p6K1l4j40L9l2J97J28o9j36O3q7J61k62O3K9K9K7Nj36j56J30N6l6J29
5303C2j14k2J43O9j71l8J83j51K05Jj43L5Q8j4r9k3R1j70M3l6R0N8j33J29N6p8
5329C1q1K53l25J65j25M09l38j36J27j47J14O7n4n9l7P5j47J98j8k5J03j06j5
5352g1P3j01J72j53j13L44k66P4kj1P3j58j5K19l3J2o6O4Q4O0j47k0j04P4n1J71
5378A09k36J42O0j04j90J40O3P8M1k99K04J19L5k17L7J04n1k0kJ39q8r1lJ47k27
$$ plain form
5403 -110 115 -91 -88 105 72 -67 -33 -32 50 -10 17 41 -6 -17 164 32 -160 198 110 92 -40 120 -3 1 88 -40
5429 -40 0 -37 -3 153 2 97 12 8 1 37 47 118 70 26 -58 82 -38 74 45 -109 152 -23 122 17 -135 189
5455 189 71 121 85 53 131 -51 109 40 30 102 79 194 -90 33 108 59 -86 -158 107 -91 139 39 29 -20
5479 -20 146 -32 89 156 59 -15 3 89 -41 11 -119 89 -39 55 -12 6 39 12 -153 50 -109 4 -34 -155
5503 -155 -28 41 -68 212 -198 -88 -27 -79 -51 -13 -30 -101 22 150 -149 -56 -67 -86 -32 -216 -103 40 -137 167
5527 167 -2 56 81 13 -152 180 -42 3 42 -18 -38 -3 -91 25 61 -7 -53 -159 92 142 -9 -15 -39 -122 43 73
5553 73 112 -17 37 -61 -40 -90 -3 5 -17 -94 86 78 -15 -19 82 -11 -125 104 84 102 -79 232 -83 -20 103 -36 -242
5580 -242 -22 18 16 117 -41 2 68 -74 -118 -65 148 4 10 -188 96 -89 178 51 -169 -28 -7 -42 -209 99
$$ packed form
5403a10K25k06LJ93l3j39L4JQ2o0K7K4m7j1J81j32j92L58q8j8j32J60j23MQ7j28
5429d0M0l7L4J56j51R5q5mpL6J0P1m8m4q4J40j20J12k9j54K61j75J45j05j52L24
5455A89j18N0l6l2P8j82J60o9j0P2k3J15k84J23P5m9j45p2K65j98K30j00j0m9
5479b0J66j78J21O7r7p4J8Q6j30N2j30K08j28R4o7J8L3k7j65K03j59J13l8j21
5503a55J27O9j09K80m10J10O1n2K8L8j7p1J23J28k99R3j1j9N4j84J13J43j77L04
5527A67j69N8K5o8j65L32k22M5L9o0k0L5q8J16L6o8m6j06K51N0j51ok4q3J65L0
5553G3L9j29N4r8K1n0Q7Qk2p7J80qr3mJ01r3j14K29k0J8j81L11l15O3J23j39k06
5580b42K20M0kJ01j58M3O6j42m4N3K13j44Oj98K84j85K67j27k20J41K1l5j67L08
$$ plain form
5604 99 -10 169 61 -44 11 91 27 -89 -16 -14 -10 -189 88 66 -19 -106 117 120 -41 -85 31 53 -86 99 -144
5629 -144 -111 -105 51 27 89 -6 -158 121 -246 -31 85 82 -88 100 -196 -100 81 76 -17 135 -44 46 -1 -41 -28
5654 -28 -217 92 -33 -8 -26 101 -115 7 24 -46 88 118 -6 164 -78 12 11 -22 136 -40 -23 69 -138 94
5678 94 42 -34 -92 77 -26 -35 -88 -60 11 -71 82 11 -5 -30 40 -7 -95 -2 -35 -26 106 -51 130 66 54 128 -102 46
5706 46 -31 133 -24 -229 18 99 6 -61 73 28 178 -15 -107 19 -61 83 12 106 -20 -217 -119 -50 -43 17 190
5731 190 -20 8 -180 118 26 47 38 -72 22 54 -103 78 64 -92 -2 -11 -56 63 182 -53 -119 -127 -37 -29 -105 -106 77
5758 77 -134 -140 -48 39 167 78 5 -170 4 32 -21 31 166 33 154 132 -71 -64 -27 -151 24 86 -110 -77 146
5783 146 24 -80 41 -58 -1 -124 35 7 -89 34 112 -139 59 28 -18 -91 64 110 27 32 196 -31 20 137
$$ packed form
5604I9j09J79j08j05N5Q0o4j16P3KMj79K77k2q5q7K23Lj61m4J16K2j39J85k43
5629a44L3OJ56k4O2r5j52K79l67K15J16lj70J88k96R6J81nr3J52j79R0m7m0J3
5654b8j89L09j25K5j8J27k16J22J7p0J34L0j24J70k42R0jl3J58j76J7R2k07K32
5678I4n2p6n8J69j03rn3K8P1q2J53p1j6k5P0m7q8R3l3RJ32j57J81o4j2P4k30J48
5706D6p7J64j57k05K47Q1r3o7J34m5J50j93r2J26q0J44p1R4j26j97R8O9PO0J73
5731A90k10K8j88K98r2K1rj10R4L2j57J81j4j56R0rm5J19J19k35o6qR0Qp6jJ83
5758G7k11oR2Q7J28q9p3j75J74K8n3N2J35j33J21k2k03PL7j24J75O2j96L3K23
5783A46j22j04J21r9N7j23J59k8r6J23P8k51J98l1m6p3J55M6q3NJ64k27N1J17
$$ plain form
5807 137 12 -67 35 42 -9 -100 133 70 -52 32 68 -70 -72 -111 -154 -99 23 176 -39 100 67 -179 -180 -178 -48 -75
5833 -75 144 4 -29 53 -205 213 11 24 74 0 66 -152 -26 -64 81 184 157 23 -214 73 -123 -141 178
5856 178 -66 82 15 -107 -2 -16 -144 -53 23 14 50 87 115 173 268 -46 -92 10 59 140 102 -18 60 89 -24 8
5882 8 -91 -63 -2 -91 10 -20 49 84 67 75 -17 -197 56 81 -26 153 -56 228 -148 -53 124 -102 -149 -75 -37 -85
5908 -85 -68 -90 37 1 -81 7 42 110 77 17 -21 -122 54 51 -109 -47 37 94 -57 42 172 37 16 -6 84 23 81
5935 81 56 56 57 11 -106 -74 -7 -186 -84 20 -171 162 -77 -67 -52 43 -100 46 -45 53 137 -33 -44 -34 -56 80
5961 80 -127 -137 -17 41 84 -64 -13 -52 -195 69 2 -103 23 58 -35 37 -86 -12 -38 69 8 -21 -42 -49 -12 -33
5987 -33 -55 42 51 65 -46 28 -57 28 -25 49 70 104 80 -23 -74 -229 29 54 80 28 -10 68 61 58 0 68 -47 -133 -72
$$ packed form
5807A37j25p9J02Pn1r1K33o3j22Q4L6j38kl9m3N5J22J53k15J39l3k46jKJ30k7
5833g5K19j40l3Q2k58M18k02J3N0p4O6k18J26l8J45J03k7j34k37K87j96j8L19
5856A78k44J48o7j22J05j4j28R1P6rL6L7K8N8R5l14m6J02M9Q1l8j20P8K9j13L2
5882Hr9K8O1q9J01l0O9L5j7Qr2j80K53K5j07J79k09K84l76R5J77k26m7P4L8m8
5908h5J7k2J27l6q2Q8L5O8l3o0l8j01J76lj60O2Q4N7j51R9J30j35k1k2R0o1N8
5935H1k5%Jm6j17L2O7j79J02J04j91L33k39J0J5R5j43J46r1R8Q4j70j1J0k2J36
5961H0k07j0J20N8M3j48N1l9j43K64o7j05J26L5r3P2j23P4k6J07o1k9k1pL7k1
5987c3k2R7RJ4j11P4q5Q5n3P4K1L4k4j03n1j55K58K5K6n2l8P8pln8O8j15q6O1
$$ plain form
6016 -72 -12 88 -43 -30 -20 -2 23 60 -41 -55 -69 -162 47 -50 -65 -170 77 -93 -10 -89 65 188 160 -96 135
6041 135 -19 -52 -84 -154 66 79 20 -54 75 195 150 35 39 50 -171 -30 67 108 100 -16 -2 -96 101 -89 -11 101
6067 101 33 10 -35 86 73 46 116 -28 37 -31 36 -21 -37 -5 -77 53 21 42 45 131 -60 32 8 -68 135 37 34 -4
6095 -4 2 -114 -143 -169 127 -31 113 -106 -120 -112 -52 -62 -71 -19 -161 -41 44 42 -49 56 151 127 -101 -81 108 -111 155
6122 155 50 -196 -21 6 179 -81 -121 -25 43 -81 -117 72 -26 99 168 52 36 -32 146 -99 200 -24 60
6145 60 45 -174 -26 5 179 224 -61 -110 1 3 -65 -160 -35 21 -62 -3 -103 53 147 2 -122 1 39 -50 192
6170 192 112 -34 -113 81 10 -106 16 -9 88 217 122 69 -31 2 184 120 -115 -11 -113 50 35 -84 -28 -83
6194 -83 42 67 -11 57 -8 53 103 71 -9 -57 104 246 70 131 -48 -47 -117 -63 77 22 53 42 24 57 11 186 21
$$ packed form
6016g2O0J00j31J3J0J8K5L7j01j4j4r3K09r7j5j05K47j70Q3p9J54J23k8k56K31
6041A35j54l3l2p0K20J3n9p4J29J20m5j15MJ1k21J41R7M1qj16J4r4J97j90P8J12
6067A01o8k3m5J21j3k7P0j44O5o8O7n7j6L2p2J30l2K1LQ6j91R2k4p6K03r8ll8
6095dOj16k9k6K96j58J44k19j4QO0j0rN2j42J20Q5kr1J05R5k4k28K0J89k19K66
6122A55j05k46J75K7J73k60m0R6O8j24l6J89r8J25O9j16j6o8J78k45K99k24Q4
6145F0j5k19J48L1J74M5k85m9J11Ko8r5J25N6q3N9j00J56R4j45j24J23L8q9K42
6170A92q0j46p9J94p1j16J22k5R7J29r5n3j00L3J82o4k35J04j02J63j5j19N6n5
6194h3J25K5p8O8o5O1N0l2q0m8J61J42j76O1j79Jp0N4J40n5L1j1j8L3m6J75j65
$$ plain form
6221 21 5 63 20 29 16 -29 46 27 12 6 225 -106 12 121 201 8 143 99 68 -77 116 -56 -65 121 10 -121
6247 -121 -10 115 14 -23 39 -97 -51 114 1 -122 -228 -28 85 64 41 16 -10 93 -151 -44 15 -114 -11
6270 -11 -79 125 31 160 -75 29 41 -34 134 -31 -73 24 268 63 118 82 95 -37 -196 35 57 3 46 3 70
6295 70 -40 111 34 107 16 -80 -33 35 24 202 89 -47 46 -1 -40 -48 -73 15 -53 106 -102 201 65 -113 37
6320 37 -127 -141 -30 83 147 146 -76 75 19 -152 59 2 -86 98 106 5 -4 -79 -33 -78 84 40 84 66 156 172 -86
6347 -86 164 -78 -10 104 -27 129 -33 -82 -222 130 -80 -141 136 -104 50 45 -62 -30 -30 82 -44 -22 -235
6370 -235 -62 -52 76 75 -45 -3 -91 171 147 159 56 -14 -134 28 -36 -45 102 -197 143 58 -33 -31 -11 137 -74
6395 -74 91 18 -54 -75 38 49 10 63 56 -15 135 106 49 151 6 98 -28 -182 -36 103 51 -7 124 53 124 -4
$$ packed form
6221B1j6N8m3Rj3m5P5j9j5oK19l31J18J09Q0j93J35m4l1j45J93j72rJ86j11j31
6247a21J11J25j01l7O2j36M6J65j13j23j06K00J13k1k3k5k6J03k44J07N9j29J03
6270a1o8K04r4J29k35J04J2p5J68j65m2R7K44k05N5l6J3j32j59K31K2n4M3m3O7
6295G0j10J51p7P3r1r6M7O8j1J78j13j36R3m7l9qk5Q8o8J59k08L03j36j78J50
6320C7j64j4J11J13O4jk22J51n6j71K11n7q8J84Qj01rp5M6m5J62m4M4j8R0J6k58
6347h6K50k42O8J14j31J56j62m9j40L52k10o1K77k40J54nj07L2%J12j26K2k13
6370b35J73J0J28jj20M2q8K62k4J2j03p0j20J62o4rJ47k99L40q5r1KK0J48k11
6395g4J65p3p2k1J13J1l9N3pp1J50k9n7J02j45R2j26j54J46J39n2n8J31p1P1j28
$$ plain form
6421 -4 154 -124 -45 2 67 152 -114 -96 21 -66 1 156 -86 16 -27 -28 12 -80 -146 -138 -23 121 -106 -15 64 207
6447 207 87 -122 -1 -119 33 -140 -16 -160 35 -24 -51 207 -68 99 -40 -37 -154 15 38 -102 20 37
6469 37 -267 -60 -3 28 10 41 -37 143 -100 -162 75 -2 -5 -167 -221 112 -65 -28 -72 77 42 -64 3 -59 -205
6494 -205 -188 84 83 -91 -38 -21 101 -71 -189 66 -124 29 -123 -85 127 63 55 32 32 -50 -91 -64 110 114 94 25
6520 25 19 44 -66 -107 102 122 -58 -70 138 79 -31 -50 -61 -230 -19 71 6 32 -116 15 -70 -4 39 -21 10 95
6546 95 168 63 -20 -32 18 37 34 -1 150 69 69 -188 58 88 28 35 89 -141 112 75 25 22 -16 24 101 -34 -126 -162 34
6575 34 -81 83 -46 -21 -62 -129 27 -32 79 -24 -199 -72 65 -55 104 197 3 -73 -34 -96 36 -25 -67 111
6599 111 -115 29 -68 -82 116 -73 34 -77 169 -100 51 -35 -118 96 -32 44 -131 -80 337 34 38 48 183
$$ packed form
6421dJ58k78P9M7O5Q5k66J8J17q7O7J55k42J02m3jM0r2o6QJ15J44k27R1P9J43
6447B07j20k09J21j18J52j73J24j44J95n9k7K58k75J67j39Lj17J69K3j40J22J7
6469C7l04K07N7L1j8L1p8J80k43o2K37p7lj62n4L33j77L7m4J49l5j06O7o2j46
6494b05J7K72jj74N3J7J22j72j18K55j90J53j52L8K12o4qk3%q2m1K7J74Mk0o9
6520B5oK5j10m1K09K0j80j2K08n9j10j9j1j69K11R0o5K6j48J31q5O6M3o0L1Q5
6546I5P3j05q3j2N0J9ll5J51q1%k57K46L0o0PN4k30K53l7n0ll8M0P7j35r2l6J96
6575C4j15J64j29K5m1o7J56n9J11j03j75J27J37j20J59R3j94p6L9o2J32o1m2J78
6599A11k26J44r7j4J98j89J07j11K46k69J51q6q3K14j28P6j75N1M17l03MJ0J35
$$ plain form
6622 183 68 26 29 49 116 37 -47 -57 -80 -67 -78 -27 61 19 161 -130 214 -240 8 37 -66 170 -4 20 6 -75
6648 -75 -88 66 138 11 -111 -111 -92 -62 -15 -174 -38 24 106 104 96 -5 -8 -34 -31 -23 56 82 -8 11 81 13 66 -94 84
6677 84 -13 3 66 -77 58 20 -164 -32 -32 9 -42 35 152 -21 54 -108 -21 -39 87 60 86 -52 20 -92 -34 -27
6703 -27 48 0 -37 68 110 -59 79 77 208 -22 -69 -25 -99 126 -100 -86 75 65 90 28 35 121 42 75 -76 19 58
6730 58 -193 -101 -20 -24 -60 -31 22 -92 -70 -52 199 -229 -114 56 22 334 -54 99 -25 118 -169 -5 1 -24 16
6755 16 -56 -103 -68 42 -70 -27 -136 51 -37 -28 6 -130 222 25 -36 -89 195 127 8 -84 136 202 56 130 -152
6780 -152 47 -15 53 21 -26 100 -237 68 -37 -106 239 134 186 39 48 -13 -57 -205 -128 40 95 -179 -7 -5 152
6805 152 121 -81 -207 59 -70 159 194 52 81 5 -6 -153 -226 -124 100 -52 102 -131 121 -97 -2 120
$$ packed form
6622A83j15m2LK0O7p9q4j0k3J3j1N1Q8m2J42k91L44m54K48K9j03K36j74K4j4q1
6648g5j3J54P2j27j22%J9L0M7j59J36O2Q2kqj01lk6LQP9K6r0J9P0o8N3j60J78
6677H4r7J6O3j43J35l8j84J32%M1n1P7J17j73P5j62Q7j8J26k7K6j38P2j12N8P
6703b7P5m8l7J05M2j69J38kJ31k30m7M4p4K25k26J4J61j0K5o2PQ6p9L3j51R5L9
6730E8k51R2Q1ml6K9N3j14K2J8K51m28J15J70l4L12l88J53j24J43k87J64Ok5M0
6755A6p2m7L5J10j12M3j09J87q8RL4j36L52j97o1n3K84o8j19r2K20O6j46P4k82
6780a52J99o2O8l2m7J26l37L05j05o9L45j05N2j47Ro1m4j48P7J68N5k74J72KJ57
6805A52l1k02j26K66j29K29L5j42K9p6j1j47p3J02K24j52J54k33K52k18R5J22
$$ plain form
6827 120 -83 132 -48 64 -79 94 -137 74 28 -127 48 168 -107 -69 -8 -134 -41 130 -37 86 -143
6848 -143 50 135 -159 -35 -48 -32 -70 -19 41 -47 -79 -14 30 14 36 -151 -147 -147 -1 -136 128 34 45 -23 -111 102 145
6875 145 127 -79 -7 -39 187 69 3 197 -182 119 -181 113 72 4 -28 157 145 -30 1 -20 139 54 111 -57
6899 -57 38 -116 -31 215 -66 78 69 41 137 142 -110 -48 70 -31 32 -55 10 92 -59 -86 -17 84 -48 62 -15 87
6925 87 -26 10 20 -30 -4 0 -53 157 -102 -148 17 -13 -112 79 -95 192 42 -155 33 -130 73 -96 166 -160
6949 -160 110 93 -23 -14 19 30 51 -56 1 -11 -79 -88 75 94 -30 40 26 20 -120 -36 -10 -100 11 51 93 -23 101
6976 101 24 -28 -296 -87 20 -118 2 47 111 128 7 -36 44 79 45 146 -100 60 4 -31 148 -53 24 -26
7000 -26 141 29 -104 19 42 -51 36 34 -60 111 126 30 -77 -58 -88 -107 13 79 7 29 -70 118 -79 31 -27 26
$$ packed form
6827A20k03K15j80J12j43J73k31K11m6j55J75J20k75L8O1j26R3J71j67J23k29
6848a43J93Q5k94J24j3J6l8N1O0q8l2O5M4j6K2j87M%J46j35K64r4J1o8q8K13M3
6875A45j8k06P2l2K26j18o6J94l79L01l00K94m1o8l2J85j2j75L1k1J59q5N7j68
6899e7R5j54Q5K46k81J44rk8R6Nk52O2J18j01O3q7O5Q2j51k7O9J01j32J10p7J02
6925H7j13L6J0n0K6Mn3K10k59m6J65l0r9J91j74K87j50j97J88j63K03j69K62l26
6949a60K70j7j16RL3J1K1j07N7j2o8rJ63J9j24P0j4oj40Q4K6r0J11M0M2j16J24
6976A01p7n2k68K09J07j38J20M5O4J7j21m3Q0L5l4J01k46J60n6l5J79k01P7n0
7000b6J67j12j33J23K3r3Q7kr4J71J5r6j07J9l0j9J20O6p2K2r9J88j97J10n8N3
$$ plain form
7026 26 77 79 -37 124 -20 -81 58 43 160 -42 51 115 196 -115 -45 166 -14 -21 -41 -190 141 25 -23 -115 -33
7051 -33 -43 140 -82 86 -5 12 -114 27 -43 -177 26 -186 -24 0 47 59 -28 -82 10 22 197 88 70 -166
7075 -166 -29 11 61 242 -54 104 97 -29 113 15 0 171 -8 131 48 200 -72 -106 138 73 127 126 4 -73
7099 -73 154 1 31 38 56 -41 -38 151 -12 121 24 109 28 -159 -28 30 41 -6 50 -32 -122 219 -40 -57 -116 -105 -70
7126 -70 11 -105 -105 79 -100 -59 4 44 -129 74 19 51 16 -227 179 14 194 -41 9 7 64 -15 -127 11 -74
7151 -74 -54 -42 67 -23 28 36 -55 52 71 -122 65 -24 0 113 -95 -73 -52 54 56 -71 16 -26 -49 88 -60 -47
7177 -47 106 134 -81 -92 6 194 47 -73 15 -85 34 -8 10 121 43 -47 83 100 -75 28 96 45 57 -105
7201 -105 72 6 -32 141 53 210 47 -148 109 47 83 -80 -120 -62 -163 108 19 89 -24 33 -73 -92 8 43
$$ packed form
7026B6N1Kj16J61j44o1J39j5J17k02R3O4Q1l11P0K11j80pk0j49L31j16m8r2Q2
7051c3j0J83k22J68r1J7j26J41p0j34K03k12J62K4M7J2q7n4R2J2J75j09j8k36
7075a66J37M0N0J81k96J58pj26J42r8j5J71j79J39q3J52k72l4K44o5N4jj22p7
7099g3K27j53L0PJ8r7LJ89j63J33r7Q5q1j87J31N8J1m7N6q2r0L41k59j7n9J1L5
7126g0Q1j16%J84j79M1O3M0j73K03n5L2l5k43M06j65J80k35N0kN7p9j12J38q5
7151g4K0J2J09r0N1Qr1J07J9j93J87q9K4J13k08K2K1J06Kj27Q7m2k3J37j48J3
7177d7J53K8k15j1R8J88j47j20Q8j00J19m2J8J11p8r0J30J7j75J03O8n1J2j62
7201a05J77o6l8J73q8J57j63j95K57o2L6j63m0N8j01K71q9P0j13N7j06j9J00L5
$$ plain form
7225 43 227 55 -31 -188 -64 -76 90 -43 20 2 -12 -47 157 -35 -274 66 -16 -98 66 -34 45 41 124 49 57
7250 57 -31 26 26 -98 -42 53 -112 -98 43 -69 -213 -152 125 -53 41 -59 -110 27 -137 11 57 -141 93 -11
7274 -11 98 85 27 -24 94 164 -170 -110 18 -11 -12 148 -61 -22 47 75 29 -56 104 75 -14 136 -43 71 48 -125
7300 -125 -29 -83 -58 -23 93 26 -55 -182 96 -24 -25 96 188 -106 36 107 86 97 -180 -56 -43 18 15 131 -115
7325 -115 -26 6 -170 -113 25 -50 36 -107 -120 -26 -76 -21 65 167 -3 -34 -46 141 81 12 133 -92 82 -80 -125
7350 -125 58 -17 146 33 79 -125 -4 -35 -33 108 47 -76 -9 -82 -128 -53 -122 -85 -101 123 8 25 108 40 243
7375 243 96 14 -53 18 -109 120 132 9 72 34 25 18 82 -32 -105 -38 140 72 -67 42 108 -91 -6 40 43 6 39
7402 39 -13 18 105 84 89 92 90 28 -93 -17 -131 -38 35 79 -34 68 -24 57 10 -64 -64 46 98 -97 -45 52 1 0 3 -33
$$ packed form
7225D3J84j72q6j57J24j2J66j33O3j8j4l5K04j92k39L40q2q2J64j00P9mQ3p5Q
7250E7q8N7%j24N6R5j65J4J41j12j44O1K77j78R4j00n1J37j64J48M6j98K34j04
7274a1J09j3n8n1J18P0l34O0J28k9jJ60k09L9O9K8m6q5J60k9q9J50j79J14k3j73
7300a25R6n4K5L5J16o7q1j27K78j20jJ21R2k94J42P1k1J1k77J24J3O1lJ16k46
7325a15Q9L2j76N7J38p5Q6j43j3R4n0N5Q6J02j70l1j2J87o0o9J21k25J74j62m5
7350a25J83p5J63j13M6k04J21l1KJ41o1j23O7p3m6P5o9L7j6K24j15J7Q3o8K03
7375B43j47q2o7P1j27K29J2j23O3l8rpO4j14p3O7J78o8j39J09O6j99Q5M6Ll7L3
7402C9n2L1Q7k1NLko2j21P6j14R3P3M4j13J02r2Q1m7p4%J10N2j95N2R7n1jLl6
$$ plain form
7432 -33 34 -110 154 77 -5 22 -19 104 64 63 -141 57 -8 70 82 43 115 -14 76 122 55 -67 -10 -29 -99 -122 -135
7459 -135 -71 58 -60 52 -207 -16 32 -168 -33 41 8 -96 -15 -25 120 -123 -97 88 -35 -120 -45 27 31 111
7483 111 -42 -38 59 95 2 132 -72 117 148 144 -102 25 25 -23 -54 -102 25 -31 105 25 -41 144 -94 19 -54 4
7509 4 28 -151 27 -79 -18 28 -38 -36 -93 -35 -34 -56 -308 -50 -34 -11 -127 -16 -9 -47 113 -87 -68 82 -117 -224
7535 -224 122 67 -76 -51 53 -30 12 -59 69 90 141 23 0 57 -94 -42 27 42 53 137 -62 65 125 16 21 -101
7561 -101 -7 23 -24 208 -189 119 65 114 38 -7 -131 17 94 -10 -173 -45 169 -80 134 19 98 49 36 -47
7585 -47 -8 132 -14 89 67 -82 86 -98 -22 -76 59 -103 -122 -23 -47 -32 67 98 -133 -94 -93 -156 88 -70 14
7610 14 -30 -52 -147 -78 2 -16 110 63 65 -4 -30 66 3 -19 -58 93 -51 4 24 148 86 178 -63 -13 -164 0 -42
$$ packed form
7432c3O7j44K64p7q2K7m1J23m0jk04J98o5P8J2l9P2j29R0M6o7j22N7j9p0k3j3
7459a35O4J29j18J12k59J91M8k00J35P4l3j04Q1j0J45k43K6J85j23q5P5P2MQ0
7483A11j53MR7L6r3J30k04J89L1mk46J27%m8l1m8J27n6J36q0o6J85k38J13p3N8
7509DK4j79J78j06O1M6o6Kn7N8Jk2k52K58J6K3j16J11Pl8J60k00J9J50j99j07
7535b24L46n5j43K5J04q3M2p1J28K1N1j18k3N7j51N2O9J5J1Q4j99J27O0j09Nj22
7561a01R4L0m7K32l97L08n4M9p6m5j24J48P7j04j63J28K14k49K14j15P9m9j3q3
7585d7L9J40j46J03k2j49J68j84P6n4J35j62j9R9k4J5R9L1k31L9Jo3K44j58Q4
7610A4m4k2r5O9Q0j8J26m7Ko9k6R6o3k2l9J51j44N5K0J24o2R2k41N0j51J64m2
$$ plain form
7637 -42 -54 42 -108 270 -138 -79 75 148 -9 -52 -27 94 22 -60 76 -67 -5 105 81 -75 -126 -137 82 69 -133
7662 -133 -18 -33 30 65 -137 -6 -3 -41 17 -69 43 -135 -59 -15 143 -25 -119 71 0 21 -167 28 125 185 -95
7687 -95 -21 -20 -20 -7 -55 113 -58 -84 -184 56 -13 21 50 -62 -253 3 56 -72 -52 46 -75 -104 -113 2 39 -45 -9
7714 -9 -44 -30 167 -63 64 -76 -227 -97 -74 -2 195 -38 -97 -66 -96 48 -88 68 70 92 81 -83 -102 84 -29
7739 -29 -6 -52 61 -128 120 -69 9 -89 -71 -39 -37 57 -35 41 -89 198 -44 234 88 104 -113 -10 136 -135
7763 -135 -71 112 172 -79 16 -14 36 78 -126 28 84 55 -143 121 76 48 75 19 -37 -104 -37 -1 87 128 23 -32
7789 -32 134 46 17 -128 237 221 16 14 -100 -58 98 50 6 65 -125 8 -38 50 -94 -123 -193 3 -177 12 3
7814 3 -38 114 -117 11 47 -93 -83 31 27 1 1 -136 -54 -80 125 -87 154 34 1 10 -127 -96 -5 -45 44 -188
$$ packed form
7637d2j2R6j50L78m08N9J54P3j57m3K5J21p2q2J36j43O2J10k4j56n1j1K19j3k02
7662a33J15j5O3L5k02J31Ll8N8q6J12j78P6M4J58j68r4J90p1K1j88J95R7O0k80
7687i5P4J%J3m8J68j71k6j00K40o9L4K9j12j91K56N3j28K0R8j21k9rJ15L7q4L6
7714il5J4J97k30J27j40j51J30K3P2J97k33n9L1l0J44j36J56KK2j1j64j9J86j13
7739b9K3m6J13j89K48j89P8r8J8L2KR4r2P6j30K87k42K78j46J6k17J03J46k71
7763a35O4J83O0k51R5l0N0M2k04J54N6k9j98K64m5k8K7n6n6o7O7L6Q8M1j05n5
7789c2J66q8k9j45L65j6k05kj14M2J56m8m4N9j90J33m6Q8j44k9p0J96j80J89r
7814Cm1J52k31J28L6j40J0J14mk6%j37Q2k6K05k12K41j20l3Rj37L1R1m0Q9k32
$$ plain form
7840 -188 30 -14 -16 13 1 -49 95 74 89 -45 -20 -9 82 -10 35 -94 56 83 108 3 18 -48 35 70 37 73 -47
7867 -47 -119 55 -90 -108 -14 -47 83 23 57 -68 60 14 -2 1 -32 13 127 -102 -106 30 -101 -41 -205 59 102 128
7893 128 102 176 -96 -111 -61 -109 77 50 -13 -114 -78 29 37 -107 141 -60 -102 73 72 102 -61 -14 -43 44 147 -64
7919 -64 -59 -119 4 55 23 10 0 -34 16 -200 59 -102 -53 137 -216 76 46 -81 -29 4 98 104 88 -53 67 255
7945 255 -3 -66 35 182 72 38 7 -67 -1 -38 -8 -21 -52 13 -29 27 -37 -71 -19 -132 60 -1 -66 244 -83 56
7971 56 137 -50 144 -183 -57 -68 12 -47 -117 40 -91 -147 -28 0 -246 79 60 56 -98 52 -32 52 -56 240
7995 240 -157 -54 -14 -91 106 -52 -78 34 -168 -101 45 75 19 -50 94 111 -79 11 16 79 200 -37 108 133
8019 133 -92 -115 -106 66 6 -54 58 -125 -112 -23 -13 -38 12 -37 -29 -268 -26 -52 -35 0 -105 158 95 -15 -31 -134
$$ packed form
7840a88K18m4kK9j2n0J44k1J5j34K5J1R1r2M5j29J50K7K5j05J5o6Q3L5l3L6j20
7867d7p2J74j45j8R4l3J30o0L4j25J28m6j6Ll3M5J14k29mJ36j31O0j64K64M3K6
7893A28k6P4k72j5N0m8J86k7o3j01L6J07Qj44K48k01m2J75jL0j63M7k9Q7J03k11
7919f4No0J23N1l2j3j0l4N0k16K59j61M9J90l53K92l0j27N2L3R4Oj6j41J20J88
7945B55k58o3J01J47j10l4l1p4O6l7L0j3l1O5m2N6o4l4N2j13J92o1o5L10l27J39
7971E6Q1j87J94l27J26j1Q0n9p0J57j31n6J19K8k46L25j9mj54J50q4Q4j08K96
7995B40l97J03M0p7J97j58k6J12k02O7J46L0n6o9J44J7j90R0NO3J21k37J45K5
8019A33k25k3RJ72o0o0J12j83J3Q9J0k5N0m9Qk39K42k6J7L5j05K63o3j10j6j03
$$ plain form
8045 -134 84 78 148 85 140 29 8 92 27 102 107 -120 -132 66 -35 -37 9 -81 -56 -81 -47 -23 -108 75 56 -255 31
8072 31 34 99 52 -21 -66 122 -6 102 -5 18 75 -107 73 -82 -75 -21 -24 84 34 85 -29 -153 92 13 84 -96
8098 -96 23 69 -197 -53 -48 43 8 24 41 39 40 -34 2 98 35 59 -144 -18 -50 -43 -115 119 -7 56 -13 -12 84 93 -82
8127 -82 -83 -91 198 -3 -38 -105 88 17 9 72 -41 67 -150 14 -53 -44 83 -176 182 91 68 195 -73 91 143 -56
8153 -56 -102 19 92 36 113 -46 -158 -37 -178 84 -124 -51 14 66 -184 32 -39 -123 0 -80 -117 -190 53 -18 23
8178 23 237 126 -6 11 -44 -35 17 -9 -73 2 -169 44 -14
$$ packed form
8045a34K18oP0o3N5j11k1Q4o5P5Nk27j2J98j01kM6r0K5k5L4K4q5J83j9l11K86
8072C1LO5m7p3m5J88j28J08j07K3N7j82J80j55PN4lJ08n0N1j14j24K45p9P1j80
8098i6J19M6k66J44NR1l5J6J7kJp4L6R6o3K4k03J26l2Pp2K34j26O3o9JR6Rj75
8127h2jqK89k01l5o7J93p1qO3j13J08k17J64o7RJ27k59L58r1k3J27k68J64N2j99
8153e6m6J21P3n6P7j59j12J21j41K62k08P3O5N2k50K16p1q4J23q0l7p3K43p1M1
8178B3K14j11j32J7n5RN2k6o4P5j71K13n8
8191a4
$$ Imaginary data points
##PAGE= N=2
##DATA TABLE= (X++(I..I)), XYDATA
$$ plain form
0 0 0 0 0 0 0 0 0 0 0 0 0 0 0 -5 8 -8 8 -8 8 -16 16 -24 24 -32 32 -40 48 -56 64 -72 80 -88 104 -117 133
35 133 -149 168 -188 208 -233 260 -289 321 -356 393 -433 478 -528 581 -640 704 -776 856 -946
54 -946 1044 -1157 1283 -1432 1603 -1803 2045 -2345 2723 -3215 3893 -4887 6497 -9543 17422
69 17422 -87365 -161546 -64064 -36767 4395 26553 39917 16029 23122 43451 55337 40499
81 40499 42595 46720 45566 39552 42127 21540 -18536 -52208 -59042 -56985 -40525 -12012 5085 -9143
95 -9143 -20848 -8440 11905 26551 50698 69033 53271 15839 -1652 -4414 -20030 -40256 -45140
108 -45140 -50541 -65560 -63486 -32605 -5243 3749 11869 22952 24990 28547 46628 56726 41394
121 41394 18521 4038 -7418 -8832 12710 35664 30506 7339 -11453 -32326 -55261 -57003 -36095
$$ packed form
0@%%%%%%%%%%%%%nJ3j6J6j6J6k4L2m0M8n6O4p2Q8j04J20j36J52j68J92k21K50
35A33k82L17l56L96m41M93n49O10o77P49q26R11j006J109j221J344j480J632j802
54i46J990k201K440k715L035l406L848m390N068n938P108q780J1384j6040K6965
69A7422j04787p4181R7482K7297M1162K2158J3364k3888P093K0329J1886j4838
81D0499K096M125j154o014K575k0587m0076l3672o834K057J6460K8513J7097j4228
95i143j1705J2408K0345J4646K4147J8335j5762l7432j7491k762j5616k0226m884
108d5140n401j5019K074L0881K7362Q992Q120J1083K038L557J8081J0098j5332
121D1394k2873j4483j1456j414K1542K2954n158k3167j8792k0873k2935j742K0908
$$ plain form
134 -36095 -21727 -16784 591 25740 33464 26038 18834 3615 -24715 -41435 -30350 -9474 5431
147 5431 17346 22188 11451 -2318 -691 10537 17660 22698 26809 18804 2161 -6248 -6505 -13089
161 -13089 -21753 -19108 -10937 -7256 608 15385 18475 2752 -12126 -15117 -15146 -12129 2852 18710
175 18710 17994 7495 2184 -1420 -8147 -10659 -8597 -12343 -20269 -19537 -11747 -4973 4226 19127 29018
190 29018 29825 32011 35741 28515 11806 -2748 -15363 -29176 -34172 -23786 -10524 -5852 -5093 -4787
204 -4787 -10419 -17708 -16546 -6920 1560 7610 15690 22211 22499 20190 18571 13565 5200 -167 -2235
219 -2235 -6206 -11455 -14774 -18971 -25559 -26913 -18058 -4939 7067 20024 29625 28373 18994 10994
233 10994 4154 -4161 -8927 -6531 -3281 -3224 -2518 -1018 -3297 -9058 -11903 -11557 -11066 -8802 -3178 1514
$$ packed form
134c6095J4368M943J7375K5149P724p426p204j5219k8330j6720J1085K0876J4905
147E431J1915M842j0737j3769J627J1228P123N038M111q005j6643q409k57o584
161a3089q664K645Q171L681P864J4777L090j5723j4878k991k9L017J4981J5858
175A8710p16j0499n311l604o727k512K062l746p926P32P790O774R199J4901R891
190B9018Q07K186L730p226j6709j4554j2615j3813m996J0386J3262M672P59L06
204d787n632p289J162R626Q480O050Q080O521K88k309j619n006q365n367k068
219b235l971n249l319m197o588j354Q855J3119J2006J2957R601j252r379q000
233A0994o840q315m766K396L250N7P06J500k279n761k845L46M91K264N624M692
$$ plain form
249 1514 3549 5749 9061 11138 12866 16180 17288 12909 5633 -1598 -10187 -18362 -20696 -17267 -11558
264 -11558 -5165 2774 8900 9163 6736 3766 660 -2692 -3660 -1267 1744 3214 4214 5424 4755 2733
280 2733 1464 628 -637 -2729 -4484 -6811 -9158 -9665 -7263 -3886 1205 7266 11754 12049 9631 5845
296 5845 276 -5527 -8697 -7966 -5945 -2837 1826 5474 5849 4527 3034 714 -2392 -4297 -4703 -4937
312 -4937 -4733 -3736 -1698 760 3354 5651 6471 6385 5168 2557 -1190 -4485 -6608 -7233 -5790 -1939 2761
329 2761 6342 7880 6514 3840 278 -3315 -5559 -6044 -6020 -5561 -4204 -1879 885 2781 4565 5106
345 5106 3911 2133 521 -358 -1632 -2554 -3401 -3431 -1755 1812 5303 7848 8055 5635 615 -4307 -6922
362 -6922 -7565 -6883 -4841 -1911 927 3668 6768 8252 7085 3318 -1725 -6513 -9165 -8588 -6061 -3268
$$ packed form
249A514K035K200L312K077J728L314J108m379p276p231q589q175k334L429N709
264a1558O393P939O126K63k427k970l106l352r68K393L011J470J000J210o69k022
280B733j269q36j265k092j755k327k347n07K402L377N091O061M488K95k418l786
296E845n569n803l170P31K021L108M663L648L75j322j493k320l106j905m06k34
312d937K04R97K038K458K594K297Q20q6j217k611l747l295k123o25J443L851M700
329B761L581J538j366k674l562l593k244m85K4M59J357K325K764J896J784N41
345E106j195j778j612q79j274r22q47l0J676L567L491K545K07k420n020m922k615
362f922o43O82K042K930K838K741L100J484j167l767n043m788k652N77K527K793
$$ plain form
378 -3268 -1097 131 711 1854 3553 4315 3464 1682 -529 -1447 -389 2494 5374 6613 5509 3131
394 3131 1524 1676 2211 1578 -764 -4325 -8543 -10853 -10231 -7090 -3905 -1798 192 1757 3452 5734
410 5734 6748 4954 408 -4517 -7425 -6890 -2106 3646 7402 8339 7314 5082 2788 1909 1120 -1422
426 -1422 -4620 -6110 -4567 -812 4048 7487 7597 3745 -1254 -4769 -6341 -6177 -6182 -6613 -7223 -6708 -3745
443 -3745 878 4614 5765 3768 76 -2434 -1963 1276 4537 5586 4510 2278 305 621 3553 6104
459 6104 6324 4445 2578 818 -591 -1348 -2622 -6373 -10514 -11077 -7970 -2400 3507 6764 4802 -1020
475 -1020 -6396 -8813 -8416 -5509 -823 2415 4030 6092 9092 10534 9642 6493 1439 -3794 -5981 -3814
491 -3814 358 2902 3461 2555 296 -935 -184 1910 1741 -849 -4181 -6728 -7334 -5245 -1592 709
$$ packed form
378c268K171J228N80J143J699P62q51j782k211r18J058K883K880J239j104k378
394C131j607J52N35o33k342l561m218k310O22L141L185K107J990J565J695K282
410E734J014j794m546m925k908N35M784N752L756R37j025k232k294q79p89k542
426a422l198j490J543L755M860L439J10l852m999l515j572J64nm31o10N15K963
443c745M623L736J151j997l692k510M71L239L261J049j076k232j973L16K932K551
459F104K20j879j867j760j409p57j274l751m141n63L107N570N907L257j962n822
475a020n376k417L97K907M686L238J615K062L000J442q92l149n054n233k187K167
491c814M172K544N59r06k259j231P51K094j69k590l332k547o06K089L653K301
$$ plain form
507 709 -309 -1728 -2416 -2180 -1288 677 1413 -318 -2094 -1588 651 2805 4776 5823 4650 3014 3314
524 3314 6128 7448 6712 3695 -1142 -6926 -9501 -7780 -4449 -1260 1226 2212 855 -957 -1828 -3217
540 -3217 -6038 -7871 -7069 -4542 -408 5287 9486 9338 5787 1906 -919 -2215 -1463 852 2024 906
556 906 31 336 662 1288 2265 2336 775 -375 -15 122 -662 -1595 -2251 -3709 -4007 -1969 850 2031 1556
575 1556 432 -2001 -4849 -5429 -3220 -1595 -682 633 1877 2300 3077 5336 6479 5350 4163 3086
591 3086 1056 -1000 -1776 -2082 -3365 -3897 -2256 -205 1109 1870 1420 -898 -4231 -5835 -4988 -3363 -650
608 -650 2774 4728 4655 3668 2798 1093 -1200 -2260 -2295 -2382 -2238 -617 237 302 -194 481 1156 1746 2991
627 2991 4168 3586 1133 -298 -1723 -3279 -3466 -1355 413 985 1471 1291 -61 -2320 -3550 -3665 -3716
$$ packed form
507G09j018j419o88K36Q92J965P36j731j776N06K239K154J971J047j173j636L00
524C314K814J320p36l017m837n784k575J721L331L189K486R86j357j812q71j389
540c217k821j833Q02K527M134N695M199j48l551l881k825j296P52K315J172j118
556I06q75L05L26O26R77P1j561j150L60J37p84r33o56j458k98K038K819J181m75
575A556j124k433k848n80K209J625R13J315J244M23P77K259J143j129j187j077
591C086k030k056p76l06j283n32J641K051J314P61m50k318l333j604Q47J625K713
608f50L424J954p3r87q70j705k293j060l5q7J44J621Q54O5m96O75O75N90J245
627B991J177n82k453j431j425j556j87K111J768N72M86j80j352k259j230j15n1
$$ plain form
644 -3716 -2637 4 1895 2751 2901 3218 2415 1236 887 1218 526 -299 -364 -1126 -2250 -2366 -1417 -560 413
663 413 1842 2904 2192 269 -1156 -2258 -3460 -2942 -1133 875 1965 2731 3219 2068 336 -593 -1181
680 -1181 -1882 -1920 -1103 -606 -513 -306 143 149 -31 731 1586 1669 807 326 -849 -2154 -2152 -578 802 1873 2890
701 2890 3417 2019 50 -1033 -2183 -3630 -3517 -2367 -1272 -79 1078 1931 1598 926 938 993 738 1171
719 1171 1341 639 -422 -1146 -1584 -1597 -1133 40 1115 823 332 -449 -1571 -2398 -2500 -1513 -444 1027
737 1027 2797 3967 3772 2909 1323 -409 -1776 -2394 -1996 -1859 -1693 -1112 -551 -888 -556 445 1096 1266
755 1266 1330 1416 967 196 -287 -328 -405 145 1081 1645 1423 854 240 -1323 -2545 -3177 -2967 -2400 -1190 207
775 207 1460 1580 1786 1762 1083 685 481 422 100 -392 -535 -570 -744 -254 458 940 856 986 652 -287 -1104
$$ packed form
644c716J079K641J891Q56J50L17q03j179l49L31o92q25o5p62j124j16R49Q57R73
663D13J429J062p12j923j425j102j202N18J809K008J090P66M88j151j732r29n88
680a181p01l8Q17M97R3K07M49Oj80P62Q55Q3q62m81j175j305KJ574J380J071J017
701B890N27j398j969j083j150j447J13J150J095J193J157Q53l33o72J2N5k55M33
719A171J70p02j061p24m38j3M64J173J075k92m91p81j122q27j02R87J069J471
737A027J770J170j95q63j586j732j367o18L98J37J66N81N61l37L32J001O51J70
755A266O4Q6m49p71m83m1p7N50R36N64k22n69o14j563j222o32K10N67J210J397
775B07J253J20K06k4o79l98k04n9l22m92j43l5j74M90P12M82q4J30l34r39q17
$$ plain form
796 -1104 -1321 -1404 -1377 -835 476 1514 1814 1859 1544 221 -794 -1413 -1239 -1365 -968 -702 -769 -807 -732 -146 159
817 159 670 1155 1371 858 548 454 351 335 817 840 1720 1942 2245 2000 835 -1092 -2590 -3678 -4045 -3284
837 -3284 -1966 -748 40 452 815 632 793 886 534 283 71 295 539 1019 1099 1224 455 -206 -51 -68
857 -68 -206 -155 -494 -756 -972 -519 442 1329 1740 1783 1181 514 92 -273 -812 -1529 -2342 -2824 -3225 -2582 -1681
878 -1681 -578 -52 568 991 1375 1784 2123 1894 1350 771 605 903 1684 2297 2279 1513 323 -726 -1769
897 -1769 -2305 -2429 -2229 -1755 -1491 -802 265 909 1347 875 236 -762 -1335 -1250 -754 -374 -291 -310 -265 56 456
918 456 1177 1317 1148 1026 593 805 925 1078 1149 409 -8 24 78 358 377 143 -725 -1492 -2060 -2226 -1831 -1726
940 -1726 -1197 -737 -225 274 950 1402 1203 342 -561 -843 -857 -285 480 1130 1549 1506 1658 1226 1333 822 425
$$ packed form
796a104k17q3K7N42J311J038L00M5l15j323j015o19J74j26L97K66o7l8P5N86L05
817A59N11M85K16n13l10r4j03j6M82K3Q80K22L03k45j165j927j498j088l67P61
837c284J318J218P88M12L63j83J61R3l52k51k12K24K44M80Q0J25p69o61J55j7
857f8j38N1l39k62k16M53R61Q87M11M3o02o67m22l65n39p17q13m82m01O43R01
878a681J103N26O20M23L84M09L39k29n44n79j66K98P81O13j8p66j190j049j043
897a769n36j24K00M74K64O89J067O44M38m72o39r98n73Q5M96L80Q3j9M5L21M00
918D56P21J40j69j22m33K12J20J53P1p40m17L2N4K80J9k34q68p67n68j66L95J05
940a726N29M60N12M99O76M52j99q61r03k82j4N72P65O50M19m3J52m32J07n11l97
$$ plain form
961 425 -12 -785 -814 -925 -495 -191 -52 -514 -720 -735 -856 -912 -853 -1090 -1214 -1210 -700 3 382 1134 1369 1133
983 1133 783 680 476 252 -43 37 -216 -248 -99 332 560 592 680 541 478 260 20 -447 -963 -1180 -1351 -1063
1005 -1063 -692 -30 354 99 80 -326 -809 -837 -928 -564 -188 209 687 1051 1394 1159 1149 717 268 -21 -233
1026 -233 -160 -204 -441 -398 -400 -334 -32 147 378 166 -178 -557 -772 -869 -942 -833 -250 275 775 799 750 542 59
1049 59 -255 -373 -216 -278 60 192 412 309 232 308 411 96 162 75 -208 -298 -520 -599 -697 -332 -278 442 543
1072 543 1018 886 362 -209 -661 -773 -846 -599 -317 -5 -18 236 372 290 131 -60 -142 -257 -31 260 127
1093 127 233 -48 274 189 539 593 436 -13 -810 -1179 -1181 -1086 -716 98 399 564 867 921 668 528 94 -212
1115 -212 -498 -450 48 158 339 13 -366 -695 -724 -409 -119 95 312 103 -215 -223 -245 101 443 756 816 789
$$ packed form
961D25m37p73k9j11M30L04J39m62k06j5j21n6N9k37j24MN10P03L79P52K35k36
983A133l50j03k04k24k95Q0k53l2J49M31K28L2Q8j39o3k18k40m67n16k17j71K88
1005a063L71O62L84k55j9m06m83k8r1L64L76L97M78L64L43k35j0m32m49k89k12
1026b33P3m4k37M3kO6L02J79K31k12l44l79k15r7p3J09N83N25N00K4m9k08m83
1049E9l14j18J57o2L38J32K20j03p7P6J03l15O6q7k83r0k22p9r8L65N4P20J01
1072E43M75j32n24n71m52j12p3K47K82L12j3K54J36q2j59j91q2j15K26K91j33
1093A27J06k81L22q5L50N4j57m49p97l69kR5L70Q14L01J65L03N4k53j40m34l06
1115b12k86M8M98J10J81l26l79l29k9L15K90K14K17k09l18qk2L46L42L13O0k7
$$ plain form
1137 789 717 155 -102 -793 -1342 -1151 -958 -728 -260 523 742 504 276 160 266 131 187 245 181 135 -147 201
1159 201 84 49 233 -69 -104 -200 -217 -618 -495 -623 -462 -31 282 690 968 623 247 -24 -406 -579 -558 -405
1181 -405 -8 96 29 -34 93 -24 208 384 286 341 510 364 189 -177 -460 -163 -378 139 210 610 328 59
1203 59 -510 -976 -970 -1047 -465 0 291 401 337 187 163 -177 -350 -167 -6 -75 61 491 583 625 387 612 619 731
1227 731 669 622 162 -283 -592 -904 -888 -532 -358 -73 -128 -109 -235 -369 -464 -465 -543 -249 -63 246 426 301 248
1250 248 192 31 -161 -1 93 226 243 85 151 370 386 676 864 1086 903 512 96 -524 -930 -999 -1066 -1089 -780
1273 -780 -884 -645 -481 -455 -312 -363 -131 -84 297 698 931 836 623 846 565 433 420 427 202 59 -151 -422
1295 -422 -422 -635 -383 -102 209 196 521 529 364 66 -309 -884 -1131 -1165 -1055 -694 -389 -317 -236 -205 -277 168 280
$$ packed form
1137G89p2n62k57o91n49J91J93K30M68P83K19k38k28j16J06j35N6N8o4m6k82L48
1159B01j17l5J84l02l5r6j7m01J23j28J61M31L13M08K78l45l76k71l82j73K1J53
1181d05L97J04o7o3J27j17K32J76r8N5J69j46j75l66k83K97k15N17P1M00k82k69
1203E9n69m66Op7N82M65K91J10o4j50k4l40j73J83J61o9J36M30R2M2k38K25PJ12
1227G31o2m7m60m45l09l12J6L56J74K85n5J9j26j34r5jp8K94J86L09J80j25n3
1250B48n6j61j92J60R4J33J7j58O6K19J6K90J88K22j83l91m16o20m06o9o7k3L09
1273g80j04K39J64K6J43n1K32M7L81M01K33r5k13K23k81j32j3Pk25j43k10k71
1295d22%k13K52K81L11j3L25Qj65k98l75n75k47l4J10L61L05P2Q1L1p2M45J12
$$ plain form
1318 280 529 690 908 788 1021 1087 825 724 543 669 246 -151 -392 -724 -1045 -1248 -1093 -981 -511 -236
1338 -236 -3 48 276 -164 -234 -115 -41 172 -130 -142 65 -19 -17 212 272 449 367 656 417 424 389 74 78 288 111
1363 111 219 304 482 359 -104 -460 -664 -744 -967 -723 -570 -542 -384 -225 -204 37 -30 -28 226 172 77 344 427
1386 427 538 579 505 627 617 745 606 379 187 -95 -418 -621 -560 -543 -479 -409 -390 -197 -196 -77 -150 -193 64 -86
1410 -86 6 160 485 228 284 281 22 145 71 -23 -119 -315 -233 -233 -146 63 77 318 528 623 676 581 208 -219 -189 -412
1436 -412 -534 -290 -289 -265 -336 -516 -481 -572 -308 -161 -148 -79 127 263 213 662 632 702 571 457 427 517 -95 -209
1460 -209 -275 -547 -454 -531 -344 -148 16 -244 38 188 -20 229 158 211 99 348 271 405 378 289 231 -79 143
1483 143 -62 -288 -365 -214 -526 -620 -420 -303 29 273 350 366 412 364 407 345 265 152 62 -22 25 105 -120 -238
$$ packed form
1318B80K49J61K18j20K33O6k62j01j81J26m23l97k41l32l21k03J55J12M70K75
1338b36K33N1K28m40p0J19P4K13l02j2K07q4KK29O0J77q2K89k39Pl5l15MK10j77
1363A11J08Q5J78j23m63l56k04q0k23K44J53K8J58J59K1K41o7KK54n4r5K67Q3
1386D27J11M1p4J22j0J28j39k27j92k82l23k03O1J7O4P0J9J93JJ19p3m3K57j50
1410h6R2J54L25k57N6lk59J23p4r4r6j96Q2%Q7K09J4K41K10R5N3r5l73m27L0k23
1436d12j22K44JK4p1j80L5r1K64J47J3O9K06J36n0M49l0P0j31j14l0R0o12j14
1460b09o6k72R3p7J87J96J64k60K82J50k08K49p1N3j12K49p7J34k7q9n8l10K22
1483A43k05k26p7J51l12r4K00J17L32K44P7J6M6m8M3o2q0j13r0q4M7Q0k25j18
$$ plain form
1507 -238 -566 -545 -532 -635 -407 -102 -243 -44 142 461 726 823 933 663 539 416 70 -13 -216 -442 -576
1528 -576 -754 -637 -813 -446 -382 -236 -49 24 257 535 719 850 737 536 526 205 119 124 52 -420 -579 -861
1550 -861 -813 -789 -490 -485 -295 79 313 454 922 687 716 751 509 199 80 185 -14 -221 -311 -410 -447 -400 -513
1573 -513 -566 -299 -301 -325 214 87 425 636 614 567 382 409 216 127 1 -246 -182 -326 -213 -256 -157 -33 65 -282
1597 -282 -43 -63 82 255 -13 5 -14 -23 314 137 340 164 -34 -48 -123 -353 -370 -226 -212 -131 -303 45 -85
1620 -85 95 118 44 294 81 244 344 357 259 321 202 340 150 121 5 -144 -400 -335 -654 -698 -635 -636 -415 -409 -256
1645 -256 55 331 343 340 395 579 364 632 493 421 336 218 -195 -202 -275 -313 -290 -144 -398 -437 -409 -378 -124 -16 309
1670 309 465 480 256 381 294 113 -294 -417 -525 -656 -468 -398 -332 -323 -259 31 -27 262 225 360 600 650 663 608
$$ packed form
1507b38l28K1J3j03K28L05j41J99J86L19K65R7J10k70j24j23l46q3k03k26j34
1528e76j78J17j76L67O4J46J87P3K33K78J84J31j13k01j0l21q6Np2m72j59k82
1550h61M8K4K99NJ90L74K34J41M68k35K9L5k42l10j19J05j99k07r0r9l7M7j13
1573e13n3K67kk4N39j27L38K11k2m7j85K7j93q9j26k47O4j44J13m3R9J24R8l47
1597b82K39k0J45J73k68J8j9rL37j77K03j76j98j4p5k30j7J44J4Q1j72L48j30
1620h5J80K3p4K50k13J63J00J3r8O2j19J38j90k9j16j49k56O5l19m4O3jK21OJ53
1645b56L11K76J2lN5J84k15K68j39p2q5j18m13pp3l8K3J46k54l9K8L1K54J08L25
1670C09J56J5k24J25q7j81m07j23j08j31J88P0O6RO4K90n8K89l7J35K40N0J3n5
$$ plain form
1694 608 655 458 258 267 -45 -187 -423 -624 -654 -738 -825 -754 -604 -450 -230 12 69 255 287 200 306 391 283 352
1718 352 427 204 371 167 73 219 46 23 18 -233 46 -45 -40 -110 34 144 -66 12 171 -39 19 -183 -252 -261 -327
1743 -327 -428 -369 -370 -174 -139 -122 -163 -87 -11 56 286 366 236 436 583 426 343 427 258 324 324 78 -37 -349 -299
1768 -299 -688 -644 -600 -430 -434 -308 -237 -184 -105 56 36 -98 1 112 131 287 272 387 211 229 92 89 64 206 108
1793 108 -79 -136 -81 7 -178 -84 11 -167 -131 71 -30 -168 -222 -190 -139 -6 -97 -142 -26 59 -254 -75 -158 -119 -104
1818 -104 -1 -104 116 160 51 111 256 221 297 521 393 268 155 38 -71 -232 -262 -519 -176 -158 -307 -371
1840 -371 -342 -501 -428 -245 -240 71 54 284 446 468 364 499 481 411 164 100 -133 -168 -177 -273 -309 -375 -251 -65 -95
1865 -95 -48 -55 6 204 210 299 221 258 140 51 51 -13 -69 -168 -266 -326 -334 -282 -259 -66 -132 76 56 214 228 298 537 339 181
$$ packed form
1694F08M7j97k00Rl12j42k36k01l0q4q7P1J50J54K20K42N7J86L2q7J06Q5j08O9
1718C52P5k23J67k04r4J46j73k3nk51K79r1Np0J44J10k10P8J59k10N8k02o9ro6
1743c27j01N9jJ96L5J7m1P6P6O7K30Q0j30K00J47j57q3Q4j69O6%k46j15l12N0
1768b99l89M4M4J70mJ26P1N3P9J61k0j34R9J11J9J56j5J15j76J8j37lk5J42r8
1793A08j87n7N5Q8j85R4R5j78L6K02j01j38n4L2N1J33r1m5J16Q5l13J79q3L9J5
1818a04J03j03K20M4j09O0J45l5P6K24j28j25j13j17j09j61l0k57L43J8j49o4
1840c71K9j59P3J83NL11j7K30J62K2j04J35j8p0k47o4k33l5rr6l6o6J24J86l0
1865i5M7pO1J98OQ9p8L7j18q9%o4n6r9r8o0qN2K3J93o6K08k0J58J4P0K39j98j58
$$ plain form
1894 181 174 231 15 -69 -182 -155 -238 -173 -110 -196 -406 -107 -136 36 -151 41 -74 259 431 160 187 128 107 178 21
1919 21 53 -53 -62 -266 -312 -42 -36 -14 -164 -57 31 -108 -65 -105 46 -120 72 149 260 71 -25 58 17 -78 -14 -163
1945 -163 -90 -77 -154 -128 -142 -85 -240 -87 -118 -47 149 186 -101 53 83 70 3 224 72 25 114 -33 229 -55 -143
1970 -143 -304 -155 -170 -289 -239 -101 -90 -115 129 9 45 155 112 235 261 200 234 107 68 94 -17 -131 -171 -149
1994 -149 -348 -210 -121 -228 -49 -3 87 62 71 91 266 196 35 125 52 -5 21 -47 -66 -87 -278 -205 -338 -16 -152
2019 -152 -228 -118 79 42 30 -36 23 316 219 226 210 158 -134 -24 -50 -224 -294 -77 -195 -174 -154 -143 -16 28 23 11
2045 11 201 90 300 236 58 226 17 -29 59 56 -66 -23 -220 -120 -310 -190 -128 90 -142 -138 28 82 125 185
2069 185 97 113 205 5 0 -57 14 -257 -142 -201 -192 -222 -162 -13 -30 -2 106 188 118 369 390 215 291 180 197 218 110
$$ packed form
1894A81pN7k16q4j13K7q3O5O3q6k10K99k9J72j87J92j15L33J72k71K7n9k1P1j57
1919B1L2j06rk04m6K70OK2j50J07Q8j39M3m0J51j66J92P7J11j89r6Q3m1r5O4j49
1945a63P3J3p7K6j4N7j55J53l1P1J96L7k87J54L0j3o7K21j52m7Q9j47K62k84q8
1970a43j61J49j5j19N0J38J1k5K44j20L6J10m3J23K6o1L4j27l9K6j11j14m0K2
1994a49j99J38Q9j07J79M6R0k5RK0J75p0j61R0p3n7K6o8j9k1j91P3j33L22j36
2019a52p6J10J97l7j2o6N9K93r7Pj6n2k92J10k6j74p0K17j18K1K0J1J27M4nj2
2045A1J90j11K10o4j78J68k09m6Q8lj22M3j97J00j90J20O2K18k32MJ66N4M3O0
2069A85q8J6R2k00nn7P1k71J15n9Rl0O0J49j7K8J08Q2p0K51K1j75P6j11J7K1j08
$$ plain form
2096 110 77 -125 148 -43 -198 -149 6 -34 -118 -106 -84 -17 -54 -136 -124 8 -22 51 19 60 154 123 119 154 0 206
2122 206 100 39 61 186 1 119 -26 139 -15 -176 -88 -129 -77 -273 -150 7 -203 -40 -17 3 -96 -53 130
2145 130 91 64 -173 43 -135 -138 -116 -22 318 45 -14 68 163 373 92 214 196 110 340 212 131 -277 -106 -410
2169 -410 -308 -307 -355 -250 -247 -234 -252 -77 -50 -52 119 -33 209 312 210 237 139 25 -16 -12 17 -98 -227 -161 125 -54
2195 -54 62 -63 41 -93 85 102 98 36 158 170 -278 -94 -85 -238 -196 -122 -203 -236 -102 -273 -159 -30 -177 213
2219 213 205 257 247 295 264 93 371 101 141 57 42 38 -84 -265 -142 -141 -210 -71 -129 -8 -94 -106 118 56 17 132
2245 132 92 86 173 31 8 -96 126 45 62 -12 104 -4 19 116 127 4 95 33 91 -80 -17 43 -29 117 79 -70
2271 -70 -106 18 56 4 -140 -23 -3 -18 -107 -229 26 38 155 -128 -125 190 -78 10 -98 55 -19 159 36 131
$$ packed form
2096A10l3k02K73j91j55M9J55m0q4J2K2O7l7q2J2J32l0P3l2M1R4l1mL5j54K06
2122B06j06o1K2J25j85J18j45J65j54j61Q8m1N2j96J23J57k10J63K3K0r9M3J83
2145A30l9k7k37K16j78lK2R4L40k73n9Q2R5K10k81J22j8q6K30j28q1m08J71l04
2169d10J02Jm8J05LJ3j8J75K7kJ71j52K42J03j02K7r8j14m1MK9j15j29O6K86j79
2195e4J16j25J04j34J78J7mo2J22J2m48J84Rj53M2P4q1l3J34j71J14J29j47L90
2219B13qN2j0M8l1j71K78k70M0q4j5mj22j81J23Jo9J39n8J21q6j2K24o2l9J15
2245A32m0oQ7j42k3j04K22q1J7p4J16j08K3R7J1j23R1o2N8j71O3O0p2J46l8j49
2271g0l6J24L8n2j44J17K0j5q9j22K55J2J17k83LL15k68Q8j08J53p4J78j23R5
$$ plain form
2295 131 58 -94 -4 -76 97 -94 -156 -37 -221 -181 -57 -90 -39 2 200 179 151 150 55 26 293 -64 51 -53 -3
2320 -3 -116 -115 -51 -147 -74 -100 -41 -102 -32 -1 109 69 17 152 -46 60 190 49 31 -52 158 -51 -158 -150 -145 -216 -13
2347 -13 -195 -138 8 -88 84 243 232 255 72 77 168 2 194 7 -74 -80 -111 17 55 126 -214 -131 -11 -27 154
2372 154 -85 -74 169 -70 -133 -44 145 -7 10 -61 -88 -135 -120 -204 7 7 -52 -81 22 53 -117 148 -79 -67 124
2397 124 120 26 53 -17 68 -48 -121 65 -61 -17 8 -238 -101 128 -13 182 202 -127 -91 37 -8 76 18 -69 -70 -3
2423 -3 -92 -30 -87 -42 3 145 -24 -79 -104 159 46 -64 58 -122 -189 -55 -29 -50 44 -95 -153 -78 -25 112 -18
2448 -18 -27 -31 -106 -46 -144 90 25 10 -70 90 -17 -60 10 72 -42 54 -50 177 -47 -58 -38 -115 29 -85 -77 -13 110
2475 110 -54 -115 111 -6 38 3 -190 29 90 70 -17 30 -34 82 -138 1 32 110 11 60 -61 99 125 -134
$$ packed form
2295A31p3j52R0p2J73j91o2J19j84M0J24l3N1M1J98k1k8jr5k9K67l57J15j04N0
2320cj13JO4r6P3k6N9o1P0L1J10m0n2J35j98J06J30j41j8q3K10k09j07QNp1K03
2347a3j82N7J46r6J72J59j1K3j83NR1j66J92j87q1ol1J28L8P1l40Q3J20j6J81
2372A54k39J1K43k39o3Q9J89j52J7p1k7m7J5q4K11%n9k9J03L1j70K65k27J2J91
2397A24mr4K7p0Q5j16p3J86j26M4K5k46J37K29j41J95K0l29L6J28m5Q4n8q7jO7
2423cq9O2n7M5M5J42j69n5k5K63j13j10J22j80o7J34K6k1R4j39n8P5N3J37j30
2448a8rmp5O0r8K34o5j5q0J60j07m3P0O2j14R6j04K27k24j1K0p7J44j14QO4J23
2475A10j64o1K26j17M4l5j93K19O1k0q7M7o4J16k20J39L1P8r9M9j21J60K6k59
$$ plain form
2499 -134 -5 66 -167 44 58 8 51 -25 -151 5 -64 -83 -19 47 -24 -158 24 -127 -14 -33 -175 -102 -17 185
2523 185 166 2 62 96 -87 122 26 30 120 -30 100 -17 -72 -78 7 -4 -265 -36 -230 -204 127 -5 -77 -102 180
2548 180 0 -27 -11 115 82 49 15 37 53 23 99 -46 -98 112 159 101 311 23 45 34 -51 97 134 16 32 136
2574 136 -5 16 -130 -25 -20 58 -94 -20 -206 132 -45 46 43 -83 -8 -14 89 72 166 -49 105 22 64 68 -130 80
2600 80 -104 -112 25 -10 -166 -70 -66 22 -2 -10 200 10 -36 -79 33 -125 52 169 142 143 -7 96 -112 -91 30 -34
2626 -34 -95 -9 -144 51 126 -133 -19 -20 63 144 -167 49 -46 21 -126 18 88 19 -19 -11 -116 35 -149 51 74
2651 74 35 115 -109 -40 13 56 -18 -1 10 28 -147 59 44 -225 -148 -137 -26 -48 -32 -173 -110 -92 -112 -20 -205 -3
2677 -3 14 0 -21 21 180 -11 15 45 143 -143 58 52 112 41 26 -97 63 56 -52 24 -121 -45 35 117 -126 169 91
$$ packed form
2499a34J29P1k33K11J4n0M3p6j26J56o9j9O4O6p1j34J82j51J13j9j42P3Q5K02
2523A85j9j64O0L4j83K09r6MR0j50J30j17n5oQ5j1k61K29j94K6L31j32p2k5K82
2548A80j80k7J6J26l3l3l4K2J6l0P6j45n2K10M7n8K10k88K2j1q5J48L7j18J6J04
2574A36j41K1j46J05NP8j52P4j86L38j77R1lj26P5oJ03j7R4k15J54q3M2Mj98K10
2600H0j84qJ37l5j56R6MQ8k4qK10j90m6m3J12j58J77J17k7Jj50J03k08K1J21o4
2626c4o1Q6j35J95P5k59J14jQ3Q1l11K16r5O7j47J44P0o9l8Qj05J51j84K00K3
2651G4l9Q0k24O9N3M3p4J7J1J8j75K06j5k69P7J1J11k2J6j41O3J8k0R2j85K02
2677cJ7j4k1M2J59j91K6L0R8k86K01oO0p1j5j23J60pj08P6j45P6Q0Q2k43K95p8
$$ plain form
2704 91 -52 -111 -144 76 -7 -8 -20 36 114 0 -12 -103 82 110 -5 113 -20 112 210 -1 -4 89 38 -63 -54 -114 2
2731 2 -157 -17 -52 -69 -158 -111 -120 67 129 -49 4 -7 -134 -76 -135 67 -150 -19 -106 -56 98 -107 109 -100 40
2756 40 -98 -29 51 120 -143 -37 33 -108 -46 26 -38 -18 66 -24 -42 -79 37 69 68 26 -40 -63 47 183 34 -28 30
2783 30 215 28 43 208 51 3 -119 -104 166 55 128 30 13 -21 71 -32 -33 -18 -86 69 97 -57 -107 -48 -107 -115
2809 -115 67 -18 70 48 -56 78 -84 146 -63 133 -12 -11 25 -158 181 -83 47 -108 -119 -104 -23 -30 -9 -41
2833 -41 28 -18 339 91 -92 72 39 38 275 16 -266 151 -32 37 28 -28 96 -133 46 85 -143 52 181 56
2857 56 -41 -71 22 112 -63 -38 15 -36 108 80 -113 -103 28 -10 -46 -217 3 -56 5 67 14 -31 -84 -136 -326 77
2883 77 -68 18 21 -4 -45 70 134 -16 4 -49 134 177 -11 -209 25 -158 134 9 99 61 65 50 -53 65 -94
$$ packed form
2704I1j43n9l3K20q3jj2N6P8j14j2r1J85K8j15J18j33J32R8k11lR3n1j01Ro0J16
2731Bj59J40l5j7q9M7rJ87O2j78N3j1j27N8n9K02k17J31q7N0J54k05K16k09J40
2756D0j38O9Q0O9k63J06P0j41O2P2o4K0Q4r0j8l7J16L2jm2o6k3J10J36j49o2N8
2783C0J85j87J5J65j57m8j22J5K70j11P3r8j7l4R2j03jJ5o8J55K8j54n0N9n9q
2809a15J82q5Q8k2j04J34j62K30k09J96j45JL6j83L39k64J30j55j1J5Q1pK1l2
2833d1O9m6L57k48j83J64l3jK37k59k82M17j83O9rn6J24k29J79L9k28J95J29j25
2857E6r7l0R3R0j75K5N3n1J44k8j93J0J31l8l6j71K20n9O1O2n3m5n3n2j90M03
2883G7j45Q6Lk5m1J15O4j50K0n3J83M3j88j98K34j83K92j25R0l8Mj5j03J18j59
$$ plain form
2908 -94 80 -77 -44 -17 -174 -66 -52 67 -85 60 -163 -15 -7 -45 -17 150 93 -86 -177 -33 -99 81 54 17
2932 17 13 52 56 39 -199 -55 -11 -39 22 -40 21 -28 -39 -91 18 100 104 -60 176 37 42 14 -3 87 -93 80 65 -170
2960 -170 139 48 -111 35 -40 144 90 99 72 -50 -35 8 -124 193 5 -115 -29 59 -50 -149 -15 -114 48 -261
2984 -261 -63 172 -89 -81 -169 81 60 -7 -50 51 78 -9 -19 128 1 110 100 8 -115 -265 5 70 65 -158 -65
3009 -65 195 -36 -115 63 36 -87 31 -60 -128 193 66 -72 -100 194 -73 -69 -41 21 -42 31 98 113 153 57 102 -85
3035 -85 96 108 60 -27 -32 -258 -38 -71 10 80 -30 122 -65 33 -124 -131 31 -32 -50 -92 -11 -77 35 16 1 52 -65
3062 -65 -29 -210 -96 34 110 -48 88 -30 -67 22 64 55 -109 169 40 15 -132 -22 -45 -46 -150 75 92 18 136
3087 136 83 -96 191 97 -74 66 -90 26 -75 16 -65 69 201 -213 -267 -31 10 113 -154 -77 140 -148
$$ packed form
2908i4J74j57L3K7j57J08J4J19j52J45k23J48Ql8K8J67n7j79r1J44o6J80k7l7
2932A7mL9Mj7k38J44M4k8O1o2O1m9j1n2J09Q2Mj64K36j39Nk8j7R0j80J73j5k35
2960a70L09r1j59J46p5J84n4Rk7j22J5M3j32L17j88j20Q6Q8j09r9J34r9J62l09
2984b61J98K35k61Qq8K50k1o7m3J01K7q7j0J47j27J09j0r2j23j50K70O5nk23R3
3009f5K60k31p9J78k7j23J18r1o8L21j27j38k8K94k67MK8O2o3P3O7J5M0r6M5j87
3035h5J81J2m8q7nk26K20l3Q1P0j10J52j87R8j57pJ62o3j8m2Q1o6J12j9j5N1j17
3062f5L6j81J14J30P6j58J36j18l7Q9M2rj64K78j29k5j47J10k3jj04K25J7p4J18
3087A36n3j79K87r4j71J40j56J16j01R1q1J34J32m14n4K36M1J03k67P7K17k88
$$ plain form
3109 -148 -40 -59 -38 57 29 -37 -163 -53 -75 -42 210 -17 3 64 -104 38 -52 -28 -65 46 60 -66 67 177
3133 177 -117 27 109 23 -155 -68 7 -128 -23 -29 -93 89 -41 -9 60 -95 -49 -3 101 -27 88 132 -18 8
3157 8 -28 39 139 64 -57 -89 83 -27 160 27 43 -68 -20 -1 22 -5 45 81 27 -30 75 32 84 -128 -79 -19
3183 -19 123 -104 60 78 -25 85 53 53 -148 43 -29 -38 166 16 -48 -131 -114 -8 60 11 -125 -67 -115 -11 -90
3208 -90 33 3 -178 -47 -84 -7 -167 175 112 66 18 -57 29 63 23 -46 71 -60 -44 -36 6 -19 -113 100 -44 89
3234 89 41 120 -150 50 -143 18 4 -80 -58 -12 -36 -103 69 -28 94 51 5 9 99 43 -126 61 124 5 40 -11
3260 -11 139 38 -48 62 0 85 170 11 123 -10 -6 130 16 -98 36 -56 74 58 -63 -114 173 -140 57
3283 57 197 -156 36 28 6 -32 -127 25 36 46 -80 22 -77 106 142 95 -66 -101 79 43 -120 42 26 88 96 -152
$$ packed form
3109a48J08j9K1R5k8o6j26J10k2L3K52k27K0O1j68J42r0K4l7J11J4j26J33J10
3133A77k94J44Q2q6j78Q7P5j35J05oo4J82j30L2O9j55M6M6J04j28J15M4j50K6
3157Hl6O7J00p5j21l2J72j10J87j33J6j11M8J9K3k7N0L6n4n7J05m3N2k12M9O0
3183a9J42k27J64J8j03J10l2%k01J91p2rK04j50o4q3J7J06O8m9j36N8m8J04p9
3208i0J23l0j81J31l7P7j60L42o3m6m8p5Q6L4m0o9J17j31J6QM2k5r4K13j44J33
3234H9m8P9k70K00j93J61j4q4K2M6k4o7J72r7J22m3m6MR0n6j69J87O3j19L5n1
3260a1J50j01q6J10o2Q5Q5j59J12j33MJ36j14j14J34r2J30j6j21n1K87l13J97
3283E7J40l53J92qk2l8r5J52J1J0j26J02r9J83L6m7j61l5J80l6j63J62j6O2Qk48
$$ plain form
3309 -152 -3 -148 -4 -8 10 73 -91 -198 -37 -57 -16 -58 57 101 -28 -60 -121 99 3 -19 -90 -64 10 60 -48
3334 -48 62 -52 -143 10 -11 -182 50 91 -27 63 -17 3 1 -192 -105 148 105 -123 258 -2 83 -85 10 60 44
3359 44 101 30 -58 -51 154 -40 51 -93 -23 1 295 90 60 120 -20 19 -90 -111 -9 -64 -124 -6 125 -148 -88
3384 -88 8 -101 -90 127 135 -32 -20 -84 -8 149 -66 39 -54 -31 -107 85 86 74 -22 -93 -54 -181 -32 -26 25 -35 -262
3411 -262 -38 25 -129 90 162 64 -213 -89 -35 -159 -40 -13 -29 -1 54 -65 -73 63 -9 -42 -92 -61 -28 139 2
3436 2 -6 -41 18 137 42 0 -129 -58 -124 -92 -42 -93 -112 -21 -114 -30 -21 -135 -78 -48 56 27 34 -63 60 -6 111 -92 157
3465 157 -252 -141 -76 -38 88 -61 78 -54 -31 -59 -71 29 -72 8 93 -139 36 131 -16 -71 163 154 10 -36
3489 -36 45 138 54 -165 -88 -175 -53 93 129 24 41 63 -12 -38 -75 -35 44 59 76 -193 -34 -15 -98 -45 41 -35 -68
$$ packed form
3309a52J49j45J44mJ8O3j64j07J61k0M1m2J15M4j29l2o1K20r6k2p1K6P4N0j08
3334d8J10j14r1J53k1j71K32M1j18R0q0K0kj93Q7K53m3k28L81k60Q5j68R5N0j6
3359D4N7p1q8PK05j94R1j44P0K4K94k05l0O0j40L9j09k1J02n5o0J18J31k73O0
3384h8R6j09J1K17Qj67J2o4P6J57k15J05r3K3p6J92Jj2r6p1L9j27J49ON1o0k27
3411b62K24O3j54K19P2r8k77J24N4j24J19K7j6K8N5j19qJ36p2l3n0L1L3J67j37
3436Bql5N9J19r5m2j29P1o6L2N0n1j9R1r3Q4Rj14N7L0J04k9Pr7J23o6J17k03K49
3465A57m09J11O5L8J26j49J39j32K3k8j2J00j01Q0Q5k32J75R5j47n5K34rj44m6
3489c6Q1R3q4k19P7q7J22J46L6j05J7K2p5k6l7M0P9J5J7k69J59J9q3N3Q6p6l3
$$ plain form
3516 -68 -199 -58 38 235 128 2 -15 110 -84 -29 56 -103 49 65 55 11 -124 -28 38 -54 140 31 -59 -198
3540 -198 -201 170 109 128 17 42 -7 119 82 166 54 -132 37 56 -50 -131 -44 -164 65 156 -16 1 75 45 -48
3565 -48 55 135 76 -98 -24 162 -48 -31 53 30 -101 -59 33 -7 78 160 -64 -76 -23 47 164 -16 -98 43 -53 35
3591 35 93 -41 -56 -12 -41 81 83 -14 -20 155 0 75 150 -17 -75 68 127 17 -70 48 -103 -8 42 -98 -155 -33
3617 -33 77 -214 16 46 71 -51 -169 -126 105 -18 -200 37 29 -53 53 -7 -17 -94 35 128 46 43 -60 273 155
3642 155 -91 -26 160 132 89 128 -112 -168 102 120 -42 2 6 8 -158 -42 132 -124 200 48 193 -94 -5 65
3666 65 52 102 7 19 -46 54 11 66 -53 -80 -1 -36 66 -10 137 54 -22 -13 -2 247 141 38 -229 48 -86 50
3692 50 -58 -58 26 18 -46 -73 145 -169 -142 -33 -134 53 71 5 7 -68 71 -19 -43 85 42 143 -39 47 -46 24 -99
$$ packed form
3516f8j31J41R6J97j07j26j7J25j94N5Q5j59J52J6j0m4j35R6O6r2J94j09r0j39
3540a98lL71o1J9j11K5m9J26l7Q4j12j86J69J9j06q1Q7j20K29R1j72J7P4l0r3
3565d8J03Q0n9j74P4J86k10J7Q4k3j31M2R2m0Q5Q2k24j2N3P0J17j80q2J41r6Q8
3591C5N8j34j5M4k9J22Kr7oJ75j55P5P5j67n8J43N9j10q7J18j51R5N0j40n7J22
3617c3J10k91K30L0K5j22j18M3K31j23j82K37qq2J06o0j0p7J29R3q2lj03L33j18
3642A55k46O5J86k8m3L9k40n6K70J8j62M4MKj66J16J74k56L24j52J45k87Q9P0
3666F5j3N0r5J2o5J00m3N5j19k7P9l5J02p6J47q3p6RJ1K49j06j03k67K77j34J36
3692E0j08%Q4qo4k7K18l14K7J09j01J87J8o6Kp5J39r0k4J28m3J01j82Q6r3P0j23
$$ plain form
3719 -99 -42 32 31 -104 -65 85 125 196 49 69 1 -30 73 -31 69 10 -201 78 -108 32 -53 25 -9 9 84 7
3745 7 -145 5 -62 -18 66 6 19 211 -83 -10 52 60 3 37 120 -50 78 29 43 6 -60 158 43 -68 159 89
3771 89 71 -53 -59 -15 -18 -35 66 -21 57 -66 -181 -100 -59 21 -113 39 14 -88 -108 77 -44 -42 62 47 -27 -86 -64
3798 -64 -119 49 36 -142 -17 -3 -54 -74 -95 23 -19 -30 185 -66 56 -29 -32 51 47 -130 -6 -33 130 -20 -96 42
3824 42 69 -54 154 -148 105 106 -96 -11 -126 -22 74 75 181 127 62 121 48 -19 -109 -192 1 -164 -14 49 53 53 -130
3851 -130 65 -76 53 -54 -32 6 -112 166 137 -38 100 -114 -181 15 134 204 -18 -87 -88 -1 -33 -24 30 -46 -3
3876 -3 -59 130 -128 -49 113 99 -103 -4 28 148 -33 -147 -37 -83 -35 -19 -67 -30 -79 0 83 -76 -31 -141 -13
3901 -13 177 12 -47 -69 18 -74 31 -61 -72 -32 -106 26 7 -88 101 17 -34 61 -10 -167 -125 -8 90 93 -98 45
$$ packed form
3719i9N7P4jj35L9J50M0P1j47K0o8l1J03j04J00n9k11K79j86J40q5P8l4J8P5p7
3745Gj52J50o7M4Q4o0J3J92k94P3O2Qn7L4Q3j70J28m9J4l7o6K18j15j11K27p0
3771H9j8j24oM4lj7J01q7P8j23j15Q1M1Q0j34J52k5j02k0J85j21KJ04j5p4n9K2
3798f4n5J68j3j78J25J4n1k0k1J18m2j1K15k51J22q5lQ3mj77J24k7J63j50p6J38
3824D2K7j23K08l02K53Jk02Q5j15J04R6JJ06n4o5N9p3o7r0q3J93j65J50O3M%j83
3851a30J95j41J29j07K2L8j18K78k9j75J38k14o7J96J19P0k22o9jQ7l2RN4p6M3
3876cn6J89k58P9J62j4k02R9L2J20j81j14J10m6M8J6m8L7m9P9Q3j59M5j10J28
3901a3J90j65n9k2Q7r2J05r2j1M0p4J32j9r5J89q4n1R5p1j57M2J17R8Lj91J43
$$ plain form
3927 45 78 -30 138 127 -4 21 80 -23 60 -21 28 -179 86 122 -125 43 77 -124 60 151 56 -149 100 -54
3951 -54 -10 10 -75 73 53 30 62 29 -3 -39 -171 -25 197 246 -79 -92 91 7 -37 -49 -4 71 -41 123 -18 -205
3977 -205 53 -23 -20 -94 -143 67 -89 -65 148 56 87 68 -39 -51 56 192 -42 -134 128 -52 8 -41 -135 81 22
4002 22 24 77 79 68 -70 -206 -45 7 109 194 24 23 48 93 19 -53 78 -47 166 -76 -31 4 -75 42 93 22 -42
4029 -42 24 56 -7 -218 10 199 -252 52 -6 -1 143 -114 -44 37 5 -48 154 74 -48 31 -37 25 -33 57 -25 51
4055 51 28 -142 16 182 -82 -48 -22 -8 -132 -213 -45 -18 -15 -133 61 47 -1 88 -120 -31 166 -183 3 123
4079 123 -82 108 -157 56 -16 -91 71 66 -211 -20 -141 16 102 17 -93 -5 116 10 154 185 -21 58 -46
4102 -46 13 -43 -95 73 4 -83 -119 29 -48 -4 -35 65 33 -146 108 108 55 -143 -30 82 102 -5 -79 -8 -46 -154
$$ packed form
3927D5L3j08J68j1j31K5N9j03Q3q1M9k07K65L6k47J68L4k01J84R1r5k05K49j54
3951e4M4K0q5J48k0k3L2l3l2l6j32J46K22M9l25j3J83q4m4j2M5P5j12J64j41j87
3977b05K58p6Lp4m9K10j56K4K13r2L1j9j07j2J07J36k34r2K62j80O0m9r4K16n9
4002B2KN3Kj1j38j36J61N2J02Q5j70jK5M5p4p2J31j25K13k42M5L5p9J17N1p1o4
4029d2O6L2o3k11K28J89m51L04n8NJ44k57P0Q1l2n3K02q0j22P9o8O2n8R0q2P6
4055E1k3j70J58J66k64L4K6J4j24q1J68K7Lj18J94j4m8Q9k08Q9J97l49J86J20
4079A23k05J90k65K13p2p5J62nk77J91j21J57Q6q5j10Q8J21j06J44L1k06P9j04
4102d6N9n6n2J68o9q7l6J48p7M4l1J00l2j79K54%n3j98J13J12K0j07p4P1l8j08
$$ plain form
4128 -154 9 99 58 114 72 -96 0 -22 110 60 -82 -134 -53 71 -94 -78 -92 44 37 8 -38 12 143 14 77 24
4154 24 138 -131 -33 -11 113 40 -38 -84 77 -62 24 32 11 107 -235 -62 54 -81 112 -40 -156 -123 -25 -38 117
4179 117 -90 -23 -86 -120 18 -140 -65 7 33 -97 166 20 -120 -68 59 -184 135 -224 167 -220 57 -41 58
4202 58 -115 44 -30 -93 113 -18 -235 -1 -166 -77 -32 -13 -150 -53 -53 -38 91 -29 -178 -157 -65 72 -13 -38 -86
4227 -86 -15 41 147 56 -61 -21 -34 -99 -79 -27 -34 -2 3 -189 63 -133 -13 34 -13 -53 33 2 8 -139 32 111 18 -104
4255 -104 -3 24 -105 168 -6 227 112 6 13 1 -140 90 80 -14 -13 141 -103 61 10 -140 90 112 -148
4278 -148 123 143 168 56 141 98 -15 -104 -5 88 -33 24 92 -84 71 -94 25 -40 176 32 -52 126 162 127
4302 127 -66 -67 -1 -137 -133 -49 -119 -37 167 26 98 -87 120 -34 -43 53 -94 78 97 2 199 -134 117 15 61
$$ packed form
4128a54J63R0m1N6m2j68R6k2J32n0j42n2Q1J24j65J6j4J36pk9m6N0J31j29O3n3
4154B4J14k69R8K2J24p3p8m6J61j39Q6Qk1R6l42J73J16j35J93j52j16L3R8j3J55
4179A17k07O7o3l4J38j58P5P2K6j30K63j46j40N2J27k43L19l59L91l87K77r8R9
4202E8j73J59p4o3K06j31k17K34j65Q9M5J9j37R7%J5J29j20j49K1R2J37q5k5m8
4227h6P1N6J06r1j17M0j3o5K0N2pL2Nj92K52j96J20M7m7m0Q6l1Oj47J71P9r3j22
4255a04J01K7j29K73j74K33j15j06Pj2j41K30j0r4JJ54k44J64n1j50K30K2k60
4278a48K71K0K5j12Q5m3j13q9R9R3j21N7O8j76J55j65J19o5K16j44q4J78L6l5
4302A27j93jO6j36MQ4p0Q2K04j41P2j85K07j54rR6j47J72J9r5J97l33K51j02M6
$$ plain form
4327 61 -25 -75 -5 66 -21 -31 26 63 -87 -89 -189 -152 -61 -206 41 -11 10 124 -122 45 16 93 29 -17 149 -81
4353 -81 -61 -188 28 -14 25 40 -13 76 -73 24 -158 -66 -24 -72 60 86 -147 86 -118 54 -13 -77 49 -37 66
4378 66 -115 86 -104 20 -44 42 -115 -14 -34 64 -13 -124 90 31 109 4 -9 130 -201 31 -18 90 33 80
4402 80 -182 -47 -64 -102 61 33 -25 -14 167 -114 -15 101 7 -46 -100 -99 55 5 -112 62 -123 -23 -43 -1 166
4427 166 44 77 -108 32 53 105 105 150 -13 -91 -29 111 60 -105 12 -12 -107 159 35 -11 12 17 -54 -74 -1 -45
4453 -45 86 -65 -139 -122 60 -48 -114 -3 -86 -168 108 45 -105 -31 -46 -6 -120 -69 125 -7 19 -50 -97 -115 -16
4478 -16 -126 165 61 16 -59 56 182 120 58 -22 -34 -68 87 124 -80 148 225 193 24 94 -90 97 32 -23 -32
4503 -32 -37 139 61 -55 -18 94 98 -168 -12 75 -128 -1 138 -61 53 -37 69 49 -64 95 -122 -165 47 72
$$ packed form
4327F1q6n0P0P1q7j0N7L7j50kj00L7R1j45K47n2K1J14k46J67k9P7o4m6J66k30
4353h1K0j27K16m2L9J5n3Q9j49R7j82R2M2m8J32K6k33K33k04J72o7o4J26q6J03
4378F6j81K01j90J24o4Q6j57J01k0R8p7j11K14n9P8j05j3J39l31K32m9J08n7M7
4402H0k62J35j7l8J63k8n8J1J81k81R9J16r4n3n4JJ54n0j17J74j85J00k0M2J67
4427A66j22L3j85J40K1N2%M5j63p8O2J40n1j65J17k4r5K66j24m6K3Np1k0P3m4
4453d5J31j51p4J7J82j08o6J11q3q2K76o3j50P4j5M0j14N1J94j32K6o9m7j8R9
4478a6j10K91j04m5p5J15J26o2o2q0j2l4J55L7k04K28P7l2j69P0j84J87o5n5r
4503c2nJ76p8j16L7J12Mk66J56Q7k03J27J39j99J14r0J06k0j13J59k17m3K12K5
$$ plain form
4527 72 123 4 -28 -33 -107 -196 77 11 -66 72 -11 4 37 46 -156 23 -118 29 -241 -22 95 167 -105 -147 -90 46
4553 46 -95 -82 156 -201 -77 -25 -57 29 75 -158 57 -144 177 -135 -97 -47 51 86 120 -46 -21 -38 11 -168 -37
4578 -37 80 -138 109 -38 -104 5 -71 151 30 -35 45 -125 -146 -72 -67 -133 9 -24 20 55 50 -3 -89 85 -116 -77
4604 -77 23 47 8 -96 -111 -17 102 76 86 147 89 -85 118 -138 69 -227 -144 -68 8 -141 100 -25 206 -89
4628 -89 -95 -85 2 -138 12 113 96 -9 48 -205 -45 -37 22 -77 -26 115 72 -33 -62 145 -11 -49 -83 117 -73
$$ packed form
4527G2N1j19l2np4q9K73o6p7J38q3J5L3Rk02J79j41J47k70K19J17P2k72m2N7J36
4553D6j41J3K38l57J24N2l2Q6M6k33K15k01L21l12L8N0R8L5L4j66K5j7M9j79J31
4578c7J17k18K47j47o6J09p6K22j21o5Q0j70k1P4No6J42l3M4L5nn3q6J74k01L9
4604g7J00K4l9j04j5R4J19k6J0O1n8j74K03k56K07k96Q3P6P6j49K41j25K31k95
4628h9oJ0Q7j40J50J01j7j05N7k53J60QN9r9N1J41m3j05k9K07j56l8l4K00j90
$$ [...]
8191a39
##END NTUPLES=NMR FID
##END=
