##TITLE=1H_Pr 4187
 200.13MHz, CDCl3,
 8 sc
 
 29.1.2025
##JCAMPDX= 6.0         $$ Bruker NMR JCAMP-DX V2.0
##DATA TYPE= NMR FID
##DATA CLASS= NTUPLES
##ORIGIN= UXNMR, Bruker Analytische Messtechnik GmbH
##OWNER= pz
$$ XWIN-NMR		Version 3.5
$$ Wed Jan 29 14:31:20 2025 Russian Standard Time (UT+4h)  she@DPX200
##.OBSERVE FREQUENCY= 200.1313
##.OBSERVE NUCLEUS= ^1H
##.DELAY= (6, 6)
##.ACQUISITION MODE= SIMULTANEOUS
##.ACQUISITION SCHEME= undefined
##.AVERAGES= 8
##.DIGITISER RES= 18
##SPECTROMETER/DATA SYSTEM= spect
##.PULSE SEQUENCE= zg30
##.SOLVENT NAME= DMSO
##.SHIFT REFERENCE= (INTERNAL, DMSO, 0, 14.3821)
##AUDIT TRAIL= $$ (NUMBER, WHEN, WHO, WHERE, WHAT)
$$ ##TITLE= Audit trail, XWIN-NMR		Version 3.5
$$ ##JCAMPDX= 5.01
$$ ##ORIGIN= Bruker BioSpin GmbH
$$ ##OWNER= she
$$ F:/spectra/data/she/nmr/H-C/1/audita.txt
$$ ##AUDIT TRAIL=  $$ (NUMBER, WHEN, WHO, WHERE, WHAT)
(   1,<2025-01-29 14:30:34.51 +0400>,<she>,<DPX200>,
      <created by zg, POWCHK disabled, PULCHK disabled
       configuration hash MD5:
       00 E9 B6 7A A2 85 ED C7 34 08 36 98 17 FE 4E 26
       data hash MD5: 16K
       19 4F 19 ED 16 3E 32 67 1C 08 DC 36 C7 BA BB 16>)
$$ ##END=
$$ 
$$ hash MD5
$$ A0 11 9E 26 B0 02 50 AE FF 06 78 96 39 53 A1 3E
##$RELAX= 
##$RELAX= 
##$RELAX= 
##$RELAX= 
##$RELAX= 
##$RELAX= 
$$ Bruker specific parameters
$$ --------------------------
##$DU= <F:/spectra>
##$EXPNO= 1
##$NAME= <H-C>
##$PROCNO= 1
##$TYPE= <nmr>
##$USER= <she>
##$AMP= (0..31)
100 100 100 100 100 100 100 100 100 100 100 100 100 100 100 100 100 100 
100 100 100 100 100 100 100 100 100 100 100 100 100 100 
##$AQSEQ= 0
##$AQ_mod= 1
##$AUNM= <au_zg>
##$AUTOPOS= <>
##$BF1= 200.13
##$BF2= 200.13
##$BF3= 200.13
##$BF4= 200.13
##$BF5= 200.13
##$BF6= 200.13
##$BF7= 200.13
##$BF8= 200.13
##$BYTORDA= 1
##$CFDGTYP= 0
##$CFRGTYP= 5
##$CHEMSTR= <none>
##$CNST= (0..31)
1 1 145 1 1 1 1 1 1 1 1 1 1 1 1 1 1 1 1 1 1 1 1 1 1 1 1 1 1 1 1 1 
##$CPDPRG= <>
##$CPDPRG1= <>
##$CPDPRG2= <>
##$CPDPRG3= <>
##$CPDPRG4= <mlev>
##$CPDPRG5= <mlev>
##$CPDPRG6= <mlev>
##$CPDPRG7= <mlev>
##$CPDPRG8= <mlev>
##$CPDPRGB= <>
##$CPDPRGT= <>
##$D= (0..31)
0 0.7 0 0 0 0 0 0 0 0 0 0.03 0 0 0 0 0 0 0 0 0 0 0 0 0 0 0 0 0 0 0 0 
##$DATE= 1738146633
##$DBL= (0..7)
120 120 120 120 120 120 120 120 
##$DBP= (0..7)
150 150 150 150 150 150 150 150 
##$DBP07= 0
##$DBPNAM0= <>
##$DBPNAM1= <>
##$DBPNAM2= <>
##$DBPNAM3= <>
##$DBPNAM4= <>
##$DBPNAM5= <>
##$DBPNAM6= <>
##$DBPNAM7= <>
##$DBPOAL= (0..7)
0.5 0.5 0.5 0.5 0.5 0.5 0.5 0.5 
##$DBPOFFS= (0..7)
0 0 0 0 0 0 0 0 
##$DE= 6
##$DECBNUC= <off>
##$DECIM= 32
##$DECNUC= <off>
##$DECSTAT= 4
##$DIGMOD= 1
##$DIGTYP= 9
##$DL= (0..7)
0 120 120 120 120 120 120 120 
##$DP= (0..7)
150 150 150 150 150 150 150 150 
##$DP07= 0
##$DPNAME0= <>
##$DPNAME1= <>
##$DPNAME2= <>
##$DPNAME3= <>
##$DPNAME4= <>
##$DPNAME5= <>
##$DPNAME6= <>
##$DPNAME7= <>
##$DPOAL= (0..7)
0.5 0.5 0.5 0.5 0.5 0.5 0.5 0.5 
##$DPOFFS= (0..7)
0 0 0 0 0 0 0 0 
##$DQDMODE= 0
##$DR= 18
##$DS= 0
##$DSLIST= <SSSSSSSSSSSSSSS>
$$ [...]
##$SUBNAM0= <"">
##$SUBNAM1= <"">
##$SUBNAM2= <"">
##$SUBNAM3= <"">
##$SUBNAM4= <"">
##$SUBNAM5= <"">
##$SUBNAM6= <"">
##$SUBNAM7= <"">
##$SUBNAM8= <"">
##$SUBNAM9= <"">
##$SW= 18.0517328524113
##$SWIBOX= (0..15)
0 0 2 0 0 0 0 0 0 0 0 0 0 0 0 0 
##$SW_h= 3612.71676300578
##$TD= 16384
##$TD0= 1
##$TE= 0
##$TE2= 300
##$TE3= 300
##$TEG= 300
##$TL= (0..7)
0 120 120 120 120 120 120 120 
##$TP= (0..7)
150 150 150 150 150 150 150 150 
##$TP07= 0
##$TPNAME0= <>
##$TPNAME1= <>
##$TPNAME2= <>
##$TPNAME3= <>
##$TPNAME4= <>
##$TPNAME5= <>
##$TPNAME6= <>
##$TPNAME7= <>
##$TPOAL= (0..7)
0.5 0.5 0.5 0.5 0.5 0.5 0.5 0.5 
##$TPOFFS= (0..7)
0 0 0 0 0 0 0 0 
##$TUNHIN= 0
##$TUNHOUT= 0
##$TUNXOUT= 0
##$USERA1= <user>
##$USERA2= <user>
##$USERA3= <user>
##$USERA4= <user>
##$USERA5= <user>
##$V9= 5
##$VALIST= <valist>
##$VCLIST= <CCCCCCCCCCCCCCC>
##$VD= 0
##$VDLIST= <DDDDDDDDDDDDDDD>
##$VPLIST= <PPPPPPPPPPPPPPP>
##$VTLIST= <TTTTTTTTTTTTTTT>
##$WBST= 1024
##$WBSW= 4
##$XGAIN= (0..3)
0 0 0 0 
##$XL= 0
##$YL= 0
##$YMAX_a= 165219
##$YMIN_a= -171041
##$ZGOPTNS= <>
##$ZL1= 120
##$ZL2= 120
##$ZL3= 120
##$ZL4= 120
##$ABSF1= 10
##$ABSF2= 0
##$ABSG= 5
##$ABSL= 3
##$ALPHA= 0
##$AQORDER= 0
##$ASSFAC= 0
##$ASSFACI= 0
##$ASSFACX= 0
##$ASSWID= 0
##$AUNMP= <proc_1d>
##$AZFE= 0.1
##$AZFW= 0.1
##$BCFW= 1
##$BC_mod= 2
##$BYTORDP= 1
##$COROFFS= 0
##$CY= -3
##$DATMOD= 1
##$DC= 2
##$DFILT= <>
##$DTYPP= 0
##$F1P= 0
##$F2P= 0
##$FCOR= 0.5
##$FTSIZE= 0
##$FT_mod= 4
##$GAMMA= 1
##$GB= 0.15
##$INTBC= 1
##$INTSCL= 1
##$ISEN= 128
##$LB= 0.25
##$LEV0= 0
##$LPBIN= 0
##$MAXI= 10000
##$MC2= 0
##$MEAN= 0
##$ME_mod= 0
##$MI= 1.114404
##$NCOEF= 0
##$NC_proc= 0
##$NLEV= 6
##$NOISF1= 3.799351
##$NOISF2= 2.8
##$NSP= 1
##$NTH_PI= 0
##$NZP= 0
##$OFFSET= 14.38212
##$PC= 1
##$PHC0= 255.5194
##$PHC1= 7.39223
##$PH_mod= 1
##$PKNL= yes
##$PPARMOD= 0
##$PSCAL= 0
##$PSIGN= 0
##$REVERSE= no
##$SF= 200.129724274929
##$SI= 16384
##$SIGF1= 3
##$SIGF2= 2
##$SINO= 400
##$SIOLD= 16384
##$SREGLST= <1H.CDCl3>
##$SSB= 0
##$STSI= 0
##$STSR= 0
##$SW_p= 3205.1282051282
##$SYMM= 0
##$S_DEV= 0
##$TDeff= 0
##$TDoff= 0
##$TI= <>
##$TILT= no
##$TM1= 0
##$TM2= 0
##$TOPLEV= 0
##$USERP1= <user>
##$USERP2= <user>
##$USERP3= <user>
##$USERP4= <user>
##$USERP5= <user>
##$WDW= 1
##$XDIM= 8192
##$YMAX_p= 0
##$YMIN_p= 0
$$ End of Bruker specific parameters
$$ ---------------------------------
##NTUPLES= NMR FID
##VAR_NAME=  TIME,          FID/REAL,        FID/IMAG
##SYMBOL=    X,             R,               I
##VAR_TYPE=  INDEPENDENT,   DEPENDENT,       DEPENDENT
##VAR_FORM=  AFFN,          ASDF,            ASDF
##VAR_DIM=   8192,          8192,            8192
##UNITS=     SECONDS,       ARBITRARY UNITS, ARBITRARY UNITS
##FACTOR=    0.0002768,     1,               1
##FIRST=     0,             0,               0
##LAST=      2.2672688,     0,               0
##MIN=       0,             -171041,         0
##MAX=       2.2672688,     165219,          0
$$ Real data points
##PAGE= N=1
##DATA TABLE= (X++(R..R)), XYDATA
0@%%%%%%%%%%%%%%%%%%%nJ3j6J6j6J6j6K1k9L2l2L7m5N0n5O2p0P9q7R7j10J21
41F3j34J48j63J80j98K18k38K63k90L17l48L86m28M74n26N86o58P41q43R69j125
62f06J330j610K009k626L676n769J1368n1847j26966J96542J06645j41465K2599
75A3280J51939r9579j50189J12653J03490j09328l8106Q8357m6227j21523K7804
86f7429P9660r945k6334j0883l4623n190L6568K0993K7319K6285n7079m7264Q1953
99A4031N3200p0072J5510J00923o9728j27698Q8739J04226r9922m1400J12323
110H0132n0167j60448P9895J52744r4189j00942J02801K0379j29741L3357J41406
121G5227m0309r5143N8596L7270p9512P315J00302k095p0260p547J1976m916K3290
$$ y = [0, 0, 0, 0, 0, 0, 0, 0, 0, 0, 0, 0, 0, 0, 0, 0, 0, 0, 0, 0, -5, 8, -8, 8, -8, 8, -8, 13, -16, 16, -16, 21, -24, 26, -29, 33, -37, 42, -45, 52, -58, 63, -71, 77, -86, 94, -104, 114, -124, 139, -151, 166, -182, 204, -224, 250, -276, 310, -348, 393, -450, 519, -606, 724, -886, 1123, -1503, 2173, -3596, 7772, -44075, -171041, 25501, 132146, -9319, 13280, 165219, 65640, -84549, 28104, 131594, 22266, -15840, 72517, 26290, -95233, -67429, 12231, 2286, -24048, -34931, -69554, -74744, -38176, -17183, 10136, 36421, -20658, -67922, 14031, 67231, -2841, 12669, 113592, 43864, -83834, 4905, 109131, 9209, -32191, 80132, 29965, -130483, -50588, 102156, 7967, -92975, 9826, 30205, -99536, -66179, 75227, 34918, -60225, -1629, 35641, -43871, -36556, 63746, 61651, -8609, -16156, -4180, -9096, 14194]
134A4194J8700j7833j0942j5946l2120K8078N8877k9675m5389M6310O161q3303
146f2888K5077J14108l2658r7124N0068M8452q8964m042J24919j8627j26265L1787
158c6157Q2854o6128l9979J00864J4360j07199j719P7493k2506l4397N9715K0280
170D7481o8585j6368M7611J2026o956J0702r311k1923Pn3O002K9640o132n1031
184b6890O78L4455k7274j8245O2154P910q3926j653P5567j8642m6173O1922L4539
197E4422q4907j8986Q8754L253o3043L5538M6183o5598l8291O7292K1591n3643
209g435Q15L0702l5257l2702L6241K4776k4274j2485M883p583j81J3944Q884Q000
223H328J98k2057m074L4106Q580k2461J5287K0670m0644k3514N0429J5693n0221
$$ y = [14194, 32894, 15061, 4119, -11827, -43947, -15869, 43008, 13333, -32056, 14254, 20415, -62888, -37811, 76297, 43639, -53485, -3417, 45035, -43929, -47971, 76948, 58321, -67944, -36157, 46697, -19431, -59410, 41454, 55814, -51385, -53104, 24389, 1883, -32514, 27201, 47481, -21104, -37472, 10139, 22165, 15209, 25911, 16600, -5323, -5316, -5369, 633, 30273, 24141, -26890, -26212, 8243, -19031, -37276, 24878, 32788, -51138, -52791, 22776, 4134, -42039, 19883, 54422, -30485, -49471, 39283, 42536, -20507, 15031, 61214, -4384, -42675, 24617, 46208, -7435, -6620, 24082, -11175, -43877, -7636, 17140, -7134, -19619, -14736, -22319, -22500, -8556, 328, 8328, 8526, -13531, -17605, 16501, 25081, 2620, 17907, 38577, -2067, -25581, 24848, 40541, -9680]
236i680L44L6928l4943m2172M7904L3192n1583j6978M3731r945m0612L3307M3116
249C2609l1327k6648L0606J0021k4701J1682K9704j1998k5229M661J0721l433
261F668j110K436k209q000j1657j656J7512O137j8150m303J5723q947j6419K4222
275B47K3021k5967j6678K7118M784k6411J2605L2226k0146l0507K1293J8386k3843
288c872m484K7873o494l1740O655K2925q699j3847J2845N753j8371n792J6978
301b70P560j0111m043P153N85q067K815J4718K092j4360j969J2291r08j0514P918
316D890J1493j3115j5113J1689R995j3642m708J3514l002j8726L367J7297l176
329G63j2178O894R517j0246o020J5430R653j2501n536J2511K666j2819L046J5038
$$ y = [-9680, -9336, 27592, -7351, -49523, -1619, 31573, -20010, -36988, 6743, -3202, -43814, -10507, 32609, 1282, -25366, 5240, 15261, -9440, 2242, 31946, 19948, -5281, -620, 10101, 6668, 5558, 7994, 5785, -2215, -13872, -15528, 1984, 8121, -10029, -14332, 1391, -7556, -23975, 247, 23268, -2699, -19377, 7741, 12525, -13886, -1281, 30945, 10799, -19708, 1585, 19971, -3872, -8356, 19517, 13023, -18717, -12062, 10863, 2164, -11683, 1162, 6915, -11456, -17248, -270, 7290, -2821, -6864, 289, 874, -7193, -4378, 10340, 12432, -1928, -3897, 8394, 7486, -3028, 4890, 16383, 3268, -11845, -156, 9839, -3803, -8511, 5003, 2001, -16725, -13358, 3939, 763, -11415, -4521, 4996, -5250, -11270, 4160, 13813, 1312, -4224, 8287, 10953, -1866, 1180, 16218]
343A6218n946j7660N657J1815j1190r617J3023L728j8099k761J6183j266j1876
356a1791O986J0053r390n902J1971O046o794r61O059p32l976Q81L348Q81l812
371B867n621K269M720o639m918R130J366j3923J022J6204m854j3442J1984J1782
385A1947j6809n489K1526J32k0554P145J6546j4641j2494J8458M031k0159J435
398h926J6117r300j1012J3806N250j2837K111J1044m683l142Q866j32o523N662
412F301J472q416M223O636j2309n457J2783n113j5476J0752J0714j9230n301K2582
426D161k962k0059J5076J7980j9547o687K6582O11k2720J2387J8621j8807j1125
439f489K1836J13k2432O685J3066j7540q642J6322k972j5686Q180P401j3737J025
$$ y = [16218, 10272, -7388, -1731, 10084, -1106, -10723, 2300, 6028, -12071, -14832, 1351, 85, -11791, -4805, 5248, -4142, -10044, 1927, 7973, 1179, 218, 6277, 5545, 1569, 2450, 5798, 6679, 2867, -2754, -485, 4235, -2404, -7322, 1808, 3174, -10749, -9727, 6477, 1623, -11819, 165, 11947, -4862, -10351, 11175, 11307, -9247, -2102, 14444, -197, -12691, 5767, 9798, -10361, -8926, 7191, -2109, -13121, 685, 5935, -6902, -4791, 6253, 1570, -1572, 7294, 7162, 639, 6301, 7773, -643, 3580, 10216, -2093, -7550, 5233, 120, -15356, -4604, 6110, -13120, -18421, 4161, 1199, -18860, -3784, 14196, -5351, -12038, 14544, 15155, -7565, 4822, 23443, 4636, -6489, 15347, 15460, -6972, -287, 12779, -4761, -13403, 2919, -53, -15739, -7559, -158, -13895, -12870]
453a2870J4620o865p510J6095J687j4642J0664J5420j5033n207K1123m314k0788
466g620J5531J5679k4307q662K5021o914k6302J5377J6359k6064q086K6048n888
479A72k4788J6390J8926k1765o506K4765k880j8064J7293J3078j9514r79K0673
492A6801p504j4032J5634M474j9317M363J4095j6715r436K0445k863k3180J0671
505f564J5045k0243m560K5002p374k3294J9761J7947k4685m751K9300o301k3991
518a4708J8794J5570k5669k292K7953j0515k5385J8013J4490k3382k367K1505
530A2007j1466j7084K0218O775k2671M248K0783j3429j2006J8961J019j9060J2057
543C52J5006k1804p386K4788l681k2083J4184J2661k2635j498K5868j0327k2294
$$ y = [-12870, 1750, -5115, -12625, 3470, 5157, -9485, 1179, 16599, 1566, -3641, 17482, 13168, -7620, 7911, 23590, -717, -9379, 15642, 8728, -17574, -2197, 14162, -11902, -19988, 6060, 172, -24616, -8226, 10700, -11065, -17571, 7194, 4314, -13750, 3543, 16621, -2893, -3872, 16801, 9297, -4735, 10899, 15373, -3944, 419, 14514, -2201, -11637, 8808, 5945, -17235, -6564, 8481, -11762, -16322, 8680, 1306, -21988, -2227, 15720, -8965, -13716, 15584, 9283, -14708, 4086, 19656, -6013, -8305, 19648, 9133, -16252, 1761, 16251, -7131, -9498, 12007, 541, -16543, 3675, 10450, -12221, -7973, 12810, -619, -12625, 6336, 7355, -11705, 352, 15358, -6446, -13832, 10956, 7275, -14808, -624, 12037, -10598, -12096, 13772, 3445, -18849]
556a8849K1724J5019k6081k556K6262q446j8684K0416Q400k7182K051K6739j2953
569E860k1105J7979P648k2891L319J8393j5816j1972K2768J539k3195R121J9188
582A0836j3852o240K0306m117j8088J8054J4330k2591m266K3341p885k0090J6081
595E819Q343k4554R81K2565j5159k0854K1492J0856k4274J522K1092j2252j2639
608a7062K3168N821k3385O362K2567j3466j3007J9559K916j8861P870J3390j8767
621b895p691K1427k650k0508R228J1246j6909j590J9173q753j6558J7379R538
634A0437k0815Q41K1148r321j3815J7273M376k0671O575K0664j4458j4806J8570
647E998M670j9158O152J5922j5320r657J9051P5j9930Q604J5602j4957p890J6416
$$ y = [-18849, 2875, 17894, -8187, -10743, 15519, 7073, -11611, 8805, 17205, -9977, -7926, 18813, 5860, -15245, 2734, 10382, -12509, -9190, 9203, -6613, -18585, 4183, 5722, -17473, -8352, 10836, -3016, -9256, 11050, 6933, -11155, 6899, 21229, -1362, -5628, 17713, 9828, -10262, 5819, 14162, -10392, -9411, 13154, -2005, -22859, -1367, 9489, -14785, -13263, 7829, -4423, -17062, 6106, 11927, -11458, -5096, 17471, 4005, -9002, 10557, 13473, -5388, 2482, 15872, -2895, -10586, 10841, 8191, -12317, -3089, 8157, -8752, -10342, 8831, 78, -16480, 899, 10437, -10378, -9537, 11611, 2290, -11525, 5748, 10124, -10547, -3972, 16692, 2234, -12572, 5998, 10668, -8490, -2338, 13584, -1736, -11393, 7658, 7733, -12197, -3593, 12009, -2948, -10838, 5578]
661E578k443j4813J1902J0332j7195l622J8146m569j3472J3132O680j6035J005
674e374J6419r137j1570J5935M582j8121K337J4884j0378q702J5493P02j8286
687a1216O137J4681j1933p657J5811l98j5587P633J1948j2850l862J5545l096
700E156j4661R366R513j2533j682J3244o046j1997J1260O412j3495N40J2244p432
714a11r539J2052L936j2403L216J1047r257p463J2726K283j2084M584Q793j0185
728b405m712J2661n86j1573N724P217j0378k965J1975j989r628O998N442j0032
742d251n99J1470l361q489P002M079j0427J650R881n370p460Q049J485r572L251
757b662Q235o140n393P992L84q078M796O995o652l490P971r44o881N128M881p039
$$ y = [5578, 3135, -11678, 224, 10556, -6639, -10261, 7885, 3316, -10156, 2976, 9656, -6379, -5374, 11045, 1908, -9662, 6273, 10855, -7266, -4929, 9955, -423, -9125, 6368, 7070, -11216, -5079, 9602, -2331, -9988, 5823, 5425, -10162, -2529, 9419, -3431, -7293, 8252, 5156, -9505, -139, 9374, -3159, -4841, 8403, 2357, -9640, 1620, 8032, -5463, -4923, 7321, -111, -9650, 2402, 6338, -6065, -2849, 8198, -1059, -8522, 4204, 6487, -5597, -1013, 7780, -2405, -7117, 5544, 4958, -6615, -891, 6326, -4052, -7017, 4958, 2969, -6659, 339, 5781, -4251, -4850, 6620, 3259, -5230, 1772, 5851, -4576, -2926, 6955, 1585, -5875, 2174, 3659, -5913, -2662, 5573, -567, -5960, 2032, 2416, -5662, -866, 6129, -523, -4013, 3958, 3014, -3867, 1261, 6142, -897]
773h97k482O932k356o315N747L475p281j017O148k668m373N770K916o820O65N915
789C359l004l336N864J627o440J064M694l192k672M896k39n334Q71M036l197j534
805b537M237r37m572K488K603l037j98L825j629l415K660J963k355L05K935k005
821C31k344K857J574k310K69K844k201k100K179J414k305K00J415k198j849J337
837h87N94j421l1K07n19j154J250J166O9J77M37L04K25O58J291O61m50l69M2J27
857B377l92J28k12j722j266J43l64r99K42N1j276k85J183j21M90J459N52r52J090
876A26J964o91P4K187q3k768R50K121k909j097K502j113m027J240K208l138j055
893c509L358p66l850K398L534k936m28M012n93l404K745K884l291m85L799j931
$$ y = [-897, -3379, 3553, 1197, -5118, 629, 4104, -3177, -4194, 1954, -714, -5087, 683, 3599, -3221, -2556, 3359, 355, -2981, 2883, 4510, -1930, -866, 3828, 636, -2036, 2860, 2621, -2713, -1842, 2194, -1003, -2537, 1700, 763, -3809, -1321, 1282, -1755, -1953, 1872, 243, -3172, -512, 1451, -904, -599, 2336, 331, -2013, 844, 2418, 108, 377, 3221, 1020, -1080, 1099, 2513, 208, 408, 1823, -375, -2224, -887, -293, -1714, -1745, -1538, -2057, -3211, -1961, -795, -726, -549, -112, 192, 417, 1075, 2366, 3027, 2577, 2208, 2250, 2377, 1985, 2113, 1901, 179, -1087, -944, -1308, -2307, -2065, -2014, -3290, -3575, -2392, -2513, -2023, -564, -12, -964, 126, 2090, 1399, 1473, 3660, 3577, 809, 1759, 3880, 971, -126, 2376, 1263, -2764, -1524, 684, -2454, -3509, -151, -917, -4767, -2369, 1165, -1771, -2199, 1813, 1220, -2184, 561, 3445, 154, -331, 3468, 1537]
909A537l115K736J547m085L36L410l168k596M383O40m759K372L780m333j473N762
925B974n12n648L511L824n619j850O686j564o413L957M109o697j066O753j669
940G76n938M787M341o232k36P116k407m774M893K736o249N46O098m001m549N040
956A947P31o423J658N162n531l169O902j105o605M638N528o829j370Q429j712
971B251o766O296M951q292p57Q969l048p833O430M684r185q82Q411m228o969O964
987I96K954q956P96P923m640n825P810J475p982L217O775n896l406Q369K85q166
1003d271M787N712p476j252Q836k835q316P024M665r567r95Q972m302p683P178
1018D77L903j0528P67J0143n265p638Q660L673r385J893R407n975n578R389K245
$$ y = [1537, -1578, 1158, 2705, -1380, -1044, 2366, -802, -3398, 985, 1625, -3134, -762, 3018, -1315, -2788, 2974, 2462, -3186, 325, 4149, -1470, -3320, 3366, 1802, -4611, -654, 3455, -3242, -4308, 2445, 776, -5162, -375, 3966, -2266, -2502, 4614, 2207, -2567, 2326, 5062, -1187, -641, 5457, 1456, -3093, 1947, 2678, -3745, -2087, 3075, -2456, -5625, 1277, 172, -6433, -1795, 3733, -3096, -4466, 3963, 2251, -4515, 1781, 6732, -1560, -2317, 6652, 3604, -4229, 2201, 6885, -2300, -3182, 5229, 1001, -5968, 996, 3950, -5006, -4210, 3713, -927, -6752, 1058, 2533, -5449, -2232, 4543, -1353, -4759, 3610, 3895, -4271, 516, 6228, -1248, -2500, 6336, 3501, -4815, 2209, 6874, -2693, -3688, 5284, 982, -6701, 477, 4380, -6148, -5381, 4762, -503, -8141, 519, 4192, -5193, -3300, 6107, 132, -5446, 3943, 6188]
1033F188r859L218P625o398m248Q257j182q683N152N749q991k326Q889k389q093
1048g091O685M475r207Q00R915m810p662R152M278j0264J211R519o169o701J0079
1063D210K027j1468K203R942p146o515R569J198r920L773P868p956m338J0447
1077C894L40r708M348O539p412j566Q768k829q441P226M767r169n38Q887m380
1092G26o781Q093K180j0090K668J0123p105o714R755K357j0063L649Q081p892
1106a013m632J0597k0j1134M512Q334p875m593R228r09r049O259O290r063k529
1121e597R850j802p536O041M308q213N52Q557n121o498P993K763r486J351P982
1136E144o155m256Q245K50r685M227Q097p044m475R066l82q161M853O681q467
$$ y = [6188, -3671, -453, 7172, 774, -3474, 4783, 3601, -5082, 70, 5819, -3172, -5498, 3391, 1002, -7091, -406, 4069, -5138, -4338, 5577, 767, -6895, 2257, 6535, -3729, -2518, 7001, 832, -5869, 4210, 6237, -5231, -3028, 6914, -232, -6747, 2822, 4020, -5900, -2127, 5741, -2215, -6553, 3894, 4234, -5474, -1126, 5413, -1999, -3565, 5203, 2374, -6067, 1159, 5926, -3243, -3781, 5106, 726, -6055, 2038, 4218, -5872, -3204, 6919, -186, -6900, 2855, 5212, -4851, -1202, 6879, -1013, -5645, 4952, 4932, -6202, -1690, 6644, -1231, -5824, 3404, 2495, -6554, -295, 5995, -3068, -5597, 4253, 2451, -5085, 956, 5264, -2949, -2397, 6160, 1039, -5459, 2534, 5297, -4189, -2838, 5144, -1011, -5267, 2978, 3228, -6457, -2230, 5867, -1177, -5652, 3414, 3032, -5129, -276, 6405, -2062]
1151b062k619J0080j662r235N065O253q157j660Q313l283p277O883M498q408k61
1166c532Q178l644n948P123K033p992J844P216n765m842P894Q01p882L311N830
1181D625o790k627Q512o12q097M525O064p042k213Q403j850p388N512L872p500
1196b606j122P383k414o889N443K944o705M98O784l403n347O686K345o479J935
1211i47N903m131l319O238M48o540K760N200n940k694N774j094o286L733L854
1226B959o213j819O892j683n801N045L742n789j60O215k046m057N080K659o008
1241i84N5O020l073l943M495Q01n500L88M612l745l414M930j67m818J819M077
1257A553l547j764N271m59m484L279L592m130o55N104j127m730L694K376m466
$$ y = [-2062, -4681, 5399, 3737, -5498, -433, 5820, -2337, -3997, 4316, 1033, -6244, 639, 5137, -3271, -3532, 4646, 1002, -4946, 2177, 4210, -3782, -1938, 5278, -487, -5329, 2565, 3366, -4516, -1205, 4625, -2165, -4792, 3720, 3108, -4989, -464, 5600, -1442, -3655, 4748, 2898, -4490, 1022, 4894, -2606, -3728, 3655, 1241, -5648, -205, 2739, -3966, -3468, 3316, -87, -5434, 1252, 3597, -2882, -947, 4956, 825, -2494, 3744, 4192, -2348, 412, 5612, -328, -3022, 2752, 1658, -4628, -895, 2959, -3254, -5073, 1819, 136, -5665, -620, 3122, -2667, -2827, 3388, 1342, -2715, 2365, 5024, -984, -929, 5091, 2018, -1925, 2570, 3371, -2129, -1741, 2871, -874, -4288, 642, 475, -4343, -2524, 1553, -1994, -3758, 1513, 1054, -3430, -151, 3441, -689, -1344, 3760, 2633, -2097, 1597, 3973, -493]
1272d93n08M204k119l934L547J300m511L66M149k714k969L932J029l905J405K883
1288A662k397j875L734N06l413J864K547l201j061L488k44l052J714J938k905
1303f95l70K998j115k436K141J400l137j76K920j234j976J911R54k630L33K389
1319A277j412j631K289J73k184Q75K092j373j360J843K79j720O86J682j436o24
1335e44J428l86r35P85Q99j146k59R97l95r22R53N38j507j04P84l40j318Q90L69
1354b13j013QQ19m56l40Q68O12o64K32P74L29l74Q63M6j14k47J89l00k72j87j8
1375E42p82m30l37j0j04n23J67k72P1J92M28M60M02M08K57J36J89R88l71k07O38
1396A842J66j085K10L35j105n82J23J19j574R5Q55j182o40J298N58j720J194J517
$$ y = [-493, -1001, 3203, 1084, -2850, 697, 1997, -2514, -2148, 2001, -713, -3682, 250, 1279, -2626, -1221, 1662, -735, -2610, 1124, 1630, -1783, 81, 2628, -573, -1634, 1854, 1610, -1442, 272, 2210, -695, -1065, 1933, 818, -1618, 523, 1923, -1214, -1390, 1530, 296, -1680, 231, 1185, -1445, -1112, 1277, -135, -1766, 523, 696, -1488, -613, 1479, 106, -1254, 589, 868, -852, -166, 1516, 80, -544, 884, 498, -437, 348, 1247, 101, -158, 839, 444, -478, 475, 1013, -494, -598, 186, -154, -1472, -582, -213, -1226, -1218, -399, -855, -1195, -327, 285, -379, -147, 627, 956, 582, 1445, 1491, 1377, 1130, 1319, 1019, 747, 560, 542, -240, -670, -1007, -1017, -1121, -1644, -1477, -1749, -1678, -1486, -1058, -598, -196, 212, 469, 605, 794, 1782, 1411, 1204, 1842, 2008, 923, 1133, 1468, 363, -219, -96, 23, -1551, -1456, -601, -1783, -2423, -1125, -567, -2287, -1093, 424]
1414D24n42n02J590K64j308R54J292j236p79J910q34j803J080J004k048q53J960
1431E73p97j703J420R80k040J08K061j125j385K308Q33k394P03K185j575j442
1447a290K616K74k871J000K235k081j346K657K9l162J509K211k616j035L457p48
1463H39k935K278J998l012l95L033r92k812K031J612l106Q0L074j669k488L043
1479E79J030l191M28L298k212k035L669M43l599J620K638l063j297L464j67l819
1495b214J770L011l874j269M550j327l572K972K640l985o63M082j042l717L424
1510G86K225m671k7M093j842l170L635J033m307N73M480k885k459L572R99m194
1526b159J701L324l312j681M116l41m150K133K930l827j301M668j432m083L303
$$ y = [424, -118, -620, 970, 1234, -74, 880, 2172, 936, 157, 2067, 1233, -570, 510, 1514, -534, -1387, 573, -224, -1927, -507, 473, -1567, -1459, 602, -523, -1908, 400, 1233, -1161, -458, 1727, 152, -1290, 1326, 1600, -1271, -271, 1964, -117, -1463, 1194, 1223, -1939, -430, 1781, -835, -1870, 1587, 839, -2096, 182, 2180, -832, -1227, 1806, 814, -1998, 33, 1645, -1461, -1381, 1693, 24, -2464, 579, 1609, -1582, -1154, 2144, -68, -2103, 1566, 2009, -1590, 30, 2668, -395, -1692, 1772, 1605, -2214, -444, 2567, -1307, -2576, 1974, 647, -2925, 47, 2687, -1298, -1961, 2121, 1079, -2638, 786, 3011, -1660, -1687, 2406, 564, -2606, 1029, 2062, -2245, -1672, 2808, -77, -2536, 1036, 2035, -2159, -458, 2866, -446, -2127, 1989, 1648, -2502, -369, 2561, -1266, -2567, 2101, 669, -3414, -111]
1541a11K831m440n00M599j660l499L567K367m467j43M833k557l483L954J002m388
1557b095O96L987l245k780M437M74m517J748L934l670j926M760m04m242L117L530
1573C804m721q30M838j310m041L006K402m672l68M498k208l950L885J605m545
1588b607K61M558k529l093M220J445m976J542M565l218k514M501K03m444K157
1603G1L592m114k046N033n02m997K694K905l877j392M747j702m149L577K597m540
1619b103m56M973k185l152L999J350m454J222M642l278l283M776Q30m360Q99L928
1635C348l919k120M630O1n123K086L879m060j639M395q99l943K742K969m603o97
1651b893N100j082l820L045K437l958k5M555k456l424L947J676m561N31L979k976
$$ y = [-111, 2720, -1720, -2220, 2379, 719, -2780, 787, 3154, -1313, -1456, 3377, 820, -2663, 1291, 2293, -2095, -1399, 2588, -657, -3437, 1000, 1474, -3043, -1295, 2639, -1031, -2957, 1803, 1399, -2843, 274, 3804, -917, -1747, 3091, 1781, -2260, 746, 3148, -1524, -1892, 2606, 398, -3552, 333, 1938, -2607, -2346, 2212, -317, -3410, 810, 2255, -2721, -1179, 3386, 168, -2346, 2155, 2358, -2086, 71, 3663, -451, -2497, 2536, 2034, -2963, -269, 2636, -1241, -2633, 2114, 412, -3737, -160, 2437, -2103, -2559, 2414, 229, -2923, 1076, 2426, -2028, -806, 3836, 558, -2725, 2051, 2881, -1479, -580, 3348, -571, -2691, 1939, 2000, -3123, -1037, 2842, -1218, -2857, 1538, 639, -3304, -562, 2407, -2196, -2893, 2207, 1125, -2695, 350, 2787, -1171, -1196, 3359, 903, -2521, 1426, 3102, -1459, -928, 3051, 75]
1667G5k919L782N41m537J735L529l121k422M525k28l924K235L257l810p82M581
1683B517q05m021K740K804m240j95M276j864l605L082J898m321k18M186k138l214
1699c118L594J073l971R12M133k663k441L939N23l497R80L289l023j503L467n88
1715A106l347J672K785l499o40L424j016k838K439K132k992m76L637j209l013
1730a835K796J586l629J49L118k032k728L239P35l591O53K926k366j820K989N20
1746G10l232J915K690k449j023L158Q9k800J554K257k597r60L113q72l010J704
1762B47J459k964j74K551j480k152K118R06k663M18K907j784j376K430J013k449
1778i93Q88K700k055j269K358J31k489Q59K209k437j098K039L2k558J322J217
$$ y = [75, -2844, 938, 1479, -3058, -1323, 2206, -915, -3337, 1188, 960, -2964, -729, 2528, -1282, -2064, 2517, 1712, -2309, 431, 3235, -1005, -1200, 3076, 1212, -2393, 689, 2587, -1734, -1952, 2234, 96, -3118, 476, 1549, -2422, -1510, 2623, -40, -2481, 1458, 1981, -1516, -536, 2753, -270, -1773, 1694, 1106, -2241, -569, 2216, -1283, -1923, 1501, 485, -2353, 86, 2218, -774, -1250, 2387, 1178, -1835, 961, 2547, -1082, -933, 2185, 153, -2575, 664, 1399, -2192, -1539, 1387, -979, -2799, 190, 710, -2522, -607, 2083, -366, -1389, 1769, 1858, -942, 612, 2869, 272, -688, 2425, 1553, -1457, 247, 1706, -1258, -1432, 1119, -361, -2513, -395, 511, -2152, -1734, 1173, -611, -1987, 443, 1456, -993, -105, 2595, 540, -729, 1629, 1760, -729, 130, 2339, -98, -1196, 843, 875, -1683, -361, 856]
1794H56k007n55K035k97j878J264J183j705n2K406j074j546K026Q63j916K56J675
1811A534j155j185J902j09j402J09J709j649r20J705L06k037M16J527j485m82
1827a216J517j20j291P00P84m72p26J387m52o21N79N95q89k9J454p91j019J077
1845D67K82j005n8J213q63p78J126l11j010M10Q18o58l53O40J63o93L24P17j77
1864B54o80Q32r6k05j64O14n47k81M00R4m30K24j25l6j29Q6K45j88j7M51Qk10
1886A00J85m8k78L58j64l91J27l4k4L0k49J94j70R3K90l12N1K20K46P2L6O1M4
1909D37j57p9J4M64l25k30J04m03m56M87j29k17j32N30k24m45M67N40p37K85P39
1930E33k05o71M29P48l75l07M22j77o36L26N31r60J30O61o27p97J046M31j220
$$ y = [856, -1151, -1706, 329, 32, -1846, -582, 601, -1104, -1156, 1250, 176, -1370, 656, 1519, -397, -141, 1534, 379, -806, 1096, 987, -415, -306, 1403, -246, -1166, 539, 845, -1192, -776, 751, -734, -1216, 301, 181, -1110, -410, 374, -98, -824, 563, 111, -510, 69, 664, -225, -254, 1200, 409, -610, 467, 749, -256, -314, 899, 36, -742, 384, 73, -937, -527, 291, -367, -720, -80, 83, -610, -286, 431, 254, -426, 406, 310, 105, -59, 555, 8, -273, 127, 221, -209, 15, -110, -146, -275, -189, 56, -132, -149, 302, 310, 100, 285, 237, -41, 317, 153, -238, -111, -145, -169, -139, -388, -194, -364, -271, 19, -293, -242, -22, 224, 296, 332, 393, 437, 280, 201, 215, 679, 354, 124, 228, -175, -631, -144, -273, -490, -622, -92, -316, -761, -294, 246, -491, -206, 533, 328, -343, 86, 834, 459, 152, 574, 397, -239, 87, 618, -342, -212, 449, -178, -975, 71, 502, -718]
1949g18O59L94m77m43J090l3j146P38P93j006m4Q80k97j165J281N99j673p3J354
1968G13n53r69Q49N94j408K29J133p23n90R31M73j638M53J271r41n55J159J30
1986E58j360Q60R02q89p68J497m61j089J067M27j113n36J744m56j368J156J028
2003A199j903N5J517r10j137J728J77j832N18J427j116j112J688O97j962P63J525
2020A322j250q24J567M24j807P03J299j717n17J573m53j735J157J049j514m99
2036a222J893m78j672J759Q45j992J77K087p83j734J806N58k216N01J958j508
2052b1j336K148K1k136Q18J694j657j282K420o6k199J460J479j665n77K492r61
2069F32j956J686J046j894n41K479j100j838J736N62k039L36K140j448j653K372
$$ y = [-718, -59, 335, -142, -585, 505, 472, -674, 64, 857, -149, -193, 687, 390, -775, 506, 1105, -568, -641, 713, 160, -809, 40, 634, -774, -545, 588, -135, -725, 206, 679, -959, -506, 765, -176, -731, 428, 558, -802, 58, 960, 71, -697, 800, 339, -750, 317, 744, -369, -905, 839, 383, -985, 171, 1199, -704, -649, 868, -42, -1179, 549, 726, -1106, -588, 839, -277, -1389, 299, 996, -966, -203, 1322, 72, -752, 815, 1239, -568, 135, 1434, -283, -800, 773, 320, -1415, -258, 791, -723, -1222, 671, 193, -1479, 280, 1125, -867, -690, 1397, 614, -1120, 686, 1244, -972, -471, 1487, -21, -1357, 791, 812, -1324, -506, 1188, -469, -1751, 669, 603, -1596, -136, 1343, -322, -899, 1593, 632, -1324, 362, 1408, -486, -1027, 1452, 352, -1486, 250, 812, -1227, -891, 1249, -199, -1852, 520]
2085E20O42j976K97K151j672j273K259M48k793R87J874j913q73K238l7k557J512
2102a66J513j960p75K653p45j960J400J461k126k03K347j091j901J924J046k165
2118g48l4J997j461r81J885L41k488O65K243j552j372K286J12k401J315J820k215
2135e88p73K616j94k166J170J621k053o74K223l54k310J759J104k527J81K124
2151A159n90j932J749O17k103J54K285j512j248J809N60k227M78J993j502j019
2167a329K396j05k511J362J691j692j072K447l17j960J191J554k649j7J953n00
2183D42j848J250J306j965j61J778r73j534K206M90k035M45J812j154j003J681
2199G37N52k041P90J564j405j046J820j36k250J078J432j639o41J713n30j376
$$ y = [520, 1162, -814, -517, 1634, -38, -1311, 948, 1396, -1397, -410, 1464, -449, -1322, 916, 879, -1678, -166, 1347, -613, -1388, 1265, 520, -1440, -40, 1421, -705, -908, 1439, 348, -1553, 371, 1417, -748, -782, 1215, -246, -1227, 658, 999, -1489, -824, 1419, -133, -1505, 781, 893, -1508, -193, 1627, -588, -1361, 1255, 1061, -1105, 65, 1686, -367, -1041, 1182, 828, -1482, 277, 1381, -1146, -965, 1159, 569, -1363, 386, 1003, -1100, -946, 1339, -173, -1421, 388, 948, -1279, -801, 1192, -310, -1329, 1067, 962, -1549, -187, 1504, -188, -1260, 1187, 870, -1090, 101, 1655, -994, -1011, 942, 442, -1406, -156, 1150, -815, -976, 802, -171, -1705, 501, 991, -1044, -599, 1213, 59, -944, 737, 1289, -752, 38, 1602, 197, -849, 971, 835, -1415, -337, 1095, -544, -1185, 528, -2, -1378]
2215a378J140J071j605l75K076q16j371J772Q11j878P8J756p14j454J354N01j807
2232h39K32J648j231j147J649L43j699N82J582j320p88J879L1j853J066R75j245
2249a35o95J743j28j882J098J115j779l10J707l75j544J013R18j485j1J681r12
2266A9q60J219M48j424L45J344q86j199J559J13j291L97R83j244j93J105k38j056
2284h59N11R04p07o38J234J36j425J241N25j418o1J433l42j515J648j11j190J73
2302d61J052p62q32J077O63j353L81J024r09p50J048L58r92Q2P32n84o20J184
2320C38J22r37L01R30r19l38O42J28o14M93L65p93j58R44m96m80J015k68o51q3
2340d59Q79r5r71P77M9m42M7N63m49k59M75N7m29L56M95m70n83N21K89o82L10
$$ y = [-1378, -238, 833, -772, -1147, 929, 113, -1258, 514, 1325, -553, -475, 1281, 567, -887, 467, 968, -839, -607, 1041, -190, -1337, 312, 655, -1044, -462, 1120, -200, -988, 891, 922, -931, 135, 1110, -135, -830, 913, 785, -1097, 1, 1116, -663, -973, 734, 359, -1185, -172, 746, -739, -750, 931, 19, -841, 378, 826, -598, -253, 1091, 205, -994, 565, 678, -613, -216, 767, -477, -670, 435, 197, -859, -348, 556, -151, -789, 445, 581, -844, 397, 922, -496, -557, 876, 534, -981, 667, 556, -634, -461, 591, -171, -1003, 74, 737, -616, -235, 789, -120, -870, 178, 536, -456, -374, 358, -226, -846, 338, 460, -477, -176, 754, -165, -503, 139, 267, -347, 146, 511, -282, -440, 504, 8, -472, 543, 275, -376, -459, 420, 325, -646, 131, 180, -262, -215, 348, -101, -360, 115, 172, -257, 99, 594, 124, -459, 62, 351, -331, -21]
2361b1M87n93j40L60Q9p08M16L95m92m10P08q6l14K68J87k39j59N47J9l88J51
2382G7L63n45J67Q3j11jK23j77m05J89K28j66l89Q69n75P6l6K28Q3l22M56q1k12
2405B2p9K16q7P4J03m75M0m7J14j81K61j49R5l4K85k83L56K1m33O09l15j96M4
2428c9K81m2l82O48k86l13j66K03M1k52M9n0K62N2J14j04j62K80K13n60M35K27
2450D49n16QM03l29j95k77P43q63K92L56j23l53M69j31j46Q6L38k43N3M83j59
2471C45n55O7M72l39k08J84Q7k66K04J53l05j04N45l54k50J04M48j52l63O78k25
2492A66m49P52j31m92nN14m15k97M76J04m84J97L40m41m52O88P8p75L90N44m51
2513a43j21N59J88o66O8O51o19l28P98k55r08O04N85p22k03J082l29o41K47L47
$$ y = [-21, 466, -127, -267, 93, 182, -526, -110, 285, -207, -617, 91, 5, -309, -41, 146, -93, -252, 295, 314, -74, 77, 440, -105, 62, 145, 34, 33, 256, 79, -326, -137, 91, -75, -464, 405, -170, -94, -130, 98, 181, -141, 315, 234, 22, -57, 159, 72, 146, 249, -226, -186, -233, -119, -300, -39, -188, -93, -127, 158, -125, 231, 252, -181, 428, 113, -83, -39, 242, 200, -182, 466, 180, -133, -299, -96, -55, -307, -258, -308, -46, 6, 120, 16, -146, 134, 347, -213, 222, 449, -67, -59, 344, 15, -180, -457, 286, -577, -285, 71, -52, -405, 64, -67, -213, -127, 211, -32, 21, 504, 345, -210, -143, 329, -10, -218, -34, 53, -213, -9, 144, -161, -265, 280, -74, -324, -220, 228, 76, -287, 391, 166, -283, 469, 338, -154, -159, 355, -60, -357, 119, 223, -261, -64, 276, -165, -617, 71, 149, -626, -236, 308, -143, -264, 295, 483, -183, -115, 536, -83, -411, 387, 132, -776, -172, 413, -309, -512, 570, 241, -400, -153, 194]
2533A94n72r5R95l78n28O88L19q35k69J202l43j155Q15K52j108J26J038m10o92
2552g56J137J06j010N61K43m58l35J077M2j194O81M82n48l85R38n49m48M79M11
2571D74q94m6J002n13r76J109K15q97M02P62n01n36P53L27j197O44N35l56n27
2590b20M81m8r55N80N70o87k76R38j62j252J047N57q64l4R35m59p43Q40L43r48
2610c57m2R45o30p55Q85M57j169J45J445j218l27Q90J54j010L42J087j182q7O05
2629A78O09j526M65J044r41l57R03l7j092O42N81q49j94J132k26p68O15P59j315
2648c77m8J220n50j217J229M55j342K44Q49m02q61Q87J53n90J26R97r94m95J296
2667E80j42q97K76P51r15r6J056k54p87M44J000j224o20J572q41m25M65L40p34
$$ y = [194, -378, -473, 522, 144, -384, 304, 623, -212, -481, 721, 378, -777, 38, 290, -818, -692, 346, -64, -756, 381, 487, -523, 38, 281, -177, -512, 565, 607, -587, 94, 576, 28, -357, 581, 32, -416, 63, 474, -420, -466, 536, 23, -953, 156, 371, -526, -124, 638, 137, -399, 354, 681, -516, 128, 663, 307, -220, 261, 213, -742, -162, 408, -279, -555, 383, 221, -1031, 16, 573, -291, -325, 610, 151, -592, 248, 591, -357, -399, 546, -84, -839, 46, 503, -666, -521, 924, -294, -621, 269, 423, -587, -245, 842, -340, -427, 178, 787, -739, -274, 770, -171, -528, 375, 338, -754, -112, 469, -380, -574, 558, 332, -436, 179, 938, -377, -425, 795, 245, -972, 257, 712, -630, -386, 463, 61, -800, 87, 240, -350, -224, 773, -221, -716, 580, 438, -459, -183, 568, -347, -443, 613, 359, -428, 16, 1016, -208, -828, 744, -97, -522, -57, 283, -451]
2686d51K28Q59m92j168J411k1r23K79R83q01m81O39K08q05J90Q34o34o00P51L86
2706C92r73O61O45q79k59P61J61j010Q80L75q74k58J052o75q07J090J81p22k15
2725d74J041p09l46P85Q0q47p4R62n03m10Q26J96j058Q32M0l06l27N00L29q81
2745c44N99K19o83l09Q89j06p30K54K85m43L23M31k34o20K79O15q14l0J208o85
2765A04l94N68R8p07J09P11n83l51M72L05p01J04R65p88n75R90k47m22N68L00
2785E26n60k88R55m24o96M40L48p13j14Q82k41p63P23Q0m34k1P21n07j6O2L82
2806C42n48J17M32m97J32L41O7p87K57M07m37k54P48l26j06K71K78n30p1L77j46
2827F7n56Q31N3m61j77L32J02n87M62j53r6J19L28l64j63N59kn71R3N79k13n43
$$ y = [-451, -223, 636, 144, -1024, 387, 366, -557, -278, 705, -96, -577, 62, 270, -535, -345, 489, -145, -745, 6, 392, -581, 80, 725, -154, -413, 348, 509, -501, 379, 754, -120, -378, 674, -1, -808, 282, 463, -259, -474, 567, -142, -488, 297, 377, -470, -544, 418, -85, -495, 331, 527, -531, 301, 341, 35, -292, 208, 537, -344, 255, 474, -209, -518, 371, 265, -465, -211, 74, -369, -46, 385, 151, -469, -190, 425, -389, -419, 789, 104, -290, 278, 376, -331, -222, 489, -94, -445, 27, 332, -369, -265, 700, -88, -663, 327, 80, -342, 226, 526, -34, -322, 633, 209, -487, -47, 301, -412, -526, 356, 115, -648, 75, 155, -279, -300, 421, -86, -102, -40, 342, -206, -89, 343, -154, -22, 319, 386, -401, -144, 263, -174, -428, 320, -6, -112, 159, 437, -93, -164, 213, 67, -489, 342, 395, -66, -243, 89, 191, -396, 66, -87, -183, -64, 264, -100, -263, 296, 294, -277, -184, 395, 182, -361]
2849c61O75j41j24j52N63n30J16O3k0k29K02M47r83K41M21N2o44L50M52m55j63
2870b20L13j47j08M97l0l29j88L03J36l95J38J55k02N5o5N1Q7j28L65n73M56m3
2892A28j97L09k13K90k70p6n0k3k32N15J04l66o3K98j90k94K66r1k37M03Q8k43
2914a44m07M86K62l61K22J00j13l6K14k27L5L25k04k90J7J32j14J77P2o7j66m5
2936a32J46n4KO9Q5J11j42L20l37J5n3J8mL6J56O2k63k08L86k9j85p6l4jjj59
2962b72J68K4K74k98K28l08J45Pj22J16K11k65j05K11o5K57r0j34J02l41M71o6
2984A48l40K73j1J91m16K38j63nJ05k1p8l16O92p8n99L53K04l21J15j32K44k46
3006a63K84K0k71L9R7J32l64K68J70j84j76K60l85k9N89k38m7R4N9k96J27L79
$$ y = [-361, 314, 173, 49, -103, 460, -70, 46, 109, 89, -140, 62, 509, -474, -233, 188, 240, -404, -54, 398, -57, -220, 93, -54, -162, 335, 305, -24, -212, 91, 227, -168, -30, 125, -77, -22, -87, -36, 51, -77, 288, -285, 171, 128, -69, 240, 27, 317, 47, -29, -79, -102, -334, 181, 285, -81, -144, 154, -36, -330, -64, -155, -392, 11, 99, -144, -551, -65, 197, -164, 58, 158, 45, 9, 223, -4, 31, 356, 152, -138, -121, 11, -103, 74, 146, 79, -87, -132, 14, -40, -38, 31, 116, 227, 85, 405, 68, 83, 30, 48, 44, 80, 236, 298, 35, -173, 213, 184, -1, -77, -111, -112, -113, -272, -104, -80, 194, -104, 124, -184, -39, -32, -154, -38, 173, -92, -197, 14, -51, 206, 116, -18, 84, -257, 214, 148, -192, 81, 70, 261, -155, 83, -80, -85, 20, -1, -79, -395, 297, 219, -380, -27, 177, -144, -29, -161, 83, -163, 121, 141, -130, -91, 6, 138, -226, 42, 212, 28, -148, 112, -273, -302, 287, 49, 2, 96, 155, -141, -14, 365]
3028C65K5q25N69Pk70J28K01m37j13K68M27p68K33M18k11l53M01m8k39L51p4N8
3050A13n05O42l27j65M71J10l92l51N97j95j58o9L99l14k11N87k57j80L28n1k46
3071a74j32M23Rj46O4L01m10j12N03j68m51R7M77l96O9J73k31m8N5K73n23L23
3093b4L74j70n10M62N3j99%L78m92k53N67j14l34K20J28k77j7L91l06k68M32p
3115C4j34o8O97o22O3K38k1l49Q9K75Ql91N02l21j66j8K22j18l54N22j19l06M58
3138A21l1j64r4M25ro42L00L54n25J89L30j99n75M78J44m43K17L76k57j27J01
3159c1J08l77K46M05k85l31K78k5k69M76J64m56L2N0M3n16P27r2n03q4N29P9k92
3182a24O96m22k47O2M20k40k59L67J16l03J54k84J67l22N87k24j54J3K17j61K8
$$ y = [365, 390, -435, 134, 141, -129, -1, 200, -237, -350, -82, 345, -423, -190, 228, 17, -336, 65, 17, -222, 129, 55, 113, -392, 250, -77, -242, 229, 339, -53, -404, 193, -2, -160, -229, 170, -144, -355, 232, -25, -205, 123, 72, -174, -306, 117, 126, -20, 44, 345, -65, -177, 326, 158, -293, -196, 281, -115, -46, 127, -104, -152, -97, 176, -347, -24, 350, 180, -330, 132, 185, -14, -14, 364, -128, -381, 186, 72, -262, -42, 86, -191, -208, 183, -123, -391, 41, 34, -100, -168, 529, -93, -30, 208, 187, -162, -73, 202, 210, -181, 321, 0, -166, -184, 38, -80, -434, 88, -31, -337, 121, 90, -74, -168, 257, 248, -394, -94, 260, -265, -76, 254, 55, -520, -42, 102, -341, -124, 252, -5, -132, -31, 77, -300, -54, 351, 66, -265, 13, -12, -281, 195, 359, -97, -65, -15, 28, -488, 239, 147, -356, -440, 89, 168, -124, 572, 150, -97, -35, 385, 145, -114, 253, 369, 66, 220, -64, 103, -219, 368, 144, -10, 3, 220, 59, 87]
3203H7j15L25n81K24M04k97k22L76j28l94M88O5k03M1J45j87k35n6M16j52k6K76
3225B51l56j46K27L3k9M9J33j1j73L6L9k98L45K48l41l23L84l0l10L81M4k88j5
3248a50N11j01j63n4M15m86q8J81J39l01J53K65k75n5J88j52m4L51k97l73L48
3269A2M9l04p8M82j2q9j94M11k85k77M49j74J54Q3j34l06J54K09j84L4N0q6j2
3292d8K9J02m6K28k27K13l71J22J04J27k23N12k12k84J2k3l8k46K47p3k04J7K89
3315Gk75K69K81j62m0j45L75l79J9J65q7q9k27M51l44J0L14o0m89L98J29l21J32
3338f8J21o7k03L44J45k48k35N10j72j67M27l89m7R9m50L05J19J0j03j48N97k85
3360I5j1M9Q2k89J90j90J02kl00J62K1j01K39m04L48L1l5L7j05J87q5j35J69j90
$$ y = [87, -28, 297, -284, -60, 344, 47, -175, 201, 73, -321, 167, 232, 29, 70, 215, 28, -207, -263, 153, 1, -25, 251, -105, -251, -24, 9, -20, 29, 162, 151, -22, 14, 53, -245, 100, 348, 7, -316, 68, 38, -272, 109, 153, -135, -150, 361, 260, 97, 43, 458, -28, -116, 65, 204, -97, 56, 321, 46, -9, 179, 27, -17, 334, 37, -336, 12, 61, -243, -321, 161, 149, 60, -134, 277, -8, -285, 164, -10, 144, 227, 93, -213, -59, 150, -34, 0, 50, -36, -48, -19, 83, 37, 265, 38, 251, -120, 2, 106, 233, 10, 522, 310, 26, 38, 15, -23, -269, -22, -95, -299, -282, 7, -268, 1, 282, 120, 80, -65, 310, -69, -50, 115, 28, -61, -288, 163, -181, -171, 143, 83, -406, -8, 121, -200, -68, 53, -14, -217, 127, 272, 24, -211, 299, 127, -40, 387, -2, -49, 50, -400, -95, 24, 34, -69, -217, 380, 95, 84, 133, 215, -74, 116, -74, 28, 26, -274, -112, -91, -192, 47, -357, -9, 22, -13, 24, -81, 106, 21, -114, 55, -135]
3384a35N17m05J33r9r2P4J46m17K78J30P0j9l50L51k32o0P3J47Lk12k5J06j1Q7
3408E8K68k14k12j7k84L23k9J6n0K59k82R5L9K34k82J42j10j23J84j4J73k75l7
3431a38L72l46O2j12l0J72K39j5k18l9J74o1j18K95j55j37k18L72J25m22L12k81
3453a67J10N5l8J36m14M31l62L62o8n8l9J63O2q8L8k73K33j23J8K2J19L5l08k3
3477a77J10p1K69k63J15k0j5k18N34j25n0MO7M1q8k16j07J32K9r9L34l72M10j47
3501G7K3M6k39K7R2j23K9J13M9k13K5P5j01K15j70k03J44K9K67N5k55L33k92k5
3525b2m2J65Ok17M0k1o0J21oL13l74J1J83rr4Q2j37K00o9L9k45L91k38Kj04l9
3551a24K17k17J01J0k15M16N4l26j9K08r0j23J45l0n7J95j90P0L8j61L82l25K32
$$ y = [-135, 382, -23, 110, 11, -81, -7, 139, -278, 0, 130, 200, 181, -169, 182, -50, -110, -37, 110, 113, -99, -124, -18, -29, 58, 326, 112, -100, -117, -401, -78, -107, -91, -141, 118, -164, -69, -30, 204, -78, 64, -46, -169, 15, 1, 174, -101, -138, 234, -112, -50, -162, -192, -20, 219, 204, -14, -53, 121, 60, -58, 237, 82, -55, -273, 99, 224, -198, 114, -167, -57, -2, -40, 96, -318, 113, -249, 113, 45, -13, -52, 111, 173, 85, 123, -150, 83, -40, -22, 0, 119, 154, -154, -177, -67, -138, 131, -132, -17, -37, -52, -270, 264, 139, 89, 93, 160, 201, 113, -103, -210, -78, -49, -148, 186, -186, 224, 77, 100, 146, -93, -66, 26, -97, -68, 45, 94, -119, -94, -19, -120, 95, -75, -278, -134, -105, 162, 217, -38, 295, 3, -22, -64, 101, 107, -110, -70, -91, -151, -30, -36, 277, -97, -86, 97, 88, -6, 76, -61, 139, 70, 109, -136, 255, 17, 19, -85, -124, 93, -124, -23, -13, -228, 188, 242, -84, -103, 105, 15, -108, 37, 7, -50, 145, -45, 25, 63, -98, 284, -41, 191]
3574A91N6m8k77j11L58l64K35N9k54J92J21Q9k30J2r8J55k22j52L10R8r6L65l00
3597H9j11J32j77M4Q1r0k94M27J28m04K11k7M7l37J99K55k29o1K14j32J93m01
3619b43K71J19k08K14L2j75m0j15j4L7j8P2k41M59k85K33k38J91j14K70l35L13
3641A85J0j99j94J34j20K20K7m03L25Q6J57k99N6m7r8K40Q7j55L0J07l72L1M93
3664C01k06k31m1K81k92J45P4J55l86j27N81J60m67j05L53n0n5K27l57P2p2l2
3686g2r4K93k18J1j9m0L13j81J86r2J23k90J64N0k03K58j19k20J53p6j14J44j72
3709b15M93k4l74L13j06l14J09j68M84l38K63k96J30L3n4Q7j17J66k12J59k1O9
3731F7LK16Q8l32q1k22L55L5j67n8r0L36j7j37k35L38mk15k87M76r5k18L11k48
$$ y = [191, 247, 199, -78, -189, 169, -195, 40, 99, -155, 37, 158, 247, 17, 29, -69, 86, -136, -288, 22, 120, 24, 389, 89, -22, 110, -67, -23, 58, -32, -326, 101, 229, -175, 36, 9, 56, -281, -82, 173, -56, -117, 97, -35, 158, -243, 28, 147, -61, 153, 185, 10, -30, -145, -159, -122, -140, -68, -309, 150, -135, 98, -140, 51, -63, 207, -128, 185, 195, -4, -198, -64, -184, 36, 63, -340, -15, 71, 228, -71, -15, -62, -160, 80, 167, 12, 42, 149, -223, -192, 301, 95, -136, -177, 104, -188, -43, 31, 186, -200, -327, 254, 414, -53, -158, 195, 145, 90, 317, -40, 32, -40, -72, -166, 127, -91, -80, -99, -139, 174, -7, 179, 87, 210, -80, 84, 134, -69, 189, 70, -150, 3, -73, -187, -43, -215, 278, 254, -120, 193, 87, -227, -118, -286, 198, -140, 123, -173, -43, -10, -64, 23, -94, 72, -140, 19, -2, 67, 70, 286, 374, 42, -39, -261, 94, 129, -38, -96, -186, 150, 133, -4, -239, 99, 95, -120, -407, 69, -26, -244, 67, -181]
3755a81M64k97p5L11n50O23n45K32lL55m45j41M38N8l89K50k39J74n4p3K59k28
3777e6l8K24k45M02n8l99J41N1K81m06N9L00l61M5j96M58m5j51O7r9r3J12J46
3800A39k61J04L4q2L53j14k22J20N6n0Ok78K56J19k57L00j62j20K81q8j90k55
3822c11N12l63L6j78N41l28j25L02j60p3K40k7j72M88m69o7K03N3j1p0j53K18
3844H6k84K01m2j3J23j21Q1k93M32R3k94J87k30R9k53K14oK0j01%L9M6n5K14l03
3869a60K8J89n9K78m68M30l29M6q8J62m8j67L79l58K58q2J54j3L7L6j28J62j17
3892A42k78J19J04K3k14Q1R6k13J85J0R5l61K20J4j65J43K57n8m38K29k63J59
3914a13J04j49o4K01m6J19m2p2J14P8j77pK47k60j97N81l18L7M5j24J46j37j66
$$ y = [-181, 283, -14, -89, 222, -328, 295, -250, -18, -21, 334, -111, -252, 186, 244, -145, 105, -134, 40, -14, -87, 172, -56, -94, 130, -115, 287, 229, -170, -29, 22, 303, -103, -44, 256, -105, -60, -256, 202, 157, 6, 73, -26, -119, -7, 139, -122, -18, 16, -66, 287, 173, -49, 71, 127, 77, 83, -195, 61, 180, -77, 223, 61, -59, 222, 134, -56, -311, 201, -162, -126, -304, 237, -91, -216, 86, -74, -147, 93, 66, -106, 382, -87, -154, 49, 102, 91, 21, -132, 86, -198, 3, -39, -52, 71, -50, 31, -262, 170, 263, -31, 156, -74, 25, -228, -14, -20, 0, -101, -101, -62, -16, -71, 143, -160, -132, 57, -2, 276, -192, 238, -91, -45, -133, 29, -19, -186, 193, -165, 93, 11, 165, 152, 189, 225, 97, 259, 142, -136, -17, 87, 110, -104, -23, 73, -140, 45, 55, 150, -211, 9, 23, -142, 1, 258, 200, -238, -9, -272, -113, -9, -158, -222, -21, -67, 52, 10, -62, 52, 130, -47, -54, 193, -67, -264, 317, -1, 36, 81, -43, 103, -34, -200]
3937b00J81k01K65r2J05k45J66K60k34K5L7L0l09K23Q6O4j77O2O7j07K48j71k83
3960b00L54k89K08J48k76k11L36k58N2M10l47L2LP5r2J82J78n11L58j67J24M3
3982A52k20L07k83J12J49k47j21l7L54l05m2J16p6K04o4j72L19j2k2j72J55k44
4004a49J17K92j95m4n6k51L31K2RN5Q2j37k52P9R0L5K8j63k27J11K21j61P9N0
4028c4P2O3k42K41k08L9j57M48K1m94J8K53j3K21l29k61L10O7mj48L17j78k09
4051b07J97l4J6M1J52k10Q6L34m77QJ22m0k23L58j08k17L61l08K59k82n7K18q6
4074i7O6NM6O2l2j16j9K90l05J94l18J82Q6Q0j79r5m8M9R0J52l6k23L20O6j67
4099E3k27L52q8J28q8r6r9Q2J12m8j39J59j42P2L9Oq3m7j13L91j95k12K56m16
$$ y = [-200, -19, -220, 45, -47, 58, -187, -21, 239, 5, 30, 67, 97, -212, 11, 97, 161, -16, 46, 113, 6, 254, 83, -200, 154, -135, 73, 221, -55, -266, 70, -188, -136, 274, -73, -41, -38, 37, -55, 127, 305, -206, 152, -15, 109, 152, -68, 239, -44, 68, 217, -30, -151, -188, 166, -139, -181, -65, -141, 63, -1, -173, 146, 134, 112, -60, 95, -149, -32, 260, 65, 21, -35, -286, 45, 67, 76, 131, 213, 76, -176, -97, -7, 28, 56, -107, -334, -223, -2, -163, -84, -34, 38, 101, -141, 100, -108, -69, -226, 222, 243, -251, -233, 20, 7, 228, -101, -362, -52, 15, 11, -137, 180, 2, -207, -10, -44, -28, 13, 165, -45, 41, 375, -102, -94, 28, -12, -235, 123, 15, -202, 159, -149, 110, -172, -229, -11, -97, -31, -26, 20, 82, 50, -66, -85, 205, -100, 94, -224, -42, 44, 124, -55, -150, -198, -149, -59, 93, 57, -166, 154, 220, 53, -174, 178, 90, 218, 130, 34, -65, 17, 129, 81, -58, 101, -41, 31, 70, 76, -7, -54, -167, 224, 29, -183, 73, -343]
4123c43K39K02L0P7k20K07k12K58j07o3k28J91q6P9j36K74q9j75J96j61K18l05
4145a54M02k91J86J7j59k10J81M3J86k09P9J16j07M2k34j6q1J22pn0j75L31k06
4168a94J60R5p3O3J37k62J77m07M18j6j37J29P3k61K14J87j72M9j42J30l10L77
4190B35j87k12kJ29j16j25Q8p1J93K64j61l26M64o6q4J84o1J6L6K3l23J1j46K21
4214a6O8L0n6k29M66m45L29k16n3j67J41Q6j40K73R9j20j83M54j10l77o5R8R8
4237c5l5j03M27l73K14jj17l7R8N0r3J00l3L5j78K52m14Q0J81j31J60o5K91k35
4261C8j73J22j3j73J46P8mJ41m7k31k4J06J08o3JN3Q2n06M74Rk60ok2L03Po3k19
4288a36K84j77L0J7j80L87l74R0K5J79Q1l58L97l82j33L34j12KN9N1l21q0L08
$$ y = [-343, -104, 98, 128, 205, -15, 192, -20, 238, 131, 68, -160, 31, -55, 24, -112, 162, 73, -102, 94, -67, 151, -154, 248, -43, 143, 160, 1, -209, -28, 15, 201, -8, 71, 187, 80, 122, -112, -128, -209, -87, -94, -144, -319, 12, -194, -34, 61, -12, 51, 188, -74, 103, -304, 114, 98, -39, 90, 163, -98, 116, 303, 131, 180, 38, 168, -142, 235, 48, -164, -166, -37, -153, -278, -190, -261, -68, 196, 35, -291, 173, 107, 23, 207, 146, 162, 198, 221, -102, -91, -237, -16, 52, 82, 26, -203, 263, -182, 147, -69, -122, -289, -148, -62, -202, 71, 170, 50, -133, 321, 211, -166, -231, -133, -35, -70, -173, 254, -119, 95, 94, -23, -60, 38, 88, -5, 95, 62, 97, -81, 171, -243, -163, 18, -113, 47, -18, 273, 38, -135, -13, -26, -199, -53, 25, 21, 162, 115, -116, -140, -34, 74, 11, 12, 65, 147, -359, 115, 124, -136, -142, -164, 139, 146, 83, -136, 148, -29, 1, 18, -162, 225, -149, -59, -34, 145, 226, -132, 265, -117, -250, 84, -28, -26, 33, 84, -237, -317, -9]
4311iK32j05k25m7M76l29K77k21J34k94K40k73o1L38J06k34p5L9JJ93J50j82l38
4334b07L30k04K25J56k31lj5p6J00k58J90o0R9k03l2K35Mk90K07J70l13K44M1
4357A09j45L38l58n3m7J66K68m38K97j14JJ06k04J81k04QK07j62K02m1J51j61
4379A07p9J3%l1j79K82J6l1K2o3K2j27N3k34L85m08M76k48J99j98k0l9j23k7M43
4404B11k5P3m59R4J49j55R5q6J85k73N12m12j23J20K9mMJ65kpp6J31Q6m02K91
4429A21j62j32L12N2k54p3L4J39k49K27k6o2k3L76l35L0nJ80j04K3P8j79J06K9
4453A03j13p8J58n0l7j19%K05l03L89qk17l6M8O5l2k21M5L2K99k60OJ23n5L7k17
4479b36R2K88k9o2j30J10r4L77j85j50R9k66K07j3K61k83p1K3K99k97L6J71J12
$$ y = [-9, 223, 118, -107, -154, 322, -7, 270, 49, 183, -111, 129, -144, -205, 133, 239, 5, -70, -31, -30, 163, 313, 131, -207, 123, -81, 144, 300, 69, 66, 51, -25, 75, -183, 7, -53, 46, -157, -189, 46, 50, -240, -33, 137, -176, 68, 109, -36, 302, -56, -109, -156, 10, 278, -160, 137, 23, 24, 130, -74, 107, -97, -89, 118, -44, 158, 117, 268, 107, 28, 41, 41, 10, -169, 113, 129, 98, 120, 57, 79, -48, 5, -229, 156, -252, 224, -24, 175, -23, -43, -82, -205, -232, 211, 186, 259, -200, -106, 43, -112, -17, -103, 82, -191, 321, -91, -214, -94, -65, -69, -65, 100, 98, 91, 15, 146, 232, -170, 121, -41, -173, 139, 191, -63, -136, -102, 37, -212, 15, -11, -73, -96, 280, -55, -25, -30, 150, 46, 69, 147, -32, 74, 103, -10, -88, 70, 20, -17, -136, -136, 69, -234, 155, 147, -70, -106, -58, 7, -25, -246, -201, -169, 130, -130, -124, -1, -56, -19, -236, -144, 144, 115, 53, -77, 33, -61, 316, 131, -19, 80, -186, 21, 8, 269, -14, -85, -62, 237, -60, -24, 147, 259]
4502B59q4j54n7k26K06L87l02P5p0j44K80j66j78P4K11P4j63j98%l4J13K26p4
4525E5j60K65k11JO2M5l3o8N7n0K86q0k9k12mj2J08K4KQ8N3k56%K75j77nk97K60
4553a3J01N4p9j03j96M41l57K18K8k77Q0J23p5l13O67l98J46P4j38K24k78K11
4575A40r5j28K45j90J44j89M47l80L01J4k85K41j47k62K5N2R8j63O1M7k6o4j26
4598b40P7R3L8q4J53J36q9l63J66K54j34J18j63m24M17O0k40N9K8J05JM2R5m00
4622b95K56J31J25j34l11L87j18j80J85L5OQ4l35J83k92K2k57M46K48j77j09K03
4644A03k7K9l22L74k58K52p3k51K3o1J52J5j46L28j65n6L01k08n6R3j19J11j20
4667h1p1L52n68M52r3Q2j8j74j77Q8M81j06k05J4j43o0J73L32j72k28J81j64J2
$$ y = [259, 175, 21, -36, -262, -56, 331, 29, 104, 34, -110, 170, 4, -174, -100, 111, 185, 22, -176, -176, -210, -97, 129, 55, -105, 160, -51, -50, 12, 57, 24, -44, 13, -37, 249, 169, 140, -72, -76, -88, 20, 44, 46, 134, 187, -69, -69, 206, 29, 24, -273, -13, 88, 142, 63, -40, -236, 205, -152, 66, 94, -183, -103, 20, -55, -368, 299, -99, 47, 121, -17, 207, -71, 140, 45, -83, 162, -28, 116, -73, 374, -6, 295, 309, 24, 265, 118, -144, -119, -67, 31, -132, -71, -24, -50, -114, -240, -163, -70, -32, -116, 37, 173, 84, -279, -113, 141, 7, 125, -38, -462, -45, 15, -225, -166, -138, -33, -32, 10, 105, -295, -39, 92, 217, 83, -228, 159, 41, -139, 46, 81, 87, 171, -164, 19, -273, -251, -508, -62, 186, 9, -100, 103, 76, 105, -217, 157, -101, 151, 78, -173, -150, -211, -59, -44, -190, 138, -27, -83, 218, 10, -46, 47, -72, 39, -81, -152, 200, -368, 84, -9, 73, 55, -119, -296, -208, 273, 167, -38, -24, -167, -227, -54, 278, 106, -122, 59, -105, -93]
4690i3o7J87L6j1j9j10K49k54J39k0N5k29J26L5J80m10K55j09K15K7p4k84J19
4713e7J48k71j56K47J57j60j7J39J5o1K29m21j3M24k84k14K57j56O4n7K00j49
4735a36j68J84K43J2j82J70k85J60M8n1J19k12P3j36n2K17o9k24L2K76K5R6j63
4758b3L14l40QR5n5J38o5K29n28K46R2k21K52N0K1k90L3q6J57p2J07j3k09K10
4782E0K64k99J5Q0O6J06k56J26l60kL71m71K75R8j62J56p9J49o7l48N88k05j4
4805H1j90M73l93j50K73J0n5k78M93l77k7M18l01l29N61j86k95M46o5j26j51K16
4827D8K18k35j02J23oj81K06J51m39K87o7l8j22K56N2l51K14r0k3L15n6nk31P7
4851AK22j49m2J68j29j12K78k09J03P1Q0l32J12j10p4N5o6J57R7j57O0K96j97
$$ y = [-93, -160, 27, 63, 52, 33, -77, 172, -82, 57, 37, 92, -137, -11, 24, 204, -206, 49, -60, 155, 182, 108, -176, -57, 91, -180, -336, -89, 68, -92, -109, 30, 45, -16, 213, -208, -221, 203, -81, -295, -38, -194, -130, -187, 13, -136, -304, -120, 123, 135, -47, 123, -162, -2, 46, -5, 114, -98, -25, -161, -213, 4, -65, -289, -257, 19, 44, 140, -23, 291, -49, -41, 54, -1, 137, 72, 301, -227, 19, 111, -110, 142, 192, 213, -77, -44, -130, 27, -45, 62, 49, -160, 50, 314, 15, 30, 110, 176, 282, 26, 152, -208, -210, 161, -310, -35, 63, -99, 57, -22, 127, 60, -288, 300, 95, 81, -109, 364, -29, -179, 94, 104, 49, -229, 264, -113, -140, 278, -23, -352, 209, 23, -272, 174, 109, -17, -168, 48, 266, 31, -71, 52, 46, -135, 71, 222, -217, 70, 3, -35, -157, 99, 151, -200, 14, -76, -99, 216, 160, 155, -76, 1, 223, 74, 32, 200, 71, -41, 237, 28, 131, 202, 282, -50, 62, -48, -122, -67, -133, 24, 121, -36, 24, 320, 123]
4874A23m7k33P1j09J60J90j75P0k30J60j0m3J86l1k25K27l38M58j41m4Q5qK61
4897C57k02M4l41J45Rk51K82k51J84KM3MP3K13l95J19J01j53k1M39k61l53L43
4920A30j49j73J18K62m48M4K40m6k83L44o8J92j7k32K34k0k14R1k3J19J49k63
4942a3L1O2k4l2N3n58M73K00Kk82K85k08j16O2j53J7M80m57J17J36j34Q0j50K89
4966A60j51J17J47m62O9P4O0j68K24m1Rj17J8N9L4lk02R5O6k5L9O3j8R5R9o3m0
4993A38pM8m10L12j34K4n1j12k5m1k9O1K31K39j75L3j00j49pM5K26R5j21k00j18
5018b27j6M64k33oK13k00J12p0J98j66p0J35n8k20N03m17O7j08L04j19j21J28
5040I3l84K28N1Kn4%K19l29L72k82r3J44o5J99l2L3pm2j99Q7j6J96k9P8k56Rq
$$ y = [123, 76, -157, -86, -195, -35, 155, -20, 50, -180, -20, -30, -73, 113, 82, -143, 84, -254, 204, 63, 19, 104, 96, 357, 155, 199, -142, 3, 12, -239, 43, -208, -24, -22, 21, 25, 98, 311, -84, 35, 136, -17, -38, 401, 140, -213, 130, -19, -192, -74, 188, -260, -216, 24, -22, -305, 39, -29, 163, 146, -86, 148, 128, -86, 5, -18, 101, 250, -13, 18, 80, 56, 24, 77, -481, -8, 192, 194, -88, 197, -11, -127, -65, -218, -201, 279, -178, -61, 75, -59, 21, -129, 160, 9, 126, 273, -189, -120, -46, 14, -154, 70, 29, 38, -79, -61, -2, 32, 29, -173, -78, -12, -37, 2, 65, 47, 142, 241, 178, 138, 131, 179, -231, 81, -53, -29, -80, -192, -217, -258, -287, -226, 5, 244, 69, 102, 2, -147, -154, -109, 117, 212, 91, -109, -227, -243, 221, -12, -18, 195, -5, 107, 37, 235, 69, -1, 134, 76, -144, 359, -58, 9, -99, 205, 86, -35, 93, -291, -63, -12, -10, -64, -64, 155, -174, 198, -84, -177, -33, -98, 101, 69, 102, 95, 53, -146, -59, -75, 121, 92, 170, -86, -77, -85]
5067h5O8p0p4Q8N0p2p2P8o2K01Q3k99K94n7k51k0K11k8K05n7J60k70p8QJ88k38
5093i9r9J86N3n3J39k15oN04l91J41m06L7J70r9K86j4k51J27J56j08J41k91l4
5116a26L4J11K38l51J27j8j77R8K76p7o9L5k91O5K88j32N7p3k04OL88k43Ko2Q8
5141a0J36N5l36m4j06L37J43r5m2k4L9r9R6j58M0K14j58j35m4J26QJ29r8K77l46
5166i5J09L8mr7J46m6k11N7J77Q2j53K11o15M67k21r3K36rKk29L28q4J26p2r7
5191d7O5m52O72j67j36K3n8K2j57N3K8J56j00L11m70L68j63j48K40k0j3o9P9N2
5215F9M9k05K32R2n8l05J86J31k09j11J56j26j10K70J5n5k85L70j39Jr5K20k69
5238a76R9L13l53k6L11j11K27j91J57m10O7J95l67K54J97j76M1Rk05K35r9J06
$$ y = [-85, -17, -87, -161, -73, -23, -95, -167, -89, -151, 50, 133, -166, 128, 71, -180, -200, 11, -17, 188, 131, 291, 21, -57, -49, 139, -99, -198, -12, 41, -12, 127, -88, -94, 410, 19, 160, -246, -209, -39, -138, 148, 134, -117, 10, 166, 58, 199, -92, -126, -92, 19, 257, -94, 33, 15, -162, -64, 212, 135, 66, 101, -190, -125, 163, 31, 88, 15, -189, -183, 205, -38, -36, -98, -10, 126, 181, -155, -199, -305, 32, 175, 80, 38, 14, 53, -46, 50, -108, -68, 146, -12, -147, -191, -65, -57, 72, -26, 251, -95, 14, 52, 48, -49, 97, 51, -160, -103, 74, 156, 3, 214, -401, 66, -155, -248, -12, -21, -19, -248, 80, -4, 122, 50, -47, 18, -434, 238, 71, -65, -42, -100, -78, -235, -182, -154, 2, -98, 213, -257, 111, -52, -200, 40, 20, 7, -62, 17, 69, 118, -87, 145, 237, 179, -126, 60, 191, -18, -129, 27, -99, -209, 61, 76, 21, -264, 106, -33, -32, -127, 93, -176, -77, 236, -117, -143, 168, 57, 284, 93, 250, -160, -93, 102, -265, -11, 186, 10, 51, 60, -145, 90, -9, 97]
5260I7j54J32k01J63L54n29L72l27j6q7L04P7k63J24j37J9K14M6k32j64N39j88
5282A43j39j64L38l10KRK27l30N9K94j73q7K83k8l94M9J84O2p9J12N0j94j28R8
5306a16M4j18L35J16j64J89k00j19j48K18%j09K22pp6m8j15j28K91r4P8Pj75L02
5330A85l67LL04j52j97K45J81m99M5K25m9o7J77J8n5k61K06L54k09J94l44K0L8
5353eK1l04J55L96k18nr9J38mP1j11n8K21j35j47M58j76j47kn2l4o8O0k57J17
5378a85KJ43N4k62L63l12P9JK97j5k17L21k91j29Q1P6j05R1j19k71M29Jp9R3l13
5403b67J89k7P9r7M02l31J12j45K45r6O1l02M81j09j56n6J39pN6j22J70j66l02
5426b49L80k57kL11o1J70k47j9j70J02J28k47o8K90j58j55M24k7m7j30N7p8j66
$$ y = [97, -57, 75, -126, 37, 391, -138, 234, -93, -109, -196, 108, 185, -78, 46, -91, -72, 142, 188, -44, -208, 331, 143, 4, -160, 178, -132, -130, -121, 106, -224, -165, 129, -44, -131, 152, 124, -270, -221, -37, 25, -54, 58, 108, -86, -214, -116, -72, -190, 145, 261, 97, 286, 86, -33, -181, 37, 37, -72, 150, 143, 67, 19, -96, -224, 67, -27, 51, 58, -117, 185, -182, -179, 125, -27, -224, 21, 202, -297, -252, -27, -76, -143, 34, 52, -3, -264, -58, 296, 87, 281, -63, -43, -5, 16, -288, -133, 263, 45, 40, -59, 79, 75, 146, 35, -23, 198, 63, -84, 374, 198, 51, 49, -3, -37, -105, -45, -302, -185, -183, -40, 14, -248, 115, -197, -118, -117, 180, 165, -52, 269, -22, -151, -70, 6, -99, -8, -127, -398, 31, 32, -47, 46, -267, -78, -105, -26, -123, 279, -52, 60, -85, 160, 64, 125, -177, 304, 195, 39, -17, 122, 115, 171, 49, 219, 53, -249, 131, -126, -128, 183, 122, 292, 45, 26, -144, -42, 86, -161, -229, 61, -97, -252, 172, 145, 98, -32, 25, -53, -219]
5449b19J34qJ20M4j10j1L77m52M8ol0L74m2k44K6j88K51j76N2K23j82l19M66j72
5473d4j20r9K24P7j19j53J57K35l27K17N1QR5l73J09j5j06J34J03j94K04r1j31
5496a58K45K19l17r3L64n37J00J19J28k64n8J47K8J73j04j38K03q6J66j29n6J24
5518G6k04P3m0L08l81J26l8P7N0m2J20j3o4J10l03K84k37J38k32L18k92J58K43
5541B35j06j13O3l7R3k07m6M54k38L7l37L2K49m36O40J6k40P3k79K5J23l12L04
5564gkK8O4J39l73J14o7M0j29K92p7j37L94k92j97M71k30j93J25q1Q8j46k8L14
5588A10n9p6N5lP4j55J23l12L80j60K82n26j33M87j89JP5R0k67N7k7K55J2k60
5612a66l8R6L4l0L35k22J05k3L0J4r2k64J21q8J21n5l3J96j09J77j56L0J6j70
$$ y = [-219, -85, -93, 27, 71, -39, -50, 327, -125, -77, -83, -113, 261, 219, -25, 1, -187, 64, -112, -60, 163, -19, -338, 128, -44, -164, -263, -39, 38, -81, -234, -77, 158, -169, 48, 99, 107, 202, -171, -62, -77, -183, -49, 54, -140, 64, -27, -158, 87, 306, -11, -104, 260, -277, -177, -58, 70, -194, -252, -105, -77, 96, -8, -146, 57, -29, 137, 8, -48, 76, -128, -55, -95, 213, -168, -42, -80, -3, 47, 5, 125, 112, 48, 158, -145, 139, -98, 40, -192, 126, -166, -8, 235, 129, 16, 79, 42, 135, -72, -118, 336, 98, 135, -202, -170, 79, -357, 283, 299, 59, 132, -147, -122, 1, -311, -7, -9, 19, 83, 222, -151, -37, -104, -64, -193, 99, 22, -115, 279, -13, -210, 261, 31, -162, -37, -118, -30, -176, -204, 110, 51, -25, 30, 27, 101, -54, 69, -243, 137, -23, 259, -267, -400, 87, -102, -101, -26, 64, -203, -146, -173, 82, 94, -166, -204, -108, -74, -104, 231, 9, 114, 91, 121, 135, 43, -221, -100, -188, -67, -122, -155, 41, -68, 109, -47, -17, -1, -171]
5636a71K37L1j02k58N78j73l32K31k16M34j03k22k0l3o0N6L74k20j90J85k29J40
5658f3q5qK75o9J6P3j52K07l4k25J85q5J39J30l15k37L75j9N3j61j89M4Q2P5j73
5683a61L32j62J92k12J80k09r0M18m34K8K06L4j89K88j89l5k73M57l47J14J03
5704E1O2k58L56k71L1K31k60q6K37k61J86N1l30O94n14o5K92j0q7J50j31j09K91
5727B50j20k31l1J19m9q3J54M9j49K11j70q5J49n8N8j7m6j7%j44Q0L05k16pJ78
5752A30J17k18q6N8k53M48j6l40Pk28L08QL3o7l0J38nR7Q9k65J90K8p9m34M49
5777G9k59K66l85R8J43j68L64L0k83P0N8j21K23q6R5j09o6R7R9m57J71K13J0O1
5801A43l23N7J92l6l5j81K86L9n35L22M0mJ56K84m10L72m28L64n05K00m2K58k72
$$ y = [-171, 66, 97, -5, -263, 315, 142, -190, 41, -175, 259, 156, -66, -86, -119, -179, -123, 251, 31, -159, 26, -203, -63, -148, -156, 119, 50, 66, 139, -13, 194, 160, -65, 120, 35, 174, 304, -11, -248, 127, 108, 161, 0, -189, -145, -63, 12, -161, 171, 9, 201, -11, 169, -40, -130, 288, -146, -118, 88, 122, -67, 221, 32, -3, -276, 181, -166, -52, 51, 113, -145, 211, -60, -29, 202, -58, -144, 93, -168, 18, 69, -261, 433, -81, -146, 146, 136, 49, 199, 68, -41, 250, 130, -101, -132, -13, -62, -145, 9, 58, -91, 120, -50, -135, 14, -44, 14, -3, -49, -66, -66, -210, -130, 175, -41, -48, 130, 247, 29, -57, 1, -252, 196, 180, -160, -153, -381, -73, -65, -32, -99, -129, 9, 4, 101, 190, -75, 115, 143, 64, -370, 79, -180, 86, -299, -201, -58, -226, 138, 168, -115, -45, 13, -108, 115, 29, 124, 15, -51, 46, 145, -312, -141, 72, 82, 143, -180, -123, 69, 33, -2, -183, 103, 142, -393, -71, -31, -35, 121, 405, -5, 367, -61, 303, -202, -2, -44, 214, -58]
5824e8j03K81j04K0n9k67pK60M2j34J76k87J17J25K3N8k6l85L66R4l68M21k30
5847d5j1J17q6j79K39O7k38m0K60k93J90j35K2m0L4JL35j34k11J69m72L06J62
5870A8k58J28L3J42Q1k98L5M43k85p0L19k14J81N9m38j63K86K64k05l0M6K3m6
5893E1j46O4L00l41J80j39J41l91J63J79p0K26l63K26l0J98k89q5J17r4L2J05
5915C4q0mK51k07k01L2K19k47N02n3l8k17k26K94m2j42J31J25k51l9J62n6J9O
5939b8J19j83M72j17o5k93K40m11K94knJ53k83j62L28o9K19k5m10k0M71l93L3
5962a37L23q2k3O8o5j85K92m24J90N1k63L83j17r2p9Nq7J61L93m51P0K42n73M59
5986E9o9J26k79J6K56n01K94K09l4j63n0K24r3J54l2n5J32k99n5M28l65J41q3
$$ y = [-58, -161, 120, 16, 36, -23, -290, -297, -37, 5, -129, 47, -240, -123, 2, 25, 83, 57, -328, 38, 132, -236, 185, -45, -56, 61, -25, -204, 35, 102, -136, -176, 84, -209, -19, -154, -132, -172, -138, -137, 198, 64, -147, 22, -450, -144, 18, -240, -112, -79, 63, 144, -154, -119, 324, 39, -31, 288, 74, 255, 314, -124, -287, -1, 263, 58, 28, 74, 97, 51, -95, -31, 269, -72, 108, -31, 110, -281, -118, 61, -9, 217, -146, 80, 50, 248, -41, -126, -9, -103, -71, 34, -46, -50, 201, -6, -207, -175, 44, -203, 299, 246, 208, -9, -235, 59, 17, -125, 6, 131, -120, -159, 3, -53, -34, -28, 91, -92, 380, 263, 198, -95, 145, -266, 28, 26, 21, 174, -109, -271, 57, -12, 207, 182, -228, -248, 223, -170, -137, 186, 104, 81, 149, 84, -101, 191, -233, -43, 8, -255, 128, 11, -81, -160, -155, -242, -81, 312, -139, -69, 173, -400, 59, -10, 116, -163, -147, 109, -392, -98, 111, 77, -86, -136, 88, -5, 149, 117, 62, 194, -105, -160, 268, -97, 44, -39]
6009c9J5J03j96J36L3o9j24J53Q6l12R6K90k4j81j31K20oL4J29j46j74M4L43j51
6033A29j95n1K01k13J75jk21k5J51J11j85j8Q0p2J01RJ23k79J24J87k56j12L44
6056A07m4j31M9j29N0o2J80j58L97m10l9J29J32J46q5k57l2J09r1Q9J06Q4pj57
6080b4Q9m9k3J8m3JQ5p1J2K3j14K29k77j3J32l47L85N6M0k96j08K75r0J74m9m2
6106b7J78k18J98N7r7m5j09O6J7j77m4M3K55m02K50J6k20M05k80L60l61J63n6
6129b8L1R5j58N7j50L1q7L66M0l51k30L84O7j63j57K47j03J11k05O3R4k43K69
6152b0m6Q7l5j06r6K20R6l59K77l4J05j72K80l30J68k30K19m8j65rM02j86N9j57
6176h0J76O9j76O1k38K08k3P7j31k05K37J14J39j93k93R4p8qJ26N6L49m44K86
$$ y = [-39, -24, 79, -117, 19, 52, -17, -141, 12, 98, -214, -118, 172, 148, -33, -164, 56, 50, 84, 213, 67, -107, -63, 280, 129, -66, -117, 84, -129, 46, 45, -176, -201, -50, 61, -124, -142, -62, -134, -33, -24, 99, -180, -56, 131, -125, -237, 107, 63, -68, -19, -148, -98, -160, 20, -138, 259, -151, -190, -61, 71, 217, 132, -125, -157, -48, -139, -50, 56, 140, 133, -24, 65, 16, -7, 11, -32, -31, 54, -17, -5, 18, -96, 133, -144, -157, -25, -372, 13, 69, 109, -187, -295, -20, -110, 64, 15, -27, 151, -67, 131, 188, 91, 46, -63, 3, 20, -157, -201, -158, 97, -305, -55, -39, -259, 146, -134, 226, -135, 28, -28, 3, 98, -60, -3, -153, -122, -209, 157, 197, -154, -384, 0, 67, -96, -253, -6, -109, 2, -203, -140, -46, -289, -20, -66, 21, -14, -120, -216, 4, 100, -259, 18, -16, 89, -83, 197, -133, 35, -195, 24, -24, -189, -198, 204, 18, 77, -80, 96, 165, -11, 50, -188, 20, -3, 74, -57, -262, -25, 89, 228, 35, -258, -164, -242, -250, -124, -68, 281, -163, 123]
6199A23O7k19q4K16l23P3J63J63j33k73M71l56J88m4P1k74L53q7n1j80J03J75
6221A42l60M28j87m9J73n2Rl09J44j23J87j12j5Q2J56R7n72K38j18J89n5K66j71
6244a2j2j84J83P6l2j9J20J74l48J02k33j2m2J91M0r1K08r2o8L89m79O3k8J57
6268E1J37j20mK7L1q5n2l5N5j03J60j93K50j24j16J70j1rK9j08j9lo1R3J89k53
6294a04R4r7J20Q2j99J95q0j51K66J15n14J67R6K73k74k36L64p7j78K3K32m2Q0
6317A55k94M4M3J15J02k3l6K06m28R6M8j48o3P8J05L9p3Kj11J90P4m1O1j98o4
6342a21K15m8R9k05J78J04k41J85j4k37O8l4L04j71l47L08m6j07M25j03j25q9
6364bl35J64P8q3L84l11K61k27K15j72j04K86n6J64m90M60k75L6m6n6m7K72j83
$$ y = [123, 190, -29, -113, 103, -220, -147, 16, 179, 46, -227, 244, -112, 76, 32, 103, -171, 182, 95, 44, -136, -33, 142, -218, 210, 23, -26, 147, 95, 104, -205, -61, -184, 3, -109, -124, -42, 114, 211, -361, -123, -241, -52, -107, 159, -12, -24, -208, -25, 51, 19, 0, 120, 294, -54, 48, -185, -197, -239, -48, -8, -99, 109, 17, -51, 338, -141, -78, -106, 51, 188, 68, 64, 91, 122, 37, -15, -50, 5, -98, 62, -131, 119, -5, -121, 49, 38, 29, 58, -50, -69, -72, -133, -40, 149, -104, -10, -107, 13, 95, -104, 91, 11, -140, 126, 241, -273, -106, -10, 263, -11, -247, 117, 40, -138, -115, 117, 75, 155, -139, -95, -52, 63, 165, 142, 106, 312, -116, -20, 28, -120, -183, -105, 0, 39, -34, -32, -143, 47, 121, 80, 141, -57, -121, 94, 46, 145, -60, 118, 222, -19, 166, 152, -85, -17, -51, 253, 82, -265, 43, -3, -110, 315, 212, 87, -2, -337, -173, -95, -178, 206, -105, 156, -71, 144, -28, -132, 154, 98, 262, -228, 232, -43, -7, -53, -109, -156, 116, -67]
6387f7j28L04j47K67j23Rk34L2M09l35l5j03R8m0k18J60K02j0k73J36K5L66k93
6410Bp3o9n3M21ll26J18j06J19n3K98k79K7k2J37k49K35j44J7l7n5J3J14k6K13
6435B19l04J78K59l18om06M29N3l7p0j04J37K0pj46L2j29K89J98k41p0K9R6L2
6459A33k32J8L58p0j33Kj56j8j3M8K57j21Oj49L27l49L34k30m4j1R8m4P2K53n66
6484b30N51j58l01K50N2l23K86m14L63k45P7l2K67k28l9K63j36Q1k23K0Q7N1L97
6507D16l51M3j98J34M5k71J36j3K44o7k07m9J63j15J45J9j85L1P3N0J29j56m3
6530b7r7N2J77l27K02K54l62N27m92K22k83J27k46L1K38jQ2k64K33l0r2M5J09
6553G8j45N5kJ31k20j27L8J61j50N00k99l11J56J74P4j94J96mQ6m28J46J84j19
$$ y = [-67, -195, 109, -38, 229, 106, 115, -119, -87, 322, -13, -48, -151, -53, -93, -311, -151, 51, 41, -232, -96, -71, 295, 2, -71, -140, -193, 228, 225, -101, 17, -89, 30, -23, 275, -4, 23, 1, 138, -111, 124, -20, -3, -40, -95, -82, 32, 6, 219, -85, 93, 352, 34, 28, -378, 51, 104, 67, -3, -107, 30, 50, 43, -103, -71, -200, 89, 287, 46, -24, 5, 101, 133, -99, -81, 277, 207, 74, 76, -80, -98, -111, -63, 194, 73, 79, -70, 257, -92, 242, 12, -32, -43, 55, 11, 83, 336, -230, 321, 163, -138, 112, 164, -159, 127, -287, 76, -169, -92, -124, 143, -85, -124, 139, 3, 84, -139, -119, -32, 19, 416, 65, 108, -90, 44, 89, -182, -46, -59, 185, 118, -89, -138, 25, -90, 55, 74, -111, -80, -7, 43, 172, 16, -27, -124, -72, 105, -222, -20, 234, -128, 399, -93, 129, -154, -27, -273, -242, -4, -5, 77, -187, 46, 16, -76, -31, 78, -67, -12, -14, 117, -103, -230, -192, -31, -181, 319, 20, -291, -135, 39, 113, -81, 115, 111, 197, -231, -85, 99, -20]
6576b0k15K59P6k77J65n9j1J75qPl5j5l5L2P5j98q1K96j00K4rK4k94M56l77K08
6602F3l85P51l48l5j37R2j6RQ0J36k54J10k44N1M19l46oj12K96n17N87l76J31
6625e1J11j22j63o8N07J22j31r8k04L08m21K26k41K29Lm3J51k05q3J7J49Oql8
6649d7Q2q2K09k03J37k08N8J49k02J57k57JL89m76K2M09k51j18L46k82l8K55j22
6672g2L92k31k53K92k19kK28n3J11K9k37j70J47j47K42l15M14l57j35L35oN9J34
6695A86j15J67j53l23J53P1Mo5n8J16k0M8j91M06j88J44m24K28j13J01k19K17
6717b8J8k3J10j3Q9M4l17M2K21j20Q3j51K04k69J59K35m96L64j74J5q1J75j8Q0
6741A49l46J19j13J23J22J34J7r1M7k85L94l88M1R7Q0k21M5Lk4ll1J7N2l26N35
$$ y = [-20, -235, 24, 100, -177, -12, -71, -82, 93, 85, 92, 57, 42, 7, 39, 114, -84, -165, 131, 31, 55, 46, 70, -224, 232, -145, 63, -322, 429, 81, 46, -91, 1, -15, -6, 74, 210, -44, 66, -178, -127, 292, -54, -60, -172, 124, -393, 194, -182, -51, 60, -62, -225, -293, 214, 336, 205, 107, -97, 211, -210, 16, -225, 4, 7, -36, 115, -90, -173, -156, -7, -1, -9, -47, 35, -47, 162, -41, 96, -112, -54, 95, -107, 50, -207, -206, 183, -293, -271, 138, -113, -231, 115, -167, -205, 50, -72, 320, 89, -164, 128, -91, -93, 135, 82, 193, 222, -15, -185, -38, -185, 57, -258, 156, -201, -336, -1, -7, 52, 186, 71, 238, 85, -238, -85, -14, -10, -75, -133, -17, -37, 11, -180, 226, 38, 182, -242, -14, -127, -26, -245, -28, -10, -33, 77, 64, 153, 197, -120, -78, 143, 23, 106, -45, 159, -110, 49, 284, -212, 152, -22, -7, -88, 87, 69, 149, -197, -78, -191, -68, 54, 188, 205, 114, 161, -124, 270, -118, -77, 20, 100, -121, -76, -73, -97, -100, -131, -114, -62, -388, 147]
6766A47k94L16l1j89M1J86L29p29J72or0M06l21k01M8K92M8k36NK85j63J40m3
6789A12j29J88l42J63j70L14j60m5R0j36M4k0j33J70J89o3k62K33j03k22L32l4
6811A6O8k38Q9J5o7J11M7k6m8j03L12l19N5J49p4R3j55J57K20l17j53N9J47j48
6835a10MJ95P1j60j46K23m4O0J00l11jJ25Q1j8K00k46mj09j15J56p5P4K75j52
6859G3K96n14O6K37Ql04J17P1J11m73N6J69P8k50L43k07K2R3O5k65K18j40J21
6882iL99l64K60l64J37J19l0l1M6l2m0q2j70J27K20l55L17q6M9l83R3O6R9M30
6906D16j74j80k61J14K22Q5k84j77N18j72Q9k67J18P0K4K2k76J83j10Q2p3J87
6928A56o7k49J23O9j30K93k52L30l05J5l29L74j14J09O9Ln6r9J16n9N4R9K4k2
$$ y = [147, -147, 169, 138, -51, -10, 176, 505, -224, -52, -58, -148, 258, -63, -264, -216, 76, 124, -112, -107, 178, 15, 155, 112, -17, 171, -171, -8, -178, 136, -24, -69, 21, -115, -71, -91, -224, -54, 135, 72, -190, 43, -60, -282, 50, 16, 84, -154, -65, -50, -117, -6, 41, 15, -33, -136, 176, -143, -88, 61, -13, 80, -75, 82, 302, -15, -168, -109, 38, -110, -106, 89, 160, 0, -146, 77, 33, 93, 193, -118, -119, 6, 87, 69, 269, 23, 19, -90, -205, -49, -124, -50, 225, 73, 369, -145, -79, 158, 166, -138, -21, 50, 161, -312, -256, -87, -9, -259, 84, -123, -101, -8, 57, -208, 10, -130, -9, 390, 26, 286, -78, 59, 178, 148, 117, 163, 131, 91, 9, -161, -34, 186, -169, 148, 62, 111, -272, -179, -113, -14, 416, 242, 62, -199, -85, 137, 222, -62, -239, 279, 107, 196, -71, 47, 117, 141, 163, -113, 70, -40, 42, -31, 156, 89, -160, -37, 32, -98, 195, -57, 273, -32, -17, -346, 28, -86, 23, 92, 95, 39, -60, 56, -3, 51, 150, 174, 152]
6952A52j11j48J19j30K08M1k6o0JR7m01N83k06N0l7j17k65K98P4K43j6j57j15
6975G7k45M4R8m9j43Q2P0K06r6j49Q4j42K60k31m7K46K06l10L9Q1J18l62Q1N3
6999b9J30l0j2L90o39K2R0P7J1l1p3o4L16q4q7m1N3Mj22L97l79L0n1J09j18L9
7025i2J43L9M8l21J17O4Q2L3k38N4j48P4K74k05L26k29J96l85J6J87O3Qp5K5l4
7050B2M8N1j37j28RJ44J05J2j68M0Q1k31N5R2J19l7Q3l15J16J10M6k28L0K0j86
7075b47J33J44jl45M35j58m3K88p8m32J79J49N5k42J82L4mj0j87K69j19J36r5
7098D3J41j21L7N2r0o8n0J4j37J91k09K76j52K33j90j28r0J80K37o8r1k86K25
7121e1P6N3J7M2k07L2k5rO3k0J31l34L47k86L57o1kj00l20O8J94J37l16J85O8
$$ y = [152, 41, -107, 12, -118, 90, 131, 105, 45, 46, 143, -258, 325, 119, 169, 132, 15, -250, 48, 122, 365, 349, 192, 77, -168, -124, -26, -75, -218, -136, -66, 140, 44, -105, -21, -163, 97, -134, -181, 65, 271, -39, 0, 81, 199, -163, -82, -29, 101, 71, 59, 449, -190, -168, -78, -1, 10, -21, -94, -158, 158, 74, -13, -54, -1, 3, -119, 278, -101, -71, -122, -13, -131, -92, 51, 90, 138, -183, -66, -2, 80, 113, -125, -71, -219, -145, 129, -76, 250, 21, 217, -168, -152, 35, 98, 106, 31, 56, 22, 70, 121, -16, -144, -135, 9, 114, 126, -42, -2, 79, -152, -97, -5, 114, 77, 160, -155, -39, 71, 117, -111, -81, -61, -247, -114, 30, 29, -316, 119, -39, -82, 206, 128, -304, -125, 24, 79, -163, 19, 53, 49, 39, -148, 121, 2, 138, 43, 184, 63, 100, 152, 62, -6, -56, -42, -179, 12, -197, 79, -73, 160, -30, -158, -248, -68, 169, 101, 10, -276, -51, 25, 78, 95, 137, -70, -38, -63, -72, -9, -29, 102, -232, 115, -171, 186, 125, 123, 23, -297, -229, -35, 102, -214, -29, 39]
7146C9O1k24K79N6Kj19J8j06%K2jj53Q4M8O2j87K46o5O1q6mJ06k74K38j57J20
7172F6l53L40l28M39J05k34k2l5K38k34J22k7o9O8m6J43j69oJ80j83O9M7k19Q9
7196a9Q1j89K41p5J69j75k01K44k17J08l48L97J22j83j30l2J46O1R1j57J0J30
7218G4K8o2M2k15J34No1K56j78j84r1P9MK24k20K75k29K13j01O1j08N9K61j29
7242A37p2L5k83Q0J33J26M0j95R6R9k32J11M7j04j25o5J62j12J84n9N4j53J20
7265B4j00P2r7j59L53k68J18J1qqM13l4l34Q3j75J61O9k58K58q2j67J14J47l01
7289a68KK15k88J76N2J43l04P6J48j75j03j37J24M55j58J3k04J04Lj58LO1j35
7312b55K53l3j43L21M1l60J01J22k3K31j06j5k35J34M05j25m8m04L99k29k1k16
$$ y = [39, 100, -124, 155, 211, 213, 94, 112, 6, 6, 28, 27, -126, -42, 6, 68, -119, 127, 62, 123, 37, 33, 139, -135, 103, -54, 66, -287, 53, -275, 164, 269, 35, 13, -22, 216, -18, 104, 77, 8, 76, 30, 173, 4, -2, 178, -5, 64, 111, -108, -19, 62, -127, 114, 39, 208, 33, -168, 76, -141, -33, -381, 16, 138, -45, -175, -207, -61, 0, 91, -66, -56, 74, 102, 40, 82, -133, 1, 6, -55, 201, 23, -161, -252, -173, -169, 55, -165, 110, -119, 94, -7, 54, -54, 5, 266, 137, 65, 100, -183, -103, 30, 156, 196, 1, 97, 196, -36, 75, 122, 18, -107, -172, -10, -122, 62, 3, 57, -96, 24, -76, -4, -101, -260, 93, -175, -57, -46, -54, -62, 351, 317, -17, 66, -109, 52, 121, -137, 121, 39, -128, -14, 133, -168, -166, 49, -239, -63, -11, 132, -172, -96, 52, -123, -226, -363, -239, 216, 58, 71, -133, -29, -26, -184, -181, -120, -255, -2, -35, -178, 143, 184, -176, -75, 47, 24, 255, 149, 134, -101, 33, 438, 313, 265, -139, 260, 31, 10, -206]
7334b06K29K95m43J35n2L18l58l8J05k93K70O3L5K3k41K21J09j39p1J7k3K70m51
7357b25J49J42m03N36k65P4l0p8L6p7Q6L9Qm7M0p5k76K45M25l68P4j4Q4K86l20
7382D6j62K00m4J35l01K06m4j01O4J85R8k89J01j19J6Q7k71K40J26r7J21j42M3
7405I8p0r0N0K30m13M41r0j58k26M90q5Ol5j53M4k61l8J82J00q6m9N0J25j86J07
7430a7j32Q9J76j16jJ85l3m1J55m07n5M12k59q6N3j14R3J99k0m2O4J08l37KJ43
7455A9M5Q2l62J04J2m4j43J05N4J09p2L61k01k2k76M73l83O3L27l35r5K04l01
7478b76L16K84n38J28K03qr6j23J17j32LK28o9K3Lp3R0k57J04J68k26J79j36j53
7502b41M26m4n9k1o9J44j28jM2R7j53K20k81q8K49j47Q5O5j7R4k55J40J71m12
$$ y = [-206, 23, 318, -125, 10, -42, 276, -82, -120, -15, -308, -38, 25, 60, 83, -158, 63, 172, 33, -38, -21, -44, 226, -225, -76, 66, -337, 199, -66, 8, -22, -100, -64, -141, -55, -16, -8, -55, -15, -90, -366, -121, 304, -64, 10, -4, 80, 366, 46, -116, 84, 40, 175, -126, 80, 36, -65, -1, 184, 282, -7, 94, -25, -9, 78, -193, 47, 173, 76, 197, 55, 98, 28, -62, -12, 218, -195, 246, 156, -2, -228, 262, 177, 183, 148, -5, 39, -222, -260, -78, 22, -64, -113, -63, 62, -124, -17, -149, -60, 116, 0, -1, 184, 151, 110, 265, -142, -197, 215, -44, -130, -77, -191, -98, 101, 81, 39, 103, 211, -126, -124, 19, 64, 146, -216, -112, -100, -144, -287, -182, -128, -19, -91, 270, 69, 47, -229, 244, -139, -76, 251, -84, -179, 25, -276, 40, 324, -214, -86, 117, 109, 13, -110, 7, -125, -122, 106, 37, 60, 63, -10, 80, -177, -73, 95, -131, 48, -88, -241, 185, 141, 82, 61, -8, 136, 8, 7, 49, 146, -7, 213, -68, -156, 93, -54, 31, 96, 79, 173, -82, 58, 229, -183]
7526a83L27j56m2l5j20K58k66K12K8Pp4L01k94L7n2O4j49k00J85J22J03k62J44
7549d5m1n9N8K28j45K09M5k32k0Pl6r6J42K16m27K99K4j19K4Q5Q6j55m9k13K12
7574bJ85k21J09n6m9k59Q6K20O4j75j66M74m80M16j60K13l67L15l08J02J47j8
7596G0n2nM1m47M77q6P4k7J31o9k26k3K35o8K45l74O8Q0J27j82k51M17m60J15
7620a90m6J24Q4p4J75k29J03J29L7r0j71J52j10o8Q5L58l78J16j14L31m4j70Q0
7643I0q2p0J14RKJ7k96P8R0k7m3j60M17n8j76K06n9j09j37M30k21k43k2J6J51
7668h3J71J90k24O6K8m46L51J7j58k34L49j74K67k76J96j27J38j48J37P2l07L53
7690A58j59n4l08K19j36K36r6j0O7K80l33o3K00P4r5j03j52K97O2k54M13k26J7
$$ y = [-183, 144, -12, -54, -89, -209, 49, -217, -5, 23, 30, -44, 257, -37, 0, -52, 12, -137, -337, -152, -30, 73, -189, -45, -86, -145, -87, 141, -4, 205, 250, 18, -2, 5, -31, -127, 15, 231, -196, 103, 127, 8, 32, 117, 203, 48, -1, -214, -2, 183, -38, 71, 15, -34, -293, -207, 13, 77, -98, -264, 210, -270, 146, -14, 199, -168, 147, -161, -59, 88, 70, 18, 13, 54, -393, 84, -2, 72, 45, 176, 107, -119, -142, 93, 25, 270, -104, -36, 44, 171, -11, -262, 155, -305, -190, -236, -112, -28, -102, 73, -156, -53, 76, 113, 23, -148, 4, -106, -174, -89, 269, -109, 7, -107, 224, 180, 10, 90, 8, -62, 52, 61, 63, 80, -216, -138, -48, -75, -118, -278, 139, 81, -95, 111, 52, -57, -194, 236, 15, -228, -250, -234, -83, 88, 278, 54, 120, 148, -298, 53, 70, -88, -322, 27, -147, 120, -156, 40, -87, 51, -97, 40, 112, -195, 158, -1, -55, -363, -144, -280, -44, -140, -150, -83, 197, -136, -199, 1, 75, -20, -123, -275, 22, 84, -170, 243, 17, 34]
7713C4k47L82l47J47M39l79o5J28P5l19j2J81j46K20j36Q0J52k4j94O6k85M07
7735A57m67K78L2r0N9J25j87O0L19l42R5Qj4n7O0O5k50J98M2q0l43K65K26k46
7759h7K31j92j7J96j73R8j13M6K22j60K71m69J0L51j62r2J23n4M1k06p4K43j41
7782a08J75p1L50m21j15O4o9K28k86K67j23m7K60J00j33j53J52k42M60j54j52
7803a8j01L8J07j3M0q1j7J3L19k81J16N1j18k12Q3k8L78m50J00J2J04j0j45J76
7827F3j00Q0j77J11k18J67j21J94k04J64J97k66K20J39l65k8p4J67N5J25k7o9
7849C3j05r8K43L4j82J68RJ26J29m63N8J65l00K67N1j02m4K8j17J39j54j33L13
7872F5j43J18j64J86j13M3K25k22J66j33l7J10j95L35l02P5j41P7J03j10P2j35
$$ y = [34, -213, 169, -178, -31, 408, 29, -36, 92, 167, -152, -164, 17, -129, 91, -45, 35, 187, 163, -31, 35, -250, 157, -310, -32, 0, -90, -31, 94, -93, -33, 286, -56, 39, 47, 33, -24, 36, 101, -149, 49, 91, 11, -332, -67, 159, -87, 144, -48, -65, 131, -42, 56, -57, -11, 211, 51, 322, -147, -137, 214, 52, -40, 83, 29, 70, -136, -210, 33, -108, 67, -4, 346, -75, -190, -126, -195, 33, -253, 14, -109, -156, 104, 204, 71, -82, 70, -172, 288, 134, -18, -119, -81, 26, 13, 53, -28, -45, -32, 287, 6, 122, 173, 55, -157, -74, -102, 276, -174, -74, -62, 42, 32, -113, 63, -37, 43, -134, -23, -241, -74, -195, -1, -205, -41, 156, -110, 110, 249, -116, -144, -218, -51, 4, 129, 102, 33, -72, -170, 73, 107, -75, 93, 102, 228, 357, -106, -48, 117, -183, 84, 135, 33, -11, 17, -100, 39, -115, -248, 65, -78, 40, -124, 62, -51, -8, 217, -5, 161, 28, -9, 101, -94, 241, -61, 14, -127, -50, 53, -57, 15, -120]
7894a20Q4K2K25m03J90n5P2J82m12R4K69m01N43l68L85r0%k46k73M19j82J59j84
7917i0K65l47P0N8J01k24k7J79k0rj15J37Q4j51K22k2q9K46j19m17J35L47j97
7940A7r7j09K32q2j07J92J23l81j02L31j5%J31j06p8o6O2l0j65J6J99l20L89k04
7964a70O7R8j79L18N7j56J47p0l90N95k71j38J04j00J09J21k45J08q9K29k91J60
7986A4P1q5m0p6K07j06j85K67l6Q2j00L14o01J37J56K72q2l14R1r5K89k43L29
8009B66m30L77k67R4j54j49J40L15o3k31L7j24K09j00K35J17N6m35K17l6L0j69
8031f5J31J10r9r2k54K72j23J69J9P6m7J1j47N0p3O3J9q6j36K42K54k31j87M5
8055g9Q3j36L9J98J15j74K46j4k55J91m46Q3M27j19o0j92J31K80l36N3j84R5J6
$$ y = [-120, -36, -14, 211, -192, -2, -57, 15, 197, -215, -121, 148, -253, 290, -78, 307, 217, 217, -29, -302, 117, -65, 94, -90, 175, -172, -102, -44, 57, -167, -194, -15, -35, -44, -159, -22, 62, -89, 133, 111, 22, 268, 149, -268, -133, 214, 17, -80, -189, 43, -39, -146, 46, 169, -212, -314, 17, 2, 2, 133, 27, -51, -117, -55, -85, -250, -234, -35, -355, 34, -170, -103, -5, -184, 134, 191, 35, 182, 112, -278, 317, 46, -92, 12, -88, 21, 142, -103, 5, -84, 145, -146, 14, 85, 0, -40, -116, 91, -15, -200, 67, 31, 113, 13, 327, -274, -137, 19, 291, 209, -105, -14, -109, 180, -63, 266, -164, 213, -54, 40, -114, -263, -123, 192, 129, -102, -65, -189, 20, -80, 155, 272, 328, -107, 110, 74, 104, -65, 66, 176, 77, -15, -269, 3, -120, 49, 68, 144, 97, 108, -39, 11, -62, 1, 20, -66, -202, 40, 294, 63, -124, -79, 4, -132, -93, 105, 220, 46, 292, 278, 23, 214, -232, -149, 278, 159, 99, -93, 38, 318, -18, 35, -149, -54, -38]
8078c8R1O2L4j39K36j75q4l4lJ43L8K4k83J51L4l50M00K38o34K00K32k69j2j64
8102c02L11k46L23k56K52K3l9j59Q4L7q8l0K38l24N8K04P7J4J43l75J99j78o1
8125i5J21o5N1J31m1k4q0NJ96o4m3k22P1J76j01j38M6K11j95P9k69M02k0k06J73
8150I9q9K73k55L6L1l24L21k31%K60j05J11j03o2K60l37ML13k54N5m5N1r8R0j00
8175i9l06O04k62j06J49K80j74k99J75j0k4j18K02q4N5K31
$$ y = [-38, 53, 115, 149, 10, 246, 71, -13, -47, -50, 93, 131, 155, -128, 23, 57, -293, 107, 345, -289, -89, 143, -126, -138, -302, 9, -237, 86, -170, 82, 105, 66, -93, -9, 28, -60, -90, 148, -176, -118, 86, 163, 177, 320, -55, 144, -34, -95, 26, -39, 12, 143, 102, 78, -2, 3, 199, 135, 92, -130, -59, 117, 16, -122, -76, 135, -60, 19, -250, 152, 132, -74, 99, 10, 283, 28, 64, 95, -229, 92, -139, -139, 121, 16, 127, 24, -38, 222, -115, -111, 202, -52, 3, -42, 9, -89, 1, -99, -405, 199, -63, -169, -20, 260, 86, -213, -38, -48, -72, -190, 12, -72, -17, 214]
8191B14
$$ Imaginary data points
##PAGE= N=2
##DATA TABLE= (X++(I..I)), XYDATA
0@%%%%%%%%%%%%Qj6J6j6K4l2L2m0M8n6P2q8J04j20J36j57J81k08K40k72L11l53
34a86L96m49N05n64O33p06P87q78R75j080J194j318J455j606J770j951K149k368
52a242K611k880L180l515L896m333M837n427O129o983Q046r410J1233j3812J7767
67A0097k4665M0114j41772M2201J81307j85936j4462J41989m2390j47612J36855
78d274J41179r2852o9680J07368j1542j02325L8459J04304l1171o3779j8924j9604
90b2841q820L4596N883j3831q774m8588m1610P5523O1029o7814j5969R1442l8119
103B107j07416R1725J31327q7643p2744J05239n838j37886O9222J60006r3438
114E4661j38144R0025N4105j21207O701J37250m3486j26558M6843O6186o7307
$$ y = [0, 0, 0, 0, 0, 0, 0, 0, 0, 0, 0, 0, 0, 8, -8, 8, -8, 16, -16, 16, -24, 24, -32, 40, -48, 56, -64, 72, -85, 96, -112, 128, -144, 167, -186, 210, -239, 266, -298, 335, -371, 416, -462, 513, -567, 627, -691, 764, -842, 928, -1023, 1126, -1242, 1369, -1511, 1669, -1846, 2050, -2283, 2554, -2873, 3256, -3727, 4319, -5091, 6142, -7670, 10097, -14568, 25546, -116226, -74025, 107282, -78654, -93116, 48873, 6483, -141129, -4274, 136905, 44053, -25627, 81741, 70199, -32126, 6333, 110637, 79466, 15687, -3237, -22841, -31661, 2935, 8818, -5013, -13787, -62375, -103985, -28462, 32567, -35247, -51216, 40226, 2107, -105309, -13584, 117743, 30100, -42644, 62595, 56757, -81129, -11907, 148099, 54661, -83483, 6542, 60647, -60560, -53859, 83391, 39905, -86653, -39810, 26376, -40931]
125d0931p095R6464n689q7989n42M4958O617J3192J5175k4942j9361N33r819K3848
139D419M8255l0604n9654L3145K5326o4296J1593J03031k9944j11005L9941P5821
151D6028o5710k1879J10889q705j30608K4244J07690m7667o0114Q3450K2086j11193
163e1489j0474R4217j0650n5860M0740K3718o9396j6900O2940J8602k4651R47
175A744k123j6218R098J7126O149J6975o407m3507R01M4339j2410k7869M1862
188B9660Q605p9977r370Q0458q593o3305L7634L7257p6865k5986R2044J5287p4096
201c7247J8293N6241m9132l7723P3472L4850n9392r758M1855j9570l1068L7905
213A8726K7497l4864k4049R568k272m421R880J126p265p075j7152j847L1569R979
$$ y = [-40931, -48026, 48438, 42749, -45240, -45782, -824, 5793, 18985, 34160, 9218, -10143, -9610, -19429, 4419, 52674, 22070, -37584, -4439, 20887, -43409, -31816, 71215, 41271, -69734, -29793, 46028, -19682, -41561, 69328, 60623, -69985, -45741, 61949, 14282, -45832, 37618, 59704, -51489, -61963, 32254, 21604, -34256, 6484, 30202, -39194, -56094, 6846, 25448, 797, 1744, -379, -16597, -7499, 9627, 15776, 32751, 26344, -17163, -16262, 28077, 15667, -12202, 29660, 38265, -41712, -51082, 29376, 20783, -42522, -4888, 32369, -44496, -70482, 21562, 36849, -37247, -18954, 37287, -11845, -49568, 23904, 58754, -638, -10396, 31459, 11889, -19179, 18726, 46223, 11359, -12690, -3122, -5394, -9815, 65, 1191, -6074, -13149, -30301, -32148, -579, 9400]
227I400k5926M694K4127k4773j7496N1719K4633m9153p830M4039j7853l9710M1980
240A7851L6238n3969l0486M3764J78m4739K0591M0036l5822l7609L0890J9505
252F428k5044M009K9790j1075k5671J1545K1430r47k937L875j944o062m810L345
266A932J4042K915k0781q764J4277l158j7085J6183J9303k6710k2123K7194J2376
279I601k5453N802L0213j6526l1072K2274K6895k1041j0610K6424j445l0388P069
292h257K8416p790j9070R753Q090j7098o068J7502O034j4568p240O971K010p470
306h785J597J1516j73j4737j951J4814K363r632N875J1646j0146j2649J3420J4043
320A7201j2102p639J2691n60j7430K692J6854m720j6724L188R421r672p781J3089
$$ y = [9400, -16526, -11832, 12295, -12478, -29974, 21745, 46378, -2775, -10605, 33434, 15581, -24129, 17851, 54089, 120, -30366, 13398, 13576, -31163, -10572, 29464, -6358, -43967, -13077, 6428, -18616, -14607, 15183, 4108, -21563, -10018, 11412, 10465, 7528, 11403, 9459, 3397, -1413, 1932, 15974, 18889, -1892, -10656, 3621, 463, -16622, -439, 18864, -7846, -29969, -2775, 9601, -15852, -10050, 20163, 3637, -27435, -5161, 21734, 693, -9917, 16507, 15062, -15326, -8257, 20159, 12369, -6701, 3052, 11142, -5956, -12024, 5478, 11512, -3056, -10296, -3325, -1315, -8785, -7188, 4328, 4155, -10582, -12533, 2281, 4644, -4988, 887, 12533, 2387, -10262, 3158, 17201, 5099, -2540, 10151, 9591, -7839, -5147, 11707, 6987, -9737, -6549, 2872, -6800, -14581, -1492]
334a492P377j3854p183J3636N423j0999K327J5851l912j5021P659J5446p613j0458
348b813J1596N438j6808m338J5902q72j5590K516R265r344q285J0435N822r217
362f293k967P322Q42l063K564N077Q17k497k527L625N591m211n402O746K212j2639
378d803j393J3843l065j6316P484J2628j4385q435K0447L664k0498M404J9119
391A2694j0029j3880J7808Q575k0351j894J7743o432j4826J1013O697j4791k448
404a0121J1721l885o846Q000K127p296N108O090n819K830R189p278n607J3281
418A1494K41j5227O922J2028j7266j0428J9393q94k3276P186J8271j8446j3282
431b3284K4016M944k3949P494K3061j3965j2954K3928P718k1239N224J8674j1970
$$ y = [-1492, 5885, -7969, -15152, -1516, 3907, -7092, -4765, 11086, 7174, -7847, -188, 15258, 7645, -2813, 8783, 14221, -2587, -6925, 8977, 8105, -7485, -4969, 4296, -5048, -13333, -2898, 2924, -6293, -9260, -1938, -1096, -4159, -1595, 3482, 4299, 1802, -725, 2900, 8491, 4280, -1122, 5624, 7836, -4803, -6196, 7647, 4582, -11734, -4250, 8378, -6007, -14442, 6005, 9669, -10829, -6425, 12694, 2665, -11215, 6593, 15168, -5183, -7077, 10666, 4234, -10592, 421, 7118, -7673, -10121, 1600, -2285, -9131, -1131, 996, -6300, -1192, 4898, -921, 1909, 11098, 3820, -1787, 11494, 11735, -3492, 3430, 15458, -1808, -12236, 7157, 6263, -17013, -9827, 8444, -10002, -23284, 732, 5676, -18273, -10779, 12282, -1683, -14637, 9291, 17009, -4230, 994, 19668, 7698]
444G698j1262J7234J827j8404L883R819j3499n477J2618o055j3112J0770L435
457e25j5816M621J6475j2516r571K0205K263j9226J2441K0640j8411j1008K6696
470A6268J795k5823J1500K1738k1828j4328K5107m21k7747R510K0167k1646j4756
483b0464K2918N26k2545J0555J5720j8176o012K2536k142j5991J4133J1205j6256
496c993R08J8705r899j1635J9669K687k3592O264J8416j7141j1716K1594k796
509G471k6236J2542K0568k3371j1741K8184j068k6607J3659K1238k1588p768K8637
522A3920l482k6998J5744K0692k1129q751K3082n437k0348J5883J1731k3172j760
535a0025K2413r498j7150J6669P037j9385O308J7916j7784j1214K4737J832k4234
$$ y = [7698, -3564, 13670, 15497, -2907, 976, 10795, -2704, -8181, 4437, -1618, -14730, -3960, -525, -16341, -11720, 4755, -7761, -17332, 2873, 5136, -14090, -1649, 18991, 580, -10428, 16268, 18063, -7760, 3740, 25478, 3650, -10678, 14429, 14008, -13739, -4229, 15938, -5708, -20464, 2454, 2980, -19565, -9010, 6710, -11466, -17478, 5058, 2916, -13075, 1058, 12263, -3993, -3085, 15620, 5721, -5914, 13755, 16442, -7150, -886, 17530, 389, -11327, 10267, 7471, -18765, -6223, 14345, -9026, -20767, 7417, 6349, -20258, -6599, 14639, -6949, -14717, 13920, 10438, -16560, -816, 19876, -1253, -10004, 13078, 7641, -12707, 3176, 14907, -8265, -10025, 12388, 2890, -14260, 2409, 9446, -9939, -3631, 14285, -3499, -14713, 10024, 11856, -12378]
548a2378R229J7375j9283q093K4760n348k5160J5717J9034k4636r393K7722k357
561G189k2989J5574J5046k3296k323K8750o640k3854J6648J4165k0710k862K0785
574A5483j0941j7055J8394N314k5312K590K0998j2748j3689J7488Q30j9429J2407
587e670J8640k0005p893K5722k15k0677J3530J5423j9887l270K3353q877k3418
600a3244J7771J4609k4680o692K1471q586j8303J7382Q991k4247M81K3877r248
613d18j7004J8174R585j8730M040J7799j3094r709K1147K863k1969N552J6087
626A4323j4211p513J7916m556j9086J2522J2753j9899n062K1488n181j8176J3987
639f95R496j8789J141K1635j0173j8315J7216J0940j9048P40J8684j1230j3041
$$ y = [-12378, -3149, 14226, -5057, -13150, 11610, 6262, -18898, -3181, 15853, -8783, -18176, 9546, 7189, -15800, -226, 14820, -8476, -10799, 17951, 11311, -12543, 4105, 18270, -2440, -5302, 15483, 4542, -12513, 5881, 11195, -14117, -11527, 9471, -3277, -16966, 522, 1352, -18077, -5670, 12970, -7035, -14928, 10794, 10579, -10098, 3432, 18855, -1032, -4302, 19051, 10174, -13244, 4527, 19136, -5544, -12236, 9235, 649, -17654, -272, 8719, -15528, -15047, 8830, -418, -17422, 752, 10337, -8393, -4353, 13446, 352, -9357, 11790, 14653, -7316, -1764, 14323, 112, -7401, 10515, 5959, -13127, -605, 12148, -7751, -12813, 8675, 3494, -14682, -695, 8801, -9988, -8847, 12788, 2615, -15700, 1516, 12456, -6592, -5852, 12832, 1602, -11439]
652a1439J7711N046j9676M293J7821j2662j1942J6158K456j6424P370J2714j5547
665d121p540J7762l86j6230Q450J0533j4575l286J7148m704j3685J2596R177j7473
679f334p82J6898o065j2022J3106M742j7514K712J6507r233j1729J3525L528j6536
693i197M318J4159j0927p806J4513L28j5745P006J2601j0639n796J3379j988j3046
707h840R350R398j2769l057J2969m666j1124J0107O414j2521l68J1745o579r498
721i439J1669N386j3037J635J0696p499o727J2363K091j2512L101R520q912n054
735f719J1708O0j1534M454P511q775k882J1300j658j0248N765O676r013r81J0708
750F372l233q955P176M514q882L01R273n154p325O825K467p842J716P826n874
$$ y = [-11439, 6272, 11318, -8358, -4065, 13756, 1094, -10848, 5310, 7766, -8658, -1288, 11426, -4121, -11661, 6101, 5715, -10515, -2065, 8468, -6107, -9393, 7755, 3051, -10634, 1962, 11139, -6334, -7116, 9782, 3717, -8305, 4801, 9543, -7971, -5259, 11248, 2015, -9714, 3811, 7339, -9197, -4879, 9280, -1647, -9453, 5060, 5388, -10357, -3351, 9250, -1389, -7185, 6194, 4206, -8840, 510, 9908, -2861, -5918, 7051, 2385, -8739, 1368, 7782, -4739, -5107, 6638, 59, -9439, 2230, 7616, -5421, -3786, 6910, -589, -7316, 5047, 7138, -5374, -2273, 7247, -1665, -6719, 4989, 5049, -6485, -2031, 5480, -3295, -6177, 5123, 3465, -6783, -1018, 5658, -3355, -4336, 6372, 3139, -5816, 1360, 5874, -3008, -2707, 6566, 1412, -5913, 912, 3379, -4463, -2747, 5079, -795]
765g95n879Q013J433p213L557O605n998l940P424K54o453M118M723o806k976O985
781C052r92n907M250K864o710j462O459j378m640M726K719o249q6O192j589l569
797b320M556J259n394P52M955k411k817L479J76m366P15L818k395j917L580j068
813F02l688J920K742k707o93K689j459k825K435K249k306n99K671j269j719K781
829H24J710k093K9K001r69j365J889J094j987p43R53q53j713Q26J54j313p39n48
847b843J14Q4M58O76L54Rk31J011J116O39N20O74k76k62Q79K71p75k86k93j216
867F23j141N25n41j423N36m23j863K12J632m21n02J910P19k057J581L075j007
884A435j069K593N24l216R99L428k618k538K942o25m164J003K981k971k406L549
$$ y = [-795, -6674, 1339, 2772, -4441, -884, 5721, -277, -4217, 3207, 3461, -2992, 1126, 5849, -957, -3933, 3052, 2060, -3847, 403, 3267, -3443, -4905, 1554, 176, -4464, 262, 2981, -3268, -3354, 2838, 1249, -2320, 2236, 3495, -1899, -1147, 3808, 1397, -1420, 2059, 2235, -2131, -1416, 2402, 7, -1910, 1670, 602, -3086, -1166, 1576, -1131, -1824, 865, -594, -3419, -984, 1265, -1041, -1640, 1031, -238, -1957, 824, 2534, 441, 470, 2471, 1502, 137, 2026, 3120, 1133, 390, 1343, 490, -1223, -397, -243, -1556, -2295, -2843, -2729, -2645, -2187, -1511, -1157, -1148, -1379, -368, 748, 1387, 1907, 2581, 2305, 2043, 2922, 3193, 2418, 2132, 1839, 623, -518, 7, -534, -1957, -1421, -1844, -3707, -3495, -1863, -2284, -2786, -876, -157, -2214, -633, 2442, 1435, 366, 2959, 3483, 267, 1266, 4694, 2076, -462, 2480, 1855, -2309, -1306, 1675, -1296, -3702, -153]
900a53k57l517J686L860k808j393L991p09k970K723K907l217p96L458j838l072
916b105L663J244m988R79L811l486k902N287R58n598J826N032m077k626O390L09
932C717o626K501N516n792k780O583p94p003K763M906n673k634P094o67o392M406
948h75M106n378l60O762j657m908M701K779o391Q70N933m060m428N575Q35p674
964d170K662N391o447l213P254m11p802M135O509p207k388R447j032p809N093
979A2O711p676k244R425k109q301N927N088q398j624Q497l099p412N841L356p990
995c996L45P497m921n337P252J583q213K844O853n880l305Q834m51q136N128P040
1011G137q127k811J0066j861q498N595N895r493j809J0205l774r532O675N389
$$ y = [-153, -410, -3927, -2241, 1619, -1189, -2582, 1409, 700, -2270, 453, 3360, 143, -653, 2805, 967, -2105, 1558, 2802, -2186, -1207, 2604, -882, -3784, 1503, 2461, -3137, -1311, 3721, -356, -2982, 3408, 3717, -2909, -408, 5108, -684, -3464, 3119, 2325, -4678, -1915, 2991, -2682, -5316, 1778, 1111, -5281, -875, 3231, -2147, -2507, 4255, 2598, -2310, 2391, 5170, -1221, -351, 5582, 1522, -2906, 2669, 3504, -4170, -1508, 3883, -2564, -5777, 1477, 1066, -6736, -2601, 3908, -3299, -5687, 3760, 2728, -5081, 12, 6723, -953, -3197, 6228, 4119, -4182, 1745, 6833, -1565, -3189, 5308, 2209, -5203, 638, 3994, -3996, -3651, 3846, -1075, -6412, 840, 2423, -5790, -2946, 3907, -1973, -5278, 3556, 3105, -5031, 97, 7137, -990, -3801, 6265, 4404, -4094, 1501, 7396, -2097, -3906, 6299, 2525, -7007, -332, 5057]
1025E057r582j323R670l980p824P991M757r993Q96R499m193o212Q325J940q862
1040c834L579P869p228m499Q838o8r190M159N876q439k292R786l375r063P406
1055d75O150r980j307J0548l716p903Q621M731j0767J43J1110m720q584Q404L897
1070F152j0149J314R156o882n949R023K477j0743K562P985n813m107Q600q59q647
1085e880N487P009q706k592R397j659q440O230M673r571K1J0233n207q576Q579
1100I98M604r936L87R738n962o464R966K317j0801K237J0165o424o418Q310J892
1115D609r451L495P524q186m557R942J55r109M182O011p325j644Q819k397p972
1130e904O864M962q829o67Q783l525o586P319K386r746J780R086n623o628Q189
$$ y = [5057, -4525, -5848, 3822, -158, -7982, 9, 4766, -5227, -4331, 5168, 975, -5237, 3088, 5028, -3834, -255, 7614, 386, -4113, 4725, 4657, -4533, -374, 5502, -2937, -5229, 4557, 1182, -7881, -475, 5675, -4305, -5612, 4936, 1220, -6683, 1938, 6669, -4098, -3955, 7155, 2435, -6149, 2255, 6152, -3997, -2683, 6473, -409, -6358, 2665, 5142, -5601, -3039, 4946, -867, -4974, 3626, 2767, -5880, -393, 6616, -2090, -4682, 4715, 3056, -5384, 846, 5519, -4052, -4031, 6202, 995, -7581, 998, 5602, -4334, -3947, 5791, -171, -6635, 3331, 5648, -5153, -2916, 7249, 825, -5593, 2717, 4609, -4842, -1347, 6177, -2009, -6566, 3376, 3531, -5578, -1396, 4615, -2710, -4354, 4465, 2068, -5904, 960, 5922, -2907, -3574, 5209, 1684, -4902, 2417, 4803, -4943, -3163, 5923, 300, -6328, 1861]
1145A861K308r499K925P808o559m658R395P09r761M080P758o631l878P883j017
1160B724q035N204N760p793k845Q884k058p158N652L948p265M0P652m060n877
1175e227P056L191q461J037O975m890m775P384J204q379K511P076n592m061P958
1190C007M76p642L607O183o405k687P913q30p651L956M849o695j507O749k058
1205A265o877M885L739o888l24O916k845m987N646K604o254J717O554m159l867
1220b875O358O89o289K518N056n739k997O253n51o593K436M454n549k278O322
1235A215j205n505M123L981n391p27O588j434m920M819K963n289J00N483k613
1250B188l810M105J304n587M52M541l606l216M150O34n388J852M200l633k141
$$ y = [1861, 4169, -5330, -2405, 5403, -1156, -5814, 3581, 4290, -5471, -1391, 6367, -264, -4142, 3741, 2724, -5311, -107, 5653, -2140, -4985, 3899, 1841, -5317, 335, 4283, -2982, -2942, 4710, 650, -5227, 1829, 5020, -3441, -2404, 4571, -319, -5094, 2290, 3494, -4885, -2374, 4702, -890, -4951, 3007, 3483, -4159, -552, 5631, -774, -3461, 4452, 3622, -4029, -73, 4776, -1919, -3426, 3323, 1265, -5612, -727, 3012, -3876, -4200, 2716, -129, -5116, 530, 3134, -3120, -1403, 5151, 992, -2875, 3483, 4172, -2117, 401, 5457, -282, -3279, 2974, 2423, -4170, -1734, 2720, -2829, -5107, 1215, 10, -5495, -1372, 2609, -2782, -3509, 3079, 1645, -3275, 1544, 4507, -782, -682, 4801, 2188, -1622, 2483, 3787, -1800, -1348, 3193, -413, -3629, 521, 1155, -4233, -2381, 1819, -1814, -3955]
1265c955N027k16m257K888L840m086j064N113j050m247L428K589m163j033M141
1280B955j779l828L309J685m235K86L514k191k944L364J527l837O12L163k308
1295g07j908L487N64l154J307K451k851p97L164o3k862J202K439k686q11L007
1311A782o94k284J941J157k648n36K846p58k417J768Q84k561J30K396j095j568
1327a657K095N9j670M77J528j128j287J975J02j621Q97J582j437m29J556k61j254
1344d73R07J050j139l00J116k60j269Q01N87j021l58M08l2q44J21O1n26m12P79
1363h04l24j43L01K78K14L68M40P15n3J65L09O0j91R2J40j29p40k69J18r71l88
1384h12pk88r30K16L22k74j38Q12L21l0M93R40n31M99J084O2p56Q72j65n37R3
$$ y = [-3955, 1072, 856, -3401, -513, 3327, -759, -1823, 3290, 2240, -2007, 1421, 4010, -153, -1186, 2955, 1176, -2652, 657, 2342, -1893, -1607, 1907, -284, -3228, 136, 1663, -2174, -1562, 1601, -707, -2615, 872, 1436, -1718, -411, 2040, -811, -1608, 1556, 1493, -1369, -167, 2272, -414, -1225, 1782, 1088, -1196, 745, 1902, -746, -1282, 1564, 806, -1611, 157, 1041, -1520, -1390, 1006, -89, -1657, 438, 497, -1173, -696, 832, -296, -1583, 392, 494, -1127, -230, 1352, -85, -514, 1042, 781, -473, 434, 1484, 345, 45, 1161, 901, -368, 433, 1020, -1, -359, 49, 17, -827, -706, -645, -1171, -1583, -804, -1128, -1271, -970, -692, -478, -110, 330, 1045, 992, 1157, 1466, 1526, 1335, 1427, 1567, 1438, 698, 429, 547, -424, -812, -819, -1107, -2037, -1821, -1499, -1773, -1911, -1099, -778, -808, -315, 625, 94, 593, 1677, 1739, 983, 1855, 1690, 1153, 1246]
1405A246P06j085j407Q51mj765J79P32n17j165J271N92j620Q16J605q18p84J954
1423G87K89j703J280J395j477j108K291j75k366J282J196k020p21J704n00k151
1439a997J770Q57k156j12K394p89j743K209J034k784N21K843j604k041K778K58
1455A438k997R54K500k074j543K745pk731R13K846k314j401L051m02k936J906
1471e2K291k762q60L172r03l239K343J876l057o00L521j860k526K911J578l384
1487a551L01L477k006k468L737M11l678J078L369k716k096L643J83m107J790L144
1503B511l630j440M115l32l808K091K751l202j094M285j295l449L274J636m147
1518a734j42M430j856l246L174J330l991P27L699k220k928M054J015m384J281
$$ y = [1246, 1952, 867, -540, 311, 307, -1458, -1279, -547, -1064, -2229, -958, -366, -1986, -1170, 435, -383, -1167, 787, 1076, -627, 653, 2048, 571, -537, 1754, 1579, -787, 495, 1691, -329, -1050, 654, 154, -1997, -227, 630, -1526, -1638, 756, -33, -1776, 433, 1467, -1317, -796, 2047, 443, -1598, 1180, 1438, -1559, -605, 1895, -179, -1722, 1023, 1016, -1715, -802, 2044, -270, -1671, 1380, 978, -1958, -52, 2239, -523, -1383, 1789, 886, -2353, -10, 1866, -1191, -1791, 1730, -130, -2656, 255, 1833, -1551, -1250, 2227, 221, -2247, 1490, 1901, -1777, -699, 2670, -46, -2142, 1501, 1684, -2423, -633, 2511, -1119, -2559, 1556, 1224, -2584, -493, 2258, -944, -2038, 2247, 952, -2497, 777, 2413, -1734, -1876, 2554, 698, -2548, 626, 1956, -2035, -1308, 2391, 171, -2757, 1297, 2312, -2072, -791]
1533g91M083l423k306M480l35m152J804L493m023j910M415m56m118L008K410l643
1549a464q74M858j771l561L741K351m480r1M456k211l417L876J444n244J119L942
1565B674l028l077M227P26m546J596L784l310k230N413k19m694K212L887l859
1580d44j307N075j162m619K802K873m434r86M726k012l595L413J677m699P9N123
1596B510k675l392M152J573m512R57M282k892k661M693Q16n131J703M288l645
1611F6k011M421p83m630K753L518m837j370M720r57m296L051K384m208k23M831
1627B429k226l508L826K106m661Q17M012k054k883M249R35m953J180M026k825
1642D70k994M087N23m550J702L463l595k091M627n49m711K672L178m096m60M441
$$ y = [-791, 3292, -131, -2437, 2043, 1708, -2444, -640, 2853, -1170, -3080, 1335, 879, -3239, -231, 2179, -1464, -2338, 2520, 749, -2812, 929, 3280, -1200, -1291, 3165, 954, -2463, 1413, 2857, -2387, -1268, 2674, -354, -3431, 796, 1522, -3024, -1428, 2356, -954, -3184, 2229, 2010, -2684, -472, 3415, -444, -1751, 3324, 2162, -2457, 345, 3218, -1216, -2202, 2524, 512, -3083, 330, 2007, -2692, -2613, 2510, -165, -3557, 595, 2168, -2344, -1387, 2895, 3, -2658, 2035, 2851, -2280, -577, 3711, 66, -1945, 2476, 1693, -2937, -184, 3334, -1503, -2873, 1847, 890, -3406, -355, 2029, -2179, -2402, 2429, 203, -3305, 521, 2627, -2034, -1217, 2795, 741, -2142, 2107, 3042, -1911, -731, 3295, 470, -2524, 1563, 2086, -2464, -762, 2701, -894, -2985, 1642, 1093, -3618, -946, 2232, -1864, -2324, 2117]
1658B117j349l801L453K712m215n56M535j440l628L701J274m370O18M174k652
1673E73l236L849O02m272J036L578l430j893M422j2m347K048L645l246j602M067
1689A782K6l988K674K669l836r19M309j391l703K491K226l898k51L682j486l263
1705b876L411J432l967N86L479k033j997L238O05l747J162L526k835k171L296
1720A109K34l590J783K692l245j174L585n63l368K600K227k955r16M093j190k945
1736a623K702J707l403l36L547k021k635K561Q62l207J68L176k309k212L345M75
1752G97k953R83K843k238q97K789J60k330J427K066k273q31K663p76k637J937
1768G30R01k457q66K751r55k709K219J276k664n1K533q41j959K538J379k909O98
$$ y = [2117, 768, -3033, 420, 3132, -1083, -1639, 2896, 1456, -2172, 1529, 2803, -1567, -949, 3225, 573, -2663, 1186, 1788, -2484, -1448, 2130, -1300, -3193, 1229, 1217, -3130, -1082, 2563, -683, -2285, 1782, 1808, -2180, 494, 3163, -673, -1592, 2717, 1326, -2377, 114, 2340, -1558, -1809, 1873, 387, -2876, 535, 1967, -2000, -1414, 2065, 32, -1965, 1273, 1878, -1869, -707, 2819, -16, -2187, 1109, 1343, -2247, -464, 2228, -1017, -2191, 1394, 831, -2537, 63, 2290, -665, -1581, 2512, 1322, -1623, 1079, 2786, -617, -953, 2594, 573, -2062, 499, 1361, -1846, -1678, 1498, -811, -3023, 322, 797, -2156, -1173, 1670, -568, -1465, 1324, 1484, -846, 581, 2647, 374, -457, 2206, 1430, -1207, 730, 1631, -826, -1692, 1059, 104, -2605, -386, 890, -1774, -1825, 708, -133, -2092, 446, 1825, -1084, -386]
1785c86K189j261j087J791P00k463L52J962j474j163J966n90j861Q74J605k213
1801a059o31K250o52j550J305J060j721k03J817k79j665J492J296j792l34K076
1817A410p62j325J419R22k175K76J358j006p62J073L51j815M41J715j231p11J035
1834B13M56j598M61J072j026l98J378k57q43Q37L15q88r6J335o27p54P44L74q07
1853a09J26O31m69r46Q97J88r59K85P33m69m95O18K94m48l9M29l03m42O85K04
1873D11m34n9M89o30j72L87j47j17J49P6n6j45J27P4R0k8J97J27j73L42k98n9
1895A51J38k75l1j93r5J49k58j10J76k20K77J05j96K88J06k2L24l48K75M53o1
1916F33m70M15K81o08l71P38n02o41Q9O11o60m53Q08j88o05L24Q70n63k7P49l9
$$ y = [-386, 1803, 542, -545, 1246, 1946, -517, -165, 1797, 323, -840, 1126, 536, -1325, -451, 1154, -1059, -1690, 560, -92, -1642, -337, 723, -998, -1201, 616, 337, -1328, 164, 1460, -332, -666, 1410, 648, -677, 742, 1664, -511, -235, 1123, 117, -645, 428, 779, -1036, -595, 1120, -111, -822, 213, 669, -929, -468, 604, -422, -820, 558, 301, -542, 295, 610, -278, -374, 961, 334, -420, 324, 698, -109, 17, 648, 179, -767, 130, 318, -641, -356, 377, -92, -587, 31, 325, -123, -162, 267, -36, -478, 207, 411, -23, -82, 407, -223, -395, -8, -155, -272, -123, -47, -103, -248, -121, -47, 43, 15, 212, 339, 166, 508, 210, 151, 289, 14, -17, -210, -305, -156, -414, -524, -348, -568, -291, -186, -382, -94, 12, -10, 314, -34, 241, 694, 633, 163, 578, 859, 251, -120, 618, 116, -525, -436, 175, -485, -938, -130, -318, -923, -599, 271, -292, -319, 430, 391]
1937C91n77N58L32q06j33Q26l47o43Q18N4p91Q1P58q12m23Q19j8o86K79R11r73
1958c82m94J322j7j094M88Q22j062k33J411l58j234J038N13j052k95J154m1j220
1976g34O33R71j255j94J233l52j247J298M19j339L6J593j185o40J161J77j685
1993a110Q27J398j228p57J250J87j365R05J009j490k56J752n01j632J076J176
2009A241j707l42J760j073j060J390P01j792k10K079q63j511J617P06j830N14
2025c80J669j237r27J948J6j806N29J658j804o28J825k56k004J133J225j980k7
2042a046J698k19j924J422J287k041K21K171q31j843J696Q16k072J83K174j668
2058B4j240J848N52k289M17J532j259j127K108M0k149J235J406j358p52K034k1
$$ y = [391, -186, 372, 704, -102, -235, 591, 244, -399, 419, 473, -318, -237, 521, -291, -714, 105, 87, -599, -320, 591, -382, -876, 446, 429, -665, -177, 645, -417, -650, 761, 403, -831, 207, 720, -332, -627, 527, 486, -734, -101, 870, -385, -579, 654, 302, -945, 353, 772, -567, -531, 1062, -123, -763, 398, 575, -1110, -283, 1115, -113, -870, 380, 567, -798, 107, 1116, -374, -630, 1122, 621, -1011, 65, 1241, -466, -808, 952, -121, -1181, 209, 910, -882, -1092, 987, 124, -1387, 230, 936, -894, -380, 1289, 52, -875, 1073, 1089, -717, -188, 1470, -334, -962, 863, 607, -1397, -264, 961, -1019, -1046, 652, 433, -1491, -69, 1218, -823, -602, 1569, 738, -1105, 591, 1407, -665, -482, 1692, 24, -1216, 632, 1184, -1105, -688, 844, -415, -1542, 566, 606, -1543, -308, 1098, -260, -1012, 1022, 1001]
2075A001k031J244J266k262O1J978o38k119J651J141k589M65K354j568j285J832
2091E01J051k596M38K214j443j484K032M49k055N64J688j503j416K350L67k712
2107a555R49J976j739j256K454l04j959J477J382j949l32K276q76j730J460J491
2123A765k607%K092j043j907K287L35j965L03K106j775j348K446L09k388N95K319
2140A524j859j322K491J05k342J154J769k063o22K747r06j991J494J435k094n60
2156a040K487r98j899J592J147k575M93J974j181j431K025L24k209N90K096j607
2172b12j285K221L72k530J004J942j967m76K065Jk181J089J415j660r42K088m35
2189E09j942J584P21j822j94J953q83j503J726O35j842N37J611j012j145J754
$$ y = [1001, -1030, 214, 1480, -782, -721, 1257, 619, -1500, 151, 1292, -1297, -832, 1522, -46, -1331, 501, 1552, -1044, -606, 1608, 165, -1319, 713, 1162, -893, -329, 1359, -144, -1560, 790, 1157, -1555, -606, 1370, -369, -1625, 829, 525, -1434, 43, 1425, -524, -856, 1420, 544, -1186, 274, 1765, -842, -842, 1250, 207, -1700, 587, 922, -1043, -740, 1366, -409, -1757, 689, 998, -1390, -795, 1524, -335, -1657, 834, 939, -1403, -249, 1520, -543, -1165, 1582, 676, -1315, 179, 1614, -480, -1040, 1447, 449, -1450, 142, 1289, -1286, -793, 1181, 0, -1431, 594, 918, -1291, -701, 1395, -212, -1497, 724, 1096, -1434, -430, 1512, -455, -931, 1134, 1135, -1046, 43, 1458, -202, -1144, 944, 509, -1433, 151, 872, -950, -1144, 809, -74, -1577, 149, 784, -1058, -521, 1090, 78, -1067, 687]
2205F87N69j898L91J757j275j197K112m03j546L57J542j333j035J738J66k401
2221a769J543J465j593o26K049n61j627J436Q69j794J8J674o36j605J459O73j681
2238g06K65J713j201j271J394O49j971O81J310j082p52J630J75j561Q43J036j340
2255a88o56J835m23j568J126P95j230p26J746o18j385J339P87j374k85J354j88
2272C41j105J105P05j449J35J353j080p58J019L17j174J98R45p16o65J034j48
2289E7r05N55J010r59n59J408k20r32O96N95j130M7R70n5j041N80N47j195P1Q26
2309C66k86o11N82L67j017J07Q60k44p81R46Qo04J69O52o48l19Q28N9j036M21
2329a81Q45j017j43R24J8r95Q44L56r13l4Q89m72p04P87L52p95J8O82l75n27K94
$$ y = [687, 1256, -642, -251, 1506, 231, -966, 1146, 743, -803, -446, 1096, -237, -1272, 466, 632, -1769, -226, 1239, -354, -980, 1069, 508, -1119, 317, 1186, -608, -590, 1084, 448, -1157, 302, 975, -706, -441, 1272, 71, -1200, 194, 843, -1128, -447, 863, -219, -971, 659, 834, -727, 116, 1152, -188, -844, 991, 568, -1000, 126, 921, -309, -1035, 711, 93, -1292, 47, 834, -540, -825, 529, 341, -764, 341, 1046, -403, -268, 1085, 5, -753, 266, 583, -591, -393, 552, -164, -829, 205, 57, -848, -293, 717, -242, -801, 607, 387, -545, 151, 746, -384, -337, 633, 578, -463, 117, 664, -531, -460, 366, 80, -531, 51, 418, -599, -492, 368, 124, -657, 289, 297, -307, -138, 514, -134, -453, 375, 434, -602, -181, 664, -353, -496, 428, 446, -549, 295, 651, -262, -296, 593, 121, -583, 204, 556, -239, -221, 461, 86, -441, -147]
2350a47M04l56j09P99m43o16N22M35o52K0O65l27m91N09J86o07M35L12p22nK45
2371E7R6o91L78L80m90L0L44j1o29P74o9n07R5M22K28n44L15L34m10j56J84j59
2393b9j06K10J48m78o2M71l08n1K59Q4k86Q7R2L05m82J80j61M35j04j17j33L32
2415B86m28m4O7j18K67L1k57k63L18M26l96j19L71N4q7N0J28r8q3nj4j10rM7l10
2440b96K02K82k42j24O1P8m27M08J69j8nQ3R4m72Q7L52k00k55N85j36m22M05m2
2463A67n74J70J34L99m53K97K02m51P8M59k88m21O18o3l80j61O65o82j56P29k63
2484B6m05J81P29n98k69O36p4n70l9M86j22m51Q27k02k58K32K58m08j67N83k23
2505A72n72L95O50q49j3M44n07k15P26M9p76L68N67p0q70O99J15q90N60N10k23
$$ y = [-147, 257, -99, -208, 591, 148, -468, 54, 489, -163, -143, 522, 195, -296, 213, 399, -208, 227, 539, -183, -188, 57, 153, -538, -160, 220, -270, -240, 104, 93, -536, 238, 169, -338, -243, 179, 407, -137, 178, 512, 102, -54, 130, -29, -135, 75, 223, -255, -317, 154, -154, -205, 54, 138, -148, -61, 31, 336, -146, 34, -127, 308, 204, 87, -46, 286, -142, -186, -119, -237, 30, 61, -196, -459, -141, 285, -111, -230, 141, 195, 108, 158, 286, 188, 105, 100, 86, -24, -33, 14, -296, -94, 188, -54, -178, -117, -39, -466, -58, 111, 93, 88, 171, 265, -207, -120, 232, 32, -223, 362, 226, -196, 209, 167, -407, -237, -103, 296, -157, 140, 342, -109, -31, 428, 140, -281, 337, 274, -106, -267, 398, -284, -440, 289, 26, -379, -198, 531, -67, -336, 300, 226, -344, -383, 103, -19, -470, 357, 155, -103, 129, 387, -21, -188, 395, 172, -400, -5, 645, -204, -217, 227, -280, -495, 231, 280, -496, -128, 439, 369, -501, 198, 313, -577, -17, 493, 270]
2526B70r18R57j22p14M47O68q63m62J088l3q53Q08J23m19m99J244l19o52N79K70
2546F00p92K9Q82o82o06O64J13o42n2Q43k48o25Q59J53q98K52R60p59o49J196
2566E98q2j123Q74N16r45k91J111k63j384J038M87j158K94N16k32p75O38P56r43
2585c68M0J185o73r83R90M58j044J21O44m66o90J339l01n86J28Q50r21p72J482
2604D33j30j102P25P41j023j88J240n37r10O94N66r34Q7P62p5r12P93J30j079
2623g19O10M98o66j48O63M14j161J06J029p83m08J007K0p98M22M50p60n10J050
2642C16N8j106P58N24r56k26J170l56p14M12P68p81J3R15o37p18P23M68j173J60
2662c82J360j152n39J146K0j103L93Q03n26p92J110J68j260O61P56p52m01R17
$$ y = [270, -648, 309, 187, -527, -80, 588, -275, -737, 351, 318, -535, 273, 396, -23, -522, 722, 403, -249, 330, 600, -192, -163, 719, 37, -569, 95, 208, -434, -486, 357, 109, -516, 343, 496, -402, -150, 810, 51, -598, 598, 516, -607, 267, 783, -162, -453, 658, 395, -989, 49, 536, -622, -328, 188, -44, -819, -181, 575, -368, -328, 857, 184, -799, 191, 649, -395, -274, 370, -96, -786, 553, 252, -334, -206, 644, -277, -1049, 433, 303, -799, -74, 667, -356, -544, 696, 159, -751, -57, 509, -425, -338, 424, 349, -563, 230, 360, -719, -109, 389, -277, -425, 238, 652, -509, -403, 626, -157, -565, 442, 462, -336, 86, 536, -224, -734, 316, 374, -732, 26, 550, -406, -632, 538, 182, -532, -120, 648, -133, -120, 795, 158, -560, 163, 631, -542, -382, 978, -174, -713, 433, 453, -650, -257, 546, 20, -772, 338, 506, -754, -93, 663, -89, -490, 427]
2680D27J78j256N23P60r92O9O31j82p22M36N79r06K2R40n18m03P66L83r06j12
$$ y = [427, 605, -651, -128, 632, -360, -291, 340, 158, -564, -128, 451, -455, -433, 507, -11, -414, 352, 735, -171, -283]
$$ [...]
8191e8
##END NTUPLES=NMR FID
##END=
