##TITLE=1H_Pr 4187-2
 CDCl3
 8 sc, 
 3.9.2024
##JCAMPDX= 6.0         $$ Bruker NMR JCAMP-DX V2.0
##DATA TYPE= NMR FID
##DATA CLASS= NTUPLES
##ORIGIN= UXNMR, Bruker Analytische Messtechnik GmbH
##OWNER= root
$$ XWIN-NMR		Version 3.5
$$ Tue Sep  3 14:53:52 2024 Russian Standard Time (UT+4h)  she@DPX200
##.OBSERVE FREQUENCY= 200.1318
##.OBSERVE NUCLEUS= ^1H
##.DELAY= (6, 6)
##.ACQUISITION MODE= SIMULTANEOUS
##.ACQUISITION SCHEME= undefined
##.AVERAGES= 8
##.DIGITISER RES= 18
##SPECTROMETER/DATA SYSTEM= spect
##.PULSE SEQUENCE= zg30
##.SOLVENT NAME= DMSO
##.SHIFT REFERENCE= (INTERNAL, DMSO, 0, 15.7039)
##AUDIT TRAIL= $$ (NUMBER, WHEN, WHO, WHERE, WHAT)
$$ ##TITLE= Audit trail, XWIN-NMR		Version 3.5
$$ ##JCAMPDX= 5.01
$$ ##ORIGIN= Bruker BioSpin GmbH
$$ ##OWNER= she
$$ F:/spectra/data/she/nmr/H-F/1/audita.txt
$$ ##AUDIT TRAIL=  $$ (NUMBER, WHEN, WHO, WHERE, WHAT)
(   1,<2024-09-03 14:52:43.40 +0400>,<she>,<DPX200>,
      <created by zg, POWCHK disabled, PULCHK disabled
       configuration hash MD5:
       00 E9 B6 7A A2 85 ED C7 34 08 36 98 17 FE 4E 26
       data hash MD5: 16K
       05 12 7C 34 97 DA 6B 7A 10 C6 FF BD 60 85 F0 35>)
$$ ##END=
$$ 
$$ hash MD5
$$ 22 D8 35 27 CD 9E 26 EC 13 53 01 BB 3C DA 49 1B
##$RELAX= 
##$RELAX= 
##$RELAX= 
##$RELAX= 
##$RELAX= 
##$RELAX= 
$$ Bruker specific parameters
$$ --------------------------
##$DU= <F:/spectra>
##$EXPNO= 1
##$NAME= <H-F>
##$PROCNO= 1
##$TYPE= <nmr>
##$USER= <she>
##$AMP= (0..31)
100 100 100 100 100 100 100 100 100 100 100 100 100 100 100 100 100 100 
100 100 100 100 100 100 100 100 100 100 100 100 100 100 
##$AQSEQ= 0
##$AQ_mod= 1
##$AUNM= <au_zg>
##$AUTOPOS= <>
##$BF1= 200.13
##$BF2= 200.13
##$BF3= 200.13
##$BF4= 200.13
##$BF5= 200.13
##$BF6= 200.13
##$BF7= 200.13
##$BF8= 200.13
##$BYTORDA= 1
##$CFDGTYP= 0
##$CFRGTYP= 5
##$CHEMSTR= <none>
##$CNST= (0..31)
1 1 145 1 1 1 1 1 1 1 1 1 1 1 1 1 1 1 1 1 1 1 1 1 1 1 1 1 1 1 1 1 
##$CPDPRG= <>
##$CPDPRG1= <>
##$CPDPRG2= <>
##$CPDPRG3= <>
##$CPDPRG4= <mlev>
##$CPDPRG5= <mlev>
##$CPDPRG6= <mlev>
##$CPDPRG7= <mlev>
##$CPDPRG8= <mlev>
##$CPDPRGB= <>
##$CPDPRGT= <>
##$D= (0..31)
0 1.2 0 0 0 0 0 0 0 0.06 0 0.03 0 0 0 0 0.0002 0 0 0 0 0 0 0 0 0 0 0 0 
0 0 0 
##$DATE= 1725360762
##$DBL= (0..7)
120 120 120 120 120 120 120 120 
##$DBP= (0..7)
150 150 150 150 150 150 150 150 
##$DBP07= 0
##$DBPNAM0= <>
##$DBPNAM1= <>
##$DBPNAM2= <>
##$DBPNAM3= <>
##$DBPNAM4= <>
##$DBPNAM5= <>
##$DBPNAM6= <>
##$DBPNAM7= <>
##$DBPOAL= (0..7)
0.5 0.5 0.5 0.5 0.5 0.5 0.5 0.5 
##$DBPOFFS= (0..7)
0 0 0 0 0 0 0 0 
##$DE= 6
##$DECBNUC= <off>
##$DECIM= 24
##$DECNUC= <off>
##$DECSTAT= 4
##$DIGMOD= 1
##$DIGTYP= 9
##$DL= (0..7)
0 120 120 120 120 120 120 120 
##$DP= (0..7)
150 150 150 150 150 150 150 150 
##$DP07= 0
##$DPNAME0= <>
##$DPNAME1= <>
##$DPNAME2= <>
##$DPNAME3= <>
##$DPNAME4= <>
##$DPNAME5= <>
##$DPNAME6= <>
##$DPNAME7= <>
##$DPOAL= (0..7)
0.5 0.5 0.5 0.5 0.5 0.5 0.5 0.5 
##$DPOFFS= (0..7)
0 0 0 0 0 0 0 0 
##$DQDMODE= 0
##$DR= 18
##$DS= 0
##$DSLIST= <SSSSSSSSSSSSSSS>
$$ [...]
##$SUBNAM2= <"">
##$SUBNAM3= <"">
##$SUBNAM4= <"">
##$SUBNAM5= <"">
##$SUBNAM6= <"">
##$SUBNAM7= <"">
##$SUBNAM8= <"">
##$SUBNAM9= <"">
##$SW= 24.0689170037331
##$SWIBOX= (0..15)
0 0 2 0 0 0 0 0 0 0 0 0 0 0 0 0 
##$SW_h= 4816.95568400771
##$TD= 16384
##$TD0= 1
##$TE= 0
##$TE2= 300
##$TE3= 300
##$TEG= 300
##$TL= (0..7)
0 120 120 120 120 120 120 120 
##$TP= (0..7)
150 150 150 150 150 150 150 150 
##$TP07= 0
##$TPNAME0= <>
##$TPNAME1= <>
##$TPNAME2= <>
##$TPNAME3= <>
##$TPNAME4= <>
##$TPNAME5= <>
##$TPNAME6= <>
##$TPNAME7= <>
##$TPOAL= (0..7)
0.5 0.5 0.5 0.5 0.5 0.5 0.5 0.5 
##$TPOFFS= (0..7)
0 0 0 0 0 0 0 0 
##$TUNHIN= 0
##$TUNHOUT= 0
##$TUNXOUT= 0
##$USERA1= <user>
##$USERA2= <user>
##$USERA3= <user>
##$USERA4= <user>
##$USERA5= <user>
##$V9= 5
##$VALIST= <valist>
##$VCLIST= <CCCCCCCCCCCCCCC>
##$VD= 0
##$VDLIST= <DDDDDDDDDDDDDDD>
##$VPLIST= <PPPPPPPPPPPPPPP>
##$VTLIST= <TTTTTTTTTTTTTTT>
##$WBST= 1024
##$WBSW= 4
##$XGAIN= (0..3)
0 0 0 0 
##$XL= 0
##$YL= 0
##$YMAX_a= 303078
##$YMIN_a= -331648
##$ZGOPTNS= <>
##$ZL1= 120
##$ZL2= 120
##$ZL3= 120
##$ZL4= 120
##$ABSF1= 10
##$ABSF2= 0
##$ABSG= 5
##$ABSL= 3
##$ALPHA= 0
##$AQORDER= 0
##$ASSFAC= 0
##$ASSFACI= 0
##$ASSFACX= 0
##$ASSWID= 0
##$AUNMP= <proc_1d>
##$AZFE= 0.1
##$AZFW= 0.1
##$BCFW= 1
##$BC_mod= 2
##$BYTORDP= 1
##$COROFFS= 0
##$CY= 11.3945322036743
##$DATMOD= 1
##$DC= 2
##$DFILT= <>
##$DTYPP= 0
##$F1P= 15.6554695791079
##$F2P= 12.8336369535428
##$FCOR= 0.5
##$FTSIZE= 0
##$FT_mod= 4
##$GAMMA= 1
##$GB= 0.15
##$INTBC= 1
##$INTSCL= 1
##$ISEN= 128
##$LB= 0.24
##$LEV0= 0
##$LPBIN= 0
##$MAXI= 10000
##$MC2= 0
##$MEAN= 0
##$ME_mod= 0
##$MI= 1.114404
##$NCOEF= 0
##$NC_proc= 0
##$NLEV= 6
##$NOISF1= 3.799351
##$NOISF2= 2.8
##$NSP= 1
##$NTH_PI= 0
##$NZP= 0
##$OFFSET= 15.70392
##$PC= 1
##$PHC0= -25993
##$PHC1= 10.18748
##$PH_mod= 1
##$PKNL= yes
##$PPARMOD= 0
##$PSCAL= 0
##$PSIGN= 0
##$REVERSE= no
##$SF= 200.130013532006
##$SI= 16384
##$SIGF1= 3
##$SIGF2= 2
##$SINO= 400
##$SIOLD= 16384
##$SREGLST= <1H.CDCl3>
##$SSB= 0
##$STSI= 0
##$STSR= 0
##$SW_p= 3612.71676300578
##$SYMM= 0
##$S_DEV= 0
##$TDeff= 0
##$TDoff= 0
##$TI= <>
##$TILT= no
##$TM1= 0
##$TM2= 0
##$TOPLEV= 0
##$USERP1= <user>
##$USERP2= <user>
##$USERP3= <user>
##$USERP4= <user>
##$USERP5= <user>
##$WDW= 1
##$XDIM= 8192
##$YMAX_p= 0
##$YMIN_p= 0
$$ End of Bruker specific parameters
$$ ---------------------------------
##NTUPLES= NMR FID
##VAR_NAME=  TIME,          FID/REAL,        FID/IMAG
##SYMBOL=    X,             R,               I
##VAR_TYPE=  INDEPENDENT,   DEPENDENT,       DEPENDENT
##VAR_FORM=  AFFN,          ASDF,            ASDF
##VAR_DIM=   8192,          8192,            8192
##UNITS=     SECONDS,       ARBITRARY UNITS, ARBITRARY UNITS
##FACTOR=    0.0002076,     1,               1
##FIRST=     0,             0,               0
##LAST=      1.7004516,     0,               0
##MIN=       0,             -331648,         0
##MAX=       1.7004516,     303078,          0
$$ Real data points
##PAGE= N=1
##DATA TABLE= (X++(R..R)), XYDATA
$$ [...]
$$ plain form
2225 2070 2943 -2939 2151 3672 -3305 -116 2777 -4364 -1798 2988 -3059 -1496 4310 -817 -1471
2240 -1471 4712 29 -3041 3084 -760 -4291 1859 164 -4226 2531 2653 -2991 2761 3539 -3359
2255 -3359 271 2434 -4330 -1483 2353 -3094 -1065 3820 -1251 -511 4996 -647 -2006 3130 -1209
2270 -1209 -4173 2150 -781 -3530 2777 1252 -2211 3046 2840 -2760 1137 1844 -4301 -512 1727
2285 1727 -3656 -564 3619 -1645 263 4353 -598 -1470 3375 -1647 -3495 1760 -1153 -3432 2368
2300 2368 1080 -1908 3125 2391 -2069 1452 1756 -3880 -703 771 -3510 -314 2312 -2042 307
2315 307 4064 -639 -457 2830 -1540 -2127 1775 -1453 -2950 1776 -228 -2237 2955 1719 -1638 2202
2331 2202 1192 -2634 528 617 -3465 -446 1686 -2159 210 2758 -850 -208 3179 -1156 -1270 1955
$$ packed form
2225B070Q73n882N090J521o977L189K893p141K566M786o047J563N806n127o54
2240a471O183m683l070O125l844l531O150j695m390O757J22n644N752P78o898
2255c359L630K163o764K847L836n447K029M885n071P40N507n643j359N136m339
2270a209k964O323k931k749O307j525l463N257k06n600L897P07o145L789K239
2285A727n383L092M183n264J908M090m951q72M845n022j848N255k913k279N800
2300B368j288k988N033p34m460L521L04n636L177J474m281L196K626m354K349
2315C07L757m703J82L287m370n87L902l228j497M726k004k009N192j236l357L840
2331B202j010l826L162Q9m082L019K132l845K369K548l608O42L387m335j14L225
$$ plain form
2347 1955 -1291 -1794 1910 -617 -1771 2118 675 -1786 2205 1128 -2037 1304 964 -2213 455
2362 455 995 -2082 323 1826 -1751 -164 2130 -1119 -752 2098 -934 -1152 1563 -516 -1329 1856
2378 1856 -352 -1959 1436 127 -1491 1354 550 -1610 991 1116 -1399 308 1023 -1935 -305 1206
2394 1206 -1759 -450 1792 -821 -308 2208 -380 -912 1718 -613 -1653 775 -514 -1562 902
2409 902 910 -1132 1472 1287 -743 727 823 -1636 -370 332 -1522 -890 796 -777 -6 1679 29
2426 29 -6 1434 -355 -1066 128 -752 -1655 269 -43 -667 1402 821 -258 1173 723 -1301 -347 -141
2444 -141 -1292 -547 261 -678 338 1009 173 226 1384 73 -328 441 -819 -1074 22 -393 -830 703
2462 703 700 62 782 1077 -465 200 -99 -1026 -754 80 -598 -243 682 186 155 561 428 153 199 -406 -408 -582
$$ packed form
2347A955l246n03L704k527j154L889j443k461L991j077l165L341l40l177K668
2362D55N40l077K405J503l577J587K294l249L67K850l032k18K715k079q13L185
2378A856k208j607L395j309j618K845q04k160K601J25k515J707P15k958J630J511
2394A206k965J309K242k613N13K516k588n32K630k331j040K428j289j048K464
2409I02Qk042K604j85k030J470R6k459J266P02j854O32J686j573P71J685j650
2426B9l5J440j789p11J194q80r03J924l12o24K069n81j079J431m50k024R54K06
2444a41j151P45Q08r39J016O71q36N3J158j311m01P69j260k55J096m15m37J533
2462G03lo38P20K95j542O65k99r27K72Q34o78L55R25m96l1M06j33k75M6o05kj74
$$ plain form
2484 -582 -441 -358 273 485 503 330 366 78 -178 -507 -409 -257 -290 -145 205 292 388 414 366 284 68 -364 -532
2507 -532 -333 -530 -72 -80 -116 515 393 265 303 683 -94 8 -40 -628 -518 46 -209 -185 675 376 571 942
2529 942 388 -294 423 -246 -955 -22 -110 -738 271 278 -373 426 403 -343 91 615 -487 -355 539 -863
2549 -863 -740 637 -231 -460 841 93 -645 774 331 -869 477 177 -1145 50 79 -878 261 823
2567 823 -543 336 1018 -497 -273 894 -357 -43 768 -348 -559 823 144 -1011 1126 -402 -782
2584 -782 1219 287 -912 857 452 -1253 624 455 -1100 410 777 -1155 105 847 -571 -266 1166
2601 1166 -688 -362 1399 -595 -1021 1198 -596 -1169 1324 59 -1347 1122 288 -1536 1033 592
2617 592 -1138 489 1074 -1456 -97 1005 -1073 -89 1230 -991 -362 1670 -719 -705 1212 -569
$$ packed form
2484e82J41Q3O31K12J8j73L6k88k56l29R8J52l3J45L50Q7R6K6m8q2k16m32j68
2507e32J99j97M58ql6O31j22j28L8L80p77J02m8n88J10N64k55K4Q60k99J95L71
2529I42n54o82P17o69p09R33q8o28J009Po51P99k3p46M34N24j102J32Q94j402
2549h63J23J377q68k29J301p48p38J419m43j200J346l00j322J195K9r57J139N62
2567H23j366Q79O82j515K24J167j251L14Q11j116k11J382o79j155K137j528l80
2584g82K001r32j199J769m05j705J877j69j555J510L67j932J260P42j418L05J432
2601A166j854L26J761j994m26K219j794n73K493j265j406K469q34j824K569m41
2617E92j730J627N85k530J359J102k078R84J319k221O29K032k389J4J917j781
$$ plain form
2633 -569 -921 1355 -195 -1264 1042 215 -1237 1370 575 -1313 813 866 -1543 668 1112 -1477 -212
2650 -212 1371 -1750 39 1395 -1243 -716 1621 -969 -844 1677 -525 -1313 1359 -104 -1799 1438
2666 1438 183 -1529 1011 987 -1931 905 1021 -1868 240 1454 -1282 -182 1637 -1608 -549 1514
2682 1514 -1130 -607 2010 -946 -1092 1871 -685 -1609 1568 194 -1700 1214 388 -2052 1498 593
2698 593 -1919 943 1341 -1694 413 1359 -1981 -274 1585 -1477 -639 1812 -1390 -989 2085 -801
2714 -801 -1277 1873 -226 -1542 1267 58 -1972 1238 1036 -2076 1236 1454 -1938 759 1498 -2123
2730 -2123 -127 1584 -1783 -646 1713 -1395 -595 2282 -986 -760 2242 -172 -1344 1993 -402
2745 -402 -2116 1382 -81 -1626 1032 1130 -1605 889 1696 -1787 796 1245 -2304 -353 1530 -1763
$$ packed form
2633e69l52K276j550j069K306q27j452K607p95j888K126N3k409K211M44k589J265
2650b12J583l121J789J356k638N27K337k590J25K521k202p88K672j463j695L237
2666A438j255j712K540k4k918K836J16k889K108J214k736J100J819l245J059K063
2682A514k644N23K617k956j46K963k556r24L177j374j894K914q26k440L550r05
2698E93k512K862L98l035K107R46l340J707J859l062Q38K451l202M01L074k886
2714h01m76L150k099j316K809j209k030L210k02l112L312K18l392K697P39l621
2730b123J996J711l367J137K359l108Q00K877l268K26L002k414j172L337k395
2745d02j714L498j463j545K658R8k735K494Q07l483K583M49l549J951J883l293
$$ plain form
2761 -1763 -487 1774 -1293 -527 2179 -479 -1153 2120 -674 -2027 1458 -519 -2023 1388 597 -2025
2777 -2025 1640 1383 -1847 836 1397 -2029 267 1616 -2438 -423 1979 -1657 -353 2024 -600
2792 -600 -999 2060 -757 -1392 1717 -514 -2054 1856 151 -1723 1575 669 -1658 1242 944 -2223
2808 -2223 350 1152 -1916 398 1548 -1767 220 2202 -1290 -379 1986 -1300 -1070 1477 -1050 -1528
2824 -1528 2064 -276 -1624 2003 526 -1901 1684 945 -2422 710 1119 -2134 228 1435 -1889
2839 -1889 550 1935 -1147 51 2113 -1368 -1367 1808 -1041 -1497 1511 -319 -1158 1735 387 -1454
2855 -1454 1894 818 -1585 1346 781 -1922 616 1213 -2131 251 1719 -1577 273 1752 -1067
2870 -1067 -428 1728 -963 -871 1657 -786 -1242 1708 -293 -1493 1352 136 -1609 1468 836 -1788
$$ packed form
2761a763J276K261l067P66K706k658o74L273k794j353L485j977j504L411p91k622
2777b025L665k57l230K683N61l426K296J349m054K015K402l636J304K377k624
2792f00l99L059k817o35L109k231j540L910j705j874L298r06k327K900k98l167
2808b223K573Q02l068K314J150l315J987J982l492R11K365l286K30K547k527m78
2824a528L592k340j348L627j477k427L585p39l367L132M09l253K362J207l324
2839a889K439J385l082J198K062l481JL175k849m56L008j830q39K893j348j841
2855a454L348j076k403K931n65k703K538N97l344K382J468l296J850J479k819
2870a067O39K156k691R2K528k443m56K950k001j200K845j216j745L077o32k624
$$ plain form
2886 -1788 1293 1131 -1988 789 1312 -1984 -218 1433 -1564 0 1942 -1186 -217 1883 -756 -795
2902 -795 1669 -739 -1299 1545 -314 -1904 1544 71 -1016 1313 894 -1263 789 1060 -1911 182
2918 182 792 -1412 -228 1226 -1351 -276 1897 -945 -555 1786 -667 -1175 1621 -689 -1459 1314
2934 1314 -270 -1595 1304 459 -1320 1024 910 -1332 720 851 -1820 187 925 -1406 -35 1505
2950 1505 -861 -207 1813 -917 -757 1031 -617 -1314 1109 -414 -1281 1499 225 -609 1437 639
2966 639 -1148 707 740 -1802 247 1275 -1490 420 1331 -959 -35 1243 -1010 -495 1313 -750
2982 -750 -747 1323 -473 -1199 935 202 -918 1195 230 -1062 1048 426 -1340 636 407 -1220 294
2999 294 722 -949 -191 1299 -891 -247 943 -896 -654 870 -690 -686 930 -60 -460 1055 195 -946
$$ packed form
2886a788L081j62l119K777N23l296J766J651k997J564J942l128R69K100k639l9
2902g95K464k408n60K844j859j590L448j473j087K329m19k157K052K71k971K093
2918A82O10k204J184J454k577J075K173k842L90K341k453n08K796k310p70K773
2934A314j584j325K899q45j779K344j14k242K052J31k671K007P38k331J371J540
2950A505k366O54K020k730J60J788j648o97K423j523q67K780j274q34K046p98
2966F39j787J855L3k542K049J028k765J910R11k290R24J278k253N15J808k063
2982g50LK070j796p26K134p33j120K113r65j292K110o22j766J976k29j627J514
2999B94M28j671P58J490k190O44J190j839K42J524j560MJ616r90m00J515q60j141
$$ plain form
3017 -946 841 -84 -1361 671 167 -1352 445 743 -1019 415 857 -634 -78 902 -755 -252 1124
3034 1124 -707 -798 1003 -380 -518 848 -138 -558 1029 294 -1020 512 81 -1045 588 235 -776
3051 -776 585 520 -865 288 909 -446 62 907 -856 -93 623 -215 -560 761 -95 -725 626 138
3069 138 -598 532 126 -936 450 110 -678 310 667 -797 14 710 -451 117 563 -752 -249 668
3087 668 -665 -296 574 -101 -348 794 -153 -230 592 276 -609 522 306 -740 37 134 -498 262 230 -244
3107 -244 163 325 -600 -224 387 -375 19 351 -363 -382 297 -462 -426 414 -141 -140 677 -14 -595 357 140
3128 140 -346 337 131 -404 95 -186 -497 72 136 -218 211 473 -126 -527 -143 -72 -50 166 31 -64 269
3149 269 232 -62 270 -52 87 189 36 -110 -159 -35 -20 -39 300 -41 294 229 82 -174 226 -197 -51 77
$$ packed form
3017i46J787r25j277K032n04j519J797K98j762J434M42j491N56R80j657N03J376
3034A124j831r1J801j383j38J366r86m20J587p35j314J532m31j126J633l53j011
3051g76J361o5j385J153O21j355N08Q45j763P63P16q38l45J321q56o30J351m88
3069A38p36J130m06j062J386l40p88R88L57j464Q11O96j161N68M46j315N03R17
3087F68j333L69Q70o75k47J142r47p7Q22l16q85J131k16j046P77R7o32P60l2m74
3107b44M07J62r25L76O11p62L94L32p14j9O79p59L6Q40n55JQ17o91n81R52k17
3128A40m86O83k06n35M99k81l11N69O4l54M29K62n99m01L84P1K2K16j35r5L33
3149B69l7k94L32l22J39J02j53j46m9J24J5j9L39l41L35o5j47k56M00m23J46J28
$$ plain form
3171 77 -156 -112 -77 -145 -28 9 80 36 297 266 -372 133 -58 180 -289 64 -150 118 -37 -318 31 -112 20
3194 20 -164 211 68 -73 40 132 -168 -318 156 -22 -153 -161 207 -174 343 11 -280 80 -98 117 -207
3215 -207 137 176 183 157 -89 -84 -191 139 -247 119 128 -424 -208 20 -369 -205 -55 -300 -528 -258 -187 -66 411
3238 411 -272 54 369 -323 -84 526 -75 -451 216 -49 -348 321 -38 -237 468 58 -248 170 488 -832
3258 -832 -43 262 -294 -103 318 14 -113 203 -186 109 423 -341 -225 294 -305 -834 33 -157 -410 483
3278 483 472 -408 229 30 -231 386 197 -569 -189 568 -55 -340 493 -233 -96 584 -433 -132 441 -203
3298 -203 -273 590 158 -532 473 110 -382 516 537 -393 156 392 -701 -220 585 -546 492 458 -424 -315
3318 -315 668 -225 -315 663 -342 -431 591 -137 -378 479 -75 -277 467 232 -715 -7 48 -646 15 539
$$ packed form
3171G7k33M4L5o8J17L7P1m4K61l1o38N05j91K38m69L53k14K68j55k81L49j43J32
3194B0j84L75j43j41J13R2l00j50M74j78j31qL68l81N17l32k91L60j78K15l24
3215b07L44L9Pk6k46Nj07L30l86L66Rn52K16K28l89J64J50k45k28K70P1J21M77
3238D11o83L26L15o92K39O10o01l76O67k65k99O69l59j99P05m10l06M18L18j320
3258h32P89L05n56J91M21l04j27L16l89K95L14p64J16N19n99n29Q67j90k53Q93
3278D83j1q80O37j99k61O17j89p66L80P57o23k85Q33p26J37O80j017L01N73o44
3298b03p0Q63m32o90J005l63m92Q98K1r30N49K36j093M81Q05j131J038l4q82J09
3318c15R83q93r0R78j005q9J022p28k41Q57n54k02P44k35r47P08N5o94O61N24
$$ plain form
3338 539 -452 282 774 -726 -72 844 -728 -205 807 -303 -642 577 -441 -374 742 89 -289 358
3356 358 131 -863 544 116 -528 439 257 -682 350 440 -391 -51 451 -485 -230 533 -439 -625 685
3375 685 -812 -424 784 -177 -511 819 169 -674 629 173 -793 52 402 -800 182 362 -745 -124
3393 -124 609 -612 161 825 -616 -301 212 -564 -497 618 -461 -557 562 -56 -556 987 142 -440 415
3412 415 320 -875 128 548 -773 213 308 -701 343 761 -543 -130 1214 -463 -418 968 -724 -358
3430 -358 753 -298 -746 898 -242 -513 1011 144 -632 441 471 -638 417 335 -986 201 690
3447 690 -861 190 584 -112 41 859 -507 -572 515 -606 -728 531 -274 -810 801 369 -583 772
3465 772 215 -882 515 448 -916 291 345 -797 141 519 -587 172 919 -618 -201 593 -706 -189
$$ packed form
3338E39r91P34M92j500O54R16j572N23J012j110l39J219j018O7J116o53l78O47
3356C58k27r94J407m28o44R67j82r39J032R0q31L40N02r36K55P63r72j86J310
3375F85j497L88J208r61l34J330o50q43J303m56r66Q45L50j202R82J80j107O21
3393a24P33j221P73O64j441L15N13p76O7J115j079r6J119o18n00J543q45n82Q55
3412D15r5j195J003M20j321R86R5j009J044M18j304M13J344j677M5J386j692L66
3430c58J111j051m48J644j140k71J524q67p76J073L0j109J055q2j321J187M89
3447F90j551J051L94o96J53Q18j366o5J087j121j22J259q05n36J611m32r52J355
3465G72n57j097J397o7j364J207N4j142R38L78j106P59P47j537M17P94j299N17
$$ plain form
3483 -189 913 -483 -207 784 -171 -832 642 261 -648 667 302 -626 537 404 -705 149 463 -861
3501 -861 169 673 -899 -86 668 -629 -178 730 -128 -704 895 -333 -464 546 -164 -704 641 -30
3519 -30 -741 631 598 -584 136 191 -750 391 980 -611 342 886 -881 -73 760 -400 -427 844 -70
3538 -70 -356 934 -304 -835 650 167 -591 714 118 -751 806 309 -869 311 487 -755 285
3555 285 512 -752 -66 616 -585 -172 862 -687 -219 767 -162 -423 810 -104 -503 644 -166 -752
3573 -752 580 64 -1084 583 168 -696 185 712 -732 343 622 -521 -218 749 -744 -165 644 -401
3591 -401 -409 617 -199 -634 605 -276 -429 654 -93 -632 376 -39 -844 191 485 -848 114 561 -552
3610 -552 157 731 -670 -60 627 -585 -429 629 -268 -471 572 -374 -247 720 18 -465 657 482
$$ packed form
3483a89J102j396K76R91r55o61J474l81r09J315l65r28J163j33j109Q54L14j324
3501h61J030N04j572Q13P54j297M51R08q58n76J599j228j31J010p10n40J345o71
3519c0p11J372l3j182P20N5r41J141N89j591R53N44j767Q08Q33j160k7J271r14
3538g0k86J290j238n31J485m83p58J305n96q69J557m97j178J180J76j242J040
3555B85K27j264O86O82j201M13J034j549M68R86r29k61J233r14l99J147q10n86
3573g52J332n16j148J667m15q64Q81N27j444J075K79j143L03R67j493N79Q09j045
3591d01qJ026q16m35J239q81j53J083p47n39J008m15q05J035K94j333R62M47j113
3610e52P09N74j401O10O87j212J56J058q97k03J043r46J27R67p02m83J122j75
$$ plain form
3628 482 -485 471 253 -536 569 821 -915 -102 367 -550 -98 550 -745 -243 590 -411 -205 740 -281
3647 -281 -370 885 112 -251 644 -22 -132 338 17 -702 529 391 -493 168 483 -596 -158 546 -441
3666 -441 196 412 -537 -190 543 -737 -526 404 -79 -177 919 238 -367 707 151 -357 465 204 -419
3685 -419 444 192 -393 180 626 -623 86 487 -509 -72 453 -239 3 475 -638 -9 666 -320 -99
3704 -99 773 101 -619 499 70 -131 238 97 -732 40 437 -599 160 52 -545 -54 280 -338 -36 599
3724 599 -45 -219 375 -330 -131 240 -76 -591 427 -79 -393 638 230 -502 120 163 -441 111 355 -363
3744 -363 78 347 -513 -148 287 -346 -171 560 -207 -208 629 -6 -252 377 -192 -103 212 173 -424 438 176
3765 176 -415 183 177 -266 88 166 -678 -237 -65 -332 41 327 -343 -233 -33 93 -347 261 -102 -28 426
$$ packed form
3628D82r67R56k18p89J105K52j736Q13M69r17M52O48j295N02Q33j001K06R45j021
3647b81q9J255p73l63Q95o66j10M70l21p19J231j38q84O61L15j079M38P04r87
3666d41O37K16r49L47P33j280K11R30m83r8J096o81o05J074n56n08Q22k61o23
3685d19Q63k52n85N73M46j249P09M01r96M37N25o92K42M72j113O29O75r86K21
3704i9Q72o72p20J118m29k01L69j41q29P72L97j036P59j08n97M91L34o18L02O35
3724E99o44j74N94p05J99L71l16n15J018n06l14J031m08p32O22M3o04N52K44p18
3744c63M41K69q60L65M35o33J75P31p67jQ37o35k46O29n69Q9L15l9n97Q62k62
3765A76n91N98om43L54P8q44M41J72k67L73K86o70J10K00J26m40O08l63P4M54
$$ plain form
3786 426 -30 -139 315 217 -340 248 173 -129 -66 350 -230 -112 152 -136 -179 97 -207 115 66 -154 202 120
3808 120 -164 102 152 0 154 365 8 17 -44 -52 -7 137 68 -123 15 324 23 -205 101 -103 -67 139 -259
3831 -259 -69 -45 -113 -77 182 -18 -215 130 74 58 25 388 16 -230 -189 -153 303 -46 353 6 49 -377 73
3854 73 79 62 174 -66 107 -22 82 188 97 212 -65 -160 68 -50 159 -190 101 -282 -47 210 13 42
3876 42 -20 -170 5 -149 346 -54 -21 -20 -105 189 224 203 62 -25 143 -228 -205 39 -401 123 -123 -55 235 -158
3900 -158 -179 -375 -108 -29 -103 382 -235 -188 84 33 292 -169 -111 179 -20 61 96 204 -18 -314 -119 57 -157
3923 -157 120 289 -263 -68 -11 -413 36 -146 -80 107 -168 -72 -107 49 -4 -100 -114 243 -661 285 -48 -244
3945 -244 -302 -216 166 111 222 177 -69 229 128 185 -107 -61 -155 -97 18 196 82 92 -246 81 -213 -74 132
$$ packed form
3786D26m56j09M54r8n57N88p5l02O3M16n80J18K64k88m3K76l04L22m9k20L56q2
3808A20k84K66N0j52J54K11l57Ro1qM5J44o9j91J38L09l01k28L06k04L6K06l98
3831b59J90K4o8L6K59k00j97L45n6j6l3L63l72k46M1L6M56l49L99l47M3m26M50
3854G3Oj7J12k40J73j29J04J06r1J15k77r5K28j18K09l49K91l83K35K57j97K9
3876D2o2j50J75j54M95m00L3Jq5K94L5k1j41q7J68l71K3K44m40N24k46O8K90l93
3900a58k1j96K67P9p4M85o17M7K72n1K59m61N8K90j99Q1L5J08k22k96J95J76k14
3923a57K77J69n52J95N7m02M49j82O6J87k75R6l5J56n3r6j4L57r04R46l33j96
3945b44n8Q6L82n5J11m5k46K98j01N7k92M6r4N8J15J78j14J0l38L27k94J39K06
$$ plain form
3968 132 48 -693 115 94 -27 48 118 8 42 420 5 192 -12 -34 -83 221 -51 -255 31 1 -294 360 66
3991 66 -140 353 -162 -73 -110 -293 -191 5 332 -353 70 221 -395 226 298 -21 324 152 -241 -127 68
4012 68 -171 -263 62 69 -184 416 -20 -106 446 -31 -125 94 317 -320 222 -29 -246 177 144 -65 -207 361
4034 361 -164 210 174 -20 5 327 -116 -127 -20 -50 -223 297 -52 -167 92 -168 -435 306 24 -266 81
4055 81 219 -76 -255 17 -355 -173 567 -246 -48 162 179 -103 326 -89 -427 271 -26 46 129 260 -63
4076 -63 -19 -136 -13 371 396 -138 -183 448 -525 -125 243 -158 15 303 -154 114 363 -51 -176 531 -206
4097 -206 -463 350 -7 -182 197 29 -47 225 271 -247 104 318 -138 181 345 -181 -505 169 -252 147 409
4118 409 -297 -65 365 140 -57 417 46 -446 328 72 -501 395 12 -440 163 50 -26 199 292 -354 -58
$$ packed form
3968A32q4p41Q08k1j21P5P0j10L4L78m15J87k04k2m9L04k72k04K86l0k95O54k94
3991F6k06M93n15Q9l7j83J02J96L27o85M23J51o16O21P2l19L45j72l93J14J95
4012F8k39r2L25Pk53O00m36q6N52m77r4K19K23o37N42k51k17M23l3k09j42N68
4034C61n25L74l6j94K5L22m43j1J07l0j73N20l49j15K59k60k67P41k82k90L47
4055H1J38k95j79K72l72J82P40q13J98K10J7k82M29m15l38O98k97P2Q3J31l23
4076f3M4j17J23L84K5n34m5O31r73M00L68m01J73K88m57K68K49m14j25P07p37
4097b06k57Q13l57j75L79j68p6K72M6n18L51K14m56L19J64n26l24O74m21L99K62
4118D09p06K32M30k25j97M74l71m92P74k56n73Q96l83m52O03j13p6K25R3o46K96
$$ plain form
4139 -58 183 -180 -215 317 -592 -349 119 -273 -557 161 59 -297 204 38 -263 125 85 -553 221 -110 -332
4160 -332 333 289 -359 28 370 -419 256 532 -223 -79 564 -293 -303 210 11 -346 107 -100 -187 340 8
4181 8 -343 442 -9 -409 -1 234 -160 124 393 -708 138 415 -380 -248 428 0 -62 305 -460 -224 217
4202 217 -251 -382 111 -152 -201 356 15 -452 297 -176 -277 135 -74 -601 24 51 -256 203 234 58 103
4223 103 542 -391 -66 301 159 -378 155 -156 -453 290 257 -198 375 -114 -474 366 389 -288 159 173 -602
4244 -602 -9 561 -131 -126 259 -393 -51 181 -422 -178 459 -514 -355 365 -127 -192 469 -270 -127 60 162
4265 162 -414 130 -34 -336 406 141 -438 238 446 -89 190 104 -93 -14 336 -87 -305 462 13 63 362
4286 362 -104 45 114 -39 -220 139 91 -119 209 67 -234 -54 -84 -445 274 161 -222 80 306 -447 -316
$$ packed form
4139e8K41l63l5N32r09K43M68l92k84P18j02l56N01j66l01L88m0o38P74l31k22
4160c32O65m4o48L87L42p89O75K76p55J44O43q57j0N13j99l57M53k07q7N27l32
4181Hl51P85m51m00M08K35l94K84K69j101Q46K77p95J32O76m28o2L67p65K36M41
4202B17m68j31M93k63m9N57l41m67P49m73j01M12k09n27O25K7l07M59L1j76M5
4223A03M39r33L25L67j42n37N33l11k97P43l3m55N73m89l60Q40K3o77M47J4p75
4244f02N93N70o92NL85o52L42K32o03K44O37r73J59P20m92o5O61p39J43J87J02
4265A62n76N44j64l02P42k65n79O76K08n35K79q6j97P9L50m23k18P67m49N0K99
4286C62m66J49O9j53j81L59m8k10L28j42l01J80l0l61P19j13l83L02K26p53J31
$$ plain form
4307 -316 263 -173 -490 300 47 -329 350 53 -248 159 -17 -219 141 311 -420 -337 115 11 -74 226 -156
4328 -156 -64 432 -125 227 477 0 -358 -66 -69 -301 479 75 -213 137 -114 -40 141 -179 129 372 291 68
4350 68 158 6 -347 -106 389 -40 -133 446 -247 108 -48 -158 10 252 33 -382 42 116 -173 270 63
4371 63 -180 -6 8 -91 195 189 -504 291 402 -305 58 639 -279 -274 182 74 -145 228 -95 -91 249 58 13
4394 13 175 28 40 197 -275 -163 143 178 -221 -100 -60 -175 106 236 -15 39 66 -551 -67 17 -125 -178 65
4417 65 -1 -172 -80 -145 -139 237 178 -44 -91 -19 -209 97 -49 -281 149 -90 -294 195 579 -204 -11 -128 -171
4440 -171 -42 7 -229 -132 -155 14 246 199 54 10 142 -28 -288 -143 79 -218 -88 130 -113 -280 460 -249
4462 -249 155 42 10 95 138 81 78 124 -211 146 9 39 -119 -91 -230 -229 379 5 -155 -7 33 36 -284 76 -260
$$ packed form
4307c16N79m36l17P90k53l76O79k97l01M07j76k02L60J70p31Q3M52j04q5L00l82
4328a56R2M96n57L52K50m77l58K92lk32P80m04k88L50k51P4J81l20L08K43q1k23
4350F8R0j52l53K41M95m29r3N79o93L55j56j10J68K42k19m15M24P4k89M43k07
4371F3k43J74J4r9K86oo93P95J11p07L63N81r18NM56j08k19L73l23ML40j91m5
4394A3J62j47J2J57m72J12L06L5l99J21M0j15K81J30k51N4K7o17M84Q4j42n3K43
4417F5o6j71R2o5OL76n9k22m7P2j90L06j46k32M30k39k04M89L84p83J93j17m3
4440a71J29M9k36R7k3J69K32m7j45m4J32j70k60J45K22k97J30K18k43j67P40p09
4462b49M04j13l2Q5M3n7lM6l35L57j37L0j58K8j39JO08l74j60J48M0Ll20L60l36
$$ plain form
4487 -260 -131 20 233 -187 120 -282 123 111 -74 -237 290 -134 72 -168 -306 -268 205 218 80 207 339
4508 339 40 -356 -69 -466 232 -25 -52 3 208 208 149 90 -115 206 298 16 -182 283 89 -110 -127 -55 -233
4531 -233 -77 -284 -237 94 -6 -248 -241 226 -196 168 -36 287 -203 -43 -43 -126 -94 30 -81 34 157 -36
4553 -36 -56 -50 -211 -73 248 -37 -207 -46 191 -182 -6 -292 -29 -320 179 -121 164 -7 -134 72 -65
4574 -65 -29 -51 31 -145 -72 -80 170 -117 261 -130 -30 -11 52 140 -251 -13 194 -180 -156 -143 -30 13 66 -41 16
4599 16 -201 -173 95 88 -269 33 3 86 -220 27 -14 134 9 -40 75 -207 84 213 -138 -11 140 -147 -189
4622 -189 70 102 188 -74 116 202 -144 276 -56 76 172 132 68 -239 -15 -292 -103 -58 12 83 72 -58 282
4645 282 137 -211 -236 2 259 -137 230 -148 -223 277 127 -151 17 68 -34 12 299 6 -180 34 -92
$$ packed form
4487b60J29J51K13m20L07m02M05j2j85j63N27m24K06k40j38L8M73J3j38J27J32
4508C39k99l96K87l97O98k57k7N5K05%n9n9k05L21R2k82j98M65j94j99j7P2j78
4531b33J56k07M7L31j00k42PM67m22L64k04L23m90J60%q3L2J24j11J15J23j93
4553c6k0Oj61J38L21k85j70J61K37l73J76k86K63k91M99l00K85j71j27K06j37
4574f5L6k2Q2j76P3qK50k87L78l91J00J9O3Q8l91K38K07l74K4J3J13M3N3j07N7
4599A6k17K8K68pl57L02l0Q3l06K47m1J48j25m9J15k82K91J29l51J27J51k87m2
4622a89K59L2Q6k62J90Q6l46M20l32J32R6m0o4l07K24k77J89M5P0P1j1j30L40
4645B82j45l48k5K38K57l96L67l78p5N00j50k78J68N1j02M6K87k93j86K14j26
$$ plain form
4666 -92 -155 -244 243 -7 -69 172 -110 140 102 30 -15 -144 -4 113 87 -132 155 -139 -68 12 -128 -222 134 73
4690 73 -161 10 -61 -87 -19 201 36 -45 10 -39 -141 -217 77 -38 -192 27 205 113 92 -52 188 -137 -85 273
4714 273 -231 -101 -130 254 -67 -180 -372 -156 -168 154 -213 -222 20 124 169 190 -112 29 70 160 105 -137 190
4737 190 -110 271 60 -197 -67 -26 94 13 48 190 -18 49 -14 23 70 -10 56 -84 26 -26 -226 -110 -56 -110
4761 -110 0 -147 196 82 -168 305 -231 -113 -74 40 223 15 -41 -81 77 83 -193 -402 194 75 12 239
4783 239 144 -159 -6 -184 392 218 119 43 443 46 -193 -71 -87 -138 -188 124 -432 40 176 -137 -189 -84
4805 -84 273 160 -67 -244 92 24 -117 9 -79 48 3 250 291 -360 -109 -191 -41 -298 245 -158 107 199
4827 199 -157 71 -203 91 53 176 118 -225 -35 -179 -137 23 53 -102 -83 271 -20 -14 278 3 -22 79 7
$$ packed form
4666i2o3q9M87k50o2K41k82K50l8p2m5j29J40J17k6k19K87k94P1Q0j40r4L56o1
4690G3k34J71p1k6O8K20j65q1N5m9j02p6K94j15j54K19J78r2k1j44K40l25N2L58
4714B73n04J30k9L84l21j13j92K16j2L22l67rK42J04M5K1l02J41M1R0n5k42L27
4737A90l00L81k11k57J30M1J20q1L5J42k08O7o3L7M7q0O6j40J10n2k00J16N4n4
4761a10J10j47L43j14k50M73n36J18L9J14J83k08n6m0J58Ok76k09N96j19o3K27
4783B39r5l03J53j78N76j74r9p6M00l97k39J22j6n1n0L12n56M72J36l13n2J05
4805h4L57j13k27j77L36o8j41J26q8J27m5K47M1o51K51q2J50k57N43m03K65R2
4827A99l56K28k74K94l8J23n8l43J90j44M2J60L0j55J9L54k91OK92k75k5J01p2
$$ plain form
4850 7 417 -30 152 -17 -150 -50 -45 194 12 -476 20 115 -193 -33 20 -47 170 128 -114 221 -141 -171 232
4873 232 252 -163 184 -119 99 -70 29 -131 94 -89 -123 -115 38 -46 -236 184 175 -84 -340 -11 -182 205 13
4896 13 -396 -231 75 138 -2 379 279 232 -101 -42 214 209 -412 -159 212 -212 -290 -83 -23 127 177 241 -56
4919 -56 132 105 -88 45 107 69 17 36 280 15 89 -46 11 -263 -260 183 270 -155 253 221 -8 83 -50 137
4943 137 -63 -11 -35 -17 137 144 -146 175 -242 1 111 215 -141 78 254 84 141 131 104 -213 89 -167 300
4966 300 -192 -243 25 253 -2 -195 -3 20 -112 -90 -23 -17 -93 -194 44 -257 -8 54 89 -236 129 214 204 -12
4990 -12 -137 -81 205 46 100 11 -67 449 -229 -12 -404 112 -163 -94 154 -32 -123 190 86 -164 194 354
5012 354 -68 138 -111 -80 177 107 -79 349 -129 -25 -117 46 -167 182 -245 -247 -73 -74 -232 154 103 334 56
$$ packed form
4850GM10m47J82j69j33J00NK39j82m88M96R5l08J60N3o7K17m2k42L35l62l0M03
4873B32K0m15L47l03K18j69R9j60K25j83l4QJ53q4j90M20rk59k56L29j71L87j92
4896A3m09J65L06O3j40L81j00m7l33N9K56no21K53L71m24p8K07O0J50N0O4k97
4919e6J88k7j93J33O2l8n2J9K44k65P4j35N7k74LM43Q7m25M08l2k29R1j33J87
4943A37k00N2k4J8J54Pk90L21m17K43J10J04l56K19J76j70N7j0k7l17L02k56M67
4966C00m92n1K68K28k55j93J92K3j32K2O7Op6j01K38l01K49O2L5l25L65Q5j0k16
4990a2j25N6K86j59N4q9p8N16o78K17l92N16k75O9K48j86r1L13j04k50L58J60
5012C54m22K06k49L1K57p0j86M28m78J04r2J63k13L49m27kJ74jj58L86n1K31k78
$$ plain form
5035 56 134 112 -109 191 26 82 158 -60 -106 -75 127 -4 99 -302 106 -67 3 -40 221 156 -353 248 281 -33
5059 -33 262 122 212 233 177 -190 20 83 4 293 16 -80 -142 417 134 -394 -164 -121 -204 185 -26 49 121 40
5083 40 -46 -17 99 -244 -182 -107 -208 143 280 -81 -317 -133 42 -146 -21 -231 -89 -76 83 -214 148 192
5105 192 -19 329 -145 -79 -145 124 -145 -77 -547 -237 60 133 -54 -252 45 -87 168 120 -5 -38 -87 -52 -83
5128 -83 23 -19 -187 11 46 -38 -80 -15 -133 88 25 136 -173 -131 -419 -83 -184 -160 64 236 -219 234 -162
5151 -162 122 124 167 92 267 -191 113 -94 -122 87 -126 233 102 -38 -76 142 -93 -1 -30 103 163 15 -60
5174 -60 -220 4 -218 -34 68 11 -27 -28 -245 -22 -139 -127 -94 -242 101 -236 107 139 -51 83 91 11 -48 151
5198 151 73 -63 -62 208 -19 -30 51 54 -185 3 -96 -64 -308 310 -65 -101 250 -110 7 75 -131 -134 12 1 358
$$ packed form
5035E6P8k2k21L00j65N6P6k18m6L1K02j31J03m01M08j73P0m3K61o5n09O01L3l14
5059c3K95j40R0K1n6l67K10O3p9K89k77r6o2N59k83n28K30M3q3L89k11P5P2q1
5083D0q6K9J16l43O2P5j01L51J37l61k36J84J75j88J25k10J42J3J59k97L62M4
5105A92k11L48m74O6o6K69k69O8m70L10K97P3j87j98K97j32K55m8j25l3m9L5l1
5128h3J06m2j68J98L5q4m2O5j18K21o3J11l09M2k88L36j01K4K24J72m55M53l96
5151a62K84KM3p5J75m58L04k07k8K09k13L59j31j40l8K18k35R2k9J33O0j48p5
5174f0j60K24k22J84J02n7l8jk17K23j17J2L3j48L43l37L43L2j90J34Qq0n9J99
5198A51p8j36JK70k27j1Q1Lk39J88r9L2k44O18l75l6L51l60J17O8k06lJ46j1L57
$$ plain form
5223 358 24 -208 167 1 -229 -56 37 -4 -90 93 13 -37 -27 110 -88 287 103 272 -280 -124 -131 220 -276
5246 -276 -192 -173 -287 -223 177 149 -151 37 117 -60 -114 -27 158 -47 133 235 -53 162 -77 -5 -402 -211 35
5269 35 -36 -108 259 114 -87 203 149 104 -176 -100 -87 -171 -87 26 -18 -135 229 51 -19 142 355 -4 -162 151
5293 151 83 65 54 -280 59 93 166 -124 -10 147 27 159 -43 80 222 124 374 -116 150 274 -418 233
5315 233 20 -13 -97 230 -37 52 -57 -12 227 78 -239 -114 -155 -142 51 -4 -325 -229 -30 -320 162 -30 48
5338 48 79 171 78 157 277 25 -98 67 -125 -141 211 -83 -74 83 -157 162 142 142 -219 214 85 30 -49 230
5362 230 76 -68 -313 143 -2 110 -70 -82 288 -68 57 -37 410 -98 -108 -197 164 -165 184 182 -60 34
5384 34 -173 -45 157 291 -55 190 6 -220 5 -82 85 -119 145 -287 169 -38 -143 72 -5 -111 -197
$$ packed form
5223C58l34k32L75j66k30J73R3m1q6J83q0n0J0J37j98L75j84J69n52J56pL51m96
5246b76Q4J9j14O4M00k8l00J88Q0j77n4Q7J85k05J80J02k88K15k39P2l97J91K46
5269C5p1p2L67j45k01K90n4m5k80P6J3q4Q4J13m4j17L64j78p0J61K13l59j58L13
5293A51o8j8j1l34L39L4P3k90J14J57j20J32k02J23J42r8K50m90K66J24o92O51
5315B33k13l3q4L27k67Q9j09M5K39j49l17J25m1J3J93n5l21R6J99k90M82j92P8
5338D8L1R2r3P9J20k52j23J65j92j6L52k94RJ57k40L19k0%l61M33j29n5p9K79
5362B30j54j44k45M56j45J12j80j2L70l56J25r4M47n08j0q9L61l29L49kk42R4
5384C4k07J28K02J34l46K45j84k26K25q7J67k04K64m32M56k07j05K15p7j06q6
$$ plain form
5405 -197 -11 4 124 -48 17 -109 -123 -24 311 367 93 -54 259 -204 -109 65 60 -67 28 74 195 105 576 -407
5429 -407 104 126 -5 -87 -59 -406 219 19 231 269 -171 -111 -109 64 -157 85 20 193 73 -135 -123 113 36
5452 36 -98 1 -208 22 -92 -344 -36 15 -4 82 133 144 -21 114 94 -126 57 193 -157 1 207 -245 -194
5475 -194 -48 403 -52 -158 37 -58 68 11 261 -68 37 -39 -117 -35 254 -15 -55 205 -230 31 -98 -255
5497 -255 94 248 -145 -204 -32 -230 -114 -109 290 14 63 -172 132 -193 22 0 190 -89 -196 -37 -150 56
5519 56 -22 98 -178 143 242 -36 169 100 67 286 -82 9 -231 -176 35 -167 -21 -74 24 -93 -222 -135 -21
5542 -21 -153 176 -143 18 -126 -96 106 19 -5 100 -11 -66 68 -266 -87 94 -252 88 30 144 -13 127
5564 127 123 -193 95 8 -328 -65 286 -13 -159 138 -126 -54 253 -174 42 248 4 195 -49 -154 -199 -239
$$ packed form
5405a97J86J5J20j72O5j26j4R9L35N6k74j47L13m63R5J74nj27R5M6J21r0M71r83
5429d07N11K2j31q2K8l47O25k00K12L8m40O0KJ73k21K42o5J73j20k08J2K36p7
5452C6j34R9k09K30j14k52L08N1j9Q6N1J1j65J35k0k20J83J36l50J58K06m52N1
5475a94J46M51m55j06J95r5J26n7K50l29J05p6p8Q2K89k69m0K60m35K61j29j57
5497b55L49J54l93n9J72j98J16NL99k76M9k35L04l25K15k2J90k79j07J59j13K06
5519E6p8J20k76L21R9k78K05o9l3K19l68R1k40N5K11k02J46n3R8j17j29Q7J14
5542b1j32L29l19J61j44L0K02q7k4J05j11n5J34l34J79J81l46L40n8J14j57J40
5564A27ml16K88q7l36K63L51k99j46K97k64P2L07m27K16K06k44J91k44j05m5m0
$$ plain form
5586 -239 174 -77 -373 116 116 -10 -40 398 -82 163 -204 -47 131 -314 133 -171 -15 -264 -223 50 -75
5607 -75 88 223 65 -92 -60 336 -202 164 -269 210 -260 231 58 -24 206 -202 -90 126 63 -132 -324
5628 -324 -1 246 91 43 6 137 -39 153 25 66 182 -216 3 -183 101 -156 -118 198 -271 335 361 67
5650 67 -99 -107 -91 -18 185 92 -118 -78 -366 94 156 -118 23 68 162 -36 344 215 27 173 -65 67 -155
5673 -155 198 108 19 -32 -15 16 99 -244 -164 -191 -185 45 -29 -242 20 -272 16 150 88 191 -221 11 88 234
5697 234 96 -172 -104 -142 -63 -395 149 -97 161 -300 222 -5 -8 182 103 -257 90 27 166 39 -34 -192 -134
5720 -134 120 -219 -181 204 266 123 390 -141 -48 -169 -157 -107 -156 97 -148 125 124 -256 80 -129 -229 135 68
5743 68 -26 86 140 43 262 75 121 242 268 200 102 240 -237 95 114 71 -104 133 177 250 115 -291 97 274
$$ packed form
5586b39M13k51k96M89%j26l0M38m80K45l67J57J78m45M47l04J56k49M1K73j25
5607g5J63J35j58j57L2L96n38L66m33M79m70M91j73q2K30m08J12K16o3j95j92
5628c24L23K47j55m8l7J31j76J92j28M1J16l98K19j86K84k57L8L16m69O06K6k94
5650F7j66qJ6P3K03r3k10M0k88M60O2k74J41M5R4j98L80j29j88J46k38J32k22
5673a55L53r0q9n1J7L1Q3l43Q0k7OK30p4k13K62k92K88J34o2J03m12K32P7J46
5697B34j38k68O8l8P9l32N44k46K58m61N22k27lJ90p9l60L47o3J39j27p3j58N8
5720a34K54l39L8L85O2j43K67n31R3j21J2N0m9K53k45K73jl80L36k09j00L64o7
5743F8r4J12N4r7K19j87M6J21K6o8r8J38m77L32J9m3j75K37M4P3j35m06L88J77
$$ plain form
5767 274 -84 139 131 80 25 249 75 -215 202 -6 95 179 -82 94 -194 41 -269 -89 -369 110 81 -159
5789 -159 -56 84 -59 -68 -103 76 -183 25 174 -284 39 -33 -141 71 -39 -3 -144 -143 41 -28 -241 133 -208
5812 -208 39 89 196 100 167 -93 16 -25 46 -83 -71 -51 58 -159 -200 63 272 -214 -97 -135 -387 -44 13
5835 13 101 -77 -35 -22 -27 -270 65 196 198 -290 109 285 -95 82 -40 -97 323 -37 88 63 -151 92 -312
5858 -312 -32 62 147 46 -188 -27 -458 -252 142 125 -225 89 -291 117 258 61 103 102 276 -6 96 -137
5880 -137 -73 41 -5 -37 -41 -109 -19 56 295 -40 -210 -78 -196 -201 301 238 -26 -145 72 126 81 225 -236 -83
5904 -83 -88 -131 -102 174 -44 -109 28 51 123 8 10 -96 295 160 179 47 -209 -111 -116 132 -172 14 -101 97 327
5929 327 34 -251 -224 195 58 142 -66 128 -103 -87 -259 73 -3 127 -111 -129 -311 -81 80 -82 -181 -19
$$ packed form
5767B74l58K23qn1n5K24j74k90M17k08J01Q4k61J76k88K35l10J80k80M79k9k40
5789a59J03J40j43rl5J79k59K08J49m58L23p2j08K12j10L6j41JJ84o9k13L74l41
5812b08K47N0J07r6O7k60J09m1P1j29J2K0J09k17m1K63K09m86J17l8k52L43N7
5835A3Q8j78M2J3nk43L35J31Km88L99J76l80J77j22n7M20l60J25k5k14K43m04
5858c12K80R4Q5j01k34J61m31K06L94j7l50L14l80M08J41j97M2jJ74k82J02k33
5880a37O4J14m6l2mo8R0P5K39l35j70J32j18nN02o3k64j19K17N4m5J44m61J53
5904h3nm3K9K76k18o5J37K3P2j15Kj06L91j35J9j32k56R8nK48l04J86j15J98K30
5929C27k93k85K7M19j37Q4k08J94k31J6j72L32p6J30k38j8j82K30J61j62r9J62
$$ plain form
5951 -19 -133 91 -304 -74 24 36 127 -48 177 224 35 -76 -184 -56 -48 -163 -417 -132 207 87 -7 -285 -207
5974 -207 198 64 10 165 -323 -4 -23 126 -35 31 31 33 47 -159 187 278 116 56 276 28 -46 -108 44 -19
5998 -19 -63 150 188 157 57 174 -53 142 101 88 -62 59 194 40 -8 -102 175 69 142 -44 82 35 -326
6021 -326 47 -216 -180 161 -31 -107 -80 -113 -19 -130 -266 116 -168 58 344 -236 -18 152 44 -225 284 456
6043 456 -58 225 -3 -133 80 189 -240 85 165 -190 -220 -230 -167 -92 -205 -114 123 22 -4 72 155 -317 -87
6066 -87 -148 95 63 68 -213 -138 -215 -24 30 199 189 -114 -54 267 -168 -321 -72 148 -12 58 -114 289 -107 19
6090 19 44 214 -78 -189 -111 101 15 -47 -37 10 -79 19 -127 82 -44 -275 232 -144 -16 -178 238 13 80
6113 80 54 29 -70 73 135 -100 -10 -205 -120 -178 261 69 -110 218 24 15 17 -126 -39 39 -146 162 293 -106 197
$$ packed form
5951a9j14K24l95K30R8J2R1j75K25M7j89j11j08J28Qj15k54K85L39j20r4k78P8
5974b07M05j34n4J55m88L19j9J49j61O6%KJ4k06L46R1j62o0K20k48p4o2J52o3
5998a9m4K13L8l1j00J17k27J95m1j3j50J21J35j54m8r4K77j06P3j86J26m7l61
6021c26L73k63L6L41j92p6K7l3R4j11j36L82k84K26K86n80K18J70j08k69N09J72
6043D56n14K83k28j30K13J09m29L25Q0l55l0j0O3P5j13R1K37j01k6P6Q3m72K30
6066h7o1K43l2Nk81P5p7J91N4J69j0l03O0L21m35j53K49K20j60P0j72M03l96J26
6090A9K5J70k92j11P8K12q6o2J0M7q9R8j46K09j26k31N07l76J28j62M16k25O7
6113H0k6k5r9J43O2k35R0j95Q5n8M39j92j79L28j94rKj43Q7P8j85L08J31l99L03
$$ plain form
6138 197 -71 -294 -88 234 59 -128 -107 170 283 -92 375 -70 261 -176 145 -287 -175 96 -62 -385
6158 -385 104 199 -70 4 -226 38 -27 163 -81 20 167 295 -158 -528 -366 -206 -50 3 -31 50 17 -50 -83
6181 -83 -108 135 -76 122 369 1 -2 5 114 41 182 149 -191 41 -146 -39 209 -65 -102 -52 148 -70 129
6204 129 294 -125 -324 -210 45 -70 -223 71 126 -175 -380 -138 192 5 -57 -322 -288 197 -255 45 -13
6225 -13 -191 130 139 232 -159 68 148 380 -108 -109 475 -1 -256 17 -48 -77 212 100 92 87 85 -138 -30 90 27
6250 27 -82 -170 -128 -77 -270 81 219 -17 -5 -193 125 -26 187 -46 -99 -125 416 109 -75 -208 -118 83 -79
6273 -79 464 -208 175 229 -46 145 -232 -224 -63 -167 -64 85 96 -87 -424 -33 -200 -70 -175 177 -163 73
6295 73 81 -159 -66 -225 -121 -245 -65 -190 210 -112 -356 37 307 -68 195 277 -108 -379 228 -146 -44 -149
$$ packed form
6138A97k68k23K06L22j75j87K1K77J13l75M67m45L31m37L21m32J12K71j58l23
6158c85M89R5k69P4k30K64o5J90k44J01J47J28m53l70J62J60J56N3l4Q1l3o7l3
6181h3k5K43k11J98K47l68lPJ09p3J41l3l40K32j87J07K48k74l7N0K00k18J99
6204A29J65m19j99J14K55j15j53K94N5l01k05K42L30j87o2k65L4M85m52L00n8
6225a3j78L21RR3l91K27Q0K32m88jN84m76k55K73o5k9K89j12qnkk23J08J20o3
6250B7j09q8M2N1j93L51J38k36J2j88L18j51K13k33n3k6N41l07j84j33R0K01j62
6273g9N43o72L83N4k75J91l77QJ61j04J03J49J1j83l37L91j67J30j05L52l40K36
6295G3Qk40R3j59J04j24J80j25M00l22k44L93K70l75K63Q2l85k71O07l74J02j05
$$ plain form
6317 -149 26 108 290 51 61 25 21 -264 -158 -65 245 -88 -433 -41 -12 161 66 -129 -65 51 -158 -98 -163 16
6341 16 168 111 -200 36 49 -275 -41 230 -20 -31 -147 -250 64 150 -57 -42 66 2 34 180 -115 -102 282
6364 282 12 -32 444 -150 100 -65 -98 27 301 165 4 162 -197 52 -189 94 -270 265 -102 10 -76
6385 -76 -97 -136 115 21 27 -115 225 46 -125 34 133 119 -258 -130 123 -262 9 -62 52 -260 -129 264 -259
6408 -259 -156 -187 -1 -218 -43 190 -140 121 -122 -253 -166 87 33 164 -32 -148 -30 -93 -98 5 142 85
6430 85 -360 127 -48 -2 5 -155 -80 227 246 35 44 98 -160 -187 38 128 56 55 -313 238 43 -181 -341 -89 -119
6455 -119 -78 246 -179 61 186 -176 -73 -76 58 25 -68 -72 -428 -11 23 51 -3 148 23 -69 99 165 -41 193
6479 193 -45 -96 111 164 -10 177 103 40 54 -408 -156 162 125 131 27 77 -8 71 22 -113 -118 5 -89 279 3
$$ packed form
6317a49J75Q2J82k39J0l6mk85J06R3L10l33l45L92K9J73r5j95O4J16k09O0o5J79
6341A6J52n7l11K36J3l24K34K71k50j1j16j03L14Q6k07J5J08o4L2J46k95J3L84
6364B82k70m4M76n94K50j65l3J25K74j36j61J58l59K49k41K83l64N35l67J12q6
6385g6k1l9K51r4Oj42L40j79j71J59R9j4l77J28K53l85K71p1J14l12J31L93n23
6408b59J03l1J86k17J75K33l30K61k43j31Q7K53n4J31j96j16J18o3nJ03J37n7
6430H5m45M87j75M6Pj60P5L07J9k11RN4k58k7K25R0p2jl68N51j95k24j60K52l0
6455a19M1L24m25K40J25l62J03lJ34l3r3ml56M17L4K8n4J51j25r2J68O6k06K34
6479A93k38n1K07N3j74J87p4o3J4m62K52L18l7Oj04N0q5P9m9j35nJ23r4L68k76
$$ plain form
6504 3 66 78 120 -201 -190 239 -125 189 -89 -125 -310 164 246 -346 212 -72 -222 -80 10 -288 22 19 -113 -113
6528 -113 109 -130 -117 -57 -48 489 -34 -73 116 117 -265 -39 -32 86 -53 69 24 -90 96 82 6 211 -143 106
6552 106 -104 32 283 190 -109 182 29 -218 2 107 40 304 76 18 38 -12 447 4 181 44 -254 2
6574 2 55 -95 -33 -246 -62 -237 -21 -77 93 99 -62 -63 217 -175 164 119 -124 88 -16 217 -107 -57 251 308
6598 308 -77 -25 114 -605 278 -268 248 222 -104 194 158 36 -176 27 126 267 -192 99 238 -1 -164
6619 -164 -39 -55 358 -146 -115 -65 -273 -8 -87 -34 -237 143 -294 300 156 157 -69 188 104 10 144 51 107 -377
6643 -377 -132 -190 -37 -1 79 -127 173 84 64 -174 253 14 -156 34 51 -40 -73 150 137 -30 -45 195 -109
6666 -109 -15 2 58 104 229 57 170 -60 299 239 -36 -130 -21 63 81 106 -391 -138 4 -13 -155 -72 254 195
$$ packed form
6504CO3J2M2l21J1M29l64L14k78l6j85M74Q2n92N58k84j50J42R0k98L10lj32%
6528a13K22k39J3O0RN37n23l9J89Jl82K26PJ18j39J22m5j14J86j4p6K05l54K49
6552A06k10J36K51r3k99K91j53k47K20J05o7K64k28n8K0n0M59m43J77j37k98K56
6574BN3j50O2k13J84j75K16n6J70Oj61jK80l92L39m5k43K12j04K33l24N0L08N7
6598C08l85N2J39p19Q83n46N16k6l26K98l6j22k12K03R9J41m59K91J39k39j63
6619a64J25j6M13n04L1N0k08K65p9N3k03L80m37N94j44Jk26K57q4r4J34r3N6m84
6643c77K45n8J53L6Q0k06L00q9k0k38M27k39j70J90J7r1l3K23j3j67j5K40l04
6666a09R4J7N6M6J25j72J13k30L59o0k75r4J09Q4J8K5m97K53J42j7j42Q3L26n9
$$ plain form
6690 195 -238 -185 97 -79 -147 -96 90 24 -134 13 217 202 29 38 104 171 -70 198 -66 -77 99 -43 98
6713 98 224 140 51 7 -178 50 341 382 164 -121 159 -149 -24 104 -174 247 -102 -88 269 282 56 50 81
6736 81 41 12 -76 -93 171 114 -111 241 -91 47 192 73 -28 -259 373 -27 -233 7 -246 -226 -136 196 19
6759 19 -13 -256 -56 172 149 257 -10 75 252 -247 118 -5 54 403 218 -83 320 20 -172 124 85 42
6781 42 -111 -133 86 68 -26 -154 189 40 -70 64 116 -234 -206 299 -243 -92 154 -248 -180 98 -44 -31 23
6804 23 169 -51 -306 219 -106 77 41 -48 114 -59 -265 -138 199 69 38 223 -212 105 -65 -169 314
6825 314 169 -404 -22 40 -37 -81 124 -33 -172 -36 -30 32 -176 94 -188 7 274 -129 163 -92 59 -111
6847 -111 109 -148 -117 55 -165 136 -156 30 -127 236 180 -86 5 51 -227 -76 423 122 -169 -12 36 88
$$ packed form
6690A95m33N3K82j76o8N1J86o6j58J47K04j5j73RO6O7k41K68k64j1J76j42J41
6713I8J26q4q9m4j85K28K91M1k18k85K80l08J25J28k78M21l49J4L57J3k26oL1
6736H1m0k9q8j7K64n7k25L52l32J38J45j19j01k31O32m00k06K40k53K0R0L32j77
6759A9l2k43K00K28k3J08k67Q5J77m99L65j23N9L49j85l01M03l00j92K96l9m3
6781D2j53k2K19j8r4j28L43j49j10J34N2l50K8N05n42J51K46m02O8K78j42J3N4
6804B3J46k20k55N25l25J83l6q9J62j73k06J27L37j30l1J85m35L17j70j04M83
6825C14j45n73L82O2p7m4K05j57j39J36OO2k08K70k82J95K67m03K92k55J51j70
6847a11K20k57L1J72k20L01k92J86j57L63n6k66R1M6k78J51M99l01k91J57M8N2
$$ plain form
6869 88 -163 -43 108 -67 230 129 -169 94 -146 -26 -177 -160 265 15 49 310 134 11 130 308 -383
6890 -383 -128 143 56 228 -37 86 427 -89 -145 50 150 -82 -53 -47 -151 78 409 175 -243 -1 -3 33 -72
6913 -72 -97 -146 259 18 -52 258 -41 -244 -121 -160 -230 -171 159 169 252 76 -17 217 179 -159 -116 230 -175 282
6937 282 114 -89 145 112 298 23 426 -219 -31 -259 265 -24 -10 64 -141 92 179 25 106 173 139 -96
6959 -96 196 297 -298 101 277 -180 146 -46 -161 30 150 -103 5 31 50 224 -73 -247 163 -193 127
6980 127 -144 105 -47 -124 289 -140 -130 -80 -189 -84 120 -9 84 120 210 182 -57 -19 -107 196 -28 -228 223
7003 223 89 43 -24 121 -4 -274 297 -269 36 79 -260 -413 -43 62 -110 -138 58 -202 -77 23 -82
7024 -82 -53 13 -126 512 -60 10 49 145 -284 -283 147 23 78 -313 -42 -269 119 -61 -150 -10 11 7 -156 0
$$ packed form
6869H8k51J20J51j75K97j01k98K63k40J20j51J7M25k50L4K61j76j23J19J78o91
6890c83K55K71q7J72k65J23L41n16n6J95J00k32K9Oj04K29L31k34m18K42kL6j05
6913g2k5m9M05k41p0L10k99k03J23l9p0N9L30J0Q3j76r3K34l8l38M3L46m05M57
6937B82j68k03K34l3J86k75M03o45J88k28N24k89J4P4k05K33Q7j54Q1O7l4k35
6959i6K92J01n95L99J76m57L26j92j15J91J20k53J08K6J9J74k97j74M10l56L20
6980A27k71K49j52p7M13m29J0N0j09J05K04j29R3L6R0k8k39L8q8L03k24k00M51
7003B23j34m6o7J45j25k70N71n66L05M3l39j53L70J05j72k8J96k60J25J00j05
7024h2K9O6j39O38n72P0L9R6m29JM30j24N5l91K71k27L88j80q9J40K1mj63J56
$$ plain form
7048 0 92 242 52 151 59 260 -220 103 80 -9 61 183 -26 -82 -152 72 -102 -78 54 -99 273 264 -138 175
7072 175 151 145 86 59 170 -46 -258 -175 -102 307 259 349 91 121 -191 -145 81 16 425 -196 -203 -22 82 35 420
7097 420 6 -7 -110 71 194 -25 79 -222 -275 14 -59 6 216 -140 197 78 -150 -132 -68 25 63 -256 -208
7120 -208 -136 -141 69 -463 32 24 -261 152 164 -18 76 -6 -83 -50 -208 53 -214 -314 -41 -16 92 -65 172 149
7144 149 -85 144 127 -98 -25 230 -24 128 -71 -103 -269 49 119 82 197 -311 86 -64 444 -88 117 282
7166 282 -124 -304 99 9 19 -65 75 89 232 -172 -92 17 197 -142 -245 109 -294 -7 144 -7 -45 86
7188 86 -202 119 7 -174 -214 64 58 -181 147 -182 -224 10 -176 -120 -82 -51 185 29 -204 -156 -245 -16 -169
7211 -169 425 -125 -174 93 -161 -152 -103 198 -248 60 302 170 -84 294 13 200 -210 -275 37 -52 332 -221
$$ packed form
7048@R2J50j90R9r2K01m80L23k3q9P0J22k09n6p0K24j74K4J32j53L72rm02L13
7072A75k4on9k7J11k16k12Q3P3M09m8R0k58L0l12M6K26o5M09o21pJ81J04m7L85
7097D20m14j3j03J81J23k19J04l01n3K89p3O5K10l56L37j19k28J8O4R3L8l19M8
7120b08P2nK10n32M95qk85M13J2j82R4q2p7L3j58K61k67j00K73K5J08j57K37k3
7144A49k34K29j7k25P3K55k54J52j99l2j66L18P0l7J15n08L97j50N08n32K05J65
7166B82m06j80M03r0J0q4J40J4J43m04Q0J09J80l39j03L54m03K87J51j51l8J31
7188H6k88L21j12j81m0K78ok39L28l29m2K34j86N6L8L1K36j56k33M8q9K29j53
7211a69N94n50m9K67k54RM9L01m46L08K42j32k54L78k81J87m10o5L12q9L84n53
$$ plain form
7233 -221 -127 -215 47 -115 -227 -140 -1 -153 -118 -106 -264 -32 -180 179 -86 -47 177 -96 141 -123 -6 185
7255 185 198 -57 30 190 -147 52 209 -70 -59 72 141 -135 115 -145 3 -35 58 10 -85 -280 52 32 38 117
7279 117 -40 -77 -133 44 -44 41 244 275 2 96 90 126 -61 239 -97 63 104 226 19 94 -181 186 -109 208
7303 208 228 -79 -213 -187 -181 -108 176 -53 258 71 -47 -2 -85 208 10 -60 -11 -122 70 138 -391 -141 108
7326 108 -304 -78 -59 -210 234 136 220 -160 -237 304 68 89 -203 -56 184 -243 37 6 -3 12 174 -93 -114
7349 -114 -276 -115 -170 42 -7 -176 334 -108 132 -335 18 172 -32 138 53 -329 -15 -225 -116 -158 11
7370 11 -175 236 -61 -233 -46 111 227 -7 -110 -184 274 146 141 255 -65 -16 103 170 168 20 15 147 24
7393 24 -89 248 71 -108 61 233 -161 26 4 51 104 108 58 -207 120 -105 -8 -151 95 -66 -261 14 14
$$ packed form
7233b21R4q8K62j62j12Q7J39j52L5J2j58K32j48L59k65L9K24k73K37k64J17J91
7255A85J3k55Q7J60l37J99J57k79J1J31O9k76K50k60J48l8R3m8r5j95L32k0OP9
7279A17j57l7n6J77q8Q5K03L1k73R4oL6j87L00l36J60M1J22k07P5k75L67k95L17
7303B08K0l07j34K6OP3K84k29L11j87j18M5q3K93j98p0M9j11J92O8n29K50K49
7326A08m12K26J9j51M44r8Q4l80p7N41k36K1k92J47K40m27K80l1rJ5J62k67k1
7349a14j62J61n5K12m9j69N10m42K40m67L53J54k04J70q5l82L14k10J09m2J69
7370A1j86M11k97j72J87J57J16k34j03p4M58j28nJ14l20M9J19O7kj48nJ32j23
7393B4j13L37j77j79J69J72l94J87k2M7N3Mn0k65L27k25R7j43K46j61j95K75%
$$ plain form
7416 14 61 -131 21 126 -102 -381 -226 -157 -229 -51 -209 -131 199 62 -144 -12 68 273 219 -61 -9 133 -68
7439 -68 174 -72 327 -298 -222 -45 -55 11 34 129 -79 -63 -99 47 140 2 -50 269 408 57 -64 137 -312
7462 -312 19 -6 -171 12 -135 146 105 -347 -192 83 43 -124 68 130 15 -87 181 -24 151 110 81 47
7484 47 23 142 107 11 151 75 65 -248 -13 277 -337 224 -270 -41 -94 -76 -46 -101 -175 -97 8 -247 -27 -108
7508 -108 132 -173 -352 -113 314 -116 -170 239 -75 -112 229 -97 -16 307 298 -202 131 32 9 135 96 -93 -162
7531 -162 -104 -94 -205 -76 -130 279 25 -266 60 -161 129 120 -200 225 -31 -12 288 -102 1 116 -38 81
7553 81 138 111 253 106 -124 -67 -58 -149 19 238 -14 127 -114 -305 3 252 -155 -43 74 -25 219 64 -275
7576 -275 -194 127 -45 115 -375 -222 -436 -107 435 91 296 9 186 112 82 296 56 82 -73 -217 105
$$ packed form
7416A4M7j92J52J05k28k79J55O9p2J78j58P8L30j37k06J32Q0K05n4k80N2J42k01
7439f8K42k46L99o25P6J77j0O6K3R5k08J6l6J46R3j38n2L19J39l51j21K01m49
7462c12L31k5j65J83j47K81m1m52J55K75m0j67J92O2j15j02K68k05J75m1k9l4
7484D7k4J19l5r6J40p6j0l13K35K90o14N61m94K29n3J8L0n5p4P8J05k55K20q1
7508a08K40l05j79K39M27m30n4M09l14l7L41l26Q1L23rn00L33r9k3J26l9j89o9
7531a62N8J0j11J29n4M09k54k91L26k21K90rl20M25k56J9L00l90J03J15j54J19
7553H1N7k7J42j47k30N7Rr1J68K19k52J41k41j91L08K49m07J12J17r9K44j55l39
7576b75Q1L21j72J60m90J53k14L29N42l44K05k87J77p4l0K14k40K6j55j44L22
$$ plain form
7597 105 34 -54 167 -102 -66 69 -43 149 -43 -337 -23 -228 214 -53 132 138 150 -18 226 170 -29 -93 216
7620 216 -374 110 -46 -218 91 71 -50 287 18 77 56 7 -17 -97 -15 135 291 -159 42 -30 76 -66 8
7643 8 -214 8 -27 17 -192 23 -64 -98 -8 254 -255 165 -73 -20 -335 32 69 114 138 -9 -139 -231 -14 -182
7667 -182 222 -44 -210 66 321 198 -32 -163 -234 58 157 42 -309 49 213 -150 136 -122 -348 -319 159
7688 159 197 -74 -291 -87 -29 36 -254 104 58 -127 105 318 -256 103 -50 -237 -198 267 105 57 -109 287
7710 287 -46 98 365 170 143 -139 -166 -354 64 66 -12 137 -17 142 -164 -93 -264 49 -98 86 -175 -118
7732 -118 245 175 152 38 -88 -51 -211 97 -163 226 61 -230 -51 -3 64 144 257 -20 161 -218 231 64
7754 64 -90 -8 190 -33 -230 -91 26 190 -153 69 317 -64 19 233 -57 178 43 83 -51 -39 -69 229
$$ packed form
7597A05p1q8K21k69L6J35j12J92j92k94L14k05M42k67J85OJ2j68K44n6j99o4L09
7620B16n90M84j56j72L09k0j21L37k69N9k1m9k4q0Q2J50J56m50K01p2J06j42P4
7643Hk22K22l5M4k09K15q7l4R0K62n09M20k38N3l15L67L7M5K4j47j30r2K17j68
7667a82M04k66j66K76K55j23k30j31p1K92R9j15l51L58J64l63K86k58k26K9M78
7688A59L8k71k17K04N8O5k90L58m6j85K32K13n74L59j53j87L9M65j62m8j66L96
7710B87l33J44K67j95k7k82k7j88M18Kp8J49j54J59l06P1j71L13j47J84k61N7
7732a18L63p0k3j14j26L7j60L08k60L89j65k91J79M8O7Q0J13k77J81l79M49j67
7754F4j54Q2J98k23j97J39J17J64l43K22K48l81Q3K14k90K35j35M0j34J2l0K98
$$ plain form
7776 229 -129 155 -241 -25 -14 144 -164 227 -98 -149 186 -215 -233 59 50 18 51 -26 -48 175 180 -122 -263 -40
7800 -40 -254 108 199 188 -18 -97 11 37 -100 -100 42 64 -55 -109 -75 150 -33 80 105 -162 268 35 49 110
7824 110 -154 79 39 295 -60 143 238 -58 56 134 -64 242 266 218 -74 -231 15 51 265 -68 -48 23 -33
7847 -33 -145 -35 -62 -85 250 13 -107 254 133 -242 -124 91 66 -71 182 -184 -263 -133 37 -103 135 329
7869 329 33 207 -192 -184 -198 -162 4 -97 -79 94 -123 110 -4 17 9 43 83 -274 -63 -76 -107 9 42 -107
7893 -107 187 -90 -465 17 78 -83 235 -133 -68 47 46 59 -22 -95 247 -33 -62 -13 -30 48 -59 -115 142 -67
7917 -67 80 -17 -58 208 86 -162 -96 -128 269 35 -89 -3 6 8 -34 47 30 -192 -180 -56 -177 -81 21 -180 -63
7942 -63 303 149 -88 -10 0 -219 -134 64 -171 -28 426 88 -274 -71 6 -112 -263 94 -195 219 -55 129
$$ packed form
7776B29l58K84l96K16J1J58l08L91l25n1L35m01j8K92rl2L3p7k2K23Nl02j41K23
7800d0k14L62R1j1k06p9J08K6j37%J42K2j19n4L4K25j83J13K5k67M30k33J4O1
7824A10k64K33m0K56l55K03R5k96J14P8j98L06K4m8k92j57K46L6K14l33K0P1n6
7847c3j12J10k7k3L35k37j20L61j21l75J18K15k5j37K53l66p9J30J70j40K38J94
7869C29k96J74l99Qj4L6J66j01J8J73k17K33j14K1qL4M0l57K11j3l1J16L3j49
7893a07K94k77l75M82O1j61L18l68O5J15jJ3q1p3L42k80k9M9j7P8j07n6K57k09
7917f7J47r7m1K66j22k48O6l2L97k34j24Q6RKm2Q1j7k22J2J24j21R6J02k01J17
7942f3L66j54k37P8J0k19Q5J98k35J43M54l38l62K03P7j18j51L57k89M14k74J84
$$ plain form
7964 129 106 -186 -182 -93 265 -43 19 -147 138 90 -20 -42 53 160 -20 327 30 57 -6 242 -182 -146 -295 -363
7988 -363 -131 147 50 -288 162 268 -194 -30 -39 26 100 -140 61 15 16 -78 -150 -58 59 138 110 -210 -71 -163 103
8013 103 -2 132 -131 -223 54 306 60 93 311 -179 -79 -2 140 -72 57 -52 -79 56 -64 119 129 222
8035 222 103 260 -83 -18 -41 -44 111 76 -193 204 140 65 -224 171 -105 -21 -136 -62 -117 192 421 -218 202
8058 202 41 -101 131 -47 26 -237 -230 18 4 -20 291 69 131 28 -43 129 -7 -89 114 209 333 -41 60
8081 60 233 18 -23 204 -31 -49 -111 -182 10 -139 91 -36 -202 -3 8 83 -53 119 -60 222 127 -125 486
8104 486 -5 -116 -55 -7 115 251 18 -174 125 22 -24 254 61 -59 37 230 109 304 236 -144 127 -160
8126 -160 82 -33 107 -186 -192 256 112 91 -185 -266 50 111 31 121 -173 174 98 -260 -115 95 212 -34 -103
$$ packed form
7964A29k3k92MQ9L58l08O2j66K85m8j10k2R5J07j80L47k97K7o3K48m24L6j49o8
7988c63K32K78r7l38M50J06m62J64rO5P4k40K01m6Jr4p2R2J17P9k8l20J39r2K66
8013A03j05J34k63r2K77K52k46L3K18m90J00P7J42k12J29j09k7J35j20J83J0R3
8035B22j19J57l43O5k3lJ55l5k69L97o4p5k89L95k76Q4j15P4n5L09K29o39M20
8058B02j61j42K32j78P3k63PK48j4k4L11k22O2j03p1J72j36q2K03R5J24l74J01
8081F0J73k15m1K27k35j8o2p1J92j49K30j27j66J99J1P5j36J72j79K82r5k52O11
8104D86m91j11O1M8J22J36k33j92K99j03m6K78j93j20R6J93j21J95o8l80K71k87
8126a60K42j15J40k93oM48j44k1k76q1L16O1q0R0k94L47p6l58J45K10J17k46o9
$$ plain form
8149 -103 29 -42 -7 -151 72 135 -3 138 -75 -161 -166 -189 163 -187 -152 -209 151 184 -47 39 -382 -55 -32 115
8173 115 -210 -56 166 68 -268 305 15 -110 504 36 -35 -59 155 224 158 282 -23 11
$$ packed form
8149a03J32p1L5j44K23O3j38J41k13q6nk3L52l50L5n7L60L3k31Q6m21L27K3J47
8173A15l25J54K22r8l36N73k90j25O14m68p1k4K14O9o6J24l05L4
8191A1
$$ Imaginary data points
##PAGE= N=2
##DATA TABLE= (X++(I..I)), XYDATA
$$ plain form
0 0 0 0 0 -2 8 -8 8 -8 16 -24 24 -32 40 -48 58 -72 88 -104 120 -143 168 -193 224 -257 297 -339 386 -438
28 -438 497 -561 631 -709 796 -887 990 -1103 1228 -1361 1511 -1675 1852 -2051 2271 -2517
44 -2517 2788 -3092 3438 -3830 4283 -4811 5433 -6183 7104 -8275 9808 -11916 15005 -19968
58 -19968 29250 -52393 223685 258498 -247396 143374 169696 -181125 -35006 15927 -331648
69 -331648 -46413 212706 -144110 -109956 279334 103761 -15326 156811 -16554 -150741
79 -150741 86052 -13038 -259691 -90625 85090 10015 550 22964 65116 153337 76689
90 76689 -68488 -43588 -5368 -13516 -50927 -152246 -67225 142095 31544 -85058 106616
101 106616 95926 -41281 96766 21217 -212789 27063 147862 -193090 -118042 164747
$$ packed form
0@%%%kJ0j6J6j6K4m0M8n6P2q8J06j30J60j92K24k63L11l61M17m81N54o36P25q24
28d38R35j058J192j340J505j683J877k093K331k589K872l186L527l903M322m788
44b517N305n880O530p268Q113r094J0244j1616J3287j5379J8083k1724K6921l4973
58a9968M9218q1643K76078L4813n05894L90770K6322l50821J46119N0933l47575
69c31648K85235K59119l56816L4154L89290j75573j19087J72137j73365j34187
79a50741K36793r9090k46653J69066J75715p5075r465K2414M2152Q8221p6648
90G6689j45177K4900L8220q148l7411j01319Q5021K09320j10551j16602J91674
101A06616j0690j37207J38047p5549k34006K39852J20799l40952P5048K82789
$$ plain form
111 164747 -20913 -35730 161393 -73072 -99043 245874 9386 -282919 85232 146672
121 146672 -176838 -10360 106326 -126204 40319 184631 -145616 -100525 198446 -7158
131 -7158 -138576 73995 471 -79752 113858 18650 -156579 51911 127420 -76700 -68652
142 -68652 32025 12807 29606 4452 -63812 17675 78042 -3404 -43095 -32030 4805 56627
154 56627 -27681 -93259 41253 64516 -38355 25133 26814 -69335 61436 90383 -143974
165 -143974 -65944 137011 -34603 -94361 79254 -12589 -45485 142898 -7525 -159985 108208
176 108208 105242 -165487 -27235 96716 -84046 -568 110397 -95158 -38566 173636 -18002
187 -18002 -129124 70959 26217 -85035 37497 -675 -95488 72150 95267 -84158 -22692
$$ packed form
111A64747j85660j4817J97123k34465k5971L44917k36488k92305L68151O1440
121A46672l23510J66478J16686k32530J66523J44312l30247M5091K98971k05604
131g158j31418K12571p3524q0223J93610r5208j75229K08490P5509k04120Q048
142f8652J00677j9218J6799k5154o8264Q1487O0367q1446l9691J1065L6835N1822
154E6627q4308o5578J34512K3263j02871O3488J681r6149J30771K8947k34357
165a43974P8030K02955j71614n9758J73615r1843l2896J88383j50423j52460K68193
176A08208k966k70729J38252J23951j80762Q3478J10965k05555N6592K12202j91638
187a8002j11122K00083m4742j11252J22532l8172r4813J67638K3117j79425O1466
$$ plain form
198 -22692 89971 1351 -33928 -8699 -42791 -2833 37821 -30994 -35258 35564 45816 26001
210 26001 -12219 -30987 32614 24852 -64576 -34275 9335 -26335 25413 41846 -56569 18061
222 18061 122271 -26984 -76089 55637 -8081 -74665 31337 -27270 -89910 87740 76172
233 76172 -93122 29242 118422 -43456 -25788 50403 -80581 -53106 75878 -54833 -96714
244 -96714 88071 59408 -46290 49067 48881 -37467 34316 23655 -101595 -36428 48280 -38987
256 -38987 -49164 32060 24844 24680 49031 1927 -11440 30406 3725 -46404 -44650 -21233 6236
269 6236 -323 -26187 14311 52502 21267 18359 18264 -26568 1289 27082 -63181 -63611 38060
282 38060 1949 -41387 37946 25130 -15889 63264 34283 -70596 9124 52983 -66092 -47176
$$ packed form
198b2692J12663q8620l5279K5229l4092L9958M0654o8815m264P0822J0252j9815
210B6001l8220j8768O3601p762q9428L0301M3610l5670N1748J6433r8415P4630
222A8061J04210j49255m9105J31726o3718o6584J06002n8607o2640J77650j1568
233G6172j69294J22364Q9180j61878J7668P6191j30984K7475J28984j30711m1881
244i6714J84785k8663j05698R5357j86q6348P1783j0661j25250O5167Q4708q7267
256c8987j0177Q1224p216j64K4351m7104j3367M1846k6681n0129J754K3417K7469
269F236o559k5864M0498L8191l1235k908r5m4832K7857K5793r0263m30J01671
282C8060l6111m3336P9333j2816m1019P9153k8981j04879P9720M3859j19075J8916
$$ plain form
294 -47176 34233 -30321 -19189 60797 -13536 -32717 77849 30551 -60416 13504 27367 -45444
306 -45444 -6736 11467 -47831 400 52435 -17714 -24482 43182 20348 -15618 5566 -4772
318 -4772 -17113 9566 -103 -28946 -7658 20286 10429 -9387 -5895 16344 14555 -7904 -5493
331 -5493 322 -8805 8075 9352 -28308 -7763 36616 -4793 -28713 19028 9027 -18795 17849
344 17849 4515 -34453 19775 33894 -35908 -13324 37269 -10935 -20759 22236 -13079 -24093
356 -24093 33259 5105 -38736 18653 33270 -21040 -3522 20970 -15707 -6505 19038 -20876
368 -20876 -25812 22548 9396 -22715 5954 21018 -670 4402 10698 -10432 -7855 11631 -7625
381 -7625 -27018 -707 13699 -6489 -5049 15407 8038 2530 15164 243 -18337 3858 7463
$$ packed form
294d7176Q1409o4554J1132P9986p4333j9181J10566m7298r0967P3920J3863p2811
306d5444L8708J8203n9298M8231N2035p0149o768O7664k2834l5966K1184j0338
318d772j2341K6679r669k8843K1288K7944r857j9816L492K2239j789k2459K411
331e493N815r127J6880J277l7660K0545M4379m1409k3920M7741j0001k7822L6644
344A7849j3334l8968N4228J4119o9802K2584N0593m8204r824M2995l5315j1014
356b4093N7352k8154m3841N7389J4617n4310J7518K4492l6677R202K5543l9914
368b0876m936M8360j3152l2111K8669J5064k1688N072O296k1130K577J9486j9256
381g625j9393K6311J4406k0188J440K0456p369n508J2634j4921j8580K2195L605
$$ plain form
394 7463 -24981 -16519 12584 -1406 -6744 16282 6833 -3114 20635 10546 -22189 -3906 12163
407 12163 -17673 -19102 6067 -2319 -5686 17342 8532 -7541 15771 18845 -14801 -11626 8518
420 8518 -9168 -18101 3407 -822 -10694 14694 16670 -10336 3817 23486 -6849 -15716 8963
433 8963 -5852 -19723 7900 2768 -19228 11479 22256 -13259 -1495 22589 -6461 -12214 12695
446 12695 -8154 -18073 13183 2124 -20256 8952 15987 -10702 1257 13619 -7162 -2326 10451
459 10451 -7884 -9657 8590 200 -8837 1319 2737 -951 1381 1032 768 1902 1147 4089 13
474 13 -6033 3967 3662 -13901 -2831 9310 -9710 -4159 15712 -4194 -5130 22274 -176 -17499
488 -17499 15573 3897 -26959 3601 8933 -24358 3735 23181 -15496 1429 32450 -8790
$$ packed form
394G463l2444Q462K9103j3990n338K3026r449r947K3749j0089l2735J8283J6069
407A2163k9836j429K5169q386l367K3028q810j6073K3312L074l3646L175K0144
420H518j7686q933K1508m229r872K5388J976k7006J4153J9669l0335q867K4679
433H963j4815j3871K7623n132k1996L0707J0777l5515J1764K4084k9050n753K4909
446A2695k0849r919L1256j1059k2380K9208P035k6689J1959J2362k0781M836J2777
459A0451j8335j773J8247q390r037J0156J418l688K332l49k64J134p55K942m076
474A3o046J0000l05j7563J1070J2141j9020N551J9871j9906r36K7404k2450j7323
488a7499L3072j1676l0856L0560N332l3291K8093J9446l8677J6925L1021m1240
$$ plain form
500 -8790 -13365 22137 -9541 -26624 11962 -4619 -26174 15820 14259 -15199 15824 23622 -11528
513 -11528 3031 11708 -20511 -11409 5524 -18048 -10002 13989 50 2850 20307 4479 2046
526 2046 11781 -9716 -13539 380 -16036 -14109 7995 -4185 -491 26233 6258 -4352 22440
539 22440 377 -23728 5130 -6831 -32387 6847 10238 -21108 16716 32589 -12035 7350
551 7350 28591 -21786 -16641 16355 -26688 -28120 22477 -4317 -17751 34162 17449 -13792 26173
564 26173 12189 -31502 1569 5024 -37812 -7326 16279 -15731 6088 32013 -1447 5972
576 5972 27129 -11559 -16665 7200 -20963 -24393 7352 -8286 -7877 27198 10513 -201 27129
589 27129 5058 -16780 8108 -11673 -34166 4466 -1304 -26027 17686 24403 -9816 21338
$$ packed form
500h790m575L5502l1678j7083L8586j6581k1555M1994j561k9458L1023P798l5150
513a1528J4559Q677l2219R102J6933k3572Q046K3991j3939K800J7457j5828k433
526B046R735k1497l823J3919j6416J927K2104j2180L694K6724j9975j0610K6792
539B2440k2063k4105K8858j1961k5556L9234L391l1346L7824J5873m4624J9385
551G350K1241n0377N145L2996m3043j432N0597k6794j3434N1913j6713l1241L9965
564B6173j3984m3691L3071L455m2836L0486K3605l2010K1819K5925l3460P419
576E972K1157l8688n106K3865k8163l430L1745j5638M09L5075j6685j0714K7330
589B7129k2071k1838K4888j9781k2493L8632n770k4723M3713O717l4219L1154
$$ plain form
601 21338 27535 -19654 1590 15830 -36359 -19205 17674 -25285 -15430 35328 -1196 -9229 41451
614 41451 6736 -23705 21741 345 -39076 5779 2667 -35085 11858 23994 -20944 12348
626 12348 35522 -14798 -3286 22687 -20331 -16317 14654 -19483 -16470 22872 -4632 -10721 27782
639 27782 3231 -13489 21543 722 -23472 11369 740 -23747 10846 5443 -19613 16894
651 16894 14004 -23317 12120 20655 -25063 41 21542 -22346 -4633 23568 -20250 -8897
663 -8897 28821 -15923 -16807 30809 -7308 -23743 30492 3433 -29443 22766 11973 -30683 11559
676 11559 13228 -30286 8033 19034 -28660 5282 31953 -20678 -5464 31574 -14383 -16756
688 -16756 21141 -13891 -21114 19504 -6865 -16837 26063 4148 -15765 26178 7510 -25453
$$ packed form
601B1338O197m7189K1244J4240n2189J7154L6879m2959R855N0758l6524q033N0680
614D1451l4715l0441M5446k1396l9421M4855l112l7752M6943J2136m4938L3292
626A2348K3174n0320J1512K5973m3018M014L0971l4137L013L9342k7504o089L8503
639B7782k4551j6720L5032k0821k4194L4841j0629k4487L4593n403k5056L6507
651A6894k890l7321L5437Q535m5718K5104K1501m3888J7713K8201m3818J1353
663h897L7718m4744q84M7616l8117j6435N4235k7059l2876N2209j0793m2656M2242
676A1559J669m3514L8319J1001m7694L3942K6671n2631J5214L7038m5957k373
688a6756L7897l5032p223M0618k6369r972M2900k1915j9913M1943j8668l2963
$$ plain form
700 -25453 12367 6680 -30421 1345 8072 -21149 10381 18695 -15952 14527 27923 -21301 -3598
713 -3598 22120 -25301 -19293 18202 -17339 -15078 28152 -1762 -9019 34673 2079 -20618 24812
726 24812 -2005 -40192 10308 7407 -35788 7906 24623 -16131 13502 29581 -16591 3866
738 3866 23796 -29302 -18134 20009 -23415 -22336 27231 -1061 -12128 32099 9667 -13784
750 -13784 20639 -273 -27196 9234 -4029 -33795 10998 15503 -21491 13253 28290 -10844
762 -10844 7015 18214 -20730 -5252 11319 -28416 -11768 22069 -15428 -8395 33223 -3
774 -3 -11213 27732 -455 -23491 13278 -5139 -28095 13176 2844 -24767 21113 21456 -22325
787 -22325 11515 26176 -21782 -5501 16658 -23311 -9939 18568 -17013 -7585 28791 -6373
$$ packed form
700b5453L7820n687l7101L1766O727k9221L1530Q314l4647L0479J3396m9224J7703
713c598K5718m7421O008L7495l5541K261M3230k9914p257M3692l2594k2697M5430
726B4812k6817l8187N0500k901m3195M3694J6717m0754K9633J6079m6172K0457
738C866J9930n3098J1168L8143m3424J079M9567k8292j1067M4227k2432k3451
750a3784L4423k0912k6923L6430j3263k9766M4793M505l6994L4744J5037l9134
762a0844J7859J1199l8944J5478J6571l9735J6648L3837l7497P033M1618l3226
774cj1210L8945k8187k3036L6769j8417k2956M1271j0332k7611M5880L43m3781
787b2325L3840J4661m7958J6281K2159l9969J3372K8507l5581R428L6376l5164
$$ plain form
799 -6373 -11370 28556 -2143 -21344 18218 -378 -26980 10393 5637 -19683 12747 11350 -16600
812 -16600 14992 16177 -23031 3010 17916 -22245 -7242 16903 -14707 -4879 20597 -10179
824 -10179 -5603 23575 -8117 -13030 20578 -6824 -20280 18306 -229 -22487 15750 9236 -17916
837 -17916 12210 10936 -18910 10072 12768 -24065 1987 19156 -19788 -5473 21161 -12023
849 -12023 -7440 20722 -8805 -11259 19959 -5281 -15760 17080 -1428 -17547 16356 4191
861 4191 -20588 11891 10680 -18396 5333 11128 -15605 4964 12581 -16991 1464 17353 -14911
874 -14911 -5714 16970 -10200 -8094 16526 -7480 -10033 17662 -2768 -12789 15243 -79 -15144
887 -15144 13161 1938 -18668 11025 9146 -17611 6294 12327 -13961 3746 12551 -15485 -102
$$ packed form
799f373m997L9926l0699j9201L9562j8596k6602L7373m756k5320L2430j397k7950
812a6600L1592J185l9208K6041J4906m0161J5003K4145l1610R828K5476l0776
824a0179M576K9178l1692m913L3608k7402j3456L8586j8535k2258L8237o514k7152
837a7916L0126j274k9846K8982K696l6833K6052J7169l8944J4315K6634l3184
849a2023M583K8162k9527k454L1218k5240j0479L2840j8508j6119L3903j2165
861D191k4779L2479j211k9076K3729N795k6733K0569P617k9572J8455J5889l2264
874a4911R197K2684k7170K106K4620k4006k553K7695k0430j0021K8032j5322j5065
887a5144K8305j1223k0606K9693j879k6757K3905O033k6288J7707Q805k8036J5383
$$ plain form
900 -102 15536 -14306 -6848 16628 -8013 -8040 16244 -4496 -9936 15969 -1506 -14188 11650
913 11650 1508 -14305 9167 3626 -14742 9594 9878 -14642 3966 11586 -11895 -98 9768
926 9768 -12548 -1636 12769 -10176 -5248 14844 -4545 -5932 13040 -4071 -9051 11734 -2595
939 -2595 -13356 8929 2301 -11616 7928 4941 -10221 8353 8376 -12895 2362 9705 -11711
952 -11711 -2141 8463 -9773 -1762 12029 -6923 -4138 13603 -2463 -6837 9683 -2932 -9213
965 -9213 8382 -1978 -11742 7687 4064 -8774 6393 6118 -7620 5917 6534 -11024 420
978 420 7231 -9631 -3201 7057 -6278 -834 10174 -4397 -3322 10989 -1817 -7066 6651
991 6651 -2021 -7473 5933 -1121 -8580 7124 4952 -7021 4641 5351 -6441 2733 3854 -8984
$$ packed form
900a02J5638k9842P458K3476k4641k7K4284k0740n440K5905j7475j2682K5838
913A1650j0142j5813K3472n541j8368K4336K84k4520J8608P620k3481J1797R866
926I768k2316J0912J4405k2945M928K0092j9389j387J8972j7111m980K0785j4329
939b595j0761K2285o628j3917J9544k987j5162J8574K3k1271J5257P343k1416
952a1711R570J0604j8236Q011J3791j8952K785J7741j6066m374J6520j2615o281
965i213J7595j0360r764J9429l623j2838J5167k75j3738J3537O17j7558J1444
978D20O811j6862O430J0258j3335N444J1008j4571J075J4311j2806n249J3717
991F651q672n452J3406p054p459J5704k172j1973J1662P10j1792R174J121j2838
$$ plain form
1005 -8984 -135 6380 -6606 -2287 7229 -2660 -752 7175 -3492 -3881 6982 -2430 -7010 4296
1019 4296 -149 -4631 5098 1143 -4558 5669 3554 -6170 1130 2545 -5775 -202 2047 -5536 1543
1034 1543 6992 -2530 -10 6445 -1425 -2503 2761 -4775 -4495 3175 -1915 -4340 4995 3230 -794
1049 -794 5459 2193 -3458 2243 -95 -7658 -2446 597 -3806 210 3673 262 3759 6699 -49
1064 -49 -1191 2315 -2947 -5338 -2088 -4199 -3139 2646 1374 479 5602 5028 1103 1363 -907 -3753
1080 -3753 -2622 -3088 -5643 -1699 1685 1072 3042 4282 3259 3002 2015 -2494 -3463 -1956 -3577 -3912
1096 -3912 -1799 -269 1695 4175 3379 2467 3064 1986 -1418 -2817 -3113 -3205 -2626 -1706 -723 1163 3645
1113 3645 4119 2003 1286 2127 -939 -2753 -2408 -3084 -2647 251 235 -856 3175 3963 764 1382 1579 -2027
$$ packed form
1005h984Q849O515j2986M319R516r889J908P927j0667l89J0863r412m580J1306
1019D296m445m482R729l955n701J0227k115r724P300J415q320N573K249p583P079
1034A543N449r522K520O455p870j078N264p536K80P670n090k425R335j765m024
1049g94O253l266n651N701k338p563N212L043m403M016L463l411L497K940o748
1064d9j142L506n262k391L250k111J060N785j272q95N123n74l925K60k270k846
1080c753J131m66k555L944L384o13J970J240j023k57r87m509r69J507j621l35
1096c912K113J530J964K480p96r12N97j078l404j399k96r2N79R20R83J886K482
1113C645M74k116p17Q41l066j814L45o76M37K898j6j091M031P88l199O18J97l606
$$ plain form
1131 -2027 -1216 -387 -4291 -2003 2155 -553 -676 3661 1468 87 2996 -259 -3066 1239 -296 -4118
1147 -4118 63 1130 -1780 1739 1892 -2069 1620 3038 -2222 -909 1978 -2280 -635 1980 -2442
1162 -2442 -1137 3332 -1286 -2040 2844 -453 -1946 3425 -652 -2872 3997 742 -4240 1996 1174
1177 1174 -5019 1298 1770 -5118 1931 5041 -3423 552 5764 -2881 -1679 4300 -4468 -4121 4195
1192 4195 -2826 -4844 5442 1415 -2799 6242 2466 -4567 3625 1428 -7801 63 1755 -6308 640
1207 640 4918 -3237 2237 7546 -2492 -464 5121 -4196 -4276 2668 -4781 -4130 5300 -581 -2345 7886
1223 7886 1937 -3495 4882 -280 -7340 1910 -572 -8883 2533 4401 -5098 4276 7327 -4269
1237 -4269 1902 6394 -7845 -3844 4500 -7558 -4916 7214 -2141 -2678 10521 1643 -4511 7760
$$ packed form
1131b027Q11Q29l904K288M158k708j23M337k193j381K909l255k807M305j535l822
1147d118M181J067k910L519J53l961L689J418n260J313K887m258J645K615m422
1162b442J305M469m618p54M884l297j493N371m077k220O869l255m982O236q22
1177A174o193O317M72o888P049L110q464L975N212q645J202N979q768L47Q316
1192D195p021k018J0286m027m214R041l776p033Q192k197r229P864J692q063O948
1207F40M278q155N474N309j0038K028N585r317q0O944p449O51R430n881j764J0231
1223G886n949n432Q377n162p060R250k482q311J1416J868r499R374L051j1596
1237d269O171M492j4239M001Q344j2058K642J2130r355n37J3199q878o154J2271
$$ plain form
1251 7760 303 -9307 2273 -492 -10158 2828 4371 -6076 5167 9572 -3967 1819 7377 -6840
1265 -6840 -4161 3661 -8445 -5650 6371 -2916 -2031 10327 1538 -2040 9175 -395 -7939 3814
1279 3814 -2436 -10534 2324 1083 -6919 6861 7316 -4486 6245 7672 -7770 60 4127 -10963
1293 -10963 -3925 5528 -7610 -2865 10940 -1443 -1751 11913 -1160 -6334 7828 -2684 -11381
1306 -11381 4915 130 -10561 5602 5971 -6943 5990 8322 -7127 2150 7365 -9462 -2930
1319 -2930 6746 -8197 -4091 9377 -3643 -3987 10465 -886 -5293 7948 -1027 -7656 6456
1332 6456 -650 -9164 5907 2332 -8476 5202 5236 -7681 3615 6031 -8150 1392 6422 -8519
1346 -8519 -142 8066 -7957 -2241 9766 -5912 -5163 9978 -2976 -6851 9178 -1244 -7307
$$ packed form
1251G760p457r610J1580k765r666J2986J543j0447J1243M405j3539N786N558j4217
1265f840K679P822j2106K795J2021r287Q85J2358q789l578J1215r570p544J1753
1279C814o250q098J2858j241q002J3780M55j1802J0731J427j5442P830M067j5090
1293a0963P038R453j3138M745J3805j2383l08J3664j3073n174J4162j0512q697
1306a1381J6296m785j0691J6163L69j2914J2933K332j5449R277N215j6827O532
1319b930R676j4943M106J3468j3020l44J4452j1351m407J3241q975o629J4112
1332F456p106q514J5071l575j0808J3678L4j2917J1296K416j4181R542N030j4941
1346h519Q377Q208j6023N716J2007j5678P49J5141j2954l875J6029j0422o063
$$ plain form
1359 -7307 9167 508 -9851 7675 3126 -11460 4952 6334 -10437 2490 8740 -8368 580
1372 580 9486 -7141 -1722 9358 -7093 -4493 9935 -5045 -7029 9840 -462 -7276 8356
1385 8356 1465 -7598 6810 1429 -9398 5346 3260 -9921 3967 6391 -8497 2045 8328
1398 8328 -7351 -508 7901 -7348 -2508 7842 -6620 -3297 9895 -5028 -5536 11082 -1531
1411 -1531 -8166 8483 248 -9073 6876 1429 -9515 6647 4600 -10077 5452 7847 -10213
1424 -10213 1559 9184 -9537 -2500 9320 -6802 -3821 9214 -4500 -4170 10520 -3390 -7190
1437 -7190 10167 -935 -10080 7295 1964 -9685 5170 4214 -7743 5084 5621 -8542 3302
1450 3302 6363 -9502 253 7791 -8425 -2168 9171 -5277 -3097 9405 -3336 -3751 8433
$$ packed form
1359g307J6474q659j0359J7526m549j4586J6412J382j6771J2927O250j7108Q948
1372E80Q906j6627N419J1080j6451K600J4428j4980j984J6869j0302o814J5632
1385H356o891r063J4408n381j0827J4744k086j3181J3888K424j4888J0542O283
1398H328j5679O843Q409j5249M840J0350j4462L323J3192j4923n08J6618j2613
1411a531o635J6649q235r321J5949n447j0944J6162k047j4677J5529K395j8060
1424a0213J1772P625j8721P037J1820j6122K981J3035j3714L30J4690j3910l800
1437g190J7357j1102r145J7375n331j1649J4855r56j1957J2827N37j4163J1844
1450C302L061j5865R755P538j6216O257J1339j4448K180J2502j2741m15J2184
$$ plain form
1463 8433 -3783 -6901 8344 -1973 -9257 7842 2426 -8769 6216 4348 -7987 4787 5353
1476 5353 -9285 1844 5929 -9473 -142 9025 -7849 -1829 11116 -4551 -4657 9146 -2707
1489 -2707 -6032 7334 -2858 -7964 8090 55 -8627 7686 4167 -8401 5119 5620 -8953
1502 -8953 2223 4828 -8524 20 6015 -7603 74 8594 -5720 -1313 9989 -4691 -4801 7749
1516 7749 -3083 -6993 6094 -2410 -6559 7305 839 -6817 7922 3856 -8067 4592 4198 -9181
1530 -9181 1303 5211 -8527 565 7287 -5942 430 9046 -5205 -2346 8745 -4864 -6453
1543 -6453 7536 -2596 -7250 6814 756 -6007 7093 2973 -6934 5337 3178 -8713 2253
1556 2253 3764 -8434 550 6339 -5437 949 7971 -4566 -1582 6584 -4801 -4100 5918 -4272
$$ packed form
1463H433j2216l118J5245j0317p284J7099n416j1195J4985j868j2335J2774N66
1476E353j4638J1129M085j5402R331R167j6874O020J2945j5667j06J3803j1853
1489b707l325J3366j0192n106J6054q035q682J6313l519j2568J3520N01j4573
1502h953J1176K605j3352Q544N995j3618P677Q520j4314M407J1302j4680j10J2550
1516G749j0832l910J3087q504m149J3864o466p656J4739m066j1923J2659l94j3379
1530i181J0484L908j3738R092O722j3229O372Q616j4251K859J1091j3609j589
1543f453J3989j0132m654J4064o058o763J3100m120r907J2271k159j1891J0966
1556B253J511j2198Q984N789j1776O386P022j2537K984Q166j1385P01J0018j0190
$$ plain form
1570 -4272 -5478 7170 -336 -5020 6880 1782 -5080 5503 1141 -7745 2809 1349 -8218 2106
1584 2106 5049 -5630 2952 7646 -4654 496 6762 -5723 -3580 4724 -5725 -4760 5849 -2023
1598 -2023 -3466 8374 1401 -4281 6418 1706 -6954 2350 37 -8386 1611 2946 -5702 2807
1612 2807 6595 -3282 1935 6535 -4498 -1989 4608 -5453 -4952 4036 -3422 -3106 6072 382 -2178
1627 -2178 7015 1331 -4645 3789 195 -7031 1256 692 -6241 2824 4103 -4075 2652 5630 -3534
1642 -3534 325 4357 -4867 -2252 3888 -4043 -3305 4872 -1541 -2650 5900 -184 -3195 4674 258
1657 258 -5233 2690 701 -5266 2064 2383 -4682 1609 4039 -3993 724 4389 -3558 -658 3928
1672 3928 -2950 -1359 3778 -2409 -2409 3725 -1217 -3112 3471 -224 -2928 3455 1395 -3412 2613 1581
$$ packed form
1570d272j206J2648p506m684J1900n098o862J0583m362q886J0554j460r567J0324
1584B106K943j0679Q582M694j2300N150O266j2485K143Q304j0449R65J0609p872
1598b023j443J1840o973n682J0699m712q660R304k313q423R997J335q648Q509
1612B807L788r877N217M600j1033K509O597j0061N01Q988p458L16R178n690k560
1627b178R193n684n976Q434l594p226Q287n64o933R065J279q178O727K978r164
1642c534L859M032r224K615O140p931P38Q177o413j109Q550o084l011P869m416
1657B58n491P923j989n967P330L19p065O291K430q032M717L665p947K900M586
1672C928o878J591N137o187%O134m942j895O583l695k704O383k060m807O025j032
$$ plain form
1688 1581 -3644 1184 1003 -3892 471 2393 -3216 1297 4118 -1942 475 3740 -2406 -1496 2553
1703 2553 -2825 -3236 2710 -609 -2236 3841 1349 -1522 3278 1194 -2953 631 118 -4596 -527
1718 -527 1231 -2487 1020 3358 -821 1349 3773 -1092 -1401 991 -2742 -2878 748 -1803 -1697 3147
1734 3147 1504 229 3165 1581 -1558 595 -1192 -3908 -1067 -579 -2345 901 2477 607 2756
1749 2756 3350 -328 200 514 -3147 -3203 -569 -2525 -1230 2131 1097 1037 3779 2325 -395 832 -909
1766 -909 -3147 -1729 -1831 -2831 25 1675 990 2134 3134 1305 539 237 -1936 -2408 -1587 -2260 -1996
1783 -1996 327 982 1411 2594 2033 1270 833 -332 -1663 -2130 -2042 -1923 -1058 208 1222 2029 2088 1929
1801 1929 1244 338 -97 -1168 -2422 -2108 -1749 -1007 349 1070 1889 2288 2148 933 346 -670 -1963 -1761
$$ packed form
1688A581n225M828j81m895M363J922n609M513K821o060K417L265o146R10M049
1703B553n378m11N946l319j627O077k492k871M800k084m147L584n13m714M069
1718e27J758l718L507K338m179K170K424m865l09K392l733j36L626k551J06M844
1734C147j643j275K936j584l139K153j787k716K841M88j766L246J576j870K149
1749B756N94l678N28L14l661n6K634j956J295L361j034o0K742j454k720J227j741
1766i09k238J418j02j000K856J650o85J144J000j829p66l02k173m72Q21o73K64
1783a996K323O55M29J183n61p63m37j165j331m67Q8J19Q65J266J014Q07N9j59
1801A929o85r06m35j071j254L14L59P42J356P21Q19L99j40j215n87j016j293K02
$$ plain form
1819 -1761 -1849 -1788 -491 685 345 1553 2397 1262 753 598 -1024 -1749 -434 -1378 -1929 443 537 135
1837 135 2145 1338 -245 1737 1210 -1988 -268 28 -2409 -761 1028 -1240 79 2193 -150 -81
1853 -81 2411 -114 -1096 1037 -775 -2059 892 -390 -1677 981 832 -1678 1156 1225 -1243 1067
1869 1067 1622 -2076 -94 1654 -1690 -590 1728 -1775 -869 2131 -1225 -852 2934 -173 -1069 2518
1885 2518 -40 -2015 1627 -786 -3051 1173 418 -2462 1463 2026 -1813 1990 2656 -1951 361 2138
1901 2138 -2979 -1613 1839 -2430 -1273 2851 -761 -957 3694 164 -1783 2704 -392 -3334 1493
1916 1493 -294 -3518 1895 1565 -2743 1877 2692 -2167 798 2571 -3358 -1102 2242 -3261 -1729
1931 -1729 3102 -1241 -1256 4066 -632 -1858 3436 -634 -3189 1872 -125 -3769 2253 1229 -3289
$$ packed form
1819a761q8O1J297J176l40J208Q44j135n09j55j622p25J315r44n51K372R4m02
1837A35K010q07j583J982n27l198J720K96k437J648J789k268J319K114k343O9
1853h1K492k525r82K133j812j284K951j282j287K658j49k510K834O9k468K310
1869A067N55l698J982J748l344J100K318l503R06L000l356L73L786l107q96L587
1885B518k558j975L642k413k265M224p55k880L925N63l839L803O66m607K312J777
1901B138n117J366L452m269J157M124l612j96M651l530j947M487l096k942M827
1916A493j787l224N413l30m308M620Q15m859K965J773n929K256L344n503J532
1931a729M831m343j5N322m698j226N294m070k555N061j997l644O022j024m518
$$ plain form
1946 -3289 2892 2719 -3080 1806 2572 -3936 -457 2220 -3835 -580 3720 -2629 -731 4923 -1270
1961 -1270 -1763 3837 -1671 -3321 3004 -1076 -4334 2898 833 -3024 3514 2570 -3214 2253 2875 -4190
1977 -4190 182 2747 -4412 -882 3455 -3358 -193 4801 -1822 -873 4790 -1636 -2806 3518 -1631
1992 -1631 -3928 3019 40 -3624 3565 1846 -3097 3651 2079 -4097 1713 2282 -5370 -79 2693
2007 2693 -4566 -267 4332 -2505 -291 5663 -2170 -1834 4128 -2383 -3850 3462 -1161 -3984 3894
2022 3894 740 -3507 3769 1912 -3768 2543 2112 -5043 692 2456 -5099 321 4229 -3496 -400
2037 -400 5427 -2384 -1372 4637 -2568 -3072 3815 -1778 -4027 4296 -499 -3753 4413 1278 -4253
2052 -4253 3325 1933 -4748 1641 1937 -5058 957 3473 -4593 708 5080 -3408 -517 4593 -3106
$$ packed form
1946c289O181j73n799M886P66o508L479K677o055L255M300o349J898N654o193
1961a270m93N600n508j650O325m080l258P232k065l857O538r44n784N467O22p065
1977d190M372K565p159L530M337o813L165M994o623R49N663o426j170O324n149
1992a631k297O947k979l664P189j719m943O748j572o176N810N69p652N291K772
2007B693p259M299M599o837K214N954p833L36N962o511j467P312m623k823P878
2022C894l154m247P276j857n680O311m31p155N735J764p555N420L908p725L096
2037d00N827p811J012O009p205n04O887n593k249Q323m795l254Q166l135n531
2052d253P578j392o681O389K96o995O015K516q066N301M372q488K891N110p699
$$ plain form
2067 -3106 -2359 4368 -2860 -3431 4702 -1454 -3506 5106 700 -3927 4272 1585 -4873 2347 1659 -5383
2083 -5383 1379 2723 -4336 1199 4281 -3793 410 5019 -3752 -2044 4646 -3439 -3108 3925 -1594
2098 -1594 -3128 4955 -398 -2873 5146 664 -4727 3389 908 -5646 1934 2370 -4583 1851 3842
2113 3842 -3506 1556 4447 -4107 -607 4255 -4188 -2469 4515 -2794 -2718 5217 -817 -2846 4993
2128 4993 159 -3889 3551 -207 -5927 2396 877 -5488 2565 3208 -3860 2043 4085 -3784 -99
2143 -99 3480 -4304 -1475 3688 -3749 -2071 5305 -1600 -2473 5264 154 -3319 3707 -6 -4421 2947
2159 2947 298 -5156 2766 2224 -4427 2289 3467 -4115 924 4171 -3794 -483 3892 -3699 -1501
2174 -1501 3976 -2821 -1615 4817 -1858 -3014 4907 -117 -3918 4035 606 -3947 3148 1127 -4466
$$ packed form
2067c106P47O727p228n71Q133o156k052Q612m406m627Q199k687o458P220o88p042
2083e383O762J344p059N535L082q074M203M609q771J708O690q085L31P033n519
2098a594j534Q083n353k475Q019m482n391Q116k481o554P580M36o953O434J991
2113C842p348N062K891q554L500M862q443J719O984p309P6P935o034k029P839
2128D993m834m048P440l758n720Q323j519o365Q053O43p068N903K042p869L685
2143i9L579p784K829N163p437J678P376o905q73P737n110l473P026l713m415P368
2159B947k649n454P922n42o651O716J178p582N039L247p965L311M375p591K198
2174a501N477o797J206O432o675j156P921n024l801P953l429m553P095k021n593
$$ plain form
2189 -4466 2428 1614 -4928 1516 3141 -4232 700 4599 -3372 32 4299 -2974 -1591 3801 -3123
2204 -3123 -2447 3928 -1774 -2923 4427 244 -2943 4278 1292 -3620 2078 943 -4900 1157 1476
2219 1476 -4598 1242 3487 -3065 1412 4558 -2586 -742 3613 -3254 -2387 3317 -2472 -2528 4186 -361
2235 -361 -2026 4675 749 -3352 3299 674 -4657 1294 432 -4534 1370 2594 -2986 1718 4256
2250 4256 -2509 333 3043 -3576 -1778 2549 -2948 -2432 3293 -918 -1380 4245 437 -2003 3325
2265 3325 -120 -3919 1719 212 -4374 1485 2137 -2836 2590 3541 -2389 1259 2619 -3677 -1089
2280 -1089 2189 -3586 -1698 3201 -1463 -786 4766 450 -1729 3419 -549 -3495 1599 -1202 -4324
2295 -4324 1569 1103 -2656 2475 2900 -1824 1557 2714 -3013 -389 1216 -3594 -1384 2301 -1885
$$ packed form
2189d466O894q14o542O444J625p373M932L899p971L404M267p273J383N392o924
2204c123O76O375n702j149P350m183l187P221k986m912N698j135n843O057L19
2219A476o074N840K245o552M477L146p144J844M355o867Q67N704n789n6O714m547
2235c61j665O701l926m101O651k625n331N951q62m966N904J224n580M704K538
2250D256o765K842K710o619J798M327n497N16N725m211m62N625l808k440N328
2265C325l445l799N638j507m586N859O52m973N426R51n930L648J360o296K588
2280a089L278n775J888M899m664O77N552m316k179N148l968k946N094k801l122
2295d324N893m66l759N131M25m724L381J157n727K624J605m810K210L685m186
$$ plain form
2310 -1885 -375 3952 182 -664 3374 -34 -2553 1652 -1285 -3679 950 214 -2762 2336 1847 -1689
2326 -1689 2183 2332 -2196 214 1401 -3300 -770 1722 -2605 -687 3143 -975 -83 3055 -596
2341 -596 -975 2440 -1087 -2686 1420 -154 -2463 1709 783 -1676 1587 1620 -1775 1073 1356 -2204
2357 -2204 -220 1360 -1978 -548 1968 -1456 -474 2318 -524 -1328 2156 -708 -1342 1802 -384 -1615
2373 -1615 1535 226 -1831 1360 258 -1291 941 1001 -1502 389 1309 -1717 439 1426 -1766 -360
2389 -360 1357 -1313 -1161 1749 -863 -469 1846 11 -781 1627 -64 -1864 807 -97 -1663 415
2405 415 693 -1173 676 1557 -1135 560 1532 -1309 -330 623 -1581 -1028 824 -818 -454 1718 31
2422 31 -24 1446 20 -880 437 -665 -1872 -137 -210 -967 654 1088 -86 683 1040 -666 -25 188
$$ packed form
2310a885J510M327l770q46M038l408k519M205k937k394M629p36k976N098m89l536
2326a689L872J49m528K410J187m701K530K492m327J918L830m118Q92L138l651
2341e96l79L415l527j599M106j574k309M172r26k459L263L3l395K848K83l560
2357b204J984J580l338J430K516l424R82K792k842q04L484k864o34L144k186j231
2373a615L150j309k057L191j102j549K232O0k503J891R20l026K156R87l192J406
2389c60J717k670J52K910k612L94K315j835p92K408j691j800K671r04j566K078
2405D15K78j866J849Q81k692J695R72k841R79R53k204N53J852j642L64K172j687
2422C1n5J470j426r00J317j102j207J735p3p57J621M34j174P69L57j706O41K13
$$ plain form
2440 188 -1480 -1091 -32 -941 -350 1024 113 288 1512 201 -244 599 -748 -1320 -161 -438 -1234 468
2458 468 549 14 958 1289 -33 146 309 -816 -652 220 -800 -603 533 178 256 891 -14 -95 588 -238
2478 -238 -509 -434 -74 -476 210 433 41 327 414 25 89 -4 -253 -429 -513 -432 -62 324 349 332 371 423 306
2501 306 10 -25 -572 -571 30 -101 -337 335 461 683 335 364 -153 -301 1 -460 -442 -283 -645 -316 254 449
2523 449 87 897 481 -144 157 -308 -1074 -115 -246 -684 -42 243 -187 713 911 -167 105 458 -433 -436
2543 -436 -16 -685 -874 497 -256 -444 1038 274 -203 761 247 -735 117 370 -1202 -79 373 -946
2561 -946 306 886 -604 -72 1014 -238 -508 989 -704 -455 740 -525 -631 563 -60 -973 619
2578 619 187 -797 857 580 -876 354 489 -1017 539 885 -1004 74 985 -794 -306 1243 -1180
$$ packed form
2440A88j668L89J059r09N91J374r11J75J224j311m45Q43j347n72J159k77p96J702
2458D68Q1n35R44L31j322J79J63j125J64Q72j020J97J136l55P8O35r05q1O83q26
2478b38k71P5L60m02O86K23l92K86Q7l89O4r3k49j76q4Q1L70L86K5j7L9N2j17
2501C06k96l5n47JO01j31k36O72J26K22l48K9n17j48L02m61J8J59l62L29N70J95
2523D49l62Q10m16o25L01m65p66R59j31m38O42K85m30R00J98j078K72L53q91l
2543d36M20o69j89J371p53j88J482p64m77R64n14r82Q52K53j572J123M52j319
2561i46J252N80j490N32J086j252k70J497j693K49J195j265j06J194o23r13J592
2578F19m32r84J654k77j456J230J35j506J556L46j889J078R11j779M88J549k423
$$ plain form
2595 -1180 -299 1434 -485 -707 1196 -367 -1040 861 52 -1256 1059 264 -1199 934 835 -1279 595
2612 595 1070 -1297 402 1257 -1123 -296 1143 -1183 -285 1465 -642 -854 1660 -236 -1017 1088 -273
2629 -273 -1508 1088 -62 -1438 957 251 -1252 514 1134 -1680 612 1203 -1421 511 1105 -1412
2645 -1412 -19 1419 -1017 -816 1674 -1054 -736 1865 -394 -1191 1531 -142 -1637 1349 15 -1978
2661 -1978 1249 695 -1778 1145 1218 -1628 765 1321 -1686 -64 1867 -1566 -402 1979 -1091 -1089 1672
2678 1672 -693 -831 1966 -637 -1391 1764 -41 -1451 1331 364 -1994 1156 880 -1857 604 1246
2694 1246 -1922 248 1469 -1448 -17 1522 -1520 -385 1727 -1361 -1298 1573 -647 -696 2183 -543
2710 -543 -1082 2059 184 -1793 1449 -39 -2409 1103 789 -1953 739 1791 -1306 600 1771 -1539
$$ packed form
2595a180Q81J733j919k22J903j563o73J901q09j308K315p95j463K133r9k114J874
2612E95M75k367J699Q55k380Q27J439k326Q98J750k107k12K514j896p81K105j361
2629b73j235K596j150j376K395p06j503J766O20k814K292N91k624J932N94k517
2645a412J393J438k436K01K490k728L18K601k259p97K722j673j495K986j334j993
2661a978L227n54k473K923P3k846K393N56l007J622J931l433J164K381l070KK761
2678A672k365j38K797k603p54L155j805j410K782r67k358L150k76k737K461O42
2694A246l168K170J221k917J431J539l042J135K112l088O3K871k220m9K879k726
2710e43n39L141j875j977L242j488k370L512l14k742K692J052l097J906J171l310
$$ plain form
2726 -1539 -363 2058 -1796 -1193 1681 -1219 -1079 2166 -144 -1128 1928 -149 -1691 1709 -142 -2454
2742 -2454 712 586 -2048 901 1219 -2020 922 1776 -1724 480 1687 -1404 -717 1312 -1787 -1245
2758 -1245 2200 -770 -1313 2271 -260 -1364 1770 42 -1871 1309 269 -2494 1074 908 -2145
2773 -2145 1143 1658 -1636 910 1915 -1714 -354 1803 -1770 -1001 1484 -1287 -926 2539 -469 -1274
2789 -1274 2500 -246 -1982 1521 -202 -2044 1404 359 -1907 1131 1055 -1530 1122 1278 -1984 -35
2805 -35 1549 -1815 -549 1997 -1296 -460 2298 -1139 -836 1805 -886 -1972 1897 -593 -1819 1395
2821 1395 216 -2246 1341 915 -1805 1298 1106 -1899 446 1252 -2054 -122 1578 -1513 -351 2049
2837 2049 -1188 -510 2393 -997 -1235 1890 -879 -1775 1544 -123 -2036 1688 1043 -1515 1578 831
$$ packed form
2726a539J176K421l854O03K874k900J40L245k310r84L056k077j542L400j851k312
2742b454L166j26k634K949L18l239K942Q54l500K204J207l091O87K029l099N42
2758a245L445k970n43L584k531j104L134j728j913L180j040k763L568j66l053
2773b145L288N15l294K546J005l629J360K157l573P69K485k771L61L465l008q05
2789a274L774k746j736L503j723j842L448j045k266L038p6k585K652J56l262J949
2805c5J584l364J266K546l293Q36K758l437L03K641k691j086L869k490j226L214
2821A395j179k462L587m26k720L103j92l005K345Q06l306J932J700l091J162K400
2837B049l237O78K903l390k38L125k769q96L319j667j913L724o45k558L093p47
$$ plain form
2853 831 -1594 944 1274 -2077 143 1055 -1809 -252 1426 -1449 -617 2058 -733 -719 1708 -595
2869 -595 -1360 1282 -598 -1482 1318 -346 -1700 1675 640 -1860 1195 1074 -1837 746 1356 -1994
2885 -1994 415 1574 -1512 -228 1679 -1729 -734 1755 -579 -857 2079 -127 -970 1946 -105 -1495
2901 -1495 1231 -38 -2261 1129 382 -1857 1059 956 -1459 886 1391 -1689 72 1029 -1922 -475
2917 -475 1554 -1350 -558 1970 -373 -795 1782 -291 -1132 1154 -271 -1553 1039 -75 -1398 1099
2933 1099 899 -1318 928 1000 -1480 291 1389 -1486 19 1088 -1278 -341 1467 -617 -694 1920
2949 1920 -519 -1197 1768 -725 -1513 1305 -277 -1611 993 650 -918 879 706 -1153 591 908
2965 908 -1428 128 1081 -1170 -393 1294 -909 -41 1526 -464 -699 1222 -423 -1229 1114 -152
$$ packed form
2853H31k425K538L30l351K220R12k864J557J678k875Q32K675k791J4K427k303
2869e95p65K642j880q84K800j664j354L375j035k500L055j21k911K583O10l350
2885a994K409J159l086J284J907l408R95K489k334k78K936k206q43K916k051j390
2901a495K726j269k223L390p47k239K916j03k415K345N05l080J761R57k951J447
2917d75K029k904P92K528k343m22K577k073q41K286j425j282K592j114j323K497
2933A099k00k217K246P2k480J771J098k875J505J069k366R37J808k084p7K614
2949A920k439o78K965k493p88K818j582j334K604l43j568J797j73j859J744L17
2965I08k336J556R53k251P77J687k203Q68J567j990k35J921j645q06K343j266
$$ plain form
2981 -152 -1330 905 182 -1075 807 435 -1276 517 588 -1071 293 1053 -1217 20 768 -871 109
2998 109 1163 -672 -298 995 -395 -813 1236 -438 -759 815 -123 -1072 940 407 -967 857 441
3015 441 -1351 391 504 -1113 573 958 -747 267 1142 -702 -226 954 -400 -390 1146 -525 -708
3032 -708 706 85 -846 1032 -17 -913 513 247 -1208 380 259 -1081 341 355 -847 40 854
3049 854 -701 315 742 -631 50 722 -631 -405 943 -249 -622 832 2 -631 636 310 -1073
3066 -1073 717 177 -1013 272 434 -827 105 664 -400 -3 567 -407 -12 916 -540 -575 847 -473
3084 -473 -702 627 -400 -285 491 -154 -256 762 -112 -632 394 -9 -643 338 96 -645 7 299 -736
3103 -736 47 473 -687 -234 621 -286 -273 571 -575 -184 435 -38 -599 380 66 -329 312 2 21 579
$$ packed form
2981a52j178K235p23j257J882l72j711J793P1j659J364P60k270J237P48j639R80
2998A09J054j835L74J293j390m18K049j674l21J574r38r49K012n33j374J824m16
3015D41j792J742J13j617J686L85j705J014Q75j844M76J180j354J0J536j671j83
3032g08J414o21r31J878j049q96J426k66j455J588j21j340J422J4j202Q87Q14
3049H54j555J016M27j373O81O72j353K26J348j192l73J454q30o33J267l26j383
3066a073J790n40j190J285J62j261R32N59j064L97N70r74L95R28j456l5J422j320
3084d73k29J329j027J15P76o45j02J018q74n20J026m03o34R81k42p41O52K92j035
3103g36P83M26j160M53Q55r07J3Q44j146L91O19m73n61R79l14l95O41l10J9N58
$$ plain form
3123 579 337 -289 128 -63 -493 -224 29 -498 -5 527 -162 -149 307 220 40 86 -301 -584 -128 -199 -553
3144 -553 221 414 55 60 38 61 370 113 -263 -79 -228 -229 -159 -81 -79 -291 60 -54 17 94 292 -249 195 53
3168 53 -459 -44 -130 -318 100 6 27 10 110 -123 261 265 -177 66 43 -49 123 -54 -34 189 -19 -171 68
3191 68 355 247 168 -221 108 219 -84 54 -58 -173 149 484 -259 79 86 126 131 492 312 -114 -48 312 -48
3214 -48 -182 -266 -90 -297 205 78 46 20 -158 148 175 -95 -79 443 -111 -354 -46 -202 -151 387 -314 -93
3236 -93 449 108 -55 336 50 -353 12 142 -723 -22 108 -396 416 638 -98 -177 363 -353 30 423 -112
3257 -112 67 27 -309 -304 543 142 -153 539 -46 -168 142 -95 -441 102 156 -238 348 445 -578 -9 112
3278 112 57 141 391 -258 62 329 -551 -368 455 -370 -124 534 -273 -325 341 -173 -772 178 161 -595 564
$$ packed form
3123E79k42o26M17j91m30K69K53n27M93N32o89J3M56q7j80M6l87k83M56p1l54
3144e53P74J93l59Nk2K3L09k57l76J84j49jP0P8Kk12L51j14P1P7J98n41M44j42
3168E3n12M15q6j88M18r4K1j7J00k33L84Mm42K43k3r2J72j77K0K23k08j52K39
3191F8K87j08p9l89L29J11l03J38j12j15L22L35p43L38PM0NL61j80m26O6L60l60
3214d8j34q4J76k07N02j27l2k6j78L06K7k70J6N22n54k43L08j56N1N38p01K21
3236i3N42l41j63L91k86m03L65J30q65P01J30n04Q12K22p36p9N40p16L83L93n35
3257a12J79m0l36NQ47m01k95O92n85j22L10k37l46N43N4l94N86R7j023N69J21
3278A12n5Q4K50o49L20K67q80J83Q23q25K46O58q07n2O66n14n99R50j7p56J159
$$ plain form
3299 564 377 -477 96 159 -250 168 341 -782 -184 474 -588 -211 403 -408 22 601 -141 -150 442 -42
3319 -42 -390 471 -8 -971 245 362 -649 430 239 -468 132 317 -640 -299 820 -491 -441 847 -19
3338 -19 -161 831 -214 -465 728 -214 -360 855 0 -394 592 201 -285 660 318 -623 383 21 -669
3357 -669 209 500 -448 231 883 -314 -39 879 -570 -362 846 -294 -586 885 -179 -629 616 77
3375 77 -788 766 170 -713 483 95 -831 -7 324 -621 -79 754 -443 42 736 -544 -167 719 -459
3394 -459 -239 742 -162 -665 708 76 -491 798 227 -951 596 375 -531 461 221 -737 386 569
3412 569 -812 253 886 -659 -102 580 -611 -117 914 -543 -230 758 -666 -905 543 -202 -851
3429 -851 709 291 -624 585 75 -691 241 761 -917 -193 208 -771 136 861 -830 -347 790 -896
$$ packed form
3299E64j87q54N73O3m09M18J73j123N98O58j062L77O14q11M30N79p42rN92m84
3319d2l48Q61m79r63J216J17j011J079j91p07O00J85r57L41J119j311N0J288q66
3338a9j42R92j045k51J193r42j46J215q55l94R86l91m86R45l42r41J006l62o90
3357f69Q78K91r48O79O52j197K75R18j449K08J208j140k92J471j064m50J245n39
3375G7q65J554n96q83J196l88r26Q24L31r45N42Q33j197M85O94j280L77Q86j178
3394d59K20R81r04n03J373o32n67J289n71j178J547k21r06R92k40r58J123J83
3412E69j381J065O33j545N57O82j191M94J031j457L13R88j424k39J448p45o49
3429h51J560m18r15J209n10p66R32N20j678P24M01r79R07P25j691M83J137j686
$$ plain form
3447 -896 -339 644 -531 -387 844 241 -746 524 -256 -817 710 108 -822 555 384 -400 344 711
3465 711 -912 297 613 -1052 -111 495 -654 -157 963 -462 -283 800 -276 -450 712 -326 -762
3482 -762 676 42 -999 614 52 -933 424 389 -850 297 702 -681 -43 648 -735 -71 483 -827
3500 -827 -521 1047 -433 -609 638 -229 -479 627 -235 -651 926 199 -822 343 183 -1128 278
3517 278 688 -1043 380 537 -753 119 776 -954 -134 686 -202 -274 645 -446 -386 1138 -383 -603
3535 -603 983 24 -667 798 159 -833 687 567 -985 373 454 -753 207 616 -720 -65 752 -764
3553 -764 -255 605 -580 -270 608 -571 -556 947 -335 -844 896 70 -492 653 -112 -931 411 139
3571 139 -900 358 321 -742 142 843 -638 246 652 -417 -116 884 -171 -432 713 -353 -628
$$ packed form
3447h96N57R83j175J44J231o03r87J270p80n61J527o02r30J377j71p84P44L67
3465G11j623J209L16j665R41O06j149M97J120j425J79J083j076j74J162j038m36
3482g62J438o34j041J613n62r85J357l5j239J147M05j383O38O91j383O64N54j310
3500h27L06J568j480j76J247q67k50J106q62m16J577p27j021J165j60j311J406
3517B78M10j731J423J57j290Q72O57j730Q20Q20q88p2R19j091O0J524j521k20
3535f03J586r59o91J465o39r92J520j20j552J358Q1j207R60M09j336O55Q17j516
3553g64N09Q60j185L10Q78j179J5J503j282n09J740q26n62J145p65q19J342k72
3571A39j039J258l7j063Q84P01j481Q84M06j069L01J000j055k61J145j066k75
$$ plain form
3588 -628 787 -293 -956 626 83 -629 588 466 -732 407 446 -557 448 620 -789 199 648
3605 648 -587 -400 712 -524 -303 965 39 -524 862 -271 -591 799 82 -437 592 49 -521
3622 -521 633 285 -634 72 442 -449 391 762 -425 -215 736 -443 -170 713 -263 -479 492 -400 -553
3641 -553 508 170 -619 652 -73 -749 560 185 -407 524 159 -450 -18 31 -471 304 439 -746 -110
3660 -110 447 -459 -262 1032 -236 -538 480 -178 -550 714 -124 -334 173 -30 -368 408 467 -384 360
3679 360 271 -565 75 496 -460 -66 199 -341 -63 568 -583 -123 628 -104 -237 494 -438 -228 480 -155
3699 -155 -713 427 -240 -401 432 220 -453 48 357 -318 186 399 -402 -160 403 -438 -105 442 -44 -475
3719 -475 533 -69 -196 555 -237 -331 336 103 -445 225 228 -582 264 184 -587 74 343 -442 221 265 -360
$$ packed form
3588f28J415j080o63J582n43p12J217j22j198J139L9j003J005J72j409R88M49
3605F48j235J87J112j236K21J268r26n63J386j133l20J390p17n19J029n43n70
3622e21J154l48r19P06L70q91Q40L71j187K10R51j179K73Q83r76k16R71q92j53
3641e53J061l38p89J271p25o76J309l75n92R31l65o09M32M9n02P75J35j185O36
3660a10N57r06J97J294j268l02J018o58l72J264q38k10N07k03l38P76N9q51P44
3679C60q9q36O40M21r56L94K65n40K78O31j151M60P51p32j33P31r32K10P08o35
3699a55n58J140o67j61Q33k12o73N01L09o75N04K13q01K42N63q41L33N47m86m31
3719d75J008o02j27P51p92r4O67k33n48O70Lq10Q46q0p71O61K69p85O63M4o25
$$ plain form
3740 -360 -320 -8 -107 -174 486 -518 -470 654 -330 -161 235 -56 -135 516 -294 -482 119 207 -175 397 497
3761 497 -424 211 447 -616 -132 684 -365 -25 246 -291 5 357 -84 -160 315 12 -197 153 -27 44
3781 44 99 -76 -226 -132 210 -378 356 253 -218 318 154 -148 -204 340 -53 -137 121 -137 -206 583 -49 -36
3803 -36 419 -43 -238 152 -82 -73 109 93 -327 -147 276 -292 455 53 250 25 339 216 26 326 -283
3824 -283 -212 256 -216 -81 246 -110 -99 217 -255 62 -16 -125 -492 228 358 82 -102 294 -87 178 354
3845 354 -389 6 -106 -41 -187 253 -42 7 -161 26 -432 -130 148 -94 -147 245 397 57 237 107 338
3866 338 160 -304 -82 16 -183 -354 156 123 -63 299 3 30 217 4 88 125 -288 37 -146 0 119 -38
3888 -38 292 70 -20 23 0 149 103 -231 -174 -109 -71 -93 83 -43 69 -24 179 21 104 -160 -32 -170 12 -79
$$ packed form
3740c60M0L12r9o7O60j004M8J124r84J69L96k91p9O51q10j88O01Q8l82N72J00
3761D97r21O35K36j063M84Q16j049L40K71n37K96L52m41p6M75l03k09L50j80P1
3781D4N5j75j50R4L42n88P34j03m71N36j64l02n6N44l93q4K58k58o9P89o32J3
3803c6M55m62j95L90k34RJ82j6m20J80M23n68P47m02J97k25L14j23j90L00o09
3824b83P1M68m72J35L27l56J1L16m72L17p8j09l67P20J30k76j84L96l81K65J76
3845C54p43L95j12O5j46M40k95M9j68J87m58L02K78k42n3L92J52l40J80j30K31
3866C38j78m64K22R8j99j71N10l3j86L62k96K7J87k13Q4L7m13L25j83J46J19j57
3888c8L30k22r0M3k3J49m6l34N7O5L8k2J76j26J12r3K03j58Q3k64J28j38J82r1
$$ plain form
3912 -79 129 193 92 1 -64 -49 -156 93 139 -199 -17 84 -153 -137 -40 33 -90 233 -59 -223 -43 113 -304
3935 -304 -150 179 -6 240 158 -9 -45 120 -244 300 16 -188 226 102 -224 169 14 149 6 -173 -257
3956 -257 -237 -59 102 87 -12 -111 -321 -27 217 -201 184 153 -78 -84 154 -215 -391 292 84 -143 -6 255
3978 255 -279 43 -158 -181 322 -18 99 146 31 -262 191 202 -294 -47 -14 -172 40 342 -271 -53 342
3999 342 -226 39 47 -104 -332 -52 -145 -184 52 -12 -378 187 57 -400 165 355 -206 146 -98 -293 -50 21
4021 21 -329 168 110 -146 175 359 -215 -170 400 -271 -112 260 -1 -308 458 78 -152 274 -336 -505 97
4042 97 -84 -311 544 -27 -452 398 363 -17 177 448 -17 -7 131 -184 -74 271 -97 66 565 -141 -297
4063 -297 392 -125 -483 120 -109 -228 -50 167 -669 109 321 -36 -84 384 -195 281 313 -349 -81 134 -298
$$ packed form
3912g9K08O4j01r1o5J5j07K49M6l38J82J01k37J6R7P3j23L23k92j64J80J56m17
3935c04J54L29j85K46q2j67l6J65l64N44k84k04M14j24l26L93j55J35j43j79q4
3956b57K0J78J61j5r9r9k10K94K44m18L85l1k31oK38l69j76O83k08k27J37K61
3978B55n34L22k01k3N03l40J17M7j15k93M53J1m96K47L3j58K12L02o13K18L95
3999C42n68K65Qj51k28K80r3l9K36o4l66N65j30m57N65J90n61L52k44j95K43P1
4021B1l50M97n8k56L21J84n74M5N70o71J59L72k61l07P66l80k30M26o10j69O02
4042I7j81k27Q55n71m25Q50l5l80J94K71m65J0J38l15J10L45l68J63M99p06j56
4063b97O89n17l58O03k29j19J78K17q36P78K12l57m8M68n79M76L2o62K68K15m32
$$ plain form
4084 -298 -203 480 -389 -10 83 326 138 142 185 -319 421 69 -323 49 -154 -277 -76 294 -211 167 501 -320
4106 -320 -226 402 -353 -252 169 108 -299 462 -135 57 270 -1 -573 448 25 -646 136 288 -636 4
4126 4 81 -560 268 219 -140 99 392 -163 199 138 -65 54 339 -249 -65 265 -95 -227 420 -179 -531 302
4148 302 271 -237 161 -132 -518 263 -116 -377 176 48 -134 71 260 -279 -338 216 -232 -145 231 -207 -187
4169 -187 116 37 -265 581 -45 -39 174 300 -408 157 135 -237 -49 64 -354 -286 303 -376 39 410 -90 -40
4191 -40 400 -240 -225 291 -21 -54 24 -380 -380 364 -32 -341 276 213 -640 211 4 -536 290 280 -498 -59 575
4214 575 -290 -172 360 -309 -11 421 -311 -82 453 -40 -280 273 -82 -319 188 405 -733 365 -32
4233 -32 -246 270 -77 -168 -118 270 -277 191 534 -460 -180 16 -439 -59 278 -237 -425 284 -342 -242 287
$$ packed form
4084b98R5O83q69L79R3K43j88MM3n04P40l52l92L72k03j23K01L70n05L78L34q21
4106c20R4O28p55J01M21o1m07P61n97J92K13k71n72J021m23o71P82J52r24O40
4126DP7o41Q28m9l59K39K93n55L62o1k03J19K85n88J84L30l60j32O47n99l52Q33
4148C02l1n08L98k93l86P81l79k61N53j28j82K05J89n39n9N54m48Q7L76m38K0
4169a87L03p9l02Q46o26OK13J26p08N65k2l72J88J13m18O8N89o79M15L71n00N0
4191d0M40o40J5N16l12l3P8m04%P44l96l09O17o3q53Q51k07n40Q26j0p78M39O34
4214E75q65J18N32o69K98M32p32K29N35m93k40N53l55k37N07K17j138J098l97
4233c2k14N16l47r1N0L88n47M68L43r94K80J96m55L80L37n15j88P09o26J00N29
$$ plain form
4254 287 -36 -255 380 2 -420 330 112 -235 115 207 -424 93 315 -662 -11 388 -113 -125 67 -137 -225
4275 -225 477 -140 -548 330 -186 -367 101 -82 -235 318 157 57 -4 178 -426 29 289 -560 35 122 -541
4296 -541 217 319 -91 125 436 -10 -163 440 -38 -366 330 -203 -251 210 -428 -393 162 4 18 235 382
4317 382 -422 257 96 -256 209 -222 -255 -123 172 -371 -111 430 -163 -35 516 -123 -228 307 -145 -262
4337 -262 316 18 -186 -33 266 -223 53 62 106 -37 0 -219 -61 134 -269 -75 326 -299 42 -30 195 -312
4359 -312 309 63 -466 19 8 -313 269 228 -385 133 62 -412 106 392 64 182 279 -89 -128 316 -167 -253
4381 -253 239 205 4 58 -181 -10 310 246 93 2 133 19 218 241 -195 199 281 8 298 209 -165 339
4403 339 135 -18 41 296 -279 105 283 -219 10 48 -107 -435 -250 185 -262 161 118 -369 -24 107 -70
$$ packed form
4254B87l23k19O35l78m22P50k18l47L50R2o31N17K22r77O51L99n01j2J92k04q8
4275b25P02o17m08Q78n16j81M68j83j53N53j61j00o1J82o04M55K60q49N95Q7o63
4296e41P58J02m10K16L11m46j53O03m78l28O96n33m8M61o38L5N55j58J4K17J47
4317C82q04O79j61l52M65m31l3J32K95n43K60N41n93J28N51o39j05N35m52j17
4337b62N78k98k04J53K99m89K76RM4j43L7k19J58J95m03J94M01o25L41p2K25n07
4359c12O21k46n29M85j1l21N82m1o13N18p1m74N18K86l28J18R7l68l9M44m83q6
4381b53M92l4k01N4k39J71L20o4j53r1J31j14J99K3m36L94Q2k73K90q9l74N04
4403C39k04j53N9K55n75L84J78n02K29L8j55l28J85M35m47M23m3m87L45J31j77
$$ plain form
4424 -70 -37 61 -285 174 207 -83 -28 -85 0 203 44 100 -388 205 -431 -16 186 -227 -32 -95 -4 -202 84
4447 84 61 31 199 50 -355 -202 183 -194 169 49 13 -39 269 -92 183 161 31 49 -30 -306 56 197 -356
4470 -356 -20 122 -88 89 89 -106 4 262 -169 -308 92 -26 -175 17 -109 -288 305 -205 -346 -85 421
4491 421 -95 79 91 54 70 -147 -63 -288 0 -137 45 4 356 -326 -81 158 -194 33 -49 -131 -351 -3
4513 -3 -64 -215 26 102 -1 164 170 -204 369 -159 -310 -258 -18 -9 -201 -178 -20 135 7 -56 -265 -85 18 -59
4537 -59 276 209 -53 -159 -185 -190 -34 -285 -230 -53 0 -106 188 -299 -118 -87 296 -21 -13 -249 -115 245 -100
4560 -100 -252 132 -302 68 96 -173 -196 -30 -33 270 47 110 17 9 79 -106 237 204 103 -82 117 282 -165
4583 -165 165 259 29 -111 182 170 54 -123 0 -66 27 210 -106 -59 14 90 -75 -92 113 -95 -385 -38 -9
$$ packed form
4424g0L3R8l46M59L3k90N5n7Q5K03j59N6m88N93o36M15K02m13J95o3R1j98K86
4447H4k3l0J68j49m05J53L85l77L63j20l6n2L08l61K75k2j30J8p9k76L62J41n53
4470c56L36J42k10J77%j95J10K58m31j39M00j18j49J92j26j79N93n10j41K61N06
4491D21n16J74J2l7J6k17Q4k25K88j37J82m1L52o82K45K39l52K27q2q2k20L48
4513co1j51K41P6j03J65Ol74N73n28j51N2K40Rj92K3J58J55j28o3k09J80J03p7
4537e9L35o7k62j06k6nJ56k51N5J77N3j06K94m87J81L1L83l17Qk36J34L60l45
4560a00j52L84m34L70K8k69k3J66lL03k23O3r3qP0j85L43l3j01j85J99J65m47
4583a65L30R4k30j40K93j2j16j77J23o6R3J83l16M7P3P6j65j7K05k08k90L47K9
$$ plain form
4606 -9 -164 -28 12 184 87 182 -287 44 28 53 -30 61 -225 -93 180 159 -119 -158 -130 -96 -155 91 159 13 -84
4631 -84 -232 -132 103 -193 70 1 -123 170 -134 -112 111 -244 -201 -197 -70 -125 195 54 36 162 137 -11 -153
4654 -153 116 80 -105 91 61 -110 -77 -290 -48 -222 -87 -33 124 142 10 273 159 -168 226 15 176 -31
4676 -31 -47 44 -101 -27 -15 -11 -244 -28 -8 -35 304 94 215 -34 128 302 -66 -255 115 173 94 195 173 -394
4700 -394 -166 -36 56 -17 30 88 2 -144 60 134 22 -14 452 -188 84 -314 -118 133 222 393 44 -38 108
4723 108 0 47 123 -246 70 87 106 -287 15 -143 -180 -68 122 -191 -93 -24 -67 -208 233 -87 -22 247 -166
4746 -166 158 -152 -112 144 74 -362 -74 -32 169 90 -28 -162 -297 131 286 30 161 -210 36 272 -102
4767 -102 -89 -51 -77 -185 -124 56 46 52 96 -210 -35 67 -40 -275 -128 -245 -321 339 69 158 -152 490 318
$$ packed form
4606ij55J36M0J72r7R5m69L31j6K5q3R1k86J32K73k1k78l9K8L4n9K46O8j46r7
4631h4j48J00K35k96K63o9j24K93l04K2K23l55M3MJ27n5L20j41j8J26k5j48j42
4654a53K69l6j85J96l0j71L3k13K42j74J35N4J57J8j32K63j14l27L94k11J61k07
4676c1j6R1j45P4J2Mk33K16K0k7L39k10J21k49J62J74l68j89L70N8p9J01k2n67
4700c94K28J30R2p3M7N8q6j46K04P4j12l6M66o40K72l98J96K51Q9J71l49q2J46
4723A08j08M7P6l69L16J7J9l93L02j58l7J12J90l13R8O9m3j41M41l20O5K69m13
4746a66L24l10M0K56p0m36K88M2K01p9j18j34j35M28J55k56J31l71K46K36l74
4767a02J3L8k6j08O1J80j0OM4l06J75J02j07k35J47j17p6O60k70Q9l10O42j72
$$ [...]
8191B1
##END NTUPLES=NMR FID
##END=
