##TITLE=1H_Pr 4147
 200.13Hz, DMSO.
 8 sc
 
25.3.2026
##JCAMPDX= 6.0         $$ Bruker NMR JCAMP-DX V2.0
##DATA TYPE= NMR FID
##DATA CLASS= NTUPLES
##ORIGIN= UXNMR, Bruker Analytische Messtechnik GmbH
##OWNER= pz
$$ XWIN-NMR		Version 3.5
$$ Wed Mar 25 15:48:57 2026 Russian Standard Time (UT+4h)  she@DPX200
##.OBSERVE FREQUENCY= 200.1313
##.OBSERVE NUCLEUS= ^1H
##.DELAY= (6, 6)
##.ACQUISITION MODE= SIMULTANEOUS
##.ACQUISITION SCHEME= undefined
##.AVERAGES= 8
##.DIGITISER RES= 18
##SPECTROMETER/DATA SYSTEM= spect
##.PULSE SEQUENCE= zg30
##.SOLVENT NAME= DMSO
##.SHIFT REFERENCE= (INTERNAL, DMSO, 0, 14.3821)
##AUDIT TRAIL= $$ (NUMBER, WHEN, WHO, WHERE, WHAT)
$$ ##TITLE= Audit trail, XWIN-NMR		Version 3.5
$$ ##JCAMPDX= 5.01
$$ ##ORIGIN= Bruker BioSpin GmbH
$$ ##OWNER= she
$$ F:/spectra/data/she/nmr/H-C/1/audita.txt
$$ ##AUDIT TRAIL=  $$ (NUMBER, WHEN, WHO, WHERE, WHAT)
(   1,<2026-03-25 15:47:44.51 +0400>,<she>,<DPX200>,
      <created by zg, POWCHK disabled, PULCHK disabled
       configuration hash MD5:
       00 E9 B6 7A A2 85 ED C7 34 08 36 98 17 FE 4E 26
       data hash MD5: 16K
       07 30 99 85 EE E8 BF E2 1B C2 17 D9 12 CD FE DF>)
$$ ##END=
$$ 
$$ hash MD5
$$ EB 2C C0 C6 B3 6B AD B1 F8 39 A9 7E C4 CD 57 26
##$RELAX= 
##$RELAX= 
##$RELAX= 
##$RELAX= 
##$RELAX= 
##$RELAX= 
$$ Bruker specific parameters
$$ --------------------------
##$DU= <F:/spectra>
##$EXPNO= 1
##$NAME= <H-C>
##$PROCNO= 1
##$TYPE= <nmr>
##$USER= <she>
##$AMP= (0..31)
100 100 100 100 100 100 100 100 100 100 100 100 100 100 100 100 100 100 
100 100 100 100 100 100 100 100 100 100 100 100 100 100 
##$AQSEQ= 0
##$AQ_mod= 1
##$AUNM= <au_zg>
##$AUTOPOS= <>
##$BF1= 200.13
##$BF2= 200.13
##$BF3= 200.13
##$BF4= 200.13
##$BF5= 200.13
##$BF6= 200.13
##$BF7= 200.13
##$BF8= 200.13
##$BYTORDA= 1
##$CFDGTYP= 0
##$CFRGTYP= 5
##$CHEMSTR= <none>
##$CNST= (0..31)
1 1 145 1 1 1 1 1 1 1 1 1 1 1 1 1 1 1 1 1 1 1 1 1 1 1 1 1 1 1 1 1 
##$CPDPRG= <>
##$CPDPRG1= <>
##$CPDPRG2= <>
##$CPDPRG3= <>
##$CPDPRG4= <mlev>
##$CPDPRG5= <mlev>
##$CPDPRG6= <mlev>
##$CPDPRG7= <mlev>
##$CPDPRG8= <mlev>
##$CPDPRGB= <>
##$CPDPRGT= <>
##$D= (0..31)
0 0.7 0 0 0 0 0 0 0 0 0 0.03 0 0 0 0 0 0 0 0 0 0 0 0 0 0 0 0 0 0 0 0 
##$DATE= 1774439263
##$DBL= (0..7)
120 120 120 120 120 120 120 120 
##$DBP= (0..7)
150 150 150 150 150 150 150 150 
##$DBP07= 0
##$DBPNAM0= <>
##$DBPNAM1= <>
##$DBPNAM2= <>
##$DBPNAM3= <>
##$DBPNAM4= <>
##$DBPNAM5= <>
##$DBPNAM6= <>
##$DBPNAM7= <>
##$DBPOAL= (0..7)
0.5 0.5 0.5 0.5 0.5 0.5 0.5 0.5 
##$DBPOFFS= (0..7)
0 0 0 0 0 0 0 0 
##$DE= 6
##$DECBNUC= <off>
##$DECIM= 32
##$DECNUC= <off>
##$DECSTAT= 4
##$DIGMOD= 1
##$DIGTYP= 9
##$DL= (0..7)
0 120 120 120 120 120 120 120 
##$DP= (0..7)
150 150 150 150 150 150 150 150 
##$DP07= 0
##$DPNAME0= <>
##$DPNAME1= <>
##$DPNAME2= <>
##$DPNAME3= <>
##$DPNAME4= <>
##$DPNAME5= <>
##$DPNAME6= <>
##$DPNAME7= <>
##$DPOAL= (0..7)
0.5 0.5 0.5 0.5 0.5 0.5 0.5 0.5 
##$DPOFFS= (0..7)
0 0 0 0 0 0 0 0 
##$DQDMODE= 0
##$DR= 18
##$DS= 0
##$DSLIST= <SSSSSSSSSSSSSSS>
##$DSPFIRM= 0
$$ [...]
##$SUBNAM0= <"">
##$SUBNAM1= <"">
##$SUBNAM2= <"">
##$SUBNAM3= <"">
##$SUBNAM4= <"">
##$SUBNAM5= <"">
##$SUBNAM6= <"">
##$SUBNAM7= <"">
##$SUBNAM8= <"">
##$SUBNAM9= <"">
##$SW= 18.0517328524113
##$SWIBOX= (0..15)
0 0 2 0 0 0 0 0 0 0 0 0 0 0 0 0 
##$SW_h= 3612.71676300578
##$TD= 16384
##$TD0= 1
##$TE= 0
##$TE2= 300
##$TE3= 300
##$TEG= 300
##$TL= (0..7)
0 120 120 120 120 120 120 120 
##$TP= (0..7)
150 150 150 150 150 150 150 150 
##$TP07= 0
##$TPNAME0= <>
##$TPNAME1= <>
##$TPNAME2= <>
##$TPNAME3= <>
##$TPNAME4= <>
##$TPNAME5= <>
##$TPNAME6= <>
##$TPNAME7= <>
##$TPOAL= (0..7)
0.5 0.5 0.5 0.5 0.5 0.5 0.5 0.5 
##$TPOFFS= (0..7)
0 0 0 0 0 0 0 0 
##$TUNHIN= 0
##$TUNHOUT= 0
##$TUNXOUT= 0
##$USERA1= <user>
##$USERA2= <user>
##$USERA3= <user>
##$USERA4= <user>
##$USERA5= <user>
##$V9= 5
##$VALIST= <valist>
##$VCLIST= <CCCCCCCCCCCCCCC>
##$VD= 0
##$VDLIST= <DDDDDDDDDDDDDDD>
##$VPLIST= <PPPPPPPPPPPPPPP>
##$VTLIST= <TTTTTTTTTTTTTTT>
##$WBST= 1024
##$WBSW= 4
##$XGAIN= (0..3)
0 0 0 0 
##$XL= 0
##$YL= 0
##$YMAX_a= 482639
##$YMIN_a= -470445
##$ZGOPTNS= <>
##$ZL1= 120
##$ZL2= 120
##$ZL3= 120
##$ZL4= 120
##$ABSF1= 10
##$ABSF2= 0
##$ABSG= 5
##$ABSL= 3
##$ALPHA= 0
##$AQORDER= 0
##$ASSFAC= 0
##$ASSFACI= 0
##$ASSFACX= 0
##$ASSWID= 0
##$AUNMP= <proc_1d>
##$AZFE= 0.1
##$AZFW= 0.1
##$BCFW= 1
##$BC_mod= 2
##$BYTORDP= 1
##$COROFFS= 0
##$CY= -3
##$DATMOD= 1
##$DC= 2
##$DFILT= <>
##$DTYPP= 0
##$F1P= 0
##$F2P= 0
##$FCOR= 0.5
##$FTSIZE= 0
##$FT_mod= 4
##$GAMMA= 1
##$GB= 0.15
##$INTBC= 1
##$INTSCL= 1
##$ISEN= 128
##$LB= 0.25
##$LEV0= 0
##$LPBIN= 0
##$MAXI= 10000
##$MC2= 0
##$MEAN= 0
##$ME_mod= 0
##$MI= 1.114404
##$NCOEF= 0
##$NC_proc= 0
##$NLEV= 6
##$NOISF1= 3.799351
##$NOISF2= 2.8
##$NSP= 1
##$NTH_PI= 0
##$NZP= 0
##$OFFSET= 14.38212
##$PC= 1
##$PHC0= -3712.138
##$PHC1= 12.7923
##$PH_mod= 1
##$PKNL= yes
##$PPARMOD= 0
##$PSCAL= 0
##$PSIGN= 0
##$REVERSE= no
##$SF= 200.129724274929
##$SI= 16384
##$SIGF1= 3
##$SIGF2= 2
##$SINO= 400
##$SIOLD= 16384
##$SREGLST= <1H.CDCl3>
##$SSB= 0
##$STSI= 0
##$STSR= 0
##$SW_p= 3205.1282051282
##$SYMM= 0
##$S_DEV= 0
##$TDeff= 0
##$TDoff= 0
##$TI= <>
##$TILT= no
##$TM1= 0
##$TM2= 0
##$TOPLEV= 0
##$USERP1= <user>
##$USERP2= <user>
##$USERP3= <user>
##$USERP4= <user>
##$USERP5= <user>
##$WDW= 1
##$XDIM= 8192
##$YMAX_p= 0
##$YMIN_p= 0
$$ End of Bruker specific parameters
$$ ---------------------------------
##NTUPLES= NMR FID
##VAR_NAME=  TIME,          FID/REAL,        FID/IMAG
##SYMBOL=    X,             R,               I
##VAR_TYPE=  INDEPENDENT,   DEPENDENT,       DEPENDENT
##VAR_FORM=  AFFN,          ASDF,            ASDF
##VAR_DIM=   8192,          8192,            8192
##UNITS=     SECONDS,       ARBITRARY UNITS, ARBITRARY UNITS
##FACTOR=    0.0002768,     1,               1
##FIRST=     0,             0,               0
##LAST=      2.2672688,     0,               0
##MIN=       0,             -470445,         0
##MAX=       2.2672688,     482639,          0
$$ Real data points
##PAGE= N=1
##DATA TABLE= (X++(R..R)), XYDATA
$$ [...]
1590A55p1j70kO8J30r9j63K83k76l1L75j84P4k36J09M1J92m6l6j36O7k51J95Q5
1614G3M5j23j0J5J42j8k24J15RO2L7m36J61K46j55J11k56M0J7J82n1jM2J18o7
1639G4L43n32j0J62k62L01j70L3n2J66l14K75k0J25j51M1K06l25J75J3j44n3K86
1662A67j33j27m9K3lL21m83L48k00J61n5J07l1j19l0j95M48R8k50o8J48j59KJ13
1686C4M9M9L3j52J95p6N2k61R9P5j89J30q2J8L1oK56j23j38l7J60j71k64J89K50
1711A21k57L03j60J13j95J22o1p2J45K0Pk84J77Mj06r2K19j86J99k32J22J49k24
1734a68J45M7j53M5K05k20K03k14J28l4J54o7L9k03N8Pl0o8J54m3j06J04K26n
1758B04k73J83k53K16k40L56j42q2R5N0p2l0k02K09K41m53K30m0j4J69k24J98
$$ y = [155, 84, -86, -88, -20, 110, 11, -152, 131, -145, -176, 199, 15, 89, -147, -38, 3, 195, 149, 113, -23, 44, -207, -12, 73, 118, -5, -15, 0, 142, 124, -100, 15, 24, 86, 123, -313, -152, 94, -61, 50, -206, -166, -149, 33, -18, -19, 23, 141, 74, 417, -115, -125, 37, -225, 76, -94, -61, -113, 53, -261, 14, -6, 119, -32, 9, 215, -110, 65, 78, -66, -119, 167, 34, -93, -142, -119, -122, 199, -284, 64, -136, 25, -30, 77, 46, -73, -103, -298, 150, 248, -2, -70, 78, -81, -79, 34, 83, 132, 165, 13, 208, 132, 184, -77, 22, 97, -92, 38, -44, -26, 5, -1, 255, 132, -6, -43, 117, -54, -318, -129, 121, -136, 167, 7, 120, -75, 47, -14, -86, 59, 79, 86, -198, -21, -17, -123, -215, 4, -182, 17, -215, -93, 56, -168, -23, 24, -129, -84, 121, -99, 104, -110, 18, -16, 138, 71, 110, -93, -35, -28, -58, -126, 28, -15, -121, -17, 209, 204, -69, 114, -139, 77, -163, 193, 51, -31, 64, 114, 42, 12, -190, 19, 260, -193, 37, -3, -17, 152, -72, 126]
1780A26o0j05J23J27n78M37J19l63J16J9Q7Q7k00O5K62l35L4L9k09J91j7K3J23
1803A11r2l7j13K24J88n36L49j77L4J5l0J58l28K45k28J38m1K11j2j04K48j78
1825D5q6J22O2k72J1K38o1Q9r5j14N3J06n0j94P6J22k10J67L2q1nJ10j80J98m8
1850C5QJ01k43j8J5N9j35L59r2j04j3j3L1J34k84k1L23k56K09k75J22L9M6n9P
1875b5J53j60Q4j14p4M7l4P8K4J49p4n9J28l16J48k7J13j94J57J4J10k99J31J
1899c9j82M35l35j12N4M2L07k33J10r9Q4j3j6o9K40K1k93l6K84j27j8l8o1k6J20
1924@K34k7j41l6o3j80L44j36J35M6k95J34j91k7L56j35k5q2J39J40k24m4K02
1947A24k55J29PJ90k38m0M9p1L30k45J52K9k48J06k12K85k83L47j16J37k72K5
$$ y = [126, 66, -39, 84, 211, -367, 70, 189, -174, -58, -39, 48, 135, -65, 0, 262, -73, -39, 0, -209, -18, -35, -12, 111, 19, -18, -131, 93, 281, -255, 94, -83, -49, -34, -64, 94, -234, 11, -217, -79, -120, 91, 79, -25, 223, 45, -41, 81, 143, -129, -118, 120, 59, 148, 53, -61, -8, 98, 48, -146, -70, 52, -158, 9, 41, -40, -45, 65, -115, 83, 35, 43, 144, -99, -117, -102, -43, -178, 181, 89, -15, -28, -41, -10, 124, -160, -181, 142, -114, 95, -180, -58, -19, 27, -32, -25, 128, -32, 52, -62, -136, -89, -123, -45, -21, 128, 54, -5, 123, -193, -45, -72, 41, -153, 4, 18, 128, -171, -40, -39, -221, 214, -121, -233, -179, -137, 170, -63, 47, -52, 32, 19, 3, -66, 174, 195, -98, -134, 150, 23, 5, -33, -94, -120, 0, 234, 207, 66, 30, -33, -213, 131, -5, 130, 176, -119, 15, -176, -203, 153, 18, -7, -89, 50, 190, -34, -78, 124, -131, -2, 5, 195, -43, -83, -34, -105, 225, -20, 132, 161, -87, 19, -193, 92, -191, 156, 40, 177, -95, -70]
1969g0l9J57n0j6rQ4j47R9O9j94J19l9O1K6q3K1J93k30O5J16j64M0K3n9J11l6
1995D8J17j91N3j06OJ69k1j72nJ91j38K38l07k0j37L26J00k53K32j66N5M8J22
2018A89l37J05J67Qp7j06P3k41K57K4m4l2k5J50j60lM3K5J27m2j73K3l4J2K6J23
2044G8p8j95K11l5Q1j98J41J63j81r8L24j55l9m3k2J04k13k0K12l9KO1q8N0K8
2069E1L5j24J31k6r1K14k28m9L0J1J3K42j09j60L2j0N3q2%k13N26l66J29n7r3
2094a41J45k0J00j91R3P0k59J96J49k84JK07J22J3l8n9j43l7k14M19j33J63k03
2117d4j95L30j77m3PL6O1O3j13l9Q9%K01k40R5j7q5M1Q0j15J43%k20Q6Lj26L56
2144A77J0j52J47j03q2Q7k30J72j48O0O8J35k70K82J00j41j15KR8j5m05L17jK83
$$ y = [-70, -109, 48, -2, -18, -27, 57, -90, 9, 78, -116, 3, -36, 25, 51, -32, -11, 182, -48, 17, 133, -31, 9, 32, -27, 84, 48, 165, -26, 27, -79, -73, 96, 75, -97, -102, 89, -49, 189, -118, -138, -275, 51, 151, -102, 130, -36, 19, 67, 189, -148, -43, 124, 132, 55, -51, 22, -219, 38, 62, 18, -14, -39, 111, -49, -52, -9, 16, 143, 101, -72, -49, -83, -71, -45, 78, 0, -195, 16, -19, 62, -136, 5, 168, -13, -111, 213, 58, 19, -24, -46, 58, -155, -175, 37, -2, 0, 61, -27, 23, 51, 86, -38, 93, 67, -24, 190, -38, -87, -57, -46, -33, 209, 100, -60, -28, -38, 15, -67, -67, -280, 246, -120, 9, -48, -141, 4, -16, 84, -107, -14, 56, -203, -7, 142, -142, -141, 66, 188, 201, 163, 104, -39, -76, -290, 129, -4, 159, -44, -239, 91, -86, -129, -122, -86, -25, 38, -75, -114, -25, -25, 176, -64, 31, 14, -71, -30, 50, -65, 78, 78, -142, -56, -53, -179, 177, 187, 35, 182, 79, -3, 84, -146, 26, -122, -62, 6, 141, -129, 153, 253, 112, -3, -1, 97, 82, -323, -6, -7, 276]
2168B76p9k21l7J05N5J78l51L1K49j84j35L8J41p9j57L3O0OK61k69J71J01k87
2191i4m9J70q0M2Q8j12j04K75j77mn7j01J58K3J84k05O3Qj00MO7KN8j73R8K02
2217A86k02%k35L33l6j8j3N4J72j80o0J51o9j21R6j82J79p4j64L23o3r2N7p9m1
2242g8M3%j01M4P1K4M6l11nK53K2J20j93N8Q0j89%K43l02l5M10j17j50O1j60J84
2268A8K2o1K3o7J91l83K71j72K04M9k95L28k03R7j55O3Qk9J88L0l52L88r2j04
2292c3r6M7J39j18O3j8k32K07K06r5j05M4J68j95m2L46l22j08LpK9N4M9J24K8
2317A36j09n8n0J47r0J4J03k14p4K15PNj21J97j29K9r5K03q4m9oN0J67j21r9O7
2343D1K20k35L4q9J10j04J40j4J23l35L08l3j98R0q5L9j01R3j74oJ72j64K34m01
$$ y = [276, 197, -24, -61, 44, 99, 277, -74, -43, 206, 22, -113, -75, 66, -13, -170, -137, -77, -71, 190, -79, 92, 193, -94, -143, 27, -53, -11, 77, -35, -139, 136, -41, -45, -102, -203, -45, -22, 162, -43, 20, 28, -72, -68, -1, 1, 59, -114, -16, 186, -16, -16, -251, 82, 46, 28, 15, 69, 241, 61, 1, 152, 83, -38, 58, -124, 55, -19, -183, 140, 77, -15, 42, -37, -78, -35, -35, -136, -92, -21, 3, 49, -262, -267, -14, 8, 128, -65, -7, 73, -116, -116, 127, -175, -210, 200, 83, -67, -6, -166, 18, 40, -21, 2, -65, 126, -257, 14, -158, 46, 95, -200, 128, -75, 22, -133, -70, -62, -91, 97, 127, -225, 163, 71, -33, -129, -82, 57, -61, 2, -16, -248, -41, 165, 70, -35, 9, 177, -18, -60, 286, -36, -144, -141, -148, -119, -65, -16, 108, 136, 27, -31, -81, 66, -24, -10, 93, -121, -195, 20, 27, 32, -89, 108, -21, 8, -87, 116, 32, -17, -23, 27, 194, 73, -26, 41, 261, 26, 60, -29, 81, -23, 117, 103, 226, -109, 199, 166, -32, 58, -27, 12, -89, 4, -170, -176, -4, -168, 66, -335]
2367c35K77J23l64L28j57Q4OM5QJ28k89Q1J29r3j49K43j05K8m1N7K0R2j80MJ93
2392A33k22J40l1j42J55O8Mk13NK09j60j1J79o3nj00r1K59j33j38J32J42k37J82
2416F2l49K68k45K44J1L2R4M7k81J40O1r7j55K68j63O4M8N9j81J07j87J90q0k08
2440b51K63K3j07O3PN4Pk15K56J9l6k50M83m41Q5M10l59J21j58j25K13o4l5p6
2464a13L92l61O0k7J35j55J13j99L00R8k75kO8k08K50l3lk55K52J13n5Q8l19J48
2488A2j54K00j26N6P9J4k76L08j64L2J26r5N6j81l9J22J56l45J69O3PM4J10k31
2512e7R6J79o6k58J24K11k80P1j24K9m0L17K2l00K05J8pJ26j60K34k00p1M5m4
2536G0o1R2r0M8k6Pj2p9J14k35o6J82P9J54l02M0J5rM0P7J95l47K62j44j27K1
$$ y = [-335, -58, 65, -299, 29, -128, -44, -38, 7, 15, 143, -146, -65, 64, -29, -178, 65, -40, -12, -53, 4, 24, 116, -64, -60, 133, -89, 51, 20, -122, 33, 101, 105, -108, -103, 106, -54, -65, 114, 51, 46, -54, -145, 114, -19, -157, -25, 117, -120, 62, -287, -19, -264, -20, -9, 23, 117, 164, -117, 23, 84, -13, -168, 100, -63, 1, 49, 108, -73, 34, -153, 37, -43, -251, 12, 35, -72, -9, -2, 52, 59, -156, 100, 119, 83, -167, 316, -125, -40, 370, 11, 132, -26, -151, 62, -2, -37, -113, 279, -82, -22, -49, 86, -69, 44, -155, 145, 243, -32, -34, 34, -174, 76, 43, 40, -215, 37, 150, 95, 183, -136, 12, -142, 58, -68, -12, 67, 81, -195, 113, -51, -19, 107, 12, 68, -113, -152, -30, 126, -219, -50, 13, 20, 64, 174, -57, 39, 218, 152, -106, 18, 229, -51, 20, -104, -75, -115, 202, 224, -76, 129, 147, 140, 266, 106, 340, 140, 69, 114, 70, 9, 101, 11, 59, 33, 40, 28, -51, 63, -172, -238, -56, 23, 177, -125, -85, -70, -79, -39, 38, 233, -114, 148, 4, -123, -102]
2562a02l2J3J16j6Q8j6j05K25%k94K98l05P1M1j97R2O7P5n4K9j00J2K0j26J81
2587a9q6J9J98k72K80r5J06k19K20k6k26K33m5j11J23j03jJ05k42K05j05j49J87
2610b3P1j4M6l05L78n5j93J5K4LJ9m1J19n5LK81k08j85J31J32Nj89K58m1k59o8
2636a51J41m2K75m02L35j45j31Q9M9M5n7j23J48M0j45K68k50L81k77%L8p8j26
2659a18J29n4p2j06K94k98L21j27O7Q7q9q3Q3J92k48o1N1J88l73J80J61j95j06
2682a77J57J14n5j62N8l3P1J15p1l04Q5J88k4J35o4l1P3k03J76k3j02P7L8K0l52
2707b94L88Q5j69l4M8J80j85k09K12j18n6Q2J24j88KK13j98K18M2j5k59K33l2
2730G0k18L78m2j25nJ39k43j61K21n0J99o6l6j24L3q0L15k13Lo9J38j92J15k3
$$ y = [-102, -134, -121, -5, -21, 67, 51, -54, 171, 171, -123, 175, -130, -59, -18, -215, -123, -56, 19, -35, -6, -106, -94, -74, -200, -19, -105, -86, 112, -160, 120, 25, 131, -88, 132, 106, -120, 113, 68, -43, 80, -23, -24, 81, -161, 44, -61, -210, -23, 48, 34, 80, -225, 153, 98, -95, -80, -56, -53, -34, -75, 44, -11, -8, 273, 65, -120, 11, 143, 148, -41, 217, 176, -83, -151, -10, -52, 223, -179, 156, 11, -120, -31, 18, 63, 6, -117, 31, 71, -74, 194, -56, 325, 48, 48, 86, 8, -118, 11, -43, -115, -221, 73, -225, 96, -31, 36, 123, 34, -49, 34, 226, -22, -83, -32, 156, -217, -37, 124, -71, -177, -20, 94, 39, -123, -65, -98, -27, 88, 17, -287, -202, -14, -38, 97, 33, 2, 75, -128, 48, 25, -77, 0, 38, 58, -294, 94, 179, 10, -24, 24, 204, 19, -190, 22, -96, -152, -70, 54, -134, -132, 81, -117, 101, 143, 128, -131, 102, 70, -148, 230, 188, 63, 58, 197, -46, -207, 14, -36, 163, 97, 61, -63, -30, -110, 205, -8, -5, -74, 64, -128, -13, -36]
2754c6J07l9K5l5j41J16j12O5J19k1l37J95O6J32n4m1q1J6N7J09j65j24J39j8
2778e8K0L0L0k20L64k09M8Jl8m0nj7j32L33q4j4o3J04m4R1j82K62j41l27K74J08
2804I1J3o7j35k7J2R0P8K6j39M6j61O0P6j7J84j55K13p6j71P1j1K98k89o9J71
2829A12q3K9m8K0n2Kj99L76k50q4J70j04J77l28L91l01L13j82Q2P8j20K8p0J58
2853A15k38P9O2J02j49J91j41q1J89j76kj6Q4k0j48K55j34l7J17L7p4l5K40j53
2877F7r3K03Jl12J70J54l70J27o9J51L0k11K30l09J65m9P4R0r5J99k15J33l8M3
2901G6o1j15M2N7K61l34O4N0J54l58L41j04j28J78k2j73J75k44%J75j67j07K98
2924E8j04J18j38P8k91K30J34j91K77R8l65J84j05L8J65k09j59M46j72k39L43
$$ y = [-36, 71, 32, 57, 22, -119, -3, -115, -50, 69, 48, -289, -94, -28, 104, 50, 9, -72, -56, 1, 110, -55, -179, -40, -58, -38, -8, 22, -198, 166, -43, 5, 6, -32, -72, -77, -94, -226, 107, 23, 9, -54, 50, 6, 97, -85, 177, 36, -291, -17, 91, 104, 37, -98, -125, -113, -23, 55, 81, -58, -12, -173, -113, -37, -54, 130, -25, 188, 112, -59, 12, 1, 299, 10, -59, 112, 29, 58, 10, 30, -22, -20, -219, 157, -93, -177, -7, -111, 66, -262, 129, -172, 141, -41, 41, 119, -1, 27, -43, 115, -123, -44, 18, 120, -29, 162, 21, -60, 129, -47, -49, -65, 19, -1, -149, 106, -28, -65, 52, 89, 15, -20, 220, 67, -26, 177, 178, -134, 36, 190, -180, -53, -122, 29, 59, -152, 78, -231, -66, -115, -41, 49, -46, 153, -62, 71, 33, 76, 15, -100, -58, -1, 260, -74, -10, 40, 194, -164, 177, 73, -55, 123, 101, -72, 103, -141, -141, 34, -133, -240, 58, -46, 72, -66, 12, -279, -49, 85, -106, 171, 269, -96, 88, -17, 21, 186, -23, -182, 264, 92, -147, 196]
2945A96k06Q5j49J85j99K7j7Q0j13L40j76O3k14R7R5n7o7Q1q2L7J76j63j82K73
2969A10j36m8r5J50J14q1J59j67q4J96l01P9m7J43j51L47l90K91j38j78L16k23
2991a34J85m9m8L0j3pj28J42oPK0r0K66j87r0K08k02OQ3o8L2J12Kj22p8mJ40k9
3019b2J5M4k34J26j31J33k4L15l85J18K33K9j2j92K3p8J40K1k97R5J19NJ15k7
3043A29m6j00N3j1j11M2N1J02m5j01l8J32l4l01J39J29J41R0l45K50l46M08k55
3066f7J6J04l0j51K58O4k68K4J01K5n3l1mp7J74n3l6K2k7j79J69Q6p3R4j22J41
3092A07j93J13J27j51j75J20K62j66q7l0J15M7j16l4N7M9n2rj2m5j33L18k46K20
3116H6j57J50QM8l8j92J02L03j75M8j95Q5j23j1P0m5j30J9j5K74o8o1J10L0r9
$$ y = [196, -10, 75, -74, 111, -88, -61, -78, 2, -111, 229, 53, 116, -98, -1, 94, 37, -30, 51, -31, 6, 182, 19, -163, 110, -26, -74, -169, -19, 95, 14, 173, 6, -78, 118, -183, -104, -151, -8, -159, 188, -202, 89, -49, -227, 89, -134, 51, 2, -46, -16, -29, -36, -164, -22, -28, -21, -1, -91, 175, -12, -102, 106, -96, -90, -7, -75, -43, 69, 71, -51, -129, -133, 7, -22, -7, 37, -197, -71, -202, -69, -93, 222, -163, -45, 188, 217, 205, 13, 36, -42, 98, 119, -178, -83, 36, 41, 156, 129, 83, -17, 36, 25, -86, -44, 7, 109, 64, -37, -75, 57, 23, -278, -139, -10, 131, 221, -124, 126, -220, 188, -67, -51, 53, 23, -128, 130, 194, -74, -50, 51, 76, 23, -8, -12, -89, 85, 32, -4, 18, -9, -188, -19, 67, -6, 88, -34, 107, -86, 27, 154, 3, -172, -52, 210, 44, -43, -73, 42, 89, -27, -61, -4, 45, -7, -16, -28, -73, -206, 112, -134, 86, -71, 79, 87, 135, 97, -95, 7, 310, 135, 183, -12, 73, -50, -61, 9, -36, -166, -147, -162, 112, 44, -17, 93, 123, 24]
3141B4j45J84m1j95J67N9j15J5R7Oo4m3k22J76J1j8L5Q0l3J37j48L0p4K1J79k05
3167h2K13j68j31M8K82n5k20O1L6J44m42L28k0K42j63Q9k13O9l6Q2m0j41K02j4
3191G1o1m4K9P1R2l33L21N1K1j02o3p9J05j24J29r8k1k2N1M3N0j52N1p0J7l7r9
3218b03K71O6N0k07r1K44j86j65J72n2K81k00P7j83j48K56jq4J10O7k31K65k3
3241H5j77N6P2Q7Qk41K4J06m9N1j66J99k25L3K48k22J65j55M9L2l3r8J11n9K6
3266g3P0k64J79J71o0L0O4J31k17Kj4n3J04J04k25K33j79j85J43O3j22O6P8J68
3290B14k52J73k84J46J34j77J05J0j41o7J92j32p4J45R1J14k52O5J14j82kj30
3312a90K26j10L3j43J29N9J52k21j81L69M4j4l5j51k65J74P6J94j88K1P8r5p6
$$ y = [24, -121, 63, 22, -173, -6, 53, -62, -47, 50, 56, -8, -51, -273, -97, -86, -104, -69, 11, -22, 115, -33, -3, -77, -56, 123, -82, 131, -37, -168, -120, 162, 107, -113, -52, -16, 128, -314, 14, -6, 236, 73, 162, -51, 18, -18, 64, 24, -117, 85, 71, 10, -34, -5, 66, 158, -175, 146, 197, 218, 116, 53, -26, 79, -45, 84, -14, -35, -57, -6, 37, 87, -65, -14, -84, -67, -104, -203, 68, 134, 184, -23, -114, 130, -56, -221, -49, -101, 180, -20, 57, -126, -274, -18, -19, -103, 7, 74, -157, 108, 85, -92, -36, 36, 123, 131, -110, -86, 20, -29, 22, -144, 55, -170, -137, 111, -111, 54, -101, -52, -20, -53, -151, -40, -99, -73, -3, -267, -88, 83, 23, 53, 117, 248, 31, 33, 19, -34, 70, 174, -51, 182, 3, -182, -39, 24, -98, -32, 46, 214, -38, 135, -149, -3, 131, -46, 59, 69, -72, -139, 53, -79, -153, -8, 83, 197, -55, 10, 124, -58, -60, -190, 36, -74, -41, -184, -55, 4, 156, -65, -246, 123, 167, 153, 118, -33, -298, -124, -48, 146, -42, -21, 57, -38, -114]
3335a14L2N1r8L5ML05k06J38Rl6q4J1m0k8J62m32L55M1j38l6JJ06n0%R2l31J42
3362a09K3K46j41Q1j55K91p9j18O5r0p4J95rJ7j16O6k27J22j8J3k41J23J79K01
3386B45j92K7k08j8J54J61j20N3k00O5N3j4K7J09k01P1p9N1L4l55N22j23q7L8
3410A3P8L2K4m9j11K00n8k19m6mJ51k3k1J25n3J6j18J39j35J63k60r6L92k81k16
3435c57K1M72j28l12K12J42j56M08k42R2k24J59O8K4l77O1n4K13O3o3j34MP4L4
3459@j17K20j13j38L01l43K39j33J51r2K04j95k9R6M7j4j94K75k02K4%K3J12j8
3483A04j17j41L08M5j71j19J17j21J10P3m10M25j49K60j09k07J3oM4p2J94j06
3505c5J01J10j71o6K90l34J91l7J0J4l2j21p8K64r1m6M3o3N7K0O5k12J12J11k73
$$ y = [-114, -82, -31, -129, -94, -90, 215, 9, 147, 156, 120, 36, 47, 7, -21, 141, -291, 64, 105, -33, -69, -68, 38, -12, -12, 80, -251, -109, -86, 160, 19, 100, -55, 236, 157, 39, 104, 14, -60, 135, 126, 143, 27, 93, -134, -12, -30, -17, -258, -135, 44, 245, 53, 80, -128, -146, 8, 169, 49, 102, -98, -33, 20, 6, 33, 142, -59, 12, -67, -16, 18, -337, 185, 62, -25, 13, 91, 123, 147, 98, -13, 187, 129, -90, -136, -140, 11, -12, -33, 92, 39, 55, -63, 76, -59, 104, -156, -252, 140, -141, -357, -336, 136, 8, -304, -92, 50, -106, 302, 60, 152, -72, 87, 155, 179, -198, -137, -191, 22, 85, 22, -112, -108, -34, 0, -117, 103, -10, -148, 153, -190, 49, -84, 67, -25, 179, -16, -45, 51, 98, 84, -110, 165, -37, -13, -13, 10, 122, 104, -13, -154, 154, 199, 28, -91, 26, -95, 15, 88, -322, 103, -46, 214, 105, -102, -89, -95, -51, -123, 71, -35, 66, 176, 5, -61, 229, -105, 86, 49, 59, 73, 41, -80, -158, 106, 15, -31, 12, -51, 6, 26, 91, -121, -9, 102, -171]
3530a71L77j4l40J58Jr9J00n3J31j54P7P2R6j59J9k6N0m2k04J39Q1QK1J15p5r2
3556A6r6J78n6j25K02oj58L4N9O5k16nQ8J10o4P5Jn0J6j44P8K53l11O6r5J49j24
3583f0M1Q4k19J81J14k93K23l71N30k92J18m2k6J14j59o3P9j54R8K19j66N1J35
3606A42j79R8o9J50j05k1p4M25j73M5j89k08K32Kq0J04j31Ml1K22j20n3J44l55
3630b20K86N6k31P1J6k62J60K74k3k7Nl8O1r8j62J67J15k00p9K71j12j76QJ67
3654B9K48k57q2J40m7p7P4p2M7N9p2j78O2J31k1Q4j5J37k00j14J63J12j87j3J6
3679c3j77J64R2k62J87K21j23L6Qmj85j65L03K3j11j44J74J9j24J48j7J66j51
3702D5j79K47J00k90J06Q5j13k2N3J7p7j5r2K1M0L13j85L1k49J55k9m1J13K7m9
$$ y = [-171, 206, 192, -148, 10, 11, -88, 12, -41, 90, -64, 13, 85, 181, 22, 41, 15, 65, 23, -181, -42, 39, 47, 68, 183, 108, 16, -80, 98, 42, -83, 119, 113, -45, -11, 48, 113, -103, -108, -20, 90, 26, 101, 102, 52, 68, -76, 2, 255, -56, 10, -85, 64, -60, -19, 65, -154, 27, 141, -152, 71, -300, 230, -62, 56, 14, -12, 102, -57, -120, -41, -195, -97, 122, -44, 7, 142, -37, 61, -8, 142, 37, 16, -58, 367, 194, 239, 50, -158, 74, 76, -4, 100, -31, -27, -58, 164, 44, -9, 135, -220, 66, 122, -109, -38, -22, -284, -124, 150, 127, 100, 105, 67, 128, 30, -132, 35, 150, -50, -129, 142, 30, -146, -138, 29, 277, 20, -62, 78, 31, -46, 28, -44, 3, 62, -10, -188, -126, 5, -16, 68, 53, 190, -10, -124, 39, 151, -36, -49, -33, -210, -46, 46, -216, -29, 192, 69, 105, 113, 109, -76, -241, 62, 85, -26, -170, 4, 23, -101, 47, 30, 196, 45, -134, 113, 213, -77, 29, 114, 1, -21, 32, 49, -28, -43, -135, -114, -74, 239, 54, 85, -164, -9, -38, -79, 34, 61, 12]
3727A2K4j73J71pj11L4Q7j34N5P1j59K16j43l3m3J21J1J02j07K03k52q8K28k85
3751b00J90n1J0L13j3l30J05K5k09J70ll3k5M8j22Q5q3K36j4qj37J16j7p9J6O9
3777E9l2p0R4m0p3K70j78J9j28K66J5j72L0J11k35J34l2l3m1k0P4j19P1j51L15
3802A34O3R0k35J4o7m9Ql3j30K53J37j97j43J76L2j90QO7P2q3J9O7J68j46k1j55
3828a41M5J35j56L8m2J11K83j78j78pj1k52L25j17J86R9k69j10J10K18j3j60R4
3851A0R8k01q6J99q2j27J93M8k51K85pk55L4L01Mk49K09J5m08J98l9L4K0R9o1
3876a9j00J14q5m3J4K24k64O3J84J42k23m7l1%m9j97L59n8N3J46k78L84l27K0
3900a8k1R1Qj49K29j75J3N3j4N3l1j56K03M2jr6j6P3K6k10K00k45J02k0M2J35
$$ y = [12, 36, -137, 34, 27, -84, -50, 37, -97, -42, 29, -130, 86, -57, -90, -133, -12, -1, 101, -6, 197, -55, -143, 85, -200, -10, -61, -51, 262, 249, -81, 24, 49, -160, 10, 7, -26, -51, -3, -125, -40, -123, 113, 99, 91, -46, 70, 53, -26, -10, 59, 27, -43, 51, 11, -62, 208, 30, 49, -79, 187, 202, 30, 60, 171, -64, 70, 38, 5, -36, -56, 18, -101, -30, -181, 134, 197, 287, 52, 66, -1, -50, -42, -75, -205, 48, 185, -12, -155, 21, 53, -137, -129, -62, 10, -73, -54, 13, 181, 35, 14, -141, -96, 39, -117, -79, -121, -10, 273, 95, -83, -90, -101, -353, -28, -145, 41, 140, -129, -239, -129, 89, 76, -84, 10, 108, -93, -179, 20, -62, -189, 4, 52, -199, 86, 79, -176, -142, 159, 163, -86, 123, 138, -270, -72, -111, -77, -57, 42, -19, -119, -5, -90, -133, -119, 105, -159, -96, 88, 230, 7, -40, -71, -71, -120, -317, 42, -16, 37, 183, -95, 289, -38, -18, -39, 52, 60, -89, 140, -35, -22, 31, 17, 70, 39, -117, 86, 128, 127, 31, 15, 88, 114, -96, 104, -141, -39, -59, -17, 118]
3926A18j40M3j37K22m9k50L28J86l86J03J6j26L0J36l71K66J49r3nq8mN4q2K16
3950A36k4ok17R3K03l93K79l9Q4j45N5Pm5j56O5nO8j75J57L4q9Qm9N8M5j24J60
3977a5j38J20J8L67k70k09P7j02L00Nm83J67J99n0J78l37K00j30N4J96jJ9p4M4
4001A35qj41n1N5r3o3K6L8N8N2j05J87J11l15l4L33l08J07j78L18p7j31M3L5J09
4026A03j81N6J48j43k4j92L14j3K65o8l56J18k8Lk11K66l7N4k5L5K0j42Q3j85
4050a40R3K5J18o6q6J93L8j14Ok59K04o8j41L86k53Q2q8K54N9k77J20j49j28L
4074a88K44K01k89L17m00K10j4r5k17K28K63l55J47k76N26j83j35J36j95J02j11
4095h4K89l37N3k2P6J27m5j7J2j27n0K38j39Q5j30J94k49N7K20j65k0l6q3kL32
$$ y = [118, -22, 21, -116, 106, 57, -193, 135, 321, -65, 38, 54, -72, -42, 94, -277, -11, 138, 45, 40, -48, -52, 2, -80, 136, 112, 106, -111, -18, 185, -208, 71, 32, 116, -29, 26, 33, -12, -168, -103, -108, -40, -215, -58, -24, -113, -105, -154, -96, -51, -175, -15, -153, -33, -15, 352, 82, -127, -50, -152, 148, 153, -330, -163, 36, -14, 164, -173, 27, -103, -49, 147, 146, 165, 91, 135, 127, -14, -65, -10, -103, -166, -140, -102, -44, 8, -97, 90, 201, -114, -148, 185, -123, -16, -194, 124, 47, -84, -41, -6, 103, -78, -22, 126, -17, -41, -233, 81, 68, 333, 265, -91, 27, -1, 2, -209, 57, 20, 74, 49, 84, 104, -38, 45, -140, -47, -22, 96, 30, -56, 137, 175, 61, 67, -192, 12, -56, -197, 189, -64, 18, -70, 184, 243, -34, 86, -63, -191, -188, 56, 257, -32, 285, -115, 95, 81, -14, -231, -3, 260, -95, 52, -224, 302, 119, -16, 120, -75, 27, -84, 205, -132, -79, -101, -25, 102, 57, 40, 52, -75, -125, 113, -26, 59, -71, 123, -126, -69, 151, -14, -34, -70, -153, -155, 177]
4120A77q8j49J79Oq9P7j33m7J2m5n8J39J6q5L5o4M11k37j91K64j38m6o5J33J73
4145A87k25j4K00Ok30J12K09k28L8L3L7j89m2L5J07p3j31O9P6J23r8j1PP8j00
4170b4R9K49o9k93M9k4J23q7O1m6j19K08q4j08J26loP5k21K88l19K63n1j64j25
4195b02K06k3l9K4q9o3J31J40j08K6R2k59J44r4P3l2j5K30k80K10O5k52K88k28
4219e5Q0J07n0p0lr2M8J02j68M5m1J56j36L2p1J50j93J07K25l24J72r8K80j55
4243D8J0j30J57m5O9n3m9J2j31K35K2j06j22q7j5K36K2k15n2J47j9p1K14j03M5
4268A9j71K78j43k2j10J66j97J34J67m9J59k30J0o7J01k33K29M8p3N1k06J06j73
4291b06J56M5J56LR5j59n1Q1j74l9P0k9j03K16r6K3l8jm3Lo3J46J37k34k7J10
$$ y = [177, 89, -60, 119, 125, 36, 113, -20, -67, -55, -100, -158, -19, -3, -88, -53, -117, 294, 57, -134, 130, -8, -54, -119, 14, 187, -38, -52, 148, 154, -76, 36, 245, 17, 55, 88, 125, -64, -106, -71, 36, -37, -168, -99, -23, 100, 2, -9, -2, 76, -24, 75, 324, 255, -38, 11, -13, 110, 23, 84, 38, -81, 127, 43, -65, 61, 58, 52, 127, -94, 194, -125, 138, 87, -77, -202, 4, -19, -58, -34, -123, -186, -55, 85, -23, 3, 95, -164, -20, -114, -41, -73, -88, 142, -138, 72, 137, -115, 173, -55, 25, 132, 82, 12, 9, -83, -35, 67, -101, -56, -97, 59, -77, -45, -116, 34, -159, -52, 173, -151, 21, -77, 203, 48, 58, -72, 85, 40, 109, 56, 7, 19, -112, 123, 145, 39, -83, -170, -185, 51, 73, -142, -194, -47, -66, -137, 77, -26, 19, -152, 126, -17, -39, -149, 17, -180, -46, 121, 72, 231, 1, 11, -56, 45, -188, 41, 89, 16, 67, -139, -33, -206, -50, -5, 151, 154, 249, 90, 39, 120, -54, -93, -23, -52, -155, 61, -35, -12, -50, -51, -94, -91, -154, -8, 129, -105, -132, -22]
4317b2N6M2j80J86k21J87j29J62M9j29K36o0k54o1M2N5Q9J30k40J07q3m0L55l55
4341g8J14L0m9Jj28O4J10l2J28l3k84L14o3j93P1r7l2L14k07LJ91l03k9K90l6
4366F6m9J64k34J54P3j40k14K57k1k01J80r2j33O8k2QJ4J54l1j3l9N1M6qj12K54
4392A80j97K18l20k7K15j60k15M03J19j51m0k8j81M38j78P1p9j36J18N6k04J73
4414G5j57r9L6R4J09j67K05j76L4K0k7LRJ45p6N7r9J30p4J01k01J27K3j91q2J36
4440d5J94p3n7O5Q5j95K02j15j52N6M7j32o9K97j69J11j17J43n8j82K04Q9j22
4463Go0j40K55Q1J88j72j20Lj67J06J74j5j70R2k47Q8j7O7J34K2j55Q1o8pP7j46
4489a09J23k10l7M77j54j11j1j74K88kk10K5J83O4r5pjp4J35J75l40k8L5Q2m0
$$ y = [-22, 34, 76, -104, 82, -139, 48, -81, 81, 130, 1, 237, 177, -77, -138, -96, -41, 48, 178, -62, 45, -38, -78, 277, -78, 36, 66, 17, 18, -110, -46, 64, 32, 160, 127, -157, 157, 94, -99, -28, -125, -157, 157, -50, -47, 144, -159, -188, 102, 66, 17, 181, -53, 101, 174, 34, -180, 77, 56, -145, 35, -57, -190, -122, -144, -136, -122, 32, 1, -12, -51, 0, 46, 38, -74, 180, -17, 201, -119, -146, 69, -91, -306, 97, 216, 65, 25, -3, -184, 254, 76, 147, 68, -68, 50, 106, -98, 75, -82, -181, -145, -51, 58, -109, 96, -80, -46, -26, -53, -50, -41, 104, 28, 85, -14, 116, 42, 143, -58, 69, 92, -99, -181, -45, 149, 76, 19, 84, 169, -26, 176, 61, -91, -35, 12, -120, -189, 108, -61, 50, -67, 76, 18, -164, 40, 129, 7, -53, -193, 62, 143, 331, 159, 39, 42, -125, -19, 155, 140, -30, 62, -185, -97, -114, -47, 87, 109, -46, 35, -33, -40, 37, -109, 14, -196, -233, 244, 90, -21, -32, -206, 82, 80, -130, -105, 78, 142, 47, 40, 39, -35, 100, 275, -65, -93, -58, 24, -16]
4514a6J12j50J45q9Jj03r2K02q2J3J0m5O2J23n1J3j20J67Po7K43m33K13k43R5
4539h5J58r5n8K18j84J38k44J79l4p1N2j0P5J95j29k93K5P1O6K12j89l4J25k41
4563a53P5J28j20j8J51jJ07o7n8r5pK2J04KK8l1J05k29L0q0K19Ok60J71K18j86
4589F1r0J08j72NJ25r7L1K26q3l8q6L1k9J17k55K53q7J21j84j47J27j7O9R5J9
4614A03k1k2m1k53J86J85l45J29q8K27j33R6n7k2J75n9k5j32L23k92N9J73q8Q2
4638A60k48J29N2k27K5K75j19o8R5j67K56k9j72K2O0M2o4j27J7j59K36LQ9K4J3
4663A18m47J39j6K96j87J13j69L53m4j61J06k94Q9J92j98J00K66k98l5ko9M9J8
4686h1J25J32j44j25J41J54p5k34Q4j16R6L0k3M6K4J33k63J32j14Q4K24o4j13
$$ y = [-16, 96, -54, 91, 2, 3, -100, -192, 10, -72, -59, -49, -94, -32, 91, 40, 53, -67, 100, 107, 40, 283, -150, 63, -180, -85, 73, -22, -80, 138, -46, 92, -152, 27, -7, -78, -26, -36, 39, 234, 105, -188, -163, -92, -26, 186, -3, -37, 88, -153, -78, 50, -70, -88, 63, 62, 169, 102, 44, -51, -58, -36, 68, 70, 98, 67, 172, -57, -27, -107, 112, 118, -142, 29, 247, 61, -29, 79, -93, -88, 37, -60, -29, 197, 114, 76, -10, 21, -8, 109, -146, 107, 20, 141, -43, -190, -63, -80, -11, 84, 103, 82, 60, 19, -234, -48, 137, -208, -79, -167, 60, -73, 23, -34, -56, 119, 60, 35, -97, 226, -66, -7, 166, 78, 160, -88, 41, 93, -134, -109, 166, 47, -21, 74, -93, 163, 134, -38, -16, 44, 86, 22, -105, -88, -247, -11, -8, 81, 105, 118, -329, -190, -206, 90, -97, 16, -153, 200, 156, -5, 101, -193, -104, 88, -110, -10, 256, -42, -77, -79, -148, -99, -81, 44, 176, 32, -93, 48, 202, 127, -107, -23, -139, -43, -13, -36, 10, 34, 167, -96, 36, -78, 6, 230, 166, 53]
4709E3j38J9j32J39n5K93j96J68o6mn9j06K05Mj2r0L8m2Q6k01j71L68j62Q4K5
4734D8j00PK8P4J5r1k0O0O3lq3K8k7O3j94J14q3L16k53r1N4J95j73r1Q0mR9L0
4762F1q5o9N7K1R7K6q4o4Rj29R9j04J5R5m8L28k76J9j6j0q4M23l90J81P6j37M1
4789E2o5j29K96k91J40l9rP5N6j88m1P9o7J46q4P8k5N4k04J59K8j28K53l3k33
4814a20J38J18m1j90o4J88n2J81l2j79j31J58K8J00n8R1j59j1Q2j50R0m3Q0J9
4838D3n8P0p7Q8M4j13j0j40l0J48J28j15K27k34j82J94J25m6j25O1J20l91J99
4861g4PL86k13j58J48j56K19q7q9oj8R7k49J50J10j73K11j08LQ2m0M6j12J11K8
4886A15j71J66p3Pj14N9J17j98J94j94j06J50N9K28j33N9k56q0J28pM2q2M5no0
$$ y = [53, -85, -66, -198, -59, -114, 179, -17, 151, 85, 81, 22, -84, 121, 125, 113, 23, 61, 19, 105, -96, -267, 101, -61, 23, 48, -52, -45, -17, 57, 72, -19, -39, 21, 84, 81, -2, 26, -1, 62, -132, -18, -101, 215, -38, -129, -75, 120, -53, -144, -64, -68, 31, 61, -24, -93, -36, -15, 82, 108, 24, -40, -31, -160, -61, -165, -150, -55, -103, 225, -51, -32, -48, -58, -142, 281, -109, 72, 148, 11, 52, -13, -142, 154, -137, 3, -36, -45, 30, 86, -102, -143, -64, -131, 15, -69, 9, -16, 38, -166, -7, 21, -107, 146, 113, -120, 18, 136, 95, -95, -159, 29, -23, 158, 126, -53, -184, -26, 2, 102, 44, 135, -24, -35, 47, -103, -13, -56, 24, 43, -15, 55, -22, 66, 110, -3, -13, -153, -183, -35, 93, -22, 205, -29, -211, -17, 108, 62, -63, -2, 118, -273, -74, -67, 319, 106, -52, 96, -60, 159, 72, -17, -23, -41, 56, -193, -43, 67, -106, 105, -3, 0, 82, 42, 88, -24, 87, 115, -56, 110, 37, 44, -70, -11, 106, -92, 102, -92, -198, -48, 11, 239, 106, 165, -91, -171, -43, -50, -8, -90, -45, -50, -110]
4911a10MP5L41l0j89j70K80k14J06K54l11k23J02JM7J48N8k18J68m02J87J08k0
4934hK0l5J46k27J95j98j27K39l1k25L70j18J28j09Q7j20Q6j04J1J26j54J92j44
4957@k31M87l77J23K13K7k15q9J29p1r5J40m9J40p7Ql6R2j23K36k5q6m4J78j27
4982A28k37J18j73kP6K21k91J61L6j98M8J53L5j50J06n2j39J84j95K11k17M20
5004B43k23R1m9N5Kj47M0J13j82R7n3J41O0j45q7j17k5K25J01k09p8K10j63M8
5028e2J03j85L3k7K50j60Qp2O5j07O6j5J31j24l7J12O6n2L1k58O4P7J38r5j44
5053a84K51j00j80L06l0L7J0j59J51L1l58K52k6P1q7j13N4J86M4k41R3K15n0l75
5077b02J34J99j27P4j09p9MJ35O9k49K93l6k32J34k3r8n8Q8J07j02k9K87p6j90
$$ y = [-110, -106, -31, 310, 280, 91, -79, 201, -13, 93, 347, 36, -187, -85, -84, -37, 111, 169, -49, 119, -283, -96, 12, -8, 12, -23, 123, -104, 91, -107, -234, 5, -26, -251, 119, 1, 129, 20, 107, -13, 73, -31, -20, 106, -48, 144, 0, -231, 256, -121, 2, 215, 242, 27, -62, 67, -4, -99, 41, -8, 132, 55, 63, 27, 119, -4, 232, 207, 121, 77, 255, 128, -109, 9, -164, -166, -90, 131, -160, 1, 37, -161, -113, 40, 75, -75, 31, -21, -160, 24, -171, 40, -177, 243, 20, 111, 62, 117, 119, -28, 12, 125, -57, 40, -13, 128, 188, 43, -44, -161, -186, 39, 140, -69, -147, 63, -100, -52, 51, -134, -101, -128, 122, -38, -30, -102, -37, -144, -78, -93, 38, -86, -123, -11, 55, 3, 34, -224, -160, -83, 55, -40, -184, 67, -33, -213, 93, 63, 100, 110, -49, 102, 133, -225, 27, 1, 72, -15, -128, -74, 112, 156, -85, 8, 223, 173, -202, -68, 131, 4, 78, -31, -110, -106, 29, 98, -151, 142, 106, -126, 8, -15, -113, -171, -83, 24, -78, -107, 180, 104, -86]
5101h6O1J57l5o6r8J01N5m9r7p7n3J41Q3k8l9q5L00k64lK3Q3K1Jp6j0n5l1J06
5129b0Q8j67L18l12K03j94L9J33K60l04j17J91l68K06j86L11M0Q7k59r1J21K3
5151Bj6L2K4j00j45K60k5O0j51O3P5O5j72J39k14J31O1j02Q2M8k29rK89j60rl3
5177c4O0K3M6j85M0K59l22J16J12J44k37QJ40j23j3N9j85k4P3L03m17K55p5n1
5201b8Q4j00J54k67L28n6j51p2J27k40Q1J22j05L10j16O5j09K74j35j05j11M4
5223fj85K41j4l4J30L9j57j66J72R6o2m3l6J4q6J30M7j39k0o2P0N3K9J11r8k2
5249Bl5o3R6j8j43J74J20m0j46j06J69n0J47q7m0j51J96k3j50K95m6k22J35j8
5273dJ19k1r8J44M2j52j9m5j04J10M7J12r4j03O6J82j26R6j62K47k34p1q0K56
$$ y = [-86, -25, 132, 97, 31, -67, 34, 89, 40, -57, -134, -187, -46, 37, 9, -30, -115, 185, -79, -82, -59, 24, 45, 46, -30, -40, -95, -126, -20, 68, -99, 219, -93, 110, -84, -45, 88, 348, 44, -73, 118, -250, -44, -230, 81, 121, 208, -51, -142, -21, 2, -14, 18, 42, -58, -203, 57, 32, 92, -59, 4, 79, 144, -28, 111, -103, 28, 89, -13, 69, 117, -112, -121, 168, 8, -1, -34, 26, 49, 95, -90, -50, 209, -113, 3, 115, 259, 22, 30, 170, 47, 34, 93, -92, -116, -43, 260, -157, 98, 23, -28, 56, -44, 110, -157, 171, 115, -36, -108, 19, -221, -140, -18, -123, 187, 71, 136, 27, 301, 166, 61, -50, -6, -191, 50, 36, 2, 132, 171, 14, -152, 20, 116, 54, 11, -25, -11, -97, 33, 80, -59, -79, -141, -71, -18, 11, 122, 24, 2, -33, -96, 0, -18, -161, 13, 133, 93, -53, -159, 10, -40, 107, 20, -20, -171, 25, 2, -148, 147, 101, -121, 14, -4, 115, 94, -4, 140, 182, 30, 11, -34, -138, -28, 19, 131, 37, -66, 0, 182, 56, 152, -10, 237, 3, -68, -148, 108]
5297A08k13K92j25j57J77q5K73n21Q0N2O1N3J78j8q2m8j03J02k99L57k64O3J80
5320F1k2o5J53k0Mj24k8J66j77J35L9m2l13J42J57k50K68p1r2J77r4kJ53p3J72
5345B54k79jN2n6L63m03J20j14nJ45j30J43k6m6J22j10l0o4k9J65r0J24k37K81
5369A49j18j30K65l3j00j7k39J94N8j11K1J08j1l5j82M22j20l00l3J78L3j86O1
5392a26L58k39J29j86J31J09j48m8J31j80K00k21pL28m03NL03j57j68K10O2r4
5414a1L7n7Q2o6N2j26j3J50n1J30J27l35Nn6M35k24k63K45j17n6J81OJ43k96J30
5439E2k19q1K75Q8l4m8N8M7j8o2j28J36M3k58J53k4L7l0J28k36O8RN3q2m4Q1O4
5466B8Q7k55J99J42j25j0j95n5J17O6n9j15K10j35L1J83m7j50j50L58j05K39k54
$$ y = [108, -105, 187, 62, -95, 82, -3, 270, -251, -171, -119, -58, -5, 173, 155, 73, 25, -78, 24, -275, 82, -182, -119, 61, 39, -26, 127, 107, 111, -13, -41, 125, -52, 83, 122, 80, -233, -91, 66, -184, 84, 13, -79, 98, 4, 2, 155, 82, 254, -25, -26, 26, -30, 333, -70, 50, -64, -69, 76, -54, 89, 63, 17, 139, 29, -1, -65, -94, 71, -19, 105, -132, 149, 31, -99, 166, 133, 33, 16, -223, -29, 29, -82, -61, 47, 36, 1, -181, 241, 121, -179, -212, -34, -1, -187, -126, 232, -7, 122, -64, 67, 176, 28, -20, 111, -69, 131, -90, -97, 231, -172, -167, 136, -21, -189, 21, 83, -11, 26, -31, 51, -15, 37, -89, -102, 48, -3, 127, 254, -81, -76, -132, 303, 79, -184, 61, -56, -112, 69, 75, 218, -78, 52, -167, -248, 27, 115, 81, 33, 91, 138, 120, 58, -70, 66, 109, -149, 4, -20, 17, -13, 115, -121, -53, -44, 9, -73, -117, -36, 28, 115, -140, 59, 201, 76, 66, -129, -184, -67, -1, -60, -175, 35, -100, -69, 114, 67, -83, -233, 125, 20, 259, 5]
5489EJ07j69o4L17q7P2j36r4R7j70K27l03L91j49j61J76o4q6J11K1k37M67l07
5512c6J08r6m6Q6N5L3k49J88j43J22j29J40K7j99J99k0m4J22j76j51J55q0J66
5535C2r2J46j46M3r4K47k17O1j82L06o2L3j49J09J25j54nL3M3q9j05K9K61k18
5559d5rR0pk51P4L01mj08o0o1L02R6l94O4J18j05j3m1Q6M7k36K34qkl59K55N6
5586B0m9k0o8M9J5M4J4J82l8k89J3L73k88R3j11O3J50l7r2P5j89j91M36RP7k93
5612e2p0K70j14p4j6o8J66rK8q8j20P9J24j59o7r5K50O7n2n1M0j48K44j75J16
5637B6p1O3J69k35j4J85j17J09j0j42j7j18L5J45m6J21j98J72r8J21L5j63noo9
5662a28R0Q3j21K22j03P6j51M8M2m8L5j68J09oj21L2J18P8j94J62n0J69k43O9
$$ y = [5, 112, -57, -121, 196, 109, 181, 45, -49, 48, -122, 105, -198, 193, 44, -117, 59, -5, -91, 20, 41, -196, 271, -36, 72, -24, -70, 16, 71, 104, -145, 43, -100, 22, -107, 33, 60, -139, 60, 40, -4, 118, -58, -209, -54, -134, 32, -60, 86, -60, -17, -111, 136, -81, -20, -202, 104, 42, 75, -74, 35, 160, 6, 1, 34, 77, -12, -117, -88, 173, -45, -54, 36, 29, -222, -148, 153, 149, 41, -19, -80, 222, 318, -76, -12, 106, 1, -12, -53, 33, 80, -156, 78, 70, 68, -291, -36, 20, -29, -49, -117, -68, -53, -9, 5, 187, 149, -140, -127, 246, -42, 51, -60, 3, 153, 116, 24, 99, -90, -281, 155, 164, 241, -52, -122, 148, 34, -40, -56, -124, 42, 33, 61, -27, -147, -68, 56, -103, -170, -265, -15, 52, 0, -51, -11, -159, 85, -90, 26, -45, 18, 187, -48, -62, 123, 6, 115, 105, -37, -54, -172, -137, 8, -38, 83, -115, 57, -41, 80, 115, -48, -53, -59, -128, -38, 45, -76, 146, 43, 119, -32, 16, 58, 10, 45, -123, -14, -20, -141, -109, 9, 87, -107, 55, 5, 174, -69, 0]
5686@k2j70K57j00L1m9J03k1M6j37nMJ82j9L3J65m93L46j41k35L12J96l75J26
5710C4J41j23K25l03M12m51J32j18M4j8j65PR0M8j29J86j55J89j71L8j48K63j00
5733g2J74k75K03j8K08m29J16J10lm7O6r4J19o9m3RJ49m53O1J80R7M7k23K38j92
5758a41J04j04L5k5J57r4J15K7j38l1Q7m8j1O9K63m05J79j97L98k61k14K95j63
5781a03J08r6K01m8qj2J9o0k6J27q5J30j72J08pj64J29j91O2K29k39L19l53P7
5805e5J31k81J70K4R9J2n1lQ9p0n4j44J35o8q2K43j47m7K52j15j60K26j71J82
5829A15J21l16j94J54J66O2j12O1K2pj8J31j55m7L3O9j73O2K13k58Q3L3o9j8j0
5854e2K96k41k14M54l28J28j5j02J66K00k08k21R2Q6l63L16J51Q8l97J92R6n5
$$ y = [0, -22, -192, 65, -35, -4, -53, 50, 29, 75, -62, -67, -63, 119, 100, 133, 298, -195, 151, 10, -225, 87, 283, -92, 34, 175, 52, 277, -26, 386, -65, 67, -51, -7, -25, -190, -183, -93, -45, -174, 12, -143, 46, -125, -87, -235, 28, -72, 102, -173, 30, 12, 220, -209, -93, 17, 14, -33, 33, -61, 58, -11, -54, -45, 104, -349, -288, -108, -11, 36, -187, 51, -141, -37, -141, -106, -131, 26, -68, 47, 74, -64, -95, -8, -56, -67, 2, 265, -140, 39, -158, 240, -21, -235, 60, -103, 5, -91, 110, 62, 54, 42, 61, 1, -25, 102, 17, 147, -25, 83, 76, -88, 41, -150, -88, 141, -98, 221, -132, -55, 76, -205, -35, -11, 88, 100, 49, 46, 135, 65, 11, -133, 2, -66, -148, 95, -52, -99, 153, 38, -122, 104, -67, 115, 236, -80, -274, -120, 46, 108, -4, 57, 79, 72, 54, 185, 30, -17, 16, 85, -88, -26, 187, -71, 12, 45, -24, -42, -52, 244, 3, -211, 243, -85, 43, 28, -74, 92, 292, 84, -137, -45, 41, -322, -6, 145, 233, -164, 28, 124, 69]
5876F9j22j91L42n5M0N2q5j06On7K44k00J11J0j91J77j74j38L29j19j5J34o6k57
5900b62J95M66k60j31j0j76P0K23k88L07k05J56j30K1k5J91j36J46J28l26K48
5921B02k80J13m7j2J37J45m41K37J42l45Q5Q6qJ5j25J03M9j99R1J79r4K75j67
5944A41j12j46J97j91N2LJ16k4j53nO5L51n96M06k29K83j23j00o8R1K01M3j68
5967C4J12O7k10k8k5M0N7j30J25j6O1n5n6J13j4K27l13n2M9J9q5j74J86j0Q3l3
5993b8j69K90R9k22J95k50Q7O9r1rn9J65l0NN6k72J73P6p3k20O0K64j00l1J19
6018A04j37q5J94K6k44K29j11j71J36k6j3J91l3l3L8k22J28O9j31K83k41p4J00
6041b3J29Q5l25J86n5K10q7j29q0N8N4j69J06J87j40r7P4O7j2m2j37R9q5N1Mp6
$$ y = [69, -53, -244, 98, 43, 83, 135, 50, -56, -50, -107, 137, -63, 48, 58, -133, 44, -130, -268, 61, -58, -73, 61, -5, -262, -67, 399, 139, 8, -2, -178, -108, 115, -173, 134, -71, 85, -45, -24, -49, 142, 6, 152, 280, -46, 202, -78, 35, -12, -24, 113, 258, -183, 54, 196, -149, -64, 22, 14, 29, -96, 7, 56, -143, -52, 127, 33, 308, 141, 29, -117, 80, -111, -59, -56, 60, 36, -117, -122, -57, 294, -302, 104, -125, 158, 35, -65, -133, -42, 159, 202, 34, 146, 213, 3, -25, -50, -10, 47, -83, 42, 26, 87, 32, -24, 89, 75, 302, -11, -63, -14, 5, -80, -254, -68, -78, 5, -28, -197, 93, 192, -30, 165, -85, 2, 71, -20, -29, -88, 77, 47, 52, 108, -164, 9, 85, 12, -208, -148, 116, 16, -15, 104, -33, -118, 76, 102, -142, 87, -24, -195, -59, -85, -98, 93, 60, 27, 65, -157, -29, 40, -91, 192, -49, -123, -23, 106, 191, -134, 52, -3, 207, 120, -9, -89, -31, 23, -146, -40, 147, 7, -90, -16, 51, 39, -3, -140, -41, -126, -75, -71, -147]
6067a47J96N0j47Q5M5M8J4j35k44K49L7J43j59n3r2J00K41m01J95m2j53M4rK21
6091H6p3j52L01j60N4q2j03J46kJ7m7l0J31j30k61L97o9J05M9k69N2nJ07j19L5
6116b2k07J74O6j61J80j12K11k09Q4j04J17k4J1Rj13J9p6Q7J79j92j20M9R7J52
6140I5j18j29L70l25l7J88K0q6N7j1j12j66L04q4Q5J24k06K5mJ94n5j43P3K5j38
6165e4J52k98J50N7k7K5m7oO2l4j71K53K18l12l1J14j3q5l6j31K46j76K70q7o1
6190b2n9j52J84N1jk5j13K71j27J31m5J5m0j54K9J15O1J98l60Q0j51J48Qj2l5
6215em45N32j04N2j89J45j90K24j60K8L12k86m0J27J7j8J15m3j88K23k44P6L26
6238B65m7l07k4R9J6K22m8j09j39N0J63j7J3Nl62K41o4J00K7k6L4j07q2J31q1
$$ y = [-147, 49, 99, -48, 37, 82, 130, 144, 9, -235, 14, 51, 194, 35, -18, -110, -10, 231, -170, 25, -17, -170, -126, -135, 86, 13, -139, 162, 2, 56, -26, -129, 17, 15, 32, -15, -45, 86, -44, -305, 92, 23, 128, 177, -92, -40, -45, 62, -57, -22, -229, -55, 11, -150, 30, -82, 129, -80, 4, -100, 17, -7, 4, 13, -100, -81, -157, -70, 109, -83, -203, -154, -57, 95, -23, -152, 218, -107, -144, 44, 64, -22, 35, 24, -88, -254, 50, -34, 51, 175, -31, -6, -10, 184, 129, -14, 59, 84, -54, 98, -200, -50, 7, -20, 5, -42, -48, 14, -20, -191, 62, 280, -32, -63, 51, 38, -47, -83, -214, 32, -144, 126, 39, -22, -81, -233, -49, 2, 1, -24, -137, 134, 7, 138, 93, 108, 68, -86, -57, 58, 119, 317, -43, 37, -114, 34, 42, 30, -5, -450, 82, -22, 30, -159, -14, -204, 20, -140, -112, 200, -86, -126, 1, 18, 0, 115, 72, -116, 107, -137, -61, 265, 218, -89, -113, -14, 2, 224, 176, 67, -72, -22, 141, 124, 137, 142, -220, 21, -43, 57, 84, 58, 92, -15, -97, 34, -47]
6263d7Q3O6Q8k83n4J64m7N2r6J86j53kk07K78J63m6%n9r2J75j40q0Q8M4L2j56
6289d3m5J09k06J35K44j64J00K0k36m5Q9J19n3pj04P1NR6j54N5q9J30k37K79r9
6314c0J68j03j09l8K2J03k12J29M3K5K15k55K5j15J52o2J57l74K66k7O4o0l3J3
6338c6j5J07k8j28L4Q3K00k04J57j18M3j44K95k01n9O6r2J45j79J49j76J75k96
6361b22J78j59Q6J28M3J92j60l30K90J8j25J81m3j44R6k02l5L96k09j49K16o6
6383b0P4L4k01L6J80j63J45o0M1kk48K43q9J44k10o1J40J40j9J01k38o2O8m8o8
6408a43L95k41J11o9K7j57J98M8l1k09P9l1q6M0J31n3m7N7J6p8J10kM4Nj1j51
6434d8J6j08J21K29j49n0m4j5J8J00j64m3N1J7r0K05P3p7k89K29p5Q1j20J29j96
$$ y = [-47, 36, 102, 190, -93, -147, 17, -30, 22, -74, 112, -41, -43, -250, 28, 191, 145, 145, 86, -6, 169, 29, -51, 37, 81, 113, -43, -88, 21, -185, -50, 194, 30, 130, 150, -86, -131, -42, 77, 24, 17, -87, -16, -11, 85, -69, -14, -103, 27, -210, 69, -30, 138, 35, -74, -112, -90, 13, -199, -70, -27, -2, 213, -42, -17, -132, 20, -42, 115, -259, 7, -20, 44, -16, -49, -36, -51, 56, 28, -100, -66, 17, 217, 13, 170, 52, 95, -49, 246, 45, -14, 52, -40, 105, -74, 75, -101, 74, -222, -44, -203, -117, 11, 54, 246, 86, -244, 46, 64, -61, 120, 77, -67, 29, -173, -208, 188, -21, -170, 46, -20, 54, 88, -113, -77, 103, -60, 85, 25, 66, 64, -184, 59, -30, 114, -96, -157, -17, 123, 104, 205, -33, -95, -27, -75, -143, 252, 11, 122, 53, 80, -77, 121, 169, 138, -71, 8, -23, -109, -69, 62, 9, -38, 19, 35, -43, 67, 65, 109, 114, 103, -48, -32, -140, -19, 210, 61, 11, -33, -48, -30, 70, -94, -137, -86, -69, -159, 46, 119, 42, -247, -18, -93, -12, -132, -3, -199]
6459a99L26p7l6J30k01J21r9KQ8k1l6j47J96Q3q8Q7p4n1O3q5j6pqM6M7m9n3q3
6487a41J32q3K15Q9j70k1O1j19J28j40Q0q3O1m8M1J56k6j75J20j5m3j14L9Jk9
6512h4q7K43K12k69N3q2k44K20J51M0j27j59J02L0m2K3L0N8j72J20j8mM0j00M7
6537a9M3j96J88P3k17J10L7J53m06J65J38q5J45j59o0J26j40K67O2l68J77m8m
6560a8J46K7j95pkj2K43j17j68O0j31K61o3Q9j22R2r3k51L01j53J71j10J8k26
6584b60J81Q6J07k27K96q4o4J7l1j16Q7ojJ72j49O1l49K24%M2L9m7j61J80K21
6609B18rl26J22or5L9K59k87Q8k09J59P7l5o5OOk2K45j39l2N0L0j94J8K27n2m02
6636c29L82j02J25lR9m03K20Lj36J47L3K0j38k3K78j48J12j82j58K11n6K8j80
$$ y = [-199, 127, 50, 14, 144, -57, 64, -35, -33, 55, 34, -2, -149, 47, 130, 42, 129, 55, 4, 67, -18, -34, -41, -49, -3, 44, -5, -58, -141, -9, -92, 123, 212, 42, 21, 82, -37, 91, -49, 31, -52, 9, -39, 2, 158, 132, -43, 77, 62, 19, -95, -56, -55, -84, -171, 72, 284, 15, 68, -14, -258, -38, 113, 153, 26, -133, -31, -1, -43, -20, 10, 68, -104, 16, -2, -6, 34, -66, -19, 24, -172, 16, 89, -128, -18, 19, 172, -234, -69, 69, -16, 129, -30, -90, 36, -104, 163, 225, -143, 34, -14, -18, 128, 155, -40, -47, -49, -61, 182, 65, -103, -43, -174, 87, 24, 113, -9, 83, -10, -261, 40, -113, 58, -52, -34, -260, -79, 7, 114, -113, 183, 99, 35, 52, 21, -95, -8, -14, -15, 157, 8, 69, -280, -56, -56, -14, 25, -22, -183, -3, 218, 209, -117, 5, -1, -96, -57, 202, -85, 3, -206, -47, 30, -5, -70, -64, -58, -80, 165, 26, -6, 44, 74, -120, -102, 125, 73, -329, 53, -49, 76, 73, 172, -231, -11, -8, -144, 3, 36, 56, -82, -105, 173, 25, 137, -45, -203, 8, -48, -20, -200]
6659b00J04J06k05L18j95Q5kk3MM1jRn3r2Q7j05K70j62J89J54o2l44J58j98J93
6684G6p7m0Q8Np1L1n1K9J38N1k81o6P5j51K51l5J97k65J95j72k17L49j70J02j8
6709b7m6P3j89J19O8j25o7J74J36n3j20J45N3q8j72J95j60J63J34l65J59P8l5
6732E0j74J38lp9L59k25k17K80N0j33m7K49l01Q5j50L3M1j24K18j7J13n2mj66
6756g6J79o2O0j0j30k1J58k19L66k05k25K66n5Ok2o0K10m0L7n7j05J75j80N4m7
6781cqJ04p8j08j1K08k64L29L1k09j0j05QO6K4j31K81M4l7Rm1m7n6r2J93j48J29
6808G8O3j45J43k31L4L02n65M76m34M42j61K8R8j28j21K42k63J90j18jL6J43o5
6831D3n1L6j16J39r5K69k42Q9o3Q9j70q3K15J69j98R6K5r8l5m%O6q4J21j07J60
$$ y = [-200, -96, 10, -195, 123, -72, 13, 11, -12, -8, 33, 32, 41, -12, -104, -17, -122, 148, -14, 175, 329, 267, -77, 81, -117, 76, -1, -41, 47, 52, -19, 12, -39, -10, 128, 179, -102, -168, -93, -244, 7, -28, 169, -96, 99, -73, -290, 59, -111, -9, -27, -73, 0, -189, -70, -2, -127, -194, -20, 116, 63, -57, 88, 141, 53, -119, 76, -84, 79, 213, -152, 7, 85, 50, -124, 14, 11, -68, 291, 66, -151, 129, 179, 46, -1, 248, -53, 32, -118, -85, -44, -168, 50, 33, 146, 94, 90, -76, 103, 41, 101, 91, -39, -60, 98, -121, 245, 40, -185, 81, 26, 32, 10, -50, 160, 120, 157, 100, -5, 170, -10, 44, -3, -11, 93, 15, -93, -104, 104, -160, 169, 200, -9, -19, -124, -116, -50, -26, -157, 124, 168, 131, 140, 99, 52, -4, -96, 97, -51, 78, 141, -4, 139, -92, -58, 244, -321, 155, -279, 163, 2, 30, 128, 0, -121, 121, -142, 48, -70, -71, -35, 108, 43, -8, 28, -88, 51, -44, 225, -17, 72, 9, 98, -72, -155, 60, 229, 31, 127, 152, 54, 19, 15, 15, 81, -3, 118, 11, 171]
6857A71m2k0P5l04K09j01L6j21J13K04l95J46J79p3j56n6J71QM4q2J6On8J7K56
6882B43j51nN8l7j29rR1J1J5l64J18J40R2r5O1M5Q2j6k70j5M9O4K8p2K88k94N0
6909b2j94J64n4Q4J92l05j0J10k3P9Oj48J73m1m1P6J04k87K4K12o5o7k8lr2K60
6935A04j11j05K3q4L0J82J54j41L9p8k03L65l11m6O2Q4O2L1j00o3K4O8j88L9J24
6960c9J74J1j53l8R7j38L56m60M06k12J34j16r0m5m8K05J45j66j00N6J17l6q6
6983b6J07L3k21K68j74r6m3K37R1j82J06p6j15L8J01j14K5k4q6Q0M0j08K00p1
7007a0M4R3m2kj59J99j1j80p8q4L06j10J59l2j88p1K51k02P9R9l02L46j08P3J14
7032A84j66n1K03k00j56J36P1M5r5j35L02p4j73J16j17L04j94K9p8L1k5r8J20
$$ y = [171, 129, 109, 184, -120, 89, -12, 24, -97, 16, 220, -175, -29, 150, 77, -79, -135, 36, 44, 88, 6, 22, 28, -30, -13, 243, 92, 87, 145, 108, -21, -30, 61, 72, 87, -277, -159, -19, 73, -22, 39, 84, 166, 150, -120, -135, -86, -22, 6, -66, 222, -72, -22, -216, -52, -106, -22, 170, -135, -145, -35, -58, 21, 27, -121, 52, 11, -30, 46, 150, -137, -113, 99, 34, -33, -61, -64, -156, 104, -7, -112, -89, -173, -143, 39, 193, 52, 91, 13, -190, 175, -136, -182, -120, -36, 26, 57, -43, -106, -82, -14, -202, -163, -39, 135, 146, -7, -45, 52, -86, 270, -190, 216, 4, 138, 22, -68, -113, -161, 44, 189, 23, -77, -21, 96, 60, -26, 81, 114, -107, 161, -13, -109, -152, 85, 176, -6, 100, 24, -91, -53, 48, -66, -41, -65, -151, -71, -31, -139, 61, -10, 34, 127, 85, 83, -76, 123, 112, -68, -146, -230, 76, -34, 125, 93, -95, -166, 85, -117, -38, 61, -241, 105, -3, 70, 184, 18, -33, 170, -30, -186, -50, 21, 66, -29, -164, 138, 64, -109, 7, -110, 194, 0, 29, -49, -18, -43, -141, -21]
7055b1P5P0o8j61O8K49k70J99j24J1n7M2j20Q2M6j14J99j95R8O1ll1M3Q6L5k58
7081e8pJ19K9R7j12k50J39Q0m4q2j26J84r7K23j75J15N1J57k69J0K56k35J11L
7105A19j02L7k40J78L1k8j0J39k08J09k90L66j30l4J09l73J67K38p9M6K9l03J71
7128e8K60k63J46p1j43q5K96k71N1K25j07J34k25K36j58R1j9O8ro1j57O8r3J84
7152C9R8j02N8l7o8k3J47j50k4L7R2j89L36j70R1j04j35O7J72j11nKj50J31k29
7177b27K0R2K08j97L41j70J27J8k76k9K57m1k21o6J62M9n0kK4m7m3P7M5N2k35
7202a32K16P8l6o9q5L8j30J74oo5O4j21K16l57K84N0j70j48K12J70k22j15P3K09
7226A28l33J29J8R0L6l2l1j7j4J32j08k9k43M35k71R2O9l08L00j50J7J56n8j11
$$ y = [-21, 54, 124, 56, -105, -37, 212, -58, 141, 17, 28, -29, 13, -107, -25, 21, -93, 106, -89, 9, 70, 67, 36, 79, 165, 200, -58, -65, 54, 83, 180, 68, -182, -43, 37, -7, -89, -215, -31, -128, 95, -80, 35, 86, 243, -26, -16, 240, 5, 116, 119, 17, 54, -186, -8, 23, -5, -15, 124, -84, 25, -265, 101, -29, -63, 46, -327, -160, 78, -1, 45, 74, -229, -58, 202, -61, 85, 14, -129, -214, 82, -189, -138, 87, -20, 114, -111, 125, -33, 58, 39, 107, 98, 37, -120, -52, -145, 39, 137, 35, 93, 56, -12, -35, 112, -38, -62, -25, 67, -122, 214, 44, 135, 31, -104, -37, 135, 24, 19, 21, -129, 2, -227, -207, -115, 93, -104, 237, 67, 194, 212, -64, -93, 164, 123, -98, -164, -2, 47, -3, -5, 19, -28, -71, 6, 51, 103, -132, 84, 162, 126, 57, -28, 10, -120, 54, 48, -17, 47, -74, 142, -215, 69, 119, -51, -199, 13, 183, -39, -154, -81, 128, -205, -76, -58, 32, 68, 36, 5, -12, -26, 106, -2, -31, -274, 161, -110, -18, 51, -257, 43, -107, -90, 66, 8, -103]
7250a03J17P4N0j61k6jJ07J3j95L51l58K73l98L29j6m1n8K4J13r5P9j90L3j57
7274b36L05j77J72l46J94q0M68l27N4J41l27K95j99J43j64p6J12J83j82J01R1
7295A45r3M9o1N5L1k64J92j15M0qL15j15n4jl36K23nj06J61P1q5O7j61j67J19
7320a03K51j04O7Q0j86P4k59K89j7q8j88J14J83j62k0q8r0L5K09m6j00K47q2l7
7344b1qJ28j94%J93N9j56lk4P2p4J29J02m0k9j78q9K62p5n9J6P6j40k5J32R3J89
7371C36n44J05J78l31K1K50m2M2j05K05k80J50J80j57K69k99NK01j27K08l90R0
7393c5K50l69O3J01Q4o7j40N3J66j87o0L15j45l3jK36J21k51k14l2J15n6J2K04
7417A30k66J78o4J52k15J27O9k7j69j3P0J14j22J0j70L52k50R5J99k09J22q8k9
$$ y = [-103, 14, 88, 138, -23, -49, -50, 57, 70, -125, 226, -132, 141, -257, 72, 56, 15, -43, -19, 94, -1, 78, -112, -79, -236, 69, -108, 64, -282, -88, -168, 300, -27, 27, 168, -159, 136, -63, 80, -84, -160, -48, 135, -47, 54, 145, 52, 101, 40, 95, 126, -138, 54, -61, -21, -29, 286, 171, 117, 116, -220, 3, -2, -108, 53, 124, 39, 106, -55, -222, -103, 148, 44, 111, 191, 5, 79, -180, 109, 92, 4, -184, -70, 113, -49, -69, -157, -247, -212, -3, -49, -149, 98, 16, -21, -29, 99, -95, -95, 98, 157, 1, -2, -26, 46, -28, 101, 203, 163, 134, -44, -133, 129, 54, -5, 11, 87, -53, -78, 54, 147, 336, -208, -103, 75, -256, -235, 15, -27, 15, -90, 115, -165, -15, 165, 8, 277, -22, -17, 184, 57, 265, -125, -35, 215, -154, -91, 10, 94, 27, -113, -60, 106, -81, -141, 174, 29, -4, -5, 231, 352, 101, -113, -145, -30, -86, -74, 130, -136, 42, -22, 130, -85, 42, 111, 84, -85, -98, -28, 86, -36, -26, -196, 156, -94, 1, 200, -9, 113, 25, -4]
7440dM6j26m8K32M0j02R3k10J84j69Q1M0L0J26j32n2k32K10j40K19o9J20j75k4
7464f2k28M24j40m2Qr2L15j84k69L62j21j03Q3J80j9J1o6K3q6j62J12j3P2r9L
7489i3J08R6K7K31k97j31J79j10O6J5j47J52K8j06j27J12L6j52K99k19j26K81
7511A22r7jj6J34j65NJ68l23J35P7r1r3K68k05J05q2L02j91k09K73j90J28k57
7534b03J92J84k40K21p6j40o4k0J49K23l83J39o8J35J1q2J8J27O9k34J74m1J05
7557A96j60J38n4j50J76j30r5J8q9J30J55k22J88j91N4J2j11o3M6J9K01j38L2
7580c8o2l4R9J40R8j21j19Q6j7l02M63k5k54L14J43l73j01Q1J00k48L72r7j18
7603a3j51K02J24j01j22J10j5k05K98l3j82P1J37K3Jj61j16J72j46Rk5Q1JJ41
$$ y = [-4, 42, -84, -132, 100, 140, 38, 131, -79, 105, -64, 17, 57, 87, 213, 81, 29, -203, 7, -133, 86, 17, 137, -38, -62, -290, 134, -6, -48, -40, -132, 183, -1, -270, 92, -29, -132, -49, 131, 112, 123, 57, 80, -6, -168, -56, -69, 3, -96, -93, 15, 111, 138, 369, 72, -59, 120, 10, 76, 91, -56, 96, 124, 18, -109, 3, 39, -113, 186, -33, -159, 122, 25, 24, 8, 142, -23, -18, 150, -173, -38, 39, -52, -145, 123, -82, 23, -59, 243, 52, -157, 116, -74, 54, -203, -11, 173, -67, 154, 78, -62, -126, -146, 3, 226, -157, -18, -86, 49, 60, -22, -4, 123, 192, -42, 132, 91, 196, 36, 174, 120, -30, 146, 16, -79, -61, -150, -20, 135, -87, 101, -90, -36, -24, -135, -198, -152, -133, 68, -70, -38, -100, -134, -35, 105, 203, 82, -37, 49, 32, -270, 193, 168, -86, 228, 371, -2, -103, -22, 78, -170, 202, 105, -13, -164, 38, 162, 61, -61, 49, 34, -171, 127, 94, -88, -17, 120, 143, 144, -17, -133, 39, -107, -98, -123, -42, -41, 100]
7627A00j9j48k9m4K16o5j52J57P0j44o2L8Q3j85R2j3J03J58j55m4K8mM9j01K09
7652A38k40J08j20lK4P6K8R7p0p6O1P7j78J00jR9k75J15p5mJ28Qo1J10p5J19q5
7679B5L4l5Q8p8j36MM0M9m5j2J76J1m9j50j01M17j30Q6p1o4Q6j39j87L49M7l36
7705a21R7J02j3J76j52k32K01J16k01J22Op5j79P1J6P4r5K6L33k57J66Q3k99j61
7729a96L78j26j27R8mJ73k04Qp9J16j4k24K31J9pj33J51q6j37J91J5pj78j2j9
7754a73K60O4l29K28J14l26L6P3M0K2PK27l35O7j92L44j18r6l0Q0P6J2p1J4J25
7779A19n8J01p9R1k38N4R6j29O9o0J06k1j3p0J46j02k64J12L41j73l4J56k88J40
7803Bj07O9J6Kk6l5p7K32j1J5j24Q6%j53J06J93j66l0r7K85j33J28k11K9R0k16
$$ y = [100, 81, -67, -96, -140, 76, 11, -141, 16, 86, -58, -120, -82, 1, -184, -92, -105, -2, 156, 1, -43, -15, -19, 30, -71, 138, -102, 6, -114, -117, -93, -17, 11, 108, 38, -38, 23, 100, -78, 22, 21, 120, -155, -40, -115, -119, 9, 17, -44, 66, -9, 110, 25, 59, 24, 112, 34, -102, -98, -58, -9, -54, -66, 110, 121, 72, -78, -179, 238, 108, 194, 123, 59, 145, 6, -181, 168, 215, -121, -24, 78, 65, 241, 89, -143, 58, 174, -27, 95, 101, 26, -153, -82, -66, 8, -87, -61, 272, 15, 181, 264, -35, -196, 182, 56, -71, 27, 23, 196, -8, 0, -79, 37, 23, -201, 30, 49, 42, -91, 60, -26, -163, 28, 43, 36, -142, -154, -173, 87, 151, -178, 50, 164, -162, -126, -53, -13, 9, 16, 243, -92, -25, -217, 127, 9, -87, -117, -37, 39, 51, -20, -6, 119, 61, 162, 83, 174, -64, -10, 86, -43, 26, -34, 72, 51, 38, -32, 114, 12, -252, -140, 201, 28, -6, 150, -138, 2, -105, -36, -20, -18, -44, -79, -156, 76, 65, 80, -44, 42, 42, -111, -5, 188, 22, -8, -105, 180, 47, 175, -36, -7, 83, -133]
7829a33N8K31k01P5j09J5J80k67J24l3L26k47J9mL0o1j09J39q2q7J89j20LL8k2
7854d8N7j50J37l6oJ95q3M0k62K39k91K40m1J30K9q8k02J38O2J60o6q0Mp0j03
7879i5J3J75n0l1r1j27j0K72o2m5m3L6j2J05o5J88j08r5K05l12j55K79m7J67l83
7904b91K59J88k45J44m0J7OJ20k15L05l73J23p7j9J76J4o5J97k28J52k44NJ50
7927E9J04j37j36K08j14M9J9j79R8r9R6J90j75j18nJ73n1O6K2j2j9r0K38j18p1
7952bk47R8P3k8K6J95q5l2j04K2j60L85j01L9r4j79J86O6j87M67k10j80J24m9
7976B3j1r0j7J30o9k30L59Q6j30j72K00k64k8J48K33Nm11L80j41J98l87K38k16
7999a66J55M5j19P7q7p4Q1J24j95J75J50P4l10m7M00k14j02J50k11L17j62N5k21
$$ y = [-133, -75, 156, -45, 30, -79, -64, 116, -151, -27, -60, 266, 19, 38, 34, 64, 3, -106, 33, -49, -136, 53, -67, -64, -26, -48, 9, -141, -4, -40, -46, 149, 66, 106, -156, 83, -208, 32, -9, 121, 150, 62, -140, -2, 60, 220, 154, 74, 78, 8, -95, -82, 93, 43, 12, -79, -206, -216, 56, -6, -51, -94, -58, -70, 35, -30, 158, 50, -45, 160, -152, -307, -28, -75, 92, -291, -32, 156, -89, 55, 15, 32, 38, 158, -57, 248, -125, -2, -79, -98, 78, 92, 27, 224, -4, 148, -96, -91, 59, 163, 26, -110, 98, -16, 33, 52, -127, -29, -128, -32, 158, -17, -135, -140, 33, -18, 48, 70, 58, 39, -51, 187, 69, -2, -249, -151, -78, -106, -80, 115, 30, -2, -106, -84, -244, 141, 40, 79, -15, -194, -8, 58, -129, 338, 128, -52, 72, 23, 12, -78, -95, 35, -34, -264, 95, 181, 51, -121, 79, -185, -213, -65, 168, 173, -238, 142, 1, 199, -188, 50, -166, -11, 34, -85, -8, -95, -169, -88, 36, -159, 16, 166, 240, -70, -117, 283, 69, -33, 117, -94, 223, 61, 116, -105]
8022a05J72K3Qj15K75k80P0k18K05J44p3k87K02J4q5j7p2J8k3l4K12q0J59Jk9
8047H5J92k61J26l01J47n1J6J10p8J55k0J27l57J65j25R8L6k26K7q5L15k58K86
8070A23j06J18k16O2J11j88R6j14n1J84j48K08j56J17q6pM07j63l90J34L8K11
8092A84l27J93j26J61j36j36K89j33K1R3j64J50j30J37k9j07j02K29j92q2K40
8113C3J5L3j15j3J03p5K23k59j18J33j5N3J5k3J72m3j53K1M8l8rl60L16m4P2m4
8139g2O3j9K48k53j50K15P5k48J66m7k02oK48J87k95R1q6N2K10J5l61J88j62K4
8163a19K96j52J4r6J85l6l0Rj10jr7O0J38O9j09n1K61l00l2R5n5j25J98J72N2
8188B36l59L04j69
$$ y = [-105, 67, 90, 98, -17, 258, -22, 48, -170, 35, 179, 106, -181, 21, 35, -50, -67, -139, -121, -144, -178, 34, -46, 113, 114, 85, 277, 16, 142, -159, -12, -63, -47, 63, -15, 140, 120, 247, -110, 55, -70, 28, 64, -162, -135, -220, 95, -163, 123, 17, 135, -81, -19, 92, -96, 0, -114, -165, 19, -129, 79, -77, 40, -46, -53, 354, 191, -199, -65, -27, 184, -143, 50, -76, 85, -51, -187, 102, -31, -10, 83, -81, 69, -61, 76, 47, -60, -162, 67, -125, -207, 33, 48, 81, -34, -47, 56, -19, 204, -55, -173, -40, -55, -2, 13, -10, 162, 119, -34, -13, 35, -3, -12, -372, -56, -100, -28, -72, -9, -28, 220, -33, -183, 32, 107, -141, 25, -22, -224, -230, 18, 205, -90, 1, -85, -33, 177, 192, -169, 19, -143, -119, 177, 25, 39, -57, 128, 92, 62, 71, -39, -40, -137, -77, 61, 130, 21, -30, 231, -69, -101, -6, -61, -186, 12, 184, 236, -123, 181, 12]
8191A2
$$ Imaginary data points
##PAGE= N=2
##DATA TABLE= (X++(I..I)), XYDATA
0@%%%%%%%%%%Qj6J6k4L2m0M8n6P2q8J05j27J51j77K09k43K83l30L80m38N02n72
32c05O51p40Q37r42J058j187J330j485J654j839K043k266K506k768L058l375L719
49A949m096M512m972N480o043O673p382Q185r097J0149j1384J2855j4639J6850
63I040j9679K3450k8755L6818n0659Q0689k58676K59506M30905o70947j82360
74c70668N60966J36229n61655P065M60255q1494l87075J95272K30338k24773j03778
85a39318K42893l2898k11562J25985J92679k34304j31950L14101N3228l69963
95a91109N1299L69354j31862l51076K01499L15702k59275k70328L17507J92193
105B43904l45937r9899L39281J2207l03285N4052K62234j14256k12689J71773
$$ y = [0, 0, 0, 0, 0, 0, 0, 0, 0, 0, 0, 8, -8, 8, -16, 16, -24, 24, -32, 40, -48, 57, -70, 81, -96, 113, -130, 153, -177, 203, -235, 267, -305, 346, -394, 443, -499, 559, -628, 702, -783, 871, -968, 1075, -1191, 1315, -1453, 1605, -1770, 1949, -2147, 2365, -2607, 2873, -3170, 3503, -3879, 4306, -4791, 5358, -6026, 6829, -7810, 9040, -10639, 12811, -15944, 20874, -29785, 50904, -207772, 51734, 482639, -188308, -370668, 190298, 326527, -235128, -228063, 232192, 150698, -236377, -41105, 189233, -35540, -139318, 103575, 70677, -140885, -14900, 177779, -56525, -188475, 125626, 178854, -191109, -139810, 229544, 97682, -253394, -51895, 263807, 4532, -265796, 51711, 243904, -102033, -201932, 137349, 149556, -153729, -99677, 162557, 48301, -164388, 7385]
115G385J45310k14483o0509K24031j7121k07454P3629J82517j15454j55652J53005
126A5204J15591j79187n8696J78303Q62j50284M0470J12667o6926p8422R2842
137B2424L8425j15784J3970J22300o8683j06634J08022Q1810j29597o1800J45832
148E0285M3147j61813j4943J66394j8257j51554M0766J26328m6920j05561M7209
159b4919Q9783m9857o8327M7524M0731l1308j8977N248J1121J7349j0089l1769
171b3490N869M6206m9o6493L451Q3129j6209q5830K5602P8958k6031p2317K2600
184b4604O9674k4416o1586K7627M3911k1159k6944N901K0250O981j9303j3353
196a7021J6074J8683j0643k9560J2149M0589k3305m1486L4339L4435l8922k7239
$$ y = [7385, 152695, -61788, -122297, 101734, 84613, -122841, -49212, 133305, 17851, -137801, 15204, 130795, -48392, -107088, 71215, 72077, -78207, -37737, 74930, 8004, -70418, 22424, 60849, -54935, -40965, 81335, 12652, -93982, 14040, 95850, -33747, -95547, 50285, 93432, -68381, -83324, 83070, 64813, -86741, -45975, 80353, 33433, -72128, -24919, 64864, 15007, -53320, -5796, 34935, 3627, -15350, -10102, 1019, 18368, 8279, -23490, -17621, 28585, 28536, -37957, -34506, 48623, 32414, -53416, -27814, 51144, 25113, -47204, -24604, 45070, 20654, -40932, -13305, 30606, 9447, -17497, -11596, 8654, 15635, -3668, -17021, -947, 17736, 7093, -22467, -10318, 30271, 6966, -34520, -181, 34254, -4668, -31907]
208c1907L9930K2889m3631j6338M9118K015m7588J4383L6386k3940k2884K6751
220E184J3525l0564m097L6031j0565l6609K8005K7409l8539j4274M0493L701l9509
233a9809M677L9349j6409l5973L2386K2706m3467m136M5886j2228m4244K4895
245f367M3444l8141m1210N3925L1541o6511j4904O9196p18o5036J1491O0547k1388
258A5869n5216L3862M3959m4664k5864M7240P372m2457O012L6400j7305k9870
270b4662K9373J9833m1059k866M5764j5796m2509K9941L6517m0149l1026N0665
282A4026K2883o0241r975O4899n820o1482J8891N2970k6807m4555L3691L4884
294C3364m0837k1272M4713L874m1124J1223L3137k1464k4678K8545J6948l5505
$$ y = [-31907, 8023, 30912, -12719, -29057, 20061, 22076, -25512, -11129, 25257, 1317, -21567, 5184, 18709, -11855, -15952, 20079, 9514, -27095, 910, 28319, -10220, -24494, 15999, 19700, -19809, -15132, 24217, 7808, -28165, 4221, 26927, -16540, -20676, 25210, 12982, -31262, -6367, 37077, -1064, -42274, 11651, 43192, -23319, -38223, 30973, 30255, -34781, -23290, 37257, 15869, -39347, -5485, 38474, -6190, -32054, 15186, 22558, -19899, -13887, 22513, 5208, -24662, 4711, 24544, -16515, -19381, 26383, 10587, -31922, -1981, 34536, -5613, -36639, 14026, 36909, -23332, -33307, 31592, 25772, -35710, -16819, 36151, 9344, -35211, -1520, 33364, -7473, -28745, 15968, 19842, -21282, -10059, 23078, 1614, -23064, 5481, 22429, -13076]
306a3076o761M0621p295l9181K0344L1547k7436k3831L2026J6574l6054q281L9513
319A8710l600l8071J5347L1235k2788k2819K6538J5330k9050q137L1449j634l0593
332a8083J2598K4640j9922j7070K3380J0329k5174m647K6813j949k7051J0563
344e573K2338j6633j4580J7971Q206j7584l528J7880k329j7305R310J3726j5213
357c314p189J7516J195j6935K265J6711n586j6890J0507J4025j4460q775J5786
370D856L423j4244q4J2168j784j1532M859J0127q851n350R951M45q455K596N930
385D055l889m810N962L383q475N5R466m078q183O502N913o708m663O928L935q034
401b641k138Q779j569o828M013L698m324j270L655N09m348R86N195l830l955O305
$$ y = [-13076, -19837, 20784, 13489, -25692, -5348, 26199, -1237, -25068, 6958, 23532, -12522, -20803, 18710, 15110, -22961, -7614, 23621, 833, -21986, 4552, 19882, -9168, -17305, 14144, 12510, -18083, -5485, 19155, -767, -17837, 5543, 15872, -9302, -13949, 12864, 10915, -16136, -5573, 16765, 132, -14448, 3523, 11729, -5855, -9383, 8497, 6168, -11137, -1827, 11899, -3314, -10503, 7013, 8208, -8727, -6462, 10249, 4663, -12227, -1720, 12305, -2155, -10930, 4856, 8279, -5965, -6049, 6119, 4335, -7197, -2338, 7789, -1062, -6412, 3539, 3984, -4471, -1875, 4055, 166, -4644, 1318, 4701, -3774, -3719, 5747, 1669, -6514, -12, 5901, -807, -5470, 1458, 5393, -2641, -4779, 4000, 2431, -4397, -384, 3314, -1010, -2280, 1375, 1884, -2464, -1478, 3717, -113, -4068, 2237]
417B237J004o135P59N060j409m700K125M815m053l483N700Q04n468J302M021j985
433E94l021K339K763l428j818M733j98m987K734L242l377k186L548J787l885j533
449b693N109n15n178K465L984l194k270K906J299k811r31L576o22l795K741K628
465B699l964q17L626j74l468P07L729j273l898K731K973l985j320L936n4l070
481a622N28K868j199k595K026K195l285m04L004j016k018J465J719j515j995K271
497D27J491l294k7L516j379k539J805J530j594j964K325J481k733p38L157p66
513F98k082J756Q61j700n47J461O86k105j74K653j139k257K318R07j890p76J885
530E55N87k127P8K180j237j639J781R22j518l79J518j46j311L10J478q58j132
$$ y = [2237, 3241, -2894, -2135, 2925, 1516, -3184, -1059, 3756, -297, -3780, 1920, 2724, -2744, -1442, 2579, 594, -2427, -88, 2675, -753, -2571, 2162, 1964, -3023, -289, 2953, -424, -2610, 938, 2725, -1160, -2693, 2416, 1901, -3277, -812, 3172, -22, -2292, 614, 1913, -898, -1829, 1747, 1125, -2670, 71, 2699, -1265, -2082, 1544, 1370, -2098, -1391, 2338, 1065, -2833, -102, 2871, -1114, -2434, 1502, 1448, -1622, -1094, 1774, 575, -2020, 6, 2201, -1084, -1488, 1516, 500, -1518, -53, 1666, 151, -1844, 427, 1918, -1376, -1403, 2113, 734, -1805, 0, 1530, -64, -2028, 297, 1778, -955, -1693, 1464, 698, -1384, 372, 1233, -467, -1014, 447, 1133, -972, -1146, 1507, 368, -1889, 429, 1336, -554, -1330, 555, 1142, -985, -907, 1273, 36, -1603, 178, 1100, -418, -797, 721, 575, -736, -426, 1052, 194, -938]
547i38J310K83j421K99J134k9j627O27J416r30j192J375O69j565K88P88p7j098
565f88M31R27o20o58R16K54j202N29P61q50k91M34O18o09n63R35K23j312M91R36
585F62q09k57N52L02n47l94O32L02p95R6O99p84K7N30jl35j45O18P0q09K98N67
607D79n90r4M49n1k32K4K01J48r14M10N94o24j33M16j44M9J64r8pl35K77L34n14
630a91Q3K58l10j7L54n8m72K22oN47l13l67M89Rn50M03O2J4k84p7L11l04N4K95
654A52K6m77L98m9P6p0m11M94j75j81L32j46k19L66P4n16M38l43J72K76j70J24
676A71l9j48L5rJ65j61j58O7k3j27K26K12k26K24n1o8K5j2m6P7k54l5L49j94j6
701a6M1Q6j98J75k92L75p8k15L50j71j28J86l29K19R5m57M24j6k46K46Q9l07L28
$$ y = [-938, 372, 655, -766, -467, 667, 638, -989, -362, 1054, 124, -1068, 307, 976, -589, -301, 487, 410, -688, -257, 670, 50, -608, 308, 562, -640, -111, 650, -200, -491, -57, 561, -48, -611, 324, 547, -765, -274, 662, -147, -404, 148, 450, -97, -491, 141, 443, -352, -256, 443, -341, -314, 216, 215, -120, -265, 353, 423, -386, -88, 479, -111, -205, 244, 193, -39, -15, 186, 334, -580, -170, 424, -200, -333, 83, -61, -12, 152, 54, 47, -288, -11, 323, -191, -108, 150, -160, -177, 177, 119, -353, -131, -137, 410, 97, -270, 219, 228, -322, 81, 143, 157, -127, -204, 107, -197, -143, 152, 178, -299, 99, 50, 126, 56, -355, 139, -36, -217, 115, -31, -250, 116, 190, -326, 112, -231, -59, 217, 47, 171, 132, -16, 19, 10, 175, 14, -144, -77, -100, -227, -1, 211, -15, 209, 158, 90, 115, 103, 57, 134, -120, -155, 194, 0, -16, 25, 111, -87, 88, -204, 171, 93, -122, 228, 57, -71, 115, -214, 5, 100, -357, 67, 51, -195, 51, 140, -167, 161]
724A61j07j41j9K04J37k8k88J16o9k92M14q7p1P1n8K34j96O6l7q0j90L48q0J62
748A70l30L08Mj94pJ63n2l12J72M05m40j07L10L8k36J39L4j59j88K48K66m16J0
771a74J68R0j15r2J34J20k25K40p3j65k42N55k58l4j19K47r2n7J27k9j75k08L36
794d1j72K63J6n3N1k88J45K84j05l51N10l13n5r4J81n5k17J72K96j99j90L67k3
817A29k63J57L85m13k17J26K74l51l1K97l1q6K48m41K26K9j2J8l18J62L31k60
839d1q9M24j54l10J83n6j28O2K64J47k29l68L56J74m46J70K08Ql03LJ79j22j28
862a96J63M8j99L58j79M2r5k1L28k84j31R7J39j54J4J90q9O8m1j96K54l33M93
885B76k32j63J55J29j13o7J04o2L1j65P2J19k06J94k0N3j98L0J58p3j4j9P8j74
$$ y = [161, 54, -87, -106, 98, 235, 207, -81, 35, -34, -326, 88, 1, -70, 1, -57, 177, -19, 47, 10, -70, -260, 88, 8, 170, -160, 148, 152, -42, -49, 114, 62, -250, -78, 327, -113, -220, 90, 128, -108, 31, 65, -94, -282, -34, 232, -184, -174, -6, 84, -31, -123, 11, 131, -94, 146, 73, -92, -334, 221, -37, -71, -190, 57, -35, -92, 35, 6, -169, -377, -41, -213, 50, 66, 13, 64, -224, -79, 205, 100, -251, 259, -54, -109, -203, -22, -77, -294, -122, 174, -25, -215, 152, 129, -134, 23, 408, -5, -222, -96, 178, -173, -204, 93, 62, -24, 224, -217, 9, 38, 26, 44, -274, -112, 219, -41, -130, 294, 140, -170, 13, -43, -171, -109, 155, 302, 73, -295, 61, 235, -211, -41, 167, 175, -128, -125, 54, -68, -196, -33, 15, -184, 174, -5, 37, -58, -79, 249, -35, -166, -69, 70, -84, -70, 120, 31, 99, 58, -138, 116, -217, 276, 44, -119, 36, 165, 52, -15, 89, 27, 58, -107, -35, 84, -122, 72, 52, 105, -93, -63, 95, 22, 8, -11, 67, -107]
909a07Q7Q5r0p2J90j11q1l9R3k8n4J0J92j89K06k15O7J16j86J15k15K80J61q7
933A28q2k4K81k14j28K02j77Jk7P4j38JJ25P1j57nN7N1j33K09l6j80k2J86L2J17
959B12m11K43JK8j29p0N5R2j9j5J24j22m4K43k47nM5M8n6j50J18J02j60j08N21
984B96l85K68k9j91k7K72r7o5j69J99M3q5%K9Q3j63j02R0J3n0n6J47ok34K17m7
1010d9J70o0j18K40j43j24J54O8j3k74R1K1o6J53J09j58j01K02j5k23K73r9k13
1033a75K02mn6K2K55j74j08J21o1J60k54J2N8j27j11K82j00J39N8j20J72j95N2
1056D8J67j34j28J31j54p6K47Kj41q6J96q8J20l14J42p2J18J10m7j52J09J07k46
1079a41P5p5K03Q1j89Q7o6J38o5j7n1L9j93R9j0K21j7J1nj03j09K20m09L09K1
$$ y = [-107, -20, 65, -25, -97, 93, -18, -99, -138, -45, -73, -127, -117, 75, -114, 92, -123, -56, 60, -126, -11, -226, 54, 215, 128, 46, 22, 303, 89, -39, 163, -14, -13, -40, 34, -104, -103, 22, 93, -64, -69, -12, 39, -94, 115, 79, -101, -123, 63, 95, 212, -199, 44, 45, 73, -56, -126, -71, 21, 2, -13, 111, -11, -55, 188, -59, -64, -19, 29, -27, -177, -59, 43, -117, -225, 296, -89, 179, 150, -41, -68, 204, 107, 42, -127, 72, 115, 30, 30, 59, 142, -21, -123, -33, -20, -70, -126, 21, 15, -219, -2, -49, 121, 61, -57, 183, 40, -84, 70, 138, 125, -149, -58, -37, -103, 50, 159, 1, -100, 102, 87, -136, 137, 38, -175, 27, 23, -33, -11, 244, 70, -38, 83, 22, 182, -72, -60, -2, -129, -240, 42, -58, 81, 139, 19, 191, -4, 48, 215, 81, -47, 84, -70, -146, 101, 103, -38, -124, 72, -16, 104, -210, -68, -140, -22, 88, 41, -111, -2, 105, -141, -66, -141, 62, 143, -46, 41, -25, 113, 48, 31, -20, 19, -174, -75, -85, 136, 119, 130, 125, 22, -87, 133, -276, 33, 54]
1104E4n3q4n0J18M1p0j8K12o8j72J12J22q1OJ9r7j79K11J01J17k49J77j67jJ01
1129A02l18J91j18K00j71n1PK55mk12O4J23l2O8k31J61L7k75L71R0k86J54j49
1152b4J49M6Qk16q9K23k01oK04J1j02j47J6J26O5p1j64K10kj45K24j26r7N0r4
1177a52J28K06k04j48L09j55k7O7j19P9k5K1J62p0j39K12k16J87j29J67q3J01
1199A72j47o9q9J02J18j61N9K24j97j08K32k64j41K37J85j60m4M6K75l76J3J65
1221G2O1m1m4l22N04m14K79j33Q1J01j9j79J11P8j81Mn4k3L70k35P4k32K86j87
1245d3j5j1K45q7R6j42lq8J03j35k2M3M3l9J02J10j49L3r6j1M1o9J7J77r6l43
1271c39K83Q7j49J26R3J41k27lJ7k34Q4k6rK67K2j89J19o9j6J12Mm1r7l6K21l67
$$ y = [54, 1, -83, -133, -15, 26, -44, -62, 150, 82, -90, 22, 144, 63, 69, 88, -9, -188, 23, 124, 241, -8, 169, 2, 1, 102, -216, -25, -143, 57, -114, -165, -158, 97, 93, -119, -55, 68, 36, 104, -127, 34, 71, -204, 167, 257, -29, 125, -24, 125, 171, 179, -37, -126, 97, -104, -110, 94, 105, 3, -144, -128, -2, 63, -8, -172, 38, 36, -109, 115, -11, -108, -58, -152, -24, 182, -22, -170, 139, -16, -43, 24, -95, -16, -41, -20, 142, 72, -67, 145, -71, 116, -13, 154, 71, 172, 25, -44, -133, -31, 87, -74, -15, 209, 12, -96, 136, -128, -269, -32, 153, -7, -51, -5, 270, -106, -93, 72, 133, 92, 48, -274, 230, -184, 95, -38, 43, 144, 125, -54, 57, 135, -46, -42, -96, -119, 251, 16, 90, -142, 144, -43, -58, -69, 176, 89, 185, 43, 40, -48, 55, -80, -102, -59, -16, -55, 47, 157, 8, 41, -55, -66, -25, -94, -77, 100, 4, -339, -56, 31, -118, 8, 101, 242, 15, 12, 29, -205, -121, -147, -156, 111, 133, -56, 63, -6, -22, 90, 94, 53, -44, -80, 141, -226]
1297b26O3P7K8L03l83M1JJ99j30J88k84O9r9K89r7R8o1k12n6q3K32J16L3R3j93
1322Fo9l8P7j2J25k29N5P4J45j92K20j12l4l8j39J55n1K1j98L48j38n7M27l81
1346c5m6J25R3j72j23K10p1J5o0L61l07kK6k81MK44j4O0j89K99o0p4k00K95q2
1371A6j84P4K64j55k13K52j8m0M3J00j63m1j06L23k50J19j14K96n10K27P3j07
1393a14K46O6l31Q2qJ45j44K30j36m2m7J48j52J34J39l23K00j66K38k02L32m30
1415a35j9j06K73l8M0M6K7Q1k68O8j88K78j59njO2rP0j2j8J19k30K46j21j02J50
1441D9J63l88J18r4L09j35k4k8O4j77N3K80oj47K5O3j84N8k3J59j30m1p9Kj06
1466b19K54J97k28k8M4J40J09l15K31k41o4rR1Q2j03Q8p4J30L6j15N8K2J4q8n1
$$ y = [-226, -163, -86, -58, 245, -138, -97, -96, 103, -27, 161, -123, -54, -153, 136, 39, 137, 76, -136, -192, -275, -43, 73, 106, 199, 6, -63, -101, -24, -36, 89, -140, -85, -11, 134, -58, 162, 50, 16, -22, -161, -6, -57, -36, -234, 114, -24, -81, 346, -35, -81, 44, 137, -35, -158, 52, -19, -4, -64, 297, -10, -12, 14, -267, -263, -19, -33, 27, -162, 137, 77, 3, -197, 98, 16, -168, -94, 170, 15, -198, 54, 36, -4, 39, 139, -24, -65, -171, 152, -98, 21, -93, 203, -307, -80, -7, -114, 132, 198, -133, -51, -59, 86, -58, 172, 36, -6, -53, 95, -57, 77, 216, -107, 93, -73, 165, -37, 295, -135, -154, -260, 13, -25, 15, 61, 88, 169, -99, -31, -219, 59, -100, -105, -106, -44, -53, 17, 5, -13, 106, -124, 122, 1, -101, 49, 212, -176, -58, -152, 157, 22, -2, -30, 34, -143, -90, 190, 184, 37, 62, 125, -59, -1, -24, 135, 5, -36, -115, -113, -219, 35, 232, 4, -24, 20, 160, 269, -46, 185, -56, -120, -129, -38, 44, -59, 29, -45, 85, 121, 6, 64, 86, 100, 12, -39]
1491c9n1K54k59K5K0J54m0l6j04Nj00K50J58l43J09mq0K23l17K73l2j37q4K18
1515F3j40J47NK2p3j53K91k14J80j31k29K39k15K27p4j03K80k43J12J9m4j04n7
1538a95P6R5q7N1J62o6j88J43j15K35M9k08J11Mq4K04j52n6l3J26P3j92J54K6
1562A33l17J09J34R7k78K20J7j58M4o7n1J44k41M39l30J58ON4j2m7j23p6O2L8
1586d5J51k08K14R4j87O9O2j49j67J72m0O2k3QL5j01L3m8j81K87K3k34K75q4J17
1611A35l30k8L04j78J40nJ6O9k68L9K6N5k0K8m4N4QJ1P5r0O9q1J31j93J25L2k60
1638a80K14N8j2j5j00O0j14J05j47J39R3q4K46m71JK01J60j19j77K26o8K1N7j20
1662b6M0k3qm1J2O1j7o2j9K52m0j76M0j57J03k7J32q6R9k7l1m8L0K4j65J87k15
$$ y = [-39, -90, 164, -95, -70, -50, 104, 64, 28, -76, -71, -171, 79, 237, -106, 3, -1, -81, 142, -175, 98, 66, -71, -155, 63, -77, 70, 75, 97, 24, -129, 162, -52, 128, -3, -232, 7, -208, 19, -55, -158, 122, -121, -9, 10, -34, -138, -195, -119, -24, -111, -60, 102, 36, -152, -9, -124, 111, 160, -48, 63, 67, -17, 187, 35, -21, -54, 72, 145, -47, 107, 133, -184, -75, 59, 156, -122, 98, 115, -43, 1, -66, -117, 27, -214, 225, -105, 53, 59, 113, 101, 54, -69, -145, -83, -45, 106, -102, 112, 206, 19, 88, 150, 1, -166, 6, -34, 28, 5, 13, 48, -53, -20, -68, -249, 38, 61, -173, 102, 18, 135, -195, -223, 81, -97, 43, 38, 54, 123, -145, -106, -80, -25, -45, -17, -61, -7, 1, 12, 87, -3, 66, -15, 116, -77, 48, 80, -180, 34, 92, 80, 65, -35, 25, -89, 16, -131, 8, 101, 17, 263, -208, -207, -6, 154, 35, -142, 84, 16, 37, 94, -26, 14, -9, -17, -58, -46, 15, -2, -64, -83, 169, 129, -47, -7, -164, -61, -88, 44, -42, 57, 30, -1, -49, -19, 5, -160, 27, -188]
1689a88J64Q4k09L00L4k13JN6j61J04K19l67J63l5j18K16p7J50j52p1J81Q3j56
1712HJ55j31k66J96mLK00k30J72O2j12J9%q2O5K9k4q0LJ01j49p2K42J15n2l42
1738a74K77O3J4k27J54k33M8J15j4k34K51k6j06J9J91J04k00k8P1Kj74J20P3k81
1762a95K54j91J80j8L6O8j29n3j01J17O7j97K13M0k85K03J54l00j71N62l19N4
1784a1q9J79j31K35j41K62k79k36K37l7J64Jk3K8p4l60M5K58N7k73R4J73j42p9
1808a42J05QJ04o3k1RJj8J62l01L36k38k30M29j47K11m54J03K00j80J29J6j80
1831a61K17k68L12L2m6l6Pj04O3j56lJ70k39J04J34k5Rj2L9k88K02l4L58k18l15
1856b58L37LR8j21jj54J13L3M4j73Q0o3J77j56j46J39j66o4L31pk6R4r7K11j75
$$ y = [-188, -24, 60, -149, 151, 185, -28, -27, 29, -132, -28, 191, -176, -13, -48, -166, 50, -27, 123, -29, -100, 81, 164, 8, 163, 32, -234, -38, -42, -39, 161, -69, 103, 165, 53, 72, 72, -10, 55, 84, 60, -20, -17, 84, -65, -137, 105, 220, 168, -174, 103, 166, 180, -47, 107, -126, -78, 37, 23, -211, 40, 14, -92, -73, 118, 222, 22, -6, 65, 67, -107, 13, 86, -195, 59, -132, 48, 30, 66, 134, 5, -48, -149, -32, 35, -162, 51, 91, -194, 9, 163, -137, -308, 254, -65, -11, -100, 79, -52, 183, 42, 304, 25, -211, 26, -11, 153, 154, 131, 159, 85, -275, -230, 28, 85, -188, -94, 79, -63, -142, -37, -29, 75, 12, -9, 0, 1, -17, 145, -156, 180, -58, -288, 141, -6, 205, -249, -146, 54, -126, 3, 19, -161, 56, -212, 100, 132, 86, 50, 57, -47, 16, -140, -143, 27, -212, -108, 26, 1, 10, -2, 37, -251, -49, -83, 275, 57, -258, 79, 82, 180, 59, 58, -96, 17, 50, 94, -79, 1, -62, 115, -41, -187, -48, -214, -278, 53, 46, 20, 114, 17, 228, 53]
1881E3r1O0j83L1J26J10K3Kk43R5N8m8R2k6j75rJ12mn3j11J3K40O6j23j8J2J73
1908A82k72J36l9k11l9K29m7J39M6j31J4J66l49K94j10l7j1J68l2j05QM8J0K85
1932C42m17J31p8p8K77l06K66j36j01O9J18j97J38q8L3R3j69J36l80K13p0N2K39
1955H7j06j7K5k11J60M3n8r5J17P3P9j12k9q4j7O3K1%Q1J59k47K87j91j91L93
1980B30j08J18l02R7O1j51m4J03Pl3J3J44k48m8J75J4K17j53m7J27j80j32K01
2003F1J47j98R3q8o0J1J7q5J36q0J52J11l7kl00J03J3onOo2o7J88K1j35J25K4
2030H3r2J3K35q4k20J41j20j72K05J02j33J56j23o2J08R7p8j6p7J01j17m8j24
2053b25M47j75r9j98L14q6J18k52K10L6j71P3j41J33Rj46K27N0k47J56J16j01
$$ y = [53, -38, 22, -161, -130, -4, 106, 129, 131, -112, -17, 41, -7, 85, 59, -116, -125, -13, -17, -70, -181, -168, 72, 138, 15, -3, 9, 182, -90, 46, 7, -204, -243, -14, -61, 78, 124, -7, 7, 173, -176, 118, 8, -29, -40, 128, 96, -9, -1, 47, 57, 342, -75, 56, -22, -100, 177, -129, 137, 1, -100, -31, 87, -110, 28, -60, -27, 66, -103, 33, -347, -134, -204, -152, 87, -19, -36, -11, -222, -62, -19, -77, -172, -55, 18, 97, -15, -44, -128, -145, -82, -61, -61, 20, 179, -68, 219, 28, -163, 230, 122, 240, -62, 35, 96, -55, -99, 4, 11, -22, -9, 135, -113, -161, 14, 28, 245, 92, 45, 172, -8, -140, 61, 208, 10, 103, 15, -45, -34, -17, -102, 34, -46, 106, 217, 180, 178, -122, -19, -6, -12, -17, -11, -73, -140, 48, 69, -66, 59, 83, -9, 4, 239, 155, -65, 76, -44, -216, -11, 91, -42, 114, -9, -71, 37, 134, 56, 40, -37, 64, -53, -101, -225, 222, 47, -52, -250, 64, -22, 96, -156, 54, 90, -81, -8, -149, -16, -7, -153, 74, 124, -123, 33, 149, 48]
2075D8j6n2o3k2P2J30j72J14j24j90L20q0M3n9J95j22k14J81k4n9J38%R5o2p2
2100Ek88J94K82k28M6j18L53l20p9J24M7j54L27k10O2k41J95j65J93J26M1j25
2122F7j41O3l8P2L5k26K09m9J40L1j22j6j54J95r9q6K89k82J11M4R5k11K06l0
2146A03j2k23L21j66p1J36k16N5J29j05J63j44L24l56p9j0J9K45j46O1Pk48K04
2169ij68K64j63j07K01m8J04l37J69K81j29o8j3K84k66j80M6J26J47p7m9q5k03
2192b80L14mm8q5R0mj61K57j55j95L96l09J13L5K3j42L37j46p0O9K2j59m1N0J48
2217E5J35k82J3J32J23R5k44j18J61k63L2J98P3k09k5K08k5o0r4J90j49K19j53
2240A2Ln8l5J5K4L4l8n3J59Jl47K52k37J46J6L79Kk50J08k11J75r2p5L0P6K16
$$ y = [48, 32, -20, -83, -105, -33, 97, -75, 39, -85, -275, 45, -35, 8, -51, 144, 22, -192, -11, -35, -94, 44, 44, 139, 77, 5, -283, -89, 193, -35, 11, -107, 246, -74, -153, -29, 18, -136, 191, -19, 43, -198, -3, -168, 25, 151, 192, 67, -74, -11, -49, 23, 58, -168, 41, -8, 132, 163, 41, 25, -129, 66, -33, -119, 170, -112, -1, 43, 138, -73, 133, 103, 91, -132, 189, 23, -48, 88, -128, -73, 56, -49, 114, -30, 294, -62, -141, -151, -132, 113, -33, 28, 35, -213, -9, -177, 87, -76, -183, 18, -30, 74, -263, -94, 187, 58, -10, -23, 261, -5, -185, -139, -13, 134, 57, 8, -77, -280, 34, 30, -18, -103, -13, -17, -178, 79, -76, -271, 125, -184, -71, -36, -13, -155, 182, 36, -34, 35, 57, -102, -143, -93, 55, 190, -92, -79, 53, 176, 271, 27, -91, 70, -193, -161, 37, 110, -99, -124, 84, 59, -1, -95, 95, -54, 165, 12, 15, -43, -78, -63, -39, -5, -43, -96, 63, 64, -283, -31, -268, -122, -106, 273, 275, 25, 133, -78, 97, 5, -70, -40, 36, 252]
2266B52k90l6N7n5J15r5PQ0L5j83K11j28J8r0L9j30L86k27k0J73r8m6PL3O4j26
2292d7J78p4j13j7J13p5K6LK99k60K0j02k5J15n3k03K45q0L96j86k69Q2L8L8k91
2317b42L73l12J94R0lm6j7O2l03L31K6r4j35O7m7o4J03j65J67O1O9k69jJ78M2
2342F5j25J9j03O7K21l0j32Q9p8p2J72l4q9j63K58j32K45k62Q5L8Qj25r9L5%K70
2368A28j02j29K24N1k18n2M9kJ03l01J50J07J08j2k0r5l9P8j55J79J83j92P7j35
2392a5K7n7R0j5R1j40R8k2k41J78o1Q4o7J84n4P6j13K19m06Q3M3L8p4m8J47k1
2418B4j9m8j75K27O1p1l9J13J71k37J26j21p3m0q4Q7J58l7j68J22l7P7J80m44
2442b47J10J57j1N6r0O2Nk05K45j29J07N6k77K09K7l8j15L6K29k87j21K11j19
$$ y = [252, -38, -74, -17, -72, 43, -52, -45, 35, 70, -113, 98, -30, -12, -102, -63, -193, 193, -34, -54, 119, 21, -25, -18, 15, 79, -47, 131, 57, -56, -73, 40, -35, -9, -6, 293, 33, 53, -49, -74, 41, -12, -215, 30, -50, 346, 160, -109, -27, 11, 49, -242, 131, -181, 13, 103, 100, 54, 37, 99, -204, 127, 153, 59, -76, -9, -56, -120, -17, -182, -15, 46, 115, -154, -155, 23, 65, -60, -41, -144, -77, 144, 114, -18, 71, -7, -79, 93, 59, -30, -193, 65, -67, 178, -84, 1, 39, 47, -78, -177, -142, -142, 128, 26, -103, 121, 172, -46, -98, -49, -51, 52, -249, -99, 8, 116, 104, 84, -11, -50, 28, -127, 52, 235, 43, 120, -15, 12, -45, 45, 30, 121, -19, 79, 57, -184, -6, -67, 17, -50, 134, 80, 156, 43, 262, -144, -61, -18, 20, -54, -102, 45, 24, 5, -43, -218, 9, 70, -1, -40, 73, 244, 7, 133, 12, -61, -101, -185, -98, 60, 23, -145, -23, -60, 17, 197, -247, -137, 20, 9, 65, -25, 37, 42, -163, 82, -47, 60, 116, -161, 48, 75, 37, -78, -42, 187, -100, -221, -10, -129]
2465a29J90J39j45P0k95J36J98j97K11j12r9KJ42k0Kk69J68o7J8j0J52o0N5k18
2489a38Q6K33L0l4k82K41k30R4o7l30L59p9q6K82Lk36O3J42j06M9L4j34M2j7m3
2514a24J24J71j00k83K26m2l1K56k45nj66J54M3J44J11j60o4k2J61j72K9J50o0
2537I5R7j71o9J7k7Kj18N4P2j02K05j78Q9j64K1K66Q5k16p6K34m2j98K42j37N6
2562C7j05J19O3j44n6N0J49rk05L5O2j53J69p6jJ52J6j45K04j47j18j5pK38l88
2587b75K65NP4j00N1J04j98OR4l7K22o2m3r5j07j00J36P7j97J45K24j78m6K68
2611B33k52p6K68k24n8J41j39K50k27K70l52J11L25k11j15O8k8j7O4k8L9k7o6
2634e1J0p8J13K24m08J53j06J24J48k79j7P1J66J6O9k78J5J5k9J03j86J59J18
$$ y = [-129, 61, 200, 55, 125, -170, -34, 164, -33, 178, 66, -33, -31, 111, 91, 93, -176, -8, -75, -57, -67, 85, 25, 80, -138, -52, 181, 211, 177, -105, 136, -94, 0, -67, -397, -38, -117, -203, 79, 82, -154, -91, 51, -55, -6, 28, -106, -64, -81, -124, 0, 171, 71, -212, 14, -28, -59, 197, -48, -53, -219, -65, -22, 122, 233, 73, 9, -13, 148, -24, 5, 155, 95, 192, 21, -48, -31, -58, -56, -174, -120, -48, -150, 55, -123, -34, -198, -177, 89, 174, -42, -118, 116, 74, -124, 118, -19, 37, -68, 51, 114, -30, -86, -36, 113, 104, -101, -66, -4, -157, 12, -64, -65, 87, 103, -42, 162, 15, -103, -118, -125, 113, -275, -10, -5, 69, -31, 20, 124, -74, -68, 26, -11, 211, 149, 106, 11, -96, -196, -60, 17, -180, -35, 189, 11, -35, 233, -19, -95, 173, -51, -109, 32, -107, 143, -84, 186, -166, -55, 270, 59, -56, 12, -16, -33, 31, 3, 42, 15, -51, -41, -119, -6, 218, -190, -37, -143, -19, 129, -150, -167, -96, 70, 86, 155, -123, -108, -93, -122, -19, -205, -46, 72]
2657G2j29O2J9o7j34J53j14K67j18j74K43k45K91j93P6r8M5K28j83j48m8J48J20
2680G3l17L66k47J49R9j90j34K92l1r0M6j28O6K13n2q9r3p4K58k6n0k0j18N0O4
2705A7m5J43j72NK22j65oJ59j93k2n7P2O6J11J9l08J3K55M6k82j37J93k0P8J1
2730CJ06J68l25J90j71kj87M9l6L24k56J11j10L9K0p8K48j42J85k59J25j85L14
2753A31Pl3n8l77J79J42o0q1K47j01j21J39J31l02J33l7L9Lj07K11L8j70NJ61
2777A19Q9k69n9N2L04j92Q8k2NK06l32J75j17j33j9J80q9J25k51n7L64j77k04
2800b14K48n9J8J69j62K5n3L97l96O9K8N2j74p6k5j33K33m0L7L1L04m33J71k03
2824a86J65J18J16j51kO4k18K42l25Q6K12j0k63p3K42p8N7j82J54J26j05J39k43
$$ y = [72, -57, 5, 24, -43, -177, -24, -138, 129, 11, -163, 80, -165, 126, -67, 9, -89, -44, 184, 1, -147, -195, -47, 73, -244, 122, -125, 24, 123, -67, -201, 91, 60, -30, 16, -112, -46, 167, 115, 26, -67, -141, 117, 91, 41, 21, -97, -47, 17, -28, 115, -57, -52, 170, 5, -1, 158, -35, -57, -114, -42, 24, 135, 154, -154, -141, 114, 160, -122, -259, -66, -86, -8, 3, 109, 277, -48, 142, -29, -31, -218, -169, -205, 119, -137, -26, -136, -97, -77, -155, 93, -49, 136, -123, 2, -183, 131, 138, 105, 47, -330, -151, -9, -69, -150, 97, -4, -125, 14, 145, -157, -24, -61, -22, -19, -126, 85, 123, -47, -42, 119, 208, -61, -120, -68, 236, 44, 132, 110, 115, 321, -11, 164, 47, -86, -105, 75, -14, 111, -140, -197, 167, -10, -214, 34, -25, -7, 162, 0, 25, -28, 369, -27, 42, 70, 122, -52, -128, -153, -286, -53, -93, -56, -25, 279, -154, 17, -186, -21, 97, 213, 62, 60, 124, -94, 148, -177, -91, 121, 111, -152, -225, 17, -61, -4, -186, -32, 94, -11, 128, -115]
2847a15L58l94k6L61R7j90j07l7M5L9p4J09j38K14Qk55K69j63N3l8L0r3K40j59
2871C4l5N9j55J01Qo7q7J64j02J45k20J71k9j00K13j13j7K12lk26k06L63j84K64
2895A90j18j31J47j90J21J14p5ll6JM1k00Q1j6MJ80j13R1K3k16J25q8J16Kj12
2920f2J00q1J11r6Pp2J81l2r1q9N1R4Nj61K44j82P8q0l0M1jn1K43j20J9j38J18
2947Fk7m3K10p5M4k9j12J39l8l2jL1j15J84j97N3l1j11K48j23N9p6o6J35r2P9
2973B0M3m4J80k69j13J49J88j05j28J19R6j5J32k93K68m1o5L3k79J07j22P8P4
2996A3J75l55M19k91J76j11k00J32l3OJ79k07J67J39k8j27j9J87j26j50j87L71
3018A30j98R4K0q1J0M0J71k63m0N3K60k11L5j5k4p1K91k56J39l36K49J9j5j13
$$ y = [-115, 243, -151, -177, 184, 281, 91, -16, -53, -8, 31, -43, 66, -72, 142, 150, -105, 164, 1, 54, 16, 46, -47, 193, 34, -1, 58, -97, 4, 12, -55, -142, 22, -80, 65, -155, 16, -13, -113, 100, -13, -30, 182, 179, -47, -253, 110, -74, 190, 72, -59, 88, -102, 19, 133, 58, 55, 19, 20, 61, -139, -58, -74, -70, 110, -3, 88, 111, -105, 20, -68, 48, 50, -62, 38, -43, 68, -28, -21, -93, 88, 56, -35, -124, -73, 21, 26, -135, 109, -73, 5, -75, -105, -64, -65, -116, 127, 7, 26, -112, 6, -21, -64, 146, 71, 115, 86, -26, 113, 75, 43, 42, 73, -42, 142, -55, -2, -33, -144, 104, -19, 40, -36, -102, 33, -59, 20, 63, 19, 199, -70, -183, -34, 154, 49, -79, 40, 136, 121, 253, -40, 228, 187, 122, 155, -124, -17, -139, -61, 13, 188, -167, 252, -39, 137, 26, -174, -42, -75, -69, 110, -97, 70, 209, 181, 54, 35, 222, 96, -54, -241, 130, -68, 26, 46, -35, -25, 15, 186, -77, -117, -64, 196, -15, 20, 5, -19, -90, 201, -55, 84, -252, -3, 16, 1, -112]
3042a12J89r1k5k17K90J50J4k22j8N8Q9J37ql71K66k08O7L8k7jQ0r3l4Q7J13k58
3068a07j05J55J72R6l10M9k05J99O3j25oQ1J70k14J50j2j82K4K7j66L53l13J88
3091a8n5lJ31m1j34K19q9P1j86M7J15J14p3l20K97j86K76k13J88r3j7J07q7K6
3115G6k00K93k4o3j56RQ3j00K6k4J27Q8k83K88p3r8N6o7p9r7K19p3%R0O3j98L93
3142B76l96K35k09M1J39Rk46J00M2pJ22k29J29k4J10j28J77K6l09K41m8r9Q9r2
3166e1J22j40J9NL4J03j43J10J33k00JJ31r6J1K0j62N6P8r9N7m8k5L36k07k02
3191a57L31j29j35L05m21L38j15k3r3j2K04L7o9k18K66l4K7r8j61K64lk14QK10
3215A08j36j41K27k3j10p5J87j20L5p0J44r2pO3o3K47Pj01p8J53j14r8R1L7J26
$$ y = [-112, 77, -14, -39, -256, 34, 184, 198, -24, -42, 16, 105, 242, 234, -137, 129, -79, -12, 26, -1, -2, 78, -15, -49, 38, 151, -107, -212, -57, 115, 211, -99, -50, -255, -56, 7, -118, -124, -43, 127, -87, 63, 51, -131, -107, -80, -246, 107, -206, -18, -73, -76, 55, 14, -120, 99, 10, 81, -105, -58, 57, 171, 98, -222, 75, -111, 165, -48, 140, 47, 30, 137, 50, 76, -124, 169, 145, 82, -74, -65, 18, -82, -56, -80, 47, 135, -148, 140, 67, -31, 25, -42, -121, -218, 1, -72, -72, 18, 81, -117, 276, -120, 115, -94, -53, 86, 95, -151, -51, -9, -16, 106, -123, 6, -18, 92, -36, 141, 167, -142, 99, 51, -48, 41, -51, 71, -69, -50, -45, -11, 92, -51, 59, 192, -8, -7, 124, 28, 39, 59, -103, -47, 31, -68, -11, -59, -84, 252, 45, -157, 174, 45, -90, 215, -206, 132, 17, -6, -99, -111, 93, 130, 61, -157, 109, 75, 102, 4, -157, 107, 104, -110, -102, 108, -28, -169, 58, 35, -75, -150, 37, -83, -48, -118, 26, -66, -73, -10, -73, 174, 181, 80, 2, 155, 41, -57, 34, 71, 197]
3240A97j36k53L07N8j45r8J85l03J35J90j19R5j16o9J77lNM3j6j14o0J94k25J83
3264A12j1j76J43p1j92K55M8J80l40L0j07R3M7M3L4j09NJ35k95Q0Q3l2K4J5q1
3289h7K64j69J5J7O4j09j12J81j32O1O6j60J19k28O1n4L99j57k2P2l07J08J49
3312C9n1J74j15j22R5j17L51l67Q4j38q2K46J42rr6j74J6K28j90p0L68j72l3L
3336A0j21oJ39J28p2K4j50O9o2J63m4q7p3J37Oj38Q8j17K66m5k63p8K67Q1j40
3361a8O7J68k05n8J30k64J02J25L3j9K1l6J07j56j1p7J27J37k02j25K68k54KJ31
3385gJ38k01K8Q9m5J30k80J96k06N5O1K9K6o5J48O4R7k40L8k26J51j7j6l9L2P4
3411A4j95O4J81k54L38R2k71N9k01J77k70K43L0k0K8o1J59p8l3Nj26J32L4Q2k57
$$ y = [197, 61, -192, 115, 173, 28, -70, 115, -188, -53, 137, 18, 113, -3, -72, 105, 102, 107, 150, 134, 20, -40, 154, -71, 112, 101, -75, 68, -3, -195, 60, 108, 288, -52, -22, -129, -36, 11, 54, 88, -21, -16, 119, -176, -96, -13, -45, -21, -6, -87, 177, 8, 23, 40, 104, -5, -117, 64, -68, -7, 59, -101, 18, -210, -149, -203, 196, 39, 17, 89, -218, -110, 39, -12, 162, 47, -75, 20, -97, 254, -113, -29, -167, -249, -3, 139, 130, 34, -140, -124, 104, -86, -156, 212, 40, 7, 10, -111, -117, 22, 150, 78, 102, -48, 21, -41, 122, 78, -9, -82, 55, 61, -77, 11, -106, 160, 115, -148, -226, 41, 122, -18, 49, 217, 12, -46, 84, -180, -78, 47, 80, 61, 82, 46, 153, -3, -14, -91, 36, 173, -29, -154, 114, -140, -138, -7, 131, -70, -42, 47, 2, 132, -148, 48, -158, -103, -42, -13, 13, -52, 96, 160, 257, 17, 55, -171, -20, -37, -53, -92, -60, 14, -181, -117, 64, -190, 148, 240, -31, 28, -173, 4, -266, -23, 7, -13, 15, -46, 113, 35, 2, 7, -119, 13, 47, 129, -128]
3436a28J40R8N8l8k75J64ok26K27K8O8N1j9m2o9n9P8j94Q8L3J90l40J78r9K50
3461A56M2o9r3Lk29R1J21J35k22K0n1J4pJ28J25J9k13k8j42K10L5pJ15j05j95
3486a47M6K12j45k1Q6J26j12r8M8J38k3Q8k85J03Kj15N9j16J51k18J72k9P5l0
3510c3K3o2n3R5M1m4j4J5j07K73L1k47RR5J15k04O1J02J84k22o8J5j13J3J98j25
3536b2m3R1o9Q6J6p2J97j72N2j74K78k00j88J99j63L94j53p9L8n1J32n8q4J28
3560H3l71J60K50o1j2q4M6k23L57j81L8j2L1p1m3k0K45p3j51K17n5m2LR3k75P1
3586h0M8p0J38j34O0l7m7J58j88J67j31K04Q6N8l36K61j81J34k5K8O7l21O6L06
3610B31k78J16j78J3L1MJ14N5k51r2j1J2M31k68J49j93J94j49J9j08J79j68J50
$$ y = [-128, 12, 110, 168, 130, -145, 19, 13, -213, 14, 42, 110, 161, 142, 100, 31, -28, 50, -144, -56, -23, 167, -173, 5, -94, 156, 198, 129, 36, 39, -190, -99, 22, 157, -65, -45, -96, -82, -89, 39, 164, 183, -30, -58, -200, 10, 45, 38, 153, 48, -147, -101, 111, -34, -55, 31, 157, 45, -53, -5, 133, 110, 198, -87, 16, 18, -97, -38, -154, -3, -221, -49, -78, -3, -33, -10, -72, -125, -30, 11, -33, -47, -32, -139, 134, 165, -82, -73, 22, 137, -67, -6, 96, 280, 58, -10, 5, -108, -95, 103, -22, -65, 26, -43, 43, 59, -13, 184, 12, 64, -110, 168, -32, -220, -21, -184, 210, 57, -22, 16, -35, 97, 39, -45, 83, -288, -128, 122, 61, 49, -35, 11, -212, 145, -36, 2, -10, 21, -50, -93, -113, 132, 59, -92, 125, 70, 28, 31, 124, -151, -80, -32, -102, 36, -98, -38, -75, -122, 36, -152, 15, -116, 88, 174, 232, -104, 157, -24, 110, 85, 113, 180, -141, -75, 231, -47, 69, -109, -96, -65, -61, 53, 108, -143, -235, -246, -234, 197, -71, 78, -115, 79, -70, -51, -159, 20, -148, 2]
3633BM8o0j17K44j87R8J11p6M1l39K99n1O6kJ30lj40k3j22K13j10q3K12j66kq6
3659a03J21J20j52R8l18K66l20L57j63J42k28J43j5Q2j33OOJ54J39p5m4qj54J13
3683C4J04pJ3O2j03k41Q8l9K30o8k57K20K46k98J12j21K22l59J65j70J51Q1m00
3706c35K92J05o6r2K17l2k01K8K15m8k48K20j39O5oL4J52j51r3P3N9j73N9o2K26
3731I9j71L2j9j37J49J3l9k7R6m9J16k11J46Jp2J24L9l4pj00K97k09r2O3J5p8
3757e5J48p4j54j35J44J81Qp9j2J74j19K8q7k48K70J19k54J69N3l0j09K6M8Nq6
3782f9J71j71J79k49O1R2k60L84j03j40K13L4j65J5J95L2l85J38K20k11J34o1
3804E4m4J65J05n27J50K3J87j57M3J7jpJ02N6k05l0J82j73J56k17R8q7O0pk5p2
$$ y = [2, 50, -10, -127, 117, -70, 28, 139, 63, 104, -235, 64, 13, 79, 77, 207, 204, 64, 41, -81, 132, 22, -61, 151, -15, -17, -103, 18, 138, -14, 84, -234, 32, -288, 69, -94, 48, -180, -37, -52, 30, -103, -97, -91, 63, 202, 127, 83, 75, -79, 34, 138, 131, 144, 206, 103, -138, -50, -89, 141, 73, -184, 36, 282, -16, 96, -25, 197, -162, 3, -167, -16, 65, -335, -43, 62, -4, -96, 121, 89, -112, -84, 131, 83, -165, 55, -84, -19, -25, 9, 161, 10, -83, -10, 49, -124, -65, -127, 99, -72, -40, -59, -196, -47, -34, -73, -100, -4, -53, 63, -148, -2, -1, -73, 51, 90, 56, 49, -51, 246, 37, -55, 8, 23, -55, 93, 19, -135, -270, -126, 55, 63, -16, -28, 146, 27, 55, -32, -280, -10, 109, -145, 24, 77, 47, -62, -36, 12, 17, -69, 102, -69, 110, -139, -78, 14, -246, 138, 35, -105, 108, 142, -23, -8, 187, 219, -166, -28, 192, -19, 115, 54, 10, 175, 280, -247, -97, -74, 113, -44, -1, 16, 15, 8, 110, 166, -39, -69, 113, -60, 96, -121, -23, -110, -50, -57, -82, -154]
3830a54K04j26K63k51M5J37M2p4J9l20K45p1L08l47J29q6K19k65N5m4K0P5n9k7
3854f3L4J98k82J08k44K29jO0j32R8N5j02O7Lk9q8P1q2J28j93J64J52k68K55k24
3879h6l7J21L5j52p8J04K34j05j31M5L2R0j0Q8j66k27K08J22r3O7j1J6o5j34K76
3904A43k82K27k20K07Nj88J97p9l1O5j2K21l74N7L8O8J9J70k87qJ2KJ31j67Lp8
3930a61J22k1P8k2L0q1K90k44J01N4k14K42l28O9j57J71J03L1m3k46J69m1RJ89
3954A00j06q0K1j72K29P3M2q1J34j36j61K51j67K16j33j26J84k6J45k13J52K8
3976A74k14L5L3j4k27Q9P4R6R4k41J10k06J56p7J67j08J30j70Q1j17J58n9j13
3999a49J91L43m96J26J46J04k34L6qkn6k9rJ8p0J26j93K22l83J91L03j49j31P8
$$ y = [-154, 50, -76, 187, -64, -19, 118, 160, 86, 105, -215, 30, -41, 267, -80, 49, -37, 182, -83, -28, -72, -52, 23, -36, -63, -29, 169, -113, -5, -249, -20, -21, 39, -93, 5, 60, -42, 25, 28, -1, -89, -18, -100, 28, -165, -1, 151, -117, 138, -86, -123, -2, 33, -119, -197, -93, 141, 36, -95, -50, -18, 72, 62, 150, -16, -243, -35, 87, -6, 61, 50, 66, 1, -133, 143, -139, 88, -132, 75, 80, -108, 89, 10, -21, 44, 32, 253, -121, -64, -26, 42, 61, 231, -56, -64, -52, -50, 81, -86, -83, -161, -39, -60, 18, -4, 26, -55, 235, -9, 92, 146, -68, 174, -154, -85, -242, -71, 32, 63, 20, -226, -57, -98, -89, 100, -6, -86, -65, -237, -8, 65, 107, 26, 160, 24, -137, 114, -53, 163, 30, -96, 88, 62, 207, -6, 146, 174, -40, -5, 28, 14, -213, -124, -50, 46, 140, -101, 9, -197, -41, -118, 49, -59, 71, -99, -18, -135, 23, -36, -149, 42, 385, -111, 15, 161, 265, 31, 67, 59, 57, 1, -28, -37, -19, -89, 37, -156, 66, -317, -126, 177, 28, -103, -25]
4023b5J4K4m9J40L6j77r0lN8K34k6j52k25L15np7q8Q3j16LQ6l5L1r6K15j57K44
4050A62r1j43L6k4j09K25p7J9j53L86l28J29nn9J56q4o1K96j21l12m9N0L01k30
4074h6J77j66n2J93l04J00K74j05L4k24J76K1j05J52j34q4P0K6K20k52J33q2J41
4097A23j34K5n0L0pN1n5R7k06O0Q6j38j0J85l7o9P7l16M79l97J34J79j59R9m7
4122@j53J15l5j8j47K62R0p8K48l32J38o4l4J8m1m0j88M01k16O3Kq1J68k1k04
4147a47o8J84J05l96M17j61o3k3J58%m0k5J11L2j85J66j89J4K79j62O4l8q8O1
4171Fj70K58j33k68M04P4k07R7n6k6K1n5lJ82j85k4J23n3np9J15N4Q8N7l30J5
4197a00J09j96K26k03J87k00R6J54p5m6J80nk49Q0l08L05R0q8j10J04L7O0p5Q
$$ y = [-25, -11, 13, -36, 104, 140, -37, -127, -130, -72, 162, 136, -16, -241, 74, 69, -8, -96, -13, -129, -126, -40, -75, -44, -140, 75, -82, 162, 71, -72, -36, -60, -169, 56, -21, -2, -155, 231, -97, 32, 27, -32, 124, 40, -21, 275, 154, -158, -207, -157, 144, -86, 91, -75, -127, 66, -238, -138, 136, 31, 65, -159, 17, 38, -67, 85, -49, -133, -63, -37, 183, -69, 64, -18, 123, -11, 14, -36, -6, -13, 38, -17, 80, -126, -66, 20, -118, -128, 57, 20, -49, 28, -288, 191, -206, -72, 107, -52, 47, 0, -153, -38, -73, -91, -238, 24, 114, 36, 284, -48, 90, 26, -8, 10, -31, -71, -259, 142, -74, -11, -9, -90, 78, 57, -147, -215, -31, 74, -322, 95, -66, -129, -152, 6, 6, -34, -59, 52, 84, -101, 65, -124, -110, 169, 7, 71, 33, -55, 6, -164, 94, -39, -307, 97, 171, -36, 61, 5, -21, 0, -55, -58, 124, -61, -85, 38, -15, -20, -99, 16, 70, 158, 215, -115, -100, 9, -187, 39, -164, 23, -177, -81, 73, -2, -48, 132, 127, -122, -42, -350, -45, 45, -43, -153, -49, -12, 48, -27, -19]
4221a9J6K5J62k15N5o5j5n7J73j70K72k50o4L34l95J26j7K85j19j80P6Q2n1K36
4245B25m27K29o6j58K55k12J62J15pj11J82k71J66j23P6j01n7J70k4k02N8K83
4267A62j11p3O6P0j0j23j55R3QQ7j91K48J1j47k6p6J37J92k26Q9n8J27q1p0J31
4292G4k34J17o7Kn1O8Q6M7n6j01J51R9j61o2kK39l94K92O5r6m8n9M4j09R1J80
4318A15m06K42J80m2o7J05j6j32Q4Q2J06l51J27Nk88J22K19j3k44K16j01n4L10
4341A99N0L3l22J59m4j69K03j99J49o3J83j43K37k69O5J53j59j87K90k95Q0j15
4363a64J77j36J45J59j48j7r6OJ30K3Q0k70L1J48J49l14O5J61n8kn1Q2k92L75
4387A83j80K3j91J72L6N1J18l35N5J32l41M13j72R3m1q1n5J72k05J39J4N0p3l5
$$ y = [-19, -3, 22, 184, -31, 24, -41, -56, -113, 60, -110, 162, -88, -152, 182, -213, -87, -104, 181, 62, -118, -42, 40, -11, 225, -202, 27, -39, -197, 58, -154, 8, 123, 116, 5, 187, -84, 82, -41, 35, -66, -123, 47, 23, -179, -121, 162, 51, -22, 44, 114, 104, -19, -174, -81, -73, 14, -177, 71, 82, -65, -91, -167, -30, 162, -64, 25, -33, 94, 13, -57, 74, -160, -43, -110, -108, -159, -91, -5, 42, -14, -115, 36, 135, -26, -88, -90, 149, -245, 47, 112, 16, -32, -91, -47, -156, -65, 115, -291, -49, 131, 89, 22, 127, 111, -21, 63, 145, 251, -100, 27, 32, -256, -134, 85, 72, -172, 44, -57, -111, 199, 249, 282, -40, 119, 75, -94, 109, -90, 59, -4, 179, 36, 273, 4, 69, 222, 63, -124, 166, -129, -49, -164, 13, -123, 22, 181, 33, 16, -80, -74, 56, 79, 159, -111, -80, 68, 217, -97, -32, 129, 71, 69, 18, 100, -192, 183, 3, 26, -165, 7, 43, 94, 212, -123, -68, 64, -277, 136, -36, 57, 16, -65, -120, 52, -153, -14, 0, 50, -23, -58]
4411e8J49L2k55L3J24L6L0k42K22K0q9Nn5J2N5O9j65j02k7J77l7J69R9k11j20
4436a29mJ95q9j85K67M2j39Q4K9p8r2J54j22J05l41L67j11k2K5J39M0k48K37J6
4460A40j31o9k7K10j37m2O9J25r3j31J52m2P6j87K10o5K3N0k70J87k9M9j07J03
4484F4k43K00P0k33K35p3J7p2N9QO3o5K05r2j93n8j5R9J24R6k30O7k2p2k5O8j17
4511a35K79l8k54J46j6qO2j60K15O4k33l0K80k55j18K38j4O0j72J41j83q1K85
4534G3M5k2r6j82J39Q5l4j81O1J10J2N5k64K54L9q2l3o8J0J23j28K2L5k62L20
4559C1r4m7O5J37j57J9j15O9j14J72J45m1jk58J82Q5L1J20j19j09lJ25n1j84m7
4584a59J46r8J62n0J49k29L5K46l17J5j0k4k8J89j71K27k01O7J35l2Q6l05Q4L3
$$ y = [-58, 91, 123, -132, -99, 25, 61, 91, -151, 71, 91, 2, 7, -48, -36, 19, 88, -77, -179, -206, -29, -66, 103, 202, -9, -129, -133, 62, -27, -212, 55, 97, -42, 42, 71, -7, -99, 55, -67, 38, -303, 64, -47, -69, -44, 95, 135, -113, 124, 140, 9, -60, -87, 123, -14, -56, 13, 138, 45, -86, 66, 24, 100, -87, 123, 58, 81, 131, -139, 48, 19, 68, -39, 64, -179, 21, 91, -142, 93, 20, 37, -35, 24, 32, 95, 30, 235, 143, -50, -108, -123, -24, 100, 196, -34, 33, 11, -61, -86, -18, -135, 144, 106, -148, -2, -18, -26, 36, -124, 91, 155, -78, -108, 172, -83, -201, 37, 23, 83, -89, 52, -131, -212, 73, 118, 96, 0, -182, -43, 42, 8, -173, -112, -2, 10, 65, -199, 55, 94, 12, -21, -89, -79, 44, -84, -62, -27, -289, 31, -63, -110, -45, 92, -65, -46, -161, -92, -206, -34, 111, 70, 69, -189, -7, 78, 109, 229, 110, 1, -2, 123, 72, -112, -159, -13, -111, 51, 1, 150, -79, -44, 202, -115, -100, -110, -134, -162, 27, -144, 83, -118, -51, 84, 52, 138, -167, -83, -50]
4608e0n0J22J5M8m3j5o2J56L0j62K0l4k9p1MJ59q0l7J59k3rl30M79j90L4J15k81
4635a25K61j2j54R6j00j06J61j30R3J14l2k07J53p1J10j01L3J01p1j17J22j08
4657i0L2J37k66L28j90k7K4Km5j0PO8l8K71k22R2j70J2L00k63J08j64J10k91L65
4682H0Oj0n7Pq2P3p2r4K27n4L9J1J21j61n1K43j23j06J01r5j96J57J31j08Q5n0
4708B2R6r4r8M2k24L25o8j53J10n9L6J60k79N3J83k73M09k57K09l26K69L3j10
4731FN9k39L23r9l1m1k1n0L00k18P1j27qJ42J70k47O6j49j1J23o2j96J34j8K35
4756A12j27k0q4J6K1J12n2P9Q2k36K77l01j2J90j64R8J4J66Jj04K0m7l2P2p5J30
4782A36o7n7j06j0J18O6o4J11k2k10P3n1R7J93j18K3o7M5Mq5r8q1J27j35J78k8
$$ y = [-50, -100, 22, 37, 85, 42, 27, -35, 121, 151, -11, 9, -25, -54, -125, -121, 38, -42, -79, 80, 57, 48, -282, 197, 7, 41, 156, -125, 136, 124, -30, 66, -34, -140, 21, -109, -16, 98, 66, -141, 12, -59, 51, -50, -17, 84, 13, -104, 18, -90, -58, 79, -187, 141, -49, -76, -52, -50, -95, -105, -98, -30, -68, 203, -19, 73, -97, -85, 215, -48, 60, -104, 6, -285, 80, 86, 76, 19, 26, -56, 17, -55, -149, 78, 24, 63, 74, 195, 34, -17, 226, 103, -3, 98, 3, -193, -36, 95, -13, 72, 22, 118, 24, -74, -32, -256, 69, 1, -152, -42, -101, -65, 95, -184, -131, 52, -221, 188, -69, 140, -186, 83, 116, 6, 65, -174, 149, 50, 19, -22, -43, -93, 207, -11, 60, -67, -75, 67, 237, -10, 56, -93, -104, 19, -43, -239, -105, -123, 112, -15, -35, -119, -103, -82, 30, -22, 57, 139, -97, 180, -121, -133, 57, -107, -9, 5, 171, 172, 68, 88, 41, 9, 81, 6, 136, 69, 12, -94, -104, 14, 80, 16, 127, 105, -105, -32, -83, 14, 207, 89, 112, 45, 90, 94, 9, -89, -170, -43, -178, 0, -28]
4808b8L8J49r0mJ07k0k38q0K40r6K67j56j69L4Q2O6qk6n8L6m5m4j47J72P7r4N1
4835A6j3J86j64q8k9J89Rj67Q7oN9N4o1j06J50k12L0J31j94K75o9q1j97M4K13
4860E6K8j50K09j18m3J07j82J28j26R2O7j42R9j00L8N5j19Q7r7J99k09J43K9j75
4884a24J91j12R3j37R5J39r6k21P7R5n9K46j99j64K06j03J10M0k6R4k00K43j80
4907Ho0r7J33m5J40J06k07j54M19k79j9J67n0J03j44q2J84l02L28o8j98K70j2
4930A41k31R2R2k35J12p5J19j03J17k1l26L82K8o8r8K40j95J57Pl79J75k3N8O6
4954C2k41L09kJl13J90K22l7j5k41%L7K31j19J5P0j46K2k62K35p5L11l09j18L14
4979A11j09j4q1L36k02qn8k6L57m02K50j54O9M3o9K5o5J8OM0k99J53J9J94K7j59
$$ y = [-28, 10, 159, 69, 65, 172, 152, -86, -166, 74, -22, 245, 89, -80, -46, 36, 102, 94, 68, 10, 46, 1, -43, -190, -18, 59, -35, 16, 3, 189, 25, -63, -92, 97, 106, -61, 26, 20, 79, 133, 72, -34, 116, -96, -66, 65, -129, 146, 77, -4, -201, -157, 56, 84, -66, 143, 25, -18, 89, -93, 35, -91, 1, 68, -74, 25, -75, -37, 18, -101, -14, -111, 88, -121, 22, 51, -124, 67, -45, 48, -89, 6, 145, 49, -172, -95, 0, -59, 187, -12, -176, 30, -73, 37, 77, 51, 145, -55, 188, 8, -52, -149, -16, -61, 79, 185, -22, -176, 243, -36, -55, 112, 62, 165, 21, -61, 123, -179, 149, 81, -117, 153, 141, -90, 2, 94, -141, -29, -104, 15, -88, 29, 8, -318, 64, 92, 24, -74, 166, -29, 128, 135, -244, -69, -92, -34, 32, -209, 100, 98, 99, -214, -24, 198, 161, 146, -95, -95, -58, 173, 54, 69, 139, -7, 15, -247, -12, -87, 224, -85, -203, 111, 2, -12, -93, 243, 41, 33, -25, -51, 306, -96, 154, 0, 69, 112, 43, 68, 3, 21, 27, 67, -232, -79, -60, 134, 161, 2]
5005Bj9r4JoJ27P0k11K94l17J75j2k39L47l5k93K74n7k69N80j53j21rK5k76P8
5030a38J07J65L5j31k9J05o5j7O4k87L63k01j06O1J46p7j06L2P7j1lm5K2L09j17
5055A53r5j64J02m7J9O3o7R6R2j48o8R9N5N5j79p3K96n6j11N6j69J49p6M4M5O4
5081A35j73j36K73k88L62k49q8Q8K07j52J61p6k28L1J79j3J37k03j26Q6n8J7K07
5104I3j12k8P5l15K01L0K59l89K43j24M4p9J7J98q6j95K64k29J24J05j54J45n9
5127B8K3l2Q5k21K08j10J5l3J48j33Q5j92L66k73J01k00J09Q0J68k07mJ0O8p5
5151A4l3l9l7J70J12j91j82J19P6J7O4l9jL4Rl25L11n5o5R8l0j20J75j62J87j67
5177f0Q9Q2j82l6J15k8jq0m5J13q4%K11J7jj92J43M3k6j62k8R1L4k28J90J40n9
$$ y = [2, -17, -111, -110, -116, 11, 81, -130, 164, -153, 22, 10, -229, 118, 83, -210, 64, 7, -262, 318, 165, 44, 35, 60, -216, -138, -31, 134, 169, 38, 9, 114, 49, 32, 96, -191, 172, -29, -135, -74, 72, -5, -111, -79, -2, -13, -16, -61, -39, 270, 153, 58, -106, -4, -51, -32, 31, -36, 60, 152, 4, -64, 35, 90, 145, -34, -107, 189, 133, 22, 78, -91, 58, -18, 26, 71, 135, -38, -174, 99, -189, 173, -76, -164, -76, 131, -21, 140, 64, -164, -133, 46, 33, 170, -33, -159, -73, -131, -114, 93, -19, -47, 28, -287, -86, -56, 203, -186, 57, -67, -23, -102, -85, 113, 27, -168, 96, -133, -9, 96, -58, 87, 28, 51, 19, 104, -117, 91, -19, -4, -37, 111, -22, 63, -129, 237, -36, 65, -135, -26, 54, 222, 15, 11, 21, 89, 14, -19, -58, -95, 75, 187, -4, -186, -67, 9, 26, 90, 51, 50, 84, 93, -232, 79, 24, -41, 57, 27, -93, 82, -80, 107, -60, 29, 111, -71, -107, 8, -20, -21, -101, -146, -33, -117, -117, 94, 111, 110, -82, 61, 104, 78, -84, -112, -21, 13, -215, -25, 115, 56]
5204E6L3l4k11J06N6j57K53j02KJ23k8lk9j09J33k07K9m2K95k86L9Q3J46j59q1
5229i4K67j05m9k0K00k40O0j30K23j49J60m02K25j07J25o5R8o7J71j39J01K0L9
5252A22k2k05O8p3j26K82k68L16K5j88r9OK12j39J11K2l9PN5k13K89j35J31j44
5276eN7j64O9J4r6J70J05j08j59j73M15o2k81L82j40O9m7P1l35K91k10j07J52
5299i2n6O3L44k28j60L4k3J26r2J63k18J27m4J73m8j36n0J42j2l3J08k3Q7l9P6
5324A89j21p2J64k33r5J79n6J90R8k25mJ82k71Q8K0j83J65k53J24J17J59j70K1
5347A3LJ15l2Nj59j64K51rk00mJ4J28L01m79K47q6M6Q0j41J46m3j88M4k8O2Pj7
5374h8J79j69Q2k92L98l2J34n11J22K14k84L72j02L9j47J80K00m36K10j47Q9o4
$$ y = [56, 89, 55, -156, -50, 6, -151, 102, 0, 2, 125, 97, 94, 65, -44, 89, -118, -89, -131, 164, -122, -83, 0, 146, -13, -94, 173, 68, 19, -1, 199, -41, 19, -111, 112, -37, 123, -279, -54, -161, -36, -101, -3, -70, 101, -38, 63, 83, 122, 100, -105, -37, -110, -236, 46, -222, 94, 119, -69, -168, -162, 50, -89, 22, 44, 5, 12, 67, -146, 143, 8, 139, -5, 52, -112, -43, -29, -125, 45, 150, 42, -117, -290, 125, 63, -218, 164, 24, 93, 46, 117, -218, 73, -137, -244, -92, -148, -85, 259, 31, -129, -95, -118, 8, -84, 79, -139, -12, -56, 117, 69, -67, -117, 25, 13, -20, 88, 65, 152, 113, 189, 68, -4, 160, -73, -168, 11, -45, 145, 243, 18, 14, 196, -75, 13, 33, -150, 15, -238, -114, 3, 162, -8, 13, 16, 131, 99, 104, -55, -219, 32, 23, -177, -181, -167, -39, 262, -217, 30, -56, -10, 70, -71, 75, 32, -156, -112, -140, -78, -71, -88, 91, -78, 4, -288, 110, 78, 212, -299, -177, 37, -247, 125, 23, 62, -85, 95, 295, -141, 69, -78, 11, -53]
5396e3j15K14l0L3m9J25j86J29J9k61J95P8k34J36nm2J3P4k31K13p9R4j64Q2j59
5421b03L57k29o5K00j43J65p0j0J19k52N0J20J11n1k9m6p0j26J01J50j24M1K0
5444A6n9j36L07j89J69P2j76m6J55j52O4l9LP2j58J56O7Q2k06J3J13j35m2j84
5468b33K00l9J57o9J3l6o9N1R1m4pr0J99l3Qk02j8J32K7m3j0Nq5O2J6K00k00k8
5496d5J81k9m4p2p2J05k53J34MJ21k19J36J22j02J21j14nj3O7o2K6%J18p7m0m3
5522e5j06L29j73J37j60N9J34j09M2j88r0K58qq3K58k72J03j68J63k64J04P4J8
5545CJ05o5j04l2J0j9J62k14OQ4P0Q0q3j48R1J05j81l5N3P8J05j47m2J98R2l16
5571a44J91pM1j21j61K37L%j76O3O2r4N4l5J09p7j0K69k49J03j44k26N11j98r5
$$ y = [-53, -168, 46, 16, 49, 0, 125, -61, 68, 87, -174, 21, 99, -135, 1, -4, -46, -33, 41, -190, 23, -56, 38, -126, -44, -203, 154, -75, -140, 60, -83, 82, 12, 2, 121, -131, -81, 39, 150, 99, 70, 24, -46, -172, -71, 79, -45, -4, 16, -43, -179, 128, -61, 108, 180, 4, -42, 113, -39, 25, -14, -11, 61, -97, 59, 126, 208, 2, 15, 128, -7, -49, -233, -33, -72, 85, 16, 29, -7, -76, -25, 66, 22, 15, -75, 124, 91, 99, -103, -121, 11, 38, -5, -15, -10, -95, -33, -17, 183, -17, -45, 136, 107, 63, -9, -81, 24, -229, -95, -91, 30, -189, -53, 69, -33, 88, -26, -31, -44, 23, -39, -13, -13, 105, 28, -12, -55, -161, 168, -5, 132, -28, 31, 165, 56, 98, -90, -180, 78, 70, -13, 245, -27, 76, -92, 71, -193, -89, -15, 3, 108, 43, -61, -93, -83, -102, 60, -154, -148, -64, 6, 86, 3, -145, -54, 51, -130, -165, -112, -34, 71, -76, -118, 80, 172, -144, 47, 40, 81, -40, -201, 36, 39, 39, -137, -74, -12, -106, -52, -87, 22, -55, -65, 204, -45, 58, -86, -312, 199, 1, -94]
5596i4K15q1r6rM6m2r8R5K0K80k63R1n4M9j97J68k18L12k28J14P7k09J34q8q7
5621a63N6J02K1K6j25p6J57j73J82J46k52M5n7N2J84R6k04m1K84k32J17j93K2
5644b6J77l62L95k30J61p2K31m12J86o2o3q0K97Jj07K47m72J17K72j47j7J0l8
5667FkOJ14J1m7j12j2R9k39J06J10O0j63K22m10R6o8K92P5k20J89j11r2L7n9r2
5693b04K86j0j48J41j28J23L6j04Jj59J29j22K94l8j71J78j88P2K8L22l38j43
5715a43L04o7j81n3O1l1J27q3J06K9q9m5m4j48L09L1j61j4k13M42kj28K25j49
5739H3Q0j23L3j02l7R9q5J08j31m5P7l04L05K40N1j09k84P0N2J85l06K87j32m0
5763b8qP6J08m8k82J56p0n9L57j80j40J46J28k10N6j03L48l44J94j66J39r2Q6
$$ y = [-94, 121, 40, -56, -65, -19, -61, -159, -64, -44, 236, -27, 64, 10, 59, -138, 30, -188, 124, -104, 10, 87, -122, 12, -76, -163, -107, -5, 16, 42, -83, -159, -2, -175, 7, 153, -99, -54, -111, -59, 125, 221, 17, -24, 260, 28, 145, -48, -26, 151, -211, 184, -46, 115, 43, 274, -138, 48, -14, -77, -157, 140, 141, 34, 281, -191, -74, 198, 51, 34, 44, 6, 4, 10, 124, 135, 88, -24, -36, 63, -176, -70, 40, 100, -63, 159, -251, -155, -223, 69, 144, -76, 113, 2, -90, -53, -112, -204, 82, 72, -76, 65, -63, 60, 96, -8, -7, -166, -37, -159, 135, 97, -74, 104, -84, -12, 16, 338, 0, -143, 161, 94, -87, -140, -79, -110, 17, -66, 40, 69, -20, -65, -109, -257, 52, 83, -78, -92, -305, 137, 135, 7, 232, 83, 163, 40, 73, -29, -66, 33, -52, 56, -75, -120, -43, -347, -42, 198, 249, 140, -144, -74, -22, 163, -143, 144, 12, -28, -36, 40, 148, 100, -182, -26, -96, -155, 202, 22, -118, 28, 156, -54, 2, -101, 247, -97, 97, -69, 70, -22, 64]
5786F4j36j1J79j00K0k06K62M9j90J05m3J12j01L02l83l6L34l68J98j22N6r6k
5809a13J48j44J17p1j24K25j08J3K28l65oJ23j7J0J2L0p2N8K51n9j88P9o5j04
5833a42L11p6K8j80j19Q5J6j30j3L74j94p4J65L4l6J05k8j90J43q4r7J22k4k0
5857b4o4J90q1r2OJ8J26P7j12j38K25o4j19K19K7j17O2j53j56J61n2R2M7j13J34
5882I9j37J17j10k7L9p4J34l5n3K57k46J88j34p1J21q2P8k7p0O3j98K22J45l42
5906a43O4P0O5J07p5j53J13M9Q5k88q9K78r0o0J6P8k57Q1Q4J85p2j89Q6K76k93
5931g2J32M4k25O4J70l31K89l3j16J17J2n0K08l77P5K8O2R0j02N4j00L2J34k9
5955G6q3j0l2Q6j37J48j95J63j6N1m2N0k03J82o0j20K99k13O7K4k2m2K11l47K57
$$ y = [64, -72, -83, 96, -4, 16, -190, 72, 121, -69, 36, -7, 105, 4, 306, -77, -113, 221, -147, 51, -71, -15, -111, -113, 35, -109, 8, -63, -187, 38, -70, -57, 171, -194, -200, -77, -94, -84, -72, -42, -114, -56, 195, 136, -52, 27, -38, -142, 169, 93, 121, -59, -178, -93, -77, -207, -220, 154, -40, -114, 51, 85, 49, 154, 126, -64, 79, -5, -102, 20, -4, -24, -88, 102, 21, -71, -65, -47, 79, 156, 44, -94, 131, 67, -52, 167, 194, 77, 139, -14, -170, -9, -61, 31, 78, -35, 99, -38, 79, -31, -58, -19, -93, 41, 6, -47, 210, -36, 152, 18, -53, 68, -14, 64, 37, -33, 30, -168, 54, 199, -143, -79, -9, 56, 163, 88, -65, 48, 97, 182, -106, -195, 83, -7, -67, -51, 27, -230, -149, -65, 120, 48, -141, -55, 221, -72, 60, 104, -121, -57, 113, -218, 71, 38, -78, 39, 51, 1, 209, -168, -93, -65, -3, 87, -15, 39, -61, -29, 105, 76, -7, -17, -49, 37, -100, 48, -147, 16, 0, 51, 9, 59, -144, 38, -22, -142, 157, -56, 11, 35, 13, -29, 182, -165, 92]
5980I2k60R1q8J30k58L21j95L73l0k19J68j02J2j6l4k03J15J6P5j09R9J39j59
6003d2O4m1P9m2M9K0k08L5rJ26j23J96j10Or5J75r7R4j04k14J76p7O9J47j58J94
6029A10k30R5N3j9O8nn8m8k6J09j91J00O6j57L02j93j62nk3J3L72j75q3O1J39
6054A13q1j09L3J4J30j7j12p6L11k54N3P5j42J58j49NK27l96L50j78L8q7J20j38
6078a12oJ01N8j25n5J55o7j09J78k53K62L7j68J91k8j69K24o4J5j05L0m7M2n6
6102g1K89l12N6M4Q1O1j59K8m2M9P0k07n3J54q1O3k39L81R1j05j09mj23J08j44
6127a74J50J24J19l32K2J39N1p9l2j45J62o0P1q3Q4K9l5m8R8k69J51J13j14R1
6151C3L4J57l26K06j52p3m2J04J49J30k21j44K69j32m2R9l7M8qj20j31J71j08
$$ y = [92, -168, -77, -165, -35, -293, 28, -167, 206, 176, -43, 125, 23, 35, 19, -15, -218, -103, -87, -12, -121, -22, 117, -42, 22, -19, 60, 18, 67, 87, -121, -86, -95, 31, -92, 104, -6, 0, -95, 80, -17, 77, -27, -241, -65, -142, -73, 74, -84, 110, -120, -25, 28, 9, 77, 72, 14, -34, -60, 49, -142, -42, 24, -133, 169, -24, -186, -191, -214, -201, 171, -4, -87, -26, 113, 32, -77, -44, -30, 100, 83, -29, -105, 206, -48, 5, 80, -62, 96, -53, -48, 179, -217, 133, -45, -7, -94, 26, -112, -118, -17, 41, -84, -139, 16, -51, -160, 18, -235, 27, 64, -104, 87, 59, -110, 114, 50, 65, -40, -10, -57, -15, -71, 218, -94, -38, 6, 87, 148, -11, 17, -25, 24, 94, -113, -166, -12, -93, -30, -269, 112, 203, 98, -11, -15, -138, -30, -174, -24, 100, 219, -113, -91, 48, 99, 20, -12, -157, 5, -55, 16, -67, 17, 46, 11, -37, 61, -208, -57, 56, -58, 33, 67, 224, -102, 104, -48, -121, -163, -59, 90, 220, -1, -145, 124, -8, -50, 49, 12, 60, 52, -68, -199, -28, -136]
6174a36L04k19k1k3J8K16j52J35k78JJ48n6o4K70r0J25J17k79n5o2m5K41n2J04
6198A47k97J86m9q9L32p8k81p4N2J85J0j49J27M0r3j38m2J08OP2n2J6j10L38j72
6223ej06J98j22j0j2Q9l9j19K85j23K72l18j13K25k11J17kL0j93L25m4m9l17K93
6247E1o0o5L1J25k9Qq4l5%r3J80M0k38J58j93K30j85L37k73K92j35J46k66O9M4
6272E5j08q2K37r8o5m9k2K38L2j70l7K59k19M0j40J12L0q1L8J59j53j3L0Q5k1
6297E7j27K4J53m2j25No6O0N7l5O3kj79J13J28oL1J32l79p8R1K63l04J80q3p2
6323a41J32K2k92L18Q5m2P9j12N5j52L3j74K59l4kk12L20o3j44O5j13qp7J8J55
6348b5k2PJ58j00n4m7J64K8p4j62J16N1O5M9j65l0P8n3o4K14k58K60k46M6n2R6
$$ y = [-136, 168, -51, -72, -95, -77, 139, -13, 122, -156, -155, -7, -63, -127, 143, 53, 178, 295, 16, -39, -101, -146, 95, 43, 147, -150, 36, -13, -102, 230, 152, -129, -203, -151, 34, 44, -105, 22, 62, -31, -169, -211, -103, -97, -25, -77, -61, -171, 167, -5, -111, 87, -35, -45, -57, 32, -7, -126, 159, 36, 308, -10, -123, 102, -109, 8, 6, 36, -157, 168, 124, 75, -242, 51, -9, -74, -43, 82, 53, 61, -23, -58, -58, -151, 29, 69, -169, -11, -204, 26, -159, 178, -95, 197, 62, 208, -58, 11, 55, -53, -135, 102, 4, -61, -110, -132, 106, 138, -32, -69, 190, -29, 11, -129, -17, 13, -68, -30, 129, -24, -37, -7, 78, 57, -70, -46, 107, 65, -60, -55, -121, -61, -4, -39, 24, 22, -157, -44, 84, 78, 109, 241, -138, -216, -125, 138, -166, 14, -69, -141, -9, 13, -279, 39, 124, 82, 161, 49, 104, -48, -15, -189, 70, 36, 34, -178, 142, 79, -65, 0, -113, -121, -198, -180, -25, -47, -40, 118, 18, -36, -83, 81, 109, 35, -127, -11, 40, 105, 154, -11, -41, 37, -16, -80, 134, -124, 136, -110, -64, -116, -20]
6374b0J15j23O0J49j08Nn2j01J7j43L52qn12K24p8K37Q0j45j6j54J67p1Q2J66
6398A23kk14J26r8k3N9J69O2j12j29P6M5j94J02N9q0r7J22J02o2n7O0r2J10r9
6423d4k6J93l76K31JJ64p6l8J1j42K01k43J61J26l17K05o6kJ40k8k27m0L53k22
6447f1N8Rj19L4kl9J33O7J18j04l20J74M9j30K06L7N6n4j83j3L1J8K8j53J87r1
6473f4J78N1l28J35j82L88Rl38K30l3j32K37o3n5j03Q1J30m56K54O4%n1R4Q6k92
6498a60m2J85m4K4k1O9L3j10j22N2P1J50r3K00k36o3J08Q8j65J43NK9j12j09N3
$$ y = [-20, 95, -28, 32, 181, 73, 78, 26, -75, -58, -201, 151, 143, -369, -145, -223, 14, 94, -51, -67, -221, -54, -125, -43, 123, 121, -93, 33, -65, -88, -29, 140, 202, 90, -39, 37, 82, -112, -10, 49, -31, -128, -6, 96, 34, -23, 37, -55, 55, -44, -70, 123, -253, -22, -21, 143, 67, 29, 40, -102, 99, -144, 17, 143, -174, 31, -35, -37, 103, 75, -152, -192, 161, -61, -3, 6, -113, -79, -81, -120, 13, 80, 198, 94, -226, -52, -3, -133, 73, 110, 166, 112, -71, -84, -53, -35, -7, -160, 27, -64, 114, 165, -163, -28, -210, 178, 187, -151, 79, 46, -86, 151, 88, 33, -70, 11, 141, -315, -61, 3, 3, -48, 46, 132, -160, -202, -17, -61, -37, -58, 11, 44, -66, -188, -136, -65, 85, -8, 192, -44, -107, 1, 89, -76, 67, 72, 101, -11, -120, -67]
$$ [...]
8191d6
##END NTUPLES=NMR FID
##END=
