##TITLE=1H_Pr 4128
 200.13MHz,CDCl3,
 8 sc
 
 1.4.2025
##JCAMPDX= 6.0         $$ Bruker NMR JCAMP-DX V2.0
##DATA TYPE= NMR FID
##DATA CLASS= NTUPLES
##ORIGIN= UXNMR, Bruker Analytische Messtechnik GmbH
##OWNER= pz
$$ XWIN-NMR		Version 3.5
$$ Tue Apr  1 13:49:32 2025 Russian Standard Time (UT+4h)  she@DPX200
##.OBSERVE FREQUENCY= 200.1313
##.OBSERVE NUCLEUS= ^1H
##.DELAY= (6, 6)
##.ACQUISITION MODE= SIMULTANEOUS
##.ACQUISITION SCHEME= undefined
##.AVERAGES= 8
##.DIGITISER RES= 18
##SPECTROMETER/DATA SYSTEM= spect
##.PULSE SEQUENCE= zg30
##.SOLVENT NAME= CDCl3
##.SHIFT REFERENCE= (INTERNAL, CDCl3, 0, 14.3821)
##AUDIT TRAIL= $$ (NUMBER, WHEN, WHO, WHERE, WHAT)
$$ ##TITLE= Audit trail, XWIN-NMR		Version 3.5
$$ ##JCAMPDX= 5.01
$$ ##ORIGIN= Bruker BioSpin GmbH
$$ ##OWNER= she
$$ F:/spectra/data/she/nmr/H-C/1/audita.txt
$$ ##AUDIT TRAIL=  $$ (NUMBER, WHEN, WHO, WHERE, WHAT)
(   1,<2025-04-01 13:48:01.21 +0400>,<she>,<DPX200>,
      <created by zg, POWCHK disabled, PULCHK disabled
       configuration hash MD5:
       00 E9 B6 7A A2 85 ED C7 34 08 36 98 17 FE 4E 26
       data hash MD5: 16K
       AB 39 86 16 54 F2 43 BB AD FD F7 13 EE 96 E2 7B>)
$$ ##END=
$$ 
$$ hash MD5
$$ 1F 61 6C 5D AF C3 2D 98 04 9F BA C4 81 17 F1 65
##$RELAX= 
##$RELAX= 
##$RELAX= 
##$RELAX= 
##$RELAX= 
##$RELAX= 
$$ Bruker specific parameters
$$ --------------------------
##$DU= <F:/spectra>
##$EXPNO= 1
##$NAME= <H-C>
##$PROCNO= 1
##$TYPE= <nmr>
##$USER= <she>
##$AMP= (0..31)
100 100 100 100 100 100 100 100 100 100 100 100 100 100 100 100 100 100 
100 100 100 100 100 100 100 100 100 100 100 100 100 100 
##$AQSEQ= 0
##$AQ_mod= 1
##$AUNM= <au_zg>
##$AUTOPOS= <>
##$BF1= 200.13
##$BF2= 200.13
##$BF3= 200.13
##$BF4= 200.13
##$BF5= 200.13
##$BF6= 200.13
##$BF7= 200.13
##$BF8= 200.13
##$BYTORDA= 1
##$CFDGTYP= 0
##$CFRGTYP= 5
##$CHEMSTR= <none>
##$CNST= (0..31)
1 1 145 1 1 1 1 1 1 1 1 1 1 1 1 1 1 1 1 1 1 1 1 1 1 1 1 1 1 1 1 1 
##$CPDPRG= <>
##$CPDPRG1= <>
##$CPDPRG2= <>
##$CPDPRG3= <>
##$CPDPRG4= <mlev>
##$CPDPRG5= <mlev>
##$CPDPRG6= <mlev>
##$CPDPRG7= <mlev>
##$CPDPRG8= <mlev>
##$CPDPRGB= <>
##$CPDPRGT= <>
##$D= (0..31)
0 0.7 0 0 0 0 0 0 0 0 0 0.03 0 0 0 0 0 0 0 0 0 0 0 0 0 0 0 0 0 0 0 0 
##$DATE= 1743500880
##$DBL= (0..7)
120 120 120 120 120 120 120 120 
##$DBP= (0..7)
150 150 150 150 150 150 150 150 
##$DBP07= 0
##$DBPNAM0= <>
##$DBPNAM1= <>
##$DBPNAM2= <>
##$DBPNAM3= <>
##$DBPNAM4= <>
##$DBPNAM5= <>
##$DBPNAM6= <>
##$DBPNAM7= <>
##$DBPOAL= (0..7)
0.5 0.5 0.5 0.5 0.5 0.5 0.5 0.5 
##$DBPOFFS= (0..7)
0 0 0 0 0 0 0 0 
##$DE= 6
##$DECBNUC= <off>
##$DECIM= 32
##$DECNUC= <off>
##$DECSTAT= 4
##$DIGMOD= 1
##$DIGTYP= 9
##$DL= (0..7)
0 120 120 120 120 120 120 120 
##$DP= (0..7)
150 150 150 150 150 150 150 150 
##$DP07= 0
##$DPNAME0= <>
##$DPNAME1= <>
##$DPNAME2= <>
##$DPNAME3= <>
##$DPNAME4= <>
##$DPNAME5= <>
##$DPNAME6= <>
##$DPNAME7= <>
##$DPOAL= (0..7)
0.5 0.5 0.5 0.5 0.5 0.5 0.5 0.5 
##$DPOFFS= (0..7)
0 0 0 0 0 0 0 0 
##$DQDMODE= 0
##$DR= 18
##$DS= 0
##$DSLIST= <SSSSSSSSSSSSSSS>
$$ [...]
##$SUBNAM0= <"">
##$SUBNAM1= <"">
##$SUBNAM2= <"">
##$SUBNAM3= <"">
##$SUBNAM4= <"">
##$SUBNAM5= <"">
##$SUBNAM6= <"">
##$SUBNAM7= <"">
##$SUBNAM8= <"">
##$SUBNAM9= <"">
##$SW= 18.0517328524113
##$SWIBOX= (0..15)
0 0 2 0 0 0 0 0 0 0 0 0 0 0 0 0 
##$SW_h= 3612.71676300578
##$TD= 16384
##$TD0= 1
##$TE= 0
##$TE2= 300
##$TE3= 300
##$TEG= 300
##$TL= (0..7)
0 120 120 120 120 120 120 120 
##$TP= (0..7)
150 150 150 150 150 150 150 150 
##$TP07= 0
##$TPNAME0= <>
##$TPNAME1= <>
##$TPNAME2= <>
##$TPNAME3= <>
##$TPNAME4= <>
##$TPNAME5= <>
##$TPNAME6= <>
##$TPNAME7= <>
##$TPOAL= (0..7)
0.5 0.5 0.5 0.5 0.5 0.5 0.5 0.5 
##$TPOFFS= (0..7)
0 0 0 0 0 0 0 0 
##$TUNHIN= 0
##$TUNHOUT= 0
##$TUNXOUT= 0
##$USERA1= <user>
##$USERA2= <user>
##$USERA3= <user>
##$USERA4= <user>
##$USERA5= <user>
##$V9= 5
##$VALIST= <valist>
##$VCLIST= <CCCCCCCCCCCCCCC>
##$VD= 0
##$VDLIST= <DDDDDDDDDDDDDDD>
##$VPLIST= <PPPPPPPPPPPPPPP>
##$VTLIST= <TTTTTTTTTTTTTTT>
##$WBST= 1024
##$WBSW= 4
##$XGAIN= (0..3)
0 0 0 0 
##$XL= 0
##$YL= 0
##$YMAX_a= 665231
##$YMIN_a= -854559
##$ZGOPTNS= <>
##$ZL1= 120
##$ZL2= 120
##$ZL3= 120
##$ZL4= 120
##$ABSF1= 10
##$ABSF2= 0
##$ABSG= 5
##$ABSL= 3
##$ALPHA= 0
##$AQORDER= 0
##$ASSFAC= 0
##$ASSFACI= 0
##$ASSFACX= 0
##$ASSWID= 0
##$AUNMP= <proc_1d>
##$AZFE= 0.1
##$AZFW= 0.1
##$BCFW= 1
##$BC_mod= 2
##$BYTORDP= 1
##$COROFFS= 0
##$CY= -3
##$DATMOD= 1
##$DC= 2
##$DFILT= <>
##$DTYPP= 0
##$F1P= 0
##$F2P= 0
##$FCOR= 0.5
##$FTSIZE= 0
##$FT_mod= 4
##$GAMMA= 1
##$GB= 0.15
##$INTBC= 1
##$INTSCL= 1
##$ISEN= 128
##$LB= 0.25
##$LEV0= 0
##$LPBIN= 0
##$MAXI= 10000
##$MC2= 0
##$MEAN= 0
##$ME_mod= 0
##$MI= 1.114404
##$NCOEF= 0
##$NC_proc= 0
##$NLEV= 6
##$NOISF1= 3.799351
##$NOISF2= 2.8
##$NSP= 1
##$NTH_PI= 0
##$NZP= 0
##$OFFSET= 14.38212
##$PC= 1
##$PHC0= -467.8657
##$PHC1= 10.39221
##$PH_mod= 1
##$PKNL= yes
##$PPARMOD= 0
##$PSCAL= 0
##$PSIGN= 0
##$REVERSE= no
##$SF= 200.129724274929
##$SI= 16384
##$SIGF1= 3
##$SIGF2= 2
##$SINO= 400
##$SIOLD= 16384
##$SREGLST= <1H.CDCl3>
##$SSB= 0
##$STSI= 0
##$STSR= 0
##$SW_p= 3205.1282051282
##$SYMM= 0
##$S_DEV= 0
##$TDeff= 0
##$TDoff= 0
##$TI= <>
##$TILT= no
##$TM1= 0
##$TM2= 0
##$TOPLEV= 0
##$USERP1= <user>
##$USERP2= <user>
##$USERP3= <user>
##$USERP4= <user>
##$USERP5= <user>
##$WDW= 1
##$XDIM= 8192
##$YMAX_p= 0
##$YMIN_p= 0
$$ End of Bruker specific parameters
$$ ---------------------------------
##NTUPLES= NMR FID
##VAR_NAME=  TIME,          FID/REAL,        FID/IMAG
##SYMBOL=    X,             R,               I
##VAR_TYPE=  INDEPENDENT,   DEPENDENT,       DEPENDENT
##VAR_FORM=  AFFN,          ASDF,            ASDF
##VAR_DIM=   8192,          8192,            8192
##UNITS=     SECONDS,       ARBITRARY UNITS, ARBITRARY UNITS
##FACTOR=    0.0002768,     1,               1
##FIRST=     0,             0,               0
##LAST=      2.2672688,     0,               0
##MIN=       0,             -854559,         0
##MAX=       2.2672688,     665231,          0
$$ Real data points
##PAGE= N=1
##DATA TABLE= (X++(R..R)), XYDATA
0 0 0 0 0 0 0 0 0 0 0 0 0 -8 5 -8 8 -8 13 -16 16 -21 24 -32 36 -40 48 -55 66 -73 84 -95 110 -125 140 -156
34 -156 177 -199 221 -245 273 -304 340 -375 414 -457 504 -556 612 -673 741 -816 900 -993
52 -993 1093 -1210 1343 -1492 1667 -1869 2113 -2405 2770 -3231 3840 -4680 5906 -7831 11225
67 11225 -18365 39205 -220213 -854559 55769 586760 -64913 -139651 452717 303118 -118781
78 -118781 54418 186992 -23370 -16829 -13958 -206329 -88915 103202 -138113 -196365 121920
89 121920 3042 -340032 -97326 180723 -43278 -51085 233403 69835 -130231 159810
99 159810 168734 -207215 -28884 321878 -10597 -279265 77581 163405 -159001 -64142 155606
110 155606 -79612 -165750 112390 81378 -83394 76260 65027 -179360 -22337 183590
120 183590 -98893 -195756 147649 95851 -236496 -47562 198612 -61275 -143392 139976
130 139976 89077 -98956 73875 138414 -75020 -15065 145310 -31668 -97784 118651 23992
141 23992 -202726 13325 163424 -144003 -207870 90653 62890 -142911 -22417 97649
151 97649 -7808 21711 100773 -32194 -28614 156853 41286 -140724 57374 153054 -111424
162 -111424 -118778 126537 18164 -192325 -32006 91168 -71645 -73976 69353 -451 -47789
173 -47789 77057 31034 -74156 65130 118537 -70076 -48504 142244 43267 -124587 1964
184 1964 81264 -65870 -75010 28597 -21403 -43735 34113 -26584 -81477 60026 82133 -87117
196 -87117 -39428 137960 32530 -111739 35957 122091 -30277 -57616 47062 10259 -43091
207 -43091 14905 5955 -47472 7457 21428 -69602 -29642 77061 -8236 -91923 28647 74210
219 74210 -46691 -44447 61903 37606 -29698 -1281 14541 -2821 29940 22372 -42537 -588
231 -588 63889 -24336 -76568 37313 66463 -47436 -54505 35012 17987 -41574 -11891 12622
243 12622 -12873 -2638 2685 -26223 6743 48871 -6624 -40214 25910 38818 -28821 -14057
255 -14057 55324 22110 -41009 -5935 30182 -2852 -17124 -2916 -5298 -866 4007 -20619 -22200
268 -22200 21306 20319 -36315 -29973 30750 20488 -23934 -869 34709 13337 -14813 -6856 12020
281 12020 16500 5793 -11103 -12329 8111 6532 -20609 -11060 17746 -2321 -29359 -5469 17245
294 17245 -3344 -15441 10693 17959 -9993 -11478 13204 16796 8666 5560 -3933 -6394 4333
307 4333 2028 -9342 2893 18433 -9433 -38484 -5210 27632 -3470 -28969 -4261 13260
319 13260 1525 -1682 8707 8088 3904 4761 -3783 -5016 13896 12419 -5109 7864 16723 -15526
333 -15526 -30352 -661 11750 -11484 -14842 -375 -10825 -14669 9503 12054 -2849 1106 -1000
346 -1000 -8000 20465 40961 5368 -18607 15259 23399 -18798 -16038 20119 -242 -30673 -10379
359 -10379 -358 -18049 -9942 4727 -9200 -9319 12963 1845 -14836 18158 34594 -1608 -4897
372 -4897 23737 8251 -10718 13645 16606 -18781 -22849 -1371 -7582 -12748 2453 -10713 -23307
385 -23307 9719 14576 -23634 -5783 40301 13212 -25376 8913 34987 -1365 -11755 14858
397 14858 3661 -13080 1614 -7789 -21486 13018 18482 -30936 -24672 29446 11850 -33129 -435
410 -435 31707 -6783 -18654 16094 10119 -6981 9438 1870 -17087 6659 12109 -26779 -11342
423 -11342 39141 5757 -42294 8443 43804 -12322 -24825 25737 15659 -21903 -5958 5071
435 5071 -11412 2558 8376 -31548 -23684 30207 4291 -43053 8381 45653 -11007 -24766 28967
448 28967 26589 -6696 11277 17251 -12862 994 20677 -17058 -19855 22772 -8223 -53531 -4099
461 -4099 25101 -32478 -33929 26534 10421 -30881 9731 36091 -425 7159 33809 -1466 -8544
474 -8544 34546 12115 -28116 12875 27310 -37454 -35326 28021 1776 -47653 -5405 16335
486 16335 -29991 -16794 23796 -5632 -15568 27915 9984 -28290 18430 45537 -13385 -16120
498 -16120 39473 9436 -33140 16438 29016 -30564 -17254 29709 -7831 -36701 8533 12288
510 12288 -22036 806 10167 -35771 -12855 42747 -3608 -43359 20830 35082 -27784 -8439
522 -8439 44881 4530 -25053 23979 21091 -24174 5982 28400 -20412 -15107 27507 -13174 -40889
535 -40889 19733 21803 -43708 -19539 35214 -10371 -39452 18931 23331 -21638 2207 21831
547 21831 -15484 874 41406 -1606 -27866 28256 25280 -36274 -3916 45625 -12901 -44550
559 -44550 18338 20541 -31632 -10920 13782 -16836 -7593 19526 -20576 -30897 33927 26757 -39528
572 -39528 -6746 44619 -5854 -25053 33443 22177 -27488 3487 26996 -15534 -11339 24872
584 24872 -8595 -29875 16337 6556 -41106 1355 37710 -23977 -37869 28895 22026 -27746
596 -27746 -536 26983 -5610 -2860 23610 -9032 -17217 32417 14574 -38367 -2040 30895
608 30895 -20529 -27541 27062 9046 -37553 -2792 24496 -12747 -9281 21596 -4720 -15351
620 -15351 23507 9288 -26594 10895 31251 -20336 -22951 27652 7042 -31933 7073 24976
632 24976 -20779 -16853 19737 -956 -14226 15768 4557 -22126 8700 20962 -21201 -12120
644 -12120 32683 2607 -34243 6584 24083 -14981 -8636 18599 -5099 -14274 15846 6077 -18172
657 -18172 8805 19180 -18849 -11692 23482 -2466 -24282 13423 15630 -25514 -12046 20763
669 20763 -530 -15774 9260 6646 -12139 6491 12531 -11697 2497 24526 -7114 -20569
681 -20569 16661 15295 -20091 -6073 17902 -7536 -19732 7115 4763 -13276 2426 6331 -14603
694 -14603 -1502 18150 -3694 -10802 16340 9401 -16565 2422 20781 -5531 -12512 13098 4651
707 4651 -16206 -926 6794 -7734 -1677 6156 -10323 -9073 13144 3118 -15756 5330 17732
720 17732 -10029 -12465 15166 10798 -7923 -1039 3835 -3717 1741 5496 -7279 -4685 9700 -3154
734 -3154 -16252 4778 12047 -10591 -7857 12432 2454 -11185 2164 10102 32 -932 2802 -2838
748 -2838 797 8886 -3190 -8515 8229 4892 -15357 -6413 13348 2810 -13076 -4908 4488 255
762 255 -1021 -89 -1767 5314 7271 -6460 -5708 12617 7730 -9177 -2692 10136 930 -9542 -1280
777 -1280 4775 -69 -2922 -5209 -5391 3445 4971 -5640 -3566 5979 -556 -7436 3622 11029 -814
792 -814 -7088 2128 5207 -55 -946 -767 490 4408 -730 -8429 -707 7425 -383 -7512 762 5326
808 5326 -2877 -4795 2453 3581 589 -2046 -5187 -142 7267 1970 -5633 -526 4174 -1749 -3163
823 -3163 4395 3836 -3516 -1288 1810 -1947 -1085 1821 -737 -705 562 -2238 -2436 2939 2743 -3540 -612
840 -612 5063 -1013 -5116 3748 6026 -1370 -2435 -313 -613 909 2296 -1138 -2249 906 -1179 -5427
856 -5427 876 5497 -3330 -4719 3374 1775 -3842 1133 5334 487 -1637 1276 1042 643 3270 -98
872 -98 -2864 4229 2528 -8364 -3284 8756 2041 -9797 -4700 3846 -125 -4227 -1024 982 1116
887 1116 766 -4024 -1834 9162 5718 -6613 -1385 9932 2935 -6070 1783 7863 -810 -5413 -501
902 -501 25 -465 -704 -5022 -3935 2273 -2301 -9578 226 9032 -1763 -9001 3416 9221 -1424
917 -1424 -2283 6018 5120 738 -312 -1550 2617 7502 -273 -9665 -897 7959 -3538 -10785 2193
932 2193 5558 -6170 -7125 949 1348 -277 66 -1701 -135 4726 1088 -4638 3843 9590 -2293
947 -2293 -5876 6196 5628 -4644 -593 5916 -251 -4979 -1055 409 -678 838 -2892 -7320 -167
962 -167 3734 -6182 -5059 6694 3011 -7351 -773 8105 2448 -1744 3844 3399 -277 3336 1777
977 1777 -3160 2585 4154 -5750 -5955 3107 -590 -7589 -558 3857 -5605 -6419 4223 3152 -2161
992 -2161 2520 3550 -1172 2032 4176 -684 1046 5693 -1657 -7110 3203 5872 -7239 -6619 5111
1007 5111 937 -7053 -1106 2890 31 709 1869 -2515 -583 5441 444 -3751 4923 4560 -7248
1022 -7248 -3444 7170 315 -6469 1225 3449 -4281 -2866 3506 645 -1064 2325 -1824 -2943 5974
1037 5974 3101 -7508 -573 8339 -1631 -8359 2358 5967 -3221 -2735 2991 -1350 -2387 3061 -206
1052 -206 -1383 4903 613 -7270 923 8634 -2452 -7436 3680 4065 -6360 -2193 5425 -731 -3484
1067 -3484 1492 -670 -1741 3312 1038 -3894 2760 5760 -5228 -5150 8197 4009 -8354 -1334 6411
1082 6411 -2505 -5676 2116 1748 -812 1129 -2046 -5405 3666 7256 -5252 -5467 7664 2989 -7238
1097 -7238 1369 7062 -2681 -4443 3444 1076 -3558 1369 1402 -3138 1738 2667 -6571 -2619 8583
1112 8583 312 -8580 1803 6905 -4244 -4108 5954 2461 -4016 782 1236 -3088 2887 4186 -5224
1127 -5224 -2120 6316 -1387 -7333 3678 6035 -5738 -4243 5613 271 -4659 3327 2437 -4342 1053
1142 1053 3764 -4078 -1880 6773 237 -5659 2573 3184 -5377 -472 6586 -2801 -6431 3861 2283
1157 2283 -5310 735 4410 -3020 -2415 4005 -784 -3879 5367 3928 -6129 -159 6251 -2724 -3721
1172 -3721 5651 1501 -6864 511 4784 -4147 -3793 4364 79 -5020 1292 834 -4321 2187 4979
1187 4979 -4509 -3638 7136 2199 -5959 2792 6885 -3315 -3915 4712 1005 -3254 2389 501 -5267
1202 -5267 904 3271 -5488 -2914 6273 -614 -7962 1710 6001 -3694 -2048 5799 488 -2807 3616
1217 3616 2252 -3014 2575 4382 -4218 -2950 4958 -1243 -6330 2967 4118 -6686 -3776 5366 297
1232 297 -3334 2208 1181 -3573 1907 3795 -3031 -1273 5967 -639 -5890 3415 4222 -4220 -1521
1247 -1521 4416 -1405 -3873 2646 1144 -4035 1737 3800 -4314 -2842 4689 213 -3824 2195 1940
1262 1940 -4477 -800 4278 -1449 -2727 3795 897 -4699 1879 5018 -2986 -2207 4011 -400 -4048
1277 -4048 1640 1906 -3059 -210 2896 -2614 -3016 3563 671 -3798 2584 4011 -3830 -2147 4951
1292 4951 2020 -2917 192 1411 -1952 -204 1815 -2664 -1640 2747 -2113 -5043 2242 3772 -3808
1307 -3808 -2746 4149 1881 -2536 1028 3023 -164 847 1469 -2185 -656 3289 -950 -3562 1864
1322 1864 1579 -4642 -2270 3761 612 -3889 -135 1600 -1451 46 1773 -724 -94 1903 -527
1337 -527 -1517 2885 2322 -2987 -886 3706 -98 -3381 1325 2441 -1156 -849 391 -954 -699 1182
1353 1182 -770 -1960 333 127 -2819 -774 2405 -507 -2347 1218 1405 -906 696 3027 776
1368 776 -499 1144 1470 255 789 423 -1334 -106 -28 -2501 -2092 1019 -100 -3246 -1854 936 -312
1385 -312 -1729 847 1774 290 130 1073 1541 1922 1249 114 72 820 154 -1373 -17 1321 -1173 -2822
1403 -2822 -203 804 -1442 -1708 262 793 -744 -1454 491 1705 933 -239 -748 1153 1842 -577
1419 -577 -1244 1432 1983 -967 -2119 753 1984 -802 -1629 423 695 -844 -1068 147 1192 171
1435 171 -1472 -990 672 1121 -851 -1155 1561 1269 -1815 -963 2384 1619 -1479 -1063 1411 802 -1131
1452 -1131 -775 436 861 -116 -1890 -1324 1896 1217 -2125 -664 2419 1028 -2519 -474 2848 778
1468 778 -2055 -613 606 296 160 -522 -386 857 147 -1915 -342 2161 -29 -2733 5 2824
1484 2824 -397 -1757 1129 1555 -451 -810 -126 8 617 260 -980 -280 1603 -460 -2599 999 2959
1501 2959 -1158 -2384 1104 1470 -900 -56 1156 2 -525 390 -688 -316 1309 -35 -1930 568
1517 568 1627 -1619 -1319 2251 997 -1903 -243 1432 -895 -940 1580 540 -1233 123 -9 -565
1533 -565 1138 1327 -1928 -1104 2039 402 -2055 397 2051 -1449 -1799 1470 950 -1413 441 1006
1549 1006 -638 -263 546 -828 -396 1849 -270 -2382 936 2026 -1698 -1262 2631 613 -2378 -392
1565 -392 1800 108 -793 410 -544 -529 1335 -541 -1697 1493 1568 -2635 -1741 2732 863 -2808 -22
1582 -22 2398 -245 -1471 883 719 205 1255 -34 -1306 1064 1365 -1941 -1062 2536 172 -3158
1598 -3158 106 2598 -1189 -2182 783 422 -1026 138 315 -651 1142 1248 -1774 -778 3205 654
1614 654 -2696 464 2629 -1464 -2070 1529 718 -1438 -27 222 -1687 5 1262 -1327 -1015 2394
1630 2394 -44 -2815 754 2659 -1126 -1293 1595 611 -1478 768 1535 -1085 -359 1659 -892 -1467
1646 -1467 1470 584 -2013 267 1457 -1878 -1392 1863 156 -2299 491 1343 -1619 -253 2095 -247
1662 -247 -1211 1648 918 -1716 455 2003 -890 -1364 1485 -628 -2211 1014 1251 -2560 -1122 2055
1678 2055 -388 -1971 1333 1389 -1387 186 1639 -678 -333 2328 65 -1985 1227 1566 -2472 -1116
1694 -1116 2188 -598 -2546 563 801 -1696 -460 1694 -759 -652 1694 -39 -1328 1756 1659 -2100
1710 -2100 -582 2595 -197 -2233 1079 1531 -1887 -634 1446 -788 -755 1249 -162 -1665 1458 1268
1726 1268 -1852 -446 2840 -488 -2610 1144 1306 -1565 8 1704 -1084 -937 1383 281 -1521
1741 -1521 1057 1600 -2032 -720 1952 -319 -1716 1105 970 -1909 -479 1434 -862 -1090 1293 198
1757 198 -1661 607 1447 -1112 31 2188 -113 -1392 1292 1224 -1464 -122 1384 -1244 -1360 1023
1773 1023 127 -1759 571 1054 -1620 -408 1641 63 -1300 752 945 -1269 195 1523 -673 -623
1789 -623 1943 385 -1644 531 1320 -1037 -506 1244 -371 -1712 400 799 -953 -174 898 -1076
1805 -1076 -1094 1310 114 -1336 724 1315 -907 -578 1473 147 -904 548 1191 -920 61 1132
1821 1132 -362 -873 905 -183 -1198 432 837 -1130 -944 957 -164 -1347 398 1004 -381 -11
1837 -11 630 -28 -339 1221 287 -813 199 713 -804 -715 684 47 -1143 -128 368 -737 -171 506
1855 506 57 -489 415 406 -560 272 663 -81 -292 707 82 -805 221 602 -105 -530 285 -124 -572 157
1875 157 463 -485 -10 401 -304 -296 631 281 -591 -139 585 -78 -189 433 355 -215 -178 314 -412 -104 475
1896 475 20 -728 -197 383 -76 -241 389 227 -452 190 77 -508 60 381 -6 -549 230 288 -25 -245
1916 -245 442 -70 -360 -72 215 -171 -1 313 -432 -199 418 -57 -473 177 419 -558 -342 739 290 -558
1936 -558 209 524 -461 -382 -26 7 -207 403 -227 -1097 163 1030 -377 -543 825 402 -764 90 852
1955 852 92 -351 100 -150 -83 384 -75 -510 267 873 -910 -720 820 379 -794 108 834 -628 -652
1974 -652 494 110 -149 359 -162 -733 266 736 -451 -730 722 440 -1318 26 914 -372 -572 523
1992 523 -279 -606 287 295 -791 159 778 -727 -786 918 512 -1025 116 680 -672 -224 756 321 -516
2011 -516 473 356 -618 152 819 -302 -632 797 265 -1017 434 632 -690 -487 579 -36 -958 596
2029 596 668 -733 -357 763 -289 -665 852 592 -644 121 629 -473 -155 736 -73 -851 324 485
2047 485 -779 -221 785 -236 -768 378 446 -480 1 581 -355 -158 842 -55 -918 564 819 -927
2065 -927 -408 803 -42 -594 227 346 -659 -320 265 -421 -107 1009 -527 -990 724 839 -585 -404
2083 -404 1106 23 -862 274 442 -350 -232 535 -240 -248 560 -437 -681 555 505 -759 -282 857 22
2102 22 -721 378 550 -313 -77 599 -194 -188 590 159 -535 512 546 -717 -357 458 -116 -751 286 540
2122 540 -412 -193 332 -386 -361 527 73 -367 125 454 -559 -242 514 32 -520 4 454 -443 -379 458
2142 458 -59 -416 253 52 -551 59 461 -152 -174 549 52 -362 408 252 -184 -44 362 -189 -254 414 206
2163 206 -561 134 628 -301 -192 230 -64 -156 279 276 -167 200 558 -23 -71 414 386 -584 -128 381 -292 -462
2185 -462 181 240 -286 6 435 -46 -390 451 40 -63 323 180 -525 79 201 -83 -583 113 390 -413
2205 -413 -37 20 182 -150 524 28 -179 360 218 -379 -114 658 -190 -336 -123 362 -302 -122 487 -19
2225 -19 -294 123 82 -94 -7 193 -168 -116 305 9 -361 163 211 -489 -159 135 -96 -137 150 243 -348 -5
2247 -5 167 -225 -19 495 -105 -456 288 310 -283 -343 348 199 -413 124 195 -180 78 307 -9 -51 424 -95
2269 -95 -425 -23 174 -207 -113 70 -99 -250 175 36 -591 -6 266 -74 121 362 8 -123 156 341 135
2290 135 -252 -28 3 -139 201 -74 -320 57 209 -36 -297 365 303 -147 -98 297 172 -56 -76 13 15 57 65
2313 65 -446 114 306 41 -329 116 290 -295 -248 169 77 -28 38 140 23 121 33 -17 168 271 -255 -185 390
2336 390 353 -231 -144 251 82 -159 -124 -48 265 297 -16 -142 132 437 47 -159 277 -5 -318 -135 207 21
2358 21 -259 -33 230 52 -191 -128 40 90 171 -298 -127 201 90 -215 -257 191 178 -268 -51 381 -61 -102
2380 -102 -39 -100 -58 143 164 -72 5 -79 -238 194 135 148 -204 20 175 -108 -172 325 -6 -125 -13 -43 135
2403 135 -258 15 57 -345 -146 -66 -117 114 210 99 53 147 19 -175 43 236 11 -377 28 133 -82 -73 88
2426 88 34 -120 -179 -82 -35 223 124 -331 144 271 -85 -135 145 258 -217 -200 158 36 -107 207 -36 -134 -117
2449 -117 30 -219 174 433 -237 -247 253 265 -255 -171 253 91 -258 -204 -112 -166 252 -142 -213 20 211 37
2471 37 -244 447 398 -469 -381 174 150 -68 88 14 -260 94 -118 -60 -269 306 -131 -396 262 207 -156 -177 312
2494 312 -225 -285 85 52 -319 33 -110 -280 90 146 -147 -356 294 271 -207 36 416 -59 -390 47 267
2515 267 -422 -288 266 44 -84 249 -243 -20 234 138 -115 274 338 -305 -387 162 -57 -321 -73 77 -139
2536 -139 -262 166 193 -96 -248 -19 -426 -121 120 -263 9 435 62 -385 262 523 -344 -41 442 284
2556 284 -181 -12 61 54 19 103 -459 -40 331 43 -400 269 201 -511 -198 500 202 -212 -74 316 -211 -11
2578 -11 138 -249 -235 427 -119 -388 450 162 -469 -86 365 -190 -163 -28 103 -277 58 252 -153 92 142
2599 142 76 -18 316 251 -270 78 291 -131 -378 291 -58 -144 -5 228 43 -5 -123 -104 97 218 232 -324
2621 -324 60 438 -273 -385 422 317 -110 -170 285 -10 59 74 -95 -179 130 49 -233 62 -9 -120 -100 336
2643 336 -45 -307 0 151 -61 -45 37 -93 -116 302 43 -148 49 -70 -112 -24 233 -123 -275 149 90 -28
2665 -28 -259 106 37 -84 -51 11 -428 -120 14 -193 -171 330 -135 -255 418 183 -14 -14 424 -208 -333 186
2687 186 44 -25 -5 -15 125 -51 -83 -291 -6 269 118 -461 -78 174 -141 -216 188 122 -43 72 87 -23
2709 -23 -89 -81 -28 78 142 -175 -293 167 141 -126 -228 275 169 -330 -168 109 -40 144 -91 144 180 217 44
2732 44 -116 263 163 -284 -211 166 254 44 -116 71 -59 15 -173 110 279 218 -65 -146 77 18 -9 -48 309
2755 309 55 -299 -32 95 -40 -442 150 8 -114 64 -72 -114 39 168 -75 -230 162 51 28 184 127
2776 127 -164 -75 114 31 154 -152 52 -124 26 120 50 -35 139 -164 80 9 -140 -237 10 229 -412 -73
2798 -73 152 128 16 -110 -28 -66 66 -170 42 203 234 14 -198 45 115 7 -153 218 327 -118 -35 197
2820 197 5 66 -20 60 64 69 -63 -60 106 -85 -152 -100 11 126 -234 19 173 113 -227 54 -31 161 203 69 -106
2845 -106 -52 104 -264 -347 -47 57 -226 -33 362 -40 -49 -121 10 152 99 24 19 89 -60 -118 63 30 -105 -75
2869 -75 -148 253 90 -63 72 104 -81 9 -33 25 236 -13 -106 -52 159 -47 -300 11 116 -14 -86 97 55
2892 55 -216 266 -108 129 111 33 -16 -31 52 -20 114 33 290 117 -42 39 -72 -119 -29 -37 -169 77 -11 -83 -181
2917 -181 -20 27 -73 47 -56 -15 -28 -60 -32 -186 -13 -54 -209 -79 125 -126 -138 -70 89 42 31 21 34 85
2941 85 -48 127 -183 117 -43 -49 -42 142 84 -27 -57 263 -3 51 -186 -20 6 117 41 -73 -40 211 -141 85
2965 85 201 134 -87 49 185 61 -165 -73 113 66 151 -193 -60 37 -127 -173 -16 307 -139 -46 33 -98 49
2988 49 -112 162 -10 115 -43 17 267 220 -263 -100 231 -6 41 -18 -42 -230 78 -232 -241 -229 -145 141 156 -131
3012 -131 303 32 209 174 102 -69 8 29 61 80 102 -5 31 -51 97 -75 -137 51 85 58 147 334 -176 -36
3036 -36 19 -103 -140 149 -55 -39 33 -69 -31 35 -298 -25 123 136 138 30 -70 -184 -11 -96 -125 154 -95 75
3060 75 92 139 158 -92 53 195 125 -125 -77 -71 -66 95 6 26 126 144 152 68 -117 -78 -3 -208 -61 -83 -154 -125 -75
3087 -75 316 -57 348 73 -173 130 26 79 -57 266 72 -94 95 35 -284 15 -39 -140 1 134 262
3108 262 -93 -86 39 82 -146 133 65 -87 -103 63 -170 54 10 -154 48 273 -48 -45 23 108 73 15 101 113 44
3133 44 22 124 4 6 9 -345 63 170 -90 -163 -101 44 -39 23 -70 44 104 64 -130 -374 -106 -88 -86 21 53 -80
3159 -80 -44 3 235 -172 -131 -73 -52 -4 134 -16 -110 61 85 165 -70 8 191 -137 53 -116 -145 -9 279 -107
3183 -107 -20 67 41 -6 40 200 58 -274 115 160 4 95 112 63 83 -38 159 43 95 -24 -250 -70 21 -110
3207 -110 -126 154 47 -3 -54 245 18 54 106 145 -72 444 47 4 58 224 1 -245 3 -87 -16 -160 -7
3230 -7 -210 182 143 187 54 137 162 -239 -31 -14 -7 -180 104 110 -49 -60 -138 -123 -30 24 -63 -38 68 190 -237 -65
3256 -65 116 6 -91 -39 -87 -135 -16 -11 -32 -95 154 -30 -109 65 7 -88 -1 223 -61 -194 20 -94 -57 259 214
3281 214 -136 -95 262 33 11 -109 65 -149 33 57 158 -207 -1 167 112 108 37 -213 -169 234 -22 -97 32
3304 32 -68 57 -11 134 124 -156 -59 -5 79 -105 114 69 16 192 -49 55 -11 112 116 84 115 216 45 -41 74
3329 74 -50 56 193 -209 -99 151 132 -206 -151 136 -20 -109 265 -62 62 53 41 -223 -156 233 16 -227 52
3352 52 -94 -101 51 5 -20 -199 -22 -37 -57 106 41 -39 247 -26 -24 -108 99 11 59 -36 279 -246 -121 -1 223
3377 223 -112 -6 161 -43 -110 -45 -124 -272 101 -333 -50 -113 73 -20 -93 112 150 -137 39 181 -8 95
3399 95 -69 51 -49 -42 8 13 49 133 -166 -153 -112 41 -138 266 184 -148 -86 168 -5 -339 -138 103 -128 -60
3423 -60 127 -61 15 69 -106 86 114 181 -54 -5 8 -11 132 -55 117 136 9 -185 -111 -21 -56 -19 81 85 224
3448 224 -104 10 -117 -160 -252 191 71 9 17 102 -139 -99 -95 -210 77 -105 -55 -279 -3 15 98 -198 121 70
3472 70 143 -84 3 -123 122 -32 -142 15 -119 51 -151 13 -36 -118 3 130 16 -199 58 143 -9 -127
3494 -127 37 30 0 -71 -29 30 -57 155 105 -38 -31 67 95 -20 82 195 -291 -156 171 30 -56 150 -127 -32 74
3519 74 -127 -201 -68 212 219 -257 -289 99 -56 91 10 -79 117 -105 13 23 282 -42 346 83 -71 -115 77
3542 77 38 221 79 -182 293 54 176 36 42 -50 -56 -69 115 -129 69 84 -46 -312 -31 113 -88 106 -109
3565 -109 86 -8 -106 -112 -40 -44 -40 -146 88 9 73 -281 -56 -9 -35 -126 222 2 42 6 -53 -171 116 135 -138 111
3591 111 79 -119 -196 146 114 -87 109 159 209 7 157 36 4 -4 241 -132 194 102 -183 -171 267 223 -117 -94
3615 -94 189 46 -155 -99 128 -20 29 126 -156 -64 160 -59 -55 -52 -3 -107 134 28 74 22 -42 133 -57 191
3639 191 97 62 -200 -97 -105 -243 206 35 -98 -109 88 -87 -154 -57 7 -110 -104 -105 -60 -5 66 -173 29 150 15
3664 15 -309 -119 177 -118 -28 147 -254 -137 268 22 -55 -166 130 37 -312 16 223 -122 96 -1 -209 135
3686 135 228 -204 163 50 40 -210 -119 318 36 -49 -32 82 -288 108 220 -128 -43 136 31 -201 210 83
3708 83 -176 24 246 89 -32 -81 -9 -140 -21 15 -37 -54 246 -176 -136 183 -177 123 -133 323 67 -143
3730 -143 43 26 -234 -89 85 -251 -277 -40 12 -240 306 86 -277 200 331 -81 -251 -69 -6 147 -219
3751 -219 166 -57 13 37 164 -226 92 33 -149 45 77 -26 -244 59 -176 -48 95 87 125 8 236 -30
3773 -30 -159 -13 145 1 42 201 -2 58 -36 57 -98 -36 -168 -278 -129 147 -5 51 60 60 58 -25 -68 -11 -83 381
3799 381 -34 44 -57 -139 -54 -152 -42 -43 -36 -30 -7 174 -7 -56 43 -311 88 -25 -183 137 107 -190 1 274 -82
3824 -82 -193 86 144 -53 -154 31 -8 -92 255 51 -43 28 61 -60 -8 22 105 -28 -29 -15 87 98 33 153 -116
3849 -116 -149 8 104 97 -4 -378 262 345 33 -116 157 -80 114 11 -102 194 -152 103 -246 188 -106 55
3871 55 -170 -130 74 128 -53 -63 214 14 5 183 -73 -171 -170 243 49 -163 118 -201 179 66 -3 -61 46 -213
3895 -213 56 -106 319 48 -148 170 21 143 40 -88 170 84 -161 -147 75 52 210 -240 8 -149 -59
3916 -59 -102 -108 -7 22 -63 53 98 166 -47 39 81 -232 -10 103 160 -79 -68 -115 37 10 -107 -10 73 -44 98
3941 98 260 73 -156 -187 -53 -28 72 -222 42 72 204 88 54 -146 -150 -198 -96 105 125 -65 -93 -52 -6 -269
3965 -269 -122 92 199 150 -49 -131 190 238 -63 115 -120 19 -76 -101 -67 -16 -59 -47 -58 76 -226 -11 30 9
3989 9 -79 -143 48 47 15 -58 -134 159 93 -72 6 55 141 -12 -55 -132 140 -32 -95 -211 72 99 165 -183 44 169
4015 169 -61 -121 -133 -4 -198 -125 87 121 55 63 -67 -201 -19 11 -29 187 65 -254 -11 -48 -25 -165 -127 210
4039 210 -22 56 1 -30 -125 -223 202 59 18 -31 107 -100 -175 85 -189 108 21 66 40 88 21 -131 108 272
4063 272 45 -147 27 121 -62 -104 -34 24 81 -95 31 108 190 -106 -145 93 301 63 -177 21 -46 72 -200
4086 -200 71 17 -1 39 -3 159 122 -90 3 224 95 167 -42 -5 131 -84 -384 -98 -36 -20 72 159 7 204
4110 204 140 -235 1 16 -290 -169 171 -133 -240 -114 70 -87 -156 220 207 -117 37 101 -81 173 164 -135
4132 -135 -56 146 63 -131 -298 250 135 -65 -44 224 -35 -203 -122 -66 357 195 -45 -130 111 -64 -280 120
4154 120 308 -269 -245 -215 -47 -143 101 25 67 106 116 15 -28 135 -32 -50 -128 -7 -241 30 264 24 38 -129
4178 -129 118 58 -28 205 59 -82 122 75 167 243 42 -346 90 -128 88 -267 -26 37 -60 111 137 60 84
4201 84 156 -39 -231 -45 22 -52 -93 114 -112 -173 209 58 -215 -147 183 124 -242 39 125 -248 -35 198 -138
4224 -138 -42 150 -146 -84 186 -13 -231 141 210 -149 -269 116 54 -100 -29 84 9 -91 -12 -2 -225 -84 -115
4247 -115 -321 65 194 51 -179 141 122 -102 -57 58 100 -4 117 88 51 75 -58 -69 165 171 18 -100 290
4270 290 181 -206 -54 175 -258 -260 -43 -33 -58 8 103 -85 -29 150 -256 -150 150 -29 -251 -61 105 -49
4292 -49 34 45 -308 -109 212 -18 -82 -47 171 -56 -183 -105 22 -90 70 178 -89 43 131 -35 -107 -167 29
4315 29 -7 -114 -228 70 295 214 -173 33 146 197 21 -58 277 -128 -159 -33 168 -271 87 202 -92 2
4337 2 -173 -61 -71 50 27 -75 65 98 23 -203 -43 215 183 3 -73 -14 -9 3 145 -168 -154 37 -221 -5
4361 -5 140 123 -204 230 66 -81 -54 -125 114 -48 -19 -61 70 -129 -298 -157 237 67 -137 -98 -80 -87 -72 37
4385 37 190 25 -363 -73 -38 97 23 -6 23 184 132 -69 88 175 -61 -18 89 -47 15 -111 50 -10 -9 234
4409 234 -112 30 140 -103 -98 -204 -25 42 -214 174 -17 -263 28 -5 -117 -170 112 55 -172 163 53 160
4431 160 -98 -52 -69 260 89 -257 -65 -93 272 102 -12 57 114 -134 37 8 -48 -106 14 -98 -13 106 -154
4454 -154 -147 223 60 -43 30 189 -88 -206 -182 229 -1 5 12 10 201 9 -168 -4 86 109 -231 -50 -125 -220 -13
4479 -13 -202 -12 106 -36 -250 80 -110 18 67 -2 55 160 72 -19 88 -115 -186 -238 -182 -163 125 -189 -33
4502 -33 7 120 -87 36 72 -193 -31 41 -38 -157 10 -5 -180 -83 165 -80 -125 126 -281 -34 -15 -33 -109 -35
4526 -35 81 134 80 59 80 -52 -143 -90 -97 -79 58 -104 -85 48 -8 -3 7 162 146 -70 45 111 35 -115 -19 8 104
4553 104 52 49 -62 -65 20 116 -71 48 94 -81 78 15 -118 -13 236 87 -13 118 -26 107 114 -11 -70 51
4577 51 69 -72 212 143 -90 -44 5 -55 -11 -197 93 90 28 91 70 -121 -94 -27 -39 18 54 -66 -78 43 104 -184
4603 -184 -144 119 1 126 -115 23 67 41 -36 55 219 218 -199 19 94 15 -234 -19 212 55 -81 -33 92
4626 92 34 89 -151 130 -119 42 -201 -19 172 -25 -212 -195 -123 171 -168 1 259 -94 -12 -45 142 339
4648 339 -290 -81 77 -4 49 122 -133 68 38 -100 -7 60 -70 -46 -16 196 34 52 33 -46 176 77 17 -53 -90
4673 -90 91 -32 -102 -13 -155 12 -3 -25 112 22 -49 87 -109 -44 21 37 -221 96 -94 -104 -99 24 183 20
4697 20 77 -196 111 -169 -142 8 6 -178 185 156 237 362 -56 -27 66 58 10 -7 95 123 -132 -36 -26 87 -97
4722 -97 -121 -193 54 -9 76 14 182 0 61 2 10 135 0 -18 -139 -103 -58 -35 7 36 -72 -42 -62 111 -156 -59
4748 -59 -101 -20 65 66 -277 98 135 -264 -87 -143 -164 42 80 57 -123 -160 -112 139 285 -18 135 -219 87 -41
4772 -41 45 168 -91 -162 86 11 -148 60 -15 -84 92 71 101 8 69 -223 -16 307 -239 278 -50 22 -106 -92
4796 -92 -234 -9 -50 167 185 -75 18 89 -229 -76 -6 34 -18 -161 -18 69 -115 -137 172 139 2 -88 163 -60
4820 -60 -204 -216 -202 134 -211 93 12 143 -190 60 76 79 11 -120 40 -1 91 -61 -75 -66 307 171 -274 -50
4844 -50 -122 -76 -98 79 15 199 -221 -101 255 -96 16 -12 -19 -158 -107 -79 -112 -36 83 -71 140 6 -73 -264
4868 -264 -8 -1 -41 103 19 28 -114 49 -182 -70 -60 -104 -211 -1 159 -44 -375 -81 117 -110 -199 37 65
4891 65 -148 -63 -95 -241 -180 14 69 -186 248 11 -99 169 -195 -7 -140 111 236 -92 -133 35 208 -67
4913 -67 24 29 62 186 -172 120 -169 -222 -139 56 16 -166 -196 90 -53 -168 -30 -68 57 -86 -165 143 54 126
4937 126 72 -100 12 33 -126 -72 -19 28 -225 -12 79 -71 -186 -29 7 172 -22 -43 -172 115 94 63 -44
4960 -44 184 198 -333 381 -83 -149 -342 -74 -100 -20 100 -139 160 -58 44 -20 -175 134 -33 -91 98 88 149
4983 149 79 -130 263 181 -32 125 -88 212 74 -109 -126 -5 20 -59 128 74 -273 181 -35 277 38 -130
5005 -130 42 -63 15 -42 49 165 47 -191 -149 -161 -220 -90 -14 267 -112 67 55 31 1 -37 -93 3 73 -53 58
5030 58 -38 129 78 80 89 153 142 -52 36 -120 -160 -63 -18 52 0 -182 55 -40 -55 -76 188 220 -75 165 -140 -173 214
5057 214 -238 114 85 87 -110 24 192 -98 63 -70 139 50 22 81 192 88 95 166 136 165 77 61 66 92 119 22
5083 22 -34 -76 56 -5 -108 -23 21 -211 -39 110 14 -139 -198 137 38 -101 -100 -310 -45 -34 -275 -192 -2 -89 -20
5108 -20 -157 159 64 -3 -188 1 85 -164 49 114 -88 -51 -117 -31 122 -48 98 305 105 -148 -208 49 36
5131 36 -153 -40 110 -19 112 -106 49 177 89 -144 -214 -59 -27 61 -102 -55 -13 51 -122 74 33 -13 -161
5154 -161 -148 -141 184 -88 12 10 64 -40 -157 134 79 73 73 43 -112 -248 104 44 82 -62 -190 252 -111 19 201
5179 201 132 -158 47 102 -212 -89 -43 27 93 175 -81 -79 44 -240 144 158 7 96 -24 -51 93 101 -98 -180 2
5204 2 24 -31 -109 -54 183 82 -54 -188 291 -21 -145 -115 -49 8 37 -88 244 100 -147 -152 3 106 -69 62
5228 62 -10 0 -80 -147 -141 164 -77 -212 9 -121 57 -17 277 159 174 -145 219 36 97 180 -22 -46 20 -14 -92
5253 -92 -19 144 64 -8 -33 108 -9 -10 -1 -134 352 140 69 -32 -20 99 -29 -152 110 90 -73 174 337 171
5277 171 23 -70 35 -115 -25 125 143 115 -269 49 -30 -17 97 -156 198 -248 35 2 -89 22 -123 -109 161
5300 161 -55 92 -164 -117 40 -137 -276 -66 192 15 104 -162 -8 159 96 -103 171 36 120 151 -50 -75
5322 -75 -48 -173 43 55 95 -72 -13 146 -63 -29 -74 -81 38 -123 21 -48 98 -54 258 -133 121 160 -123 -16
5346 -16 -69 -150 -21 221 -54 -110 45 68 171 74 -25 -49 52 225 -89 64 98 -2 -80 61 171 84 -199 -107
5370 -107 171 82 89 44 -21 -181 -170 19 68 -48 -26 -105 -6 2 115 -49 -261 171 -64 -78 -60 -7 121 -211 -66
5395 -66 -15 9 66 -74 213 -147 -272 121 119 -17 108 -169 64 -26 -93 -45 104 -176 -42 43 74 30 113 62 142
5420 142 -30 46 -223 39 94 49 -15 -305 137 -180 -60 85 -7 64 -5 19 8 105 -62 -30 58 -10 -83 -113 -120 -132
5446 -132 -77 45 -51 154 -23 -212 -143 197 71 -64 270 -173 13 140 2 15 -93 126 -59 -177 50
5467 50 71 -281 79 -50 -83 164 68 94 101 -66 34 137 -69 -66 45 8 -37 -92 -135 56 -47 -19 8 -22 68 -172
5493 -172 13 -76 -122 126 -160 49 29 -48 -200 -34 156 -217 118 85 39 89 64 24 45 60 -184 135 49 205
5517 205 8 45 -21 -7 -200 -33 -182 74 -40 232 90 -56 -12 140 -29 122 39 -78 -119 -85 56 -75
5539 -75 138 -100 291 80 -96 89 49 21 236 -7 -128 -122 -82 5 -68 188 220 -133 -137 43 -122 -133 -170 -91 -110
5564 -110 -48 -117 -119 -42 10 116 -131 -48 153 -28 303 -146 -16 -36 -39 -10 -93 124 51 59 -140 37 -24 -60 30 77
5590 77 -141 62 36 -86 146 26 42 -79 80 -114 99 -164 51 -78 -23 -221 146 -84 -54 78 -64 144
5612 144 -223 -297 25 -160 -152 -134 19 158 -116 -195 65 11 114 -120 39 82 168 -9 100 -42 18 37 28 233
5636 233 13 -8 -96 266 66 -77 -61 -96 134 -87 55 24 108 47 147 56 161 194 -49 6 202 118 -223 -88
5660 -88 -32 -98 -49 14 -147 -6 33 -65 111 2 -9 216 -10 -115 190 49 -230 171 35 154 59 108 74 -128
5684 -128 -73 184 -73 -233 -121 203 -64 -44 171 111 1 195 -179 12 8 -185 -8 -69 78 -38 -43 228 48
5707 48 135 0 -75 -158 -5 -205 130 8 40 -157 -60 48 -48 65 -73 76 15 148 75 202 51 -153 -70
5730 -70 -102 -114 -41 -95 165 -208 18 39 110 -173 154 237 74 -278 108 218 -56 -65 50 -128 30 -38 204 -42
5754 -42 -13 30 -45 40 -31 327 -22 68 33 148 148 252 -43 -14 -94 -78 104 106 130 42 123 -10 -10 -169 -92 112 -81
5781 -81 109 -26 -126 51 -110 -6 -139 -84 37 -256 11 42 -56 -66 -74 134 133 -96 150 68 99 -68 -124 -54
5805 -54 201 -34 -133 75 54 -161 -1 -18 96 -145 61 16 -5 99 -115 -131 -60 87 0 -41 23 -98 56 -68
5829 -68 8 -18 17 -78 -151 -89 27 46 206 -156 38 -50 -46 -50 -114 -135 -107 126 158 -100 114 86 -105 -109 -155 39 52
5856 52 -6 -79 -12 -67 116 -17 -68 -76 65 -85 50 -43 294 -284 135 32 -27 5 8 54 38 -36 49 -1 -26 -156
5882 -156 117 -191 23 -196 -19 -208 -12 24 -84 32 4 47 143 38 115 104 -11 50 -43 6 -3 2 81 31 47
5907 47 75 146 -11 114 -26 -161 -45 0 -169 -274 -162 -146 48 -34 21 12 -63 -1 154 25 11 -156 -85 -80 95
5932 95 75 291 -167 102 -20 102 1 20 194 10 27 -17 -47 152 -52 -176 11 117 179 -144 31 -78
5954 -78 -47 160 72 6 -44 -198 137 -47 -9 69 -37 2 60 -111 -51 -12 -131 168 -208 57 22 -91 89 31
5978 31 -113 -85 -102 98 129 158 -6 69 185 18 -77 -73 -161 -105 -60 -55 -217 116 -27 -61 -162 46 -104 -13 127
6003 127 23 88 -87 -31 -95 253 -297 -68 20 63 172 159 11 207 6 -113 13 145 56 200 4 -3 -237
6026 -237 -116 -85 -33 0 -2 -117 -28 43 -143 -27 100 -132 -105 2 72 82 152 143 140 188 23 -4 -81 34 -185 -17
6052 -17 4 40 5 -101 -121 89 -12 -165 -154 74 -39 -95 302 -19 87 -63 -67 47 134 -117 -15 205 -162
6075 -162 -16 -265 4 -9 -198 51 72 -31 9 -117 57 -51 -54 244 -25 100 -96 -113 195 -40 56 195
6097 195 30 -131 -24 28 35 -7 -58 -74 -162 -22 42 -102 89 -54 -80 -64 16 29 -3 33 27 96 69 -129 -45 -108 301
6124 301 -24 -41 118 -19 17 47 -125 3 -28 -188 -84 94 -16 194 207 125 51 -58 -247 -28 -147 -131 -140
6147 -140 -55 182 -8 -235 26 55 67 -104 -4 -37 17 218 39 186 111 -54 -185 -52 -2 91 103 -1 189
6170 189 -29 -103 70 102 94 104 -248 -130 103 -3 188 -25 135 -20 32 -58 71 -134 -160 -105 67 -14 129
6193 129 -11 13 5 -71 -59 -38 -2 117 -94 114 77 -248 19 52 -148 -68 -37 13 -106 64 43 146 45 -204
6217 -204 -35 86 -211 105 -20 -63 58 -124 -35 -7 -72 -97 82 -95 125 60 57 10 39 -123 -155 -118 132 23
6241 23 -156 -147 105 138 18 66 -266 74 -18 -87 -19 -14 -97 -169 -183 142 75 -12 81 -138 -6 -95 -81 59 -36 -22 -14
6268 -14 -30 -125 -117 48 -53 273 -6 -55 -9 89 -56 46 95 -26 141 -58 -64 58 -61 42 -17 -204 -37 29
6292 29 28 -13 -126 -241 162 210 155 168 -55 -90 -22 2 -275 -14 69 62 22 95 172 -73 4 28 67 -199 -92 128
6318 128 4 -98 174 -60 199 256 -16 207 179 -50 -63 -110 174 -35 -127 192 124 311 -365 -130 -165 24
6340 24 191 -93 -181 -72 -112 -136 -99 250 74 -19 155 8 -36 -33 27 29 276 -60 -64 34 60 -169 16 -69 -102 -2
6366 -2 22 104 42 -220 -80 -123 -143 -49 -37 100 97 203 -68 -193 47 82 -218 102 39 245 198 113 93 19 152 -28
6392 -28 186 -101 -219 -10 84 -89 -56 122 -148 -1 -111 133 -118 -145 -143 148 -154 20 -203 -212 5 87 124
6415 124 -2 130 132 41 -119 7 -114 -77 -160 92 -168 -64 175 59 14 -29 -101 -166 -154 65 -108 139 39
6438 39 -173 -55 -164 -88 112 186 22 190 121 210 5 73 114 167 67 -156 -99 -49 -127 -22 -129 225 119 5
6462 5 -46 -237 -23 -90 9 -30 -51 116 64 49 223 187 113 25 -18 -139 58 99 8 -33 -22 59 -76 199 -28 100
6488 100 -73 223 190 2 122 3 177 43 92 -112 -44 -26 -71 178 -67 254 69 29 -45 -195 -107 -8 190
6511 190 -60 27 58 -189 77 -30 -100 -50 41 -156 -70 9 -172 -9 49 -45 38 -28 246 -52 -105 -124 179 48
6535 48 -18 -60 -92 132 102 46 91 -61 0 -47 57 -88 30 137 68 182 19 0 -193 102 -154 14 -98 251
6559 251 -1 62 -159 90 -199 196 -122 71 170 4 -25 -115 -32 -274 -53 -88 100 -83 -59 34 -25 -30 37 78
6583 78 -52 -96 -130 172 79 -37 69 -111 -51 78 -1 -113 -3 9 69 -29 -81 -159 -24 -44 93 52 -88 128
6607 128 239 49 -54 -235 -19 -48 70 120 0 39 -210 80 156 38 -163 146 36 72 73 71 12 229 -58
6630 -58 69 -56 97 310 184 -23 -104 90 13 -170 85 304 22 -136 70 187 -86 -91 111 -119 -59 -166
6652 -166 61 -91 115 -19 133 99 49 176 -181 152 -37 140 130 12 15 -79 52 -99 2 27 -157 -151 8
6675 8 -308 21 -289 45 20 -157 -93 27 26 -130 -9 131 103 -47 -60 103 36 -78 88 -233 58 -1 -334
6698 -334 -21 161 21 27 -49 109 -337 89 95 159 24 -238 155 147 144 -32 89 -64 -115 -146 -172 -6 -89 87 95
6723 95 -112 142 320 -98 146 -76 95 12 -25 -5 -208 -178 -182 34 -86 -178 64 186 203 0 -6 59 -144 -10
6747 -10 -61 -123 19 -95 3 112 -79 -93 -155 -72 26 -19 -181 -111 -146 -201 -108 -132 -81 -18 -51 79 -39 67 -44 -47
6773 -47 19 -53 -32 150 36 41 70 -3 38 -173 76 -154 -13 -20 29 23 -126 43 130 -45 91 -148 -196 1 169
6798 169 107 76 -84 24 138 -22 31 -4 -28 197 104 -98 -92 -75 -36 80 97 -238 68 -72 33 -93 -22 135
6822 135 -54 92 199 11 36 92 -168 -99 37 49 -202 -56 15 61 149 -281 -23 74 28 157 -14 -126 -24
6845 -24 19 -16 -19 85 -14 16 -20 115 284 35 -58 94 319 167 83 -236 -84 -251 30 97 135 94 -396 18
6869 18 40 -52 -152 20 -48 -45 -25 154 -31 -77 205 87 51 -136 -23 -34 246 -145 -249 73 52 145 16 -97
6893 -97 -89 115 67 -101 -76 127 -38 -192 46 -75 -129 -154 -74 15 -57 -180 -137 -29 -137 31 -47 122 63 -17 -41
6918 -41 20 -136 -78 219 -16 -83 -74 -62 -163 115 -48 -19 -53 -127 -230 91 -194 89 -318 123 141 -52 -10 72
6942 72 -36 23 75 47 173 42 65 199 49 63 58 33 74 -277 -32 -51 -127 -106 88 142 76 29 119 192 77 99
6968 99 -22 108 -13 -56 148 -33 33 58 98 -22 -340 174 33 -5 9 24 193 91 51 -86 292 216 164 -52
6992 -52 46 -8 183 117 -180 229 82 97 95 -110 32 76 88 17 -160 102 -15 41 -116 9 -47 50 -291 -91
7016 -91 -32 -141 56 -172 35 67 78 267 -122 121 -36 77 -315 -212 36 37 -138 -11 30 -191 9 41 -46
7039 -46 181 -102 -108 252 191 -14 65 91 -206 78 125 -17 -181 132 -149 290 -110 49 5 -81 130 -78 -24
7062 -24 -197 122 49 124 -69 -116 -171 -164 -197 -68 34 264 34 -28 -40 -15 -83 -7 103 98 158 -70 3 38 109 121 149
7089 149 -23 103 -106 -79 201 14 43 -21 -117 -188 246 133 -111 51 8 -222 -101 -47 -68 -9 74 -117 30
7112 30 138 42 11 -175 -173 -96 -45 -113 4 -47 -43 1 174 -273 -14 12 41 -101 -89 -216 46 -92 86 -59 -152
7137 -152 53 37 -76 219 -170 108 -128 42 -78 7 -100 25 141 61 198 -135 21 37 313 4 87 -34
7159 -34 43 171 1 167 218 -150 53 67 -36 8 37 48 -17 91 -24 39 -44 61 47 -61 276 271 -131 43
7183 43 18 54 62 37 7 -19 -131 43 -72 101 46 44 21 -84 -39 -14 -15 100 -156 -7 19 -95 -21 18 10 185 -29
7210 -29 190 50 -47 13 -226 161 -78 -159 53 111 -187 -47 40 -14 21 -69 59 -51 21 -20 199 -103 -48 -135
7234 -135 -188 285 242 -20 -70 -39 -40 37 140 -93 -51 23 -118 72 95 166 -108 47 151 287 213 58 -232 -99
7258 -99 96 -229 -67 49 -142 61 72 -109 57 268 81 -56 53 -88 -135 40 93 -41 -4 -9 -26 163 -154
7281 -154 8 -33 18 27 39 -128 -98 37 -82 -115 56 99 22 -28 116 -16 91 -86 149 -121 -179 47 72 -88
7305 -88 3 -41 35 32 89 -45 45 27 -43 213 -57 205 4 -1 -157 77 -189 39 -242 38 161 -97 64 71 68
7330 68 17 63 -328 -65 123 106 116 54 90 -136 211 104 44 -186 -147 86 -192 -79 -47 -6 -29 -214 131 -134
7354 -134 -73 44 89 -95 -25 -417 -95 193 206 -18 151 88 -61 99 89 143 54 -228 43 275 -31 156 -137
7377 -137 41 8 3 -23 71 67 24 7 14 161 -75 207 137 262 9 -50 157 -57 26 218 149 -118 -118 -118 122 -110
7403 -110 -35 -73 -27 158 207 161 -99 -85 0 138 -4 -146 68 177 -108 -98 -75 -157 -142 -35 92 45 61 -60
7427 -60 181 -100 -65 -129 29 -173 119 -233 11 -30 2 192 -60 -165 108 77 21 -62 -138 -20 -118 111 -64
7450 -64 201 -57 123 177 -173 -169 25 -45 -77 -115 -17 22 47 -115 90 -92 -301 25 312 111 70 -115 58 54
7474 54 149 6 50 23 130 -107 -76 -137 -4 -110 -23 8 -114 -75 156 -188 -86 -117 -178 71 -189 -62 -126 -68
7498 -68 156 147 22 -37 160 -184 42 37 19 165 143 -93 19 212 19 -45 -34 -24 -113 -93 147 77 -78 220 68
7523 68 -28 -81 -137 -22 91 109 -158 59 14 34 -8 -91 -63 66 -194 -12 145 20 -83 -51 156 -37 -233 -138
7547 -138 5 -72 8 30 74 -143 -164 -101 103 -34 67 56 285 -7 4 24 -67 120 -11 68 3 -26 -115 50 230
7572 230 -5 -26 -37 62 156 -263 113 184 -30 -64 -20 -47 100 -104 83 -93 203 -7 42 -30 -106 104 -192 -54
7596 -54 -112 112 -84 -156 -197 26 129 -132 -59 22 -36 -45 85 68 -2 -22 39 -172 21 -72 92 85 -84 155 -10
7621 -10 28 -35 -99 -13 9 -63 102 158 44 -55 -131 -326 120 333 -1 48 154 -53 225 -39 252 -126 -1 -61
7645 -61 -11 51 58 126 45 125 230 115 178 137 -57 12 -63 -58 175 89 36 92 226 9 -176 264 -182 98 -126 -3
7671 -3 -77 -221 -119 114 57 222 28 129 65 45 -94 -5 102 -82 194 -204 56 79 -71 -42 -42 265 -153 7
7695 7 -40 -178 102 88 -40 111 36 19 14 259 57 23 179 91 4 -258 87 43 49 -5 -74 -42 136 -95 0 132
7721 132 126 53 100 77 -361 9 -16 -3 63 -89 -82 -62 -122 5 -3 -128 -18 -196 117 253 25 31 -252 49 104 104
7747 104 -158 183 -4 -71 107 152 165 60 21 152 -85 213 106 39 139 -158 -132 149 152 -10 219 -34 -11
7770 -11 207 -12 -89 -25 -31 -58 145 163 -75 58 -121 -86 -5 -2 12 -143 141 -100 45 60 -169 33 -14 -69 -121
7795 -121 33 72 182 6 125 67 1 139 174 -27 103 -141 -133 12 26 121 100 189 49 59 -123 13 -118 45
7819 45 34 -137 -65 86 -77 22 296 -84 300 99 95 47 18 64 -149 109 10 199 -196 -62 199 68 -28 -5
7843 -5 -174 240 34 223 -63 -43 40 251 125 8 8 131 191 -129 110 164 -226 -85 -50 3 136 -12 1 136
7867 136 14 13 -81 103 -235 -196 124 -49 44 -145 178 -10 -1 -82 -49 62 -28 -164 18 40 -135 -185 130 -11
7891 -11 -2 157 -84 -133 -76 46 204 196 84 127 -11 182 -191 97 54 29 88 116 -91 -31 -58 75 91 110 94 54
7917 54 125 -125 87 69 236 28 -24 -23 -179 -43 -114 6 -133 -91 26 -122 -135 -137 -57 -74 107 168 -172 -280 -4
7942 -4 -49 21 89 55 -79 -43 199 48 -210 -47 90 39 93 -142 15 117 -86 161 10 170 17 255 -93
7965 -93 39 94 -132 86 152 -14 -8 214 -85 184 -1 13 58 26 -20 -31 -284 81 48 -77 64 99 105 121 -13
7990 -13 181 91 -139 44 98 -4 115 -58 60 -107 73 30 174 -89 2 101 -158 -101 -221 -169 35 91 200
8013 200 -32 102 100 104 -190 -81 48 -31 243 1 -91 158 5 -105 -19 -170 -30 -45 142 69 -175 52 188
8036 188 121 126 -100 -92 144 -213 -37 -198 91 -312 -172 -73 174 -54 -159 8 62 -155 -99 -43 47 51 -288 -146
8060 -146 138 112 170 89 -28 71 201 -139 254 -88 -334 -10 236 35 -60 -84 33 312 37 -186 195 -66
8082 -66 -48 53 -39 -30 81 -103 -135 -93 -61 88 -95 176 -39 -46 -263 38 -39 44 57 1 -202 96 40 -106 18
8107 18 -13 11 118 94 108 -64 -63 121 -28 132 -28 255 46 67 -45 -137 63 0 -17 79 -31 195 126 -51
8131 -51 -241 -151 132 14 -32 -203 -152 11 -95 -89 -211 154 208 -77 -85 -65 81 -77 18 -109 -54 53 -23 -225
8155 -225 180 -41 143 90 -244 190 -35 148 29 46 34 -100 -42 -22 -89 86 -7 -347 -64 4 -33 -70 -266
8178 -266 -106 176 -74 -164 61 -22 -111 84 178 -125 86 64 -118
8191a18
$$ Imaginary data points
##PAGE= N=2
##DATA TABLE= (X++(I..I)), XYDATA
0 0 0 0 0 0 0 0 8 -8 8 -8 16 -16 24 -30 33 -48 56 -72 88 -104 121 -146 176 -208 241 -281 329 -379 438
29 438 -503 575 -655 745 -844 952 -1073 1203 -1350 1507 -1683 1873 -2082 2309 -2555 2827
45 2827 -3123 3447 -3801 4187 -4615 5083 -5602 6173 -6813 7526 -8331 9249 -10301 11521
59 11521 -12964 14693 -16811 19478 -22953 27691 -34557 45453 -65429 114022 -480315 -273707
71 -273707 665231 -211774 -421609 210661 265631 -283172 -38500 268337 103336 -745
81 -745 152523 53469 104829 237663 30652 -142605 114782 39501 -300700 -133603 175126
92 175126 -67944 -182267 80103 -10539 -261318 16311 160061 -157291 -56704 325949
102 325949 50233 -267547 96353 273619 -106261 -121975 150983 -20184 -179629 89937
112 89937 117457 -111571 567 98401 -108400 -29957 198415 -22680 -176548 137158 143935
123 143935 -219719 -103366 194489 -36613 -208331 65416 77271 -153056 -13844 125301
133 125301 -76503 -73644 135515 29581 -76768 129928 110782 -124810 32975 223416
143 223416 -64079 -198441 94214 101688 -158056 -80184 78108 -50246 -93410 19287 -47443
154 -47443 -75690 99590 52029 -123401 53267 204092 -40160 -104662 149083 93662 -143641
165 -143641 -15396 138778 -41699 -108380 50833 8880 -99113 354 6802 -100676 9492
176 9492 99976 -66455 -76531 131531 80339 -101582 8837 128011 -16154 -59011 67913
187 67913 31336 -49423 10724 -9813 -79773 21570 56805 -105318 -87224 101681 32615
198 32615 -129678 1678 123892 -22316 -71120 61731 49418 -33818 20205 44793 -17424
209 -17424 7174 34701 -43473 -29162 74498 5698 -101203 1619 71309 -47086 -66271
220 -66271 46871 28722 -56389 -19939 27772 2723 8913 15756 -31554 -3591 64010 -6336
232 -6336 -69151 37265 82862 -33581 -56131 41689 34704 -37893 -10132 28684 -8059 -18493
244 -18493 267 -17507 -3554 30186 -19048 -57602 11088 41051 -25114 -25823 43755 23017
256 23017 -40311 -3333 43982 5527 -18288 9730 15576 6995 6046 -11323 -14109 21146 19070
269 19070 -37798 -38572 23026 19543 -31703 -15856 21488 -1300 -26994 -5881 19279 16581 1032
282 1032 -7716 178 19642 17028 -11780 -8345 21440 7112 -24065 -5933 16527 -4370 -18735
295 -18735 3832 9991 -19595 -21672 10973 16954 -708 -6260 -7160 -2948 12782 14529 1234 4631
309 4631 16939 -1842 -25025 2431 30134 -5203 -33441 -3370 17135 -3784 -15811 -3676
321 -3676 156 -6348 -5597 -7280 -6199 14225 19169 -187 3915 15510 -6043 -14927 17596 28838
335 28838 -2673 -13514 4912 36 -13239 448 985 -20090 -16963 -8221 -12975 4382 22494
348 22494 -5158 -24755 11828 29593 -6802 -6125 35843 21839 -17498 -515 17982 -2997
360 -2997 -6419 4547 -12586 -22714 -2910 -6429 -25393 -2846 16237 -15285 -19628 18681 14402
373 14402 -8453 15000 28591 -1522 -7067 18904 14815 -1416 7228 -1226 -22881 -3279 5865
386 5865 -29007 -20702 23291 651 -39800 -3394 34620 945 -17520 14811 14972 -6284 7954
399 7954 9894 -8501 11584 21600 -22355 -24526 25623 12255 -37435 -10322 30020 -7128 -29219
412 -29219 10913 16425 -8625 3583 7035 -12975 3562 18096 -14465 -12980 30096 5200 -44876
425 -44876 -1192 42490 -12525 -35532 22610 26426 -17360 -3615 20952 2986 4029 14032
437 14032 -18097 -21831 24522 7229 -45717 -7421 34051 -21477 -45352 15775 24398 -18541
449 -18541 -6307 17013 -4037 4005 32834 5742 -7691 33127 17963 -31184 5144 38239
461 38239 -21335 -39968 17332 5864 -48497 -18749 19290 -17271 -23195 12998 -5676 -17742
473 -17742 29241 25574 -16735 15165 42696 -11698 -19021 44382 25554 -37395 -5204 29496
485 29496 -19235 -26129 16433 -7804 -33810 5548 2139 -38691 -3023 34767 -15733 -28905
497 -28905 31872 18989 -29861 13458 42565 -15298 -16588 37076 9726 -29192 13223 27398
509 27398 -16736 -8284 14662 -21813 -16918 34417 -2448 -52742 4637 33042 -32412 -29066 32464
522 32464 4248 -35960 11866 26605 -20276 -186 36928 -4588 -15146 32037 8026 -28857
534 -28857 22306 35435 -32729 -23316 37299 272 -44329 7803 23591 -30808 -18874 16288
546 16288 -15444 -15816 27352 -793 -33880 18317 32243 -27151 -7835 50259 2831 -40356
558 -40356 21552 37798 -22176 -12648 24806 -5048 -14759 15176 -10942 -32072 21285 22723 -45256
571 -45256 -23850 38358 -3667 -38911 19489 25432 -28615 -4783 33750 -3619 -12459 28769
583 28769 8867 -23233 16179 21626 -28299 -2982 38253 -17960 -45212 20774 24617 -34970
595 -34970 -17087 23065 -7160 -17398 16061 -1110 -18677 25440 22507 -30924 -3473 40545
607 40545 -5537 -26926 26495 18767 -35165 -9204 28413 -8977 -21177 14345 -1593 -23123
619 -23123 12905 13010 -24778 2192 31710 -13708 -25078 28036 18235 -28957 836 29829 -14367
632 -14367 -22139 20131 6108 -19788 7604 9178 -20938 691 21849 -14635 -16240 28486 7677
645 7677 -34915 1990 30639 -10886 -17106 16319 340 -17934 11013 10844 -17597 1693 20326
658 20326 -12407 -14028 24199 7003 -22951 10145 21670 -20119 -14842 22348 3644 -21108
670 -21108 2541 7803 -15193 -3456 11425 -10037 -5810 18983 -3808 -21373 15812 22770 -14839
683 -14839 -7636 22802 1968 -17437 8869 12337 -12469 -3557 7420 -12685 -8100 13310 -4430
696 -4430 -17704 8315 8947 -17626 -3061 21541 -858 -13883 12623 11310 -12503 395 14445
709 14445 -2526 -4517 6486 -5642 -9593 10089 4044 -17665 -1691 15098 -9185 -16391 12311
722 12311 11717 -11568 -4421 7610 -38 1163 7145 -2248 -3600 9328 902 -13532 3845 14031
736 14031 -8903 -12104 9393 2886 -13803 -1204 9723 -2120 -6010 1637 -314 48 7882 44
750 44 -7019 7887 9129 -10530 -4441 16222 5075 -13783 -5019 6838 402 -4543 -1700 -2776
764 -2776 -134 2673 -7386 -7365 9966 7656 -9941 -3614 12040 4204 -7628 1041 9062 2009
778 2009 -3141 -2191 -1598 3610 4495 -5940 -5969 3864 -582 -8281 1201 8849 -2909 -9881 1014 6455
794 6455 -255 -1576 918 1602 3485 331 -5674 666 8412 188 -7921 206 6210 -2407 -5616
809 -5616 2745 4165 -1409 -3377 -3598 488 6406 1038 -6892 -1904 4221 -565 -3405 3651 4168 -3945
825 -3945 -2422 3386 302 -807 2292 311 -1336 654 -983 -2181 1996 2042 -3714 -2321 3923 -810
841 -810 -5604 2496 5935 -2489 -4024 822 1567 1769 2992 41 -1895 1113 972 -2797 1073 5260
857 5260 -3076 -6565 2205 2116 -4926 -1360 3466 -1206 -3783 318 1448 61 1872 671 -1875 3327
873 3327 4057 -5083 -1315 10635 4149 -8673 -3123 6971 2172 -4823 -1726 970 -1416 -2199 -4471
888 -4471 -3546 4807 2308 -9441 -4121 8390 2748 -6886 977 9412 1002 -4471 2791 5200 2373
903 2373 2090 -678 -1380 3463 131 -7490 -526 6630 -4052 -12729 -619 6870 -4715 -7084 3062
918 3062 2937 -2325 -1510 898 3444 7132 1126 -5981 2113 10963 665 -8027 4113 8840 -4862
933 -4862 -7536 2398 2389 -2517 -2799 -3217 -2601 1353 -961 -5842 473 6745 -3114 -7802 5391 6924
949 6924 -4295 -1711 7203 2153 -3665 1644 4712 2146 1994 213 -4055 727 4858 -4053 -6275
964 -6275 4148 982 -10353 -4475 5288 -542 -6769 -181 2549 -1349 1588 3111 -715 3230 6758
979 6758 -1395 -2797 6787 4429 -4541 -194 4848 -4185 -7747 2301 2173 -6089 -2745 456 -4022
994 -4022 -1622 3195 -238 -235 5172 844 -4103 4806 8698 -3793 -5612 6594 3637 -6925 -2115
1009 -2115 3763 -1254 -2672 -521 -3010 -2087 3579 697 -4313 3027 4948 -5304 -3132 8626 2884
1024 2884 -6156 752 4628 -3083 -3194 3751 1019 -3339 377 -936 -2937 4001 3350 -6720 -1673
1039 -1673 8864 162 -7828 2504 7674 -2834 -5098 2749 -147 -3280 1990 1317 -2533 2281
1053 2281 898 -6241 625 8903 -795 -7472 3521 6074 -4841 -3091 5911 344 -5114 592
1067 592 670 -2400 1542 1166 -4012 787 5012 -3743 -5242 7472 5402 -7722 -2116 7994 -322
1082 -322 -5632 2499 3783 -1899 -930 -1080 -3989 2368 5900 -5136 -7246 6327 4385 -7470 -689
1097 -689 7662 -1710 -5541 3641 3326 -3060 837 3139 -2179 -186 2981 -4222 -3128 7910 1328
1112 1328 -9155 339 7650 -3486 -5750 5112 3360 -5232 -901 2880 -2063 1040 4246 -3636
1126 -3636 -3179 6194 936 -6666 2556 6679 -4793 -5663 5248 2076 -5489 1477 3158 -4309 -1016
1141 -1016 4161 -2968 -2825 5996 1148 -5971 1437 4879 -3496 -1339 6668 -980 -6541 3712 4421
1156 4421 -4823 -1240 4632 -2491 -4502 2836 475 -4413 2797 3727 -5661 -2112 6825 -660 -4507
1171 -4507 5071 3161 -5997 289 6569 -1805 -4197 4566 2031 -5355 392 2453 -3939 -104 4040
1186 4040 -4768 -5435 5201 2421 -6919 172 6867 -2698 -5265 5151 3870 -3059 1907 2698 -3355
1201 -3355 899 4382 -3047 -3097 5542 440 -8107 -85 6226 -3946 -5374 3742 210 -5161 1630
1216 1630 2821 -3024 1117 4812 -2237 -2465 5941 2164 -5029 2562 5387 -5430 -4469 5693 1297
1231 1297 -5035 374 1536 -3625 -333 3482 -2725 -2591 4968 481 -5848 2313 5759 -3309 -2437
1246 -2437 4714 110 -4038 2423 2501 -3423 397 3886 -3328 -3696 4668 1694 -4355 1167 2992 -3844
1262 -3844 -1108 4543 -685 -3992 2409 1538 -4645 561 5000 -2264 -3407 4045 1373 -3642 1488
1277 1488 3589 -2287 -1258 2880 -1779 -3425 2640 1223 -4510 458 3546 -3744 -3038 4780 2437
1292 2437 -3937 -379 2993 -690 -141 2975 -543 -1439 3198 -341 -4541 1855 3919 -4150 -4647 2998
1308 2998 1253 -4280 -895 2663 -391 -638 1471 -751 -155 3906 1064 -2738 2117 3034 -3075 -1919
1324 -1919 3905 1448 -4398 -818 2094 -1445 -1519 964 -1003 -1348 950 -892 -1723 1873 1932 -2933
1340 -2933 -1521 3636 679 -3472 1046 3470 -942 -1468 1152 449 33 1647 392 -1352 703 1181
1356 1181 -1673 -864 2026 -859 -3406 -73 623 -2096 -1309 1372 -442 -1760 554 1717 537 622
1372 622 1338 392 899 1832 -50 -239 2476 1161 -2310 -1271 1075 -484 -2670 -883 257 -1901
1388 -1901 -1950 -439 -149 705 440 -560 169 1616 1308 24 1150 2448 229 -1564 1018 1858 -1009
1405 -1009 -1592 81 525 -1191 -1806 -51 895 -171 -1636 -1232 381 1292 -762 -1095 1467 1812 -915
1422 -915 -1629 1429 2565 -434 -1379 710 1318 -637 -823 612 1184 62 -1552 -771 929 746 -924
1439 -924 -1308 818 890 -1898 -1136 2063 1269 -1879 -966 1908 1143 -811 -410 1293 1123 -64 -1526
1456 -1526 -983 1453 1058 -2087 -1274 2003 644 -2475 -700 2673 675 -2262 -576 1498 586 26
1472 26 -184 -310 766 130 -1236 -501 2136 173 -2915 -394 2536 -392 -2442 1012 1702 -928 -1242
1489 -1242 248 612 718 351 -768 -46 1420 -150 -2055 625 2586 -1357 -2899 1053 1669 -1328
1505 -1328 -591 844 -101 -841 350 -69 -287 922 337 -1569 389 1782 -1294 -1303 1855 1217 -2023
1522 -2023 -421 1810 -461 -1334 1009 635 -1429 40 571 -208 468 966 -1531 -1015 1944 823 -2125
1539 -2125 22 2068 -957 -2226 1545 1158 -1491 -231 1280 -414 -810 502 -261 -408 1310 36
1555 36 -2132 482 2036 -1360 -1712 2028 992 -2623 -700 2226 270 -1013 393 70 -369 1023
1571 1023 262 -1440 912 1867 -2077 -1638 2569 1334 -2659 -644 2481 -519 -2168 228 1070 -705
1587 -705 354 -28 -1320 953 1983 -1079 -879 2638 504 -2814 228 3274 -719 -2550 999 1084
1603 1084 -1477 -497 275 -1009 299 505 -1793 -1217 2331 1056 -2842 69 3142 -806 -2042 1920
1619 1920 1525 -1168 -25 696 -665 -146 1288 -900 -1379 1610 284 -2561 104 2572 -1184 -2397
1635 -2397 1466 919 -1890 96 1831 -1040 -951 1648 -160 -1332 1696 1335 -1805 257 1834 -984
1651 -984 -1501 2019 480 -2390 -173 1488 -1186 -1392 1446 -251 -1980 1061 1096 -1883 9 2380
1667 2380 -327 -1159 1879 854 -1595 1224 1926 -1880 -1529 2169 -23 -2661 322 1059 -1948 -915
1683 -915 1245 -482 -1234 1845 482 -2015 1214 2178 -1327 -844 2638 381 -2567 328 1643 -1480
1699 -1480 -1040 1316 -662 -1522 1022 53 -1856 1031 1678 -1824 -1279 2586 782 -2103 1022 1998
1715 1998 -1349 -783 1693 -351 -1682 1050 206 -1715 663 1274 -1797 -1031 2425 -88 -2614 715
1731 715 1931 -1357 -677 1638 -508 -1410 1165 421 -1712 570 1436 -1658 -1183 2203 501 -1989
1747 -1989 940 1453 -1570 -490 1668 -408 -1649 760 586 -1859 -96 1028 -1404 -923 1861 64
1763 64 -1856 1281 1722 -910 -106 1568 -238 -1420 1256 928 -1289 188 1332 -1496 -1213 1478
1779 1478 -27 -1926 250 936 -1197 -526 1616 -429 -1023 1274 738 -1345 474 1802 -620 -585
1795 -585 1412 355 -1340 501 1308 -651 -495 917 -552 -1044 1035 428 -1457 -172 990 -1039
1811 -1039 -862 1085 326 -1095 257 1235 -901 -352 1043 22 -371 937 423 -1113 179 1048 -555
1828 -555 -952 761 143 -1473 25 1045 -788 -823 548 -355 -411 654 480 -672 201 1044 -55 -513
1846 -513 1206 677 -813 32 791 -392 -552 630 79 -773 -194 190 -533 -332 719 -155 -467 546
1864 546 378 -546 37 887 0 -379 304 399 -323 128 450 -353 -348 399 -387 -527 303 243 -344 -366 352 62
1886 62 -597 270 263 -462 -74 -7 -176 -108 272 -100 -399 -225 330 -126 -122 447 87 -553 18 268 -91 41
1908 41 410 -156 -440 201 442 -206 -54 501 57 -456 90 651 -298 -96 334 -268 -98 371 -13 -422
1928 -422 200 725 -297 -525 659 363 -423 53 594 -293 -246 171 188 -123 82 -164 -668 45 786 -542
1948 -542 -811 606 433 -791 -202 725 11 -384 420 171 -217 347 292 -553 117 518 -691 -777 695
1967 695 737 -703 -163 814 -210 -606 659 536 -416 -40 141 -587 191 884 -527 -818 776 622 -1054
1986 -1054 -291 993 -319 -981 388 333 -473 311 587 -326 -116 922 -412 -977 540 663 -721 -263
2004 -263 1175 -52 -470 615 439 -620 -10 536 -477 -231 836 -217 -917 445 505 -963 -76
2021 -76 778 -405 -676 688 22 -854 244 777 -809 -566 724 -96 -889 498 611 -881 -344 613
2039 613 -256 -147 727 323 -599 65 778 -605 -508 988 95 -1066 150 501 -564 -248 385 -358 -569
2058 -569 522 152 -976 595 999 -705 -524 1010 199 -558 298 684 -285 -304 304 -198 -130 361 -304
2077 -304 -1070 240 644 -656 -518 1023 22 -771 218 619 -451 -41 624 48 -425 414 -11 -392
2095 -392 653 628 -619 -698 796 232 -781 240 677 -438 -162 391 148 -515 383 -68 -462 406 764
2114 764 -401 -272 697 -61 -709 74 414 -318 -441 344 -51 -333 294 323 -338 123 582 -494 -618 505
2134 505 198 -363 157 467 -13 52 577 -54 -422 150 268 -629 -52 344 -376 -588 347 1 -422 6
2154 6 479 21 -148 206 20 -162 492 110 -432 109 396 -339 -576 250 106 -496 -185 312 -220 -358 490
2175 490 283 -292 61 247 -147 -140 539 -68 -492 214 279 -287 -23 320 -119 -147 192 142 -302 115 281 -136
2197 -136 -379 457 -42 -543 52 323 -151 -155 203 -146 -281 302 141 -303 -19 170 -344 84 402 -11 -357
2218 -357 108 137 -201 -80 315 -28 -241 -43 -51 -130 157 174 -151 -325 182 205 -169 201 312 -360 -179 380
2240 380 116 -236 194 273 -122 -145 13 -29 -169 91 -251 -385 144 403 -202 -161 315 -123 -278 -64 41
2261 41 121 -149 380 -111 -301 188 9 -275 155 186 61 -128 293 -35 -186 307 8 -492 -390 279 -165
2282 -165 -211 158 39 -423 -199 392 39 -10 172 67 -87 196 224 -325 155 97 -160 -313 144 143 -253 -241
2304 -241 245 -144 -207 222 153 -198 106 -43 -197 -103 469 197 -188 277 286 -355 -308 376 146 -229 -117 126
2326 126 23 226 14 -12 78 256 -251 -268 356 260 -244 -298 362 -132 -166 -121 243 -47 -145 -91 -110 206 260 -99
2350 -99 -493 195 239 -306 57 283 255 -202 -238 298 77 -298 -206 61 -18 168 -260 41 101 133 -35 172 292
2373 292 101 -136 -10 333 83 -56 -246 -68 -9 61 -119 -21 -175 -32 103 322 230 -51 26 -220 135 -126
2395 -126 83 49 230 -186 -119 101 -75 -114 -57 278 -10 56 -29 -118 -105 76 -128 45 167 8 -322 68 525
2418 525 61 -270 162 505 -20 -189 47 123 -12 -93 43 24 118 146 -359 -172 425 -105 -411 69 486 -212
2440 -212 -350 153 130 148 -268 -47 -226 -23 -50 -17 202 299 -398 -546 -158 465 -285 -331 117 239 -74 -48
2462 -48 294 35 44 -43 65 8 347 0 -195 126 442 -430 -250 163 -4 -323 80 118 -129 -99 18 -80 -249
2485 -249 49 -133 -208 352 439 -316 -231 514 128 -311 37 74 -321 -237 -4 -293 28 90 123 -235 124 170 -152
2508 -152 99 415 85 -321 197 198 -265 -59 344 21 -15 187 71 -445 38 178 -316 -73 101 -273 -244
2529 -244 286 312 -337 -238 302 -132 -421 336 260 -151 170 77 -123 2 150 -272 -218 204 -367 -285 180 460
2551 460 -312 -217 245 160 -193 143 372 -214 -167 -124 -168 -172 380 91 -350 -184 499 -301 -323 413 329 17 9 306
2575 306 87 17 112 -36 -213 171 -52 -539 258 387 -440 -143 223 119 -568 -3 73 -298 -271 222 17
2596 17 4 -14 -79 -240 286 132 -364 -23 483 -30 -171 94 67 -237 -200 94 7 -143 93 -116 -106 159 16
2619 16 -339 67 380 151 -365 56 484 -222 65 113 189 -238 22 124 -145 92 210 -252 -18 391 -57
2640 -57 -111 226 112 -266 167 195 30 -319 227 174 -186 50 180 -101 52 161 -215 -60 71 83 -12 -30
2662 -30 221 -212 -133 121 -99 -151 69 117 -46 -45 177 -242 -306 248 -185 -89 35 -7 -95 -163 140 195 -253 -58
2686 -58 -71 -148 70 -18 -85 221 -198 -100 -22 167 86 -335 -60 108 -178 -106 81 248 40 -33 243 -124 -93 108
2710 108 10 -90 70 -139 -359 139 74 -237 22 287 99 -118 -95 75 231 -125 -176 -134 160 288 -24 -23
2732 -23 134 309 -130 -72 116 107 -217 89 304 91 -49 197 127 -85 151 -81 -113 -29 -150 -150 -170 198 104 -335
2756 -335 108 255 114 -96 15 -349 -139 179 -146 -21 -3 -68 36 -3 24 -105 -129 241 108 -122 -71 100
2778 100 204 -112 -133 58 63 -154 -35 -259 -10 -2 54 -178 168 30 -150 196 266 -82 -73 277 219 -99 5
2801 5 -80 130 -65 270 53 -203 99 -116 -47 192 299 -18 -376 29 -77 -76 9 88 21 -143 -159 -52 64
2824 64 -120 -244 -183 -198 73 -87 -60 75 89 -179 -371 376 60 20 -97 -6 -289 -104 -196 -71 227 172 -36
2847 -36 -207 220 -75 -222 62 104 -147 -150 -53 156 -99 -56 -229 13 -271 193 -21 -6 301 7 -178 -84 238
2870 238 -67 -35 68 123 -27 -42 5 36 54 136 -210 -176 178 -92 22 72 238 -215 -28 74 117 -84 -100 129
2894 129 -209 183 274 -18 0 211 -168 -109 124 48 -312 43 146 66 155 58 222 -154 50 184 21 72 -33
2917 -33 130 -50 84 -31 -56 -69 155 -131 -185 39 -62 43 115 91 -17 40 -81 68 -99 -157 -87 -286 139
2940 139 76 194 45 -55 46 -77 -173 22 184 -107 -32 124 -174 125 -97 -3 113 -127 -28 -170 78 -110
2962 -110 -300 -184 149 112 -104 17 156 134 -102 -43 -95 204 -120 -131 -109 -12 -121 -26 258 50 -47 -95 -4 -14
2986 -14 -170 -86 -55 -109 -34 263 -26 -108 -64 61 -178 -134 -75 -1 -75 59 88 43 46 176 -53 -93 61 127 68 -68
3012 -68 -52 40 -1 -125 119 -92 33 -81 -74 -36 71 -3 88 53 -101 195 6 -174 -66 -92 54 61 -125 124
3036 124 -97 -83 -42 -55 175 -94 78 133 -36 -175 57 1 48 72 -140 8 -65 -18 112 299 28 -108 79
3059 79 4 -55 -45 81 -92 -89 -3 154 -74 -86 -188 -25 89 116 -57 -77 198 157 -107 -25 -16 66 19 -157 16
3084 16 -39 182 -33 22 30 14 -79 -78 -7 -92 -158 151 3 -55 5 -16 -35 84 -36 -132 -162 16 -107 -156 -67 219 65
3111 65 -129 -99 176 24 28 -77 -42 -15 -17 49 96 226 7 -140 -153 351 -4 -121 271 67 -188 -146 153 -225
3135 -225 -12 114 -138 -49 62 -10 99 -229 35 -64 -6 144 -59 -65 113 -89 8 -105 117 30 -135 137 5
3158 5 92 154 147 -138 15 -19 -206 -65 31 133 -61 -169 133 -48 -122 51 90 -199 52 148 8 -80 464 -47
3182 -47 -218 96 -51 -165 -240 172 48 -363 81 82 -111 158 139 -83 -216 83 -156 -41 206 9 -90 -127
3204 -127 246 101 -340 36 -1 -118 -146 -15 21 94 169 -11 -93 21 47 -165 49 207 -4 -281 -6 23 -162
3227 -162 197 -23 -283 -149 -74 -178 -186 6 115 -133 105 161 -59 -269 73 252 -248 -29 134 37 54 191
3249 191 -26 109 -34 -15 -63 -37 25 -44 -324 -41 64 -34 -30 195 178 -110 86 -153 -110 146 47 17 111 55 -116
3274 -116 -82 29 78 -109 -137 -35 92 61 0 38 149 253 11 -308 -54 60 -16 -63 177 37 33 -73 313
3297 313 -226 45 -44 6 -307 -204 -61 -226 -379 -57 156 -161 70 78 -183 -53 10 -245 -13 -8 177 -363
3319 -363 15 217 -24 -143 56 115 -197 131 54 -134 -86 25 -19 -6 93 35 -56 210 89 -267 -350 -27 94
3342 94 -159 110 -82 -231 -31 80 82 -65 16 27 -245 124 -54 -65 -177 139 92 -127 59 68 17 49 32 -133
3366 -133 -177 79 171 82 39 22 18 -15 264 58 75 12 110 23 -63 -39 16 -41 39 -17 -243 69 104 -101 45 90 129
3393 129 1 235 78 27 -112 -227 -198 -203 -160 72 -40 -90 -39 -17 -75 -7 -81 -42 -88 167 -58 121 185 140 -114
3418 -114 -140 150 12 148 10 -28 54 -54 92 245 112 33 -182 -196 133 -133 82 140 146 -95 116 25 225
3441 225 -31 -124 -9 6 122 86 -228 97 69 29 -81 31 106 -31 32 95 107 13 77 4 -92 87 80 91 32 -41
3467 -41 69 -60 35 27 -64 -53 54 140 -167 -83 -51 -180 -149 -42 -112 16 199 -132 33 -123 -59 -94 100 141 -18
3492 -18 70 49 79 60 236 -154 -43 256 6 -170 -119 11 -170 -166 -137 80 270 -69 -17 78 210 -250 -93 118
3516 118 -20 -134 -307 -5 -91 159 63 51 135 -44 -140 -301 1 -122 -53 1 -62 53 99 367 -30 59 -125
3539 -125 -6 -58 41 209 -67 -62 -237 32 27 -25 22 -149 87 195 -8 -89 -214 256 -13 1 -46 124 -148 22
3563 22 7 -257 70 161 -72 -43 71 -64 16 26 -18 62 -190 -100 307 -149 -323 5 35 11 -47 71 259 28
3587 28 -176 -101 -33 288 -63 -182 166 -225 -165 -120 -147 -18 -324 23 -29 -50 103 70 -216 -50 180 -108 82
3610 82 97 -44 -41 -199 64 140 -9 51 106 -173 -150 232 64 102 213 6 -179 64 165 -161 -100 179 -244
3633 -244 -239 51 263 22 51 291 -114 76 93 -140 -82 151 1 -302 14 231 -135 -160 -35 -61 -199 -32
3655 -32 -171 -44 -58 -138 7 -151 -133 117 9 79 79 -52 -134 263 244 31 -103 37 -1 -160 42 -21 -74 -24
3679 -24 110 43 -12 -63 -312 -137 208 6 -213 300 287 -117 -79 297 35 10 217 45 -76 -95 60 -67 -184
3702 -184 299 -30 -304 38 340 -142 -131 258 67 -135 4 192 -79 69 -110 -156 34 -50 73 -49 -26
3723 -26 70 -5 -195 91 3 -344 2 254 -142 119 13 -69 -16 21 -66 -211 -50 -24 -192 66 38 -7 -94 35
3747 35 84 -103 -158 -22 118 -303 -204 88 -142 9 363 -72 -4 147 -74 -151 44 133 -85 -255 -158 135 -132
3770 -132 30 27 -126 -62 158 -195 17 153 -142 -147 91 74 -416 -44 326 64 -118 10 14 -181 90 200 -23
3793 -23 -16 118 97 -99 56 90 -187 15 -105 86 -126 284 6 -72 -94 56 -126 221 177 -157 -127 -213 48
3816 48 -155 318 156 -214 -196 89 82 -297 -82 336 -87 -305 -80 13 -64 22 93 -86 20 187 -64 34 287
3839 287 -8 -317 -66 164 -124 -191 -61 203 105 -4 10 -15 59 -176 -12 11 88 -83 -187 -111 40 -22 -148
3862 -148 -17 -77 114 -133 160 72 43 -33 -144 125 176 -38 -36 -86 2 -230 -316 259 -109 -236 -9 63 -48 -83
3886 -83 164 -182 -130 73 117 -216 119 188 183 -223 158 53 -259 -166 -24 -76 -16 -72 360 33 99 129 -127 119
3910 119 163 -97 -33 208 96 43 141 -145 -149 -142 14 50 -156 -11 78 -165 -127 21 -77 48 34 145 -59 43
3934 43 136 163 -172 -122 -37 -42 168 61 10 -203 -232 71 -272 -49 126 35 221 -143 50 70 -32 -87 55 -178
3958 -178 334 58 -101 13 184 -44 -384 104 211 -64 -32 -26 178 -57 66 -12 77 141 -156 19 12 283 -170
3981 -170 -117 213 94 -127 -270 -26 37 -123 -90 -88 186 37 -47 86 -73 -39 -200 -142 133 -99 62 -101 156
4004 156 4 48 -196 197 -130 -104 -133 -37 21 -255 149 -195 -231 -6 -31 165 57 -34 241 -16 50 -134 37
4027 37 8 -7 -152 58 14 -217 85 157 -22 89 4 -96 -217 1 220 -107 -47 93 101 -28 12 -90 22
4050 22 44 37 -84 -16 -62 -134 -37 106 12 1 -72 65 154 -74 27 67 -61 15 -182 12 82 53 126 143 92 268
4076 268 -167 -28 113 224 -246 27 96 -109 6 134 119 64 -16 3 64 -84 -123 -161 36 347 191 -138 21
4099 21 170 -67 -154 40 44 -81 14 -32 43 11 243 -110 -81 -57 -15 -69 -67 311 -114 47 36 44 -34 -12 52 30 -169
4126 -169 77 -37 63 -70 -167 -35 -38 344 -27 60 182 -20 -216 199 141 -166 -210 97 -27 54 114 -40 -25
4149 -25 275 -78 19 19 173 -146 -309 38 31 -5 -8 215 -92 222 276 63 95 -13 243 -74 -81 39 208 -93
4173 -93 73 -130 -164 97 272 -20 220 231 74 -87 -139 169 -223 -38 122 -269 -21 284 54 -226 77
4194 77 -76 25 -99 77 -37 -80 182 119 21 43 257 -66 -188 351 57 -130 16 29 -180 -135 280 -95
4216 -95 -407 24 151 208 -168 -23 93 -28 217 -88 -317 41 186 -125 -206 291 -15 -293 83 272 -328
4237 -328 -255 -133 112 -173 159 139 63 -124 -79 -109 -41 202 -47 -80 181 356 -177 -75 -34 -83 -56 51 -81
4260 -81 -209 75 -4 -64 167 -25 -108 -183 -27 312 13 -297 -20 61 -7 116 -30 -70 -71 19 -219 47 159 15
4284 15 -35 70 140 -127 -19 70 32 -39 146 57 -142 -27 312 62 -62 -114 -217 -64 157 -75 -242 11 105
4307 105 74 21 -38 -56 -189 -151 -83 6 32 196 -7 -124 177 -29 -92 115 117 -143 -7 306 18 -223 -108 156
4331 156 -76 -236 -2 -84 172 89 -14 128 -90 -208 52 99 202 -137 -342 54 25 5 46 33 -19 122 -59
4354 -59 108 -3 121 155 -69 176 125 -38 -242 221 46 -116 -329 25 122 -127 -44 142 111 -18 -110 -234
4376 -234 164 -75 -75 -25 -57 -222 -196 -29 1 -138 -15 -78 209 243 17 93 -70 119 -93 -109 -85 70 183 6
4400 6 -201 24 31 -59 18 272 -99 79 31 -102 -154 -107 -161 78 306 -213 125 75 38 12 -17 -134 -73 78 -262
4425 -262 203 15 -50 -3 163 146 109 -73 -29 31 -28 -240 145 79 -215 124 -19 -96 121 -264 -181 14 -2 -178
4449 -178 299 144 41 -118 185 301 53 -97 -71 85 146 16 -112 94 -211 -110 -114 65 89 -140 -40 -35
4471 -35 -85 130 -187 49 -88 -124 -42 -44 58 57 -204 -99 172 207 195 -142 -8 35 -134 -124 83 -248 -291 -83
4495 -83 -8 63 66 -44 -111 6 -83 -165 -98 148 -126 -37 -95 -31 267 -98 -99 167 40 -52 -96 -34 68 -116 -88 169
4521 169 -8 48 -2 13 118 -28 -21 -24 180 124 -173 19 6 -12 -59 -42 29 86 100 -15 -88 -240 -120 111 153 -37
4547 -37 -197 10 61 191 -172 28 81 -36 -139 -8 18 131 -100 -301 -73 168 4 -145 28 -106 105
4568 105 -43 -59 142 -238 140 70 83 121 42 -172 -20 302 77 0 -11 117 -248 -115 147 61 3 -122 57
4591 57 -24 30 10 123 -77 -232 -64 76 38 99 115 -135 197 -115 -109 145 -10 14 -26 -57 176 3 16 -200
4615 -200 -25 -50 82 -96 33 -17 124 -81 -124 241 65 -228 -16 58 71 162 -63 -39 88 35 -75 54 102
4638 102 -45 -62 -76 74 183 63 106 -28 -106 26 73 -59 190 -163 27 75 69 -29 -117 82 -199 132 101 314
4662 314 98 132 13 -33 66 -84 -30 -10 126 -8 63 12 -89 -62 -230 32 67 -52 -204 128 -155 -16 64
4685 64 -26 -31 14 -202 1 -74 -187 17 81 -26 75 76 -32 237 100 -218 -114 -5 -63 -221 31 -31 57 -119
4709 -119 -90 -182 35 20 -20 184 124 69 -154 29 355 -37 -198 -5 -49 -20 -337 74 -177 32 66 -131 -78
4732 -78 62 -275 -87 -128 -43 78 -174 217 75 139 23 -104 -29 57 -89 49 -62 113 -119 81 -174 41
4754 41 -160 -119 209 65 -77 -171 -92 116 -140 -16 -107 -157 12 5 4 88 68 -95 -20 -18 20 -90 -137 -104 -71 127
4780 127 12 -129 57 -44 49 80 -111 -82 133 -52 -70 121 -91 83 56 67 12 105 141 -134 131 178 37
4803 37 -291 -6 57 162 193 -70 -131 -14 -61 -59 214 -115 -88 -52 73 2 69 52 -112 163 192 18 -100 9
4827 9 -29 -149 -5 -51 -144 47 -4 25 148 -20 85 265 83 -29 -91 -328 268 10 44 -107 70 146 -91
4850 -91 -11 39 8 45 -61 -1 45 -24 -52 150 251 20 -44 -119 57 63 -21 75 215 143 -25 -91 -167 -14 0 -64 99
4877 99 235 -21 181 144 181 22 -372 -119 272 112 -17 -118 181 -66 -37 67 52 67 -83 -207 97 64
4899 64 -48 12 148 19 87 -1 2 41 22 -124 52 -24 26 -10 55 -20 -156 11 9 -88 -124 -46 24 -35 -129 -22 133
4926 133 262 -17 -36 -204 -7 27 265 124 68 -54 -109 -171 57 83 45 -45 43 161 -323 -57 237 -8 -165
4949 -165 18 31 -88 7 54 81 -146 159 125 -57 11 41 -44 -58 -2 25 -262 -168 -105 22 -210 101 32 106 -142
4974 -142 -2 3 -162 -63 2 20 2 -158 -128 93 128 -92 76 -73 80 122 -4 58 -242 31 -79 -108 -47 -9
4998 -9 -255 -71 -71 211 37 124 -16 -73 153 -40 -27 -15 -147 323 46 44 30 -88 -47 232 51 138 -220 -279 13
5023 13 -47 49 11 -110 -138 -101 201 48 -154 8 -65 179 49 70 26 104 -8 40 -134 5 -98 71 14 41
5047 41 4 40 223 120 -81 -129 4 -145 -122 36 178 156 -38 -15 125 -34 15 29 -87 82 -237 -8 70
5070 70 28 34 113 -71 -64 -80 2 -79 160 93 -22 65 -150 15 -54 -24 73 -75 8 79 112 127 66 -59 -102 -37 88
5097 88 -251 62 175 90 39 -12 26 53 -301 -172 103 154 136 9 -88 -16 223 -242 -38 -161 213 15 -109
5120 -109 -195 104 -113 -149 -137 -13 23 -50 84 50 93 -3 -65 172 89 -56 -69 -69 -110 -200 -34 24 94 -63 50 223
5146 223 294 -206 -141 82 56 -5 -118 91 160 -133 -295 -281 24 25 112 129 57 41 -135 77 -5 143 87 78 37 -2
5172 -2 -27 -76 141 33 139 -21 -146 -68 15 66 -14 45 -192 12 -11 -5 14 -15 160 146 -143 -5 -89 -72 -76 87
5198 87 -87 -146 -18 -39 104 -75 -58 105 -7 240 -26 -4 338 31 -48 -38 -111 -90 20 -53 -135 47 0 -151
5222 -151 -192 117 -90 -82 -39 87 132 202 -146 14 -49 52 39 -98 29 28 -58 -86 -121 135 -73 -166 -148 111 94
5247 94 -224 -34 82 -158 -90 70 22 132 -17 54 156 23 -162 16 -47 -121 22 -9 -131 -231 178 -40
5269 -40 -120 52 10 -56 -108 193 96 18 170 -47 -104 -13 153 -55 -30 21 121 -42 29 145 12 -85 54 -54
5293 -54 -183 125 -165 254 -70 -80 -37 29 -16 -175 51 -124 -40 181 -16 82 130 50 67 89 -321 159 259 -188
5317 -188 49 -29 -51 217 263 34 168 -123 -184 -25 -32 -35 -54 -280 3 49 -23 -265 -126 140 0 -147 42 187
5341 187 202 20 49 131 164 -127 -59 85 -124 -60 -160 97 86 1 -38 -50 -40 0 -2 -64 -62 -59 106 -76 -18 126 6
5368 6 -149 70 88 -136 -144 37 -152 47 164 -328 -38 -36 -98 109 31 71 66 100 77 44 -78 24 93 -23 -60 -143
5394 -143 -83 22 5 28 73 44 -106 77 -189 45 -38 36 197 23 7 8 -59 49 37 117 171 26 -43 48 51 53 279
5421 279 -142 -99 3 -94 -9 94 30 5 -56 -20 162 -164 -4 39 197 87 103 -192 65 -132 -152 26 -23 -42
5445 -42 -104 -183 -99 183 88 -44 -31 -17 48 42 153 217 -125 -96 -116 -74 -155 229 56 0 -166 -4 -90 -111 -39 49 37
5472 37 -106 -71 -3 50 -29 150 -114 -147 -102 -132 -129 -71 -39 122 -87 -183 -11 -35 97 -4 -102 53 111 -66 -28 51
5498 51 -106 15 -95 -203 17 -93 -73 186 158 176 -18 11 -77 -87 -165 80 37 -33 178 -22 22 62 -85 35
5522 35 123 151 0 -79 -107 -72 102 -62 -233 -117 -59 -94 28 110 208 75 -232 204 -24 123 216 -197 112 -81
5546 -81 7 261 91 -40 5 -10 -113 40 89 37 -76 21 -133 -74 152 99 159 141 149 148 16 82 -16 -58 -3 15 169
5573 169 -38 -99 -23 123 -244 217 158 108 21 -21 41 61 -101 -109 78 -103 21 -80 -69 1 -8 -42 85 -72 -163
5598 -163 -4 -11 -191 94 -137 -242 203 3 -150 -194 -45 102 134 -59 114 236 218 107 121 183 -31 17 -151
5621 -151 226 41 -23 128 69 120 -17 -73 -24 135 88 130 -30 124 -71 137 32 -13 183 -51 -58 -93 48 29
5645 29 6 64 -140 -144 -178 -17 12 99 88 11 210 138 0 -25 154 -98 -165 40 -17 -128 -9 -111 67 140 -198
5670 -198 27 39 35 -190 97 -12 4 49 41 -126 25 14 -188 33 -16 57 116 -69 -183 -56 -105 44 284 -40
5694 -40 110 87 -150 107 -142 -99 -2 -135 -4 -30 82 6 -48 120 155 189 -80 18 -175 -216 -54 -24 -245 -19
5718 -19 -92 -177 323 16 -21 -13 34 -113 38 -156 18 129 9 -90 -60 -107 100 88 133 90 271 -110 -30 1 124
5743 124 -2 78 -30 20 -11 168 -121 227 -10 127 -42 346 137 -31 -50 -22 192 -390 -54 -96 119 -162
5765 -162 160 -131 114 9 19 -77 100 -22 -2 -1 91 113 -15 -137 -59 246 -91 -77 68 -109 29 -32 -211
5788 -211 308 74 -194 -57 16 12 115 -219 -61 -163 -295 -27 163 -131 -79 33 150 -122 -218 43 180 49
5810 49 -35 -144 -39 96 30 -44 31 28 -21 177 -85 -114 40 -7 158 -79 99 -157 144 61 -91 -48 -6 187
5834 187 101 -183 -51 73 -100 -9 -43 -87 -97 -177 -54 -126 -134 -170 97 -15 100 -17 -112 262 20 -17 138 -23
5858 -23 53 4 37 -53 -15 37 -124 7 74 -88 13 -101 -40 -43 -77 16 71 54 67 8 -70 54 -10 23 -18 -65 29 -254
5886 -254 -76 -70 9 -31 31 192 -18 -56 61 105 -130 -181 -207 162 -53 -76 37 6 19 -207 -97 -85 -77 36 -170
5911 -170 -60 9 5 -39 -86 -41 15 154 -63 20 -31 118 -121 125 83 90 -95 161 -78 25 -1 -82 42 80 24
5936 24 28 61 94 -59 54 153 -5 138 100 96 58 -71 -76 139 -149 -60 72 -106 -110 -119 168 273 -131 -43 -153 15
5962 15 -155 -136 122 -75 193 -2 -128 231 31 -218 -71 15 27 27 -53 -96 18 -84 -41 258 158 -52 42
5985 42 -107 153 55 -105 -136 -183 -124 132 -155 156 101 138 191 -201 -262 67 -75 -14 157 -101 -145 -35 148 27
6009 27 57 16 85 3 4 -124 -18 42 5 -207 -86 55 39 -204 68 -76 98 -51 -211 -132 62 84 -240 -157
6033 -157 -28 -176 -98 90 -28 39 -119 90 74 159 -109 14 11 -99 77 139 -80 1 351 11 -239 -75 -31
6056 -31 -45 144 106 67 37 35 -44 -164 -177 -65 161 71 33 10 -221 14 -32 88 179 147 124 -34 -88 -54 51 141
6082 141 -27 -70 25 179 -18 14 -22 -4 85 -264 88 -5 220 139 185 -34 130 -143 92 165 -7 120 152 -14
6106 -14 81 -79 -6 104 46 93 -115 71 17 46 -175 142 -137 2 -145 55 109 -92 216 82 -174 218 -152
6129 -152 -72 -71 92 -155 28 37 85 -22 -245 -23 28 -1 -11 -91 10 34 143 -27 -61 260 -68 147 -4 -46
6153 -46 221 176 -59 -73 45 -91 135 -68 150 70 135 145 -29 11 24 -98 -110 124 42 -164 -262 -91 -14 -59
6177 -59 5 -101 70 -51 119 121 17 -97 8 -176 -5 95 -158 -45 85 27 88 -26 -157 -42 75 -127
6199 -127 10 -116 174 42 -164 -17 -77 56 -42 -140 248 30 -40 203 23 79 -197 -72 -171 -22 -217 -54
6221 -54 54 -145 -191 -41 -43 43 -160 -123 -55 190 121 39 27 191 -74 -89 179 28 -140 -113 59 157 50 99 -125
6246 -125 144 -18 -85 109 -146 83 -39 -142 -191 34 -126 -101 -282 -36 84 -219 -81 101 -19 -10 -45 160
6268 160 -42 -216 -183 175 34 -152 167 -9 212 166 25 -24 47 -48 -25 -39 -148 -104 66 -152 -80 -86 -51 68
6292 68 58 -232 -22 -94 169 26 -40 1 221 -2 -41 74 -24 52 3 79 84 12 202 36 59 -17 24 -31 -84 102
6318 102 -174 -267 -48 -240 -18 -83 -201 27 -102 -20 101 63 33 121 -40 11 -69 -75 -46 11 24 147 2 -39 -32
6343 -32 68 61 -39 132 21 -30 53 238 -50 -237 119 -84 -100 -141 18 -68 158 -83 -118 356 -115 51 3
6366 3 36 152 217 -100 23 57 -217 115 -84 108 75 298 -167 66 212 -15 62 125 -56 45 142 -37 -143
6389 -143 -87 -135 3 -260 -4 -8 -30 98 95 -45 -48 -204 -74 152 -49 -102 60 -105 -61 306 -64 84 -114 259
6413 259 223 104 -83 -122 47 -75 -136 -103 79 51 -74 213 -87 -36 -84 253 133 -255 68 36 57 36 24 -67
6437 -67 -154 -63 63 63 40 -21 48 70 125 128 118 121 269 18 -51 -37 133 151 -57 -239 -51 48 1 9 184 -9 117
6464 117 -76 -72 105 -48 -1 -191 -59 -122 58 14 96 32 -229 -91 167 -138 -233 35 82 -52 91 -186 92
6487 92 -104 -76 15 34 99 -151 -59 67 84 -54 -203 -105 -87 -104 -166 111 17 -106 -25 -181 -37 -67 2 -112 -100
6512 -100 17 8 -67 -206 11 88 -69 177 2 -157 -41 -55 -23 -42 -55 -19 -53 -112 -4 129 24 241 0 -73
6536 -73 -75 83 -11 73 25 204 57 180 -110 -17 -90 -103 -68 198 -61 3 -75 -104 18 -57 57 154 -86 -27 -29 -91
6562 -91 133 -98 -59 -28 85 -141 59 96 -54 199 -102 -9 22 112 261 54 -4 -83 162 178 145 -161 152 150
6586 150 61 -14 130 22 97 136 -118 193 -122 52 42 -58 59 74 -19 -120 -33 137 -29 -106 117 134 45 40
6610 40 75 -32 104 136 120 52 -209 -127 66 24 -82 -76 -68 -190 17 -79 25 -254 98 -195 156 -188 -112 140
6634 140 -70 101 -43 -123 -303 -101 -29 209 -65 51 57 -373 -43 -79 144 76 76 135 24 -61 -118 79 142 -54
6658 -54 -1 -240 -13 -7 -144 -16 157 -81 -105 -62 -130 91 202 -167 50 60 206 -13 -52 255 1 -28 24 70
6682 70 -36 -13 151 -163 -22 -96 -81 21 -174 -9 -91 -183 -53 2 -58 -11 -6 -127 21 178 237 5 158 158 -19
6707 -19 -79 -21 -153 -32 -16 58 196 41 137 -181 -119 -273 65 32 -50 -105 138 -16 -99 4 91 -47 31 76 -231
6732 -231 -13 -131 301 128 75 -40 -135 329 -185 -8 -17 -142 44 -25 -207 24 7 -67 -24 -30 32 -45 -5 -14 83
6757 83 -292 -119 3 82 -43 -5 46 229 -22 -158 -27 21 264 -232 -69 183 69 52 134 -137 3 66 -139
6780 -139 -155 -43 23 31 -12 46 -127 57 186 23 111 -175 -275 73 196 2 3 88 -43 -25 -163 -30 -12 9
6804 9 -162 77 112 5 -44 98 114 -108 47 105 -94 10 -125 -162 35 -68 96 -138 -28 -57 24 246 117
6827 117 65 118 -39 -108 41 -181 -37 -69 -97 68 -43 -107 4 151 -52 107 53 -72 131 -71 55 52 -38
6850 -38 -153 111 46 -6 -110 110 231 -107 -57 98 114 -164 -55 61 97 -46 -64 69 36 -77 158 -149 25
6873 25 -57 -88 57 38 -50 -99 40 42 -172 49 -63 117 -59 158 -21 -234 -35 -401 -133 -5 231 -69 119
6896 119 105 90 -160 -114 143 -165 44 28 111 63 -134 -184 -109 1 -130 -234 94 -103 -223 -66 -18 14 123
6919 123 203 -72 183 229 119 77 -60 -76 -56 32 -40 125 -46 11 -67 -93 -102 -50 167 112 -42 23 -337 -247 100
6944 100 5 64 -194 27 -109 -58 227 32 -200 -103 85 -47 -129 -140 36 64 -78 77 41 184 -256 134 -7
6967 -7 -173 -6 182 -84 159 32 34 60 66 56 -212 -82 -150 100 43 -23 94 -74 -8 120 64 -256 197 -45
6991 -45 -22 -30 -73 33 -221 59 -15 146 179 92 -119 -62 -169 -56 200 -248 26 -71 22 -197 134 -51 -35 120
7015 120 -106 30 64 40 49 6 -36 -59 -6 23 -73 28 37 51 49 37 73 275 -82 25 -39 111 328 54 -44 -122 4
7042 4 -2 -73 -21 -237 -10 -161 335 -35 33 46 19 126 48 14 92 -127 6 -81 -9 214 56 4 -96 53 57 15
7068 15 0 109 31 -123 -160 -95 -28 -104 -93 141 17 30 -149 14 -189 210 -50 68 90 123 -11 101 -46 72
7092 72 23 -97 9 -50 -122 -157 -11 100 -181 -34 -12 88 -12 -86 -236 -103 27 128 -16 42 -105 -85 119
7115 119 145 57 -70 -50 -82 -26 -110 -45 165 141 130 -13 -3 61 15 -145 -140 7 69 113 75 -6 115 -156 -228 26
7141 26 -22 -102 -102 -133 -35 -280 167 -297 -86 97 32 19 -152 -141 -48 135 -53 -90 -103 -77 95 7 -115 236 34
7166 34 142 -143 53 177 -11 -34 156 26 -70 -68 62 50 -80 -188 -269 -153 -166 104 36 -53 -128 8 -4 -158
7190 -158 -25 -63 -142 -121 133 49 26 54 -17 46 98 9 5 98 74 35 -2 220 -73 95 -5 38 106 -242 -136 -168
7216 -168 -71 -158 255 58 -263 64 -5 9 19 -27 -41 -314 1 2 100 186 -70 54 -71 -134 229 -30 118 -121
7240 -121 -315 36 8 111 -79 -244 -258 111 -209 243 -82 -41 265 -65 47 59 -12 42 -59 -24 -70 89 104
7263 104 132 142 -232 -40 -98 -165 -67 -67 -70 -15 -48 86 -79 107 -49 1 -226 -109 51 -26 122 94 34 58 -230
7288 -230 30 -63 -95 -179 43 55 -54 -92 139 -66 -123 90 -282 181 -80 26 27 -152 157 22 191 -90 -84
7311 -84 31 -55 -42 -33 -141 -69 -64 -52 32 -21 75 -69 175 -21 66 -31 211 -23 -3 157 23 65 -36 140 -127
7336 -127 140 11 -18 -12 -12 -27 -35 78 -1 -76 -19 -24 -121 -229 246 57 -186 -77 -13 -22 -43 -72 3 12 -1 56 116 -84
7364 -84 -83 18 -139 -186 -218 6 -22 98 44 63 52 -90 -105 67 -89 91 40 -62 0 -3 -26 7 118 18 214
7389 214 178 128 219 123 43 -52 -170 232 70 52 21 -58 268 176 -22 -113 33 110 67 -5 -152 79 33 -20 20 125
7415 125 116 -102 115 65 -70 13 0 26 42 -139 -68 110 78 -98 -66 -172 21 -19 107 208 4 -188 -13 8
7439 8 103 -6 -119 85 -125 60 124 -116 -35 2 53 10 52 104 -162 -92 35 -139 143 -10 -161 -91 -177 16
7463 16 231 -59 -61 173 -58 99 -231 95 36 -63 30 -58 34 -23 -87 -29 -230 -25 43 -256 -214 -239 -216 74 -86
7488 -86 -188 -193 104 25 114 166 9 26 146 116 -19 188 76 -49 -97 -8 12 -208 87 87 -185 70 -228 -70
7512 -70 -7 41 -125 66 -111 230 84 -204 -19 -45 -106 -21 11 -97 76 69 97 -26 -9 47 40 -183 29 69 -81
7537 -81 -64 61 -118 76 20 -97 53 -44 -25 226 -124 -97 -52 -78 52 -35 -252 -160 54 90 -119 53 114 76
7561 76 57 -102 -118 43 58 46 14 189 -23 70 100 37 -250 104 17 -75 -88 -2 133 167 51 1 -279 -243 130
7586 130 -36 164 -265 119 14 -17 69 -163 -94 102 -154 -94 -40 -200 16 78 83 21 -13 -158 -36 145 57 57
7610 57 -10 155 -142 -50 2 -49 -142 23 116 23 63 76 -319 -111 -35 -6 -14 -41 -108 -8 -69 -89 -138 33 233 -107
7636 -107 -43 -111 -20 -71 -155 43 -73 -48 18 12 -103 162 68 37 119 39 3 -32 -80 -178 97 -22 225 -84 15 -10
7662 -10 31 -146 10 -13 74 -201 -99 -162 -77 -363 66 42 -235 -128 72 -215 203 79 -47 -101 109 -71 65
7685 65 -195 13 40 -161 -170 -28 13 -23 -163 15 -180 87 -173 28 -89 -68 165 -147 -86 -173 -118 -123 -17 -32
7709 -32 241 157 111 -176 40 -22 -55 102 6 -43 308 -30 96 234 -27 -13 42 198 -14 -16 107 -209 -81 -77
7733 -77 37 -147 -88 187 150 -36 -134 214 -124 -81 57 -270 49 70 -22 123 100 -61 -36 -23 50 44 -155 -63 41
7758 41 92 -90 63 -153 -192 13 -59 72 70 -80 -78 36 32 -80 156 24 -54 -71 -59 82 42 -133 97 -57 -43
7783 -43 -66 -105 182 118 87 59 -33 13 247 -20 1 152 -52 85 -45 1 -55 -71 38 54 -41 53 -1 -66 22 -21
7809 -21 99 -11 190 -130 105 -71 217 60 -98 -36 50 -127 35 157 -34 73 157 19 -4 -93 -16 -138
7831 -138 -142 79 -184 53 20 189 -104 76 112 116 -125 104 -43 -38 -78 -126 -36 -58 -149 -163 -9 -14 -205 82 204
7856 204 20 -77 31 144 155 -20 67 195 -67 158 103 73 178 80 22 -210 -104 33 85 58 -164 230 -62
7879 -62 14 4 34 -133 -103 191 -53 -76 -142 199 115 19 152 3 118 -82 -154 -312 -132 -39 113 39 56 -64
7903 -64 -123 88 -14 102 -169 -3 -60 138 -81 45 103 -70 -195 -139 -117 -73 153 92 -173 -72 65 -48 95
7926 95 -114 3 34 54 -15 43 -99 252 8 65 -148 161 -84 -3 -9 22 -111 -10 127 -101 -288 -101 -110 -63
7950 -63 1 37 29 116 140 -55 330 165 -161 -18 81 37 -24 16 26 -66 36 122 175 -69 -156 -20 71 -61 6 -24
7976 -24 -42 13 -295 -136 99 57 -50 -46 56 -204 -168 -207 125 -169 -16 65 63 73 17 -39 -63 -16 -59 4 -33 2 84
8003 84 15 -7 102 -133 -60 31 122 -76 -110 -26 -43 -134 -165 -13 226 -33 14 -17 -50 121 111 -39 -44 60 -128 -16
8029 -16 276 -168 -127 122 -9 -5 37 -125 -91 194 173 144 71 -310 28 -10 81 -19 -129 93 156 -229 2 70
8053 70 133 -114 -54 -60 25 27 -20 -3 10 56 -26 3 30 57 107 218 17 87 -252 20 -158 -15 106 24 -195 -130 30
8080 30 56 -117 -7 -135 9 52 33 87 -39 108 65 -166 -186 -154 -63 -28 62 -81 109 -4 -27 -152 -19 -103
8104 -103 47 -94 219 31 250 -32 -140 -273 291 0 145 -90 64 -8 -37 304 123 79 -25 180 -13
8125 -13 -97 -172 7 -19 58 154 -57 -133 -94 179 101 -129 -89 6 22 104 -14 93 51 3 -12 166 165 -22 227 26
8151 26 -46 -79 -23 124 80 -156 -3 116 40 84 -38 4 -205 87 1 -21 -23 -50 60 -47 -112 -8 41 -3 -70 16
8177 16 -98 97 95 -101 -90 52 94 23 -27 21 -60 -19 98 113
8191A13
##END NTUPLES=NMR FID
##END=
