##TITLE=1H_Pr 40m
 CDCl3
 8 sc, 
 27.06.2022
##JCAMPDX= 6.0         $$ Bruker NMR JCAMP-DX V2.0
##DATA TYPE= NMR FID
##DATA CLASS= NTUPLES
##ORIGIN= UXNMR, Bruker Analytische Messtechnik GmbH
##OWNER= root
$$ XWIN-NMR		Version 3.5
$$ Mon Jun 27 15:42:50 2022 Russian Standard Time (UT+4h)  she@DPX200
##.OBSERVE FREQUENCY= 200.1313499994
##.OBSERVE NUCLEUS= ^1H
##.DELAY= (6, 6)
##.ACQUISITION MODE= SIMULTANEOUS
##.ACQUISITION SCHEME= undefined
##.AVERAGES= 8
##.DIGITISER RES= 18
##SPECTROMETER/DATA SYSTEM= spect
##.PULSE SEQUENCE= zg30
##.SOLVENT NAME= CDCl3
##.SHIFT REFERENCE= (INTERNAL, CDCl3, 0, 15.7039)
##AUDIT TRAIL= $$ (NUMBER, WHEN, WHO, WHERE, WHAT)
$$ ##TITLE= Audit trail, XWIN-NMR		Version 3.5
$$ ##JCAMPDX= 5.01
$$ ##ORIGIN= Bruker BioSpin GmbH
$$ ##OWNER= she
$$ F:/spectra/data/she/nmr/H-F/1/audita.txt
$$ ##AUDIT TRAIL=  $$ (NUMBER, WHEN, WHO, WHERE, WHAT)
(   1,<2022-06-27 15:41:22.78 +0400>,<she>,<DPX200>,
      <created by zg, POWCHK disabled, PULCHK disabled
       configuration hash MD5:
       00 E9 B6 7A A2 85 ED C7 34 08 36 98 17 FE 4E 26
       data hash MD5: 16K
       F1 18 13 CE 6A 05 D2 6C CD 6E C4 20 C9 28 CF A7>)
$$ ##END=
$$ 
$$ hash MD5
$$ A1 FB 9C D4 12 0A C3 5A 84 E6 7B A2 F8 EE 15 B3
##$RELAX= 
##$RELAX= 
##$RELAX= 
##$RELAX= 
##$RELAX= 
##$RELAX= 
$$ Bruker specific parameters
$$ --------------------------
##$DU= <F:/spectra>
##$EXPNO= 1
##$NAME= <H-F>
##$PROCNO= 1
##$TYPE= <nmr>
##$USER= <she>
##$AMP= (0..31)
100 100 100 100 100 100 100 100 100 100 100 100 100 100 100 100 100 100 
100 100 100 100 100 100 100 100 100 100 100 100 100 100 
##$AQSEQ= 0
##$AQ_mod= 1
##$AUNM= <au_zg>
##$AUTOPOS= <>
##$BF1= 200.13
##$BF2= 200.13
##$BF3= 200.13
##$BF4= 200.13
##$BF5= 200.13
##$BF6= 200.13
##$BF7= 200.13
##$BF8= 200.13
##$BYTORDA= 1
##$CFDGTYP= 0
##$CFRGTYP= 5
##$CHEMSTR= <none>
##$CNST= (0..31)
1 1 145 1 1 1 1 1 1 1 1 1 1 1 1 1 1 1 1 1 1 1 1 1 1 1 1 1 1 1 1 1 
##$CPDPRG= <>
##$CPDPRG1= <>
##$CPDPRG2= <>
##$CPDPRG3= <>
##$CPDPRG4= <mlev>
##$CPDPRG5= <mlev>
##$CPDPRG6= <mlev>
##$CPDPRG7= <mlev>
##$CPDPRG8= <mlev>
##$CPDPRGB= <>
##$CPDPRGT= <>
##$D= (0..31)
0 1.2 0 0 0 0 0 0 0 0.06 0 0.03 0 0 0 0 0.0002 0 0 0 0 0 0 0 0 0 0 0 0 
0 0 0 
##$DATE= 1656330082
##$DBL= (0..7)
120 120 120 120 120 120 120 120 
##$DBP= (0..7)
150 150 150 150 150 150 150 150 
##$DBP07= 0
##$DBPNAM0= <>
##$DBPNAM1= <>
##$DBPNAM2= <>
##$DBPNAM3= <>
##$DBPNAM4= <>
##$DBPNAM5= <>
##$DBPNAM6= <>
##$DBPNAM7= <>
##$DBPOAL= (0..7)
0.5 0.5 0.5 0.5 0.5 0.5 0.5 0.5 
##$DBPOFFS= (0..7)
0 0 0 0 0 0 0 0 
##$DE= 6
##$DECBNUC= <off>
##$DECIM= 32
##$DECNUC= <off>
##$DECSTAT= 4
##$DIGMOD= 1
##$DIGTYP= 9
##$DL= (0..7)
0 120 120 120 120 120 120 120 
##$DP= (0..7)
150 150 150 150 150 150 150 150 
##$DP07= 0
##$DPNAME0= <>
##$DPNAME1= <>
##$DPNAME2= <>
##$DPNAME3= <>
##$DPNAME4= <>
##$DPNAME5= <>
##$DPNAME6= <>
##$DPNAME7= <>
##$DPOAL= (0..7)
0.5 0.5 0.5 0.5 0.5 0.5 0.5 0.5 
##$DPOFFS= (0..7)
0 0 0 0 0 0 0 0 
##$DQDMODE= 0
##$DR= 18
##$DS= 0
##$DSLIST= <SSSSSSSSSSSSSSS>
$$ [...]
##$SUBNAM2= <"">
##$SUBNAM3= <"">
##$SUBNAM4= <"">
##$SUBNAM5= <"">
##$SUBNAM6= <"">
##$SUBNAM7= <"">
##$SUBNAM8= <"">
##$SUBNAM9= <"">
##$SW= 18.0517283424941
##$SWIBOX= (0..15)
0 0 2 0 0 0 0 0 0 0 0 0 0 0 0 0 
##$SW_h= 3612.71676300578
##$TD= 16384
##$TD0= 1
##$TE= 0
##$TE2= 300
##$TE3= 300
##$TEG= 300
##$TL= (0..7)
0 120 120 120 120 120 120 120 
##$TP= (0..7)
150 150 150 150 150 150 150 150 
##$TP07= 0
##$TPNAME0= <>
##$TPNAME1= <>
##$TPNAME2= <>
##$TPNAME3= <>
##$TPNAME4= <>
##$TPNAME5= <>
##$TPNAME6= <>
##$TPNAME7= <>
##$TPOAL= (0..7)
0.5 0.5 0.5 0.5 0.5 0.5 0.5 0.5 
##$TPOFFS= (0..7)
0 0 0 0 0 0 0 0 
##$TUNHIN= 0
##$TUNHOUT= 0
##$TUNXOUT= 0
##$USERA1= <user>
##$USERA2= <user>
##$USERA3= <user>
##$USERA4= <user>
##$USERA5= <user>
##$V9= 5
##$VALIST= <valist>
##$VCLIST= <CCCCCCCCCCCCCCC>
##$VD= 0
##$VDLIST= <DDDDDDDDDDDDDDD>
##$VPLIST= <PPPPPPPPPPPPPPP>
##$VTLIST= <TTTTTTTTTTTTTTT>
##$WBST= 1024
##$WBSW= 4
##$XGAIN= (0..3)
0 0 0 0 
##$XL= 0
##$YL= 0
##$YMAX_a= 273577
##$YMIN_a= -275200
##$ZGOPTNS= <>
##$ZL1= 120
##$ZL2= 120
##$ZL3= 120
##$ZL4= 120
##$ABSF1= 10
##$ABSF2= 0
##$ABSG= 5
##$ABSL= 3
##$ALPHA= 0
##$AQORDER= 0
##$ASSFAC= 0
##$ASSFACI= 0
##$ASSFACX= 0
##$ASSWID= 0
##$AUNMP= <proc_1d>
##$AZFE= 0.1
##$AZFW= 0.1
##$BCFW= 1
##$BC_mod= 2
##$BYTORDP= 1
##$COROFFS= 0
##$CY= 11.3945322036743
##$DATMOD= 1
##$DC= 2
##$DFILT= <>
##$DTYPP= 0
##$F1P= 2.36226072786647
##$F2P= -0.459571619588291
##$FCOR= 0.5
##$FTSIZE= 0
##$FT_mod= 4
##$GAMMA= 1
##$GB= 0.15
##$INTBC= 1
##$INTSCL= 1
##$ISEN= 128
##$LB= 0.24
##$LEV0= 0
##$LPBIN= 0
##$MAXI= 10000
##$MC2= 0
##$MEAN= 0
##$ME_mod= 0
##$MI= 1.114404
##$NCOEF= 0
##$NC_proc= 0
##$NLEV= 6
##$NOISF1= 3.799351
##$NOISF2= 2.8
##$NSP= 1
##$NTH_PI= 0
##$NZP= 0
##$OFFSET= 15.70392
##$PC= 1
##$PHC0= -18047.17
##$PHC1= 10.80069
##$PH_mod= 1
##$PKNL= yes
##$PPARMOD= 0
##$PSCAL= 0
##$PSIGN= 0
##$REVERSE= no
##$SF= 200.130013532006
##$SI= 16384
##$SIGF1= 3
##$SIGF2= 2
##$SINO= 400
##$SIOLD= 16384
##$SREGLST= <1H.CDCl3>
##$SSB= 0
##$STSI= 0
##$STSR= 0
##$SW_p= 3612.71676300578
##$SYMM= 0
##$S_DEV= 0
##$TDeff= 0
##$TDoff= 0
##$TI= <>
##$TILT= no
##$TM1= 0
##$TM2= 0
##$TOPLEV= 0
##$USERP1= <user>
##$USERP2= <user>
##$USERP3= <user>
##$USERP4= <user>
##$USERP5= <user>
##$WDW= 1
##$XDIM= 8192
##$YMAX_p= 0
##$YMIN_p= 0
$$ End of Bruker specific parameters
$$ ---------------------------------
##NTUPLES= NMR FID
##VAR_NAME=  TIME,          FID/REAL,        FID/IMAG
##SYMBOL=    X,             R,               I
##VAR_TYPE=  INDEPENDENT,   DEPENDENT,       DEPENDENT
##VAR_FORM=  AFFN,          ASDF,            ASDF
##VAR_DIM=   8192,          8192,            8192
##UNITS=     SECONDS,       ARBITRARY UNITS, ARBITRARY UNITS
##FACTOR=    0.0002768,     1,               1
##FIRST=     0,             0,               0
##LAST=      2.2672688,     0,               0
##MIN=       0,             -275200,         0
##MAX=       2.2672688,     273577,          0
$$ Real data points
##PAGE= N=1
##DATA TABLE= (X++(R..R)), XYDATA
$$ [...]
3014B586n42p680J0727n512l064R417r048K080M430p757O884k173l621Q340q259
3029c192J145O695j0034O620K506q396Q036l516l372P209p009M047K999q682Q734
3044C790k755o484J0498o350r36P220p875L500J205o265Q107m894j467Q685r868
3059c889K946N236j0199P361P50n941P398n118l9N149q478O854P48p974J0130
3074D934m492n135R275o921R32N076o883N839k024m760Q575o843L52P945r823
3089c953M338L188q398O663j666l018P026p110K801L390r116Q409o20o733R836
3104E037n206k814O987p188L230K547n972P481m431l286Q967q978K189O654r342
3119d125N490R13o372O769m397k15O139q108N206J550q744Q891k333n131R106
$$ plain form
3014 2586 2044 -5636 5091 -421 -3485 5932 -3116 -1036 3394 -4363 2521 348 -3273 5067 -3192
3029 -3192 -2047 4648 -5386 1234 3740 -4656 3380 -136 -3508 3701 -3308 739 3738 -4944 3790
3044 3790 1035 -5449 5049 -1301 -2237 4983 -2892 608 1813 -4452 3655 -1239 -2706 5979 -3889
3059 -3889 -943 4293 -5906 1455 2205 -3736 3662 -1456 -1495 3654 -4824 2030 2778 -5196 4934
3074 4934 442 -4693 4582 -2339 -1407 3669 -3214 2625 601 -4159 4416 -2427 -2075 5870 -3953
3089 -3953 385 3573 -4825 1838 172 -2846 4180 -2930 -129 3261 -5855 2554 1934 -4799 5037
3104 5037 -169 -2983 4004 -3184 46 2593 -3379 4102 -329 -3615 5352 -3626 -1437 5217 -4125
3119 -4125 1365 2278 -4094 2675 -1722 -1937 4202 -3906 1300 2850 -5894 2997 664 -4467 4639
3134D639n864r8M504p007N784q90m791R157o373j647P697q702K834M591p171N815
3150B478j589l749O203o552K320M842q924P287M41q186Q599l316l184P081o095
3165b344K636K265o608P033l489l232R130o908k57O543q571M051K060n558O730
3180C481m046j215N878q019L980L586q896P822q99n718P556n092l43N142o438
3195c221N010P9o317Q350m836k515Q203p274J881M474p405N170o79l957P002n798
3211a833Q12N401q407M732J884p121P381k328l362O300o053K135L034p178P106
3226B503j321n075Q104n722r54O204o828L660J956n811O385l451k208O877o777
3241b458K239M266q066N956j50n568P054m165q37N259o763L870J306o353P345
$$ plain form
3134 4639 -1225 -1323 3181 -3826 1958 1068 -3723 5434 -939 -2586 5111 -3591 -757 3834 -3337 2478
3150 2478 889 -2860 3343 -3209 -889 3953 -4971 2316 2757 -5429 3170 -146 -3330 3751 -2344
3165 -2344 292 2557 -4051 2982 -507 -3739 5391 -1517 -1774 4769 -3802 249 2309 -3249 3481
3180 3481 -565 -1780 4098 -3921 59 3645 -5251 2571 1672 -4046 3510 -1582 -1925 3217 -3221
3195 -3221 1789 1868 -4449 3901 -935 -3450 4753 -2521 -640 3834 -3571 1599 920 -3037 3965 -1833
3211 -1833 -1021 4380 -4027 705 2589 -4532 2849 521 -2841 3459 -2594 -459 2575 -4603 2503
3226 2503 1182 -3893 4211 -1511 -2465 3739 -3089 571 2527 -3284 3101 -350 -2558 4319 -2458
3241 -2458 -219 4047 -4019 1937 1787 -3781 3273 -892 -1729 3530 -3233 637 1943 -4410 2935
3256B935l000l419P583o215P45M416o691N189j05m755O983m805o99N983p463L570
3272B52K974o924O303k156l200O180n449J421M036p171N464m33n317P442m294
3287h72j612O053o539L016K319o085O335k258l307O644n603P87M617o968N018
3302A545K16n162O419l777r78N306o423K862K911o587O136j936l807O956n523
3317a842L64M698o615M612J84n008O615l717j583N966o433K638K973o430N701
3332B123j215l684O317m822J76M900o848M488M26n028N963l204j856N903o181
3347b542K097L205o295N330j013m094O585m752j98M916o593M162J110n312N838
3362B444k576k075N598n635J930L353o274N108p10m143O409m770k64N044o199
$$ plain form
3256 2935 -65 -3484 4099 -2116 -1371 3045 -3646 1543 1438 -3317 3666 -1139 -1838 4145 -3318 252
3272 252 3226 -3698 2605 449 -2751 3429 -2020 -599 3437 -3734 1730 1297 -4020 3422 -872
3287 -872 -2484 3569 -2970 46 2365 -3720 2615 357 -2950 3694 -1909 -1122 3495 -3473 1545
3302 1545 1761 -3401 3018 -759 -1737 3569 -2854 8 2919 -3668 2468 532 -3275 3681 -1842
3317 -1842 -1478 3220 -3395 1217 1401 -3607 3008 -709 -2292 3674 -2759 -121 2852 -3578 2123
3332 2123 908 -2776 3541 -1281 -1105 3795 -3053 1435 1861 -3167 2796 -408 -2264 3639 -2542
3347 -2542 -445 2760 -3535 1795 782 -3312 3273 -1479 -1677 3239 -3354 808 1918 -3394 2444
3362 2444 -132 -2207 3391 -2244 -314 3039 -3235 1873 1163 -2980 3429 -1341 -1605 3439 -2760
3377b760L414J364n610O173k723k643O089n567J695L085o042M782n68l730N993
3392B952m341j33M823o028L424J799n823N689j922k929O019n405J444L229o055
3407c257N106o99m039O099m436n96N209o220L029J734n272N543k504k186N734
3422C245n272J561L498o428M839q1m581O041l182j189M677n513K572J763m862
3437b912N595k505k885O098m907K99L902n566L870N77m159N083l692o73M883n741
3453b733L045K105n855N216j292l416N508l587O95L015n426M142l91m062O122
3468C086l536j507N643n731J756K202m807M633j435k322N147n216J162L752o238
3483c411L983J393n117N243k239j945M533m441K536J531n023N587k102l427O121
$$ plain form
3377 -2760 654 2018 -3592 2581 -142 -2785 3304 -2263 -568 2517 -3525 1257 689 -3041 2952
3392 2952 -1389 -1522 3301 -2727 697 2496 -3327 2362 440 -2489 3530 -1875 -431 2798 -3257
3407 -3257 1849 1150 -2889 3210 -1226 -1822 3387 -2833 196 1930 -3342 2201 -303 -2489 3245
3422 3245 -2027 -466 3032 -3396 1443 1362 -3219 2822 -360 -1549 3128 -2385 187 1950 -2912
3437 -2912 2683 178 -2707 3391 -1516 -1217 2685 -2881 989 1566 -2593 2490 -1202 -1875 3008 -2733
3453 -2733 312 2417 -3438 1778 486 -2930 2578 -1009 -314 2701 -2725 1417 1026 -3036 3086
3468 3086 -450 -1957 3686 -2045 -289 1913 -2894 1739 304 -2018 3129 -2087 -925 2827 -3411
3483 -3411 572 1965 -3152 2091 -148 -2093 2440 -2001 535 2066 -2957 2630 528 -2899 3222
3498C222m195l35M198m727K337O50l803M862l039p31N218o300K258K864o219M905
3514A165J3l828N054l237j91K840m743M278K22m419N898l014k648N653m462Q19
3530f00L188m256L621j521k528N025n030Q77N098o601L403J517n541M330r53j682
3546a653M259m180K019J500n925N765r45m046O813l618j868M436m480J813J487
3561A377l339M534k904j456M953n934J829M365n915L276J089m283L767k603J55
3576a089L209m347L850O7n378N658j642l673O296l356j71K555m266L363j363k081
3592b368N883m262n42M983o496K057L386m952L748n40k302L401m254J819K349
3607A910n106N393m26n148N532k514k361M637l302J821J164m026M603l220j478
$$ plain form
3498 3222 -973 -1308 2890 -1837 500 1150 -2653 2209 -830 -1561 3657 -2643 -385 2479 -3740 1165
3514 1165 1178 -2650 2404 -833 -1024 1816 -2927 1351 1573 -2846 3052 38 -2610 3043 -1419 -600
3530 -600 2588 -1668 1953 432 -2096 2929 -2101 -1224 3874 -2727 676 2193 -3348 982 29 -1653
3546 -1653 2606 -1574 445 1945 -3980 1785 840 -3206 3607 -11 -1879 2557 -1923 -110 1377
3561 1377 -1962 2572 -332 -1788 3165 -2769 -940 3425 -2490 786 1875 -2408 1359 -1244 -1089
3576 -1089 2120 -2227 1623 1690 -3688 1970 328 -3345 2951 -405 -576 1979 -2287 1076 -287 -2368
3592 -2368 3515 -747 -1289 3694 -2802 -745 2641 -2311 1437 897 -1405 1996 -2258 -439 1910
3607 1910 -3196 2197 1771 -3377 2155 -359 -2720 1917 -1385 436 1600 -2426 2177 -1043 -2521
3622b521O005n123R56M587o208K053J758l626L911j941J98K715n440L130J294
3637A748n733N752l50m040N046l204j104L328l556L441l94l278N148m226r26N599
3653C251n256J435L398m767K885p50k144L890l309J612L013o070M092L41n055
3668c434N210j020k551M140l332Q32Q28l637N068j825k919O115m886n38M536m776
3684b189K074K157l551L680k839n46L607n123L076K612n761M451l08m245M742
3699A837k355l60K998m142L403n83l924N700l220j747N815m628J20L117m801L618
3715H48l78j924M108m031N98L205n707L704J838n001M644j018k706L956l804J572
3731i6J747m401M676j314l435N382l506q33M464m645J941J474l805L898k150j210
$$ plain form
3622 -2521 3484 -1639 -683 3904 -2304 -251 1507 -2119 1792 -149 49 2764 -2676 454 1748
3637 1748 -3985 1767 1417 -2623 2423 -781 -1885 1443 -2113 1328 934 -2344 2804 -1422 -2348 3251
3653 3251 -2005 -570 2828 -1939 946 196 -1948 1942 -1367 245 3258 -2812 1280 1621 -3434
3668 -3434 1776 756 -1795 2345 -987 -155 673 -2964 2104 279 -2640 3475 -1411 -1949 2587 -2189
3684 -2189 -115 2042 -1509 2171 -668 -1214 2393 -2730 346 2958 -2803 1648 1340 -2905 1837
3699 1837 -518 -878 2120 -2022 1381 798 -3126 2574 -646 -2393 3422 -1206 -1086 2031 -2770 848
3715 848 470 -1454 2654 -1377 -779 2426 -3281 423 2261 -2740 1904 886 -1820 2136 -1668 -96
3731 -96 1651 -2750 1926 612 -2823 2559 -947 -1780 2684 -1961 -20 1454 -2351 1547 -603 -1813
3747a813M711m795J729K836n455L527N38l675M674k461p38L128m041K347J065
3762A577m434N051j613l055N202l976K91L004m238L236n09k932M448l024l89M170
3778B809m909K087K086m768M020q08k183M093l582Q61K561m639L352K84l457M461
3794B268k713j338M273m432K029J735m043L727j433k154M572l731K47L408m698
3809b283K917P49l725M282k672p10L932m415J930J980m375L915j046k586M524
3824B417l521K24L204m530L168J97l617M659k475j522M341m472J595K124m345
3839b553L675o78k639M372l318L05L185m543K951N33l843M650k047j646M164m246
3855a678J600J879m315L979q79k778M607l345K2L251m598K769P05l588M177k053
$$ plain form
3747 -1813 2898 -1897 -168 2668 -2787 740 1278 -2397 2277 -184 -922 2206 -1835 512 1577
3762 1577 -2857 2194 581 -2474 2728 -1248 -957 2047 -2191 1045 536 -2396 2052 -972 -1361 2809
3778 2809 -2100 -13 2073 -2695 1325 517 -1666 2427 -1155 -294 2267 -2372 980 1264 -2193 2268
3794 2268 -445 -1783 2490 -1942 87 1822 -2221 1506 73 -2081 2491 -1240 -993 2415 -2283
3809 -2283 634 1383 -2342 1940 -732 -1442 2490 -1925 5 1985 -2390 1525 479 -2107 2417
3824 2417 -1104 -880 2324 -2206 962 1159 -2458 2201 -274 -1796 2545 -1927 -332 1792 -2553
3839 -2553 1122 444 -2195 2177 -1141 -836 2349 -2194 757 1290 -2553 2097 50 -1596 2568 -1678
3855 -1678 -78 1801 -2514 1465 586 -2192 2415 -930 -908 2343 -2255 514 1219 -2369 1808 -245
3871b45j597M138m156J689K047m256L857p29k973M482l094j63L426m302K564Q34
3887A522m013M317j733k060M549m145J195K313m375L640l93k869M019l280q8L670
3903B269m834K913J175l918M123j761j874M450l941J128K053l948L536n72l113
3918b314M651k902n69L684m361K281J109l917L863j287j972L746l431J082K605
3933B268m982L550J62l283M150k264r42L350l841K294R84m399M360j181k250N014
3949B990l835k98L253l848K918n07k512L730l000j8L404m848K720J608m374L313
3965F96K98k721L625l017K38K708l649L105q11l209N011k281j730M161l692J471
3981B03J071l296L371o78k022L861m468J429L278n106L080Q17l817L635j813q74
$$ plain form
3871 -245 -1842 2296 -1860 -171 1876 -2380 1477 748 -2225 2257 -837 -1000 2426 -1876 688 1522
3887 1522 -2491 1826 93 -1967 2582 -1563 -368 1945 -2430 1210 817 -2052 1967 -1313 -1401 2269
3903 2269 -2565 348 1523 -2395 1728 -33 -1907 2543 -1398 -270 1783 -2165 1371 799 -2314
3918 -2314 2337 -565 -1134 2550 -1811 470 1579 -2338 1525 238 -1734 2012 -1419 -337 2268
3933 2268 -2714 836 998 -2285 1865 -399 -1341 2009 -1832 462 1446 -2953 1407 226 -2024 2990
3949 2990 -845 -1143 2110 -1738 1180 673 -1839 1891 -1109 -1127 2277 -2571 149 1757 -2617 696
3965 696 994 -1727 1898 -1119 -881 1827 -1822 1283 472 -2737 2274 -7 -1737 2424 -1268 203
3981 203 1274 -2022 1349 671 -1351 2510 -1958 -529 2749 -2357 723 1540 -2277 1358 -455 -1329
3997a329L316l623J929J034l800M012j275k890N236l058n41L189l531J732K78
4012F79k278L973k825o21L947m730J611K630m949L352L39k599L112k550M68J845
4028A404l589L371j99l637M717k319k207M442k643J31K060l096K807j269j713
4043a740M090l582N57L521n048K397J376l382K739r18q19K462l359J773J191l986
4059b728M204l35l611M288k150j607L544l006J583M12k144L520k813r50M457m251
4075a587J038L449m624J657J078k686K934j946P49K095m009K562P79m517M630
4090A602r68k525L944k375l29J409k655K897r89j787M254l299j082M187l920J109
4106e27K739l605K518j046j110K476l327K062K119m582L799J61m450M067j106
$$ plain form
3997 -1329 1987 -1636 293 1327 -2473 1539 264 -2626 2610 -448 -989 2200 -1331 401 679
4012 679 -1599 2374 -451 -1072 2875 -1855 -244 2386 -2563 789 1128 -1471 1641 -909 -441 1404
4028 1404 -2185 1186 987 -2650 2067 -252 -2459 1983 -660 -529 1531 -1565 1242 -27 -1740
4043 -1740 2350 -1232 -675 2846 -2202 195 1571 -1811 928 10 -809 1653 -1706 67 1258 -2728
4059 -2728 1476 1141 -2470 1818 -332 -1939 1605 -1401 182 594 -1550 1970 -843 -1793 2664 -1587
4075 -1587 -549 2900 -1724 -67 1011 -1675 1259 -687 62 2157 -1852 710 1489 -3028 1602
4090 1602 634 -1891 2053 -322 -651 758 -1897 1000 11 -1776 2478 -821 -1903 2284 -1636 -527
4106 -527 2212 -1393 1125 79 -1031 1445 -1882 180 2299 -2283 1516 1677 -2773 1294 188
4121A88j440K749k259R35L42k780L715j590j744M786l816l20L381l899J372J354
4137I74k015K774k416p7K801m462K875J760m381L633m76k757K950j734l8K061
4153A472k750K771q31l236M499k714j249M532l076%K146l330K207o31p73L062
4169B099l121O12K627m640K524J535l741L706j080j487K268k737J612R00k760
4184a683L277j102k256L613k569q67L522l056Q47J252k549K371j515m35L287l603
4200a466J484J798l887K410L88k611L354j601j24J738l062K367J81k943L693j466
4216B53j926L694l046K91J863k401K019l09j793L192k826k8L241l928J822J561
4232A679l456K662p66j403K547k180J216J175l272K747k99k685L625j706q73K723
$$ plain form
4121 188 -1252 1497 -762 173 515 -2265 1450 -140 -1884 2902 -914 -1234 2147 -1752 -380 974
4137 974 -1041 1733 -683 -760 2041 -2421 454 2214 -2167 1466 990 -1767 1183 -551 -589 1472
4153 1472 -1278 1493 662 -2574 1925 -789 -2038 2494 -582 -582 1564 -1766 441 -190 -963 2099
4169 2099 -1022 -410 2217 -2423 101 1636 -2105 1601 521 -966 1302 -1435 177 1077 -1683
4184 -1683 1594 492 -1764 1849 -720 -1587 1935 -1121 -274 978 -1571 800 -715 -1150 2137 -1466
4200 -1466 18 1816 -2071 339 727 -1884 1470 -131 -255 1483 -1579 788 969 -1974 1719 253
4216 253 -1673 2021 -1025 -734 1129 -1272 747 438 -1355 1837 -989 -1017 2224 -1704 118 1679
4232 1679 -1777 885 119 -1284 1263 -917 299 1474 -1798 949 650 -2035 1590 -116 -989 1734
4248A734k997R60J297k495K686j297j135L076l112P14K193l522K272N83k505K809
4264A261j644k67K224k937J853R71l448L300j129j618K968j970o9K170k976J863
4280E52K07k497L327k096o09L032l188J119J421l023K504o69j350K813k295J85
4296e67J928l018K408O2k507L171j600j024K771k491J224Q71k686K884r49j889
4312a412L108k633l4K585l086K083J81k468K910j360q82K906l197J071J524k955
4328a659K730m68k019K895j971k35K307k896J930L62k515K924j128j158K508k672
4344a065Q53J587l157K682m91j810K950k076k34K273k937J805K50k500L299j224
4360B05j941K684j276L45Q26k446K337n17j533K546j604k79K175l060J652R35
$$ plain form
4248 1734 -1263 -303 994 -1501 1185 -112 -1247 1829 -1283 -569 1624 -1898 374 957 -1548 1261
4264 1261 -383 -650 1574 -1363 490 1461 -1987 1313 184 -1434 1534 -436 -505 1665 -1311 552
4280 552 759 -1738 1589 -507 -1116 1916 -1272 -153 1268 -1755 749 80 -1270 1543 -752 -567
4296 -567 1361 -1657 751 813 -1694 1477 -123 -1147 1624 -867 357 1228 -1458 1426 477 -1412
4312 -1412 1696 -937 -971 1614 -1472 611 792 -1676 1234 -126 -1008 1898 -1299 -228 1296 -1659
4328 -1659 1071 603 -1416 1479 -492 -727 1580 -1316 614 976 -1539 1385 257 -901 1607 -1065
4344 -1065 -212 1375 -1782 900 409 -1401 1549 -527 -761 1512 -1425 380 630 -1870 1429 205
4360 205 -1736 948 -328 17 843 -1603 734 217 -1316 1230 -374 -653 1522 -1538 114 1049
4376A049k928K862j189j138K933k928R38J014k396K000M87k357K792j492m41K145
4392A351k600J401O60k226K610r33j522K816k259M19J819k905K116M9k169K838
4408A465j979j08K067k748J374R80k811K747o81j652K678j963K90J363k590K323
4424G55p0k145K845j621o59K634k653R24J112k469K463r01j153K382k304M71J671
4441A282k865K223j00j976K683j504m23J947k456J294R21k594K447q68j467K836
4457A380k169j37K111k139J505J52k078K531j835j06K551k886J173J304k921K465
4473I01k43j684K426k013N2J687k380J981j95k116K932j526j058K634k247Q80
4489C1J075k099J981n21j843K849k146K88J812k604J410Q01k511K238q77l90J997
$$ plain form
4376 1049 -1879 983 -206 -1344 1589 -1339 -401 613 -1783 217 704 -1653 1139 -353 -794 1351
4392 1351 -1249 152 812 -1414 1196 263 -1259 1557 -702 -283 1536 -1369 747 796 -1373 1465
4408 1465 -514 -622 1445 -1303 71 1051 -1760 987 306 -1346 1332 -631 -341 1022 -1568 755
4424 755 685 -1460 1385 -236 -895 1739 -914 10 1122 -1347 1116 215 -938 1444 -860 -389 1282
4441 1282 -1583 640 540 -1436 1247 -257 -680 1267 -1189 105 1026 -1568 879 11 -1456 1380
4457 1380 -789 -926 1185 -954 551 703 -1375 1156 -679 -785 1766 -1120 53 1357 -1564 901
4473 901 658 -1026 1400 -613 -561 1126 -1254 727 532 -1584 1348 -178 -1236 1398 -849 31
4489 31 1106 -993 988 467 -1376 1473 -673 -385 1427 -1177 233 1034 -1477 761 -116 -506 1491
4506A491k505J331P98k901K754m98j918K570j396m96J555j934J240M22j365K208
4522A356j749o46K330k496Q79J880k891J868P0j684J930j331L75J483k489J763
4538F48J59k443K634q54j451K551j697L30J046k080J515m61j081K877k244l16
4554h67K452k840J079J371k216K025n46j205J784k228J051J562k783K494k36k708
4570a811K819j196o95K023j881Q49M59j994K256j112r64L109k448K21J588k307
4586a084J149L78j469K099j325K8J514k671J501R74k487K530k04k040K095j667
4602f79K30J217j723J928l96j780K426k026m48K905k412N61J304k276J174K0r67
4619i42K197k096N91J636l022J712P64k361K501p85p31J738k070R48L58j703K494
$$ plain form
4506 1491 -1014 317 1115 -1786 968 470 -1448 1122 -274 -770 785 -1149 91 513 -852 1356
4522 1356 -393 -1039 1291 -1205 -326 1554 -1337 531 601 -1083 847 -484 -109 1374 -1115 648
4538 648 807 -1636 998 144 -1307 1244 -453 -123 923 -1157 358 -103 -1184 1693 -551 -867
4554 -867 1585 -1255 -176 1195 -1021 1004 458 -747 1037 -1191 -140 1422 -1361 1133 897 -1811
4570 -1811 1008 -188 -883 1140 -741 108 567 -1427 829 -283 -1247 1862 -586 -365 1223 -1084
4586 -1084 65 443 -1026 1073 -252 -224 1290 -1381 120 1094 -1393 1137 933 -1107 988 -679
4602 -679 -449 768 -955 973 577 -1203 1223 -803 -1251 1654 -758 -197 1107 -1169 5 25 -942
4619 -942 1255 -841 -250 1386 -1636 76 840 -1521 980 195 -536 1202 -868 80 438 -1265 1229
4636A229r85j601K887k159k41J783j824Q64Q14j604J688j468k42K106k522J436
4652A61J177k732J630K66j710K203j180P9J227k066J501l11k060L113j101j163
4668i66K575k380K8J427j758J364k25r90K325k397N75J698k876J936P14k355K061
4685G56n19q70J616j918J334O65k570K301n36j927K958j579l01K069k176P91N70
4702F64j812J875j021m22K295k743P13J611k832J965K18j729K353j439j58J590
4718A128k108J475K07k072K614j065j388K656j934J35J645k124J569l46j264J906
4734A034j593k65K151k156R13Q42k417K174m59j200J932j899N42J150k110K094
4750G33p5j770K318j084q89K021k167Q58R89j798J853q39j267K448k012O9J939
$$ plain form
4636 1229 244 -1357 1530 -629 -870 913 -911 -47 767 -837 851 -617 -859 1247 -1275 161
4652 161 1338 -1394 236 502 -1208 995 -185 -106 1121 -945 556 245 -1815 1298 197 -966
4668 -966 1609 -771 -743 684 -1074 290 65 -925 1400 -997 -422 1276 -1600 336 1050 -1305 756
4685 756 237 -633 983 -935 399 1064 -1506 795 259 -1668 1290 -289 -590 1479 -697 94 664
4702 664 -1148 727 -294 -716 1579 -1164 -451 1160 -1672 293 511 -1218 1135 -304 -462 1128
4718 1128 -980 495 702 -1370 1244 179 -1209 1447 -487 -352 1293 -831 738 392 -872 1034
4734 1034 -559 -824 1327 -829 84 926 -1491 683 224 -976 956 -943 -401 749 -1361 733
4750 733 658 -1112 1206 122 -767 1254 -913 -55 934 -864 989 150 -1117 1331 -681 -612 1327
4767A327k556J678Nj555J913j026m19J845k133J153N91k249K346n86j342K276
4783A268j363k15J514k221J327L44j556K051j158n52J972k407P33J036k011J875
4799F37l95j061K017j817L94J295k363J623J85j606J719o77r00K025k015J078
4815A39P26j876J837o26j207K150j701Q9J695j988R09M94j452J909j333o50K343
4832A458k398O99J225k334J910k28j424K096j384j74J431j858J452L71k037K180
4848I85r12j136K381j967K71J679k532J886k96j203K134j760l00J920k199J329
4864B80N03k216J979o92o60J936k202Q70R43j753J602mj524J859j186k65J850
4881A320k234R06O22j513J856j146p66K139j951O45J190k201J773k88j549K328
$$ plain form
4767 1327 -1229 449 454 -1101 812 -214 -633 1212 -921 232 823 -1426 920 334 -1008 1268
4783 1268 -95 -310 1204 -1017 310 654 -902 1149 -9 -561 1411 -996 -263 773 -1238 637
4799 637 242 -819 1198 -619 -225 1070 -1293 330 515 -1091 628 -49 -949 1076 -939 139
4815 139 865 -1011 826 200 -1007 1143 -558 -469 1226 -762 147 641 -811 1098 -235 -885 1458
4832 1458 -940 -241 984 -1350 560 332 -1092 1004 -380 -554 877 -981 471 842 -1195 985
4848 985 73 -1063 1318 -649 -378 1301 -1231 655 359 -844 1290 -470 -770 1150 -1049 280
4864 280 783 -1433 546 -146 -806 1130 -1072 -202 741 -1012 590 586 -938 921 -265 -530 1320
4881 1320 -914 -8 614 -899 957 -189 -955 1184 -767 -122 1068 -1133 640 352 -1197 1131
4897A131j191p15J952j897Q06P70k123K016m76j259K289k030L61J599k343J627
4913E17j01j345J954j167l33J629j801O37R22k052J982m97j226J957j901O26J054
4930H55j892J528k87j563K149r78p84K085j920Q31N71j450J544l45j337K132j699
4947e60K46J289j721J193K16j675K052j154m91J659j621O97O34j971J914m51j296
4964a040K162j508j88J550j801R82J94j310J917j148m59J928k372O51J465k014
4980i91J419J12j284J830j659J48J586k164J677J44j974J872p75q29K085j618
4996d21J35P33j464J445j57j219K070j662j2J791k277J371K63j665J769n75n98
5013d73J527j693O96R86k253K088l19j833J885q50m49J677j832J283N1j605J911
$$ plain form
4897 1131 -60 -775 1177 -720 86 856 -1267 749 273 -986 1303 -727 -366 1233 -1110 517
4913 517 416 -929 1025 -142 -475 1154 -647 -10 912 -1140 842 345 -881 1076 -825 -199 855
4930 855 -1037 491 204 -1359 790 -188 -972 1113 -807 24 595 -855 689 344 -993 1139 -560
4947 -560 -314 975 -746 447 663 -1012 1040 -114 -605 1054 -567 130 764 -1207 707 256 -1040
4964 -1040 1122 -386 -574 976 -825 157 351 -959 958 -190 -649 1279 -1093 -442 1023 -991
4980 -991 428 540 -744 1086 -573 -425 1161 -1003 674 818 -1156 716 -59 -888 1197 -421
4996 -421 -286 447 -1017 428 271 -948 1122 -540 -552 1239 -1038 333 596 -1069 700 125 -473
5013 -473 1054 -639 57 1043 -1210 878 559 -1274 611 -239 -688 989 -843 440 491 -1114 797
5030G97p71r45K104k014M96J453k304J329L1r65J640r49%R80j999J437K91j924
5048a313K018l29j167J774j525K55R90j744J920p01j313K030j489l54K319j918
5064e47P28P23j724J321p96n63J623j311N19J132k460J812p9j642K160o65k59
5081b8P95j582R87J75j481K034r61o50K029j794k18J581j842J318K97j410J246
5098D96j114J18J381j981J203R49k031J765n02j310J760j020J73R68j484J333
5114G04m04j604K346r60o10J738j610M3Q24j525J501k25o02J512j982M89J194
5131H29j968J454P83k117J908p18r23J293j201R90M59j664J747q30j061J945j117
5148a91j66J711k089R04J54j196J361j149K16J634k141O35J291k161J513j11q71
$$ plain form
5030 797 26 -919 1185 -829 -333 1120 -1184 145 176 -789 851 -98 -98 882 -1117 320 611 -1313
5048 -1313 705 376 -791 983 -542 -287 703 -1041 879 178 -1135 895 -594 -948 1371 -547
5064 -547 181 904 -820 501 -295 -858 765 -546 -27 1105 -1355 457 378 -1264 896 231 -28
5081 -28 767 -815 172 347 -1134 900 -61 -711 1318 -476 -694 887 -955 363 660 -750 496
5098 496 -618 -500 881 -1100 103 1052 -979 786 284 -1026 734 -286 -113 855 -629 704
5114 704 300 -1304 1042 82 -528 1210 -400 -357 467 -1058 443 218 -384 1128 -854 -365 829
5131 829 -1139 315 1098 -1019 889 171 -752 541 -660 330 789 -875 872 42 -1019 926 -191
5148 -191 -357 1354 -735 169 323 -873 488 -661 -445 1189 -952 -317 974 -1187 326 215 -656
5165f56J223q10l3Q73j849J530M18j814J992p75j023J848j405K14J232j587J168
5182E46l98r41J659j407j97K136k268Q38R29j998J409m27m02J323j352N45P71
5199G66j998J575N9j492K186j046p16J443j398N48P49j242J550r80q07J851j902
5216h54O74J081j747J300J11j141J076p70r5J164j515J079L42k095J859k33r88
5233g52J796j158k04J022j662J233r7j161J968j221k52J464j626L26J043j438
5249g19J298n51o09J510j558K60J204j960J549Q3j711K113q90n51J295j320N07
5266e0N19j253J622o01j202J927j155q5J182j635O63M80j169J589j156m7J295
5283I24j807Q21P25j662J615l07j182J775j130m06J315j113N36K03j408K015j029
$$ plain form
5165 -656 567 -243 -276 597 -1252 278 696 -1118 874 99 -924 924 -481 -267 965 -622 546
5182 546 148 -793 866 -541 -738 1398 -870 -32 897 -1101 308 -119 -521 802 -550 -5 766
5199 766 -1232 343 402 -1090 1096 50 -666 777 -621 -73 676 -566 984 4 -803 1048 -854
5216 -854 -180 901 -846 454 565 -576 500 -270 -365 799 -716 363 705 -1390 469 236 -752
5233 -752 1044 -114 -318 704 -958 275 178 -983 985 -236 -488 976 -650 -324 719 -719
5249 -719 579 28 -581 929 -629 -369 835 -1125 424 507 -1204 909 19 -532 763 -557 -50
5266 -50 469 -784 838 237 -965 962 -193 -278 904 -731 -68 412 -757 832 -324 -371 924
5283 924 -883 -62 663 -999 616 309 -873 902 -228 -634 681 -432 104 307 -1101 914 -115
5300a15o69J642j305J45J007j543J431k82r23J442j194J62J237j857Q59M84j322
5317h01J273m19p55J393j372L81Q93j524J120j27r32J796j214k34J616j819R60
5334B35K00j229J426q08j12J039j342M94R33j625J272l28q27J397j014m2J440
5351A109j741O75L51j408J377k72p31J581j492M09J082j641J144k57j046J634
5367G74j222K4J319j600O19O72j219J295o77q71J579j153J43J209j894J485J0
5384D93j322J506r02l79J653j924O28O72j174J501q61n03J470j268O3R73j543
5401i17J463m9j200J496r95k26J148j653J143O60j693J399o82m77J405j178J89
5418a67Q15j547J311J37j372J594j077k92J447j662R26N86j567J300M4j151J365
$$ plain form
5300 -115 -784 858 -447 -302 705 -838 593 311 -612 830 -364 -202 1035 -822 37 521 -801
5317 -801 472 53 -702 691 -681 -300 593 -931 189 62 -870 926 -288 -522 1094 -725 235
5334 235 435 -794 632 -176 -288 751 -591 -97 836 -789 483 155 -672 725 -289 -331 1109
5351 1109 -632 43 394 -1014 363 91 -640 941 -551 -142 940 -701 443 186 -860 774
5367 774 -448 -424 895 -705 -86 586 -633 662 -15 -886 693 -460 -317 892 -1002 483 493
5384 493 -829 677 -225 -604 1049 -875 -247 425 -749 752 -109 -612 858 -410 -347 626 -917
5401 -917 546 497 -703 793 -202 -428 720 -933 210 870 -823 576 -106 -583 822 -356 -167
5418 -167 648 -899 412 549 -823 771 -306 -598 849 -813 113 699 -868 432 476 -675 690
5435F90j128K57Q82j340Q67K62j094J123m03p43J491j213K46O12j344J200l85
5452b0q22J641j193J99R54j407Q17M58j374J422m56o25J325j583O98P47j537J384
5470F28l75r83J558r19k39R79j154P41K08r91J377j071m53J295j158O20N29j466
5488h74J031K37q06R54j154M61Q94j488P97M47j315J474l45j038J655j324J54
5505b40Q13j353J341l70o84J275j064l95J465j382N53P06j502J515q79k9P89j049
5523d90L42Q18j534J228j34j086J456p83k9J025j096M58K17j285J605n64p52J497
5541H93j276K4J124j720J047J40o19J246j411L34J267j837R53O08j730J279j40
5558A82r98J179n30K05N91j176J157l96r04J251p46m75J568j253M50K95r82Q36
$$ plain form
5435 690 -438 -181 701 -639 228 490 -604 519 116 -627 864 -349 -103 509 -835 365 -20
5452 -20 -842 799 -394 -195 759 -648 169 627 -747 675 219 -406 919 -664 34 781 -756 628
5470 628 253 -730 828 -91 -330 649 -505 236 444 -547 830 -241 -694 601 -557 63 592 -874
5488 -874 157 394 -412 542 -612 -151 743 -745 52 499 -816 658 313 -725 930 -394 -240
5505 -240 573 -780 561 191 -493 782 -282 -677 788 -594 -41 665 -837 678 -201 -230 559 -490
5523 -490 -148 670 -864 364 230 -856 600 -183 -212 813 -283 175 392 -893 712 148 -604 893
5541 893 -383 -359 765 -955 92 232 -387 859 -552 -218 1049 -788 165 773 -957 322 182
5558 182 -816 363 -167 38 629 -547 610 214 -690 561 -185 -660 908 -345 105 400 -582 254
5576B54o4p60J444j348M39O89j533J222Lr71J183n01n63J014j220Q02J43q91J413
5595G55n61r93J402j050O1J330j318O70K23j184Q92q64J98J375j498N31Q80j813
5613i64R52O6p40J101n28k05J016j474O66L69j102J678o82q12J449j445J72J132
5631F49j024R44o65n23J250j104R7J209j327P93L07j267O84k41m00J004r95O19
5649A0N27j450J431o67r36J879p43k48R80j383P07L29r27J231p10m78J293j440
5667e95M41J045j475Q16K81j187J114p82J8R78j471J063L16j783J749m43j000
5684i15J472q00n4P74j036P81j22n80J408j136J08J130j698N12O24j234J206l09
5702A31l64R28j243M59M04j041J165Q2j103J280r12m62J223p14K77L40j010J084
$$ plain form
5576 254 190 -570 874 -474 -35 654 -879 343 346 -625 558 57 -506 508 -712 90 233 -658 755
5595 755 194 -799 603 -447 -386 944 -374 296 519 -665 227 -637 -439 936 -562 -31 849 -964
5613 -964 -12 54 -686 415 -113 -318 698 -776 -110 259 -843 835 153 -659 790 -655 -483 649
5631 649 -375 569 -96 -619 631 -473 -376 833 -494 299 606 -661 23 -218 -618 386 -609 10
5649 10 537 -913 518 -149 -1085 794 51 -197 783 -600 107 436 -491 740 30 -448 845 -595
5667 -595 -154 891 -584 232 513 -674 440 -342 -324 654 -817 246 562 -1221 528 85 -915
5684 -915 557 -243 -297 477 -559 222 100 -480 928 -208 -100 1030 -668 -156 468 -766 440 131
5702 131 -233 695 -548 -89 315 -726 439 521 -582 698 -214 -676 547 -167 110 450 -560 524
5720E24o79n96J402j330O28J172j746N19O76j159R58l76k72J113j445O97K59j349
5738a004J380r5j096J507j081P5Q39j337J018N8r31J205q99m28J638j376N75O68
5756G16j229Q37n1l91N41q81O51L76j281J155O5j522J468k67o95J067j010N35
5774H4K28r95J277n62o89J416r73k26J163j172K99M52j087J459p22l50R69r90
5792d19N63M91j235J139m29q38J317p22lO16r26L29P83j344J146o29o73J790j555
5811e99N01O11j139R29q5r77J365p36j44R23j268O90N91j333J087j34o42J020
5829F60j181K58P87j113P01kj004J345p44J9P83r24L43M32j010J158o88l91J216
5848F45r23r6J079j344J095m2j034J143n70Q2M55j124N52M60j053J355p68m75
$$ plain form
5720 524 -155 -751 651 -679 -51 1121 -625 -106 570 -589 369 -7 -279 834 -611 86 345 -1004
5738 -1004 376 281 -815 692 -389 -314 525 -812 206 264 -667 538 -361 -789 849 -527 48 716
5756 716 -513 324 273 -118 423 -458 193 569 -712 443 508 -1014 454 187 -508 559 -451 84
5774 84 312 -683 594 32 -657 759 -214 -440 723 -449 -150 302 -785 674 -48 -398 571 -419
5792 -419 144 635 -600 539 110 -728 589 -133 -136 480 -446 -117 666 -678 468 -161 -834 956 -599
5811 -599 -98 513 -626 303 218 -759 606 -130 -274 649 -619 71 662 -671 416 282 -360 660
5829 660 -521 -263 524 -589 112 110 -894 451 -293 -274 509 -415 -72 360 -650 508 -180 -571 645
5848 645 -278 -374 705 -639 456 414 -620 523 -47 35 490 -634 -82 378 -675 680 -88 -563
5866e63J139j194M35Q55j340R99Rj335J227n03k22Q50j057P45M30j067J143m16
5884A35n14J080r34o1J150j593J146j21r26J385q31k67J240j667P13N10j304J329
5902D70m05p63J279j017J68N25r66P56K36j034J115m77k40J231j301M42P29j389
5920f41J530p23p16J298j131K21P14r14O18K50j247J193l92m41J186j357M21N44
5938D13j206J114m43m62J302j068K31N43j090Q72L17j250J154l98l04J004j238
5955e09M63L93q71Q89r9o12J154q35l50J048j228N26N85j366J322o60J83N29r25
5974c63L90N06j434J418k05r51J092m21j61P36r16N53J96q88J115o94m56J210
5992G27r16Q8P07j389J076j31n55O91m66r6J65o75J84O84j338J282K7r40J512
$$ plain form
5866 -563 576 -618 -183 672 -668 331 340 -995 232 -271 -493 357 -700 45 475 -592 551 135
5884 135 -379 701 -233 -294 856 -737 409 288 -638 747 -84 -351 889 -778 -65 445 -859 470
5902 470 65 -698 581 -436 -268 257 -709 47 283 -751 364 -113 -353 878 -423 19 748 -641
5920 -641 889 166 -550 748 -383 -162 552 -362 256 506 -741 452 60 -381 805 -552 -131 413
5938 413 -793 321 -122 -584 718 -350 -119 424 -666 206 523 -727 427 29 -275 729 -509
5955 -509 -46 347 -524 365 266 -346 808 -27 -377 671 -557 -31 554 -812 510 -150 33 562 -363
5974 -363 27 533 -901 517 312 -639 453 32 -129 607 -309 244 440 -448 667 -27 -483 727
5992 727 -189 -101 606 -783 293 162 -393 298 -168 -264 -99 -774 -590 94 -1244 38 65 -875 637
6011F37j012O46J70q06P18R6q76R55o99k26J140j052K58N11j140J180n46m28J202
6030G28j146K29P76j224R64k15q46J197o36l95Q68p38N49J47n49J091q18o32J487
6049H37j181q8R87j022O56J14o39R59r01L13P11j285P51M56j313J035n11o73J178
6068C84m84j72O62p81P46j17j087J337m48m28J173j172R4Q61p36N49k40l69P73
6087E45q88n7Q41j254J308j18q57R07p40j29P87o80N62J64j345J267m91p88J572
6106F06q17J4O11q85K28N68q23R18l58L4N10j038J10P42j165J099n5p42J007q50
6126b86j01P20q55Q55K00j328J361q73m31J192q25K01Q16r54O06j75n69J103r28
6145b71K07O73j138P08J29j205J244m6n29P79o41L11J58j177J113o1p95J059q70
$$ plain form
6011 637 -375 271 441 -365 353 449 -427 528 -171 -397 743 -309 -51 460 -680 500 -46 -474 728
6030 728 -418 -189 587 -637 327 112 -734 463 -173 -568 300 -438 111 258 -291 800 -18 -650 837
6049 837 -344 -432 555 -467 189 303 -336 623 -278 35 746 -539 212 668 -645 390 -121 -794 384
6068 384 -100 -272 390 -391 355 238 -849 488 40 -388 785 -387 -293 568 -168 381 141 -228 545
6087 545 -343 -400 441 -813 495 377 -480 427 -313 -442 345 -335 227 391 -954 313 -178 -966 606
6106 606 -211 -197 414 -471 -243 325 -498 420 62 96 606 -432 -322 420 -745 354 299 -443 564 -286
6126 -286 -387 333 -522 333 533 -795 566 -307 -738 454 -371 -170 646 -308 298 123 -446 657 -271
6145 -271 -64 609 -529 179 308 -897 347 301 -228 551 -90 221 379 -798 315 254 -541 518 -352
6164c52j92Q99p87L69L79o60R65n63m39R20q27J63R42j331O75K19n97M51L6p9
6184A91j3J21j10R64k125P87N7k33J062q49j71L94p39R32O7p93J136r65k01P28
6204B40n78J75Q71j323J133l96k07J317p78l50m0j087J053L44j187J288l99l81
6222c05Q46m72k93O88r48R14o45l52J071p38J1Q15j074O61K57q82R65m63m8O26
6242F34j127N49K35r84J245l54n10O65n87k23Q59q10Q09r5o19Q05o91k07R94q92
6262c04j92R58j012O26K5o31Q37k47k12O33j137Q02M56j194J317p72p5O61j006
6281d67L45M03p27N04j80m39J204r12J60N44r19M13N58q72O55r6n02Q78p32J42
6301d0M65o54M03j61n5N39o96n3Q21j044N50L24r80J179o44l50Q01o29%O21j082
$$ plain form
6164 -352 -544 355 -432 -63 316 -344 621 58 -381 539 -288 -125 817 -514 161 380 -217 234 270 191
6184 191 178 299 189 1153 -972 -185 -128 -361 701 -148 -319 75 -664 268 335 -458 678 -287 -488 240
6204 240 -338 -163 708 -615 518 122 -85 1232 454 104 64 -1023 30 374 -813 475 76 -305
6222 -305 541 69 -224 464 -484 430 -215 -567 504 -234 -223 592 -482 179 436 -446 519 56 8 634
6242 634 -493 56 291 -693 552 198 -312 353 -234 -457 402 -408 401 306 -313 492 -199 -406 588 -304
6262 -304 -496 462 -550 76 101 -530 307 60 -152 481 -656 146 602 -592 725 -47 -122 539 -467
6281 -467 -122 281 -446 58 -122 -561 643 -269 -109 435 -484 -71 487 -385 270 174 -328 550 -182 -40
6301 -40 425 -229 174 13 -42 497 -199 -252 569 -475 75 399 -581 598 -46 -396 405 -224 -224 397 -685
6322f85Q67M6q40J086n29p3L96p16N31M26r61Q31j84o15Q12n77Q5N21q25P18P7
6343C91q15R15n84j03N96n56j3K30k93M80k57n67Q99p08L46K93o79Q44j06p36
6363d23Q85o69j70O94m60P2M49r95Q59k64k73N66n67O6O26r11P94k4p40P54k70
6384am17O42o36L07P70j158P50j04o20Q98o90P7P18j030O74Q1q28R51k73l86Q16
6405E41p65J89M26r06O67K7o63R72o10L8N57n07K99j24p08Q02m1o08Q42p32K71
6426c3K79m91N08m1n90O88n14m7Q32j005P11J17q08P35n09l37J059p33q2N75o18
6447c04N76k72m18J100r86k41Q37p98L61K53p98R88m75k77P33l18j32M16o28M16
6467C3L1n68Q38p12J25P53q27L86K32o49O79k29m19P33q33K68N51p97L48M83r98
$$ plain form
6322 -685 182 228 -612 474 -55 -128 268 -448 83 509 -452 379 195 -420 392 -185 -100 421 -404 314 391
6343 391 -424 491 -93 -196 400 -156 -169 61 -232 248 -9 -576 323 -385 -39 254 -425 419 313 -423
6363 -423 462 -207 -377 317 -143 -71 378 -617 242 -22 -295 271 -296 -230 396 -515 279 255 -485 269 -1
6384 -1 -418 224 -412 -105 665 -493 257 153 -467 431 -259 -182 536 -494 180 261 -567 384 111 -275 541
6405 541 -224 -35 391 -515 152 179 -484 488 -122 -84 473 -34 265 141 -567 235 194 -414 428 -304 -33
6426 -33 246 -245 263 222 -368 320 -194 -241 591 -414 297 414 -394 341 -168 -505 554 -179 -261 314 -304
6447 -304 272 0 -418 682 -304 -545 292 -506 -145 108 -690 298 -177 -454 279 -39 -171 245 -383 33
6467 33 64 -504 334 -378 -253 500 -327 59 291 -358 321 92 -327 406 -427 -159 392 -405 -57 426 -572
6488e72R53n97k05P49r60N46L23l66N60n67l39J010o70n2N66q30L45M07o06N64
6508B59l12k65N48q98O21K59o17O58k08n75O80l81k5P72q50O42k96k15N92l50
6528C9k99R57j088K13O37n76M86m88J44K32n19L66J10o48N91K63q82N46P0n79
6548d25O65n48J33M84n72M12l34l5O82o22jN25n66J56K91o02P15l33m70Q66p84
6569c63O79K02j249J062k85o16J069n32j77L84n72N46k51l88R36o31m49J006o16
6588b45J87L99m63L23K45p39O92o47P9O52q37M43L94j091P74ok30M54m97J07L4
6609B8o56J036l69q28J239n55m06P89l14j23N23m10L34m56j99R38j121L40Q71
6628F61j059P04J57q74N89l38K42O3n70N38J73o13O01k3r63J047m66j68P41q01
$$ plain form
6488 -572 381 -216 -421 328 -632 -86 237 -129 431 -136 -475 535 -135 -187 379 -451 -106 301 -305 259
6508 259 -53 -318 230 -668 -47 212 -405 253 45 -530 150 -231 -256 516 -334 308 12 -203 389 39
6528 39 -260 697 -391 -178 459 -117 369 -119 25 257 -262 104 214 -434 157 420 -462 84 154 -425
6548 -425 240 -308 -175 309 -263 149 -185 -220 462 -160 -161 364 -202 -46 245 -357 358 25 -445 421 -363
6569 -363 316 518 -731 331 46 -570 499 -33 -210 174 -398 148 -103 -491 445 -186 -635 371 -245
6588 -245 -58 341 -122 201 446 -293 399 -248 -169 483 -354 89 483 -608 166 160 -70 384 -113 -6 28
6609 28 -628 408 39 -789 450 -105 -511 278 -36 -159 364 -46 288 -168 -367 571 -550 -210 661
6628 661 -398 306 463 -411 178 -160 82 145 -425 113 286 -327 274 251 -712 335 -131 -299 442 -359
6648c59L86L6m19Q02r03K46P22q76Q7N43o87P36j48m44M85m81L64L55r10P56m4
6669B47q69Q34m11l21Q70o20K41J15o34R56n05j82R11j069J04Q79j201Q13K04
6688C62p32N51j20k00P53p61M83k6j040J049j70n80O94l49k01N00m54N01m0p23
6708e03J080o69n36J070r45J98P25q61M85j5n14Q56n50K22M67j084O55L90p47
6727b76N20k10m88P49m98pM28n53O50O3q43Q77o83l25J005o04k5M46n33L90j70
6748h7l70R50r85L51N80q90O18J74q51R47k87k78J52n27O45j70p19J203m70j48
6768a62N82n01n5N84r56P05jn37O72l66O4N46j042K68O08r24M40K8l41N40l60
6789b08J29L39n24M86k23l35O46n20k3P19n67K00lm75Q54n39l83R43o85R6L33
$$ plain form
6648 -359 27 63 -356 446 -457 -211 511 -365 -278 265 -422 314 166 -278 207 -274 90 445 -465 291 247
6669 247 -622 212 -199 -520 350 -270 -29 86 -548 408 -97 -279 632 -437 -333 546 -655 158 362
6688 362 -370 181 61 -139 614 -147 336 310 -730 319 149 -431 263 -86 -287 213 -241 260 220 -503
6708 -503 577 -92 -628 442 -503 -305 420 -441 44 29 -485 371 -179 43 510 -574 81 471 -276
6727 -276 244 34 -454 295 -203 -210 218 -335 315 378 -465 412 -271 -596 409 -195 -220 226 -307 83 -87
6748 -87 -457 493 -492 -141 439 -451 167 341 -510 437 150 -128 24 -503 142 -28 -747 456 -14 -162
6768 -162 420 -81 -136 448 -508 197 196 -341 331 -35 29 575 -467 -199 409 -515 -75 -47 -388 152 -208
6789 -208 -79 260 -264 222 -1 -336 310 -210 -233 486 -81 119 116 -359 495 -44 -427 516 -169 -73 260
6810B60p67P01J11n32M73m80q9N55n19K75K33o11N59N5o23Q01j56m27O24q95N71
6831A19L0o65Q86m72n29R24n06K78K29q65O98P0m37P35p22P5L23m85M23J49o53
6852c95O97k49l32Q65r26M95L62q71M96j06l06O40n25p9O86j018N35M1l27L66
6872D9p2j47Q83j006L34M03j047P41j02l49N81j77l34N64o27M15M4m07Q21n06
6892F1m08Q97j016M30N90q99N71l8m78N71o17q3M97m75M06N18o65L59n01K1N00
6913B41n51M00Q8m97L82N1m07O96m48k46O56q48M19L55p43O91l81k92P60p06M32
6934E2J58m37K64R8n34P97l40j38N90q05J88J68m39N33Rl31P52p23J41M65q64
6955c96N16j52l61P57n29j33P79p50L27L84j021Q24p4l90N76n55K82L79q92O73
$$ plain form
6810 260 -507 194 305 -227 246 -234 -323 232 -287 -12 221 -390 169 224 -399 402 246 -181 443 -452 119
6831 119 149 -516 370 -102 -631 293 -213 65 294 -571 127 197 -240 495 -227 -152 171 -314 109 258 -395
6852 -395 302 53 -279 586 -340 155 517 -354 142 36 -270 370 -155 -234 452 -566 -31 10 -317 49
6872 49 -23 -170 713 -293 41 444 -603 138 36 -313 268 91 -243 321 -306 109 153 -254 567 61
6892 61 -347 550 -466 -36 554 -345 226 188 -290 281 -336 -419 78 -397 9 527 -138 221 -280 -259 241
6913 241 -310 90 178 -319 63 114 -293 403 -45 -291 365 -483 -64 291 -452 239 -142 -434 326 -380 52
6934 52 210 -227 37 135 -399 398 58 -80 510 -295 -107 61 -378 155 164 -167 585 -138 3 468 -396
6955 -396 120 -32 -393 364 -165 -298 481 -269 58 442 -579 245 171 -219 357 -198 84 463 -429 244
6975B44k40l89Q63m44j8M64q26N3O68o37O27q0l70N55m30j29N73r60M91M23r91
6996e53N15O7j69K52n60M26J79n77O97l09m96N21k04j12P26p79N42K52p50M22
7016I0k67M8N70o39R0M76p40P35j93m07N86n38R4L09p96P04k9m67M94k31k27P28
7038C90m74p1O35p36O71l90j02M90p36J59N88p34M38K73r40Q10j11m35O60n50
7058a65L67L73r88M79o9o30R67k63m04M66o40O84j50m96Q09l14k46N68p88J13
7078c27P04p30L87O6k25J82j48OM07o73N41O3o71O95k13n62J153p09L8K88m70
7099a98M08l19l20P91n19K75K24p73N12L31r92P02k50j10O49l77j59K92n22M52
7119I7L13p98R52o74k74P02k52j04N16p47N02l53k83Q90o67J13J51m15M78j37
$$ plain form
6975 244 4 -385 478 34 16 480 -346 -293 375 -262 365 285 -85 470 40 -89 484 -476 15 438 -553
6996 -553 -38 29 -140 112 -448 -22 157 -420 277 -32 -528 -7 -211 -323 403 -376 166 418 -332 90
7016 90 -177 -129 441 -198 -108 368 -372 363 170 -237 349 -189 -95 214 -582 122 93 -374 120 -111 -338 390
7038 390 -84 -155 480 -256 415 25 -77 413 -323 -164 424 -310 128 401 -539 271 160 -275 385 -165
7058 -165 202 575 -413 66 -3 -633 334 71 -333 133 -507 177 27 -469 340 26 -220 348 -440 -327
7078 -327 377 -353 34 100 -125 57 -91 -85 322 -351 190 253 -418 277 64 -498 655 -54 -16 272 -198
7099 -198 210 -109 -429 362 -157 118 342 -431 81 412 -580 122 -128 -238 411 34 -125 167 -355 97
7119 97 410 -388 564 -110 -384 318 66 -38 478 -269 233 -120 -403 487 -180 -67 84 -331 147 10
7139A0m73O24j62j55M35j18J09o9q03O37J83o09Q76p47o4O85p08L94L07m91O73
7160E34o58r8P64p25K01K89q21N16j31J93j02k06J53K94l53K95j97n32Q85j84
7180A17m92Q28o38K08l6n2K24j70k14N76n88M9M13o02M20O3l28O31n48o3K39l12
7202b75L05K05o80N49m3m43O97m43J25L37j44r9N4m54O23l52k00O73n99K17L20
7223C73p10L97j1j32K56m16J30M25p30M08P7n32P45q3k60K3k44L72M02q50O62
7244C02j42l40M65m48p4N74m94L25J0l24K32j01l57O71n84K07K71n63O00l0n78
7265c78P19l37k27N39l96J2J03L3J12j6m94P77o72K56M26l97P3o4l91P11l93j53
7287a57K83m37L08J45m07L58j41k54Q07o49k64Q25r13N70J17n16O28l70l42Q35
$$ plain form
7139 10 -463 161 -1 -156 279 161 270 201 -602 35 218 -391 485 -262 -326 359 -349 45 352 -139 534
7160 534 -124 -222 542 -183 18 307 -514 2 -129 64 -38 -244 -91 203 -150 145 -52 -584 301 117
7180 117 -375 453 -185 23 -13 -65 159 -11 -225 351 -237 -188 225 -377 43 106 -222 409 -139 -202 37 -275
7202 -275 30 235 -445 104 61 -382 315 -128 -3 334 190 91 145 -309 314 -38 -238 435 -164 53 373
7223 373 -337 60 49 -83 173 -243 -113 312 -418 -10 67 -465 280 197 -63 -40 -284 88 490 -360 302
7244 302 160 -180 285 -163 -237 337 -157 168 178 -146 86 -15 -372 299 -285 -78 193 -370 230 200 -378
7265 -378 341 4 -223 316 -80 -68 35 68 180 164 -330 447 -225 31 457 60 133 69 -322 389 -4 -157
7287 -157 126 -311 -3 142 -265 93 -48 -302 505 -144 -408 417 -496 74 191 -325 303 -67 -409 426
7307D26p34L92O3m54O46m8n30N10k98j5K92m99M30j23m22N61k22r8K20q4J81L3
7329B27o95N67r9l19O14n39m9N53k30m0L19l63J29l13J68M99p08L40J36m56M72
7350B13l04k19O46l33n1K67o05L36L35o58N95k72q4K76m89L52L16n45N53j96k97
7371a64Q02q89K8O69p59K72M35o50M09k49l56O33m96J66M07n68L19J88n28O69
7391C38m02q7N43p63N29q0j90K85K4j87L68m13K7K67m53K71q7l21N75k07l83M81
7413A35l42J20L27m57M65l61l62R95p15j04O20p03N71k22k07L26k57M1O40p60
7433b50J63K17m43P89o93J47M07m54n7L58o12O58k06j27J33o6M2P5j30N9K52o64
7455d02N21j55k87Q18n53O9L44p21L29J48k27L68n66J82L05k52L9K24n75O69l12
$$ plain form
7307 426 -308 84 147 -307 339 291 -239 271 -27 -42 250 -249 181 58 -364 197 -25 -123 97 13 194 227
7329 227 -468 99 0 -319 295 -244 -293 260 30 -10 309 -54 75 -238 -70 429 -279 61 197 -259 213
7350 213 -91 -310 336 3 -48 219 -386 -50 285 -373 222 -50 -134 142 -347 5 321 -224 329 133 -164
7371 -164 638 -251 -223 446 -313 -41 394 -256 153 -96 -452 181 -315 -149 258 -310 9 197 -331 338
7391 338 -64 -151 392 -371 158 78 -112 173 197 10 378 -35 -8 259 -194 77 -10 -331 244 37 -346 135
7413 135 -207 -87 240 -217 248 -113 -475 520 -195 -299 321 -382 189 -33 -240 86 -171 -130 510 -250
7433 -250 -87 130 -313 476 -217 -70 337 -117 -174 184 -428 230 24 -103 30 -36 6 81 -49 10 262 -402
7455 -402 119 -36 -323 495 -58 11 355 -366 -37 111 -116 252 -314 -132 173 -79 -40 184 -391 278 -34
7476c4k55O00o47L35L19r30P67p7l42M72l38k3M41l73l9J72l38L72o6o7J85k17
7498h3L32J51q00M37qk63M76l05J4M43o95M09Lo39O56k74r4N58k92j40M19n74
7520b69J36J16k75M57j86k98N56m84L19K28m98L28j93k92N74m42K65L66o91N65
7540B82k6p68J037n37K87l41K8M37k38m43M75j11k36L44n61L18O11p88L47L17
7560D34p05N21k83k40P53l81j78M25l57L42k64l34O32m77j59L60l37J83R7j79
7580a47J19j24JL60n49L95J49l67J61r6p7K04J76l42M39o57L27J17n18N44n2m83
7602d20Q27l72r0L16o45O24k29P8J1k60mN55m72P1L90o87N48j87k47M38l88J15
7624b8L46o18L14j13k89N09J44m93O11m11pJ32k28N30l78j59L51m37O3L59l30
$$ plain form
7476 -34 -289 311 -336 -1 318 -612 155 78 -264 208 -130 -153 288 -85 -124 48 -290 82 16 -51 134 -83
7498 -83 249 400 -400 37 29 -234 242 -63 -49 394 -301 108 111 -528 128 -146 -240 318 26 -114 305 -269
7520 -269 -133 -17 -292 165 -21 -319 237 -247 72 300 -198 130 -63 -355 219 -223 42 408 -283 282
7540 282 256 -512 525 -12 275 -66 -38 399 161 -282 193 82 -154 190 -371 -53 558 -230 117 434
7560 434 -271 250 -33 -273 480 99 -79 346 -11 331 67 -267 365 -112 -271 89 -248 -65 32 -147
7580 -147 -28 -152 -151 209 -340 55 204 -163 -2 -98 -175 29 205 -137 302 -355 -28 89 -429 115 63 -420
7602 -420 407 35 -55 261 -384 240 11 89 100 -160 -164 391 -81 -10 380 -307 241 54 -193 245 -143 -28
7624 -28 318 -300 14 -99 -388 121 265 -228 383 -28 -35 97 -131 399 21 -138 213 -224 -161 198 -132
7645a32P9J96l79J84R7l03J97m07M61M50q31R08k41o02N85l79J72L89n21J91j38
7666b4j64L25n94K61N90m06J67J11n07l5L69k5L12o27M23M2n96M62j68m91N31
7687d4J24l53J54r4M15mk23K51j53k64O09n20l7M12j87J92j32l03L85k01j73L05
7709A59m70M25K03q10O42k93j51N75j38m58N24m03J15O7k73O68l08l69M94l70
7729a71L9O43n99N60m59j2L48p26N13J62p65O79L84j016L95J70m32N37j27o4J17
7750A76k46Q5l5l08Q20o76j52M29k76J60J0j81K77j10N2K91n92K11L58p29K70
7771a66M90m20M21n15m7M73l45K82K5n37N96j09l98L82j97j53O75n46L1J71k46
7792a33M13l92l2M38m10n7J99l55L48Q7k35L32m67K79K10k80L29j78m00O39m39
$$ plain form
7645 -132 -53 143 -236 -52 45 -258 -61 -468 -7 443 -388 520 279 -323 262 -117 55 444 -77 114 -24
7666 -24 -188 137 -457 -196 394 -12 155 266 -241 -276 93 68 380 -247 176 218 -378 84 -84 -575 -44
7687 -44 80 -273 -119 -213 202 198 -25 226 73 -191 418 -102 -139 273 86 278 146 -157 228 27 -146 159
7709 159 -311 114 317 -493 149 -144 -295 280 142 -316 208 -195 -80 -13 -286 382 74 -295 199 -171
7729 -171 -132 511 -88 472 13 1 349 -377 136 298 -467 212 596 -420 -25 145 -287 250 123 59 176
7750 176 -70 15 -20 -328 492 -184 -336 93 -183 -23 -13 -194 83 -27 25 316 -276 -65 293 -436 -166
7771 -166 324 -96 325 -190 -237 236 -109 173 198 -339 257 148 -250 132 -65 -218 457 -89 -58 113 -133
7792 -133 280 -112 -144 294 -116 -173 26 -329 19 106 -129 203 -264 15 225 -55 274 96 -304 335 -104
7813a04j73O63k64j40P4j80K34j20l27M84k00OM70q25N34K6k76O46o33j44N84
7834C35m56j3L83m84M73k58l14N73m05N9k1k1J43K34m50L86k01j66P61p03R8K58
7856B11m94J98Pl03M76l49K54M42o37M20j52k12K87k35m2K66k03q0M48n56K39
7877a5J90l95N52m50K13J26m33q5L86k29M20l40j02J87r2L7L18n83M03ql45M23
7899A78j83j12K85m84M06Ol24O37p12j0N90m78L43P3o60O71p2l22J99Q5q6K38
7921B68n97L23K71l77J84r8L0J8K04k65J24l37M50q1k64K51lm51N68k13Q6N3m16
7944b72L65k01N7N16n81K94J71n56K89j32k2Q5n7l58M38j83nK88o31O86k23k23
7966b55P82p58m8N07n26L34k01j67M39j3j48M43o79J39q0J17J94k31J1L19k67
$$ plain form
7813 -104 -277 386 122 -18 56 -124 110 -10 -337 147 -53 -47 423 -402 132 158 -118 528 -105 -249 335
7834 335 -121 -134 249 -235 238 -20 -334 239 -166 -107 -128 -149 -6 228 -222 164 -37 -203 558 -145 -47 211
7856 211 -283 -85 -78 -381 95 -254 0 442 -195 225 73 -139 148 -87 -129 137 -66 -146 302 -254 -15
7877 -15 175 -220 332 -118 95 221 -212 -297 89 -140 280 -60 -162 25 -67 -30 288 -295 108 100 -245 178
7899 178 -5 -117 168 -316 90 96 -228 409 -303 -313 277 -201 142 215 -445 226 154 -168 31 116 30 268
7921 268 -329 -6 265 -112 72 -26 4 22 226 -39 85 -252 198 117 -147 104 101 -350 218 5 91 144 -272
7944 -272 93 -108 -51 465 -116 178 349 -207 82 -50 -72 13 -44 -402 36 -147 -152 136 -495 191 -32 -255
7966 -255 527 -231 -279 228 -298 36 -165 -332 107 94 -54 389 -290 -151 -231 -114 80 -151 -140 179 -88
7987h8j01L88k25P7l9m26O11m43q8P20k44l48L88m12L11k02j23N95o70J55L72
8008B08o11K41L83o36N90o7m08O51n09L10r1k30M76m0m60M37k76o6K50o99O30
8029H3j57j4M87o41P1K61n27M57K99o93N43K9l83L32o7o4j55j32N57k02m16N23
8051A91k20j63O45n36N4J86k75J87o3k44R03p91R6R2m19M72k2l13M31M5l62N1
8073e5k67J63L3J84J09l11m35R73l78j49M90n29K90k6l32O96n28j21N24m04J17
8094D4L83m89L5M7j06K64k77J58J73o81M92J35n14M19n2J06J4k50k2L40m16Q1
8116a16J81m14N36k54K3L23n30L31J03l16M09k84k53M54k52QK37l75K59p6k47
8137b53K45N6j24L84m82jN3p2O19m50k2M05n11n4P06n72K15o5k48K28l14K46L09
$$ plain form
7987 -88 -189 199 -26 51 12 -414 197 -246 -334 386 142 -206 182 -230 81 -121 -244 351 -319 -164 208
8008 208 -403 -162 221 -415 175 108 -300 351 -158 152 61 -169 307 267 -193 244 -32 -98 152 -547 83
8029 83 -74 -88 399 -242 -171 90 -437 20 319 -374 169 198 -185 147 80 16 -139 -271 286 84 -332 191
8051 191 -29 -192 453 -83 -29 157 -118 69 6 -238 665 -126 -30 62 -357 115 93 -220 211 256 -106 -55
8073 -55 -322 -159 -126 58 167 -144 -579 394 16 -133 357 -172 118 92 -240 456 -72 -193 331 -73 44
8094 44 427 -62 -27 20 -86 178 -99 59 232 -449 43 178 -336 83 31 137 151 -99 -121 219 -197 -116
8116 -116 65 -349 187 -67 -44 279 -251 80 183 -133 276 -8 -261 193 -59 -51 186 -189 70 -6 -253
8137 -253 -8 48 -76 308 -174 -175 -122 -194 425 -25 -47 358 -153 -207 499 -73 142 77 -171 57 -257 -11 298
8160B98n95L77K78p86O57k44l10L16M1p4L53m03K81M4n32N39m43R2L21l39J35
8181Fl0J88R4j90k78N07n37j92Q07o46
$$ plain form
8160 298 -297 80 358 -428 229 -15 -325 -9 32 -42 311 -92 189 233 -299 240 -203 -111 210 -129 6
8181 6 -24 164 258 68 -210 297 -240 -432 375 -271
8191b71
$$ Imaginary data points
##PAGE= N=2
##DATA TABLE= (X++(I..I)), XYDATA
0@%%%%%%%%%%Qj6J6j6K4l2M0m8N6p0Q1r7J18j36J58j84K10k43K83l25L71m24M80
33B54n40O09o86P71q64R63j073J193j323J467j623J794j982K187k410K653k921
50a531L216l545L911m315M767n278N863o537P320q248R368j0741J2474j4740J7828
65I812k2299K9332m1938P0903k44548m6106N18421m26312J58059J59664k38811
76g3823J44396j54104L9012J80408l54155L34241Q3156m24536L71972j12995k99323
87b65751M15717j53595l3270J83572k51010J57942p5065j60191L79030k63047
97f5668l8628L66273l90997M8256K08213k95163K06091J7985r6552J91476k78450
108a27164R5139J66671l52540K99542P0257l20788L08067j18333j70438K48555
$$ plain form
0 0 0 0 0 0 0 0 0 0 0 0 8 -8 8 -8 16 -16 24 -24 32 -38 43 -54 64 -72 86 -98 112 -131 152 -173 198 -226 254
33 254 -286 323 -363 408 -456 507 -566 627 -696 771 -852 942 -1040 1147 -1263 1390 -1531
50 -1531 1685 -1860 2051 -2264 2503 -2775 3088 -3449 3871 -4377 4991 -5750 6724 -8016 9812
65 9812 -12487 16845 -25093 45810 -198738 -244844 273577 -152735 5324 164988 -73823
76 -73823 70573 -83531 -44519 135889 -218266 115975 199131 -225405 146567 33572 -265751
87 -265751 149966 -3629 -36899 146673 -104337 53605 -21460 -181651 197379 -65668
97 -65668 -104296 261977 -129020 -80764 127449 -167714 38377 56362 -40190 151286 -127164
108 -127164 -32025 134646 -217894 81648 151905 -168883 139184 20851 -149587 98968
118I8968j78750R4696Q7461k13643K46247j55407j60560L50141k52557j516K89990
129B05070l03945Q8475P9711k04609K05719j06432j2469K18051k87270J22346
139D647J12752l15389K67160J5567k10158K54679j42108m3524J53334k20704J59382
150C5638L4133j86533K58177j52678j14562K56380k23589N3490J65151k27185
160a01578J53889k1220j38170K09868j76881K2869J99638k60734J37773P6532
170A01986k49751K02296l6686r1056J86018j74623O2634Q5286k22000K11177l4339
181D0942j74979K67871j41299o9694J88876k01114Q4071P3014j63173J82564r5874
192h795p4802K02068k10875N9060J50024k34065J57446K4165j71644J84990j03227
$$ plain form
118 98968 -79782 14914 102375 -111268 134979 -20428 -180988 169153 -83404 -84920 205070
129 205070 -98875 -10400 69311 -135298 70421 -36011 -48480 169571 -117699 4647
139 4647 117399 -197990 69170 84737 -125421 129258 -12850 -56374 96960 -123744 35638
150 35638 69771 -116762 141415 -11263 -125825 130555 -93034 -39544 125607 -101578
160 -101578 52311 31091 -107079 102789 -74092 -51223 148415 -112319 25454 101986
170 101986 -147765 54531 17845 -73211 112807 -61816 818 86104 -135896 75281 40942
181 40942 -134037 133834 -7465 -77159 111717 -89397 -5326 67688 -95485 87079 -8795
192 -8795 -83597 118471 -92404 -33344 116680 -117385 40061 64226 -107418 77572 -25655
203b5655k4605J49912j86434J19269M5047k02884K05111o1593j16730K08930j48909
214c8541O014J21094j77748J27260p209j28099J97278j28694l3668J73688k00214
225h8839P9182R0000j82717J56083l3937r5628J63319j42878L4076J09080j89832
236a02091J48686R007j63091J95010r3673o3526J65642j54756N9955O4438j57157
247i1556J57174n6122r2876J84873j51857J4316J34920j90354J10853L2796j45551
258i3384J64036q2251m7144J46673j57707P0288O7943j68513J58710l4464j10229
269h6042J76607j22646o030J24009j59838R8937K3295j32652J59193q4250n0529
280e9946J53101j54690N1146Q3523j61729J32351j9617j04391J58189j10751m546
$$ plain form
203 -25655 -50260 99652 -86782 32487 77534 -125350 79761 18168 -98562 110368 -38541
214 -38541 -32527 88567 -89181 38079 30870 -97229 100049 -28645 -62313 111375 -88839
225 -88839 -9657 80343 -102374 53709 19772 -75856 87463 -55415 -21339 87741 -102091
236 -102091 46595 55602 -107489 87521 -6152 -69678 95964 -58792 1163 65601 -91556
247 -91556 65618 9496 -83380 101493 -50364 -36048 98872 -91482 19371 52167 -93384
258 -93384 70652 -11599 -58743 87930 -69777 511 68454 -100059 58651 24187 -86042
269 -86042 90565 -32081 -38111 85898 -73940 24997 48292 -84360 74833 -9417 -59946
280 -59946 93155 -61535 -10389 73134 -88595 43756 24139 -80252 77937 -32814 -37360
291c7360J16648j56701R6726K8288j36908J57724p1801o1654J53362j40098L7996
302a3778Q5166j51239J22644j6009j00852J54444j09120q116J21524j56737Q7708
313A5635L8309j39854J47239n9054o6881J44924j29359L2551Q2142j45426J17041
324C7267j3168j01931J52546j01038j7490J24503j46151P2931M6308j30948J31939
335E4768m9380o2692J35774j22172K9356Q3781j43017J08293k470j06094J43030
346F9177q6768k6128J18349j33788O3398M5058j25392J25752m5512o6042J35794
357G3898j16625K0815Q9580j39857R8437O929j04565J35810p8257k8821J16619
368G3963j28256N8844M8488j25419J22048l8561p0949J33669j09858J2424R1980
$$ plain form
291 -37360 79288 -77413 19313 47601 -89307 68417 -3384 -65038 88324 -51774 -13778
302 -13778 71388 -79851 42793 26784 -74068 80376 -28744 -36860 84664 -72073 15635
313 15635 53944 -85910 61329 2275 -64606 80318 -49041 -16490 65652 -79774 37267
324 37267 24099 -77832 74714 -26324 -43814 80689 -65462 7469 53777 -77171 54768
335 54768 5388 -57304 78470 -43702 -14346 69435 -73582 34711 32241 -73853 69177
346 69177 -17591 -43719 74630 -59158 4240 49298 -76094 49658 4146 -61896 73898
357 73898 -42727 -21912 67668 -72189 26248 33177 -71388 64422 -13835 -42656 73963
368 73963 -54293 4551 53039 -72380 49668 11107 -59842 73827 -36031 -23607 68373
379F8373j34609Q8430J2323j04073J26439p0721k9922J12641j23245N4073N1418
390E1127j25131J15839k8549p5912J29625r4944K403Q8498j21154P8144J2468
401C2414r5231J22706o8586l3253J14129j21762M3776O3084j22376R9085j5029
412A8957p4468J13090q6526N224Q1519j19581Q3244J3803j06868J24791n8317
423e132m7479J18412j03459K8615N8570j08894R2625k2338o4841J20482r4048
434b7487L209R4107j29521O9422L3953j07048J07904m0022m3085R6248j01053
445d3373L8301N1343j12383J05043j8258q5034J22764p8276j8996R5424j01991
456d5436N3456K6257q7615R8652n5456l5067J11367j05879L1129P1143j21334
$$ plain form
379 68373 -66236 22194 34517 -69556 56883 -13838 -43760 68881 -54364 -291 51127
390 51127 -74004 41835 13286 -62626 66999 -27945 -25542 62956 -58198 19946 32414
401 32414 -62817 59889 -8697 -41950 72179 -49583 -5807 57277 -65099 33986 18957
412 18957 -55511 57579 -28947 -23723 57796 -61785 21459 35262 -71606 53185 -5132
423 -5132 -52611 65801 -37658 -9043 49527 -59367 33258 10920 -53921 66561 -27487
434 -27487 -24278 69829 -59692 9730 43683 -63365 44539 4517 -38568 57680 -43373
445 -43373 -5072 46271 -66112 38931 20673 -64361 58403 -19873 -38869 56555 -45436
456 -45436 8020 34277 -53338 45314 -10142 -45209 66158 -39721 -8592 62551 -58783
467e8783P8574N333p8351J01090o0097q093P5733j06366O4062K0321j02550J16633
479D7506l7986o0665J10966q8571N169O5518r3392P6016n766o6627J03547q1832
491b6117r518R8050j13515N4900M8198j06523Q7592k4717n2780R2580p8440K7294
503b996N7862j09563Q1043n505q6237J16117n5788k9372R1833r3577L3394L1889
515B9100q5887R2154l3086m4112J05194r4726O241P5015j04293O7305K0053p6499
527d3541Q7348n2866k0488P6028r2641N5602L7658j02364R3785k4080o9522J01092
539D6011o5815J526O7364q8165N8496l491p2823J00420n8207j8192R8373j03642
551c8145K8049N0723r6153P6258r761m7147Q8650p4825Q771N8663j03256P4395
$$ plain form
467 -58783 19791 25124 -53227 47863 -12234 -20327 55406 -50960 13102 33423 -69127 47506
479 47506 9520 -51145 59821 -28750 -23581 41937 -51455 24561 18795 -47832 55715 -26117
491 -26117 -35635 62415 -51100 3800 51998 -54525 33067 8350 -44430 48150 -30290 -2996
503 -2996 54866 -54697 26346 20841 -65396 50721 -5067 -34439 57394 -36183 -2789 29100
515 29100 -56787 35367 2281 -41831 63363 -31363 -25122 49893 -54400 12905 32958 -43541
527 -43541 43807 -9059 -29547 46481 -46160 9442 47100 -55264 38521 14441 -55081 46011
539 46011 -19804 -18278 49086 -39079 19417 15926 -56897 43523 -14684 -32876 65497 -38145
551 -38145 -10096 40627 -55526 20732 10971 -36176 52474 -22351 -13580 45083 -58173 16222
563A6222J8467q5496R9070m4192m3790Q2884p6333L0153L9556q0023Q1514l0392
575G640n9186J00852p5368k157Q3420r2554M4523K0873p6772P6501l8335j6913
587b7476Q1526q9040L5480M3050j03525Q0750J155o6598R0291n1248j2264N7107
599C9208q1413N3976J0385o9435R8203n0599m2955R4779q5276J3404O3025q1117
611c7815N7853o432n2103P7162o6516O736P1517r5602N8207K5865r4697Q3753
623B7928k2425m3144Q1415o2793J8117L6490q2588P2659j4375n9358J00791o1080
635h363k0294P8523q5056L0654L1903o6766P0582l1501k8715P4698q3313K5254
647a2394N6202r2804O7780Q539p3021P8395m1130j6359O2823o9532M3781J6657
$$ plain form
563 16222 34689 -50807 48263 4071 -39719 43165 -33168 -3015 36541 -43482 38032 7640
575 7640 -51546 49306 -26062 -28219 55201 -37353 7170 28043 -48729 27772 -10563 -27476
587 -27476 54050 -34990 490 43540 -59985 20765 21920 -44678 45613 -5635 -17899 39208
599 39208 -42205 11771 22156 -47279 50924 325 -42630 52149 -33127 -19723 43302 -37815
611 -37815 20038 13606 -38497 38665 -27851 -21115 50402 -45200 13007 38872 -55825 27928
623 27928 5503 -37641 43774 -19019 -902 35588 -47000 25659 11284 -48074 52717 -8363
635 -8363 -28657 49866 -35190 -4536 27367 -39399 31183 -318 -29033 45665 -37648 -12394
647 -12394 43808 -48996 18784 27323 -45698 32697 -8433 -24792 38031 -31501 12280 28937
659B8937p5319Q2943l5775m4167R4648o9356K686N9267q0988M7863M117n3358
671c8502P6937n1927p261O8900r0123M1425L5147q5527P6967j3440m9330P5376
683C8642n9402P640M7445p5689O2534j033o4420Q6731n0646k3481P8858p5630
695b8451K6827L6446p3170O3662k1027l8977P7145o5512J0327N6401q6156N2220
707I735J2492o6691P5780l5318k2023O6002p0968L0355L0183p4824P2410j7026
719A0107m8159Q0881n8823k735N8441p4841M6468J1670o1240P3564m0459k2686
731b7812P1634p3922K6586L9524p7804O3071j0107m9457P5698n4618k6N6641p7629
744c8221M7459J3743o7087P5407l2814k8531P1639o7443K1151L8002p3093O2254
$$ plain form
659 28937 -46382 36561 786 -43381 51267 -18089 -15403 43864 -37124 10739 14856 -38502
671 -38502 38435 -13492 -20753 48147 -41976 -551 34596 -50931 26036 12596 -36734 38642
683 38642 -20760 -13120 34325 -41364 21170 20137 -44283 42448 -8198 -31679 47179 -28451
695 -28451 -1624 34822 -38348 25314 4287 -34690 42455 -23057 -12730 43671 -42485 9735
707 9735 22227 -44464 31316 -4002 -26025 39977 -30991 -636 29547 -45277 27133 10107
719 10107 -38052 42829 -15994 -18729 39712 -35129 11339 23009 -38231 35333 -5126 -27812
731 -27812 43822 -30100 -3514 36010 -41794 21277 11170 -38287 37411 -17207 -17233 39408 -38221
744 -38221 9238 22981 -44106 31301 -1513 -30044 41595 -25848 -4697 33305 -39788 22466
756B2466r940m8949P6872n3904n235N9328p4352M0346J8771o4365O8641l0694
768a015k8285O9107o6214J9558M0700p4581N8130l931n1837P2833m7006p053N7099
781C7505p0623L9930J7582o4662P0515k8569l1835P1766o3693J4455M2881p1809
793c6557N4439l428n0108P1864m7974q150N9069p2480L7587K2072o7010O7264
805B6588k4133l3920O8886n9807J3122M2416p1186N3930j076n2446P1980m3689
817i335j2612O0982o8163L1878K4712o4188O2858k1159l4173O7550n8079J0416
829i313M4447p0960M9542L416n4507O8679l8642j5887N9208o4550K8861K5039
841B5333o3159O0980j8422l6681O8566n5051N900M7422o8492M5661O069n3105
$$ plain form
756 22466 12526 -36423 40449 -13455 -18690 40638 -33714 6632 25403 -38962 29679 -1015
768 -1015 -29300 39807 -26407 -6849 33851 -40730 17400 13469 -38368 34465 -12541 -19594 37505
781 37505 -33118 6812 24394 -40268 30247 1678 -30157 41609 -22084 -7629 35252 -36557
793 -36557 17882 14454 -35654 36210 -11764 -19914 39155 -33325 4262 26334 -40676 26588
805 26588 2455 -31465 37421 -22386 -9264 33152 -38034 15896 14820 -37626 34354 -9335
817 -9335 -21947 39035 -29128 2750 27462 -36726 26132 4973 -29200 38350 -19729 -9313
829 -9313 35134 -35826 13716 17132 -37375 31304 -7338 -23225 35983 -28567 294 25333
841 25333 -37826 23154 4732 -31949 36617 -18434 -12534 34888 -33604 12057 18126 -34979
853c4979O5890l6475j5482N7975o3712K7719K7207o4876N9897j6808l8162O6620
865C4814n0454K311M5762o5596M3827O385n3523O6315l5907j9153O2056o2874
877b6037K3180L1435o4344N5677j1868l8533O4924m9131K111M7542o6761M1758
889I953J0895n5831O3287k9499k2274N8777n8167J9683L0091o2325N4980j0948
901H622m1201O5916m7577l422N0312o2612L6040J3248n2692O0084k9918k0848
913b4048N9566n8861K0417L4113o5114N1556n903m3052O2580m1824k700M6488
925C3218o2492L7490J1471n6489O3404k6270k6822O1666n5066J1884L4055n8717
937c2668M8121o050l8545O1969m6019n272N1942o3410L3040K1539n5442N3379
$$ plain form
853 -34979 30911 -5564 -21046 36929 -26783 936 28143 -36733 23164 6356 -31806 34814
865 34814 -15640 -13329 32433 -33163 10664 17049 -36474 29841 -6066 -25219 36837 -26037
877 -26037 -2857 28578 -35766 19911 8043 -30490 34434 -14697 -12586 34956 -31805 9953
889 9953 20848 -34983 28304 -1195 -23469 35308 -22859 -3176 26915 -35410 19570 8622
901 8622 -32579 33337 -14240 -17662 32650 -29962 6078 19326 -33366 26718 -3200 -24048
913 -24048 35518 -23343 -2926 31187 -33927 17629 11726 -31326 31254 -10570 -13270 33218
925 33218 -29274 8216 19687 -36802 26602 332 -26490 35176 -19890 -8006 26049 -32668
937 -32668 15453 9403 -29142 32827 -13192 -18464 33478 -29932 3108 24647 -30795 22584
949B2584k0079k6062N3586n0322J7362L3094o1712M9322m600m8781O4170l4574
961f012j2930N0823n3897K4979J3918m9987N5220k4164k3063O2241n6608Q403
973a1077M1408o3342M0593P465m0768N3199l4587o652M2760n9734L6536J9817
985B5618n9226N9290j7256l7909N7509m2563M220L6542n0211M0303p312m1073
997c2068O0497m1319r043N9864n9827J9178K7144n5017M2513j0078k2344N0755
1009C0255m6121J2740L1551o4454M6109P848n0662O0680k3627k3658M4602m5462
1021b0199J9643J7378m3418N2835k2526l1439O0491n1477J02N0292n5075K9160
1033E767J1873m2970M2640k8232n144M6567n4567K9347K2833o4111N0523n434
$$ plain form
949 22584 2505 -23557 30029 -20293 -2931 30163 -31549 17773 13173 -35608 28562 -6012
961 -6012 -18942 31881 -22016 2963 16881 -33106 22114 -2050 -25113 37128 -19480 -11077
973 -11077 30331 -33011 7582 15047 -25721 27478 -7109 -13761 28999 -30735 5801 25618
985 25618 -33608 25682 8426 -29483 28026 -14537 -10317 26225 -23986 16317 9005 -32068
997 -32068 28429 -12890 -21933 37931 -21896 -2718 24426 -30591 11922 1844 -20500 30255
1009 30255 -15866 -3126 28425 -36029 10080 17928 -32734 27946 4319 -19339 25263 -20199
1021 -20199 -556 16822 -26596 26239 3713 -27726 32765 -18712 -18610 31682 -23393 5767
1033 5767 17640 -25330 17310 -10922 -16066 30501 -24066 5281 28114 -35997 14526 9092
1045I092l9050N7267l1317l079L2111n0488L4340J0l9854O2429l2223k0378N5511
1058C4371n5229R690L3258m7199L8755n200k7836M4678m4223O421L9973n7852
1070c0393L9837J4597n4819M8774j7302k3802M6103l6522J6409J9276m8852M4717
1082A8023j4183l4622O1759l7633p333M5795n2111J9455J3442l8450M5244k1700
1094b314j2144M5191n3803J6589L0397n6449M3984M040l9234M5966k9549n885
1106a3211L3604m4517L4064Q366m5969N2510k4580k7301N4815m0458O273L1439
1118B5035m5014L1359o574k9308M8859l5819K11M3156n5667K3609J9386m9578
1130c0345M3304q273k1639M0553l7770J0558K2125m8269M3815j776l9049N3840
$$ plain form
1045 9092 -29958 27309 -4008 -7087 25024 -25464 8876 8886 -30968 31461 -762 -21140 34371
1058 34371 -20858 -11168 22090 -25109 13646 8446 -19390 25288 -18935 -12514 27459 -30393
1070 -30393 9444 24041 -30778 17996 694 -23108 22995 -13527 2882 22158 -26694 18023
1082 18023 3840 -30782 30977 -6656 -13989 31806 -20305 -850 12592 -25858 19386 -2314
1094 -2314 -14458 30733 -23070 -6481 23916 -32533 11451 15491 -23743 22223 -7326 -13211
1106 -13211 20393 -24124 9940 18306 -27663 24847 267 -27034 27781 -12677 -6404 25035
1118 25035 -19979 11380 4806 -24502 24357 -11462 -11251 31905 -23762 -153 19233 -30345
1130 -30345 12959 4686 -16953 23600 -14170 -3612 18513 -29756 14059 12283 -26766 27074
1142B7074k9530j6530M2868m1293J7901J6646l7269M0157k0671j9958M7358m3822
1154a7069R409L5595n1549L0748N948l8256M1428k2335o110L5861m3888K4236
1166D018J2874m7231M7255j1623k8520M9509l4016j494K9638m1431K9381Q22l0628
1179b1446M6320l0671j0118M3172m7217J7133K4006m3890L5571o576k5308L8995
1191A9971l2963O418K8232m5177L2649L488l9817M6061k0729j6519M1540l6787
1203a3633J2260J7774l8560L6459j1117k2924M5683l6110Q67L4305m6024K4827
1215C807J0280l5662L9004j8735j2816L5876l9365J6374J9218m2582L8105o939
1227F565k9261M3774k9316k970L1896l9331K4162O208l4107M0974k0841j4085
$$ plain form
1142 27074 -2456 -18986 23882 -17411 490 17136 -20133 20024 -647 -20605 26753 -17069
1154 -17069 -7660 27935 -23614 7134 13082 -25174 16254 -6081 -12191 23670 -20218 4018
1166 4018 16892 -30339 16916 5293 -23227 26282 -7734 -9228 20410 -21021 8360 9182 -21446
1179 -21446 24874 -5797 -15915 27257 -19960 -2827 21179 -22711 12860 6284 -19024 19971
1191 19971 -12992 -6574 21658 -23519 9130 12618 -27199 18862 -1867 -18386 23154 -13633
1203 -13633 -1373 16401 -22159 14300 3183 -19741 25942 -10168 -9301 25004 -21020 3807
1215 3807 14087 -21575 17429 -1306 -14122 21754 -17611 -1237 17981 -24601 13504 6565
1227 6565 -22696 21078 -8238 -11208 20688 -18643 5519 11727 -22380 18594 -2247 -16332
1239a6332M1012l9143J1378K3160m1266L1831l446k6175L9760k8716j218L0822
1251B1667m1429K3851R497l6945L9704j6049j7690L8348l4219Q750K2139l8805
1263b1181L1350l523k6883M0300k7427l566L2724l9367K0345J1756l5522L6448
1275A5454j4231j6753L7745l4043Q026K2837l9610L0244j602k8019L8796k5224
1287f380n243L2083l8153J9141J1874l5096L6064j3210j8041L7548l2562O928
1299e047K3347l7940K8307j25k7854L8618k4021o435L2316l6626J7192J2892l4661
1312b0037L3788j1572j8138L5996l0602M792K3882l7669K6630J508k8349L6307
1324A6536k0637q247L1217l4405J5417J4102l3955L2309r406j9291L6132k9189
$$ plain form
1239 -16332 24680 -14463 -3085 20075 -21191 10640 7194 -18981 20779 -7937 -9155 21667
1251 21667 -19762 4089 13586 -23359 16345 296 -17394 20954 -13265 -4515 17624 -21181
1263 -21181 10169 6646 -20237 20063 -7364 -10930 21794 -17573 2772 14528 -20994 15454
1275 15454 1223 -15530 22215 -11828 -3802 19035 -20575 9669 8067 -19952 18844 -6380
1287 -6380 -11623 20460 -17693 1448 13322 -21774 14290 1080 -16961 20587 -11975 -5047
1299 -5047 18300 -19640 8667 8542 -19312 19306 -4715 -11150 21166 -15460 1732 14624 -20037
1312 -20037 13751 2179 -15959 20037 -10565 -5773 18109 -19560 7070 8578 -19771 16536
1324 16536 -4101 -12348 18869 -15536 -119 13983 -19972 12337 2931 -16360 19772 -9417
1336i417L279K4782l6473K4555L241k8600L5313j9320q981L1674l4324J4146J4976
1349A4851l4537L1324q276k0324L5169k7550J867K4740l5343K3193M158k8251
1361a8979L4281j8094r683L2057l3316J2848J6366l4066K9814o074k1164L4104
1373A8094k5088N16K4330l4221K1623N027k9096L3665j6469j1631L1659l0984
1385a2575J0217J6343l2225K7462n464j9952L3522k5352J08K5445l4209K0400
1397C720P270k9015L1686j3969j1632K9795k9160J0431J5865l2356K8244n146
1409E733k2606L4269k3194k708K5909l1925J7614O425k7146L0516j4812j0776
1421a2701L0850l0340R013J8267l3403K5629j079k1672L0851k0681j884K3421
$$ plain form
1336 -9417 -6138 18644 -17829 6726 9967 -18633 16680 -2640 -11621 20053 -14271 -125 14851
1349 14851 -19686 11638 3362 -16962 18207 -9343 -7476 17264 -18079 5114 9272 -18979
1361 -18979 15302 -2792 -12475 19582 -13734 -886 15480 -18586 11228 5154 -16010 18094
1373 18094 -6994 -6478 17852 -16369 5254 10281 -18815 14850 -1619 -13250 18409 -12575
1385 -12575 -2358 13985 -18240 9222 3758 -16194 17328 -8024 -7916 17529 -16680 3720
1397 3720 10990 -18025 13661 -308 -11940 17855 -11305 -874 14991 -17365 10879 5733
1409 5733 -16873 17396 -5798 -8506 17403 -14522 3092 9517 -17629 12887 -1925 -12701
1421 -12701 18149 -12191 -3178 15089 -18314 7315 6236 -15436 15415 -5266 -7150 16271
1433A6271l1197J9390O631k8542L1599j2650j4936L0752k6096N141J7672k8566
1445a4531K2749l459k0318L0814k2056k762K7496l2091J5047J0573k8939K6925
1457I448q519j2763K7552k5229P879J5543l1785K5679k291k1992L3144j8371o929
1470h634K4450k7865J2860R253k4356K7428j3397j2657K9613k8099O560K1408
1482A6564l2415K0536K534k2516K6026j6600j501K2414k8857J6773R271l0996
1494a8767K9152p322j7727K9949j9659P24J6312k5756J9855k490j8932L1599k0253
1507c315o769K8167l0277Q985J5098k5909K2338n363j2857K3464k4454O937J7945
1520A3990l0947K3578L900k7648K8785j2981j0014K3826k0922J1107P356k4281
$$ plain form
1433 16271 -14926 4464 11095 -17447 14152 1502 -13434 17318 -8778 -3637 14035 -14531
1445 -14531 8218 4759 -15559 15255 -6801 -9563 17933 -14158 889 11462 -17477 9448
1457 9448 929 -11834 15718 -9511 -1632 13911 -17874 7805 5514 -16478 16666 -1705 -8634
1470 -8634 15816 -12049 811 10064 -14292 13136 -261 -12918 16695 -11404 -4844 16564
1482 16564 -15851 4685 7219 -15297 10729 -5871 -7372 15042 -13815 2958 12229 -18767
1494 -18767 10385 3063 -14664 15285 -4374 -3650 12662 -13094 6761 4271 -14661 16938 -3315
1507 -3315 -10084 18083 -12194 -3209 11889 -14020 8318 2955 -9902 13562 -10892 -3955 13990
1520 13990 -16957 6621 10521 -17127 11658 -1323 -11337 12489 -8433 2674 10030 -14251
1532a4251K6495j2551j4698L3016k4329J14K3369k8945J2894N015j8802K3655
1544A0982j4445k238K1750l0722J3923J2648l0734K7080j305k0270K5453j7151
1556e029r06J5189k2071K0699j013k1074K9756j8382j0975L0224k4530N364J6573
1569A3825k3776J6482n812j1938K4156k1708O019K0025l2597J7995O943k7448
1581a7834K6022o537r895K0594k0523Q234O736k3801K7823p325j7287L1816k2284
1594d261n814K3574k4054J1787P115j7083K0473j5614m738K3033k7915J2969J6893
1607A6365l0905K0818K08k1341K3069j2332L14J5486k3155J7261l02k3364K9914
1620A2036j2543j1458K9090k2512J108J4316k2415J7231k089j1341K4383k1987
$$ plain form
1532 -14251 12244 -307 -15005 18011 -6318 -6204 17165 -11780 1114 6129 -12673 10982
1544 10982 -3463 -5701 16049 -14673 -750 11898 -18836 8244 6939 -13331 12122 -5029
1556 -5029 -5935 9254 -12817 7882 6869 -14205 15551 -2831 -13806 16418 -8112 -2748 13825
1569 13825 -9951 6531 719 -11219 12937 -8771 -2752 17273 -15324 2671 9614 -17834
1581 -17834 8188 1651 -8244 12350 -8173 61 6797 -17004 10819 3494 -13793 18023 -4261
1594 -4261 -10075 13499 -10555 1232 8347 -8736 11737 -3877 -8615 14418 -13497 -528 16365
1607 16365 -14540 6278 6486 -14855 8214 -4118 -3804 11682 -11473 5788 5486 -17878 12036
1620 12036 -507 -11965 17125 -5387 -4279 10037 -12378 4853 2764 -8577 15806 -6181
1632f181M62K0789k9967J5812J0840k4728K2314o549j2148J8844j9349R042J1185
1645A0366k4111K3538n167k0923K8328j6112n273K3184k1683R622N163j9740K1727
1658H919j1383o482K5636k5013N891J6465k8313J7526L192j7386K2607j3668k717
1671d726J6079k4735J5552O316k3322K5925q433j5364K4588j9090K006J5434k0643
1684a0413J7070k576j6269K4150j7380l099K3895k5423J0723J0555k4000J9352
1696F585n311j0719K2171j8961N238J2968k5748J8966N57k0169K6165j2380p285
1709g923K0019k1586R020P607j9751K2203q693j1723K4663k1690K197J8351k4256
1722a1562J5575L253j8485K1387j2727m089J9675k2951J1546R132k4302K1545
$$ plain form
1632 -6181 -5719 15070 -14897 915 11755 -12973 9341 2792 -9356 9488 -9861 -819 10366
1645 10366 -13745 9793 4626 -16297 12031 -4081 -9354 13830 -7853 1769 6932 -12808 8919
1658 8919 -2464 -8946 16690 -8323 -2432 14033 -14280 3246 6438 -10948 11659 -2009 -4726
1671 -4726 11353 -13382 2170 8486 -14836 11089 2656 -12708 11880 -7210 -5204 10230 -10413
1684 -10413 6657 4081 -12188 11962 -5418 -8517 15378 -10045 678 11233 -12767 6585
1696 6585 1274 -9445 12726 -6235 -997 11971 -13777 5189 5746 -14423 11742 -638 -7923
1709 -7923 12096 -9490 -470 7137 -12614 9589 896 -10827 13836 -7854 -5657 12694 -11562
1722 -11562 4013 7266 -11219 10168 -2559 -6648 13027 -9924 1622 10754 -13548 7997
1734G997n026j4999K3814j6523N10J5271k2393J5196O10j7750K4354j3385o788
1747i112K2458k2585P417J1669k1872J8646l699j2602K1712j7841J695J6220k3924
1760a1818J6273L316k0173K2719j0786q176K0916k0214P313J0160k1923J9545
1772G152m808j3896K3456j7243l09J7423k2822J3030M504j8937K1904j0452p302
1785h300K0895k1158P601J1093k2485J8921k565j4822K2664j5784j108J7065k2023
1798a0006J2733M505j9059K1378j0196q487K1298k0062N731J2062k2222J7999
1810E674k282j4809K2429j5370j446J7556k2171J2499N366j9352K1219r130q808
1823h625K1044j9399N470J2200k2165J7395j641j5056K2241j4984k298J7569k2049
$$ plain form
1734 7997 2971 -12028 11786 -4737 -4227 11044 -11349 3847 4457 -13293 11061 -2324 -9112
1747 -9112 13346 -9239 -1822 9847 -12025 6621 2922 -9680 12032 -5809 -4114 12106 -11818
1760 -11818 4455 7771 -12402 10317 -469 -8645 12271 -7943 -630 9530 -12393 7152
1772 7152 2344 -11552 11904 -5339 -5648 11775 -11047 1983 6487 -12450 9454 -998 -8300
1785 -8300 12595 -8563 -962 10131 -12354 6567 4002 -10820 11844 -3940 -5048 12017 -10006
1798 -10006 2727 7232 -11827 9551 -645 -9132 12166 -7896 -2165 9897 -12325 5674
1810 5674 3392 -11417 11012 -4358 -5804 11752 -10419 2080 7446 -11906 9313 183 -8625
1823 -8625 12419 -6980 -1510 10690 -11475 5920 4279 -10777 11464 -3520 -5818 11751 -10298
1836a0298J1862N767j9870K0704q281r457K1071j9069M833J2627k1480J6784j006
1849D187j5198K1920j4101k812J7944k1546J1154O834k0205K0380p453j0199K0733
1862A1638j7747L484J3075k1561J5787l8j5876K1570j3391l659J8084k0697R707
1875C76P465j9674J9183o469j0310K0571j7251L210J3481k1439J5497P51j6366
1888a0975K1630j2338m741J8109k0246R157P516j9131J9041o601j0671K0680j7639
1901f209K613J4093k1730J5013J571j6693K0498j1833m114J7716j9853R414P880
1914H366k0469J9574n331j2184K1450j6284J281J4385k0596J3452J525j5803K0704
1927A0070j1728m904J8650k0494P086J0032k0306J7459l049j2060J9506j5655
$$ plain form
1836 -10298 1564 7331 -12539 8165 -116 -9573 11498 -7571 -2738 9889 -11591 5193 4187
1849 4187 -11011 10909 -3192 -6004 11940 -9606 1548 8382 -11823 8557 1104 -9095 11638
1862 11638 -6109 -2625 10450 -11111 4676 4638 -11238 10332 -3059 -6718 11366 -9331 376
1875 376 7841 -11833 7350 881 -9429 11142 -6109 -2899 10582 -10857 4640 5391 -10975
1888 -10975 10655 -1683 -6424 11685 -8561 596 8112 -11019 8022 1421 -9250 11430 -6209
1901 -6209 -3596 10497 -11233 3780 5351 -11342 9156 -2677 -6791 10925 -8928 486 8366
1914 8366 -12103 7471 2140 -10044 11406 -4878 -3597 10788 -9808 3644 5169 -10634 10070
1927 10070 -1658 -6562 12088 -8406 -1320 8712 -11594 5865 2816 -9244 10262 -5393
1939e393J310J3602k0292J4535K415j7648K0614j0492p182J9546j7970O490R300
1952H835j8743J6421m812j1531K1157j5957R98J5784k1857J1688M109j7368J9150
1965G874q469n760J7283j9034P015Q787k0472J8861k661j3669K1003j4199k409
1978e850J5140j8626J1674M157j5859J8781j0417p237J9283j8595N943J2486k0226
1991i346J4275j129j3859J8454j2297M16J4615k0258J1488L521j8982K0398o812
2004D84q633J9568j6448K649R567j7949J5619k186j1240K0645j5111k812J6281
2017A0434k0418J0095P963j6593J6432o788q371J6086j6991O851J1485k0176J6235
2030F244j650j6683J9773j0612l522J6808j6878Q484L233j6918J8059p881o656
$$ plain form
1939 -5393 -4083 9519 -10773 3762 6177 -11471 9143 -1349 -8531 11015 -6955 -465 8835
1952 8835 -9908 6513 1701 -9830 11327 -4630 -3632 12152 -9705 1983 6092 -11276 7874
1965 7874 -595 -6355 10928 -8106 -1091 7696 -12776 6085 3424 -10245 10758 -3441 -5850
1978 -5850 9290 -9336 2338 6495 -9364 9417 -1000 -8237 11046 -7549 -1606 10880 -9346
1991 -9346 4929 3800 -10059 8395 -3902 -3486 11129 -9129 2359 5880 -13102 7296 484
2004 484 -8149 11419 -5029 -2380 7187 -10762 4857 2671 -8569 12076 -3035 -5847 10434
2017 10434 -9984 111 8074 -8519 7913 1125 -7246 8840 -8151 -1300 10185 -9991 6244
2030 6244 4594 -12089 7684 -2928 -6450 10358 -6520 1964 5197 -11721 6338 -1543 -8199
2043h199K0820j7637K174J2515k0288J2803J999j1962J8042j1615k474J3170k0018
2056a0670J1252P261j8297J8928n336j2421J7284j3828J914J1974j5797J3708
2068E972k122j4717J9322j2996l233J9461j8110O992P679j8311J4378m542o833
2081g060J7808j5096L606J0719k1379J4316J948j5183K0128q919o235J4059j6836
2094h124P330N975j4852J8144o792j0628J9106j6847N55J5819j7419J1102K530
2107E899j4147J4708j0377k041J5948j7233R612P064k0448J5836k636j1767J8911
2120I329j1030M2J0258j7163J1204k11j3244K0451j0120o065J7448j8306L909
2133c498R997j5335J4043k572q800J5543j5563K252J2856j8475J2877M599j7606
$$ plain form
2043 -8199 12621 -5016 -2842 9673 -10615 2188 4187 -7775 10267 -1348 -3822 9348 -10670
2056 -10670 582 7843 -10454 8474 3138 -9283 8001 -5827 -3913 8061 -7736 5972
2068 5972 3850 -10867 8455 -4541 -7774 11687 -6423 569 8248 -10063 4315 -227 -7060
2081 -7060 10748 -4348 -742 9977 -11402 2914 4862 -10321 9807 888 -5347 8712 -8124
2094 -8124 -794 5181 -9671 8473 1681 -8947 10159 -6688 -6133 9686 -7733 3369 5899
2107 5899 -8248 6460 -3917 -5958 9990 -7243 2369 9433 -11015 4821 2185 -9582 9329
2120 9329 -1701 -1659 8599 -8564 2640 2429 -10815 9636 -484 -6549 10899 -7407 -3498
2133 -3498 6499 -8836 5207 2635 -6165 9378 -6185 -3933 8923 -9552 3325 7924 -9682
2146i682J6335p019o766J5424j3428O492O398j6567J4954n221j1164K0178j3064
2159c130j356J4578j7781P875L682j3033J5969p836m246J5607j8033O086R089
2172G471j7907J5178P0j2547J5953j0868j554J1645j5190J0926K537j4513J7196
2185H397q908p760J7669j4781L489J0050j5691J1194k007j0169J6358j1956M8
2198d067J3663j8154R352M871j5934J5862m585p066J4750j3477L977P587j5632
2211h853J3787j436j1644J7407j1221l303J3772j5354P678N012j3699J4120o679
2224d13o387J5329j4512M181J0140j7209J2003N04j2531J5661q738k254J2492
2237H266j4956P994M246j4932J5705n346q056J6009j2761J582R855j5296J0810
$$ plain form
2146 -9682 6653 -366 -7132 8292 -5136 1356 7754 -8813 6141 920 -10244 9934 -3130
2159 -3130 -4486 10092 -7689 186 3868 -9165 6804 -1032 -5278 10329 -7704 -1618 7471
2172 7471 -10436 4742 4812 -7735 8218 -2650 -4204 7441 -7749 3177 5714 -8799 8397
2185 8397 -511 -8271 9398 -5383 -1894 8156 -7535 3659 1652 -8517 7841 -4115 -4067
2198 -4067 9596 -8558 794 5665 -10269 5593 1008 -6058 8692 -4785 -808 6779 -8853
2211 -8853 4934 3498 -8146 9261 -1960 -5263 8509 -6845 833 5845 -7854 6266 -413
2224 -413 -6800 8529 -5983 -1802 8338 -8871 3132 3636 -8895 6766 -1972 -4226 8266
2237 8266 -6690 1304 5550 -9382 6323 977 -7079 8930 -3831 -2249 7606 -7690 3120
2250C120L99j0843J4929r868k824J3592j5639P007O637j5011J3571m061q218J4870
2264G661j2274K178R668j5413J1251Q92j2754J6111q700l903J3743j4047N939
2277C52N599j3895J3417m209p957J5308j2551J039J0691j5446J0011J608j1831
2290g864J4298p832m157J3352j4063N744O523j4404J3028l035q982J5053j0972
2303c311L60J0406j4073Q535K089j1722J4442p228m839J3762j3401M249P468j4456
2317g719J2079k500q689J4388j1179L78J0681j4792R216K456j2411J4020o613
2330f85m707J2802j2603M087P276j3771J2007k242r183J4486j0142p75J1196j4072
2344f326Q286L039j2317J3422o196n227J3091j2668L829P121j3714J1247j196
$$ plain form
2250 3120 3519 -7324 7605 -2263 -5087 8505 -7134 -127 6510 -8501 5070 1009 -7209 7661
2264 7661 -4613 -2435 7233 -8180 3071 3963 -8791 7320 -1380 -5283 8460 -5587 352
2277 352 5951 -7944 5473 1264 -6693 8615 -3936 -2897 7794 -7652 2359 3967 -7864
2290 -7864 6434 -1398 -5555 7797 -6266 -522 6001 -8403 4625 1590 -7392 7661 -3311
2303 -3311 -2951 7455 -6618 1917 4006 -7716 6726 -502 -5341 8421 -4980 -731 6737 -7719
2317 -7719 4360 1860 -6829 7559 -3620 -3242 7439 -7353 1863 4319 -8092 5928 -685
2330 -685 -5392 7410 -5193 -1106 6170 -7601 4406 2164 -7019 7467 -2675 -3450 7746 -6326
2344 -6326 1960 4999 -7318 6104 -92 -5319 7772 -4896 -1067 6054 -7660 3587 2391
2357B391r558J3890r393j268J0829j3376P333L685j2347J3409n465n723J3195
2370G602j2039L283P895j3869J0723o47r639J3657r047j273J0864j3487O873L646
2384D542j2184J2870n093o113J3083j1317K407Q091j3498J0284o58r453J3513
2397F474q638j749J1192j3109O476M598j2209J1803m291o000J2749j1030K185
2410a549Q378j3494R605L02j0058J3206p821k620J0507j1741N639M016j2041J2128
2424D457l973o664J3503j1159J264Q810j2732Q862N43q793J2270p981k004J0960
2438G363j2842N805N702j2757J1132k858p173J1652r343J829P414j2244R011R7
2452B788j0650J3368o919l443J1921j1631L992N043j1061J0326l055n777J2380
$$ plain form
2357 2391 -7167 6723 -2670 -3938 6891 -6485 848 4533 -7814 5595 130 -5593 7602
2370 7602 -4437 -1154 6741 -7128 3595 2948 -6691 6966 -2081 -3354 7510 -5977 896 4542
2384 4542 -7642 5228 135 -5978 7105 -4212 -1805 6286 -7212 3072 2414 -7039 6474
2397 6474 -2164 -3913 7279 -5830 646 5244 -6965 4838 547 -5453 7296 -3734 -1549
2410 -1549 6829 -6665 2940 3242 -6816 6390 -1431 -4051 6456 -5285 354 4370 -7671 4457
2424 4457 484 -6180 7323 -3836 -2572 6238 -6494 2368 2911 -5882 6388 -1593 -3597 7363
2438 7363 -5479 326 6028 -6729 4403 1545 -5628 6024 -3319 -1490 5924 -6320 2691 2788
2452 2788 -7862 5506 -1413 -4856 7065 -4566 -574 4469 -6592 3734 679 -5098 7282
2465G282j0895J379R213j3898Q674K653j0603J1610n466l790R528j0875N541M776
2479E129j1796J1593l131q815J3105q963q21R930j0915O520P99r332J1584p052
2493b165k184J2120j2364M017O638j3152R242J54p152J0975p681K99O683j2092
2507f662Q678J516j0480J3442n667o159J1122r738J782O197r299R449l302o526
2521e647J1609j0336Q26J1035j2750O032M318j1225Q759l161l240R824r622M809
2535A231M248j3170J0828j008r242J3758o523k870Q234j0159M846J784p548J1693
2549F102o026m627J1741j2649K075R277j1660P862J268p745Q615p695P57Q271
2563E566j1344Q692K722j2866J1237l252p024J1956o853Q78N455j0390P717k362
$$ plain form
2465 7282 -3613 -2234 6979 -6919 1755 4408 -6195 5415 -51 -3841 5687 -5188 353 5129
2479 5129 -6667 4926 1795 -7020 6085 -2878 -3699 6231 -4684 1836 2635 -6697 4887 -2165
2493 -2165 -4349 7771 -4593 -576 6062 -7090 2152 2306 -4846 6129 -1552 -1253 5430 -6662
2507 -6662 2016 3532 -6948 6494 827 -5332 5790 -3948 -2166 4031 -5268 4181 879 -5647
2521 -5647 5962 -4374 -3548 7487 -5263 769 5087 -6138 2621 -540 -3780 6044 -3578 1231
2535 1231 5479 -7691 3137 2129 -7113 6645 122 -2748 5486 -4673 173 1957 -5591 6102
2549 6102 76 -4551 7190 -5459 -3384 5893 -5767 2095 3363 -4382 4233 -3462 -2705 5566
2563 5566 -5778 2914 5636 -7230 4007 755 -6269 5687 -1166 -288 5167 -5223 2494 132
2577A32o575J3356q376j747J0774j2716L278M980q785R089k538l611Q552j1020
2591e207L594O613j2284J0889J364j0726J0818n622l942Q734p496N219K217r385
2605e214J0213o183n300J3470r904J067Q933j1704M798J461p429R783n790L71
2619a428Q271j2717N545M488j2025J0883k27p237R960p095o89N672r206R284o26
2634B853q137J2073q229l986J1554j0246L309O144r556P461l174n075R721q956
2648d244L237P980j2753P710J337j0670J0462k832l214Q297q480L763K161r472
2662f718J0785k685o449J2392q694k100Q576r883N633K286p212R087o523j881
2676c386Q919j0972M761O451j1624Q770n49q116R520o237O46O835r662P024K59
$$ plain form
2577 132 -6443 6913 -1463 -3210 7564 -5152 -1874 3106 -5679 3410 872 -2739 5813 -5207
2591 -5207 -1613 5000 -7284 3605 4969 -5757 5061 -561 -4503 4231 -3265 1954 4171 -5214
2605 -5214 4999 -1184 -6484 6986 -2918 -1851 7082 -4622 176 1637 -5792 3991 -1799 -1428
2619 -1428 6843 -5874 -329 4159 -7866 3017 2790 -4447 5513 -1582 -2271 3401 -5805 3479 2853
2634 2853 -5284 6789 -1440 -5426 6128 -4118 -809 5335 -4221 3240 66 -5009 4712 -4244
2648 -4244 -1007 6973 -5780 1930 3267 -7403 3059 227 -2987 5310 -3170 593 2754 -6718
2662 -6718 4067 1382 -5067 7325 -1369 -3469 5107 -4776 857 3143 -4069 5018 -1505 -3386
2676 -3386 5533 -5439 -678 5773 -5851 2919 2370 -5746 3774 -2463 -1817 5018 -4644 2380 2639
2691B639r435J1515n122m073J1325r192J545N289r661P638j624m796J0268q631
2705b315J9Q268j2055O347L810r769R515l554m400Q384q552L673M821j0052R454
2720C594j505q157J1085p027j570R213r354N084J993q682R679m891l188J0106
2734F380r638K398O251j1036P639J51p466R854n892j116P474j0152N909K252r118
2749f110J0160l620n434J0346q405J315O405r486P492k37p235J0165o805j658
2763c107R216j0577M712M205j0021R005k723n149R593q118J919O142j0893P818
2777B022J05q003J0701n852k338Q703r570M026M089r251Q871k652n422J0180q054
2792b445P64P139j0660P184J003p905R796n681k431Q899r595M210L970j0158R286
$$ plain form
2691 2639 -6796 4719 -403 -4476 6849 -2343 -798 4491 -5170 2468 844 -3952 6316 -2315
2705 -2315 -2296 5972 -6083 264 4074 -5695 3820 266 -4134 4250 -4302 -629 4192 -5860 3594
2720 3594 2089 -6068 5017 -2010 -3580 5633 -3721 1363 3356 -5326 4353 -538 -3726 6380
2734 6380 -3258 -860 5391 -5645 1994 2145 -5321 4533 -1359 -2475 4999 -5153 756 3008 -6110
2749 -6110 4050 430 -5004 5342 -3063 -1748 4657 -4829 2663 2426 -4809 5356 -1449 -3107
2763 -3107 6109 -4468 244 4449 -5572 3433 710 -4439 5154 -2964 -1045 5097 -5796 2022
2777 2022 2127 -5876 4825 -1027 -3365 5338 -4232 -206 3883 -5368 3503 851 -4571 5609 -2445
2792 -2445 -1681 5458 -5202 1982 2985 -4920 4876 -805 -3236 5663 -3932 278 4248 -5910 3376
2807C376k593n679J0153q030N36P138j0330P038R77q269J0242n488k695R295r480
2822c809L669M215r307Q779k232n905R973p572L20P369j0210O282J365q658J0028
2837D307m822l242R024r192L252N040r984Q489j650o509J0601p697o9P630r978
2852d800N999J832q312R600m523l502R413r351L200N389j0283Q432j156o767R860
2867E031p073l56P638j0261O117K036q829R718m443l928R792r040K514N501j0049
2882e632Q017p44o739J0183o910o67P885r980N719K494r181R754m028l883Q881
2897E169q047J969N392r777Q118q46p353J0328o600j338Q414r772M735K707q573
2912e474Q905l489l951R541q872K115O327j0331P523R2p299R645n630j509P733
$$ plain form
2807 3376 783 -4896 5257 -2773 -2237 4901 -5429 1609 2586 -5683 4559 -929 -3624 5671 -3809
2822 -3809 -140 4075 -5232 3547 1315 -4590 5383 -2189 -1869 5500 -4710 1572 2937 -5721 4307
2837 4307 -515 -3757 5267 -3925 -673 4367 -5617 2872 1222 -5287 5314 -2383 -2452 5178 -4800
2852 -4800 1199 3031 -5281 4319 -204 -3706 5707 -3644 -444 4945 -5338 3094 1938 -4829 5031
2867 5031 -2042 -2398 5240 -5021 1096 3132 -5697 4021 -422 -4350 5442 -3598 -1084 4417 -5632
2882 -5632 2385 1641 -5098 5085 -1825 -2492 5393 -4587 1132 3626 -5555 4199 171 -3712 5169
2897 5169 -2878 -909 4483 -5294 2824 1978 -5375 4953 -1647 -2985 5429 -4343 392 3099 -5474
2912 -5474 3431 -58 -4009 5532 -3340 -1225 5102 -5229 2294 2386 -4913 4732 -898 -2407 5326
2927E326r397M942K657q908R765l815n158R734q152J203O306r314O586K01o873
2942d897R337o447j067Q636r889M730L593r463Q586k346m841R159p493J532N752
2957D882r840P520j97p949J0505n390k747Q561q843L106L975q375P975k644m589
2972d050R181q143Q33P230j0339O797J818q094Q495m647k168P801q505M494L340
2987D043r479R014k224o272J0123o709m33O653q709N315M55o795R526n570j995
3002c057Q889j0010L063N337r303P167o10n260Q172o902O08O190r360P019J343
3017C286q692R643l851m414Q746o975J922M232q104P748k906n702J0336p491j55
3032b377Q485j0278M182K697p668P662l052k324P486q709L580M495j0399Q473
$$ plain form
2927 5326 -4071 871 3528 -5380 4385 570 -4588 5146 -3006 -1803 4503 -4811 1775 1976 -4897
2942 -4897 4440 -2007 -3074 5562 -4327 403 3996 -5467 3119 773 -4068 5091 -2402 -870 4882
2957 4882 -4958 2562 2365 -5584 4921 -469 -3216 5345 -3498 -392 3583 -4792 3183 539 -4050
2972 -4050 5131 -3012 -2179 5051 -5288 1509 3327 -4767 3728 -919 -3087 4714 -3791 703 4043
2987 4043 -5436 3578 1354 -4918 5205 -1504 -1937 4716 -3993 1322 1777 -5018 4508 -1062 -3057
3002 -3057 5832 -4178 -1115 4222 -5081 2086 1476 -3784 4388 -2514 -1906 4284 -5076 1943 3286
3017 3286 -5406 4237 386 -4028 4718 -2257 -335 3897 -4207 3541 635 -5067 5269 -2222 -2377
3032 -2377 6108 -4170 12 2709 -4959 2703 -349 -2673 4813 -3896 -316 4179 -6220 2253
3046B253P2p227R353m987k241O615p159M781J155o800R118n507l415R437q693
3061c245J666O451q805N328R1n656P144n004L22O699r517N390K643r944R076j397
3077A242n062Q398o116P56L786p407P144j328n777R956o628k328Q712q951K847
3092g56M467p169O184k615l413P417p950K947N989j0089O808J133q363Q145l342
3107f07k203O851o710L677J260p390Q735l312m685J0103p267o16O734q375M650
3122H45R01n058P820n702r62O928r336M304M387q950P554r07o088P231n033N26
3138a540N049p253O236p09o978R378m804k958Q710o995J396M189p507N780j553
3153D41l303P830p258J114O224r867N156K387p109P483k698k763N722o682K958
$$ plain form
3046 2253 2325 -4902 4451 -536 -2777 3838 -3321 1460 2615 -4185 4933 -574 -3989 5448 -3245
3061 -3245 -1579 4872 -3933 1395 1486 -4170 2974 -2030 -1708 4991 -4526 864 3507 -6437 2639 1242
3077 1242 -3820 4578 -1538 -782 3004 -4403 2741 1413 -4364 5592 -1036 -3364 5348 -3603 -756
3092 -756 3711 -3458 2726 111 -3302 4115 -3835 -888 5101 -4988 1820 2953 -5410 2735 -607
3107 -607 -2810 4041 -2669 1008 2268 -5122 3613 301 -4384 5719 -1548 -2164 4570 -3805 845
3122 845 1746 -3312 4508 -1194 -2156 4772 -4564 -260 4127 -4823 2731 1824 -4264 2967 -2066 -1540
3138 -1540 3509 -3744 2492 1783 -5195 4183 -621 -3579 5131 -1864 -468 3721 -3786 1994 441
3153 441 -2862 4968 -2290 -1176 5048 -4819 337 2724 -4385 3098 400 -2363 3359 -3323 -365
3168c65L073p291Q122k145o242Q868n791j149P295p214L861J156n640O902m628
3183a188j532P999q214K690M618q727N691Q7n404P403m595m1N046p890N218P40
3199A901p038Q721l275l944P643o439R82M317o207N577j252m149P727o231k53
3214a920O882q339M069K758p384O193k095l003O516o305K460L674p964O283l29
3229A496o297Q096l963j858O463o866K761K209n903O896k885l110P457o841Q63
3244a482N365p264M846O99n237O450m347j016N701p368M393K404p295O847k331
3259C65m042P324n376N55M344o872N233m64n137P509m396j577O847o955K683K941
3275B982o780O199j793l343O815o039J208M603p357M738J078o002O911l517k236
$$ plain form
3168 -365 2708 -4583 3539 1394 -4848 4020 -1771 -2920 4375 -2839 1022 2178 -3462 3440 -1188
3183 -1188 -2720 5279 -2935 -245 4373 -4354 1337 1424 -3980 3423 -1172 -1213 3833 -4057 1161 1901
3199 1901 -5137 3584 309 -3635 4008 -2431 -1449 2868 -3339 2238 986 -3163 4564 -1667 -1920
3214 -1920 4962 -3377 692 3450 -3934 2259 164 -2839 3677 -2628 -168 3506 -4458 1825 1496
3229 1496 -4801 3295 -668 -2526 3937 -2929 -168 2041 -3862 3034 149 -2961 4496 -2345 -1482
3244 -1482 3883 -3381 1465 2164 -3073 3377 -970 -1986 3715 -3653 740 3144 -4151 2696 365
3259 365 -3677 3647 -1729 -1174 3170 -3702 1531 1067 -4070 3439 -957 -2534 4313 -2642 41 2982
3275 2982 -3798 2401 608 -2735 4080 -1959 -751 3852 -3505 1233 2311 -3691 3220 -297 -2533
3290b533O289o388K099L271o483N825j600l890O990n412L12N118o715M214O79
3305A776n205O373l196j669N941o523K544L090o820N865j099m074O407n040K49
3320a381M603o322M140Q57n550O696l430k338O163n975J957L468o588N619j182
3335G37l816O545n052l6N005o455L791J776o030O213k450k576O142o156J669L725
3351C032o392N048n29m326O127m151o54N138o283L455J708n691N956k698k734
3366b994O435n636J384L814o367M919j49m441O005l940n77M820n872K971J992
3381B364n691N931k347k971N844m956R95L589o100M604M6m778O326l954q69N227
3397C260o185K969K120n550N288j504k884N645m758R44L765o079M529q5m923O554
$$ plain form
3290 -2533 3756 -2632 -533 2738 -3745 2080 480 -3410 3580 -1832 -1520 3598 -3117 1097 1776
3305 1776 -3429 2944 -252 -1921 4020 -2503 41 3131 -3689 2176 1077 -2997 3410 -1630 -1381
3320 -1381 3222 -3100 1040 1897 -3653 3043 -387 -2725 3438 -2537 -580 2888 -3700 1919 737
3335 737 -3079 3466 -1586 -1622 3383 -3072 719 2495 -3535 2678 228 -2348 3794 -2362 -693 3032
3351 3032 -3360 1688 1159 -3167 2960 -1191 -1845 3293 -2990 465 2173 -3518 2438 -260 -2994
3366 -2994 3441 -2195 -811 3003 -3364 1555 1406 -3035 2970 -970 -1547 3273 -2599 372 2364
3381 2364 -3327 2604 257 -2714 3130 -1826 -831 2758 -3342 1262 1308 -3470 2856 -1098 -1967 3260
3397 3260 -2925 44 2164 -3386 1902 398 -2486 3159 -1599 -655 3110 -2969 1560 1475 -3448 3106
3413C106l621j383N196n607K435J922n222N362k090k609N648n184J057L841o205
3428c354M279O69m775N620l220j049M923n533K884K165o138N779j679l265N708
3443C014m312K14L778n267L794k04l894N633l529j111N152n689K029K971o086
3458c507M901n43l453N232m188M47L788n670M378M04n321O213k547k681N499m476
3474a524J584K287m816M341j380l006N719m722R1M925o367L061J535n210N319
3489A837j848j516M309n299K691K003n982N405k12m562O220l753r39L976m390
3504b060K794J061m100N409l671j628N659n650J545L788n534L390o6l494M641
3519B084l507N58L713n845L812R02n778N852j254l101N509l943N02K109m525M495
$$ plain form
3413 3106 -515 -1898 3298 -2309 126 2048 -3174 2188 98 -2511 3137 -2047 -990 2851 -3354
3428 -3354 925 1594 -3181 2439 -781 -1830 3093 -2440 444 2609 -3529 2250 571 -2694 3014
3443 3014 -1298 -1084 2694 -2573 1221 1017 -2877 2756 -773 -1884 3268 -2421 -392 2579 -3507
3458 -3507 1394 851 -2602 2630 -1558 -1111 2677 -2993 1385 1789 -3532 2681 134 -2547 2952 -1524
3474 -1524 60 2347 -2469 1872 492 -2514 3205 -1517 -1426 3499 -2868 193 1728 -3482 1837
3489 1837 -11 -1527 2782 -2517 174 2177 -3805 1600 1388 -3174 3046 -707 -1646 2330 -2060
3504 -2060 734 1795 -2305 3104 -567 -2195 3464 -2186 -641 3147 -2387 1003 937 -2557 2084
3519 2084 -1423 -865 2848 -2997 815 1717 -4061 1791 537 -2564 2945 -998 -496 1613 -2912 1583
3535A583j109k828O014m470j093N340o009K220K791m460L981j873j775L906m871
3550b653K553K934o071M869nn297N405k174j029L750l460K095M77m579N360k603
3566d28k360O949m925m33M260n650K477J064k791M247l081l1L816o615L596K609
3582B704n982N189o05l913M335k893m0K648l706M526j450m032O053l851j830O401
3598C554m621Q15K743m128K464r83j153M330m743J653L765p220L933J287m919
3613c223N227j071k012K777l554J722J179m427N911j775l667O185m549r64M778
3628B537m038K111J115l401L755l382l05M780n867K971L345o382L573M46l957
3643b699M316k091K07K499m931L757k54m623O521k666k550N592m689K49L003l937
$$ plain form
3535 1583 474 -2354 3660 -810 -1903 3437 -2572 -352 2439 -2021 1960 87 -1688 2218 -2653
3550 -2653 -100 2834 -3237 1632 1627 -3670 1735 -439 -1468 2282 -1178 917 1394 -3185 2175 -428
3566 -428 -2788 4161 -764 -1197 3063 -2587 -110 954 -1837 2410 -671 -702 3114 -3501 95 2704
3582 2704 -3278 1911 1306 -2607 1728 -1165 -1205 1443 -2263 2263 813 -3219 2834 -1017 -2847 3554
3598 3554 -1067 -252 2491 -1637 827 -156 -1309 3021 -1722 -69 3696 -3524 409 1696 -3223
3613 -3223 2004 933 -1079 1698 -1856 -134 1045 -3382 2529 754 -2913 3272 -1277 -2241 2537
3628 2537 -1501 610 1725 -1676 2079 -1303 -1608 3172 -2695 276 3621 -2761 812 1258 -2699
3643 -2699 1617 -474 -267 2232 -2699 1058 804 -3819 2702 36 -2514 3078 -1611 -1362 1641 -2296
3659b296L492p27j525L989m847Q33M149n913L184K539n251L691j061k016L233
3674A474l408K563J485m644M527j351m262O034k847j383M735m496J928L82l081
3689b344M156k635o24N317n789R45L711n590L664R25l527L951k316n66K941m977
3705b758L890J002n280N659k088l181M958l402M77K730l857L112q07l197N158
3720B416l786j51M817n485K332K065m748L522p81j560L742l747J238K494n440
3735c072M512n3m377N591k532j678L756l890J825J261l726M500k419j962N028
3750B764m683N80L950n053L156M17l321L954k563l97L772m748K617J815m954M415
3766A721j211k641M762l348J44K528m128K991k9l362N075l136j003M336m463J383
$$ plain form
3659 -2296 1196 469 -1056 2933 -1914 -1081 3068 -2845 339 2878 -2373 1318 257 -1759 1474
3674 1474 -1934 629 2114 -2530 1997 646 -3616 2418 -429 -1812 2923 -1573 355 737 -2344
3689 -2344 1812 -823 -1447 3870 -1919 -974 2737 -2853 811 1736 -1791 2160 -156 -722 2219 -2758
3705 -2758 1132 2134 -3146 2513 425 -2756 2202 -1200 -723 2007 -1850 1262 455 -2742 2416
3720 2416 -1370 -1521 3296 -2189 143 2208 -2540 982 201 -1359 2383 -1364 -126 2368 -3072
3735 -3072 1440 1387 -2990 2601 69 -1609 2147 -1743 82 1343 -2383 2117 -302 -2264 2764
3750 2764 -1919 -1339 2611 -2442 714 1131 -2190 1764 -799 -1196 2576 -2172 445 2260 -2694 1721
3766 1721 510 -2131 2631 -717 -573 1955 -2173 818 789 -2573 2502 -634 -1637 2699 -1764 -381
3782c81K410m163L367q85k241M246l794N94L334m931L466N37m083M610k010j667
3798a591L937l912J572K066m563M088j333k533M956m053K85L215m326K550Q85
3813A243l553M301k204j440M070m016J241K396m338L839r01k768M729l654RL490
3829B444m629K689J028l930M628k272j689M164m201J260K511m508L736o95k967
3844b431M724l316L1L320m455K475J099l745M034j860j964M563m107J438K367
3859B173m378L808o58l001M338k793p17L860m731K408J210m129M407j780j972
3874a955M655m193Q66K694m744L736j49l246M271k774l92L540m239K404J353m101
3890b274M111j575k330M603l659P33K385m114L232j05l117M252k829p26L950m647
$$ plain form
3782 -381 2029 -2134 1233 348 -1893 2353 -1441 -847 2487 -2444 1022 1559 -2524 2086 76 -1591
3798 -1591 2346 -1566 6 2072 -2491 1597 264 -2269 2687 -1366 -1081 2134 -2192 358 1243
3813 1243 -2310 1991 -213 -1653 2417 -1599 -358 2038 -2300 1539 638 -2130 2599 -1055 -1046 2444
3829 2444 -2185 504 1532 -2398 2230 -42 -1731 2433 -1768 -508 2003 -2505 1231 536 -2431
3844 -2431 2293 -1023 -992 2328 -2127 348 1447 -2298 1736 -124 -2088 2475 -1632 -194 2173
3859 2173 -2205 1603 945 -2056 2282 -511 -1228 2632 -2099 309 1519 -2610 1797 17 -1955
3874 -1955 2700 -1493 -627 2067 -2677 1059 910 -2336 1935 -839 -1231 2309 -1930 474 1827 -2274
3890 -2274 1837 262 -2068 2535 -1124 -391 1994 -2120 1112 1007 -2110 2142 -687 -1413 2537 -2110
3906b110K329J328m222L827r40k069L970l286O23K658m508L304L20l564M839k981
3922d82q16L815m294K022J594m059M032j629j828M349m239P96L259m777K963M65
3938A171l319L757k138p62L956n330L070J263m063L199n42j921L663k555l10L437
3954B576m193K296J55k784M375k670j627M210l869J381K203m084L422j132j813
3969a554L806l856O74K772m252L331k39m288N426k178j396L759l242J552J023
3984A338l394L411j604j514M364l664q5L899m451J922J306l145L120j720p82K970
4000A971l949K129J699m557L810L45l936M160k108o66K696l222K292N7l090M545
4016B176k816j186M908m165O80K672m030K443j98j846L142k691N97K547m348K518
$$ plain form
3906 -2110 219 1547 -2675 1152 212 -1857 2113 -1173 -550 2108 -2400 904 1224 -2340 2499 -482
3922 -482 -1298 2517 -1777 245 1839 -2220 1812 183 -1645 2704 -1535 -739 2520 -2257 706 1171
3938 1171 -2148 1609 -529 -1291 2665 -2665 405 1668 -2395 804 262 -1659 2004 -551 -861 2576
3954 2576 -1617 679 834 -1950 2425 -245 -1872 2338 -1531 -150 2053 -2031 1391 259 -1554
3969 -1554 2252 -1604 -930 1842 -2410 921 682 -3606 1820 -358 -1754 2005 -1237 315 1338
3984 1338 -2056 1355 -249 -1763 2601 -1063 -1148 2751 -1700 222 1528 -1617 1503 -217 -999 1971
4000 1971 -1978 151 1850 -2707 1103 1448 -2488 1672 -436 -1102 1594 -1628 664 721 -2369 2176
4016 2176 -640 -1826 3082 -1083 -403 2269 -1761 682 484 -1362 1780 -911 -314 2233 -2115 403
4032D03J306m535M195q18k237L369k858Q22J237l022L594j292k428M784l542r04
$$ plain form
4032 403 1709 -2826 1369 551 -1686 1683 -1175 -353 884 -2138 1456 164 -2264 2520 -1022 -1926
$$ [...]
8191C3
##END NTUPLES=NMR FID
##END=
