##TITLE=1H_Pr 4-NO2
 CDCl3+DMSO
 8 sc, 
 4.05.2022
##JCAMPDX= 6.0         $$ Bruker NMR JCAMP-DX V2.0
##DATA TYPE= NMR FID
##DATA CLASS= NTUPLES
##ORIGIN= UXNMR, Bruker Analytische Messtechnik GmbH
##OWNER= root
$$ XWIN-NMR		Version 3.5
$$ Wed May  4 14:41:06 2022 Russian Standard Time (UT+4h)  she@DPX200
##.OBSERVE FREQUENCY= 200.13135
##.OBSERVE NUCLEUS= ^1H
##.DELAY= (6, 6)
##.ACQUISITION MODE= SIMULTANEOUS
##.ACQUISITION SCHEME= undefined
##.AVERAGES= 8
##.DIGITISER RES= 18
##SPECTROMETER/DATA SYSTEM= spect
##.PULSE SEQUENCE= zg30
##.SOLVENT NAME= CDCl3
##.SHIFT REFERENCE= (INTERNAL, CDCl3, 0, 15.7039)
##AUDIT TRAIL= $$ (NUMBER, WHEN, WHO, WHERE, WHAT)
$$ ##TITLE= Audit trail, XWIN-NMR		Version 3.5
$$ ##JCAMPDX= 5.01
$$ ##ORIGIN= Bruker BioSpin GmbH
$$ ##OWNER= she
$$ F:/spectra/data/she/nmr/H-F/1/audita.txt
$$ ##AUDIT TRAIL=  $$ (NUMBER, WHEN, WHO, WHERE, WHAT)
(   1,<2022-05-04 14:40:01.57 +0400>,<she>,<DPX200>,
      <created by zg, POWCHK disabled, PULCHK disabled
       configuration hash MD5:
       00 E9 B6 7A A2 85 ED C7 34 08 36 98 17 FE 4E 26
       data hash MD5: 16K
       0C 02 8C DC CE EF D2 2B 95 C3 A5 0E 67 83 60 56>)
$$ ##END=
$$ 
$$ hash MD5
$$ 24 DA 56 02 FF C8 ED 1D 0F C1 EB C2 F6 BE DC DA
##$RELAX= 
##$RELAX= 
##$RELAX= 
##$RELAX= 
##$RELAX= 
##$RELAX= 
$$ Bruker specific parameters
$$ --------------------------
##$DU= <F:/spectra>
##$EXPNO= 1
##$NAME= <H-F>
##$PROCNO= 1
##$TYPE= <nmr>
##$USER= <she>
##$AMP= (0..31)
100 100 100 100 100 100 100 100 100 100 100 100 100 100 100 100 100 100 
100 100 100 100 100 100 100 100 100 100 100 100 100 100 
##$AQSEQ= 0
##$AQ_mod= 1
##$AUNM= <au_zg>
##$AUTOPOS= <>
##$BF1= 200.13
##$BF2= 200.13
##$BF3= 200.13
##$BF4= 200.13
##$BF5= 200.13
##$BF6= 200.13
##$BF7= 200.13
##$BF8= 200.13
##$BYTORDA= 1
##$CFDGTYP= 0
##$CFRGTYP= 5
##$CHEMSTR= <none>
##$CNST= (0..31)
1 1 145 1 1 1 1 1 1 1 1 1 1 1 1 1 1 1 1 1 1 1 1 1 1 1 1 1 1 1 1 1 
##$CPDPRG= <>
##$CPDPRG1= <>
##$CPDPRG2= <>
##$CPDPRG3= <>
##$CPDPRG4= <mlev>
##$CPDPRG5= <mlev>
##$CPDPRG6= <mlev>
##$CPDPRG7= <mlev>
##$CPDPRG8= <mlev>
##$CPDPRGB= <>
##$CPDPRGT= <>
##$D= (0..31)
0 1.2 0 0 0 0 0 0 0 0.06 0 0.03 0 0 0 0 0.0002 0 0 0 0 0 0 0 0 0 0 0 0 
0 0 0 
##$DATE= 1651660800
##$DBL= (0..7)
120 120 120 120 120 120 120 120 
##$DBP= (0..7)
150 150 150 150 150 150 150 150 
##$DBP07= 0
##$DBPNAM0= <>
##$DBPNAM1= <>
##$DBPNAM2= <>
##$DBPNAM3= <>
##$DBPNAM4= <>
##$DBPNAM5= <>
##$DBPNAM6= <>
##$DBPNAM7= <>
##$DBPOAL= (0..7)
0.5 0.5 0.5 0.5 0.5 0.5 0.5 0.5 
##$DBPOFFS= (0..7)
0 0 0 0 0 0 0 0 
##$DE= 6
##$DECBNUC= <off>
##$DECIM= 32
##$DECNUC= <off>
##$DECSTAT= 4
##$DIGMOD= 1
##$DIGTYP= 9
##$DL= (0..7)
0 120 120 120 120 120 120 120 
##$DP= (0..7)
150 150 150 150 150 150 150 150 
##$DP07= 0
##$DPNAME0= <>
##$DPNAME1= <>
##$DPNAME2= <>
##$DPNAME3= <>
##$DPNAME4= <>
##$DPNAME5= <>
##$DPNAME6= <>
##$DPNAME7= <>
##$DPOAL= (0..7)
0.5 0.5 0.5 0.5 0.5 0.5 0.5 0.5 
##$DPOFFS= (0..7)
0 0 0 0 0 0 0 0 
##$DQDMODE= 0
##$DR= 18
##$DS= 0
##$DSLIST= <SSSSSSSSSSSSSSS>
$$ [...]
##$SUBNAM2= <"">
##$SUBNAM3= <"">
##$SUBNAM4= <"">
##$SUBNAM5= <"">
##$SUBNAM6= <"">
##$SUBNAM7= <"">
##$SUBNAM8= <"">
##$SUBNAM9= <"">
##$SW= 18.05172834244
##$SWIBOX= (0..15)
0 0 2 0 0 0 0 0 0 0 0 0 0 0 0 0 
##$SW_h= 3612.71676300578
##$TD= 16384
##$TD0= 1
##$TE= 0
##$TE2= 300
##$TE3= 300
##$TEG= 300
##$TL= (0..7)
0 120 120 120 120 120 120 120 
##$TP= (0..7)
150 150 150 150 150 150 150 150 
##$TP07= 0
##$TPNAME0= <>
##$TPNAME1= <>
##$TPNAME2= <>
##$TPNAME3= <>
##$TPNAME4= <>
##$TPNAME5= <>
##$TPNAME6= <>
##$TPNAME7= <>
##$TPOAL= (0..7)
0.5 0.5 0.5 0.5 0.5 0.5 0.5 0.5 
##$TPOFFS= (0..7)
0 0 0 0 0 0 0 0 
##$TUNHIN= 0
##$TUNHOUT= 0
##$TUNXOUT= 0
##$USERA1= <user>
##$USERA2= <user>
##$USERA3= <user>
##$USERA4= <user>
##$USERA5= <user>
##$V9= 5
##$VALIST= <valist>
##$VCLIST= <CCCCCCCCCCCCCCC>
##$VD= 0
##$VDLIST= <DDDDDDDDDDDDDDD>
##$VPLIST= <PPPPPPPPPPPPPPP>
##$VTLIST= <TTTTTTTTTTTTTTT>
##$WBST= 1024
##$WBSW= 4
##$XGAIN= (0..3)
0 0 0 0 
##$XL= 0
##$YL= 0
##$YMAX_a= 195719
##$YMIN_a= -149639
##$ZGOPTNS= <>
##$ZL1= 120
##$ZL2= 120
##$ZL3= 120
##$ZL4= 120
##$ABSF1= 10
##$ABSF2= 0
##$ABSG= 5
##$ABSL= 3
##$ALPHA= 0
##$AQORDER= 0
##$ASSFAC= 0
##$ASSFACI= 0
##$ASSFACX= 0
##$ASSWID= 0
##$AUNMP= <proc_1d>
##$AZFE= 0.1
##$AZFW= 0.1
##$BCFW= 1
##$BC_mod= 2
##$BYTORDP= 1
##$COROFFS= 0
##$CY= 11.3945322036743
##$DATMOD= 1
##$DC= 2
##$DFILT= <>
##$DTYPP= 0
##$F1P= 2.36226072786647
##$F2P= -0.459571619588291
##$FCOR= 0.5
##$FTSIZE= 0
##$FT_mod= 4
##$GAMMA= 1
##$GB= 0.15
##$INTBC= 1
##$INTSCL= 1
##$ISEN= 128
##$LB= 0.24
##$LEV0= 0
##$LPBIN= 0
##$MAXI= 10000
##$MC2= 0
##$MEAN= 0
##$ME_mod= 0
##$MI= 1.114404
##$NCOEF= 0
##$NC_proc= 0
##$NLEV= 6
##$NOISF1= 3.799351
##$NOISF2= 2.8
##$NSP= 1
##$NTH_PI= 0
##$NZP= 0
##$OFFSET= 15.70392
##$PC= 1
##$PHC0= -18400.23
##$PHC1= 22.20075
##$PH_mod= 1
##$PKNL= yes
##$PPARMOD= 0
##$PSCAL= 0
##$PSIGN= 0
##$REVERSE= no
##$SF= 200.130013532006
##$SI= 16384
##$SIGF1= 3
##$SIGF2= 2
##$SINO= 400
##$SIOLD= 16384
##$SREGLST= <1H.CDCl3>
##$SSB= 0
##$STSI= 0
##$STSR= 0
##$SW_p= 3612.71676300578
##$SYMM= 0
##$S_DEV= 0
##$TDeff= 0
##$TDoff= 0
##$TI= <>
##$TILT= no
##$TM1= 0
##$TM2= 0
##$TOPLEV= 0
##$USERP1= <user>
##$USERP2= <user>
##$USERP3= <user>
##$USERP4= <user>
##$USERP5= <user>
##$WDW= 1
##$XDIM= 8192
##$YMAX_p= 0
##$YMIN_p= 0
$$ End of Bruker specific parameters
$$ ---------------------------------
##NTUPLES= NMR FID
##VAR_NAME=  TIME,          FID/REAL,        FID/IMAG
##SYMBOL=    X,             R,               I
##VAR_TYPE=  INDEPENDENT,   DEPENDENT,       DEPENDENT
##VAR_FORM=  AFFN,          ASDF,            ASDF
##VAR_DIM=   8192,          8192,            8192
##UNITS=     SECONDS,       ARBITRARY UNITS, ARBITRARY UNITS
##FACTOR=    0.0002768,     1,               1
##FIRST=     0,             0,               0
##LAST=      2.2672688,     0,               0
##MIN=       0,             -149639,         0
##MAX=       2.2672688,     195719,          0
$$ Real data points
##PAGE= N=1
##DATA TABLE= (X++(R..R)), XYDATA
0@%%%%%%%%%%%%%Pj5J6j6J6j6K4l2L4m2N0n8P2q2R0j04J20j38J59j82K07k33K62
36A39k95L32l72M15m62N14n72O34p00P72q53R42j038J143j259J388j531J689j865
55i79K065k290K546k844L193l611M120m755N576o682Q267j0742J5199k5807J04303
70H7559J08160n8222n2992j02271p5828n6045K687L6988P5867P4841O2216K2389
82A25349j2541n6378o6208o1818l7302n360L1644N2207O1047M5237K0920r895
94H6902l1196m3913m3559l0411m099J1703K4595K9041K2243J1458j071j1551j2513
107G629q626j298J713M477O236j167q127q760q855k199O877J1705J4479J2121
121B6205J817j2303k3284k4043j9692r057J1733K8693L8245L8259K2700K003j9857
$$ plain form
0 0 0 0 0 0 0 0 0 0 0 0 0 0 0 7 -8 8 -8 8 -8 16 -16 18 -24 26 -32 40 -42 48 -56 64 -74 85 -97 110 -123 139
36 139 -156 176 -196 219 -243 271 -301 333 -367 405 -448 494 -544 599 -660 728 -803 886 -979
55 -979 1086 -1204 1342 -1502 1691 -1920 2200 -2555 3021 -3661 4606 -6136 9063 -16744 87559
70 87559 195719 137497 84505 -17766 -93594 -149639 -146952 -109964 -34097 40744 102960 125349
82 125349 112808 56430 -9778 -71596 -108898 -114258 -82614 -30407 30640 75877 96797 86902
94 86902 55706 11793 -31766 -62177 -66276 -54573 -29978 -937 21306 32764 31693 20142 7629
107 7629 -997 -2295 -582 3895 10131 8964 837 -7923 -16778 -18977 -12100 -395 14084 26205
121 26205 28022 15719 -7565 -31608 -51300 -60357 -48624 -19931 18314 56573 79273 81276 61419
134F1419m0046m7970m0611j9322P772L0076M7453M8977L3845R593k1145m3647
146B6394n0712m5429k4963M086L3013N1269N1283L8214J3822j7095l9501n2162
158a1781m8215k7013k092K2293M0964M6664L7552J6388o706k4138l5871l3984
170b5939k2377n536J4670K6103K7211K2496J0840n208j8064k4583k2243j4428
182c7058l452Q262J3852J7470J4808N841r99n112q092o696m890J001L493K855
196A283K089j666k490j875l266M35N187N626M761J440j793n769q730p811l752
211a6331J315Q860R872J0554Q399M18p593j3800j5821j2724o434J762J1407J6951
225c165J8571J2513L824l750j2179j7520j4815q826L12R416J3925J5796J1710
$$ plain form
134 61419 21373 -26597 -67208 -86530 -78758 -48682 -1229 47748 81593 91186 70041 26394
146 26394 -24318 -69747 -94710 -90624 -57611 -6342 44941 83155 96977 79882 40381 -11781
158 -11781 -59996 -87009 -89101 -66808 -25844 20820 58372 74760 68054 43916 8045 -25939
170 -25939 -48316 -53852 -39182 -13079 14132 36628 47468 42260 24196 -387 -22630 -37058
182 -37058 -40510 -32248 -18396 -926 13882 19723 18724 13612 5520 -1176 -6066 -5065 -1572 1283
196 1283 3372 1706 -784 -2659 -5925 -5490 -303 5323 10084 11524 9731 3962 -4768 -12579 -16331
211 -16331 -15016 -6156 3716 14270 22669 23087 15494 1694 -14127 -26851 -33285 -31523 -20116 -3165
225 -3165 15406 27919 31743 27993 15814 -1706 -16521 -25347 -25035 -15619 -1694 14102 25812
238B5812M077n309j4038j4921j4508j0078n98P493J3003J4931J1396N707j368
251B1599p674j1672j2391p647j011K929Q247J0704Q236M770q65o035p507p775
265f092n972j890L515P766P148P041M881l56m428p397r111o074l126J18L682O501
281c794P353L856O92j231m846o741m923l078J361N484O500P446O107K557j897
296A4846o953p129p802n835j397K625O733Q800O513L666k78m734p800q925n821
311a3491j946J982O547P908P264N399m15m837o952p684o283l020K432O001P108
326A3P263M780Q55j514m887o360l385j748K3K151L088K874M00r14j767k771j060
343b959k25m23K340R41o74j107j998j287R9J235M684M802M616K480k355n151o878
$$ plain form
238 25812 29889 24580 10542 -4379 -18887 -28965 -29563 -22070 -9067 5864 17260 22967 21599
251 21599 13925 2253 -10138 -17785 -18796 -15867 -7620 3084 11320 16090 15225 9190 1683 -6092
265 -6092 -12064 -13954 -10439 -2673 4475 11516 16397 16041 11613 4216 -4895 -10969 -14095 -13977 -10295 -3794
281 -3794 3559 7415 8107 6876 2030 -4711 -9634 -12712 -11351 -5867 633 8079 14186 16743 14846
296 14846 7893 764 -7038 -12873 -14270 -11645 -4912 3888 10401 14067 13789 9055 1255 -7670 -13491
311 -13491 -15437 -13455 -6908 1000 8264 13663 13248 8411 1459 -6225 -12508 -15528 -13096 -7095 13
326 13 7276 12056 12911 11397 6510 150 -3235 -4983 -4960 -2809 279 3153 3553 2639 872 -1899 -2959
343 -2959 -3184 -3607 -1267 -326 -1000 -2107 -4105 -5392 -5293 -4058 626 5428 10044 12524 10169 5018 -1860
360a860q682n184l01N423R688J1211R599L806k994r339j4678j3931q326k214P166
375b0616J4353J6410J4407O364l443j2470j8463j8488j3212k890R187J7059K0970
388I168J9603J0147o38j2282j9856k0947j5869n699N506J5335K1031J8796J0517
401C4812Q34j0475j8091j9569j5698o247L879J2527J6870J5869J0247J697p239
414A9416j2358j3316j1149m186K373P729J0752R310N487P25l867o196o586l561
428e427l68J323L527L178J081n81k372k461r29J279L307L331K516l13m571p067
444d547p263n837n82N284R521J2802J0798M924k863j0164j4358j4980j0250j467
458b8982P774J5847J8875J5183P904l291j3694k0241k0822j3820m185P717J8482
$$ plain form
360 -1860 -10542 -15726 -16027 -10604 -916 10295 19894 23700 20706 11367 -3311 -17242 -25568 -27782 -20616
375 -20616 -6263 10147 24554 30918 27475 15005 -3458 -21946 -35158 -38048 -28861 -11802 9168
388 9168 28771 38918 38280 25998 6142 -14805 -30674 -36373 -30867 -15532 5499 24295 34812
401 34812 35646 25171 7080 -12489 -28187 -34434 -30555 -18028 -1158 14711 24958 26655 19416
414 19416 7058 -6258 -17407 -21593 -19220 -11491 -739 8571 14058 14783 10916 4720 -1866 -5427
428 -5427 -5795 -4472 -945 2233 3314 2733 361 -2100 -3029 -1750 1557 4888 7404 7091 2520 -4547
444 -4547 -11810 -17647 -18229 -12945 -3424 9378 20176 25100 22237 12073 -2285 -17265 -27515 -28982
458 -28982 -21208 -5361 13514 28697 36601 33310 19616 -625 -21447 -35267 -39452 -31735 -13253
471a3253K1799J9417J1485k173j2560k0782k2605j6821o136O115J6864K1718K0623
484B3691J2217R67r321j8035j9722j4977o739L426J3106J6737J5912R838J564
497B8664p027j3135j4069j1536n417K317P295R964R503O290M44l471o379o362
511b919m742j290J815K993M324K443m3n35j530q72Q51K189K750J889l81k637n968
528a663n468m069j462L812P523Q728P593L405k562q027j2016j1372q004j649O798
543a8433J1427J4342J2916O136j371r405j4594j5000j0881l050N546J2993J6427
556G053J4342Q426Q1r537j4874j5916j3293m965L589J0934J4841J4130R134Q71
570B4816o764j1974j3606j1454m489J635Q383J1643J1026P680K065l933p872r852
$$ plain form
471 -13253 8546 27963 39448 37275 24715 3933 -18672 -35493 -41629 -35514 -18650 3068 23691
484 23691 35908 36875 27554 9519 -10203 -25180 -31919 -28493 -15387 1350 17262 27100 28664
497 28664 21637 8502 -5567 -17103 -22520 -20203 -12908 -2944 6559 12849 13293 9822 3443 -2919
511 -2919 -7661 -8951 -7136 -4143 181 2624 2581 2046 516 -356 495 2684 5434 7323 6942 4305 -1663
528 -1663 -7131 -11200 -12662 -8850 -1327 7401 14994 18399 15837 7810 -4206 -15578 -23582 -25231 -18433
543 -18433 -7006 7336 20252 26388 25017 15612 1018 -13982 -24863 -27913 -22367 -9374 7053
556 7053 21395 29821 29902 20365 5491 -10425 -23718 -28683 -25094 -14160 681 14811 23945 24816
570 24816 18052 6078 -7528 -18982 -23471 -21836 -13453 -1810 9216 16896 18961 15028 7156 -2696
584b696p194l467O04N079O797O732M525J021k318m077n001l812k306Q8J555K323
600b147K173J116o84j56r52n92O89J013P24J62p33j849k627j142j82J691L822
617C26M215L516J737j077l727m998n455l627j129K747N209N859N082L199j194
632A0683m046o663p090m836j843K135N468P199O311L741L63k944o136o802m547
647i007k333J684M865N508O097M078R70k712m802n480m680k956O27K483M128M877
663C347K832P13j320l209m035l647k019J68J835L276L003K534J951j090j497k210
679F32k522j480J3P54K228J833K038R07l64m37k280k158j410m59k36J455J024
696d62J639N74J31p60j502j317j052p52J45J152J154K116J210M98n15r25r08j633
$$ plain form
584 -2696 -9890 -13357 -12753 -7674 -877 5855 10380 11401 9083 5006 5 -3807 -6113 -6025 -4470 -2147
600 -2147 26 1142 458 302 -650 -1242 -553 460 1184 1346 613 -1236 -3863 -5005 -5187 -3496 326
617 326 4541 8057 9794 8717 4990 -8 -5463 -9090 -10219 -7472 -2263 3596 8678 11877 10683
632 10683 6637 -26 -7116 -11952 -13795 -11660 -6192 1007 7318 11059 11422 8478 2342 -4460 -9007
647 -9007 -11340 -9656 -4791 717 6814 10892 11862 9150 4348 -1132 -5812 -8768 -8141 -5658 -1530 3347
663 3347 6179 6892 5572 2363 -1672 -5319 -7338 -7170 -5335 -2059 944 3478 5429 4339 2842 632
679 632 -1890 -3370 -3357 -2603 -375 1458 3496 4403 4039 3602 1322 -836 -2246 -2705 -2941 -1486 -462
696 -462 1177 1751 1882 1122 -380 -1697 -2749 -3501 -3356 -2204 -1050 1066 2276 2774 2259 1334 426 -1207
714a207q57L74P47J465J972O63Q32p29j378j773j848q02l40K01J714J019R06J315
732B274r07p43j456j300o57pP44R71J106J209K48k85M16q28m89P1l4K29O22l97
752G87j48m37m45J23j46J291M86N63k0j177j761j597j974q52J023J876L012K752
770C356J778M02j748l051l671l272j435R20L379M979M867L299P55k397m758o163
786b760m774k870j33M125N793O048M825J641k590n117o775o384l935p45M212N975
802c464P394N863K461p19m858o934n865m462o91K800N336O959M419L317p02l913
818F941n159n273m046j246J612L426M106L541K115l74j999l015k952k074k15L70
834d242J540J981R57J144j71n66J26P8O27Q75l04kj612j826j614j202P83J952
$$ plain form
714 -1207 -2064 -1690 -943 522 2494 3157 3989 3260 1882 109 -1739 -2541 -2881 -2680 -966 53 959 2274
732 2274 1367 624 -832 -2132 -2789 -2796 -2052 -1081 25 1234 1482 1197 1613 785 296 367 333 562 1184 787
752 787 639 202 -243 -120 -266 1025 1511 2074 2054 877 -884 -2481 -4455 -5307 -4284 -2408 604 3356
770 3356 5134 5536 3788 737 -2934 -6206 -7641 -6721 -3342 1637 6504 9803 10558 8161 3403 -2760
786 -2760 -7534 -10404 -10537 -6412 -619 5429 10254 11895 9305 4188 -2587 -8971 -12906 -13651 -9439 -3464
802 -3464 3930 9793 12254 11535 6677 -257 -6122 -10584 -11275 -8475 -3139 3820 8239 11556 10854 6941
818 6941 1782 -3491 -7537 -8783 -7171 -3745 361 3902 6017 5643 3644 629 -2323 -4397 -4612 -4242
834 -4242 -2702 -721 236 1380 1209 643 769 847 1474 2349 2045 2043 431 -1395 -3009 -4211 -3428 -1476
852a476L370L282K010K46k101m442n031m449k447R56L608N987O400M529J263k310
868I395n686p065o401l851N11M043P738P912O185L221k123o143q002p764n236
883a3266q42L584O806P831O801L301j562m745p590p503n398j525K792N554O804
898A042O500L161n11l030n482n560l671j626J813L811M540M244K262K21j656l664
914B394l110k497p39P98Q25J868J419M02k89n66p03j58K75N07J85m39o20j692
932b140j405n40J94J870L081K620K407O88j324l294l946l538j891k15L151M528
948B46M859L894J259j825m322n911n529l402m29K855N236O316M927K171q16m130
964E399n877n405m607n86K593N004O172N134K771q1l373n110n218m146j092J480
$$ plain form
852 -1476 1894 5176 7186 7432 5331 889 -4142 -8591 -11038 -10082 -6474 -487 5913 10442 11705 9395
868 9395 3709 -3356 -9757 -13608 -13097 -9054 -1316 6596 12781 16002 13879 7736 -266 -8030 -13266
883 -13266 -14108 -10524 -3718 4113 10914 14215 12653 7908 318 -7185 -12583 -14108 -11316 -5762 1042
898 1042 7542 10703 10192 7162 1680 -3880 -7551 -9177 -7364 -3553 987 5231 7493 7714 6058 2394
914 2394 -716 -3213 -3952 -3154 -2329 -461 958 1360 1071 505 -198 -356 -81 426 611 172 -448 -2140
932 -2140 -3545 -4085 -3891 -2021 1060 3680 6087 6775 5451 2157 -1789 -5327 -7218 -7433 -4282 246
948 246 5105 8999 10258 8433 4111 -1800 -7329 -10731 -11160 -8305 -3069 3247 8174 10345 9529 5399
964 5399 -478 -5883 -10490 -11076 -8483 -3479 2693 7827 10598 10517 7144 2034 -3184 -7330 -8422 -6942
980f942L432N011L798K521j96k014m064m459k898j382O48K631L240K894J994L19
996D533j218k095k220j728r50P58J411J660J256J312j78m63n77n77o64k92J29
1013I7M56k75m55n69l80K37k38O64J082L48K65j84j234q22j402p44k2J181J639
1032c56J551J759Q59n35q57k127j914j106k71Q11J828J944J845O80m86j220k396
1049Ij996j346o13N93J377J666K006P71K26j183j510j864j219m64O69J234J785
1066A41J885J187J45o90j726j112j398m75K33Q73J538J101R73L67q08j601j277
1083f44j528q21j48Q63J438J044J520M80o55o59j425j515j071N1Q94J350J971
1100A145J660Q03K31j156j922j879j300p49M18J743J870K065R64j1j452j882k247
$$ plain form
980 -6942 -3510 1501 5299 7820 7624 5610 1546 -2913 -5811 -7193 -6545 -3914 -674 2220 4214 4533
996 4533 3315 1220 -1000 -2728 -3678 -2920 -1509 151 1407 2719 2541 2078 1501 924 260 -32 97
1013 97 553 278 -177 -746 -1126 -889 -1127 -463 619 967 1232 1048 -186 -1008 -2410 -3154 -3176 -1995 -356
1032 -356 1195 2954 3813 3278 2421 294 -1620 -2726 -2997 -2186 -358 1586 3431 4111 3625 2405 9
1049 9 -1987 -3333 -3946 -3353 -1976 -310 1696 2467 2693 1510 0 -1864 -3083 -3547 -2878 -1644 141
1066 141 2026 3213 3358 2668 942 -170 -1568 -2043 -1810 -937 601 1702 2675 3042 2234 633 -644
1083 -644 -2172 -2993 -3141 -2278 -840 204 1724 2204 1549 890 -535 -2050 -3121 -3070 -2176 -826 1145
1100 1145 2805 3608 3839 2683 761 -1118 -2418 -3167 -2749 -1006 864 2929 3893 3882 2430 548 -1699
1117a699k039j068Q38J084K100K427J535L82p46j941j966j704j186J90J400K547
1133A54K093J496O86p70j426j739k117q63j46N62J711J296J342J33n52q45j391
1150c76r10m86l87N07P33M52N90j96R0m18N7O31O99j06M72k65r59q32j006j80
1170a890K68J483J919J692J185n31j610k318l078k168q40J176K419L206L359J747
1186F019M23k202l494m386l482j485J228L233M653M769L317Q39k281m202m981
1201b032m520k304O29L686M415M878M127R33j909m104n417m798k686k41K857M379
1217b107M801L651J544j165l406m405l648k597K05K019L510L643K754J259k82
1232E776k331k639k432j519j50P53J740J516J150K86l62r98p01m35q1M0L18k12
$$ plain form
1117 -1699 -3738 -4806 -3968 -2884 -784 1643 3178 3560 2814 873 -1093 -2797 -3983 -3793 -2393 154
1133 154 2247 3743 4429 3659 2233 494 -1623 -2486 -2632 -2070 -359 937 2279 2412 1860 1015 -376
1150 -376 -1286 -1772 -2159 -1652 -919 -467 123 -73 17 -401 -344 287 986 880 1352 1087 128 -704 -1710 -1890
1170 -1890 -1622 -139 1780 3472 4657 4126 2516 198 -2880 -5048 -5888 -4712 -2293 913 4272 6019
1186 6019 6442 4240 746 -3640 -7122 -8607 -7379 -4146 507 5276 8593 9432 7151 2949 -2032
1201 -2032 -6552 -8856 -8227 -4541 -126 4752 8879 9812 7903 3799 -1618 -6416 -9102 -9343 -6486 -2107
1217 -2107 2694 6345 7889 6724 3318 -1087 -4735 -7332 -7127 -5108 -1598 2045 4799 6058 5776
1232 5776 3445 806 -1626 -3145 -3295 -2542 -802 714 1864 2150 1788 790 89 -346 -427 -387 -69 -281
1250b81m73j213n81m01M50J454J969J947J222M15j196k767l222k341j230J247
1266e001K927L932M099K228L15k058m467n138m409k106J059L282N149N329L625
1281H766J133k270m661n604n442k780K92L498N493N762M769J807j741m009n431
1296d18n315l101l87K782M848N106M344J478j124l253m918m343k901o98J716L655
1312b529L577L044J269k99j965k870k297k286k64J184J458K019J773P47j23l25
1328B113r19r03l83j33M58L1j37l50p29m97O9J112J047J236Q70j75p56k119k522
1347b687j679q04K66K152L074K858K324Q0j066k618l817k947j558K03K752L141
1363c26M278K932Q41j174l303m316l718k296j59K321L448M021L303J077r44l038
$$ plain form
1250 -281 -754 -1967 -2548 -2949 -2499 -1045 924 2871 4093 4508 3312 545 -2677 -5018 -6248 -5001
1266 -5001 -2074 1858 5957 8185 8500 6442 1975 -3163 -7572 -9678 -8619 -5337 -188 5141 8766
1281 8766 9899 7629 2968 -2636 -8078 -10858 -10566 -7068 -1575 4187 8956 10763 9022 5013 -418
1296 -418 -5733 -8834 -9221 -6439 -1591 3515 7859 9337 8213 4960 42 -4301 -7202 -7900 -6184 -2529
1312 -2529 1048 4092 5361 5062 3097 227 -2070 -4356 -4620 -3436 -1978 41 1814 2561 2438 2113
1328 2113 1194 291 -92 -225 233 264 127 -223 -952 -1449 -1380 -268 779 2015 2885 2710 1954 -165 -2687
1347 -2687 -4366 -5170 -4904 -2752 322 3180 5504 5584 4518 1900 -1917 -4864 -6422 -6219 -3467 -326
1363 -326 3952 6884 7725 6551 3248 -1068 -4786 -7082 -7241 -4920 -1472 2549 5852 6929 5985 2947
1379B947l607l756k397j65J335L354L528L089J591m39j988k445l317j850n54P98
1395c876K145K890K174J162j23j251j954k050j820p34M46J299J476J289R11m7
1411A937m38j073r94p52n18J94N27M92Q19J27J64K88j80j55L22k7J25k37m17k99
1431i5R8k8l13J82P00K16P4k3m18p13k48n27l08k00L74Q25O24M61J76k6p15k96
1453a80n92l96L46Q0P72R55N61M2j44P9j260n00o96l08M13M36O43O90L17j91m83
1474E84p68p34o63k56N8M51J051J275M91L47m62q99n88j559l13K28P23J458J238
1493A662J165J62m93j197j329j407j587k6R59J626J585J418P80l91j397k217k204
1510b891j038p43R83K142K379K266J489k93j501k355k629j413r68R36J948K530
$$ plain form
1379 2947 -660 -4416 -6813 -6978 -5643 -2289 1239 4328 5919 5480 3492 1047 -2270 -4120 -4674 -3876
1395 -3876 -1731 1159 3333 4495 4372 3121 1167 -883 -2703 -3437 -2991 -1692 -216 1073 1984 1937
1411 1937 1499 426 -568 -1320 -1838 -1644 -1117 -625 194 321 485 773 593 438 760 733 858 621 204 -95
1431 -95 3 -25 -338 -156 544 760 834 811 393 -320 -568 -1095 -1403 -1603 -1229 -404 220 681 857 831 116 -180
1453 -180 -772 -1168 -822 -742 30 985 1546 1588 1444 1523 263 -237 -933 -1241 -828 -392 251 941 1258 1067 584
1474 584 -184 -918 -1581 -1837 -1779 -1328 -277 998 1489 1836 1374 475 -113 -1672 -1985 -1757 -1034 424 1662
1493 1662 2827 2989 2496 1299 -30 -1437 -3024 -3050 -2091 -465 1120 2538 3318 2927 1530 -687 -2891
1510 -2891 -3929 -4672 -3689 -1547 832 3098 4587 4294 2793 438 -2191 -3604 -4572 -3636 -1688 842
1526H42L152J353L6j548k659k817k377j148O15J876K623K337J717M22j226j767
1542A431k531k410j212N19J520J930K030J699P27p57j204j929j428k65j76P28
1558a328J337P24N62L32k23m85o62k70J07l2P6l62q15k11q80J57L71J220J522
1577A140J119M47n4j379k028k022j276l68J345K466K796K823J654o72k361l184
1593D46l948k667j007R64L682M234L772K309j49k620l822m799l938j575J084L578
1609d456M746M555L060Q33k244m236m601l863k219R71K827M510M623L104P54j409
1625F955l792m033l749k344K37K086L370L555K259J048o85k422k777k642j462
1640d396k3J140J828K074J212M87j46j018o07o60k29L28j7P5j6m50l71k86K46
$$ plain form
1526 842 3994 5347 5383 3835 1176 -1641 -4018 -5166 -4551 -2675 -52 2285 4002 4424 3198 1431
1542 1431 -1100 -3510 -4722 -4203 -2683 -753 1277 2976 3703 2946 1742 -187 -1615 -1880 -2056 -1328
1558 -1328 9 733 1295 1627 1404 919 257 -13 94 62 138 -224 -1039 -1250 -2130 -1973 -1602 -382 1140
1577 1140 2259 2706 2652 1273 -755 -2777 -4053 -4421 -3076 -610 2186 5009 6663 5991 3630 446
1593 446 -3502 -6169 -7176 -6212 -2530 1704 5476 7785 7636 5016 1194 -3605 -7543 -9118 -8034 -4456
1609 -4456 290 4845 7905 8738 6494 2258 -2343 -6206 -8425 -7454 -4627 -117 4506 7610 8364 6955
1625 6955 3163 -870 -4619 -6963 -6726 -4640 -1270 2285 4544 5592 4907 2485 -292 -2934 -4396
1640 -4396 -4419 -3279 -1451 623 1835 2322 2176 1158 551 -109 -338 -10 -27 48 32 -418 -789 -1075 -829
1659h29R70J404J185O83n91j531j792k544j977n01J321K242L250L081J613l63
1675E621j823l618l969k915r07J165L628M189M400K244O65k404m344m604l925
1690f597j904Q14L184M505M964L022O09k096l725m782m362k248L24K647M220M509
1706C084L288J121j310k832m175l393j972PJ772L022L494K751O36m72j819k809
1722C93k246j511l83J025J576J794J305M36m44q93j114n20o83R5L05M06j57J93
1740d23l23%J5M95J010Q57O95j41p74j097j651j278l04L06J628K102J913J276
1758D306qj539k102k901j771j170L90K161K795K373K234Mr54k588k884k699j222
1775e575L16K073K940L041K028P61p63k385l009k413j628o0J542K667K716J451
$$ plain form
1659 -829 141 1545 2730 3413 2822 1291 -501 -3045 -5022 -5523 -4202 -1960 1290 4371 5984 5621
1675 5621 3798 180 -3789 -6704 -7611 -6446 -2818 1371 5771 8015 8680 6276 1932 -2672 -6597
1690 -6597 -8501 -7687 -4503 2 4966 7988 8597 6501 2776 -2006 -6368 -8616 -8292 -5645 -1425 3084
1706 3084 6372 7493 6183 3351 -824 -4217 -6189 -6182 -4410 -1388 2106 4857 5493 5021 3202 393
1722 393 -1853 -3364 -3747 -2722 -1146 648 1953 2389 1945 1052 -62 -582 -1265 -1170 -865 -459 -616 -423
1740 -423 -746 -746 -731 -236 774 1631 2326 2185 1411 314 -1337 -2615 -2919 -2613 -985 1117 3030 4306
1758 4306 4298 2759 657 -2244 -4015 -5185 -4795 -2634 161 2534 4768 4772 3818 1230 -1654 -4353 -5575
1775 -5575 -5259 -3186 -246 2795 4823 5584 4821 2436 -573 -2986 -4614 -4674 -3132 -465 2251 3702
1791C702R15n20j866k373k508j268k24J042J613K023J693R04k90j154j669j575
1807a555q01k25P47J221R23J227O12j60m50q41j012l76r5J23N04L18K82k13M11
1826F40o21Rl9o1m14K73m6J64j69l22j1K3J64N22O34j18J85r1j70p29j36k84p2
1849f69K91O75N27L96J46k43m62j076m75j67j41K46N78M70O31L71m98j00q76q90
1869a266j85J34L10P58Q14K80J66j93K8p89k92m42j27K37O29P37P6L93ro03n43
1890A13n03p41l09K03K23R98N42L06N00m17r76o79n06n81N10L32J258P01O45L36
1910A955l98n13r87j296l06j34N79R15R89J133L65l01q11j518j183o80m80M62
1928b209R96J470J361J70K31p01j356j245r87l97N70J071J473J313P72P6p70j024
$$ plain form
1791 3702 4617 4097 2231 -142 -2650 -3918 -4142 -3100 -1487 536 2229 3133 2843 1689 20 -1555
1807 -1555 -2356 -2581 -1834 -613 310 1537 2149 1989 1539 698 -314 -690 -785 -662 -158 160 442 229 640
1826 640 19 28 -11 -72 -486 -213 -259 -95 -264 -586 -597 -574 -410 112 746 628 813 722 552 -177 -313 -597 -669
1849 -669 -378 297 824 1220 1366 1123 661 -415 -890 -1057 -1198 -952 -374 96 727 1098 600 500 -376 -1266
1869 -1266 -1451 -1317 -1007 -249 565 845 1011 818 846 57 -235 -677 -804 -567 62 799 875 1268 1259 656 113
1890 113 -390 -1131 -1440 -1237 -1014 -16 526 832 1332 915 -61 -740 -1246 -1827 -1317 -985 273 974 1619 1955
1910 1955 1557 1044 57 -1239 -1545 -1679 -1100 -185 804 1937 2302 2001 1190 -328 -1511 -2191 -2671 -2209
1928 -2209 -1213 257 1618 1788 2019 1318 -38 -1283 -2270 -2667 -2097 -1026 447 1760 2532 2608 1838 814
1946H14j245j066n00K89J014P20J015P52K47n80r16j116o12l99J24K06R56M86
1964A89M00J63l24n6m00l48L86n30L74J0J33K2k23L1J84M89K68P07K7l98p04p00
1986c00j040m02l16Q35Q84J320R65M36k15j127j564j578j127p8N97J814K243J510
2004B857J102m82j090j920k551j251l51N49J910K401J944J259l62j072k207k458
2020a722j731q58M19J609K043K385J302P4q45j426k543j933o82M21J635J727J889
2037A764J198M78o43j370j546j482p21J96Q99R88J538L89J91n04p40o73p05m05
2055a148M2K61L81J44N1J41l40J59L67K03M39J80J04p8j241q78j30k59M16J136
2075e0J126J239M38j03j072j481j845j255n37P94J496K024J603J050J79j572k011
$$ plain form
1946 814 -431 -1497 -1997 -1708 -694 26 1041 1793 2040 1460 544 -572 -1184 -1583 -1459 -1253 -297 189
1964 189 589 752 428 372 -28 -376 10 -520 -146 -136 -3 19 -204 -173 11 500 768 1475 1502 1104 400 -300
1986 -300 -1340 -1742 -2058 -1223 -339 981 1946 2382 2167 1040 -524 -2102 -3229 -3307 -2710 -896 1347 2857
2004 2857 3959 3477 2387 467 -2084 -3335 -3686 -3137 -1227 1174 3118 4377 4015 2943 736 -1722
2020 -1722 -3453 -4311 -3892 -2283 -240 2145 3447 3521 2676 1250 -1293 -3226 -3908 -3487 -1852 -125 1764
2037 1764 2962 3440 2797 1427 -119 -1601 -2322 -2126 -1227 -239 1299 1688 1879 1375 635 -38 -743 -1148
2055 -1148 -1106 -845 -464 -320 -269 -128 -468 -309 58 261 700 880 984 906 -335 -1213 -1343 -1602 -1186 -50
2075 -50 1076 2315 2753 2650 1578 97 -1748 -3003 -3540 -2746 -1250 774 2377 3427 3606 2034 23
2092B3j876j885o14N31J994K320K001J584L14j365j962k509j714p60L02J688K142
2109B14K123J586R7p35j877k430j614j066K30J013J894J995J146J92m37j199j553
2126d21j490o99N9P88Q94J544O60N72m72m56q65j23l20l01M36L59m4p4J75j80
2146D2k69L30O9O72R3l17n44m14q48m22m7J45P27J200R66N32P6p28j157j240r79
2167b113l19M81R51J629J594Q02L9j195j090j999j098m83J34J184J754J484P28
2184B483L84p39j549j222j716r17K25J030J688J606J040M78p10p32j959o72r95
2201b277Q8Q98J075J181Q40P27n13q83j249m58j200L70L69O65L79N59M12j25k13
2220F45o68o46o8j07K41J24J39M92J42k43l4K13k02N40mk6Q0j060L97k99j46K62
$$ plain form
2092 23 -1853 -3738 -4352 -3821 -1827 493 2494 4078 4392 3027 1065 -1444 -3158 -3918 -3616 -1928 214
2109 214 2337 3923 4020 3285 1408 -1022 -2636 -3702 -3472 -2459 -565 1430 2576 2768 2331 1132 -421
2126 -421 -1911 -2610 -2551 -1763 -869 675 1335 1907 1435 979 114 -9 -329 -630 -194 165 121 47 222 42
2146 42 -227 103 172 844 937 620 76 -338 -1186 -1608 -1655 -1510 -783 417 1383 1915 1991 1263 106 -1134 -2113
2167 -2113 -2432 -1951 -1000 629 2223 3025 3064 1869 779 -1220 -2318 -2801 -2667 -1483 271 1755 2483
2184 2483 2867 2128 579 -643 -2359 -3276 -3051 -2021 -333 1273 2313 2791 2081 1349 -610 -1282 -2277
2201 -2277 -2189 -1291 -216 965 1805 2532 2019 1136 -113 -571 -1771 -1401 -1032 -367 12 571 983 858 645
2220 645 -23 -669 -737 -844 -603 -479 -340 152 294 51 17 230 28 568 564 538 618 -442 -45 -344 -490 -228
2242b28RL10M77K03J25j80p63o00k64j27L6N59M04M33L92L53m47o26k58o33l84
2263a209J36N73M60P61P57Nl93n45m26q21l32J35O1P40N92L70J15l56L4j015k75
2284f33l07k91J92L55M80L40N02L3l76l58O6n28j19M01m9N47K17K01K18k88k82
2305C21r0n90j9K5J63K35mR9J24q5j1k15l34Q4R0k36J34O0L18J75p4J%m21K7m9
2331b72L29j03K42K28k2K93j08m84j21m30m0O14k68J77K60P3k45l0k56k02m20
2352g85L25QJ8M86J61k67L68j24q0P2m65K75j6N1J55M51l11Q3n2o6j07l5j95J70
2376A20l51J3j26M7p6P7j95R4O12j82j13mM5j34o9n49K51M18L75M35J03J31N7
2399I79n81l41n15k66m2K78L22N56P92q6j35n78m59n05j039O8L61P27P28P05M38
$$ plain form
2242 -228 -219 91 568 771 896 716 -47 -647 -911 -1038 -1002 -443 -39 394 786 1139 692 66 -192 -825 -1209
2263 -1209 -1073 -500 -40 721 1478 1483 1090 545 119 -702 -1034 -899 -838 -98 494 864 979 623 657 -358 -633
2284 -633 -940 -1231 -1039 -684 -204 136 638 671 295 -63 3 -525 -644 -243 -292 255 472 673 891 603 321
2305 321 231 -359 -378 -353 -190 45 41 140 264 179 168 -47 -381 -297 -207 -443 -309 -249 69 244 170 171 171 -250 -223 -272
2331 -272 57 -46 196 424 402 695 587 103 -18 -448 -488 126 -142 35 295 368 123 93 -163 -365 -785
2352 -785 -460 -452 -434 52 213 -54 314 190 110 182 -283 -8 -24 27 182 633 322 405 353 287 180 145 -50 120
2376 120 -231 -218 -344 -297 -373 -296 -491 -397 215 33 -80 -84 -39 -173 -242 -791 -540 -122 253 688 791 922 979
2399 979 398 57 -458 -724 -766 -488 -166 390 1182 1096 961 383 -76 -581 -1620 -1552 -1191 -464 264 969 1407
2420A407k81q02o3j074m25j03J42O44J030P52L92J34l60p53j127n31l50Q4R34
2439c50N91K94O09r4j91m43p38n47l02J02L24M47M71L13K97j44n43k73M8j67q9
2460c85K26L74J60j79L02k88O9L9k24J95J14m84n1j58j46j45N1L53O6L57K80J18
2482F44k4m76l76m51m90K31K10L35J200M32L70R7r54p05o37q21k9O27K49J165
2502E97N39N66k56n42o62j217n61o40O68P41P55J141K20R0m83p59p47q77O0j30
2522a497M71J175P38M91P3j26r10l78p08l48M1L89O23K86M86j2j88l80l52k98
2542d24k39J19j7K62J04P6J28Q8j96J27%L25k96J41j03O3m53M8o2K27M26j31M72
2565F85M19m95l42j55p68k46l24L41M19P64L82L20k00m58o76m62l53k27J19R01
$$ plain form
2420 1407 1126 324 261 -813 -1238 -1341 -1199 -555 475 1227 1619 1753 1393 640 -487 -1018 -1368 -1284 -350
2439 -350 241 535 1144 1050 859 416 -322 -869 -1171 -1069 -745 -298 173 486 783 639 96 -177 -129 -296 -385
2460 -385 -159 215 375 196 498 210 279 318 94 289 403 -81 -132 -290 -436 -581 -530 -177 -111 246 526 644
2482 644 620 144 -232 -683 -1173 -942 -732 -397 803 1235 1605 1702 748 43 -594 -1415 -1444 -817 -568 597
2502 597 1136 1702 1446 904 242 -975 -1536 -2176 -1508 -767 -12 1129 1349 1439 956 197 -550 -1427 -1367 -1497
2522 -1497 -1026 149 887 1378 1451 1325 415 37 -671 -1019 -978 -589 34 320 806 794 606 226 -126 -424
2542 -424 -663 -544 -561 -299 -195 -119 9 97 -99 28 28 353 57 198 95 158 -295 -247 -309 -82 344 213 685
2565 685 1104 609 267 112 -656 -902 -1226 -885 -466 298 680 1000 800 342 -334 -796 -1149 -1376 -1257 -356
2585c56O28N15N00Nk45q08m92n91k28K44L78O30O26N49j9n25n48p38n57m14j1
2606a457L79P08Q77R9L72k22m71n26n16k13L68o7O49L61J25L55j00o3l18n52k24
2627d36J2M86jp5L70n6p3r7k16j85J55J8r3J08J9l6K7k99J83P1L92k61L13k46
2651H0J41j83j65M0M6QJ72L46j75J70r0j80r8k63k67J45p9K47J40J00J97r9o7
2674A66k03k29j84j12J24K04L45j70L41K17l35k72N0N9j80j63K28J72J91K54j05
2695C98N4k3m87k67j32m7L81j46M10L6J84j18l13j01j80j36R1k90P59Q2K54J45
2717E54j61j5j55j42m18L2P8K36J57M89q5K21m57k81k6m35j91J12j65L24K76K72
2739B20K89l18K6n79J6l21J44J86L79L12L17J34n8o12K5o19J64J01J6J52M52j48
$$ plain form
2585 -356 272 787 1287 1292 1047 239 -253 -844 -1072 -828 -450 180 806 1355 1336 811 263 -475 -1032 -1446 -1457
2606 -1457 -1078 -370 507 606 978 756 285 -241 -757 -970 -602 -669 -20 341 466 821 721 658 340 -212 -436
2627 -436 -424 62 61 -14 356 300 227 130 -86 -271 -116 -98 -191 -83 -64 -100 -73 -372 -189 -118 274 13 326 80
2651 80 221 38 -127 -87 -41 -33 139 485 310 480 390 210 112 -151 -418 -273 -352 -105 35 135 332 233 166
2674 166 -37 -266 -450 -562 -438 -234 111 -59 282 499 164 -108 -58 1 -179 -342 -114 58 249 503 398
2695 398 452 429 -58 -325 -457 -504 -123 -269 141 177 361 243 -70 -171 -351 -487 -396 -686 73 155 409 554
2717 554 393 378 223 81 -337 -305 -227 9 166 655 570 791 334 53 27 -408 -599 -487 -652 -328 -52 220
2739 220 509 191 217 -362 -346 -667 -523 -337 42 354 671 805 747 135 160 -459 -295 -194 -178 -26 426 278
2761B78L27l33j51l17j79J75k79p3M33L0J12J40j13J5k76R9j52L66k20K45j10
2782A7m8oK40o2l6J66K74k57K97k34k80k42p3k45R3k6K97N63K09r8l60k97k49
2805c57m37m59N39M31N2P33M22J22j77l63p30n44o3N8P1P52O71N46N0l45l48p99
2827a75p65k48k83O04N98N43N76p2N9J7r62m74m22j73K26O14M39P22M59K7n60
2848G50m01p37j33k55K72L22R8O97k6p8j10l72l89j23j3O4oM00j49K44k70K85
2870G0j85k4K07j12J6L47k82o4l13J98r2K67L37L63r1Q9K7q63j8j95k38J6J32
2893d08M73K35K97q6%l16o82k58n35J51N14O19L51O75j0p4l96o00l32o29kM76
2915e37K99Q83N29jJ9l97q43o17n3l95N06J29P13J60M96K35o44m42k69l47m06
$$ plain form
2761 278 605 272 121 -196 -375 -200 -479 -552 -119 -89 23 163 50 65 -211 -112 -264 102 -118 127 17
2782 17 -31 -37 203 141 105 271 545 288 585 351 71 -171 -244 -489 -396 -422 -125 438 647 549 189 -108 -357
2805 -357 -794 -1253 -714 -283 -231 502 924 1046 869 506 -224 -768 -831 -773 -702 50 721 1267 1317 972 624 -175
2827 -175 -940 -1188 -1471 -867 -269 274 850 778 837 854 -108 -582 -1004 -1177 -951 -337 102 824 1283 1310 750
2848 750 349 -388 -521 -776 -504 -182 -84 613 587 509 399 27 -362 -485 -498 -434 -440 -40 -189 55 -215 70
2870 70 -115 -139 68 -44 -28 319 37 -27 -340 -142 -234 33 370 733 642 731 758 -105 -123 -318 -556 -540 -408
2893 -408 65 300 597 511 511 195 -487 -745 -1280 -1129 -615 4 355 1030 1020 946 550 -50 -382 -1011 -1013 -537
2915 -537 -238 645 1174 1173 1192 795 -48 -665 -718 -1113 -607 -478 235 395 891 1126 482 40 -229 -576 -982
2936i82K33J91L96O07l3K72J8o24k02m5k16J4K7N82m1K29n5N8k83j61k00Mp8L26
2960C7j30N3O0l57K66M6p1J17J11k81J93J13j56o4n6l57N66N2J88o1K04k63K00
2983D10l62m7k51j75K13R6P30m92R8j52Q6l81qj94JJ22j0M78J73N9p6Q9j64k97
3007e4j01j13p7J51L15L99p0j29j5q0l03j06j53j67N3O99Q3Q4k29K04k86l84j88
3030d67N1j7OK44M53J44n5k05p6j57k29K4k02K15R1L19L14j33N8M7j92n51l95
3053g13J73K02Q1J51L18L13j89k07k29j96n0o6q5L39j31P54J3n1m8k74j33n07
3075e35J07L28o8L00L49Q1p3P7l51l43j02j26l8J34nL45J14Q5l62K25l50J8q7
3098b77J63J47l87L15j67J51J58j53J55J6N5j29L21J6m51On02J55K82J11J75J18
$$ plain form
2936 -982 -749 -558 -162 445 412 684 702 78 -124 -169 -385 -371 -344 238 197 426 371 429 146 -15 -215 -211 -289 37
2960 37 -93 -40 20 -337 -71 -25 -96 21 132 -149 44 157 1 -63 -119 -476 90 142 330 269 473 210 410
2983 410 48 1 -250 -425 -212 -116 614 122 220 68 154 -227 -235 -429 -428 -306 -316 162 335 394 318 407 243 -54
3007 -54 -155 -268 -345 -194 121 520 450 321 306 226 -77 -183 -336 -503 -450 249 332 416 187 391 105 -279 -467
3030 -467 -416 -433 -427 -183 270 414 359 154 78 -79 -308 -284 -486 -271 -180 139 453 320 378 425 233 -318 -713
3053 -713 -540 -338 -257 -106 212 525 336 129 -100 -296 -346 -412 -497 -158 -289 465 478 427 379 105 -28 -535
3075 -535 -428 -100 -168 132 481 562 489 566 215 -128 -230 -356 -394 -260 -265 80 194 279 -83 142 -208 -190 -277
3098 -277 -114 33 -354 -39 -206 -55 103 -50 105 121 176 47 368 384 -67 -61 -563 -408 -126 -15 160 278
3120B78J73J21m43k00m93j68j42L26K71M18L40L22P3k59p68m15p1j73P9M28N12
3141B09L68L52K50m80n54p04p0m14L41R5M51P98L42J6j14n72p41n77j08P7L17
3162g18M91N15M44K74l31l13l62n12r4j65K89O15J02K53K77j15q8o87O5k39o9
3183c68k29L96J55J51mj07r6Q5j94K07N5j23K33k50j91lp6J21K68L49J28j36P5
3206D46j10k46k55k81l22L13K00L4P19L94Nl22n35l46p34r9P4L56O78N28N82L4
3228A113l91m76n51l98m09J19M50N08N19M78K65k17p95r0p95l47j92P14M09L13
3248B27N26K35m21Qm82n38o09M7M93K57M18L88J92j0n05j24k08Kl61J85L11P9
3270A10J76k68K85l7J4j79r7M2j46NK53m09J19M1j07j4J70k05Q25m03j87o8j86
$$ plain form
3120 278 451 572 129 -71 -564 -732 -874 -548 -277 141 481 803 876 617 -151 -566 -637 -810 -731 -303 209
3141 209 577 929 1179 699 145 -559 -629 -1043 -702 -607 -156 642 984 1000 886 314 -427 -1004 -1112 -1035 -718
3162 -718 -227 288 732 1006 675 362 0 -512 -606 -771 -482 133 235 488 765 650 562 -125 -60 -299 -368
3183 -368 -597 -201 -46 105 101 -6 -102 -17 -211 -4 51 -72 161 -89 -280 -283 -359 -238 30 379 507 371 446
3206 446 336 90 -165 -446 -768 -455 -255 -221 498 892 897 575 40 -306 -1040 -1139 -1065 -709 -31 497 1079 1113
3228 1113 722 246 -305 -703 -1112 -993 -543 -35 484 962 1227 1010 215 125 -670 -1017 -1209 -495 -86 227
3248 227 753 988 567 575 93 -445 -1054 -1007 -514 -257 161 549 741 731 226 102 -106 -104 -465 -280 31 110
3270 110 286 18 303 266 280 101 4 46 -100 -95 158 -251 -132 -91 -198 -212 -42 -247 578 175 -12 -80 -266
3293b66j18j0l7L22M86J93J93Lk09j22n56n32K39j19J97N90K85P4J99m05j75n24
3315b92k99l02M9J35M30P00K36n1k52j56k35j50l36r3K94M05L15P5L45l25k50
3336B43k65j15j28n3J39Q2K69J23L10l87L4l15l9l48p3L83M6m8L02k38K26J40
3358B88k61K13k82j22K36j32k00M21k00K02Q7p2j3j04J27k14Oj4J68k55j15L61
3380A25k71L9j17K7K24O8j3m0j50J1j7k07L08R2J3R8j59J65j4k86rk35L07K16
3404A75L0J52j48k54P2N3m29J96j47N63n79J12L56j31j13J10j78Kn3RN2K26J9
3427I5j4K47pm1l62J12p8M0J56j04J34j82J66%q1r8j52q2R2l84M03L7L51p0n5
3452A23J35l09M9l52K67l36J69K04j6L38J98j53M2l33k82j20p6K02o8L22K50R
$$ plain form
3293 -266 -384 -394 -431 -109 377 570 763 766 557 435 -121 -653 -414 -533 -336 254 539 613 812 407 232 -292
3315 -292 -591 -893 -844 -709 -279 421 657 606 354 198 -37 -187 -523 -616 -322 83 398 473 818 493 243
3336 243 -22 -137 -265 -318 -179 -97 172 295 605 218 252 -63 -102 -450 -523 -140 -94 -142 160 -78 148 288
3358 288 27 240 -42 -164 72 -60 -260 161 -39 163 250 178 165 61 188 -26 -20 -34 134 -121 -236 125
3380 125 -146 -107 -224 -197 27 95 82 42 -108 -97 -114 -321 -13 79 92 190 31 196 182 -104 -113 -348 -41 175
3404 175 205 357 209 -45 27 80 -349 -153 -300 263 -316 -204 152 21 -92 18 -160 -158 -211 -202 -150 76 95
3427 95 81 328 321 280 -82 30 -48 -8 148 44 178 -4 162 162 81 -17 -169 -251 -159 -543 -140 -103 248 178 123
3452 123 258 -51 -2 -354 -87 -423 -254 -50 -66 272 470 317 359 26 -256 -376 -452 -250 -318 4 254 263
3474B63K4K08k88m74Jk04J39K32O0L04O6l22P8j2J8m05L76l55n4L19q9K68J77
3497C30j12q9q3j20J70j89J53J09j02R4P5k23K33k79l25N09j92j43l9K13j06k61
3519c77K74k50L64K7K80rR7j69l79K25n99K53J45J63M09j33N36l66r3o15j20k61
3541e98j14L64Q7M66l5K77J13k63m27o0m71R6o3L88L37L84J22m2j18l08j19l23
3563c07l16NM36J64M9Q00m44r9k42j01k78l24L42J88K0j08N65l7p9j87N6M9l02
3586a50k4k7J35J47j60K86j87J94r0j3O4J09j38q9k6J75n44mK33O6rK78l3l0j15
3611D8l4q7j61p7Q5J63L36J98j35j25o9r3k4j91l71K37L82J14L14j78K35l29j44
3634I4k06l65j4P6p9K96K01M07J55k64q8l79j84l02J03K07L52P4K55J25n1j30
$$ plain form
3474 263 287 495 207 -267 -266 -470 -331 -99 -39 265 331 9 87 75 93 -312 64 -291 -345 -26 -115 153 330
3497 330 218 129 46 -74 96 -93 60 169 67 161 236 13 246 -33 -358 151 -41 -184 -223 -10 -116 -377
3519 -377 -103 -353 11 38 318 309 406 237 -142 83 -516 -263 -118 45 454 321 857 491 398 -217 -337 -598
3541 -598 -712 -348 -261 205 170 447 560 297 -130 -190 -661 -565 -628 -240 97 481 603 561 443 135 16 -307
3563 -307 -623 -618 -182 -18 31 831 387 288 46 -55 -333 -657 -315 -127 -107 -215 350 313 234 47 103 152 -150
3586 -150 -174 -201 -66 81 -79 207 20 214 124 111 175 284 146 57 31 206 -338 -342 -109 -43 -52 226 193 163 48
3611 48 14 -73 -234 -311 -226 -63 273 471 336 211 142 49 25 -166 -537 -300 82 196 510 332 567 238 94
3634 94 -112 -477 -491 -415 -494 -198 3 410 565 301 213 -166 -350 -652 -549 -342 10 84 339 464 413 283
3656B83k09k01m7k34k1N22Q6J8J98j31l5l82j1J03p0q3J6P0L26l35K10j06J22
3679H9m2j50n4K90Rp3O5k36K69j52J20j34M56j01K6l60J35p0l76J02k33L97M0
3702A7K9L39k56J33k04j89l5j52j40J99K83Q1K02k32K38j72k67k50K58m92L22
3723b88N12j46N34k73k3j60l10q0N7q6J75r6K13P6J13j80J77j19l85OL9K37n4
3746f1R9O3O0J73m25k3J6J99R1l02J27qrJ84P9m7l34q1K71j21j77J92j43m6J00
3771a23k32K05J45j48J1J67J89j67r4k07J49j2J68j47M34j32j85R2Jm0j11L4N2
3794D9j60j94M12j69J82J46j69k56M5O1j79J6j07K68n0O3P2j70J41o3j21L92j90
3817A9j35O7k04L23m0J19Pj18q6M34m89L26k65J88p1J9K45k69k51n3M11n02M0
$$ plain form
3656 283 74 -127 -174 -408 -429 93 179 197 395 264 229 -153 -164 -61 -131 -214 -198 -128 198 -137 73 -33 89
3679 89 47 -103 -157 133 142 69 134 -102 167 15 135 1 457 356 382 22 157 87 -289 -187 -420 -23 17
3702 17 46 385 129 262 58 -131 -166 -318 -458 -259 24 105 307 75 313 141 -126 -376 -118 -610 -288
3723 -288 224 78 612 339 316 156 -154 -234 -177 -263 -88 -184 29 105 218 38 215 96 -289 -283 -244 -7 -61
3746 -61 38 101 161 334 -91 -114 -98 101 192 -110 17 9 0 184 263 216 -118 -199 72 -49 -226 -34 -177 -223 -123
3771 -123 -355 -150 -5 -153 -142 25 214 47 -47 -254 -105 -117 51 -96 338 206 21 113 114 74 -37 -3 49
3794 49 -111 -305 107 -62 120 266 97 -159 -114 -53 -232 -216 -323 -55 -105 -42 30 -140 1 -62 -183 209 19
3817 19 -116 -49 -253 70 30 149 156 38 -48 386 -103 223 -42 146 75 94 339 70 -181 -234 177 -325 -285
3840b85K86n3J16j12%P9m0M1J26j60r6K68k22O0L5J49k38K6J79j15n3j57J68O5
3864F7r4r9J03J66k03N0l0n3Q1j99L27k37J85N0j4r5m0N8pl51K81k6K16k16L86
3889C06k1k08M5k61J69k58K99L1j92J79l20M21K4l31J25j98K94k83J63l0N7p5
3911f4L53j54q5K44l56j0J12j06J45K7j90J27n1j01J30K72j37q7J38j98j97K74
3933H6k28Mj84J99J47N9J77k3l27O5j62K10k27J64R3j27M06k57R3k1j09p4k07
3956b43J44p5J30j4L86r1p7k43J1K09k91O2r1o0J43N6K64O9j77j99j96K93l59
3979c49K91Q5Q0K36r3j02k42J62m6K5k50j52J34M4M7J05M3K5J39M1l22j37K73
4002C7k29M84k65l1n9n9R1J7nL9J47r8K7j40k40N0P3K67J87l86N5K72j95J11l55
$$ plain form
3840 -285 1 -52 64 -48 -48 31 -9 32 158 -2 -98 170 -52 8 43 192 -46 -20 159 44 -9 -166 2 67
3864 67 -27 -126 -23 143 -60 -10 -40 -93 -12 -211 116 -121 64 114 100 5 -35 23 16 -335 -54 -80 136 -80 306
3889 306 285 77 122 -139 30 -228 71 102 -90 89 -231 190 214 -117 8 -190 104 -179 -16 -46 11 -64
3911 -64 289 135 50 294 -62 -72 40 -66 79 106 -84 43 -8 -109 21 293 156 69 207 9 -188 86
3933 86 -142 -138 -322 -123 24 83 260 237 -90 -25 -187 23 -204 -40 53 -74 332 75 168 147 38 -36 -243
3956 -243 -99 -174 -44 -58 328 237 160 -83 -72 137 -154 -92 -183 -243 -100 -44 220 289 112 -87 -283 10 -349
3979 -349 -58 27 107 343 250 148 -94 68 22 47 -203 -355 -221 -177 -130 -25 18 43 182 223 -99 -236 37
4002 37 -192 292 27 -4 -63 -122 -31 -14 -19 20 167 69 96 -44 -284 -234 -161 106 293 -93 -38 234 39 150 -205
4027b05K57j40l9Q1j24L86j58o6q1J61j55Qk55R7J75j53J79J86J05J64j80j48
4049I5P9k69q6p9J44M2O0l7M2N4K20l06k12J42J07k01p2K99J35k83L28k29J37
4072A10kk8k32N6J78l69L61J04O9m21n2J25J11m2Q4k71L16R1j08j63L8k1J50k35
4096a51K86k28j94J99K26j68l15L25m3L64r5l2m59L36j44K18k24R2j06J16O6r1
4118b2L42k77p9J38j91m5R8Or9N2l8L90l40L52j7l68R0m5Q4M7L0J5J6P0k32J97
4144A74j21L8j42O2K38m47J49P9Lr5J91R9k8j76Jj87J63j10n1R6j70L12j88J06
4168dP4Jj70J00j14K37M4k37L65k44n0M7J13p8k6no7q2j30J79P9l12J23R1J48
4193H2j69j15M09l12K70k60J54m4q2J44mq5R5p3J1R9q6M1p7J19L5j86q9K5PJ89
$$ plain form
4027 -205 52 -88 -127 -46 -170 216 58 -8 -89 72 -83 -75 -330 -233 -58 -211 -32 154 259 423 243 95
4049 95 174 -95 -181 -260 -116 -74 -14 -51 -9 45 265 -41 -253 -111 -4 -205 -277 22 157 -126 202 -27 110
4072 110 108 80 -152 -96 82 -287 74 178 247 -174 -226 -101 10 -32 52 -219 97 188 80 -83 -45 -66 84 -151
4096 -151 135 -93 -287 -88 138 -30 -345 -20 -63 301 206 174 -285 51 -93 125 -99 -7 -113 3 69 -22
4118 -22 320 43 -36 102 -89 -134 -36 -30 -129 -77 -115 275 -65 287 270 -98 -8 -53 31 78 108 123 139 209 -23 174
4144 174 53 91 -51 11 249 -198 -49 30 33 -62 129 228 200 24 25 -162 1 -109 -160 -64 -234 78 -110 -4
4168 -4 70 71 -99 1 -113 124 168 -69 296 52 2 49 162 84 58 53 -14 -96 -226 -47 32 -280 -157 -66 82
4193 82 -87 -202 207 -105 165 -95 59 15 -67 77 73 -12 83 10 21 120 34 75 -2 117 152 -34 -123 -98 -91 98
4219I8J08k19K78k24k31J81j3j65O2J96J96l50j68K95P7j14M0J10j29j12R3q8
4241g9j65L49l0J45m2k97R6R9j87K45p9Pk70J50K5J11R5l70J31R5P3l5K8j32j81
4266b18K56q6L10k06J0K58J61m07j87j28LK75P0j55J91k3j64J58j3j06p7J88k45
4289a35j04M40j15L5J06l12L96k66k67J96j20J21J45p3J03J99l03kk57L53k92
4310a52j84M20q9J32k08L45l52J52l7K8J9j75r9J68Rj35M8k38L66k24Q3L80j49
4333A08oj97j19nK48k07J2J45Q1M9o6R1k83R3l1j33N9q5K03R2K06l01J24L8j25
4358il6J8k26K27O5r1K47L0l94K48JJ21l60l23L84J36J20M9j03l0P0n5j68jl16
4383c96K78l6K30m2p0L70j18l31J70Ok61K6K12j71R1J96n5o1o5J26K8r0Q6l87
$$ plain form
4219 98 206 -13 265 41 -190 -9 -22 -187 -125 71 267 -83 -251 44 121 7 47 157 28 -84 9 -79
4241 -79 -244 105 75 220 178 -119 -23 76 -111 134 55 62 -208 -58 -33 78 173 -197 -66 29 102 67 95 -37 -218
4266 -218 38 -48 262 56 66 324 485 78 -109 -237 -234 41 111 -44 147 124 -40 118 105 -1 -78 110 -135
4289 -135 -239 201 86 121 227 -85 311 45 -222 -26 -146 -25 120 47 150 349 46 44 -213 140 -152
4310 -152 -336 84 -5 127 -81 264 -88 64 27 55 74 -101 -200 -32 -23 -158 -110 -348 18 -206 -123 257 108
4333 108 102 -95 -214 -219 29 -178 -166 -21 60 109 43 134 -149 -56 -87 -220 -161 -246 -43 49 255 -46 78 116 -9
4358 -9 -45 -27 -253 -26 39 -52 195 225 -169 79 80 201 -159 -482 -98 38 158 207 104 74 144 89 -79 -80 -396
4383 -396 -118 -154 76 34 -36 334 216 -115 55 61 -200 -174 38 -133 -42 154 99 38 -27 99 127 37 123 -264
4407b64L18j15M3j25J59j28L33q4k19K40k39j8j52J26k3K29n8K08o8j49R8K9k20
4430g9J15m31K94M1K08k40K75K5j40j16JP7j42n3J1k63L41J46J5p1j8Mj49o1o0
4455b70J38K84o6J5j29M01j48j67j22j66J14Q8J02k04oJ70k6K27J83l95O0Q0k34
4478g1k8K2Q3j75K07N7l0r5j04M3lJ22j02K03k13L15l09OJ59k70M20j76j57K10
4502A14m0k67N7K04p1J24j28K6j60N4J7rq7N0K29l0o4L17k77k05J65J13j34r8
4526a00p0J73L13m38K0K14l09L65o5k38L17l64J18M8p9J84j47p9l42N57l10J44
4548h8N9r9J11L18j79Q3k71n2m7L2K35j0J02k00P7l9o9J27J37l14J37j95J69j42
4572a18J16J01j96O1j44J24J80l18R9o7J29r8K8J33j31J93o2J80n0J48l2m08m2
$$ plain form
4407 -264 54 -61 -18 -143 16 -112 221 137 -82 158 -81 -99 -251 -125 -148 81 23 231 163 14 112 141 -79
4430 -79 36 -395 -101 -60 148 -92 183 208 68 -48 -47 30 -112 -165 -154 -417 -76 70 85 14 -4 0 -149 -210 -270
4455 -270 -132 152 86 101 -28 373 225 58 -64 -230 -116 -28 74 -130 -136 34 8 235 418 23 83 163 -71
4478 -71 -99 -77 6 -169 38 95 65 -30 -134 -91 -94 28 -74 129 -84 231 -78 -72 87 -183 237 61 -96 114
4502 114 74 -193 -136 68 -3 121 -7 19 -141 -87 -70 -79 -166 -116 113 83 19 336 59 -146 19 132 -2 -100
4526 -100 -170 3 316 -122 -102 112 -197 168 103 -135 182 -182 -64 -16 -95 89 -58 -137 -479 78 -232 -88
4548 -88 -29 -128 -17 301 122 205 -66 -118 -165 -133 102 92 194 -6 71 32 -37 90 227 -87 50 -145 24 -118
4572 -118 -2 99 -97 -36 -180 -56 124 -194 -95 -162 -33 -131 -103 30 -101 92 30 210 160 308 276 -132 -174
4595a74j44L55m84O57Ln9J24l97K6j40P1K2j24O5J09j1K68J90l87j30K43r6k78
4618b91m9R9K67j36L98j63o5m6J59l9m83m4K48J0K35J95k14n1o4K9J99j98j55
4641a59L9K7n3J5K01K76j40l65K21j34Q9P8m07J54P3J45j05o8m2L71k91L57m2
4664B40j62L3j58j02P5O0j17M21k24Q2J3o8ML7k85m47P1L37L27J50K9p7N2k17
4688G4p7j50j67J94q8J54L71k64L73p8l80J14j29j98j61J87J23L64j68O4J72j59
4710A71m07j53K36l32K77J4K61J66j39k04L66k48q7J90k51J79L49m95J09o2J72
4731A12J70k20J07J18j91j73k54J68R5kj12O0J73j5K9j1K15j45k96p8J04j11L02
4754D5J0m3J94J80l3j75k41J75l83O9Q2m3J2K45K11j32J65m9m57Qj90J46q3J19
$$ plain form
4595 -174 -318 37 -447 210 213 154 278 -119 -93 -233 -162 -140 -264 -199 -90 -101 167 357 -30 -160 83 -13 -291
4618 -291 -340 -241 26 -110 288 125 60 14 173 134 -349 -393 -145 -135 100 295 81 30 -34 -5 194 -4 -159
4641 -159 -120 -93 -146 -131 70 346 206 -159 62 -72 17 95 -312 -158 -85 60 -45 -113 -155 216 -75 282 240
4664 240 78 111 -47 -149 -74 -14 -131 290 66 148 161 93 97 134 -151 -598 -527 -190 137 287 316 239 291 74
4688 74 -3 -153 -320 -126 -214 -60 311 47 420 342 -38 76 -53 -251 -412 -225 -102 262 94 158 330 171
4710 171 -236 -389 -153 -485 -208 -194 67 233 94 -110 256 8 -79 111 -140 39 388 -107 2 -60 112
4731 112 282 62 169 287 96 -77 -331 -163 -68 -70 -182 -122 51 36 65 54 269 124 -172 -250 -146 -257 45
4754 45 55 12 206 386 353 178 -63 112 -271 -202 -120 -163 -151 94 305 173 338 289 -168 -160 -350 -204 -287 -168
4778a68L36l5L02k40j51j20J25j55k35J13j49L11K84k50J69j66K36l80J45L9k33
4799b22P7L8J1K28l8O4Q6k04j11k00K31j14K73Q1n6r0L3k55N2K62k02J3L23j7
4823B63m01K00j08m6M15m12J70L5q6m4R3o9j37o9k49L64K87j00p6J5J70J1l93
4846a67J01M9k61K88J32J24j74Q3j45J45k22k45O4p2Q1K55j66K86j11j65J8J06
4868DJ05R2l39N8j83M86l58J84m5j50%J2J37q8Q8j98L97j94M1p4P6lP5j84J03
4893D2J08J18l41o2K35j57J06K0N1j9p3m4P8M1k38j09M01k23R1j53J89O2R4p3
4917A44j07L9j67n5K64m4j83k0j0J74J85l48o5M6L12k25q5K51k06Rnj9l6j11L12
4942E0P6J16k17J97j16K6j27j42J10k7k5L1K84l61M11m35J63l25K55J86k74OJ93
$$ plain form
4778 -168 168 133 435 195 44 -76 49 -106 -341 -228 -377 -66 218 -32 137 -29 207 -173 -28 11 -222
4799 -222 -145 -107 -96 132 94 158 244 40 -71 -271 -40 -154 119 200 144 54 87 -168 -116 146 -56 -43 280 263
4823 263 -138 62 -46 -92 323 -89 81 116 30 -14 79 10 -127 -196 -445 -81 206 106 30 45 215 226 -167
4846 -167 -66 -17 -278 10 142 266 92 175 30 175 -47 -292 -228 -300 -219 36 -130 156 45 -120 -102 4
4868 4 109 201 -138 -80 -263 223 -135 49 4 -146 -146 -134 3 -85 3 -195 202 8 49 -25 51 48 123 -61 42
4893 42 150 268 -73 -135 100 -57 49 69 120 101 28 -16 62 103 -135 -244 157 -66 25 -128 61 123 217 144
4917 144 37 76 -91 -146 118 74 -109 -129 -139 35 220 -128 -193 -147 165 -60 -145 106 -100 -91 -96 -115 -151 -262 50
4942 50 126 242 25 222 106 132 5 -137 -27 -54 -79 -48 236 -125 286 -149 14 -311 -56 130 -144 -138 55
4965E5m7K69l64QK09q4j56kj40R6M00j35P5J56l01K12k73%K32m9N8k26J67j91
4989c1P2M7j88p9R2J54o7p0q8K83l53K59k69J88J76j38J92k45J43k73L68l46K10
5012C7k77K84N7L82l73J7J9l20J00l3q9m6L50L47k68J42j82k2k75K9MK32j96n6
5036a37L83O8k65j8P9k70m7j0r1L32j93J12N0P1j68P7K67k75r4J73L1j38m1L5
5060f9K93j77k41L20l56L68j19k12R0k01L10j27l8J92k93L08m3J36j12k02k4j54
5082c51K54l14K58K80j93K05k3J05k45J16k07m54R3K83p2J63J03N88l50l7L4l87
5104a51N6k07j46L37Q2J02J44J50o5m2l89O4k25K31k69J54L19j25Q9Q3L6K8j24
5127A32m56Q0P9O9J44ok30K1M77k52k79K86k43L44k07K14n9l1n1kO7j4P3j80N8
$$ plain form
4965 55 8 277 -87 -79 130 46 -110 -112 -252 -156 244 109 184 340 39 251 -22 -22 210 161 219 -7 160 -31
4989 -31 41 88 -100 -179 -87 67 0 -70 -158 125 -228 31 -238 -50 126 -12 180 -65 78 -195 173 -173 37
5012 37 -240 44 101 483 110 127 146 -174 -74 -107 -196 -242 108 455 187 329 147 125 -150 -121 -117 115 -81 -137
5036 -137 246 314 49 31 110 -160 -207 -217 -308 24 -169 -57 -7 64 -104 -27 240 -35 -129 44 75 -63 -104 -69
5060 -69 224 47 -194 126 -230 138 19 -193 -103 -304 6 -121 -159 33 -260 48 5 141 29 -173 -197 -351
5082 -351 -97 -411 -153 127 -66 139 116 221 -24 92 -115 -569 -476 -193 -265 -102 1 589 239 202 236 -151
5104 -151 -95 -302 -448 -111 -29 73 217 367 302 260 -129 -65 -290 -59 -328 -174 145 20 109 192 228 256 132
5127 132 -324 -244 -165 -96 48 42 -188 -167 310 58 -221 65 -178 166 -41 173 114 83 32 30 97 83 156 -24 34
5152C4j95J58j38K17k76J38L1k3N6Q1r0L6j53Q4q7j17K27j8n7J82K13j20M1l25
5176a01j90j9J77K6o0J95k60L44k3o9o8M15m34j69L48l78J76J14j7M02k45k8j44
5199hP2m3p2L0J14j01R3P1k13jK23k87J44l9m6j23K13n7L3R0j97RK50j25k22M4
5225a48J03J42p8J71k59J13n1j93N5J61L0L0jK6n8l30L46j98J15K86k33J78k17
5248a0r5L69l39k97L77m5J94o0o3j22j03J31R9n8j37L31l09J73j24l1M37m37L08
5271A89j18l79M07k41M8Q1j87Q1L56j43j83q1J52j30P3j28K55j70J78q6j89Q9
5293a26r9J47K44j35j64K45j33K64l63M5K01j27k08J36J72%mr7K8K3q8O7J33k58
5317i7N7J23P2O4j60q3Q9l36J05K06M2pQ4l70M14k64L68L8n86K35k62K87N6j00
$$ plain form
5152 34 -161 -3 -141 76 -200 -62 -31 -54 2 83 -7 29 -124 -40 -127 -244 -17 -35 -92 90 303 183 224 -101
5176 -101 -291 -310 -133 -107 -167 28 -232 112 89 20 -48 367 -67 -236 112 -266 -90 24 7 409 164 136 -8
5199 -8 64 21 -51 -21 93 -8 85 156 -57 -58 165 -122 22 -17 -63 -186 27 -30 3 93 -104 -95 155 30 -192 -148
5225 -148 -45 97 19 190 -69 44 -7 -200 -145 16 46 76 75 101 43 -287 59 -139 -24 262 29 207 -10
5248 -10 -105 264 -75 -372 5 -40 154 94 31 -91 -194 -63 36 -22 -159 172 -137 36 -88 -119 318 -119 189
5271 189 71 -308 99 -142 -94 -13 -200 -119 237 94 -89 -170 -18 -148 -75 -203 52 -118 60 -26 -215 -126
5293 -126 -225 -78 166 31 -133 112 -21 243 -120 -75 126 -1 -209 -73 99 99 95 -2 26 49 -39 28 161 -97
5317 -97 -40 83 155 219 59 -24 65 -271 -166 40 82 75 159 -211 203 -61 307 345 -241 -6 -268 19 75 -25
5341b5j70L25k02J52R0m74L22j11J62k78n8K91r6j19L35o7J3j19PJ03l60J87o3
5364a55L33l19J40l4J10m4J57k9k07M5J18k68KP7J84q9J08M8k93M15j87r3p3J73
5388A19m54L10KJ23k74j12K16J4P7J64m2M3j24j45j43J93J16jk56J44J38n7l6
5411A5L7o3j32K3j94M75k30m4J51J17Rl33J20j10j69J95J25q0K57k8j72l4L35
5434B70l67L9l6q5L55j37L00j27L4k14R6k74K98J8l08J02l5L9L43j99M3l08q2
5457b35L19q7l4L1O8r1p1K18Qj61P7j42L82k64J04m1k62J52j57J85O2k14j5N09
5481C41k22k19N8o9j9J79O0j87J11j48M22k5j69k3j25lj39j03K89P5r4K71n8j02
5505A01j51J20k69n8L01k55K05J08M4r4Pm3ok7k88J47O9j64J13K17M3p0j04O5
$$ plain form
5341 -25 -195 130 -72 80 170 -304 18 -93 69 -209 -267 24 -72 -191 144 77 90 -29 -22 81 -279 -92 -155
5364 -155 178 -141 -1 -35 75 31 188 159 -48 -3 115 -153 -151 -74 110 21 129 177 -116 299 112 19 -54 119
5388 119 -335 -25 -23 100 -174 -286 -70 -56 21 185 143 186 62 -83 -226 -33 83 82 -174 -30 108 51 15
5411 15 52 -11 -143 -120 -314 161 -69 -113 38 155 164 -169 -49 -159 -328 -133 -8 -88 169 141 -31 -65 270
5434 270 -97 -58 -94 -179 176 39 339 212 246 32 128 -146 152 170 -138 -36 -71 -32 311 112 155 -153 -235
5457 -235 84 -3 -37 -6 62 -29 -100 118 126 -35 42 -100 282 18 122 81 -181 -29 -186 -1 61 -153 -168 341
5481 341 119 -100 -42 -111 -130 49 109 -78 33 -115 307 282 113 90 -35 -38 -177 -280 9 84 -10 261 203 101
5505 101 -50 70 -199 -257 44 -211 -6 102 146 52 59 16 10 -17 -305 -158 -89 -253 -140 77 120 50 -54 11
5529A1j61J90j43Q3J09j85L14k24j13J85k17L44l04j88K04j44M38k75J49r2m4
5550f3r3L33j47J03k47%j5M3N5R6j34J21K7J30r6l4l5J46n8j99j25J11j60L60
5574A19q0j70M14m60L68j29j76j60J28J11O5j11j52K82N8j29J46k79M1m1J14J91
5596A50j44o5K98k67K78l42L01l69L07j42k24L20k16J78k71J88Pj02j70K7L9J94
5618b5r2J07P7J08j92k6j09P5K58k83J84k0j34J78P3k33J15k89K35J75j07j63
5640h8K7K26j04k14K40Rj15L1o2J0m5Q6J33j19R1k44K75p3o9p7J69r4N3n4J88
5665A80j01l46K35J9Pj43L75k1n1j4j0k5k91J20J83k34J83j43k05N11n4j80K23
5688B18M2o8j64L5n6J37J54n26K98m5K46j98j97j1R5j2Q4O0j03K58j61m7j15p2
$$ plain form
5529 11 -150 40 -103 -20 89 -96 218 -6 -119 66 -151 193 -111 -299 -95 -239 199 -76 73 -19 -63
5550 -63 -156 177 30 133 -114 -114 -129 -86 -31 65 -69 52 79 209 113 79 44 190 132 -67 -192 -81 -241 119
5574 119 39 -131 283 -177 191 62 -114 -274 -146 -35 30 -81 -233 49 107 -22 124 -155 -114 -155 -41 150
5596 150 6 -59 239 -28 250 -92 209 -160 147 5 -219 101 -115 63 -208 -20 -13 -115 -285 -258 -219 -25
5618 -25 -117 -10 67 175 -17 -43 -152 -77 181 -102 82 62 -72 106 179 -54 61 -228 7 182 75 -88
5640 -88 -61 165 61 -153 87 96 -19 12 -50 -40 -85 1 134 15 106 -138 137 64 -5 -82 87 -7 46 -8 180
5665 180 79 -267 -32 -13 -6 -149 226 205 154 140 130 105 -186 -66 117 -117 66 -77 -282 229 175 -5 218
5688 218 260 192 28 63 7 144 298 -228 70 25 271 73 -124 -135 -40 -52 32 92 -11 247 86 39 -76 -148
5712a48L11q8qk54R2kK97q6j46j68J46j63R2J06K50l25q0J81P3pm5k7q6J60j81
5737a06p1J79J05MJ34l40L23j76j42O0k3K8K3M6o7OK40l24J20l69J92L82k04J06
5761A26j78o6J70l2k93J70j16J30m4R7J06J64j49R9j08j81j49M83k15L8k12L29
5783A69j03q2K40j75oo6N2j06K73m66L02P7mJ17j72J50j04Jq7P5k48n4J36m9K05
5808G5j88Q4J54j55k6P8jK2Q7j08rL2o5o0M2J36j9L2l83L65o2j88k32L55jK34
5834A99k05J51k10L04p8m45J44K5j7J28P0J60J20k32J92m07QP0n3J84j99K23K8
5857A60J60m12L80k9k48J02j57l70J94J16O8Q4J80n5k90K59l53M8K51k7j17q7
5879a43K94k74L52q0k48J75j8J58j04l63K85j30J65j93l5J37K28j11J47m26J00
$$ plain form
5712 -148 163 75 67 -187 -95 -97 200 114 -32 -200 -54 -217 -125 -19 231 -94 -174 7 80 73 28 1 -85 75 -106
5737 -106 -177 2 107 111 245 -95 228 52 -90 -30 -53 -25 -2 44 -23 -17 223 -101 19 -350 -158 224 20 126
5761 126 -52 -118 52 20 -273 -103 -219 -89 -133 -36 70 234 85 184 76 -105 -254 229 14 52 -160 169
5783 169 66 -16 224 49 43 -23 29 -77 196 -270 32 109 105 222 50 200 96 97 10 85 -163 -217 -81 -130 75
5808 75 -113 -29 125 -30 -56 22 21 43 130 22 13 45 -20 -80 -38 98 79 111 -272 93 31 -157 -389 -34 -35 199
5834 199 -6 145 -65 239 161 -284 -140 -115 -132 -4 66 226 346 114 306 -101 -93 -23 -76 108 -91 132 160
5857 160 320 -92 288 259 11 113 -44 -414 -220 -104 -36 48 228 173 -117 142 -211 -163 88 61 -56 -143
5879 -143 151 -123 229 149 -99 76 58 216 112 -251 34 -96 69 -124 -159 -22 206 95 242 -184 -84
5900h4K76k9k67L21j95k22K84m7R0k57l9j16K58j72L2J17J63j8Kr4O8J00j34k01
5924a64L3J2ML99k88K05P7j77L8o4J08k31L8k02Q2N7O7N4M6q4J06l09j66J79L32
5949A52k65m9K51n4p4K0j95L82k22rk35K76Q7j00j1L32k67k0o2K42o4M1J71m24
5973i7J09M9j33j06J83j6J89o2r3RJ48k26m2J01%j69Q9l9N61m29nK9j30k86L96
5998C0q1j32J30k71L09N2M9k15J21j5m08K41J58K5j29M8L64j56J06q7j90J96j76
6021c1L2P9L9j54J48M3K05m77JN3J4K07o2k40r9K94j05K20m32n3K93r6J97j55
6045g9m2k0k1K98j7j48j3O9o2j24O7M12l06l8K09j03k70J85K50l22j00N00l68
6068d3o8L8m3M1j85K98J14q6Q3j82j60K30q1l1j2j56K93N5k52J52k5r2L0j82K65
$$ plain form
5900 -84 192 163 -104 217 22 -200 84 37 127 -130 -169 -285 -27 -199 -167 -50 113 95 97 3 71 171 37 -164
5924 -164 -131 -119 -115 284 -4 201 278 101 139 75 183 -48 -10 -212 -130 -73 -6 48 94 10 116 -193 -359 -180 152
5949 152 -113 -162 89 35 -39 -19 -214 168 -54 -63 -298 -22 65 -35 -46 286 19 -1 -63 179 115 156 327 -97
5973 -97 12 61 -72 -178 5 -11 178 116 23 32 180 -46 -88 13 13 -156 -67 -106 455 26 21 50 -80 -366 30
5998 30 -51 -183 -53 -324 -15 37 86 -129 -8 -23 -431 -190 -32 -7 -136 -88 276 120 226 139 -51 145 -31
6021 -31 1 80 119 -35 113 156 361 -116 -115 -62 -48 159 97 -143 -242 52 -53 167 -265 -318 -25 -121 76 -79
6045 -79 -121 -141 -162 136 119 -29 -42 27 -35 -159 -92 320 14 -24 185 82 -188 -3 247 -75 -175 325 -43
6068 -43 -111 -73 -116 -75 -260 38 152 66 149 -33 -193 37 -44 -75 -87 -243 50 105 -147 5 -20 -112 -82 -264 1
6093Aq9L7J09j64k2k88M88J15k89j0k23M57o8j17L14m24K83k42L12k60j59J91
6115d8k72Q2K94j29Qj39O2O2M6l9k17J14M72m07q5N8k9M4J10J75k28k6L0Q5J23
6140A46k29N6J00k32K79r3j2j23J33r8L63m61R5K92L05k34j86J56l16J01o3Q5
6162F4r2r6OL54j97j12k52J82N6r9J62PJ62j35j07K85m67K06K20m01J97j37J17
6185g7N6M22l59K00k00J33m0K4k15J84j84j68R3j0K03l2l18K06%n7K02j85L29
6208B07k01Q8l8l25O7K7K78J56l31K81l42n2J99j88J87m6J13l72L56k19L49k36
6230d2L2l7M4l04K86l13N52O5k98L04p1m99L20r5J9q4K44Pj36L06j89J10j97j12
6254h8J65J32n25Q4P1Q7j97K55K64m44J32j55j5J11J15mp5J02M7J41k84j85L30
$$ plain form
6093 1 -88 -51 58 -106 -128 -416 72 187 -102 -112 -335 122 54 -63 251 -173 110 -132 180 -80 -239 -48
6115 -48 -320 -238 56 -73 -65 -204 -142 -80 -34 -73 -290 -176 296 -111 -196 -138 -167 -123 -13 162 -66 -92 -62 23 146
6140 146 -83 -27 73 -159 120 27 15 -108 25 -73 290 -171 -76 216 521 287 101 257 -59 42 -21 64
6162 64 -28 -124 -118 236 39 -73 -325 -143 -87 -186 -24 -17 145 10 -97 188 -279 -73 147 -254 -57 -194 -77
6185 -77 -21 401 42 242 42 175 135 159 -56 128 -56 -224 -131 -141 62 30 -288 -82 -82 -139 63 -122 207
6208 207 6 94 56 -269 -202 -175 103 259 -72 209 -133 -185 14 -174 13 -33 80 -292 64 -155 194 -42
6230 -42 -10 -47 -3 -307 -21 -334 218 283 -15 289 218 -281 39 -56 -37 -121 123 130 -6 300 111 221 24 -88
6254 -88 77 209 -316 -232 -161 -74 -271 -16 248 -196 -64 -219 -234 -123 -8 -12 -87 15 62 203 -81 -266 64
6277F4n5k19L04j33K27j69k61L51m0k06K4N9J33l5J25K2m11J31m9O6K65J5m49
6300b41L83k02J26J35k02k95K99k00P3O9QL44k03j26L0O7j45j06J65k77K70L36
6322C08r8k55M22n29J23k8j46K22j43J06K51k18K43l2k31o9O7o8mK1r3L22K0L0
6346B21J7l82M2k80K89J02k03lJ21L3R3k07K04M3k90J69J20k47K54m4j52L4j43
6369b09K7J67j50M0K70Q2k16k12J3L16l18Q1M37o33L29O0K0k0k47o1J33M4k14
6392b61O2R8j42L11M5m3j64j13J48j57J83l53L97J27j9j22J2J94k74N4q9j3J19
6415@K7N4j16P8J35k86L05k90Rj93K13K91l76K25j68K70j81j27J22J04L6K8q1
6438G9jp7J26j92J35l9J41j51OR3j91M6M1K2K04k13J44r6q7j20K27j72p3L29p7
$$ plain form
6277 64 9 -210 94 -39 188 19 -242 109 69 -137 -113 -54 79 44 169 191 -220 -89 -138 -72 193 208 -241
6300 -241 142 -60 66 201 -1 -296 3 -197 -124 -55 -47 297 94 -32 -2 65 -80 -186 -21 -298 -28 308
6322 308 210 -45 377 -152 -29 -57 -203 19 -124 -18 233 15 258 226 -5 -74 -7 -75 -79 -58 -151 171 191 221
6346 221 238 -144 -102 -382 -93 9 -194 -197 -76 -43 50 -157 47 90 -200 -31 89 -158 96 52 -100 -66 -209
6369 -209 -182 -15 -165 -125 145 227 11 -201 -188 128 -190 -109 328 -305 24 84 104 84 -163 -224 -91 -47 -261
6392 -261 -199 -101 -243 68 113 70 -94 -207 -59 -216 -33 -386 11 138 119 -3 9 203 -71 -17 -106 -119 0
6415 0 27 81 -35 43 178 -108 197 -93 -84 -277 -64 227 -149 76 -92 178 -3 -130 -8 96 132 160 79
6438 79 78 1 127 -65 70 31 172 21 27 120 -71 -25 16 38 242 29 173 77 -10 -130 97 -75 -148 181 104
6463A04j66J70j35L0j39P2l74O02l16N4J6PK80j16m1o5k39K79j11OJ63k31J68
6486A8k96M61l60J00J01j63J7L66j98j57K8m4L57o7j79j0L6J08k44K79j4o3m0
6509C6j16Q3K6j62P9J48J6K8k22K2q7L76j07J94m77J74k06O4K6J36l7j67L18l10
6533a65J49J98j68q4N9j36M11j47J31k66j02jP3r2J40P1N9l05L35j71j44L61m32
6556b26L39J33k9r9j76N4K50m10K4J02j22L65O7j88J44l99J8J58op2Mj74J65m7
6580a25J09Q1k81L90j90j66Q0q4J27o5L42L3j58l42J57J6r7K55r1J27k63J40k76
6603b81K55J06k50L30j90K04k51j7J46R6j71J25j61j26R3L7P3n1J19k12J72J43
6625A89l07j03J27J70k72M46l40M90l71j31R4k53J4K62l2k5J37O2j61J49N4k52
$$ plain form
6463 104 -62 108 -27 3 -136 -64 -438 164 -152 -98 -82 -75 205 89 48 -17 -256 23 -88 -82 81 -150 18
6486 18 -278 183 -177 -77 24 -139 -122 244 46 -111 -83 -127 230 163 -16 -26 10 118 -126 153 139 76 36
6509 36 -80 3 29 -133 -54 94 110 138 -84 -62 -149 227 120 314 -163 11 -195 -131 -105 31 -6 -173 145 -165
6533 -165 -16 182 14 -70 -11 -147 264 117 248 -18 -120 -121 -48 -140 0 71 130 -175 160 -11 -155 206 -226
6556 -226 113 246 217 118 -58 -4 246 -164 -140 -38 -160 205 272 84 228 -171 -153 5 -1 -73 -69 -243 -78 -125
6580 -125 -16 65 -216 174 -16 -182 -102 -186 -59 -124 218 251 93 -249 -92 -76 -173 82 -9 118 -145 -5 -281
6603 -281 -26 80 -170 160 -30 174 -77 -94 52 148 -23 102 -59 -185 -92 -55 18 -33 86 -126 46 189
6625 189 -118 -221 -94 76 -196 250 -90 400 29 -102 -8 -261 -247 15 -17 -42 95 157 -4 145 199 -53
6647e3j51K8K38L1l3j52N25n07K95j87k18L63k18l0j88L33k37J32Q0K12m46L99
6669B16j22j76j98M58%r7j93K57k88L78p1j75j41L9j14K96pp6Rj24J09K2J51m2
6693A11m7j70k23J88j4L8J39J3N6p3Q5j35J21j20j70K75j42J06o2j16J47NJ80
6716A92k30K03k48J1k31K96j88J55j16M78k2k47J35l10p3p4K56n7R3o1R9N8J44
6739B63n9k20j59q9L3K19k16R9R2k6J97N1k09Q2k03kJO5K69j90k7P8o7l1J34k0
6765F5k6K42m18J57Q6J01j09k20K33j21j45M85k23k05Q4q8J06j26p0J92j23J45
6787B2K3J68k17p4K88j58k74J03q7K83p9J98J39k6j49P4j66P9j39J46j16k4N0
6810F4n7K9j77L95q1m60J38l7L4o1R7K94N2j8j83r2q6q3P1l4J51p2J30Q7n8r0
$$ plain form
6647 -53 -204 -176 62 93 60 -92 433 -74 221 34 -184 179 -39 -69 -257 76 -161 -29 51 263 -183 216
6669 216 94 -82 -280 178 178 81 -112 145 -143 235 164 -11 -152 -113 -227 69 62 -14 -5 -129 -20 2 153 111
6693 111 64 -106 -329 -141 -155 -117 22 35 91 18 103 -32 89 -31 -201 74 -68 38 -24 -140 7 12 192
6716 192 -38 165 -83 -72 -303 -7 -195 -40 -156 322 300 53 188 -122 -195 -269 -13 -70 23 -38 61 119 263
6739 263 204 -16 -175 -264 -231 -12 -228 -129 -37 -63 134 185 -24 58 -145 -147 -146 -81 188 -2 -29 49 -18 -49 85 65
6765 65 39 281 -137 20 106 207 98 -122 111 -10 -155 330 107 -98 -14 -102 4 -122 -192 0 -123 22
6787 22 45 213 -4 -78 210 52 -222 -119 -206 77 -2 196 335 309 160 234 68 147 8 154 38 14 64
6810 64 7 36 -141 254 173 -287 -149 -186 -152 -213 -116 178 230 212 29 -63 -149 -232 -161 -195 -44 -116 14 101 43 -47
6836d7j27L9j94M73k23j7M02k57l60L09M15l24j83P1l76L09J28l5J59M5J7j36
6858H8k7m6J1R4l3N5j76m7N2l7j5Q3M1j88J91p5N2o5R2K9j40K9j66K18Q7k21L11
6885A97o4k29J41L13k16l6m27K42J30P1J42k59L16k20k57K06j0j51P2k13M41l94
6907b05P4o0J58L4J20q3l00K95K9J1k96M51M3l38J38o8J43q0j87K66k26K16k0
6930A15L2J82k54j69K37k89J01P7j3J69oj50nL1j52p4M06k51R8m4N3J44j92k02
6954a56J40k57K78l78M52K65k51K05Q5n31J52kl77L72j0LJ98k13j82L47rq8M1
6977H4j6l38K20o4r3K73p1K39o0J20l91NK00j43M7j83J33RJ06j1k1j02j78l2K93
7002B6j35K7J20k43M42j98K4L0j09N8J23k30J36k76L59p6q7m8n5J92P7L45l89
$$ plain form
6836 -47 -174 -135 -329 144 -79 -96 306 49 -311 -2 413 89 -94 -23 -399 -90 38 3 162 207 224 88
6858 88 61 15 26 120 87 142 -34 -81 -29 -66 -81 2 43 -145 46 -29 23 -42 50 79 -61 -32 -198 20 107 -114 197
6885 197 133 -96 45 358 142 106 -321 -79 51 122 264 5 321 101 -156 50 40 -111 -39 -252 189 -205
6907 -205 -131 -191 -33 1 121 38 -262 33 62 73 -223 228 271 -67 71 3 146 66 -121 145 -81 135 115
6930 115 147 329 75 -94 143 -146 -45 32 19 188 182 32 27 58 -94 -168 238 -13 85 41 94 238 46 -156
6954 -156 -16 -273 5 -373 79 344 93 298 383 -148 4 2 -375 -3 -13 -10 188 -25 -207 140 131 43 84
6977 84 68 -270 -50 -114 -207 66 -5 234 174 294 -97 -92 108 -35 12 -171 -38 -29 77 66 45 -57 -235 -267 26
7002 26 -109 -82 38 -205 237 39 63 93 -16 42 165 -65 71 -205 154 78 -9 -57 -112 80 157 502 113
7025A13l27K37mK3j43J41j1K2j03P3N2J44k7o3k29J37k57K18PJ5J87%n1j45J31
7050A40m85J80j49M20q9P8qL8P8l29K26k47J86j27O9L0J42L7k68K57k57N2r8K0
7074a04N4R1k51M70j29j46K5Q7r0j14J69j87L0M6OK6K80j74r1K07j53m1l2j28
7098a49L14m6j34Or2j07K94J00l01J21r1k3R7M9j01NK47l02Q9J87k22K2L8K7l11
7123b83L82j19r2jK68n5J3Kr1p3Q4p3j17P7J3N4k14L45j17J71qj71K80k54J09
7148A30j09k1r0N1J37j39J09Lj09j39J5j8Q5J71o7j57K50r2J34J21o49M24j37
7171i7j99K08p2K44J48k63R6L2O5k46Q1oQ1l8K9r8R4j20J50No7L14P3k56j50r9
7197i1Q6J45l9k11L05j06j27K8J68j67oK15m46N3K13j01K76J9j43K25l31j41K63
$$ plain form
7025 113 -214 23 19 42 -101 40 29 51 -52 21 73 217 190 127 -102 35 -222 -4 3 18 205 205 154 9 140
7050 140 -345 -165 -314 106 17 95 87 125 203 -126 100 -147 39 -88 -19 11 153 190 -78 179 -78 -26 -124 -104
7074 -104 -50 41 -210 260 131 -15 10 97 7 -107 62 -125 -95 -49 -43 -17 263 89 -2 205 52 11 -21 -149
7098 -149 165 119 -15 -9 -101 -208 86 186 -115 6 -85 -108 -11 38 -63 -58 189 -113 -24 163 -59 -37 1 28 -283
7123 -283 99 -20 -112 -113 155 100 113 115 24 -49 35 -38 -155 -78 -65 -11 -225 120 3 174 166 -5 275 21 130
7148 130 21 0 -90 -39 98 -41 68 71 -38 -177 -162 -180 -95 76 9 -148 102 10 144 265 -384 40 -97
7171 -97 -296 -88 -160 84 232 -31 65 97 162 -84 -3 -9 72 34 63 -35 59 -61 89 94 27 341 414 158 8 -91
7197 -91 -5 140 101 -110 195 89 -38 -10 158 -9 -15 200 -246 -193 20 -81 195 214 71 296 -35 -176 87
7220H7K2k01M9PM8M8j21J63ml28L49j85J43n7J10J6m5J48j05n4o5l9O9J42l40
7245a43P2K58J73p0q1l5k08K62l91K31Lk85K32l7O0l94L93r3K6j5K10j21K31k2
7269B56n56J88n8L17j75J23q6P4n9j45K40k56J80kp3J65o5k06M13m81K65j34r3
7292a68L68N1m15J52pJ00r6K4N2j76J27j07K7r6J90J88j38p6k83K46N9j65J45
7315BJ95n0j50O0k63K21j6M8j13J54j3j48r6K66o8q3J32J21m42O8J81o6R2L22
7339C54l67k40L04q1J8N7k94L06J68j97j55K53l43L54k20J80K3k74J27l25M07
7360E5j25P9l8R7j74K5J27n7K02k86J33j5k35J50K12n4l06K98l24J50J3R2k23
7383b04L48k29J55j0q5M9K07m01J29m8K7k1J18Q6r9K0P5l6J53l21K74k70R9L3
$$ plain form
7220 87 109 -92 -43 -36 12 60 -61 102 98 -230 119 -66 77 20 130 146 101 249 144 90 25 -14 55 197 -143
7245 -143 -71 187 360 290 209 174 -34 228 -163 68 71 -214 18 -19 41 -353 40 -53 -27 -42 168 47 278 256
7269 256 -300 -112 -170 147 -28 95 9 83 24 -121 119 -137 43 41 -32 133 68 -138 275 -206 59 -75 -168
7292 -168 200 251 -164 -12 -19 81 -15 9 61 -115 12 -95 -68 -164 26 214 76 0 -283 -37 22 -143 2
7315 2 197 147 -3 57 -206 15 -1 47 -66 88 75 -73 -169 97 29 -54 78 199 -243 -175 6 -60 32 354
7339 354 -13 -253 51 -30 -12 45 -249 57 225 28 -127 126 -217 137 -83 97 120 -154 -27 -352 55
7360 55 -70 9 -29 68 -106 -81 46 -11 191 -95 38 23 -212 -62 150 96 -210 88 -236 -86 -73 19 -204
7383 -204 144 -85 70 60 -25 24 231 -170 -41 -89 -62 -83 35 121 22 42 117 81 234 -87 187 -83 16 49
7407D9j52mJ37J6k74N5L01k03K06j12k59L66k19K36l61K82K8j98Q9j33J5R4R4
7430E3j48L31m75J85J11M5j19K19j96J42j31M5M0L6j13l3k44L14j7R0Rl6k55K42
7454I5m4l38L01l4l5K41L1K4m6n8j85p1q2J53K1K62Rl12N17m50O2p5j42R9P3J17
7480A33j97Q9j47K58J22l85K49k4j54K19j88j02j9K67L98o00M86k70k8O1l48L28
7502A48l30K47o8k01NK17j49K79k28N3j67K90J35m0l31K07m0n1J48O0r0J12j15
7525I1j46j38j1K98k24J92j11N5P3K62l14k6j89K56k08J64k38J45Q0K16l8o5j72
7548d8j46K02M4l13M32k86q8J50Q5K08j74j27qj07k04M48k50K55J14p2Kj84K94
7571B27k72j7M7J73n2l6j30K01o3J68k82O9j39K33k55J20j10K49m3j77Q9p8j84
$$ plain form
7407 49 -103 -107 30 46 -228 -173 128 -75 131 19 -240 126 -93 143 -218 64 92 -106 -17 -150 -135 -41 53
7430 53 -95 236 -239 -54 57 102 -17 202 6 148 17 62 102 138 25 -8 -252 62 45 135 144 108 -147 95
7454 95 51 -287 14 -20 -55 186 217 241 195 137 -48 -119 -201 -48 -27 235 244 -68 449 -1 61 -14 -156 -57 16 133
7480 133 -64 25 -122 136 258 -127 122 98 -56 163 -25 -127 -146 121 519 -81 405 135 107 168 -180 148
7502 148 -182 65 -3 -204 -199 18 -131 148 -80 -27 -194 96 231 191 -140 67 27 -24 124 184 94 206 91
7525 91 -55 -193 -204 94 -130 62 -49 6 79 341 27 1 -188 68 -140 24 -214 -69 11 227 189 124 -48
7548 -48 -194 8 52 -261 171 -115 -203 -53 32 240 66 -61 -69 -176 -380 68 -182 73 187 115 117 -67 227
7571 227 -45 -62 -15 158 106 70 -60 141 78 246 -36 33 -106 127 -128 -8 -118 131 88 -89 0 -78 -262
7594b62K61K1R7j50J43j87J83k25K39p8j60J42L45k49M6l43J84MK8j88M7L76l82
7617a08K01k33O6J64M0l86K87p9k16J98l1J95q3J08K5l91K50p3J75j93J20J59
7639A95j95J09N9m9k94J35q1K16q3L4k58J61m7O7P0%j08J62j41%O7J68j21j74
7663a08L9q1L49l84K44r4M6P6Qj55k7J94m6J17r7j61J97N2j28j12K28j11k89L01
7687E8n4k92L58q3o4K08j85q3J11O2J10p3l24K17p0J50r5K16j74p1K62j69k7j15
7711a27J36J03q3r0J73Q6j38r6Jj32k02M37j70K73j79r0L06J1l74L08Q2k68K56
7734B23k52K58k82j63J21P1J56k36K6O6k84K51K1Q4N3j71l8K9J31K3l6l9j28r8
7758b14J21J1J62k01j38L97k08N5j16L56k66L13k59m3r0J67k18J30j21M02J25
$$ plain form
7594 -262 -1 20 117 -33 110 -77 106 -119 120 42 -118 24 369 120 166 -177 7 11 39 -149 -102 274 -108
7617 -108 93 -140 -74 90 130 -256 31 -48 -264 -66 -97 98 15 123 148 -243 7 -66 109 -84 36 195
7639 195 0 109 168 119 -175 -40 -121 95 12 46 -212 -51 -98 -31 39 39 -69 93 -48 -48 19 187 66 -108
7663 -108 -69 -150 199 -185 59 -35 11 87 95 -60 -87 107 61 178 81 -80 117 169 41 -71 157 46 -243 58
7687 58 4 -288 70 -13 -77 131 -54 -137 -26 36 146 73 -251 -34 -104 46 -49 167 -7 -78 184 15 -12 -127
7711 -127 9 112 29 -61 112 198 60 -36 -35 -167 -369 68 -102 171 -8 -98 208 219 -155 153 235 -33 223
7734 223 -29 229 -53 -216 -95 -24 132 -104 -78 -12 -296 -45 -24 60 113 -58 -96 -67 64 87 51 12 -116 -214
7758 -214 -93 -82 80 -121 -259 138 -70 -15 -131 225 -41 272 13 -30 -120 47 -171 -41 -162 240 365
7779C65q7l48ML9r0J57q9j8Q5j67R4O9J05P8K3k94J36p5j39K23k2k8%L8K5J8K
7806A04j01Q2j58r5K2p3R2J70J97j34k56K37O2K6k97J85l35K39P8k80O5K95j56
7829c1J2O7n6ML8J20l13L2L62k95J43J34k61R9p2M2j17J38q4k44M03N6j76l0k7
7854e6L8m9L11j30j67K5j44K9J02K32o9J4k7O2k02p2J88k83K49k28N3K53k6R4
7878A97j32k22K2M8L7j74K51j28j81M63k83p4K08N5J09k44r8NJ00k2J08N1k94
7901a98K59J9k35J31q3J86l37K58q7l3L9K85j34R6j49j35nj17J11M3O9L2j15J35
7925C5j29R6K35j78j5j09N6L3K12l24L5J64M8j54k13M47k77rj03K88k15J54Q9
7948A66j23J69j90J70k75J35p7j8j13K28O8K8O8k9j40k77L0M4J46P7k01j1J53
$$ plain form
7779 365 278 -70 -66 -27 -117 40 -49 -67 18 -149 -55 14 119 197 220 -74 62 -13 -152 71 49 21 21 59 84 102 104
7806 104 3 85 -73 -168 -146 -219 -127 43 240 106 -150 87 149 175 -122 63 -272 -33 45 -235 -170 125 -31
7829 -31 -19 48 -8 -4 34 154 -159 -127 235 -60 83 217 -44 55 -17 25 -92 46 -38 -282 121 177 1 -29 -56
7854 -56 -18 -67 244 114 -53 -28 -172 -143 -41 191 122 136 109 171 -31 -103 85 -198 51 -177 -124 129 103 197
7878 197 65 -157 -135 -87 -50 -224 27 -101 -282 181 -102 -176 32 87 196 -48 -146 -141 -41 -63 45 96 -198
7901 -198 61 80 -155 -24 -107 79 -258 0 -87 -120 -81 204 70 166 17 -118 -123 -240 -129 -86 -17 15 -100 35
7925 35 -94 2 237 59 44 -65 -9 24 236 -88 -53 111 159 5 -208 239 -38 -47 -150 138 -77 77 166
7948 166 43 212 22 192 -83 52 -25 -43 -156 72 140 168 236 207 67 -210 -180 -136 10 87 -114 -125 28
7971B8K1K30k62j35j0N7M1j69J59J3j5J28j88M1R7Jk80J92K5M2J60m6l74J26R6
7996b2n1K5J72k5j34j5L49l94J69p3J31j85k4K88j56J08k46R7q4Lp2N8J28J94
8020B41r0J11k63J23q0P2m3j08k79K66o9K92j96J21r7J36k64o3J77J41j57J24
8042I5R8k35L53k44l19K62k09J00L51k93K63k44M0Q6Q1j90r8L8J94k44K27k10
8064i8O7P0l07K12l7J29k3j49n9O5O1L0k84J89K32P2j26l5rJ57j03J03k34L39
8088B62j6P5k43j91Q3m1K7j63L25j32L22n08J15O1j57K37k20J14o2L45j89r6K05
8111A53j59p5J76P5l15k48K98J17P8p2J9J13j36j18P0k1j1n9R1LK5k15K01J56
8135A46k38K25l43J52R0j75J48J65N6jk02R1j54R9K63n27Q8o9K49oj01K64l08
$$ plain form
7971 28 49 279 17 -118 -128 -71 -30 -199 -40 -27 -42 86 -102 -61 36 37 -243 -51 -26 16 176 130 -244 -118 -22
7996 -22 -73 -48 124 99 -35 -50 299 -95 74 1 132 -53 -77 211 55 163 -83 14 -70 -67 -139 -81 47 241
8020 241 151 262 -1 122 42 114 71 -37 -316 -50 -119 173 -23 98 1 137 -127 -190 -13 128 -29 95
8042 95 193 -42 311 67 -252 10 -199 -99 252 -41 222 -22 18 104 185 -5 -103 -65 129 -115 112 -98
8064 -98 -31 39 -268 -56 -93 36 13 -136 -195 -130 -69 -39 -323 -134 98 170 44 9 0 157 54 157 -77 262
8088 262 246 321 78 -113 -30 -71 -44 -207 118 -14 308 -200 -85 -24 -181 56 -164 -50 -112 233 44 -52 153
8111 153 -6 -81 95 170 -145 -393 -95 22 100 28 47 160 24 -94 -24 -45 -56 -115 -24 -21 4 -211 -10 146
8135 146 -92 133 -210 -58 32 -143 5 170 226 225 23 114 -40 59 322 -205 -117 -186 63 57 -44 220 -88
8158h8K07j54j43R7K2k04J48M5K08jPm6j34J6j08J77l23M0L33j70P0n8k8K0J84
8183A17j07k0J63K7k26O7l07O2
$$ plain form
8158 -88 119 -35 -178 -81 -59 -263 -115 -70 138 137 144 98 -36 -20 -128 49 -274 -234 99 -71 -1 -59 -87 -67 117
8183 117 10 -10 153 180 -46 21 -286 -224
8191b24
$$ Imaginary data points
##PAGE= N=2
##DATA TABLE= (X++(I..I)), XYDATA
0@%%%%%%%%%%%%%%%%Pj5J6j6J6j6J9k7L2l3M1m8N6o6P4q6R6j08J24j40J57j77
38i4J99k23K47k73L04l36L74m13M54n02N54o12O73p42Q18r02R96j099J218j355
58g14J513j697J916k183K514k938L503m302N527p660J2447m4201K7859J12812
72A04396N0563J5774m0778o8211q8453o9789l9642Q733M4994P3202O7491M8603
84A06883J4398k4521n6130o2919n5524k7316L056L1946N0048N2392L8103J3000
96H3416j3422k7207l7583l4132j8973j965J1768K0299J7454J2091L853l649q231
109C719p002K055N688N264N635M0p293j0888j2443o694M780J3542J8499J6468
123C1370J0572l648k2132l0858l1044k3536m419J5776L4206M5539M0230K2202
$$ plain form
0 0 0 0 0 0 0 0 0 0 0 0 0 0 0 0 0 0 7 -8 8 -8 8 -8 11 -16 16 -17 24 -24 32 -34 40 -46 50 -58 66 -74 83 -94
38 -94 105 -118 129 -144 160 -176 198 -215 239 -263 291 -321 352 -390 428 -474 522 -577 641 -714
58 -714 799 -898 1018 -1165 1349 -1589 1914 -2388 3139 -4521 7926 -36275 -8416 104396
72 104396 154959 170733 129955 61744 -26709 -96498 -136140 -127407 -82413 -9211 58280 106883
84 106883 121281 96760 40630 -22289 -77813 -105129 -102073 -70127 -20079 32313 70416 83416
96 83416 69994 42787 5204 -28928 -47901 -49866 -38098 -17799 -345 11746 15599 11950 3719
109 3719 -3283 -1228 4460 9724 15359 15399 8106 -2782 -15225 -21919 -17139 -3597 14902 31370
123 31370 41942 38294 16162 -14696 -45740 -69276 -73695 -57919 -23713 21826 62056 84258
135H4258j953k5303m2739n0128l8498j3307J2588L7382N0110M6874L0565K684
147I2533k8055m7188n2885m1561j9615R876L8577N1518N0362L4042O171j9821
159G3954m0850n1335m2760k2672K571K4508L7764M1757L0023J0562r563k6269
171B7690l1637k6625j6951R75J7580K5048K5647J7772O408o677j8097k1240j8847
184a8954j0964k7O181J0674J3239Q827K142k316m679l850l587Q6K337K919L054
199E082k128m817k579l352p43L661O691P465M462K01m436q847q920q108l483N678
215a4173J0987J2539J2436O934q50r746j6193j7185j4043n320L481J1043J7491
228b599J8083R820K491o051j3748j5415j3856n940L505J1036J6252J4273J0644
$$ plain form
135 84258 82305 57002 14263 -35865 -74363 -87670 -75082 -37700 12410 59284 89849 92533
147 92533 64478 17290 -35595 -77156 -96771 -86895 -48318 3200 53562 87604 93775 73954
159 73954 33104 -18231 -60991 -83663 -81092 -56584 -18820 22937 52960 63522 53959 27690
171 27690 -3947 -30572 -47523 -46548 -28968 -3920 21727 39499 45907 39230 21133 -107 -18954
184 -18954 -29918 -29945 -23764 -13090 149 8976 11118 8802 4123 273 -3314 -3228 -891 2028 5082
199 5082 2954 -1863 -4442 -7794 -8537 -4876 1815 9280 13742 13943 9507 660 -8260 -16368 -19851 -14173
215 -14173 -3186 9353 21789 28723 27873 18127 1934 -15251 -29294 -34614 -31133 -20090 -2599
228 -2599 15484 25304 27795 21744 7996 -7419 -21275 -27215 -23710 -12674 3578 17851 28495
241B8495L473q093j3317j5048j3863p609N8P388J2739J3593R668L209k796p368
255A0529j1643j0559n465q58N102P881Q644P710K973k261o274q005o472n197j344
270a5239N385O935Q309P375L244j8l915p159p899n484k313J079L244O579N991
285F114K933L35m210o011o379n709l174K233O016P823P512O267K807l314n765
300G478q025q100m207m11L187P816Q315O557K612j366m931q619q030n757j521
315a5002M221O570P402P699L572j979n311p669p080o149k010L140M909P078O408
330E799K583J076k025m166l765k500O2J251K249K562J206k14q05k980j202M19
346d50k19J287R16k76k382l119l159k152M69M018N393O746N842J104l327p055
$$ plain form
241 28495 31968 23875 10558 -4490 -18353 -25962 -25904 -18516 -5777 7816 17484 20693 17897 10529
255 10529 -1114 -11673 -17138 -17996 -12894 -5013 3631 11341 14314 12053 5779 -2226 -8698 -13895 -15239
270 -15239 -9854 -2919 5390 12765 16009 15991 12076 4917 -2982 -8466 -10779 -9700 -6456 123 6114
285 6114 9047 9382 5172 -839 -7218 -12927 -16101 -13868 -7852 -29 7483 13750 16557 13243 7478
300 7478 -547 -8647 -12854 -13265 -10078 -2262 6053 12610 15222 13856 8925 306 -7724 -13481 -15002
315 -15002 -10781 -4211 3191 10890 14462 12483 7172 -497 -7577 -13726 -15736 -12596 -7687 -609 5799
330 5799 8382 9458 7433 3267 -498 -2998 -2936 -1685 564 3126 4332 4118 3313 333 -869 -450
346 -450 -669 618 1534 1258 -1124 -4243 -7402 -9554 -9085 -5067 326 7072 12914 14018 10691 3636
362C636r730q547n006Q62Q149J1649J3261R184K821m101j2465j5833j3673q308
376b8101M61R870J6009J7992J3525M702n917j5986j9229j9358j2775l36J0623
389b8520J8261K1910J7509Q719k814j4235k0105k0439j3037k843P710J7407K0860
402A0383J6887Q807k125j2135j7430j8322j3050l852N548J2916J4957J3619P710
415B3913j340p586j1723j1976p807k518L255P712Q544O748K649o73l078n349l550
430b779j287R47L020K292J015r35k712k242j495J118M573N185M314K559l593p261
446B719r417j0188n404J014P521J2317J3748J1091L425n323j2511j6726j5803
459b3537q487N26J0917J8602J9498J5307O125n672j5461k2064j9848j2945k011
$$ plain form
362 3636 -6094 -14641 -19647 -18785 -10636 1013 14274 23458 26279 22178 9713 -6120 -19793 -28101
376 -28101 -27640 -17770 -1761 16231 29756 34458 28541 12555 -6674 -26032 -38807 -39143 -28520
389 -28520 -10259 11651 29160 37879 35065 20830 725 -19714 -32751 -35594 -27884 -10477 10383
402 10383 27270 36077 33952 21817 4387 -13935 -26985 -30837 -25289 -12373 2584 16203 23913
415 23913 22573 14987 3264 -8712 -16519 -19037 -15782 -8070 474 7222 9871 9198 6120 771 -2779
430 -2779 -4066 -3119 -99 2193 3208 2273 -439 -2681 -4176 -3058 1515 6700 11014 13573 9980 2719
446 2719 -6698 -16886 -22290 -21276 -13755 -1438 12310 23401 26826 21503 8992 -7734 -23537
459 -23537 -32024 -31498 -20581 -1979 17519 32826 38951 33279 17818 -4246 -24094 -37039 -39050
472c9050J1181J9197K2177J9205Q221m128j5078k1920k1282j5254l846Q535J7158
485a4884K1211J7880R537j210j1153j7919j7350j2431m047N813J2912J6499J3364
498A8222P551j96q128j1387j2061r112k778L383O650Q625O529L500m37m384m848
513A129m730k567K93J364K555J690k65r02j787m95J321K857M626L595J415j018
529I081n669p183o242m556P09N910R238J0391Q141K613m521j0517j2784j2738
543a8127p828P44P091J3493J5155J1525N150l543j1611j5196j5112r605j463P283
557b2044J4824J6614J3317P521j896j0244j5152j5471j0850l401N282J1675J4333
570D508J2938O920j036p501j2000j3131r065l530K867Q146J0642R875N064Q08
$$ plain form
472 -39050 -27869 -8672 13505 32710 40931 36803 21725 -195 -21477 -36731 -40577 -32042 -14884
485 -14884 6327 24207 33744 32534 21381 3462 -13888 -26319 -30366 -24553 -11641 4858 18222
498 18222 25773 25577 17449 6062 -5999 -15111 -17889 -14506 -7856 769 7298 10798 10361 5977 1129
513 1129 -3601 -6168 -5875 -4511 -1956 -266 -531 -1433 -3220 -3715 -2394 463 5089 8684 10099 9081
529 9081 3412 -3771 -10013 -14569 -13860 -7950 1288 11679 19820 22433 17912 7395 -5389 -18127
543 -18127 -25955 -25211 -18120 -4627 10528 22053 27203 23660 12049 -3147 -18259 -27864 -29327 -22044
557 -22044 -7220 9394 22711 30232 28336 18092 2940 -12531 -23381 -26782 -21500 -9825 4508
570 4508 17446 24366 23330 15829 3829 -9302 -18367 -21897 -19030 -10884 -242 9633 14697 15505
584A5505m559p608q024n708k413K128M889N625N916K928M19j972l264l317k690
599b145p72P09N46J693N16n84k92o67k79J149J133J290M37q34k025l263l085j239
617g712L52K732M751M896L953J361j653m017o291n031l537j31L756N182O948N949
633A1508J785j781m913p003o816m836j049K788N665P155N307K900k25m319o131
648C5n926m707j491K185M909O181N281L818K12k897m154n089m606q63J202K322
664c588M376L753K495L02j939l244l880l023j519k30K159K835K474K338O60r71
680B998j447k554j817j400K35J617J180K414K026O01L2j022k099j008j619k17
696b080O38R17J681R12O69N4j119j562j455j931k26J61R64J577J172J364L34p87
$$ plain form
584 15505 10946 3338 -4686 -10394 -12807 -10679 -5790 -165 5751 8679 9098 7126 3862 545 -2145
599 -2145 -2917 -2208 -1662 31 547 -37 -329 -996 -1275 -126 1007 2297 2734 1900 -125 -3388 -6473 -7712
617 -7712 -7360 -4628 123 5019 8972 10333 8680 4663 -1628 -6659 -10196 -10327 -6571 -1389 5559 11508
633 11508 13293 11512 6599 -404 -7220 -12056 -13105 -10317 -4652 2503 7810 10710 10485 6166 35
648 35 -5891 -10598 -12089 -9904 -4995 1186 6467 10285 10497 7600 3446 -1643 -6249 -7112 -5910 -3588
664 -3588 788 4541 7036 7338 5399 2155 -1725 -4748 -6267 -6497 -4338 -1503 971 3309 3969 2998
680 2998 1551 -1003 -2820 -4220 -3985 -2368 -1188 1226 3252 3853 3885 2863 764 -244 -1863 -2080
696 -2080 -1442 -525 1156 2068 2737 2791 1672 110 -1345 -3276 -3502 -3341 -2377 -800 372 1736 2070 1283
714A283r86j496j177k17j88J557J762J395J607N84o71j365j908r05q56o93J140
731a134Q07J679J043j06m04j401j620r88o12r0N70Q59J159L60%J76k66n12N87
750A07j50M85M10p7j50m28o12J21Q9J035J311R80J149p66j732k087k847j726q06
769e694J170K715L075L115J780p97j903l978m825k925j304J819M103N697N011
784G059L366M07k837n692n953m774k903J925M710N917O617L885J053k956o031
799C793p272o209l311O10M028O084O811M975K090k069n224o367n801l334K44L140
815g812N705N956M434K097j062l775m590m565k627l10J557L087L674K698J052
830E519p61j565k838k337r60l42M00J015R80K48j54k49%Q34J088J241P69Oj143
$$ plain form
714 1283 297 -1199 -2376 -2593 -2781 -1224 538 1933 3540 4124 3453 2088 180 -725 -1581 -2274 -1134
731 -1134 -327 1352 2395 2289 1885 484 -1136 -2124 -2736 -2826 -2256 -1397 -238 122 122 298 32 -480 107
750 107 -43 442 852 775 625 197 -415 -294 -205 830 2141 3121 4270 3504 1772 -315 -3162 -4888 -5694
769 -5694 -4524 -1809 1266 4381 6161 5364 3461 -517 -5342 -8267 -9571 -7752 -3649 2048 7059
784 7059 10425 10832 7995 2303 -3650 -8424 -11327 -9402 -4692 1225 7842 11727 12780 9824 3793
799 3793 -3479 -9688 -12999 -12389 -8361 -2277 4534 9509 11599 9530 4306 -2061 -7862 -11196 -10952 -7812
815 -7812 -2107 3849 8283 10380 9318 5543 953 -3612 -6239 -6549 -4992 -1905 1769 4467 5519
830 5519 4758 3193 355 -1982 -2942 -3284 -2884 -1869 -889 -641 -795 -1044 -1044 -210 878 2119 2888 2894 1751
849A751k003k427k266n86J507L101M198L563K519J12l408n161n514n088j766J534
865i934M642O476O305M251N19l354o332q135o170l089P23N454Q197Q067N996J686
881A5302k810o372q228p298m359J25M718P370P717O226K017j896n516p731o742
896g477m229r28L250N129O817M770K265p73l780n279m543l408m59J980L624M054
912A013L054J913l40j658k113k426j360k99N38J097R97N12j16m23l60M39j76J307
930A599L16o5p19j861k395k045q62J081K459L273L434K597J0j689l784m335m007
947f993k095J669L318N114N722L521O55j881n200n945n782k887K87L405N754O232
963D894M135J784j758m751o220n795l138k25K968N345N626M799K326j249l540
$$ plain form
849 1751 -252 -2679 -4945 -5531 -4024 -923 3275 6838 9357 9469 6061 900 -4614 -9702 -11468 -9934
865 -9934 -5292 1184 7489 11740 12259 8905 2573 -5562 -11732 -14821 -14098 -8644 -447 7620 13616 15302
881 15302 12492 6120 -2108 -9406 -13765 -13640 -8922 -1552 6165 12391 14408 12512 6996 -735 -7477
896 -7477 -11706 -12634 -9384 -4255 2562 7332 9597 8824 5044 -235 -4778 -8186 -8645 -6665 -3041 1013
912 1013 4067 5980 5640 3982 1869 -557 -1917 -2216 -1678 -581 416 928 812 389 29 468 292 1599
930 1599 1915 1850 1131 -730 -3125 -5170 -6032 -4951 -2492 781 4215 6812 6822 5133 1349 -2986 -6993
947 -6993 -9088 -7419 -4101 1013 6735 10256 10911 9030 3830 -2115 -7897 -10784 -10497 -7092 -1338 4894
963 4894 9029 10813 9055 4304 -1916 -7711 -10849 -11074 -8106 -2761 2865 7664 9990 8741 5201
978E201m844m623l109p99K091M115M385L672J819n99k567l993l261k332j176J060
994d960K495K593K506P16o0j078k415j476j419m99R55J173J267J158K99k6l16
1011I13m05K43k69K68L30j64l4o83j137J59r0L43J137Q27O38R1r53r30k052j187
1031b955j032J97J561J319J894J720O92q10j443k056j440j315L51J456J722K045
1047A906J892M62m76j209k374j771j485N8P16J460J993J319K99j09j427j520j856
1064b122j356p1M75J415J881J339J119k6j132q72j525j158l24N20J388J448J269
1081B268Q43J03o92j413j323j602l78m07J207R91J646J059m7k58j197k069j405
1098b674q40k82J244J479K027J686Q82k84j361j767j618j530j15O97K029J932
$$ plain form
978 5201 357 -4266 -7375 -8174 -6083 -1968 2417 6089 7908 7309 4742 749 -2512 -4844 -6020 -4960
994 -4960 -2465 128 2634 3350 3290 2212 -203 -1679 -3098 -3597 -2642 -1469 -202 956 1255 1229 913
1011 913 508 751 482 750 1080 916 882 199 -938 -779 -869 -526 611 1438 2076 2167 1214 284 -1768 -2955
1031 -2955 -3987 -3790 -2229 -910 984 2704 3396 2586 1143 -913 -2353 -3668 -3317 -1861 -139 1906
1047 1906 3798 4260 3784 2575 201 -1570 -3055 -2997 -2281 -821 1172 2491 2790 2681 1254 -266 -2122
1064 -2122 -3478 -3549 -3074 -1659 222 1561 2680 2654 1522 650 -875 -2033 -2357 -1837 -449 999 2268
1081 2268 3111 3214 2522 1109 -214 -1816 -2194 -2601 -1394 -403 1243 2302 2255 1997 800 -1269 -2674
1098 -2674 -3514 -3796 -2552 -1073 954 2640 3522 3238 1877 110 -1508 -3038 -3153 -2456 -427 1505
1114A505J912P83K08j422k121k372j888n92M34J641K033J830J253L14j324j924
1130B70k420j540o62M41J552J998J958J765J11n27j536j817j017q95K44R37J240
1147A02J678M85r2Rj142j147m21o34L96k0K46K70m42l26n8P9L66J067M55M93l03
1168A061m36j478j224j130N3J068K105K294K075J088p61j787k744l584k067m71
1184e938J574K906L688L317J900o85k668m291m504l107j420J792L656M781M818
1199E819K489J42k230n014m505m055j777J353L690N412M935L195N08k546m355
1214C061n036m480k226Q05K540N022M115K739R69j675l454m288l326j591O4K151
1230d610L509K989K234O23o75j903k287j543r39l2J083J685N68J050k36n13l46
$$ plain form
1114 1505 3417 4200 4408 2986 865 -1507 -3395 -3987 -3553 -1912 121 1951 3204 3518 2194 270
1130 270 -2150 -3690 -4352 -3911 -2359 -361 1597 3362 3473 2946 1410 -407 -1424 -2319 -2075 -1138 102
1147 102 1780 2265 2173 2182 1040 -107 -528 -1162 -766 -786 -540 -270 -712 -1038 -1096 -1017 -651 416 871 1364 1061
1168 1061 625 -853 -2077 -3207 -3154 -2086 19 2313 4388 5476 4715 2928 184 -3400 -5467 -5938
1184 -5938 -4364 -1458 2230 5547 7447 6762 4094 -197 -4701 -7808 -9228 -7436 -3780 1001 5819
1199 5819 8308 8450 6220 1206 -3299 -7354 -9131 -7778 -4088 1324 6259 9454 9962 7416 3061
1214 3061 -1975 -6455 -8681 -7876 -5336 -314 3801 6540 7509 5834 2380 -1908 -5234 -6825 -6761 -4610
1230 -4610 -1101 1888 4122 4745 4070 2167 -120 -1663 -2602 -2634 -1551 134 702 1752 1516 1003 657
1247F57k09J13N75J96j66p37j318j456j373k79P58K020K588K376J535n89k136
1264B555k970l509k704p06J840L624M828L612K719k19k875m838n388m009j431
1279i471J312L994N570N244L555j47k711n453n863n121k441J175M213N559N618
1294E033M040Q48k209m190n738m561k167J50L372M593N093L551J255j416l879
1309C775m084l569k409k0J881K786L490K443Q70q19k091k328k261j645J74J007
1325b800J136J542J014L84l45l40j43m15J90O39r5m9q79j065n74j41M50J678J588
1344A775J780P09j01j813k552k708j997j012Q96K605L328L043K130j56j742l732
1360D53l456l098j204J019K688M175L998K625N96j668l619m024l656j801N69K433
$$ plain form
1247 657 448 561 1136 1332 1166 429 -889 -2345 -3718 -3997 -3239 -1219 1369 3745 5280 4691 2555
1264 2555 -415 -3924 -6628 -7334 -5494 -1870 2958 6570 9289 9070 6195 1357 -4031 -8040 -9471
1279 -9471 -8159 -4165 1405 6649 10204 10057 7346 1893 -3970 -9091 -11532 -10357 -6144 -585 5033
1294 5033 9073 9921 7712 3522 -2216 -6777 -8944 -8794 -5422 -829 4264 7815 9070 7654 3775
1309 3775 -309 -3878 -6287 -6307 -4426 -1640 1850 4293 5163 4344 2253 -75 -2336 -3981 -3807 -2800
1325 -2800 -1664 -122 892 1276 931 591 448 33 223 862 767 718 -161 -1226 -1800 -1941 -1491 187 1775
1344 1775 3555 4264 4163 2350 -202 -2910 -4907 -5919 -5023 -2418 910 3953 6083 5927 4185 453
1360 453 -3003 -6101 -7305 -6286 -3598 577 4575 7200 7796 6128 2509 -1515 -5171 -6972 -6403 -3970
1376c970L919L678K550Q83j191l124l833l392k030J56J529L366L134K399J190
1391E264o87k168l111k499j332j29J410J978K452K121Q56j83j344j453k107j318
1407b250j60M94J075J243O41P84ro37q34r05n16m89K46J75O24J33pJ73K13M6n4
1428a4K86K89k2n5k85l03j2j1j86O00J83P72L51k33n05m89p63o94q2j20N02K11
1450e80R32L25Kj01m42q86q15J07mL73R52M35P97M39Qo25p29o51m77J42J43M23
1472b32J149M34L15m3q27n56j151p21R0j53N43J185Q70N51J10m72j137j158q99
1491b102n37L08J443J137J397J154L81l29j580j880j367p98j77J293J599K164
1507B106J645L05q72j722k339j961j552j23J224J915K813J960R22l81j948k442
$$ plain form
1376 -3970 -51 3627 6177 7060 5869 2745 -1088 -4480 -6510 -6354 -4825 -1459 1675 4074 5264
1391 5264 4577 2409 -702 -3201 -4533 -4662 -3252 -1274 1178 3299 4155 3972 2628 1175 -932 -2250
1407 -2250 -2410 -1916 -841 402 1043 1827 1818 1181 347 -558 -1074 -1563 -1317 -1142 -518 -385 -392 -219 -6 40 -14
1428 -14 272 561 539 484 199 -104 -116 -127 -313 287 470 1242 1593 1360 855 366 -397 -1091 -1173 -1293 -791 -580
1450 -580 352 677 679 578 136 -750 -1565 -1458 -1462 -1089 -137 298 1095 1534 1542 917 188 -463 -940 -798 -655 -232
1472 -232 917 1351 1666 1623 796 240 -911 -1632 -1542 -1695 -1152 33 903 1454 1564 1092 -45 -1203 -2102
1491 -2102 -2639 -2331 -888 249 1646 2800 3181 2852 1272 -608 -1975 -2773 -2950 -1657 -58 2106
1507 2106 3751 4056 3184 1462 -877 -2838 -4390 -4513 -3289 -1374 1439 3399 4321 3940 1992 -450
1523d50k556j909J52J040K024L077K593J304k85j292k682l066j952m64P53K098
1539a615K252K579J179j30j074k400k440j970q00N02J394K114J890J089J81q51
1555A900j147j411o74o42O25M37P79P59L18R0k05j23k40L09J68P8j65o51q80q82
1575a557r15J57O83J693J414J511P42j249j644k358k880r91L07J086L313L386
1591B698K699J525j018k302m031m033k382l38J673L915M416L957J818n08l071
1606E018m804m596l549j123J665L705M883M491K757n03k475m271m833l669j017
1621h321J032L164M631M406K424M51k107l364l852l248j563Q76K030L215L020
1636B794K051M64j254k173k536k153p59n6J178J420J187J067J42m78p98k61O8
$$ plain form
1523 -450 -3006 -4915 -4763 -3723 -1699 1378 3971 5275 4990 3698 1016 -2050 -4002 -4466 -3713 -1615
1539 -1615 637 3216 4395 4265 3191 791 -1649 -3619 -4419 -3917 -2523 -409 1481 2570 2751 1900
1555 1900 753 -658 -1332 -1974 -1349 -912 -133 626 944 1034 829 706 466 775 943 1021 856 205 -675 -1557
1575 -1557 -2472 -2315 -1632 61 1475 2986 3728 2479 835 -1523 -4403 -5394 -5087 -4001 -688 2698
1591 2698 5397 6922 5904 3602 -429 -4462 -6844 -7182 -5509 -1594 2822 6779 8597 8089 5018
1606 5018 214 -4382 -7931 -9054 -7389 -3684 1199 5690 8447 7944 5469 1198 -3635 -7304 -8321
1621 -8321 -7289 -4125 506 4912 7336 7787 5680 2316 -1536 -4784 -6347 -5471 -3441 -226 2794
1636 2794 4845 5309 4055 1882 -654 -2807 -3566 -3622 -2444 -1024 163 1230 1372 894 96 -165 -97
1653i7J35K49K07l93n26r21l81l70Q56J716J845J550O11p32j783k640k694k159
1671e527k44J540L074L679K709J513q18k629m110m066k645p95J887L654M848L902
1687E972K544r9k791m511m674l441j498J463L638M688M413K579J25k316m192m493
1703b593l704j678P38K968M001L839K890J02j331l419l499k849j472K10K005L081
1719g11K849K184M39p85k064k228j443j297K12J065J393J159R14N8k26o67m50
1736D02q20J61P7l03L61n29n37l49k50M33J133J196J117M61k68r22j898j545j226
1755c306m61J168J889K674J721J521l65j580k835k731k139n31P84K118K760K959
1771C646R88L55j557k675l260k546o72N22K244L247K696J727M14j188k150k932
$$ plain form
1653 -97 38 287 494 101 -425 -1346 -1727 -2097 -1241 475 2320 3870 4481 3749 1966 -674 -3368 -5527
1671 -5527 -5771 -4231 -1157 2522 5231 6744 5926 3297 -813 -4879 -7524 -8319 -6432 -2778 2070 5972
1687 5972 8516 8417 5626 1115 -3559 -7000 -8498 -7035 -3397 1291 5704 8283 8408 6092 1900 -2593
1703 -2593 -6297 -7975 -7237 -4269 -268 3571 6461 6563 5232 1813 -1686 -4535 -6007 -5797 -3792 -711
1719 -711 2138 4322 4761 3976 1912 -316 -1759 -3056 -2844 -1779 -386 773 1687 1745 1519 852 402
1736 402 -418 -257 -180 -483 -122 -651 -1188 -1537 -1787 -1354 -221 975 2092 2553 2285 1363 -535 -2080 -3306
1755 -3306 -3767 -2599 -710 1964 3685 5206 4841 3261 426 -2305 -4444 -4975 -4191 -2073 687 3646
1771 3646 4634 4989 3432 757 -2503 -5049 -5721 -5199 -2955 292 2988 4715 5129 3941 1791 -1141
1787a141k620j196O41J687K694K352J886M35j119j611k372k008j299K49R23J851
1803f48J694J325L76p22r02j337j613m04l21R03J020P19J162K26j72l76p01m11
1821a82m50K18O6K60M62k39K86m8J19k80j4j04L57j24o51m2k53j01j61j48M35
1842e94N93L34L14J86m48k66m57o22%J0O72N21P54M68l22r1n11k68j024k45Q2
1863i14L53L81O20O49k92J69p35j081l02l67J88J84Q08M39M92M71j66n45l31o01
1883e80n66N51J12N77N78M14K97K15n64o15r83m42k35j66Q57Q85M92P45j94p18
1903F60n67r14p91m42M74N16P31J222O62J47k62p54j093j006k87J09P12Q97J419
1922A433Q72L57l90j283j170j251r63K47M35Q96J586J102N19o09q70j236j067
$$ plain form
1787 -1141 -3761 -4957 -4316 -2629 65 2417 4303 4738 3619 2008 -364 -2372 -3671 -3422 -2499 -648
1803 -648 1046 2371 2747 2025 1123 -214 -1827 -2231 -2552 -1649 -629 90 1252 1478 1306 930 229 -182
1821 -182 -632 -414 -348 -88 374 135 421 373 492 212 198 94 451 327 -324 -366 -619 -720 -881 -1029 -594
1842 -594 -1 333 647 833 385 119 -338 -960 -960 -950 -278 243 997 1465 1143 1052 541 273 -751 -996 -914
1863 -914 -561 -180 440 1089 797 966 231 -850 -1152 -1519 -1331 -1147 -339 100 592 1063 897 352 21 -580
1883 -580 -1146 -595 -483 94 672 1086 1383 1598 1034 419 -564 -1006 -1241 -1407 -550 335 827 1572 1378 660
1903 660 93 -821 -1612 -2054 -1580 -1064 -333 889 1551 1698 1436 682 -411 -1417 -1704 -1595 -883 14 1433
1922 1433 2305 2662 2272 989 -181 -1432 -2395 -2148 -1713 -817 769 1871 2390 1781 911 -325 -1392
1939a392j016k02N01J060J552J055Q78n17o33j007j030n60m17J89Q75J344R01
1956A581L24J49o62r34q23o11n8r2O22L02M13J65J2k89m9k01k35q6L68mj82k27
1978e17l23K07lK46P15Q37M69K03o08o08q27j115p23l5P93J402J246J070N42n97
1998B374j097k052j980r79J71P40J763K327J817P49n03j506k107k029j507m46
2014d265J314J904K485K161R68k39j725k175k314j656o58P27J841K394J692J146
2030C600O2j163k112j872j632o15L23J552J820J490J293k17l84j217j529j310
2046a911q8K14P29J062R27M59K08n00l10n88k01k2l23J58J00j65m58j4O9L44J89
2067a21O36L88L14k34p82q98j054m68m2N77J418J991J052M73k88j409j679j960
$$ plain form
1939 -1392 -2408 -2610 -2109 -1049 503 1558 2436 1919 1286 279 -751 -1311 -1728 -1539 -664 680 1581
1956 1581 1905 2054 1392 458 -365 -976 -1034 -1126 -504 -202 211 376 388 99 50 -151 -386 -472 -104 -108 -290 -517
1978 -517 -840 -633 -636 -390 325 1162 1631 1834 1226 618 -209 -1324 -2047 -2082 -1289 113 1359 2429 2971 2374
1998 2374 1277 -775 -2755 -3734 -3563 -2823 -1060 1267 3084 3833 3330 1824 -283 -2312 -3819 -4265
2014 -4265 -2951 -1047 1438 3599 4567 4328 2603 428 -1886 -3542 -4200 -3473 -1632 762 2454 3600
2030 3600 3662 2499 387 -1485 -3117 -3732 -3409 -1857 -37 1453 2746 2529 2145 928 -601 -1911
2046 -1911 -1999 -1785 -1056 6 933 1392 1600 1100 790 202 1 -21 -344 -186 -86 -251 -709 -723 -654 -310 -121
2067 -121 515 903 1217 983 201 -697 -1751 -2219 -2261 -1684 -266 1725 2777 3250 2962 1553 -126 -2086
2085b086j141RQ38J940K047J568Q00l94j495k214k264j506o39J063K237K076J720
2102B559J346J14j873j881k110j741o05O20J787K360K101R67J76j005j602k268
2118a055j296p01J87J401J239J777J198J87j037j263j191j243m91L77O09R70O20
2135B88N63K51j71o80m49j72N0M29m59M04Q6j56K2k41Q6L11M98P23k0l14k47j358
2157e56q49k81k19O28P00J082J178K38n6q03j596j241n31o27R14J253J571J357
2175B162O68M6j127j345j544j274l02M13J471J446J643O20J43r81j480j514j600
2192b555n89M50J109J153J700R18Q9n67q82j698j011m27M7R52J411Q32P68L03
2210B003l53n24r32r22m19j84N04P16N82M18m3o9k21n44j99j94m9N9L6k19J78
$$ plain form
2085 -2086 -3227 -3218 -2380 -440 1607 3175 3975 3581 2086 -128 -2392 -3898 -4537 -3474 -1237 839 2559
2102 2559 3905 4019 2146 265 -1845 -3586 -4191 -3571 -1784 576 2677 3644 3820 2815 1213 -1055
2118 -1055 -2351 -3052 -2865 -1464 -225 1552 2750 2937 1900 637 -554 -1797 -2288 -1911 -1302 -332 288
2135 288 851 1102 931 251 -198 -370 -320 109 -350 54 140 -16 6 -235 -149 162 660 1383 1363 1049 802 -556
2157 -556 -1405 -1686 -1905 -1277 -577 505 1683 1921 1865 1062 -534 -1775 -2306 -2933 -2019 -766 805 2162
2175 2162 2830 2876 1749 404 -1140 -2414 -2716 -2303 -832 614 2257 2877 3020 2039 559 -955 -2555
2192 -2555 -3144 -2694 -1585 -432 1268 2186 2275 1708 826 -872 -1883 -2310 -2263 -1311 100 932 1700 2003
2210 2003 1650 1126 194 -728 -1147 -1331 -827 -111 471 889 846 777 556 12 -187 -381 -430 -371 -335 -554 -376
2231c76K21j77K64k28P50J1j74J46q4j14o43l04K63J04L96M65L73M56j21m54o10
2252A64o30p66R1J42N47M34O39K44j1k86n28p01n77l6J63N46O69O84K85M8j29
2273I92l11j055j25m54J11N72L78N71M97j21p5p66l88n12l26K65j5N91M60J18
2293D07K85l30k57k05o46j32L4K19M76K53J99J27J83k12j91k69n1j08J52MK32
2314A70K57oJ44l45l53o3m18L21LL1r9L24J17J21j1k55l00j16j20J56K96p1M70
2337B53J84k5K14j95q6n17k30M25j62K39K94j97J26om0n44Rk62J76p0O1j3L11
2360e5K71n8K7j64l11K49k73j40M77K10l18M56k68Q4J56pj84J07j63r4J03j68
2382f3n2k11j34J33L64J88j5L9J22o75mp01L33O1L31K74L87K64K38l03j68p02
$$ plain form
2231 -376 -155 -332 -68 -296 454 465 291 437 353 239 -404 -708 -445 -341 55 520 893 1349 1228 774 164
2252 164 -466 -1232 -1141 -999 -452 -18 621 865 854 568 40 -661 -1238 -1274 -1111 -565 104 788 1073 1121 992
2273 992 681 -374 -499 -953 -842 -270 108 679 1176 1055 980 214 -174 -686 -1012 -747 -762 -171 289 407
2293 407 692 362 105 -100 -746 -878 -844 -625 -149 104 303 430 613 401 210 -59 -110 -218 -66 -62 170
2314 170 427 421 565 220 -133 -196 -614 -293 -290 -259 -358 -34 83 204 193 -62 -362 -478 -598 -442 -146 -217 253
2337 253 437 412 626 431 345 -172 -402 23 -139 100 394 197 323 317 277 -267 -258 -520 -344 -414 -353 -366 -55
2360 -55 216 158 185 21 -290 -41 -314 -454 23 233 -85 371 103 187 343 336 152 259 96 2 105 -63
2382 -63 -115 -326 -460 -327 37 225 210 249 371 -304 -308 -1009 -676 -615 -284 -10 377 641 879 576 408 -294
2404b94m78l4K0N30M09N93M80J19l12n53n90r23j41k56L48N15P48P64J76j4o73
2425D34m15q36o44j75P11M19P67O63O31k09m24o63r00k96j28L23M20N39P13K77
2445A207j21k72k72q42n58O8j94K61M93M87J53J90k05k36l07k4l25K30J61k7O4
2466f9K82l65Q5n7L63J81n5K47r3k40p28j44j18J21K91J10M27P51j25k06n59l48
2488b49p85l03M3K96J011L77O07N65J00j009o07j014l02n1J74J094Q73N71M82
2507A873l86n13q07j213k67m61M14R46O82P57N45j56o37q20r21k17l66J20N60
2526h67P86J090L45J28n17o97l51m99L6j85K76N45M60N06l80k21j85l56r5k32
2546d13J60j60J27m9N12k11J37l19o1J13M20P3k69R3k07m07J6J00m1M47N46K72
$$ plain form
2404 -294 -772 -806 -786 -256 153 746 1226 1345 1033 480 -110 -1033 -1174 -1430 -1082 -567 181 945 1121 1107 434
2425 434 19 -817 -1461 -1636 -925 -506 261 924 1555 1346 922 259 -641 -937 -1065 -742 -322 217 930 1207
2445 1207 1086 814 542 -300 -858 -790 -984 -723 -230 257 410 600 395 159 -148 -172 -497 -267 -106 -133 -69
2466 -69 213 -152 -67 -124 239 420 365 612 519 279 -449 -593 -711 -590 -299 -189 238 989 864 658 99 -249
2488 -249 -1034 -1337 -1294 -998 13 390 997 1562 1662 653 46 -968 -1270 -1321 -1147 -53 820 1391 1873
2507 1873 1487 974 167 -1046 -1313 -1774 -1360 -414 268 1025 1570 1414 777 -43 -964 -1181 -1547 -1427 -867
2526 -867 -81 1009 1354 1482 965 268 -83 -582 -546 -731 -455 90 550 1056 676 455 270 -86 -181 -413
2546 -413 -253 -413 -286 -335 177 -34 103 -216 -277 -164 256 329 60 153 -54 -461 -445 -345 -386 61 607 879
2568H79QK35p42l30m64l09l20M13N98M04N92J33J42p29q63n76n90m1N17N06O74
2589A37R02l6M8k56q45n29l15l06J12J105M08O54K08N5l50n63n14q35NML35O44
2611F8L61M43Q2n17k64m30o24L5J51K22M23o7Q07J26j78l06j52k88J12n43L7P20
2633B18j67K24M39l30k98j32J80k10j9j38P1L3k3r8Q8k05K37J63n1J8P5p4j84
2656a83O9r6M6k8M23O3R6L8j4r2k03l28Q5k26L48J0J41L16j45m4k57p5l86jj9
2681d62J05N0J02K12K01m5n9j43j95p7k05K90J82J14L18PJ97j96m9r9n75j9j12
2704d58K59P6K87J52J94l65m2j28k78m82M6J44M79j1L64J80j47L69p77r0k42k12
2726f82J57N56K63K51K88n1m01j15n22k42K0k73N67K19K86J39O0j30n33m7n18
$$ plain form
2568 879 887 1122 380 50 -414 -723 -1043 -630 -32 372 964 1097 1239 510 -353 -929 -1519 -1560 -1043 -537 137
2589 137 1039 1003 1051 795 -50 -579 -894 -1200 -1088 17 425 1079 1287 1342 992 429 -85 -920 -915 -911 -576 68
2611 68 429 872 954 437 173 -257 -881 -846 -695 -473 -50 -117 690 816 638 332 180 -108 4 -539 -502 218
2633 218 51 275 714 384 86 -46 134 -76 -95 -233 -162 -129 -152 -250 -162 -367 -130 33 -18 0 75 1 -183
2656 -183 -114 -210 -164 -192 231 294 390 428 414 322 119 -209 -124 -350 -2 8 149 465 320 276 19 -56 -442 -443 -462
2681 -462 -357 -307 -205 7 208 163 104 -39 -234 -311 -516 -226 -44 70 388 395 592 396 347 248 -327 -346 -458
2704 -458 -199 -123 164 316 510 145 103 -25 -303 -785 -739 -595 -116 -127 237 417 270 639 -138 -228 -470 -682
2726 -682 -525 31 294 545 833 782 381 266 -256 -498 -478 -751 -184 35 321 460 520 390 -143 -190 -708
2747g08L4Q5N4M19K79L46k6J0m45n9j77m63L71LL51L24Q2K96k25k35m03j44J02
2770a29q1j4J60J33q5J43j4j06k8j10j47O0J75Nj5k62J55J02o6J81k59N98j68
2793B28N26l67j38m33j93r9J3K82N23K10J26M1l26n81l15l07l8j35K62P97O57
$$ plain form
2747 -708 -674 -589 -535 -116 163 509 483 493 48 -11 -188 -651 -280 -277 74 398 480 776 551 316 -87 -231 -129
2770 -129 -210 -224 -64 69 -16 127 113 7 -21 -131 -278 -218 -43 -38 -53 -315 -160 -58 -124 57 -202 396 228
2793 228 754 387 249 -184 -377 -476 -463 -181 342 552 678 719 393 -188 -503 -810 -848 -983 -721 76 733
$$ [...]
8191h8
##END NTUPLES=NMR FID
##END=
