##TITLE=1H_Pr 4-N-S
 DMSO, 8 sc, 
 31.8.2021
##JCAMPDX= 6.0         $$ Bruker NMR JCAMP-DX V2.0
##DATA TYPE= NMR FID
##DATA CLASS= NTUPLES
##ORIGIN= UXNMR, Bruker Analytische Messtechnik GmbH
##OWNER= root
$$ XWIN-NMR		Version 3.5
$$ Tue Aug 31 12:20:49 2021 Russian Standard Time (UT+4h)  she@DPX200
##.OBSERVE FREQUENCY= 200.131506
##.OBSERVE NUCLEUS= ^1H
##.DELAY= (6, 6)
##.ACQUISITION MODE= SIMULTANEOUS
##.ACQUISITION SCHEME= undefined
##.AVERAGES= 8
##.DIGITISER RES= 18
##SPECTROMETER/DATA SYSTEM= spect
##.PULSE SEQUENCE= zg30
##.SOLVENT NAME= DMSO
##.SHIFT REFERENCE= (INTERNAL, DMSO, 0, 15.7039)
##AUDIT TRAIL= $$ (NUMBER, WHEN, WHO, WHERE, WHAT)
$$ ##TITLE= Audit trail, XWIN-NMR		Version 3.5
$$ ##JCAMPDX= 5.01
$$ ##ORIGIN= Bruker BioSpin GmbH
$$ ##OWNER= she
$$ F:/spectra/data/she/nmr/H-F/1/audita.txt
$$ ##AUDIT TRAIL=  $$ (NUMBER, WHEN, WHO, WHERE, WHAT)
(   1,<2021-08-31 12:19:35.12 +0400>,<she>,<DPX200>,
      <created by zg, POWCHK disabled, PULCHK disabled
       configuration hash MD5:
       00 E9 B6 7A A2 85 ED C7 34 08 36 98 17 FE 4E 26
       data hash MD5: 16K
       45 42 DB 67 F6 DF 4D A6 0A D9 01 6F 30 AD A4 5B>)
$$ ##END=
$$ 
$$ hash MD5
$$ 02 3D 12 8F 68 B0 43 F2 52 A3 B4 45 6D 05 C5 98
##$RELAX= 
##$RELAX= 
##$RELAX= 
##$RELAX= 
##$RELAX= 
##$RELAX= 
$$ Bruker specific parameters
$$ --------------------------
##$DU= <F:/spectra>
##$EXPNO= 1
##$NAME= <H-F>
##$PROCNO= 1
##$TYPE= <nmr>
##$USER= <she>
##$AMP= (0..31)
100 100 100 100 100 100 100 100 100 100 100 100 100 100 100 100 100 100 
100 100 100 100 100 100 100 100 100 100 100 100 100 100 
##$AQSEQ= 0
##$AQ_mod= 1
##$AUNM= <au_zg>
##$AUTOPOS= <>
##$BF1= 200.13
##$BF2= 200.13
##$BF3= 200.13
##$BF4= 200.13
##$BF5= 200.13
##$BF6= 200.13
##$BF7= 200.13
##$BF8= 200.13
##$BYTORDA= 1
##$CFDGTYP= 0
##$CFRGTYP= 5
##$CHEMSTR= <none>
##$CNST= (0..31)
1 1 145 1 1 1 1 1 1 1 1 1 1 1 1 1 1 1 1 1 1 1 1 1 1 1 1 1 1 1 1 1 
##$CPDPRG= <>
##$CPDPRG1= <>
##$CPDPRG2= <>
##$CPDPRG3= <>
##$CPDPRG4= <mlev>
##$CPDPRG5= <mlev>
##$CPDPRG6= <mlev>
##$CPDPRG7= <mlev>
##$CPDPRG8= <mlev>
##$CPDPRGB= <>
##$CPDPRGT= <>
##$D= (0..31)
0 1.2 0 0 0 0 0 0 0 0.06 0 0.03 0 0 0 0 0.0002 0 0 0 0 0 0 0 0 0 0 0 0 
0 0 0 
##$DATE= 1630397974
##$DBL= (0..7)
120 120 120 120 120 120 120 120 
##$DBP= (0..7)
150 150 150 150 150 150 150 150 
##$DBP07= 0
##$DBPNAM0= <>
##$DBPNAM1= <>
##$DBPNAM2= <>
##$DBPNAM3= <>
##$DBPNAM4= <>
##$DBPNAM5= <>
##$DBPNAM6= <>
##$DBPNAM7= <>
##$DBPOAL= (0..7)
0.5 0.5 0.5 0.5 0.5 0.5 0.5 0.5 
##$DBPOFFS= (0..7)
0 0 0 0 0 0 0 0 
##$DE= 6
##$DECBNUC= <off>
##$DECIM= 32
##$DECNUC= <off>
##$DECSTAT= 4
##$DIGMOD= 1
##$DIGTYP= 9
##$DL= (0..7)
0 120 120 120 120 120 120 120 
##$DP= (0..7)
150 150 150 150 150 150 150 150 
##$DP07= 0
##$DPNAME0= <>
##$DPNAME1= <>
##$DPNAME2= <>
##$DPNAME3= <>
##$DPNAME4= <>
##$DPNAME5= <>
##$DPNAME6= <>
##$DPNAME7= <>
##$DPOAL= (0..7)
0.5 0.5 0.5 0.5 0.5 0.5 0.5 0.5 
##$DPOFFS= (0..7)
0 0 0 0 0 0 0 0 
##$DQDMODE= 0
##$DR= 18
##$DS= 0
##$DSLIST= <SSSSSSSSSSSSSSS>
$$ [...]
##$SUBNAM2= <"">
##$SUBNAM3= <"">
##$SUBNAM4= <"">
##$SUBNAM5= <"">
##$SUBNAM6= <"">
##$SUBNAM7= <"">
##$SUBNAM8= <"">
##$SUBNAM9= <"">
##$SW= 20.0188882624521
##$SWIBOX= (0..15)
0 0 2 0 0 0 0 0 0 0 0 0 0 0 0 0 
##$SW_h= 4006.41025641026
##$TD= 16384
##$TD0= 1
##$TE= 0
##$TE2= 300
##$TE3= 300
##$TEG= 300
##$TL= (0..7)
0 120 120 120 120 120 120 120 
##$TP= (0..7)
150 150 150 150 150 150 150 150 
##$TP07= 0
##$TPNAME0= <>
##$TPNAME1= <>
##$TPNAME2= <>
##$TPNAME3= <>
##$TPNAME4= <>
##$TPNAME5= <>
##$TPNAME6= <>
##$TPNAME7= <>
##$TPOAL= (0..7)
0.5 0.5 0.5 0.5 0.5 0.5 0.5 0.5 
##$TPOFFS= (0..7)
0 0 0 0 0 0 0 0 
##$TUNHIN= 0
##$TUNHOUT= 0
##$TUNXOUT= 0
##$USERA1= <user>
##$USERA2= <user>
##$USERA3= <user>
##$USERA4= <user>
##$USERA5= <user>
##$V9= 5
##$VALIST= <valist>
##$VCLIST= <CCCCCCCCCCCCCCC>
##$VD= 0
##$VDLIST= <DDDDDDDDDDDDDDD>
##$VPLIST= <PPPPPPPPPPPPPPP>
##$VTLIST= <TTTTTTTTTTTTTTT>
##$WBST= 1024
##$WBSW= 4
##$XGAIN= (0..3)
0 0 0 0 
##$XL= 0
##$YL= 0
##$YMAX_a= 254267
##$YMIN_a= -170740
##$ZGOPTNS= <>
##$ZL1= 120
##$ZL2= 120
##$ZL3= 120
##$ZL4= 120
##$ABSF1= 10
##$ABSF2= 0
##$ABSG= 5
##$ABSL= 3
##$ALPHA= 0
##$AQORDER= 0
##$ASSFAC= 0
##$ASSFACI= 0
##$ASSFACX= 0
##$ASSWID= 0
##$AUNMP= <proc_1d>
##$AZFE= 0.1
##$AZFW= 0.1
##$BCFW= 1
##$BC_mod= 2
##$BYTORDP= 1
##$COROFFS= 0
##$CY= 11.3945322036743
##$DATMOD= 1
##$DC= 2
##$DFILT= <>
##$DTYPP= 0
##$F1P= 2.36226072786647
##$F2P= -0.459571619588291
##$FCOR= 0.5
##$FTSIZE= 0
##$FT_mod= 4
##$GAMMA= 1
##$GB= 0.15
##$INTBC= 1
##$INTSCL= 1
##$ISEN= 128
##$LB= 0.24
##$LEV0= 0
##$LPBIN= 0
##$MAXI= 10000
##$MC2= 0
##$MEAN= 0
##$ME_mod= 0
##$MI= 1.114404
##$NCOEF= 0
##$NC_proc= 0
##$NLEV= 6
##$NOISF1= 3.799351
##$NOISF2= 2.8
##$NSP= 1
##$NTH_PI= 0
##$NZP= 0
##$OFFSET= 15.70392
##$PC= 1
##$PHC0= -13361.04
##$PHC1= 12.60098
##$PH_mod= 1
##$PKNL= yes
##$PPARMOD= 0
##$PSCAL= 0
##$PSIGN= 0
##$REVERSE= no
##$SF= 200.130013532006
##$SI= 16384
##$SIGF1= 3
##$SIGF2= 2
##$SINO= 400
##$SIOLD= 16384
##$SREGLST= <1H.CDCl3>
##$SSB= 0
##$STSI= 0
##$STSR= 0
##$SW_p= 3612.71676300578
##$SYMM= 0
##$S_DEV= 0
##$TDeff= 0
##$TDoff= 0
##$TI= <>
##$TILT= no
##$TM1= 0
##$TM2= 0
##$TOPLEV= 0
##$USERP1= <user>
##$USERP2= <user>
##$USERP3= <user>
##$USERP4= <user>
##$USERP5= <user>
##$WDW= 1
##$XDIM= 8192
##$YMAX_p= 0
##$YMIN_p= 0
$$ End of Bruker specific parameters
$$ ---------------------------------
##NTUPLES= NMR FID
##VAR_NAME=  TIME,          FID/REAL,        FID/IMAG
##SYMBOL=    X,             R,               I
##VAR_TYPE=  INDEPENDENT,   DEPENDENT,       DEPENDENT
##VAR_FORM=  AFFN,          ASDF,            ASDF
##VAR_DIM=   8192,          8192,            8192
##UNITS=     SECONDS,       ARBITRARY UNITS, ARBITRARY UNITS
##FACTOR=    0.0002496,     1,               1
##FIRST=     0,             0,               0
##LAST=      2.0444736,     0,               0
##MIN=       0,             -170740,         0
##MAX=       2.0444736,     254267,          0
$$ Real data points
##PAGE= N=1
##DATA TABLE= (X++(R..R)), XYDATA
$$ [...]
$$ plain form
1967 1199 1038 1002 1239 1182 1311 1286 1227 1214 655 568 386 304 131 -81 -457 -350 -613 -695 -910 -977 -1379 -1214 -935
1990 -935 -1346 -1014 -1002 -840 -503 -522 -514 -265 -128 -251 -64 67 388 331 276 6 301 190 210 379 165 96 -57
2013 -57 -356 -167 -183 -340 -186 -408 -55 -100 202 139 130 330 355 414 442 561 808 900 568 817 671 558 574 523
2037 523 110 135 136 -10 35 -211 -554 -323 -599 -550 -604 -490 -475 -422 -778 -716 -721 -409 -350 -372 -56 190 -33 47 118
2062 118 349 113 100 83 214 263 -37 62 6 33 13 -133 23 -119 35 -470 -28 -390 -197 -115 154 -71 159
2085 159 164 -77 38 356 -148 185 522 158 34 276 375 274 170 42 -22 -13 141 76 -38 -189 -73 -237
2107 -237 -281 -192 -225 -323 -55 -309 -66 47 -63 -197 -264 -432 -13 -45 292 -157 -4 -44 -37 120 26 0 450 179
2131 179 130 394 18 400 387 -177 162 300 -28 -237 95 -137 -288 -94 137 -53 -159 -326 -91 22 -81
$$ packed form
1967A199j61l6K37n7J29k5n9j3n59q7j82q2j73k12l76J07k63q2k15o7m02J65K79
1990i35m11L32J2J62L37j9QK49J37j23J87J31L21n7n5k70K95j11K0J69k14o9j53
2013e7k99J89j6j57J54k22L53m5L02o3rK00K5N9K8J19K47R2l32K49j46j13J6n1
2037E23m13K5Jj46M5k46l43K31k76M9n4J14J5N3l56O2nL12N9k2L16K46k23Q0P1
2062A18K31k36j3j7J31M9l00R9n6K7k0j46J56j42J54n05M42l62J93Q2K69k25K30
2085A59Nk41J15L18n04L33L37l64j24K42R9j01j04j28o4RJ54o5j14j51J16j64
2107b37m4Q9l3r8K68k54K43J13j10j34o7j68M19l2L37m49J53m0PJ57r4k6M50k71
2131A79m9K64l76L82j3n64L39J38l28k09L32k32j51J94K31j90j06j67K35J13j03
$$ plain form
2152 -81 -120 -300 -57 108 -26 -223 176 -236 -108 -211 216 243 174 -27 85 -168 147 -84 382 1 261
2173 261 85 71 -84 92 -5 136 -29 13 -40 -48 -40 -69 11 53 210 96 189 445 167 97 394 159 126 439 383
2198 383 260 173 362 162 -132 25 51 -271 -184 -354 -405 -561 -387 -373 -509 -150 -342 -294 -698 -216 -173 -139 -29
2221 -29 176 -68 238 313 289 360 281 327 423 560 438 274 223 171 425 241 79 -53 -270 -118 -66 131 -59
2244 -59 14 -163 125 -185 -7 175 151 347 147 302 281 240 268 264 417 408 414 119 117 145 -363 -206 -471 -235 -508
2269 -508 -377 -592 -614 -528 -600 -582 -603 -339 -510 -434 -441 -355 -6 -240 146 209 230 754 381 317 396 533 428 341 245
2294 245 656 112 310 271 39 22 231 -157 -18 -248 -26 5 -38 -202 2 147 201 -20 95 166 590 112
2316 112 329 318 472 297 185 515 275 -200 -332 -150 -359 -336 -439 -650 -577 -947 -558 -591 -621 -408 -417 -376 -578
$$ packed form
2152h1l9j80K43J65j34j97L99m12J28j03M27K7o9k01J12k53L15k31M66l81K60
2173B61j76j4j55J76r7J41j65M2n3qQk9Q0M2J57j14R3K56k78p0K97k35l3L13n6
2198C83j23q7J89k00k94J57K6l22Q7j70n1j56J74J4j36L59j92M8m04M82M3L4J10
2221b9K05k44L06P5k4P1p9M6R6J37j22j64n1n2K54j84j62j32k17J52N2J97j90
2244e9P3j77K88l10J78J82k4J96k00J55k1m1K8mJ53rOk95kK8n08J57k65K36k73
2269e08J31k15k2Q6p2J8k1K64j71P6pQ6L49k34L86O3K1N24l73o4P9J37j05q7r6
2294B45M11n44J98l9k32j7K09l88J39k30K22L1m3j64K04J45N4k21J15P1M24m78
2316A12K17j1J54j75j12L30k40m75j32J82k09K3j03k11P3l70L89l3l0K13rM1k02
$$ plain form
2339 -578 -376 -455 -71 -17 177 -49 258 286 551 523 551 705 501 638 379 424 298 346 197 -242 -1 -3 -236
2362 -236 112 108 -123 -158 -40 -263 -162 -181 141 255 268 373 277 323 93 356 224 115 49 149 289 -72 -349
2385 -349 -142 -299 -118 -434 -268 -341 -502 -357 -627 -501 -529 -606 -579 -272 -461 -329 -434 174 43 -37 -117 173
2407 173 304 304 435 445 127 407 421 336 462 282 90 211 -23 82 -10 -71 95 -75 -92 -13 -73 -353 47
2430 47 407 307 239 361 193 97 270 39 98 339 81 316 142 16 -75 76 -388 -348 -389 -174 -157 -286 -313
2453 -313 -348 -577 -498 -262 -336 -319 -439 -347 -230 -359 -6 -177 -60 45 453 428 272 460 332 80 320 150
2475 150 -60 272 73 518 -50 95 -220 144 113 -259 -362 -253 -65 -50 -97 139 107 173 308 149 -118 21
2497 21 81 -37 255 176 -123 -79 -108 158 69 -70 47 88 -133 -230 -152 -1 -174 121 -458 -316 -289 -134 -367
$$ packed form
2339e78K02p9L84N4J94k26L07K8K65k8K8J54k04J37k59M5j26M8j49m39K41kk33
2362b36L48mk31l5J18k23J01j9L22J14J3J05r6M6k30K63j32j09o6J00J40l61k77
2385c49K07j57J81l16J66p3j61J45k70J26k8p7K7L07j89J32j05O08j31q0q0K90
2407A73J31%J31J0l18K80J4q5J26j80j92J21k34J05r2o1J66j70j7P9o0k80M00
2430D7L60j00o8J22j68r6J73k31N9K41k58K35j74j26r1J51m64M0m1K15J7j29k7
2453c13l5k29P9K36p4J7j20R2J17j29L53j71J17J05M08k5j56J88j28k52K40j70
2475A50k10L32j99M45n68J45l15L64l1l72j03J09J88J5m7K36l2O6J35j59k67J39
2497B1O0j18K92p9k99M4k9K66q9j39J17M1k21r7P8J51j73K95n79J42K7J55k33
$$ plain form
2520 -367 -57 4 -296 -80 125 78 -66 -57 -189 178 58 179 -49 306 120 73 270 155 152 -60 -23 -76 65
2543 65 -124 -44 -219 -131 -19 -270 -11 177 37 164 99 -184 -129 -199 -155 68 -129 188 -52 -94 -37 45 105 95
2567 95 106 36 35 281 153 25 200 -58 -145 -71 -284 -99 -182 -181 -4 182 -139 -21 -73 295 2 -127 74 -142
2591 -142 100 102 82 193 409 242 -90 -184 88 97 24 -137 -163 -135 -1 -97 260 148 -62 115 81 -65 -17 -47
2615 -47 -168 114 -115 8 -161 -153 -243 90 9 -105 210 -31 -121 94 -61 194 138 -116 -178 262 -1 -132 163
2638 163 183 277 29 -11 -72 -313 -100 -35 43 45 -272 149 74 -54 -121 169 -5 -150 -159 31 -57 -96 80 63 -6
2663 -6 285 49 65 46 343 137 -125 -158 54 27 -119 -70 -230 -38 -84 -386 -40 -82 -122 -271 -39 -208 73
2686 73 90 82 108 131 177 141 -36 165 136 292 230 110 239 25 57 78 326 -46 37 -42 -19 11 -261 192 -74
$$ packed form
2520c67L10O1l00K16K05m7j44Rj32L67j20J21k28L55j86m7J97j15lk12L7n3J41
2543F5j89Q0j75Q8J12k51K59J88j40J27o5k83N5p0M4K23j97L17k40m2N7Q2O0j0
2567I5J1p0jK46j28j28J75k58q7P4k13J85q3JJ77J86l21J18n2L68k93j29K01k16
2591a42K42Kk0J11K16j67l32r4K72Rp3j61k6K8J34r6L57j12k10J77l4j46M8l0
2615d7j21K82k29J23j69Qr0L33q1j14L15k41r0K15j55K55n6k54o2M40k63j31K95
2638A63K0R4k48m0o1k41K13O5P8Kl17M21p5j28o7K90j74j45rJ90q8l9J76j7o9
2663fK91k36J6j9K97k06k62l3K12k7j46M9j60J92m6l02L46m2m0j49K32j69K81
2686G3J7qK6K3M6l6j77K01k9J56o2j20J29k14L2K1K48l72Q3p9K3L0k72M53k66
$$ plain form
2711 -74 -182 -228 -179 -57 -250 2 174 -53 162 305 0 -82 122 79 49 -12 -146 92 252 46 -112 -534
2733 -534 84 -360 -35 -41 -189 -59 -20 104 -390 177 74 119 -337 -100 6 -8 103 74 213 -51 174 156
2755 156 55 372 205 145 234 129 4 196 184 2 230 -74 32 94 -378 -400 -112 121 -223 -119 -80 105
2777 105 30 26 0 -149 351 -136 125 -156 166 9 -184 -148 46 123 -23 126 12 -70 -259 109 -169 -35
2799 -35 -332 -244 -203 -158 -190 -143 62 -49 138 -89 34 126 420 18 46 47 253 291 341 147 19 148 404 257
2823 257 73 355 101 -300 -245 43 -272 21 -107 -1 9 -196 -63 -90 163 -233 -148 -2 -133 48 -8 -72
2845 -72 198 14 73 -129 182 115 -47 -128 113 -215 64 -84 -41 19 -207 -150 -215 -95 -235 -69 151 -47 -140
2868 -140 6 158 2 -105 279 10 148 68 116 101 -120 228 246 -165 33 100 56 175 -16 -96 27 -82
$$ packed form
2711g4j08m6M9J22j93K52J72k27K15J43l05q2K04m3l0o1j34K38J60k06j58m22
2733e34O18m44L25oj48J30L9J24m94N67j03M5m56K37J06j4J11k9J39k64K25j8
2755A56j01L17j67o0Q9j05j25J92j2j82K28l04J06O2m72k2K88K33l44J04L9J85
2777A05p5mk6j49N00m87K61k81L22j57j93L6J94P7j46J49j14q2j89L68k78J34
2799c5k97Q8M1M5l2M7K05j11J87k27J23R2K94m02K8JK06L8N0j94j28J29K56j47
2823B57j84K82k54m01N5K88l15K93j28J06J0k05J33k7K53l96Q5J46j31J81n6o4
2845g2K70j84N9k02L11o7j62q1K41l28K79j48M3O0k26N7o5J20j40J66K20j98r3
2868a40J46J52j56j07L84k69J38q0M8j5k21L48J8m11J98O7m4J19j91q0J23j09
$$ plain form
2890 -82 -8 -156 -73 215 -164 -40 127 55 -182 239 268 37 -151 -210 252 -139 -91 124 130 -109 27 -104 91
2913 91 27 99 -303 -205 -50 -315 -188 19 -20 -63 -257 -279 187 -20 -122 132 23 127 -68 22 33 238 41
2936 41 1 110 235 356 -278 43 131 -29 34 184 -125 123 -152 26 354 -130 103 -108 -154 -145 4 60 -157
2959 -157 110 23 -39 133 163 -141 -40 257 -169 -24 139 70 25 -76 94 -258 145 322 -55 -61 -133 39 -31
2982 -31 -101 -191 -204 43 -98 -105 258 -50 318 3 63 -176 -55 127 -78 207 -5 159 -88 104 63 71 18 121
3006 121 237 -234 150 31 -209 131 -50 -118 81 72 118 98 -167 -24 135 163 33 20 238 36 -37 131 -109
3029 -109 73 -53 125 117 -9 -83 144 181 -110 129 34 -156 116 -215 79 104 121 34 -70 -71 -31 -83 -24 -15 -309
3054 -309 27 -77 -88 -108 24 -12 18 -70 65 290 -140 20 19 -169 169 79 123 73 -276 -44 -39 89 -142 -21
$$ packed form
2890h2P4j48Q3K88l79J24J67p2k37M21K9k31j88n9M62l91M8K15Ok39J36j31J95
2913I1o4P2m02R8J55k65J27K07l9m3j94k2M66k07j02K54j09J04j95R0J1K05j97
2936D1m0J09J25J21o34L21Q8j60O3J50l09K48k75J78L28m84K33k11m6RJ49N6k17
2959a57K67q7o2J72L0l04J01K97m26J45J63o9m5j01J70l52M03J77l77op2J72p0
2982c1p0r0j3K47j41pL63l08L68l15O0k39J21J82k05K85k12J64k47J92m1Qn3J03
3006A21J16m71L84j19k40L40j81o8J99rM6k0k65J43J59K8j30j3K18k02p3J68k40
3029a09J82j26J78qj26p4K27L7k91K39r5j90K72l31K94K5J7q7j04jM0n2N9Rk94
3054c09L36j04j1k0J32l6L0q8J35K25m30J60jj88L38r0M4n0l49K32NJ28k31J21
$$ plain form
3078 -21 152 -35 -350 13 22 56 22 -418 222 -2 -92 269 166 166 -99 126 67 -22 -42 29 302 25 61 -105
3102 -105 -93 153 197 361 -96 -159 9 -152 -148 -289 256 78 -153 -104 167 -24 -305 19 -26 -28 -440 -36 -274
3125 -274 -90 3 -69 10 -216 48 49 216 68 106 -127 -122 -90 81 -22 -231 -12 -27 -55 120 88 38 -136 -326
3149 -326 -35 141 -45 -66 1 -235 -42 240 -1 97 134 -134 -87 126 5 117 193 169 -21 58 168 -197 -182
3172 -182 -212 -142 -170 -159 -222 -93 113 -263 -152 -60 151 -172 148 -64 -214 -27 -147 -37 47 -130 -21 -232
3194 -232 160 239 61 -43 172 -293 85 -39 -45 -88 -106 175 -244 9 195 -69 -96 -41 -363 -38 -219 141
3216 141 202 20 176 -72 188 7 84 -81 191 -16 -75 -358 -267 287 -113 -90 -101 97 -105 -88 47 -101
3238 -101 -59 49 82 -11 72 41 -195 169 268 -132 -236 -101 -31 -65 -55 -41 206 -56 227 23 -5 401 -15 -47
$$ packed form
3078b1J73j87l15L63RL4l4m40O40k24r0L61j03%k65K25n9q9k0P1K73k77L6j66
3102a05J2K46M4J64m57o3J68j61Mj41N45j78k31M9K71j91k81L24m5km12M04k38
3125b74J84R3p2P9k26K64JJ67j48L8k33NL2J71j03k09K19j5k8J75l2n0j74j90
3149c26K91J76j86k1O7k36J93K82k41R8L7k68M7K13j21J12P6k4j90P9J10l65J5
3172a82l0P0k8J1o3J29K06l76J11R2K11l23L20k12j50J87j20J10Q4j77J09k11
3194b32L92P9j78j04K15m65L78j24om3j8K81m19K53J86k64k7N5l22L25j81L60
3216A41O1j82J56k48K60j81P7j65K72k07n9k83R1N54m00K3j1J98k02J7J35j48
3238a01M2J08L3r3Q3l1k36L64R9m00j04J35P0l4J0J4K47k62K83k04k8M06m16l2
$$ plain form
3262 -47 -136 131 -17 192 156 -26 -31 172 91 -200 -13 107 245 -215 -103 167 -135 -78 22 113 62 -255 -192
3285 -192 165 261 -89 78 111 84 -100 -36 -93 -117 140 42 -19 -122 80 -221 -93 -99 80 -18 -3 40 -52 -71 -126
3310 -126 86 204 -62 40 64 51 -1 -1 78 -89 -13 15 34 -75 -309 -265 -126 -35 -184 89 202 124 -21 -45
3334 -45 36 67 -60 260 -69 60 185 -61 33 6 116 -204 459 266 37 -132 115 190 31 -30 111 -242
3356 -242 89 -139 37 90 -228 111 51 -53 95 101 -150 -222 -257 -2 -267 -103 75 301 -195 -54 155 -9
3378 -9 -106 193 210 -215 -106 -62 259 8 179 158 132 215 -292 -161 176 189 -101 -138 52 -125 -261 -29 135
3401 135 28 87 -178 -172 46 83 260 15 107 87 28 -261 59 106 -66 -190 -275 -28 54 -340 270 -32 -50 -246
3425 -246 -78 20 -32 -87 170 -77 18 28 34 204 -120 133 -62 42 92 27 72 7 162 105 -206 206 -66 -134
$$ packed form
3262d7q9K67j48K09l6j82nK03q1k91J87J20J38m60J12K70l02N7J00R1n1l17O3
3285a92L57R6l50J67L3k7j84O4n7k4K57r8o1j03K02l01J28oJ79r8J5M3r2j9n5
3310a26K12J18k66J02K4j3n2%P9j67P6K8J9j09k34M4J39R1j49K73J13p8j45k4
3334d5Q1L1j27L20l29J29J25k46R4k7J10l20O63j93k29j69K47P5j59o1J41l53
3356b42L31k28J76N3l18L39o0j04J48Ok51p2l5K55k65J64J78K26m96J41K09j64
3378ir7K99J7m25J09M4L21k51J71k1k6Q3n07J31L37J3k90l7J90j77j36K32J64
3401A35j07N9k65OK18L7J77k45R2k0n9k89L20M7j72j24q5K47Q2l94O10l02j8j96
3425b46J68R8n2n5K57k47R5J0OJ70l24K53j95J04N0o5M5o5J55n7l11M12k72o8
$$ plain form
3449 -134 216 96 126 -121 15 233 193 244 -5 81 172 41 31 11 31 -69 9 219 9 -116 -164 31 55 -147
3473 -147 -303 86 -137 46 -38 -46 -110 -296 62 -69 19 41 -142 -28 -30 284 177 79 -11 -50 -136 -76 -144 -15 -41
3498 -41 187 -198 -59 72 76 -217 -117 -167 31 212 185 28 71 -273 -330 -128 90 -23 257 -7 -35 243 -129
3521 -129 17 -16 -211 -226 -80 108 -58 147 11 -162 108 -48 -115 68 -206 -5 88 -51 233 186 -78 -109
3543 -109 -85 -178 50 32 35 -36 -38 -222 23 124 156 -301 76 132 21 210 196 19 -104 -16 -312 -2 -48 -33 3
3568 3 140 69 -2 148 -103 -45 -324 -59 -212 109 -29 -235 -61 384 86 -21 -178 67 -67 -236 13 -126
3590 -126 -110 179 5 -11 -77 265 101 73 153 25 146 -137 76 221 91 103 192 -266 -55 378 1 -112
3612 -112 -160 -31 196 -89 -54 -64 -183 -15 -41 -38 -61 210 -177 68 31 185 -110 82 179 -164 72 -90 -130
$$ packed form
3449a34L50j20L0k47J36K18m0N1k49Q6R1j31j0k0K0j00P8K10k10j25m8J95K4k02
3473a47j56L89k23J83q4qo4j86L58j31Q8K2j83J14kL14j07r8r0l9q6O0o8J29k6
3498d1K28l85J39J31Mk93J00n0J98J81k7j57M3l44n7K02K18j13K80k64k8K78l72
3521a29J46l3j95j5J46J88j66K05j36j73K70j56o7J83k74K01R3j39K84m7k64l1
3543a09K4r3K28j8Lp1kj84K45J01L2m57L77N6j11J89j4j77j23Q8k96L10m6J5L6
3568CJ37p1p1J50k51N8k79K65j53L21j38k06J74M45k98j07j57K45j34j69K49j39
3590a26J6K89j74j6o6L42j64k8Q0j28J21k83K13J45j30J2Q9m58K11M33l77j13
3612a12m8J29K27k85L5j0j19J68k6Lk3K71l87K45l7J54k95J92R7l43K36j62m0
$$ plain form
3635 -130 258 130 85 78 -75 -268 149 178 213 -156 6 -178 -53 -94 -167 -76 163 122 135 -30 24 49 -23 -79 8
3660 8 56 116 85 240 370 142 198 54 -49 34 244 -21 -230 -54 -225 251 107 129 79 129 -157 -63 -50 67
3684 67 -174 112 290 16 12 97 -18 -75 73 -92 6 39 91 88 -164 -174 -156 -194 113 -146 211 -58 -61 -110 -12 -40
3710 -40 -141 -122 -211 130 379 -26 -170 104 141 -36 -200 101 67 75 -119 42 -192 71 -33 97 -217 -235 -68
3733 -68 -162 115 25 -50 -14 103 184 218 92 332 -365 342 -50 184 -85 -47 -10 -56 8 -19 -8 63 96 -60 -231
3758 -231 121 -60 -254 243 -154 -120 71 -48 120 58 -186 75 110 270 -29 144 150 -36 -106 155 211 -243
3780 -243 152 193 26 -9 319 75 -129 2 -77 -76 -16 43 -430 135 212 137 335 -100 -13 -6 -212 56 56 2 205
3805 205 -32 97 -103 -185 50 -66 81 87 32 18 190 92 -88 -201 311 142 -86 -101 108 -279 46 -113
$$ packed form
3635a30L88j28m5pj53j93M17K9L5l69J62j84J25m1p3R1K39m1J3j65N4K5p2n6Q7
3660HM8O0l1J55J30k28N6j44j03Q3K10k65k09J76j71M76j44K2n0N0k86R4J3J17
3684F7k41K86J78k74mQ5j15n7J48j65R8L3N2lk52j0J8l8L07k59L57k69lm9R8k8
3710d0j01J9q9L41K49m05j44K74L7j77j64L01l4Qj94J61k34K63j04J30l14j8J67
3733f8r4K77r0p5L6J17Q1L4j26K40o97P07l92K34k69L8L7m6O4k7J1P1L3j56j71
3758b31L52j81j94M97l97L4J91j19J68o2k44K61L5J60k99J73Oj86p0K61N6m54
3780b43L95M1j67l5L28k44k04J31p9JO0N9m73N65P7p5J98m35Q7Pk06K68%n4K03
3805B05k37J29k00q2K35j16J47On5j4J72r8j80j13N12j69k28j5K09l87L25j59
$$ plain form
3827 -113 -168 200 -327 46 64 -164 -115 -51 259 -73 148 59 -329 -94 -374 161 178 1 -166 -170 -140 50 -126
3850 -126 -196 -40 256 -75 169 -31 -186 45 -93 174 -61 -72 12 116 -64 -76 8 61 -292 87 10 58 160
3873 160 -25 137 190 39 -56 -61 -50 -86 -307 -168 -17 -205 -231 65 -96 98 193 -142 -6 -61 161 -93 -264
3896 -264 49 110 -48 -51 209 216 -276 -35 -173 -277 -46 -107 247 -53 -20 64 271 63 58 -17 -14 -109 17 -51 97
3921 97 108 18 -23 -123 5 -7 72 -7 69 70 196 -126 -11 -48 10 -114 184 86 -109 177 -179 164 4 -8 -46
3946 -46 171 -226 -30 -45 52 92 -10 172 185 3 -32 160 -95 125 -4 93 54 -39 -201 58 96 -152 306
3969 306 171 -171 306 238 122 128 -8 -170 213 79 224 -187 68 -161 -196 -10 -111 -67 -19 271 -116 -131
3991 -131 -14 -106 -74 101 -160 42 34 52 -7 22 -30 -37 174 0 26 121 255 -324 97 64 83 199 175 -121 -176
$$ packed form
3827a13n5L68n27L73J8k28M9O4L10l32K21q9l88K35k80N35J7j77j67mL0J90j76
3850a26p0J56K96l31K44k00j55K31j38K67k35j1Q4J04j80j2Q4N3l53L79p7M8J02
3873A60j85J62N3j51r5nJ1l6k21J39J51j88k6K96j61J94R5l35J36n5K22k54j71
3896b64L13O1j58lK60Pm92K41j38j04K31o1L54l00L3Q4K07k08np5Lr5J26o8J48
3921I7J1r0m1j00J28j2P9p9P6JJ26l22J15l7N8j24K98r8j95K86l56L43j60j2l8
3946d6K17l97J96j5R7M0j02J82J3j82l5J92k55K20j29R7l9r3j62K59L8k48M58
3969C06j35l42M77o8j16Oj36j62L83j34J45m11K55k29l5J86j01M4M8K90l87j5
3991a31J17r2L2J75k61K02qJ8n9K9n2pK11j74K6R5J34n79M21l3J9J16k4k96n5
$$ plain form
4016 -176 59 93 -58 315 -60 138 5 178 -98 -89 5 123 67 -47 107 -67 -10 -124 227 -274 -164 297
4038 297 38 -210 -69 13 -210 -96 -107 146 184 -28 74 -97 30 -18 -396 21 -101 -217 66 50 159 102
4060 102 -35 249 -45 145 -81 -42 -105 27 95 272 291 -43 -102 -319 -104 247 266 34 -55 31 -17 170 93
4083 93 42 -119 -179 438 -235 143 46 -93 0 -47 -296 -51 65 160 66 -76 -75 13 41 34 52 137 -249 23 244
4108 244 -135 55 -35 -182 -103 -28 97 -31 -35 -9 -99 154 82 -33 15 2 3 -216 -12 -17 -73 84 211 -141 166
4133 166 291 -163 56 -128 3 -258 -73 -286 -62 -61 -100 -156 138 -216 -182 89 -38 -182 25 -92 72 -94
4155 -94 -68 298 -160 -28 101 -26 -92 -165 -128 39 133 130 0 123 -148 -42 -137 -180 75 -150 -6 70 -308 52
4179 52 147 -206 68 73 43 -118 -17 51 40 397 -1 -108 134 205 -115 -3 -2 146 -43 -4 -88 12 -120 -66
$$ packed form
4016a76K35L4j51L73l75J98j33J73k76RR4J18n6j14J54j74N7j14L51n01J10M61
4038B97k59k48J41Q2k23J14j1K53L8k12J02j71J27m8l78M17j22j16K83j6J09n7
4060A02j37K84k94J90k26L9o3J32O8J77J9l34n9k17K15L51J9k32q9Q6m8J87p7
4083I3n1j61o0O17o73L78r7j39R3m7k49K45J16R5r4j42JQ8K8pJ8Q5l86K72K21
4108B44l79J90r0j47P9P5J25j28mK6r0K53p2j15M8j3Jk19K04nn6J57J27l52L07
4133A66J25m54K19j84J31k61J85k13K24Jl9n6K94l54L4K71j27j44K07j17J64j66
4155i4K6L66m58J32J29j27o6p3L7J67R4lj30J23k71J06r5m3K55k25J44P6l78L60
4179E2R5l53K74Nl0j61J01O8j1L57l98j07K42P1l20J12JJ48j89L9q4J00j32N4
$$ plain form
4203 -66 191 140 -11 12 -172 -295 -376 52 61 214 -25 62 66 -177 -90 -13 282 -63 -198 -219 -51 52 -17 5 -92
4228 -92 -75 4 -73 -44 42 -31 181 -81 175 -109 156 27 -100 27 119 -88 198 -123 0 -74 -32 -35 -241 159
4252 159 122 292 112 -54 102 23 -72 -80 -86 -26 -158 -119 2 -97 52 -26 -127 176 12 -9 -41 -34 -57 -282 109
4277 109 -234 152 -232 -222 -95 280 -381 -3 -3 112 71 15 83 19 53 69 -11 -6 -115 -303 -234 -63 -14 -155 48
4302 48 -16 -31 -91 77 16 164 60 82 142 -44 146 161 -54 -58 -81 -164 0 -49 83 -66 82 -10 -86 14 -80
4327 -80 170 318 -88 26 67 83 208 -70 204 -125 -104 -122 108 -255 -38 149 -7 -30 35 161 56 34 124
4350 124 35 100 70 -94 -17 -153 -265 -28 -5 -45 -55 5 -43 -39 93 -12 -107 -175 -134 239 -34 -91 8 -188 7
4375 7 89 -121 61 -27 329 -137 -42 9 44 -276 313 188 120 -17 -129 57 100 200 -126 -140 51 -135 105
$$ packed form
4203f6K57n1j51K3j84j23q1M28RJ53k39Q7Mk43Q7P7K95l45j35k1J68J03o9K2r7
4228i2J7P9p7K9Q6p3K12k62K56k84K65j29j27J27R2k07K86l21J23p4M2lk06M00
4252A59l7J70j80j66J56p9r5qoO0j32L9J21r9J49p8j01L03j64k1l2Pk3k25L91
4277A09l43L86l84J0J27L75o61L78%J15m1n6O8o4L4J6q0Nj09j88O9J71M9j41K03
4302D8o4j5o0J68o1J48j04K2O0j86J90J5k15mk3q3J64m9J32j49J48r2p6J00r4
4327h0K50J48m06J14M1J6J25k78K74l29K1j8K30l63K17J87j56k3O5J26j05k2R0
4350A24q9O5l0j64P7j36j12K37K3m0j0O0m8MJ32j05r5o8M1L73k73n7R9j96J95
4375GQ2k10J82q8L56m66R5N1L5l20N89j25o8j37j12J86M3J00l26j4J91j86K40
$$ plain form
4398 105 113 1 421 -309 74 -125 -15 -28 -55 107 133 -145 5 -131 -209 218 0 -33 202 -25 -208 173
4420 173 58 130 -190 34 38 -45 -78 30 -239 105 54 -201 -75 -72 13 134 -168 -244 163 -245 -52 -117 241 -100
4444 -100 144 162 266 200 -89 120 410 9 -125 -96 36 154 -78 5 -29 42 -73 -379 139 -72 -136 115
4466 115 -21 8 95 -118 -81 43 47 -47 154 -25 25 -91 37 -136 106 -101 12 50 90 -1 237 -60 -144 174
4490 174 1 -32 97 -22 60 -27 -39 -46 -74 177 170 122 20 68 -99 66 178 33 -59 111 -74 -305 -161 -63
4514 -63 108 22 -98 -223 -56 -176 97 7 53 -420 -304 -243 73 12 7 -142 32 -93 -53 224 -403 -179 112
4537 112 -151 155 -66 31 -136 35 -33 -113 25 7 29 51 -46 88 99 -90 -305 4 -132 116 -10 -71 28
4560 28 -176 -56 -237 2 -74 8 243 -296 298 195 79 -137 -61 28 -106 22 -98 67 69 -268 308 96
$$ packed form
4398A05Qj12M20p30L83j99J10j3k7J62K6k78J50j36p8M27k18l3K35k27j83L81
4420A73j15P2l20K24Mq3l3J08k69L44n1k55J26LQ5J21l02p6M07m08J93o5L58l41
4444a00K44J8J04o6k89K09K90m01j34K9J32J18k32Q3l4P1j15l06N18k11o4K51
4466A15j36K9Q7k13L7J24Mr4K01j79N0j16J28j73K42k07J13L8M0r1K38k97q4L18
4490A74j73l3J29j19Q2q7j2pk8K51pm8j02M8j67J65J12j45r2J70j85k31J44R8
4514f3J71q6j20j25J67j20K73r0M6m73J16O1L16o1nj49J74j25M0K77o27K24K91
4537A12k63L06k21R7j67J71o8q0J38j8K2K2r7J34J1j89k15L09j36K48j26o1R9
4560B8k04J20j81K39p6Q2K35n39N94j03j16k16P6Q9j34J28j20J65Kl37N76k12
$$ plain form
4582 96 69 53 -60 119 -118 -24 159 -124 -180 32 -135 -146 43 -166 -97 5 -240 162 -26 -14 -29 47 49 -131
4606 -131 138 58 -100 79 -109 101 82 -15 -202 10 -31 -26 182 -99 -183 -207 -136 189 -115 108 -30 -297 -281
4629 -281 -305 -84 -319 56 265 -15 -194 49 8 -409 -32 -187 -175 -184 65 251 55 -372 -2 -42 -6 -72 -147
4652 -147 95 7 -142 21 -5 267 -145 -96 -10 206 -6 -262 153 63 -184 -45 91 -8 -116 -144 155 56 90
4675 90 -78 -12 -132 181 -68 -118 -63 86 325 53 47 17 -99 -121 65 -27 21 -150 -89 -58 98 119 -333 39
4699 39 -81 -91 -224 -5 -159 -155 279 -72 133 -197 -87 62 -55 21 -133 -156 189 105 -329 -112 -31 54 210
4722 210 -179 -2 -133 -374 293 274 -37 187 -92 -64 -76 50 162 175 -143 -124 128 -313 -59 -78 143 49
4744 49 -270 -36 70 -205 -111 -213 -148 16 -65 -61 253 139 -163 402 -221 133 -44 40 -187 56 210 124 159
$$ packed form
4582I6k7j6j13J79k37R4J83k83n6K12j67j1J89k09O9J02k45M02j88J2j5P6Kj80
4606a31K69q0j58J79j88K10j9r7j87K12m1NK08k81q4k4P1L25l04K23j38k67J6
4629b81k4K21k35L75K09k80j79K43m1m17L77j55J2rK49J86j96m27L70m0L6o6p5
4652a47K42q8j49J63k6K72m12M9Q6K16k12k56M15r0k47J39J36r9j08k8K99r9L4
4675I0j68O6j20L13k49n0N5J49K39k72ol0j16k2J86r2M8j71O1L1J56K1m52L72
4699C9j20j0j33K19j54MM34l51K05l30J10J49j17P6j54k3L45q4m34K17Q1Q5J56
4722B10l89J77j31k41O67j9l11K24k79K8j2J26J12J3l18J9K52m41K54j9K21r4
4744D9l19K34J06k75R4j02O5J64q1ML14j14l02N65o23L54j77Q4k27K43J54q6L5
$$ plain form
4767 159 -45 4 51 26 94 -28 53 -50 -85 -118 -193 118 118 57 -149 -42 -150 -86 9 -180 -109 -76 47 55 65 19
4793 19 78 139 -44 5 -53 89 -83 170 -73 249 -123 9 401 57 -192 -14 184 -121 -80 -12 109 -172
4815 -172 -28 92 130 147 -11 160 67 35 -104 -133 -71 83 -106 34 26 -199 199 111 -31 195 -108 -50 155
4838 155 -252 289 -44 -102 57 -61 124 -138 19 -8 -127 -192 -43 200 8 58 -90 -115 2 24 62 -69
4860 -69 -30 -15 -11 -173 94 86 -159 -6 -376 48 5 -138 67 20 232 -72 -185 -173 160 -49 113 22 -21 0
4884 0 -416 -23 190 -28 37 -143 13 -175 -234 -116 -78 267 -72 135 -128 174 -85 168 88 4 -137 90
4906 90 -44 -122 -103 187 85 157 42 -17 131 40 133 -7 181 -147 200 84 -168 -21 359 3 -183 137
4928 137 -14 -205 -26 141 112 157 -118 -57 53 -255 58 -127 34 103 -87 -59 -71 -106 60 -70 211 237 14
$$ packed form
4767A59k04M9M7k5O8j22Q1j03l5l3p5L11%o1k06J07j08O4R5j89P1L3J23QJ0m6
4793A9N9O1j83M9n8J42j72K53k43L22l72J32L92l44k49J78J98l05M1O8J21k81
4815a72J44J20L8J7j58J71r3l2j39k9O2J54j89J40qk25L98q8j42K26l03N8K05
4838A55m07N41l33n8J59j18J85k62J57k7j19o5J49K43j92N0j48k5J17K2L8j31
4860f9L9J5Mj62K67qk45J53l70M24m3j43K05m7K12l04j13J2L33k09J62r1m3K1
4884@m16L93K13k18O5j80J56j88n9J18L8L45l39K07k63L02k59K53q0q4j41K27
4906I0j34p8J9K90j02P2j15n9J48r1R3j40J88l28L47j16k52J47L80l56j86L20
4928A37j51j91J79J67k9M5k75O1J10l08L13j85J61O9j90K8j2l5J66j30K81K6k23
$$ plain form
4951 14 37 -236 -211 100 147 -16 -2 -137 103 10 29 -9 -123 156 62 -291 188 -29 133 26 -100 106 47
4974 47 -362 -164 24 -235 -63 277 -13 -119 17 -370 -40 49 28 47 -301 58 -54 166 36 -67 84
4995 84 -17 -108 48 162 -65 -57 74 350 140 37 348 -107 52 -92 107 177 120 126 245 -116 -31 121 -143
5018 -143 48 -67 44 192 77 -57 -503 -161 -130 30 -48 -100 150 -248 147 -105 57 78 -1 -48 -48 -20 -54
5041 -54 45 22 79 88 47 187 68 -54 -150 19 -35 -160 157 -69 -14 -106 42 260 228 9 -68 149 73 69 3 204
5067 204 64 -223 132 -121 20 -76 -31 111 192 -4 152 158 -124 29 -92 118 -166 -104 -102 57 -95 -54 -340
5090 -340 184 -140 -92 20 -82 91 65 -25 -112 99 32 161 -7 -30 -67 238 -93 -161 -3 21 -48 3 35 23
5114 23 -114 -52 -38 -30 12 -145 -72 95 36 -271 -2 275 226 -130 98 154 -87 -67 64 -261 -229 122 -1 123
$$ packed form
4951A4K3k73K5L11M7j63J4j35K40r3J9l8j14K79r4l53M79k17J62j07j26K06n9
4974D7m09J98J88k59J72L40k90j06J36l87L30Q9k1J9l48L59j12K20j30j03J51
4995H4j01r1J56J14k27QJ31K76k10j03L11m55J59j44J99P0n7OJ19l61Q5J52k64
5018a43J91j15J11J48j15j34m46L42L1J60p8n2K50l98L95k52J62K1p9m7%K8l4
5041e4R9k3N7Rm1J40j19j22r6J69n4j25L17k26N5r2J48K18l2k19p7K17p6mo6K01
5067B04j40k87L55k53J41r6M5J42Q1j96J56Ok82J53j21K10k84O2KJ59j52M1k86
5090c40N24l24M8J12j02J73k6r0q7K11o7J29j68k3l7L05l31o8J58K4o9N1L2j2
5114B3j37O2J4QM2j57P3J67n9l07K69K77m9l56K28N6k41K0J31l25L2L51j23J24
$$ plain form
5138 123 39 119 1 -64 -188 175 203 125 -26 242 45 -71 -106 -36 48 65 -20 50 -147 286 48 36 -66 47
5162 47 -226 59 26 164 -165 -8 -105 -24 -20 12 42 -117 26 90 44 55 34 -132 -60 -290 -87 -19 210 120 341
5187 341 -61 96 165 322 -175 136 -138 61 -235 111 -49 -292 136 -142 86 1 39 18 -121 -126 219 -1
5209 -1 104 -103 -109 157 -162 28 63 -143 133 -101 115 246 380 165 -69 -149 -19 114 -137 -2 -224 -105
5231 -105 -125 164 -35 -214 198 -58 43 117 196 126 247 79 -30 -9 -158 -94 -11 -213 75 216 44 -108
5253 -108 43 -18 139 98 253 -107 286 -65 -148 -37 -32 -74 -100 -56 -122 -28 -4 2 -198 122 51 106 467 92 -64
5278 -64 250 -271 -63 57 111 249 64 24 96 -56 -127 60 -27 -76 -326 87 -128 56 327 56 100 -211 -349
5301 -349 -11 -154 -14 38 -30 -158 -149 -121 -242 28 12 158 29 72 -110 -59 174 215 39 65 1 221 -44 -171
$$ packed form
5138A23q4Q0j18o5j24L63K8p8j51K68j97j16l5P0Q4J7q5P0j97M33k38j2j02J13
5162D7k73K85l3J38l29J57r7Q1ML2L0j59J43O4m6J1k1j66P2k30K03O8K29r0K21
5187C41m02J57O9J57m97L11k74J99k96L46j60k43M28k78K28q5L8k1j39nL45k20
5209aJ05k07oK66l19J90L5k06K76k34K16J31J34k15k34q0J30J33k51J35k22J19
5231a05k0K89j99j79M12k56J01P4P9p0J21j68j09K1j49O4Q3k02K88J41j72j52
5253a08J51o1J57m1J55l60L93l51q3J11Nm2k6M4o6R4K4Ok00L20p1N5L61l75j56
5278f4L14n21K08J20N4J38j85m0P2j52p1J87q7m9k50M13k15J84K71k71M4l11j38
5301c49L38j43J40N2o8j28RK8j21K70j6J46j29M3j82N1K33M1j76K6o4K20k65j27
$$ plain form
5325 -171 168 -94 33 -39 136 147 284 4 -87 21 140 -67 170 -179 -189 -12 -73 208 85 -35 -218 125
5347 125 41 -160 19 -7 -79 48 49 -2 -118 182 135 -31 -37 -17 -63 -277 -58 54 -33 -42 144 74 201 -116 -203
5372 -203 360 -80 48 44 128 -1 30 -245 -78 -41 -167 187 203 22 137 -15 238 -60 -63 55 296 86 -274
5395 -274 264 96 -81 96 -103 -40 -125 -145 -177 170 -88 17 130 7 0 105 333 14 49 41 -53 46 -71 204
5419 204 50 -49 119 -145 181 243 276 72 -52 -32 41 -148 -56 17 312 246 112 -122 -161 285 0 -110 38
5442 38 14 -49 -158 103 166 47 -280 155 150 214 -19 -36 -143 135 -28 -57 104 161 -293 97 -146 24 246
5465 246 -2 96 34 160 -213 133 6 95 -388 15 33 -163 200 -11 131 -44 45 -52 -183 -213 83 7 -57
5488 -57 136 -134 -64 -65 53 29 -176 -133 76 -264 -84 -1 -34 223 -289 -185 19 282 -92 153 17 -269 -16
$$ packed form
5325a71L39k62J27p2J75J1J37k80r1J08J19k07K37l49j0J77o1K81j23j20j83L43
5347A25q4k01J79k6p2J27Jn1j16L00m7j66oK0m6k14K19J12q7rJ86p0J27l17q7
5372b03N63m40J28mQ4j29L1k75J67L7j26L54J6j81J15j52K53k98lJ18K41k10l60
5395b74N38j68j77J77j99O3q5k0l2L47k58J05J13j23pJ05K28l19L5qr4R9j17K75
5419B04j54r9J68k64L26O2L3k04j24K0P3j89R2P3K95o6j34k34l9M46k85j10J48
5442C8k4o3j09K61O3j19l27M35nO4k33j7j07K78j63k9J61N7m54L90k43J70K22
5465B46k48R8o2J26l73L46j27Q9m83M03J8j96L63k11J42j75Q9r7j31l0K96p6o4
5488e7J93k70P0jJ18k4k05M3K09l40J80Q3l3K57n12J04K04K63l74K45j36k86K53
$$ plain form
5511 -16 128 74 14 58 13 196 79 69 114 -249 307 49 82 -144 3 -164 -91 70 -195 225 -88 -38 101
5534 101 -208 -275 -137 -82 182 -130 -271 -5 -27 105 -119 -1 34 114 205 113 -370 66 -35 -280 28 142
5556 142 -298 185 2 97 -11 -76 -124 198 -166 -185 5 -14 -25 40 -76 -19 -46 -421 -42 1 111 -43 -111 213
5580 213 -133 274 -86 6 -44 -286 77 -225 48 -17 188 43 249 -96 -22 27 83 134 165 -56 57 178 143
5603 143 -118 384 182 134 42 116 -123 -110 -120 144 238 179 -181 48 69 -167 130 -247 162 3 63 -147 113
5626 113 -80 8 -187 -134 274 -155 -27 -14 78 -91 -97 -183 181 55 64 107 -143 156 -19 293 93 -112 172
5649 172 155 -76 -98 122 -122 235 -7 175 -245 -79 -176 81 -92 170 180 -88 -103 -64 -18 -64 -93 408 163
5672 163 -160 -221 -6 -253 -165 380 -150 -126 -60 122 -188 -28 -81 90 192 69 132 217 10 -154 187 4
$$ packed form
5511a6J44n4o0M4m5J83j17j0M5l63N56k58L3k26J47j67P3J61k65M20l13N0J39
5534A01l09o7J38N5K64l12j41K66k2J32k24J18L5Q0R1r2m83M36j01k45L08J14
5556A42m40M83j83R5j08o5m8L22l64j9J90j9j1O5j16N7k7l75L79M3J10j54o8L24
5580B13l46M07l60R2n0k42L63l02K73o5K05j45K06l45P4M9N6N1L1k21J13J21l5
5603A43k61N02k02m8r2P4k39J3j0K64R4n9l60K29K1k36K97l77M09j59O0k10K60
5626A13j93Q8j95N3M08m29J28J3R2j69oq6L64j26RM3k50K99j75L12k00k05K84
5649A72j7k31k2K20k44L57k42J82m20J66r7K57j73K62J0k68j5L9M6m6k9N01k45
5672A63l23o1K15k47Q8N45n30K4O6J82l10J60n3J71J02j23O3Q5k07j64L41j83
$$ plain form
5694 4 -188 117 -10 -81 195 182 121 298 68 -56 233 91 -124 -103 -49 233 -55 -17 226 -113 -202 -3 -142
5717 -142 -285 -72 11 14 110 -77 202 -181 80 -239 -158 182 -85 -46 217 -212 -74 49 75 158 -38 -94 46
5740 46 263 -111 -148 -28 -87 238 91 -318 76 -7 82 51 -7 -135 -212 -45 -133 -85 112 12 123 23 -391
5763 -391 -87 -171 -94 75 133 -229 60 15 34 -43 -28 62 11 -96 117 -205 -111 45 -150 16 -349 140 12
5786 12 53 82 43 -37 78 -77 205 -22 -61 -9 -117 -31 191 -149 -47 -82 89 -224 -267 -314 -201 82 65 -95
5810 -95 -79 -264 -150 328 71 49 -55 -101 -42 60 83 -50 -78 16 -103 243 205 108 -29 82 -77 186 -59
5833 -59 209 35 192 -68 -64 -74 -88 -207 -136 -26 100 96 -129 47 -14 -234 54 -333 -128 -96 -119 148 -28 276
5857 276 221 -132 -40 68 -113 130 37 -203 -47 -190 6 -84 230 -240 7 201 52 -67 -31 -10 -187 63
$$ packed form
5694Dj92L05j27p1K76j3o1J77k30j24K89j42k15K1N4K82k88L8K43l39q9J99j39
5717a42j43K13Q3LR6j87K79l83K61l19Q1L40k67L9K63m29J38J23K6Q3j96n6J40
5740D6K17l74l7J20n9L25j47m09L94q3Q9l1n8j28p7J67q8M8J97j00J11j00m14
5763c91L04q4P7J69N8l62K89m5J9p7J5R0n1j07K13l22R4J56j95J66l65M89j28
5786A2M1K9l9q0J15j55K82k27l9N2j08Q6K22l40J02l5J71l13m3m7J13K83j7j60
5810i5J6j85J14M78k57k2j04m6N9J02K3j33k8R4j19L46l8r7j37J11j59K63k45
5833e9K68j74J57k60Mj0j4j19P1J10J26mk25J76o1k20K88l87K05L2k3K67j76L04
5857B76n5l53R2J08j81K43r3k40J56j43J96r0L14m70K47J94j49j19L6K1j77K50
$$ plain form
5879 63 -167 -77 -18 -24 -121 -280 237 93 22 -133 37 125 -272 -133 192 22 -53 -8 -113 49 -293 151 142 24
5903 24 1 117 91 -78 -209 38 36 134 -184 -79 -206 151 126 122 303 67 -296 94 137 24 -28 46 89 -43
5927 -43 -11 -264 192 -26 82 -173 -184 -51 182 331 -136 -39 135 94 -311 49 57 -13 80 156 131 -176 -198 -65
5951 -65 63 -12 -64 -31 77 -185 -35 -136 135 103 -392 -109 -41 -112 -77 48 36 62 101 46 48 121 -152 -123 131
5976 131 35 -56 -120 -43 171 -129 -42 -146 -131 26 -33 -207 89 -45 -176 61 30 -14 -5 71 91 -23 -168 159
6000 159 201 13 -96 187 -59 41 -245 245 -114 -309 -11 75 -97 413 -102 36 210 -102 -123 79 139
6021 139 -64 -109 118 65 -18 100 -91 -44 14 102 -174 -12 -162 -161 385 -295 134 -56 36 -30 5 -148 -133 -262
6045 -262 151 178 -463 235 -173 -159 -73 -46 162 -194 136 -36 -59 80 -335 -68 -109 141 75 138 214 -163 220
$$ packed form
5879F3k30R0N9or7j59N17j44p1j55J70Q8l97J39L25j70p5M5j05J62l42M44rj18
5903B4k3J16k6j69j31K47kR8l18J05j27L57k5mJ81k36l63L90M3j13n2P4M3j32
5927d3L2k53M56k18J08k55j1J33K33J49m67R7J74m1m05L60Qp0R3P6k5l07k2J33
5951f5J28p5n2L3J08k62J50j01K71l2m95K83O8p1L5J25j2K6L9n5KP3k73K9K54
5976A31r6r1o4P7K14l00Q7j04J5J57n9j74K96j34j31K37l1m4RP6K0j14j45L27
6000A59M2j88j09K83k46J00k86M90l59j95K98Q6j72N10n15J38J74l12k1K02O0
6021A39k03m5K27n3q3J18j91M7N8Q8k76J62j50JN46o80M29j90R2o6L5j53J5j29
6045b62M13K7o41O98m08J4Q6K7K08l56L30j72k3J39m15K67m1K50o6O3P6l77L83
$$ plain form
6068 220 23 -31 -36 92 -9 -147 147 98 21 47 -73 -8 273 -53 49 14 199 -140 -116 -263 165 -206 -98
6091 -98 15 106 -138 -134 26 46 115 54 73 137 76 8 153 -25 -176 -41 -68 81 -97 124 -61 164 -218 -157
6115 -157 -271 -29 3 -113 -111 97 148 76 -17 59 75 -129 203 -289 -10 -16 326 57 -119 -271 89 52 32 159
6139 159 -24 -7 222 91 -127 131 54 17 131 -60 2 62 -47 -29 -29 95 113 92 -102 131 -57 43 -229
6162 -229 -49 -16 177 -144 -57 -56 176 123 1 -195 85 57 -63 189 73 208 82 203 -125 -169 -154 67 1
6185 1 -34 -47 204 20 39 -187 -67 -177 -37 213 30 163 206 22 118 -115 69 -12 32 85 185 -142 -26
6208 -26 -2 -257 -55 67 -296 -68 339 261 -47 95 -35 -124 -16 -65 -137 -84 191 178 352 -70 141 -249 -60
6231 -60 189 42 139 -86 245 7 -55 76 -332 198 252 44 55 93 -81 -17 202 86 2 131 -108 146 14
$$ packed form
6068B20j97n4nJ28j01j38K94m9p7K6j20O5K81l26J02l5J85l39K4j47M28l71J08
6091i8J13R1k44MJ60K0O9o1J9O4o1o8J45j78j51J35k7J49j78K21j85K25l82O1
6115a57j14K42L2j16KK08N1p2r3P6J6k04L32m92K79oL42k69j76j52L60l7k0J27
6139A59j83J7K29j31k18K58p7l7J14j91O2O0j09J8%J24J8k1j94K33j88J00k72
6162b29J80L3J93l21Q7JK32n3j22j96K80k8j20K52j16J35j26J21l28m4J5K21o6
6185Al5j3K51j84J9k26J20j10J40K50j83J33M3j84R6k33J84q1M4N3J00l27J16
6208b6K4k55K02J22l63K28M07p8l08J42j30q9J08m9p2N3K75j3J74m22K11l90J89
6231f0K49j47R7k25L31k38o2J31m08N30N4k08J1L8j74O4K19j16q4J29k39K54j32
$$ plain form
6254 14 34 134 -20 31 141 179 -14 -107 223 82 -87 -180 -130 49 150 151 87 70 12 32 -12 -7 2 -18 -61 -71 -133
6281 -133 33 87 -45 -24 75 -85 149 159 -75 -40 -174 -45 -65 -17 69 -141 6 -263 149 55 -42 194 103 -11
6305 -11 -33 -80 -177 -47 -38 -206 -45 0 5 -191 201 -96 -33 66 -52 -16 -103 83 162 -60 -48 270 198 44 -47 107
6331 107 8 -73 220 -37 47 -157 -15 75 26 -176 95 -79 -100 -82 110 -4 213 143 160 164 -421 118 65 -113
6355 -113 220 -172 77 -171 123 189 255 -147 43 11 127 74 36 -175 48 88 102 42 198 -4 -147 -29 -176
6378 -176 -4 -53 -262 -29 75 37 -51 71 38 65 67 223 53 125 108 45 125 -110 27 -112 -18 -23 177 217 -2
6403 -2 -72 -205 54 1 -48 10 2 116 -192 105 -34 173 1 -155 61 -21 -109 -58 -13 -19 62 -167 172 -432 -38
6428 -38 -177 108 46 20 178 -215 -129 -186 95 -63 -164 -157 75 40 138 -145 -131 -144 61 -80 -37 -134 369 82
$$ packed form
6254A4K0J00j54N1J10L8j93r3L30j41j69r3N0J79J01Jo4j7n8K0m4NRk0m3j0o2
6281a33J66N4j32K1R9j60K34J0k34L5j34J29k0M8Q6k10J47k69M12r4r7K36r1j14
6305a1k2m7r7J30Rj68J61M5Nj96L92k97O3R9j18L6q7J86P9k22J2L18p2j54r1J54
6331A07r9q1K93k57Q4k04J42R0m9k02K71j74k1J8J92j14K17p0J7Mn85N39n3j78
6355a13L33l92K49k48K94O6O6m02J90l2J16n3l8k11K23M0J4o0J56k02j43J18j47
6378a76J72m9k09K33J04l8q8J22l3K7KJ56j70P2j7o3Q0k35J37j39R4nK00M0k19
6403bp0j33K59n3m9N8qJ14l08K97j39K07j72j56K16q2q8N1M5oQ1k29L39o04L94
6428c8j39K85o2k6J58l93Q6n7K81j58j01PK32l5R8k83J4j3K05j41M3r7N03k87
$$ plain form
6452 82 -13 7 -79 268 55 29 91 -105 -18 -56 202 30 173 106 -111 317 42 37 177 108 -64 -108 -109 -160 184
6477 184 -16 75 6 -186 -149 -54 38 -295 -144 170 1 -40 -57 -57 -143 -75 5 163 -143 -391 -188 -120 74 105 179
6502 179 15 256 60 140 133 148 -146 151 -158 -139 15 -126 38 72 65 -181 108 -129 32 323 34 -93 -25
6525 -25 396 98 57 85 -48 -28 -16 118 -18 -163 78 -142 153 102 -11 37 -29 -205 -56 -133 61 -298 29
6548 29 -75 50 -115 173 -220 177 212 175 -84 -28 -62 32 -75 58 56 24 86 -35 -95 -125 28 -96 -159 175
6572 175 -97 6 103 -23 19 -50 68 -95 -155 90 -190 58 68 -150 -93 134 77 -76 95 -107 -81 -86 183
6595 183 -64 120 -138 -47 -87 -235 24 7 -122 74 33 -107 87 165 -46 -285 -90 321 -49 -15 82 -24
6617 -24 -155 -284 21 -130 7 -175 -202 -154 20 5 157 88 -15 -49 123 127 -76 184 -34 -11 -20 -128 -254 -120
$$ packed form
6452H2r5K0q6L47k13k6O2j96Q7l8K58j72J43o7k17M28k75nJ40o9j72m4jn1L44
6477A84k00R1o9j92L7R5R2l33J51L14j69m1j7%q6O8Q0J58l06k48K03O8J94L1P4
6502A79j64K41j96Q0pJ5k94K97l09J9J54j41J64L4pk46K89k37J61K91k89j27O8
6525b5M21k98m1K8j33K0J2J34j36j45K41k20K95n1j13M8o6j76J49p7J94l59L27
6548B9j04J25j65K88l93L97L5l7k59N6l4R4j07J33kl2O2j21o0l0J53j24o3L34
6572A75k72J03R7j26M2o9J18j63o0K45k80K48J0k18N7K27n7j53J71k02K6nK69
6595A83k47J84k58R1m0j48K59j7j29J96m1j40J94P8k11k39J95M11l70L4R7j06
6617b4j31j29L05j51J37j82k7M8J74j5J52o9j03l4J72Mk03K60k18K3rj08j26J34
$$ plain form
6641 -120 146 106 -272 103 324 -99 49 20 44 47 99 99 95 -133 30 136 -116 5 62 209 192 -156 162 -161
6665 -161 -226 -126 38 35 60 79 -141 136 -43 -189 -110 282 -59 -15 -179 2 248 -46 159 1 169 39
6687 39 -26 232 74 104 -25 180 -99 271 -10 40 158 -66 -199 -7 -106 -107 -37 56 -180 175 -82 -14 227
6710 227 157 -127 99 52 -84 114 -58 187 -111 105 -162 -15 -27 -66 124 32 -100 -35 104 39 106 -215 120
6733 120 253 -48 -113 -116 -19 -225 149 -83 -215 -282 97 -55 -58 -40 -82 -50 31 159 194 2 -253 250 100 93 -180
6758 -180 162 2 180 43 -1 179 -153 -45 3 -1 -57 60 -241 -23 145 -141 1 265 -301 -39 141 230
6780 230 218 -210 110 109 -63 93 90 227 -235 211 29 -52 99 -141 77 -89 -98 168 93 -91 -262 116 167
6803 167 89 144 4 -94 228 23 -301 24 -196 -178 -164 37 8 -46 -146 -28 144 -28 -29 143 204 -320 152
$$ packed form
6641a20K66m0l78L75K21m23J48k9K4LN2%mk28J63J06k52J21N7J47j7l48L18l23
6665a61o5J00J64lK5J9k20K77j79j46P9L92l41M4j64J81K46k94K05j58J68j30
6687C9o5K58j58L0j29K05k79L70k81N0J18k24j33J92r9jP0R3k36L55k57O8K41
6710B27p0k84K26m7j36J98j72K45k98K16k67J47j2l9J90r2j32O5J39o5O7l21L35
6733A20J33l01o5lR7k06L74k32j32o7L79j52lJ8m2L2Q1J28L5j92k55N03j50pk73
6758a80L42j60J78j37m4J80l32J08M8mn6J17l01K18J68k86J42K64n66K62J80Q9
6780B30j2m28L20jj72J56lJ37m62M46j82q1J51k40K18j66rK66p5j84j71L78N1
6803A67p8N5j40r8L22k05l24L25k20J8J4K01k9n4j00J18J72j72jJ72O1n24M72
$$ plain form
6826 152 218 12 151 -56 18 -213 14 37 -111 29 133 35 -136 50 -221 -101 -296 54 -41 -121 -14 -261
6848 -261 -231 -180 90 -86 -159 111 186 -116 -162 73 -59 92 -42 77 122 36 -124 -28 -247 -245 -102 16 -182
6871 -182 156 -24 215 203 -252 222 21 -169 -4 -182 31 -168 -74 -13 -107 158 111 23 -76 44 8 36 -45
6894 -45 247 -16 -143 12 59 40 80 198 69 -53 41 -32 -340 -25 -123 0 153 89 -93 117 -129 -5 -300
6917 -300 33 8 -37 -35 116 111 -131 -52 -7 234 -136 32 -185 -45 297 90 57 79 -237 -134 102 -218 99
6940 99 114 161 -179 -56 96 -204 129 -29 -13 79 96 -166 13 -278 -71 76 194 259 43 137 -129 -65 64
6963 64 32 142 -27 48 -3 -94 111 251 189 -83 -185 166 283 260 -48 -290 79 -178 247 -34 503 -106
6985 -106 54 -116 -113 85 280 -160 -19 -94 -54 65 172 400 -13 -177 29 183 23 199 6 7 -306 -174
$$ packed form
6826A52O6k06J39k07P4k31K27K3j48J40J04r8j71J86k71J20j95L50r5q0J07k47
6848b61L0N1K70j76p3K70P5l02m6K35j32J51j34J19M5q6j60R6k19KJ43J18j98
6871a82L38j80K39j2m55M74k01j90J65j78K13j99R4O1r4K65m7q8r9J20l6K8q1
6894d5K92k63j27J55M7j9M0J18j29j22R4p3l08L15r8J23J53o4j82K10k46J24k95
6917c00L33k5m5KJ51nk42P9M5K41l70J68k17J40L42k07l3K2l16J03K36l20L17
6940I9J5M7l40J23J52l00L33j58J6R2J7k62J79k91K07J47J18O5k16R4k66O4J29
6963F4l2J10j69P5n1r1K05J40o2k72j02L51J17k3l08k42L69k57M25k81N37o09
6985a06J60j70LJ98J95m40J41p5M0J19J07K28m13j64K06J54j60J76j93Jl13J32
$$ plain form
7007 -174 190 -43 369 24 113 1 -96 78 15 -77 -3 94 -183 65 -116 174 349 -24 244 43 -36 61 -219
7030 -219 226 159 209 -82 -27 -161 -59 -283 158 -260 248 121 17 171 54 200 53 -44 324 236 -52 177
7052 177 -39 -73 18 -4 -157 -260 -344 17 172 130 -190 -21 91 41 -61 -8 289 39 21 -39 8 71 64 -231
7076 -231 111 -83 -116 -40 10 -71 -166 -132 191 -84 -228 -165 -47 -142 -116 -193 84 204 -88 32 -54 88 113 -156
7100 -156 -96 10 180 162 59 141 -130 -69 96 -55 -64 -190 -222 -30 -168 247 145 130 -91 -180 -25 21 101 -115
7124 -115 -22 136 -11 -39 111 -78 190 -10 -59 79 81 43 223 106 -129 69 -5 67 -252 146 72 -150 86
7147 86 19 113 -43 -129 56 29 204 32 260 32 180 244 -76 -118 110 -3 13 -137 94 -60 -63 88 -296
7170 -296 8 18 167 -22 71 160 67 -69 -321 52 122 -5 173 -153 -203 -115 129 208 227 -78 162 199 122 -197
$$ packed form
7007a74L64k33M12l45Q9j12r7J74o3r2P4R7k77K48j81K90J75l73K68k01p9R7k80
7030b19M45o7N0k91N5j34J02k24M41m18N08j27j04J54j17J46j47r7L68q8k88K29
7052A77k16l4R1k2j53j03q4L61J55m2l20J69J12n0j02N3K97k50j8o0M7O3pk95
7076b31L42j94l3P6N0q1r5L4L23k75j44O3J18r5K6p7K77J20k92J20q6J42K5k69
7100a56O0J06J70j8j03Q2k71O1J65j51rj26l2J92j38M15j02j5k21q9J55M6Q0k16
7124a15R3J58j47k8J50j89K68k00m9J38Kl8J80j17k35J98p4P2l19L98p4k22K36
7147H6o7R4j56q6J85k7J75j72K28k28J48O4l20m2K28j13J6j50K31j54lJ51l84
7170b96L04J0J49j89R3Q9r3j36k52L73P0j27J78l26n0Q8K44P9J9l05K40L7p7l19
$$ plain form
7194 -197 -206 -135 -54 75 -109 79 109 100 -79 -209 -161 -11 12 -2 47 -56 154 118 -12 20 33 155 147 -169 235
7219 235 25 110 -179 107 190 -96 -329 -34 246 72 -59 236 -64 -57 31 -145 -5 -210 -116 32 4 -300
7241 -300 -27 65 -223 -163 -69 152 94 393 105 117 21 -127 153 -42 132 150 103 82 -76 48 48 -321 150 135
7265 135 202 -143 -16 88 30 28 -184 -67 -213 -11 -21 35 94 44 7 -54 -149 -274 -49 -289 99 45 -78 18
7289 18 -82 -55 -182 -1 52 238 -80 -241 60 -178 -75 94 66 19 -102 155 148 -187 -29 57 5 -241 -139
7312 -139 -263 -141 61 178 144 106 -117 -315 65 147 -145 -165 -309 186 -109 -76 -169 150 5 -197 143 -83
7334 -83 160 23 -9 -108 -51 -151 -9 114 -260 50 -80 30 -81 -128 -37 185 -165 -108 178 102 266 -106 117
7357 117 -52 -191 8 -107 38 74 -158 -58 -36 58 111 -48 -103 86 65 21 -27 -19 -185 -126 89 -262 -135 -106
$$ packed form
7194a97rP1Q1J29j84J88L0rj79j30M8J50K3j4M9j03K10l6j30L2J3J22ql16M04
7219B35k10Q5k89K86Q3k86k33K95K80j74j31K95l00PQ8j76J40k05R4J48k8l04
7241c00K73R2k88O0R4K21n8K99k88J2r6j48K80j95J74J8m7k1j58J24%l69M71j5
7265A35O7l45J27J04n8kk12J17j46K02j0N6N9n0l7o1r5j25K25k40L88n4j23R6
7289A8j00K7j27J81N3J86l18j61L01k38J03J69k8m7j21K57pl35J58Q6n2k46J02
7312a39j24J22K02J17l4l8k23j98L80Q2k92k0j44M95k95L3r3L19j45k02L40k26
7334h3K43j37l2r9N7j00J42J23l74L10j30J10j11m7R1K22l50N7K86p6J64l72K23
7357A17j69j39J99j15J45L6k32J00K2R4N3j59n5J89k1m4m8Qj66N9K15l51J27K9
$$ plain form
7381 -106 -38 171 0 45 -1 -79 152 -8 88 3 0 -22 -44 -194 -91 -186 -72 114 -187 194 78 247 -42 -40
7405 -40 134 -72 -103 -130 -94 -101 63 20 265 61 -343 30 179 4 -222 60 -24 203 -366 -48 350 17 -10
7428 -10 196 33 -28 161 185 -122 -181 61 -129 -112 99 -302 161 -123 -258 110 -14 -112 -5 208 133 -131
7450 -131 130 -112 -42 -164 -69 -2 -214 -38 -78 -239 -1 -61 -193 -143 -223 -87 27 -130 294 209 -227 135 -54
7473 -54 118 49 104 -82 302 279 -181 83 71 -4 96 395 -14 -79 55 117 -1 -31 -78 178 -180 32 281
7496 281 21 103 -74 -113 76 35 -421 250 163 258 79 -178 101 -79 138 233 -43 -150 -105 65 135 90 -27
7519 -27 48 16 1 -32 132 29 -174 -238 6 77 127 -62 -20 113 -250 140 55 -46 -175 -103 -19 -15 5 -58 -155 -242
7545 -242 154 58 225 -109 -25 -58 -160 257 195 -51 210 -85 -214 -32 -108 -41 -43 191 266 -52 54 141 -174
$$ packed form
7381a06O8K09j71M5m6p8K31j60R6q5lk2k2j50J03r5J14J86l01L81j16J69k89K
7405d0J74k06l1k7L6pJ64m3K45k04m04L73J49j75k26K82q4K27n69L18L98l33k7
7428a0K06j63o1J89K4l07n9K42j90J7K11m01M63k84j35L68j24r8J07K13p5k64
7450a31K61k42P0j22R5O7k12J76m0j61K38o0j32N0q0J36J14j57M24q5m36L62j89
7473e4J72o9N5j86L84k3m60K64j2p5J00K99m09o5J34O2j18l0m7K56l58K12K49
7496B81k60Q2j77l9J89m1m56O71q7R5j79k57K79j80K17R5k76j07M5J70P0m5j17
7519b7P5l2j5l3J64j03k03o4K44P1N0j89M2J33l63L90q5j01j29P2Q4MK0o3r7q7
7545b42L96r6J67l34Q4l3j02M17o2k46K61k95j29J82p6O7kK34P5l18J06Q7l15
$$ plain form
7568 -174 -293 -85 256 42 -176 29 -24 -25 -16 59 151 -392 131 149 124 141 -31 2 76 -40 113 23 247 14
7592 14 -154 79 -95 190 43 -85 191 -14 -56 -169 21 137 -63 -369 70 -222 -128 63 -240 111 226
7613 226 52 -34 125 34 1 -13 109 149 -3 102 43 -109 84 59 54 26 44 -45 120 215 59 20 69 276 149
7638 149 176 184 60 153 124 147 42 169 67 67 -82 82 391 -43 -241 -204 117 -102 -17 172 53 -42 -49 -264
7662 -264 46 15 174 174 -144 68 14 -48 288 -147 41 170 51 -160 42 212 -31 -221 -96 129 29 -178
7684 -178 -181 -207 57 -53 128 137 183 278 39 -61 -68 -173 -18 -62 20 151 -174 138 -207 330 184 -20 -4 31
7708 31 -1 174 -122 75 185 135 235 24 -6 72 99 5 91 -78 167 -33 -138 -88 -50 106 25 65 410 -80
7732 -80 -55 3 -146 4 -103 103 119 -290 0 -25 -232 70 81 7 62 287 -21 -5 142 -152 64 115 113 56
$$ packed form
7568a74j19K08L41k14k18K05n3jRP5R2n43N23J8k5J7j72L3P4j16J53r0K24k33
7592A4j68K33j74K85j47j28K76k05m2j13J90J16k00l06M39k92R4J91l03L51J15
7613B26j74q6J59r1l3j4J22M0j52J05n9j52J93k5nk8J8q9J65R5j56l9M9K07j27
7638A49K7Qj24R3k9K3j05J27j02%j49J64L09m34j98L7L21k19Q5J89j19r5pk15
7662b64L10l1J59%l18K12n4o2L36m35J88J29j19k11K02J70k43j90J25K25j00k07
7684a78lk6K64j10J81RM6R5k39j00pj05J55m4Q2J31l25L12l45N37j46k04J6L5
7708C1l2J75k96J97J10n0J00k11l0P8K7r4Q6j69K45k00j05N0L8J56q1M0L45m90
7732h0K5N8j49J50j07K06J6m09K90k5k07L02J1p4N5K25l08J6J47k94K16N1kn7
$$ plain form
7756 56 -135 81 47 42 137 129 -162 -135 262 143 87 -20 87 -89 136 -325 131 -24 -24 108 -140 -82 -45 -55 62
7781 62 -76 -61 -204 114 89 -18 -6 130 27 -50 253 74 25 179 -45 18 206 -215 52 -27 -201 -77 103
7804 103 -242 -57 -158 116 390 121 131 186 323 -43 -18 -31 -419 46 257 257 10 -151 -223 25 261 186 120
7827 120 93 284 93 -2 -237 176 15 -81 32 -228 -86 -142 -3 -38 -110 110 131 89 68 96 -206 68 -106
7850 -106 -59 -5 -126 97 -162 254 22 31 -24 -185 -85 203 -2 -255 -126 -136 18 -118 -2 -118 53 -48
7872 -48 -297 64 165 -40 68 -8 283 -18 132 -159 303 -107 237 103 -178 -123 147 10 -11 6 -118 -71
7894 -71 91 -239 -51 -36 -48 -256 111 -84 -149 -8 58 -78 8 48 214 -90 71 -168 62 412 38 83 -77
7917 -77 97 104 251 -251 27 -116 117 -22 49 -22 286 131 164 11 -14 40 170 -1 62 -77 96 -118 36
$$ packed form
7756E6j91K16l4nR5qk91K7L97j19n6j07J07j76K25m61M56j55%J32k48N8L7j0J17
7781F2j38J5j43L18k5j07J2J36j03p7L03j79m9J54k24O3J88m21K67p9j74J24J80
7804A03l45J85j01K74K74k69J0N5J37l66K5j3l88M65K11%k47j61p2K48K36p5o6
7827A20k7J91j91r5k35M13j61r6J13k60J42n6J39l5p2K20K1m2k1K8l02K74j74
7850a06M7N4j21K23k59M16k32Rn5j61J00K88k05k53J29j0J54j36J16j16J71j01
7872d8k49L61J01k05J08p6K91l01J50k91M62m10L44j34k81N5K70j37k1J7j24M7
7894g1J62l30J88J5j2k08L67j95o5J41O6j36Q6M0J66l04J61k39K30L50l74M5j60
7917g7J74PJ47n02K78j43K33j39P1p1L08j55L3j53k5N4J30j71O3j39J73k14J54
$$ plain form
7940 36 -130 503 -32 31 18 -123 -16 -77 -95 15 -292 15 258 -44 -180 145 -2 24 -118 -196 190 -39
7962 -39 73 24 17 -140 -32 -52 -97 -30 14 -252 -162 26 120 -61 -6 -207 -78 56 278 6 -1 79 -298 -75 -76
7987 -76 -25 -67 36 -29 32 -40 80 132 -124 -338 63 -195 257 -59 304 -52 14 195 -115 -403 -27 -103 133
8010 133 -386 86 -211 5 -74 81 83 -36 177 96 -68 -161 -2 134 159 158 -24 -41 -291 -187 98 -42 42
8033 42 65 8 -33 89 -139 -134 -143 189 13 -240 41 -96 -18 -27 160 -207 222 21 280 -48 -128 2 111 195
8057 195 -164 124 -36 -62 136 -3 -74 8 -66 28 -85 -48 -4 -37 42 114 -91 -225 -88 16 155 -170 246
8080 246 6 260 -54 98 35 -114 -210 -69 -129 -228 85 -209 195 -133 59 -84 124 204 -311 -209 -60 31
8102 31 203 -182 291 -11 -79 153 104 45 -128 103 -160 10 247 -27 57 -41 77 -29 -36 -56 -26 98 138 130
$$ packed form
7940C6j66O33n35O3j3j41J07o1j8J10l07L07K43l02j36L25j47K6j42p8L86k29
7962c9J12m9pj57J08k0m5O7M4k66R0J88R4j81N5k01J29J34K22k72pQ0l77K23j
7987g6N1m2J03o5O1p2J20N2k56k14M01k58M52l16L63l56O6J81l10k88L76p6K36
8010A33n19M72k97K16p9J55Kj19K13q1j64r3J59J36K5jj82j7k50J04K85j40Q4
8033D2K3n7m1J22k28NrL32j76k53K81j37P8rJ87l67M29k01K59l28q0J30J09Q4
8057A95l59K88j60k6J98j39p1Q2p4R4j13L7M4l3P9P2k05j34J37J04J39l25M16
8080B46k40K54l14J52o3j49r6J41o0r9L13k94M04l28J92j43K08Q0n15J02J49R1
8102C1J72l85M73l02o8K32m9n9j73K31k63J70K37k74Q4r8J18j06pk0L0J24M0q
$$ plain form
8126 130 -112 181 -66 -47 184 -354 -18 99 -56 -240 57 93 -58 -84 141 -50 -70 147 -109 -110 -114 44 118
8149 118 -189 27 -42 -14 77 271 -35 -108 184 -92 -136 -105 -71 88 87 233 101 117 46 -214 19 96 -85 -185
8173 -185 -22 -178 -216 -66 10 -43 34 24 48 99 -233 -7 256 20 10 343 36 -38
$$ packed form
8126A30k42K93k47J9K31n38L36J17j55j84K97L6j51k6K25j91k0K17k56jmJ58P4
8149A18l07K16o9K8R1J94l06p3K92k76m4L1L4J59jJ46j32J6p1k60K33P7j81j00
8173a85J63j56l8J50P6n3P7j0K4N1l32K26K63k36j0L33l07p4
8191c8
$$ Imaginary data points
##PAGE= N=2
##DATA TABLE= (X++(I..I)), XYDATA
$$ plain form
0 0 0 0 0 0 0 0 0 0 0 0 0 0 0 0 0 -8 8 -8 8 -13 16 -16 16 -24 24 -32 40 -41 48 -56 64 -72 85 -96 109 -121 136
37 136 -153 171 -189 213 -237 261 -290 319 -353 389 -430 475 -522 576 -634 699 -773 853 -943
56 -943 1049 -1165 1305 -1467 1664 -1903 2206 -2600 3142 -3928 5194 -7559 13582 -65074 -110536
71 -110536 -47707 -20036 23019 22041 83893 129163 114869 132920 182926 170002 169647 170469 160062
84 160062 166738 142923 97172 113844 100203 44364 39009 38071 8932 2303 -16999 -21074 4251
97 4251 -17871 -32521 13234 16922 1500 27567 41310 49999 61240 44807 61740 84168 45072
110 45072 32583 54036 24391 -5029 -16296 -41338 -51273 -78454 -124291 -117457 -121167 -169214 -170740
123 -170740 -156131 -170100 -166210 -161461 -150658 -112725 -108855 -106130 -49837 -24112 -24980 12746 43195
$$ packed form
0@%%%%%%%%%%%%%%%qJ6j6J6k1K9l2L2m0M8n6P2q1Q9j04J20j36J57j81K05k30K57
37A36k89L24l60M02m50M98n51O09o72P42q19R05r97J098j210J333j472J626j796
56i43J992k214K470k772L131l567M109m806N742p070R122j2753K1141p8656m5462
71a10536O2829K7671M3055r78O1852M5270j4294J8051N0006j2924l55Q22j0407
84A60062O676k3815m5751J6672j3641n5839n355r38k9139o629j9302m075K5325
97D251k2122j4650M5755L688j5422K6067J3743Q689J1241j6433J6933K2428l9096
110D5072j2489K1453k9645k9420j1267k5042r935k7181m5837O834l710m8047j526
123a70740J4609j3969L890M749J0803L7933L870K725N6293K5725q68L7726L0449
$$ plain form
136 43195 60491 83759 84083 103550 134672 113402 105046 132399 117507 94270 93161 78677 71611
149 71611 57446 22887 27975 32002 -7170 -12247 3844 -10603 -14615 -11471 -10993 10755 7296 -5022
163 -5022 27973 38898 19307 33830 45747 39366 40716 26709 23119 34003 5295 -18686 -5085
176 -5085 -23142 -53110 -56912 -68891 -76942 -84049 -108485 -101563 -86018 -109301 -107899 -79822 -79961 -75349
190 -75349 -58651 -47254 -20800 -10267 -12867 21532 43259 31793 48765 69428 67635 72432 69438
203 69438 68271 81741 64467 45448 60591 51598 26524 26925 21154 12366 9809 -8485 -6698 6830
217 6830 -13469 -18966 2087 -2303 -7282 798 1707 13099 15720 1821 17636 29755 8580 9930
231 9930 21293 10668 5801 -504 -8947 -1293 -15462 -35473 -23061 -25561 -47266 -43989 -41862 -46897
$$ packed form
136D3195J7296K3268L24J9467L1122k1270q356K7353j4892k3237j109j4484p066
149G1611j4165l4559N088M027l9172n077J6091j4447m012L144M78K1748l459j2318
163e022L2995J0925j9591J4523J1917o381J350j4007l590J0884k8708k3981J3601
176e085j8057k9968l802j1979q051p107k4436O922J5545k3283J402K8077j39M612
190g5349J6698J1397K6454J0533k600L4399K1727j1466J6972K0663j793M797k994
203F9438j167J3470j7274j9019J5143q993k5074M01n771q788k557j8294J787J3528
217F830k0299n497K1053m390m979Q080R09J1392K621j3899J5815J2119k1175J350
231I930J1363j0625m867o305q443P654j4169k0011J2412k500k1705L277K127n035
$$ plain form
245 -46897 -43493 -51502 -46891 -27819 -37611 -40306 -15848 -12536 -15202 -2353 3446 13430 21180 12333
259 12333 25584 41089 25767 26379 40502 33097 29237 28294 22026 28924 21994 4014 14437 16593
273 16593 -3215 -1283 2682 -4229 -2968 -9644 -11229 1641 -7861 -16882 38 -663 -10309 -3315
287 -3315 -1966 -820 3185 -6927 -1811 10874 -3493 -6818 6537 815 -3708 -717 -4541 1669
301 1669 991 -12007 -2314 5014 -9508 -6881 1169 -4216 -2008 -4067 -6428 5312 -41 -9960 4398
316 4398 6258 -4426 1115 3076 2086 6118 -1327 549 12288 2198 -2685 10034 5861 747
330 747 5085 1364 4566 6078 -5791 -348 6803 -7199 -8541 -1598 -8226 -9393 -11053 -16401 -8602
345 -8602 -12345 -23689 -12689 -9068 -19882 -14442 -9500 -10416 -4152 -6563 -3876 10340 5767 3350
$$ packed form
245d6897L404q009M611J9072r792k695K4458L312k666J2849N799R984P750q847
259A2333J3251J5505j5322O12J4123p405l860r43o268O898o930j7980J0423K156
273A6593j9808J932L965o911J261o676j585J2870r502r021J6920p01r646O994
287c315J349J146M005j0112N116J2685j4367l325J3355n722m523K991l824O210
301A669o78j2998R693P328j4522K627Q050n385K208k059k361J1740n353r919J4358
316D398J860j0684N541J961r90M032p445J876J1739j0090m883J2719m173n114
330G47M338l721L202J512j1869N443P151j4002j342O943o628j167j660n348P799
345h602l743j1344J1000L621j0814N440M942r16O264k411K687J4216m573k417
$$ plain form
359 3350 18316 19753 15760 23555 23469 26027 29921 20907 23572 31289 18703 14402 20574 12577 7629
374 7629 5456 -1965 489 -2725 -15689 -10296 -7503 -19345 -16940 -12905 -16459 -12774 -13974 -14552 -3980
389 -3980 -6777 -11467 92 1636 -4425 841 545 -789 2452 -5985 -6801 -529 -11223 -17376 -11306
404 -11306 -17302 -21782 -20845 -25410 -22058 -20032 -27608 -20023 -11125 -16283 -10876 -432 1256 8855 14056
419 14056 16500 28912 31979 28874 40247 44252 38513 42939 42405 38430 39692 30934 24856 27697 16345
434 16345 5817 7789 -390 -9478 -11162 -18227 -20036 -20025 -28857 -26656 -20061 -26776 -25157 -16780 -18010
449 -18010 -14268 -10017 -10629 -2667 -351 -5724 1122 4001 -3363 -1647 -1612 -7129 -6359 -12200 -17979 -13864
465 -13864 -20555 -27861 -22726 -24696 -29163 -24407 -24320 -21302 -14356 -14703 -8752 3861 4240 9619 22250
$$ packed form
359C350J4966J437l993P795q6K558L894r014K665P717j2586m301O172p997m948
374G629k173p421K454l214j2964N393K793j1842K405M035l554L685j200n78J0572
389c980k797m690J1559J544o061N266k96j334L241q437q16O272j0694o153O070
404a1306n996m480R37m565L352K026p576P585Q898n158N407J0444J688P599N201
419A4056K444J2412L067l105J1373M005n739M426n34l975J262q758o078K841j1352
434A6345j0528J972q179r088j684p065j809J1q832K201O595o715J619Q377j230
449a8010L742M251o12P962K316n373O846K879p364J716L5n517P70n841n779M115
465a3864o691p306N135j970m467M756Q7L018O946l47N951J2613L79N379J2631
$$ plain form
480 22250 25086 30506 38493 38917 45241 49285 43741 47341 48815 39816 37929 35370 26115 22417 15055
495 15055 4982 4115 -3669 -14931 -14310 -18011 -25884 -24836 -26444 -28152 -23419 -26033 -24428 -15480 -16739
510 -16739 -16084 -6882 -6699 -5597 -389 -1796 387 3578 -3037 -2407 -71 -8245 -10208 -9872 -16530 -17523
526 -17523 -19602 -25231 -22282 -22950 -28061 -22572 -18664 -20216 -13459 -8273 -5069 3951 8201 12071 23459
541 23459 26357 28492 37802 39844 39740 44390 42425 41093 42320 34927 31293 30580 20889 14511 12201
556 12201 3389 -1804 -5612 -13934 -15015 -16761 -24130 -22456 -20592 -25008 -22074 -18770 -19502 -14314 -12276
571 -12276 -11961 -5210 -3859 -5265 871 873 -1701 1526 -643 -3185 -1822 -6934 -10133 -8369 -14140 -17650
587 -17650 -15682 -19431 -20575 -18285 -20792 -18095 -13630 -14981 -9511 -3008 -2810 3100 10447 12175 18604
$$ packed form
480B2250K836N420P987M24O324M044n544L600J474q999j887k559r255l698p362
495A5055j0073q67p784j1262O21l701p873J048j608j708M733k614J605Q948j259
510a6739O55R202J83J102N208j407K183L191o615O30K336q174j963L36o658r93
526a7523k079n629K949o68n111N489L908j552O757N186L204R020M250L870J1388
541B3459K898K135R310K042j04M650j965j332J227p393l634p13r691o378k310
556A2201q812n193l808q322j081j746p369J674J864m416K934L304p32N188K038
571a2276L15O751J351j406O136Kk574L227k169k542J363n112l199J764n771l510
587a7650J968l749j144K290k507K697M465j351N470O503J98N910P347J728O429
$$ plain form
602 18604 23190 23960 29918 32233 29879 33787 33803 29211 29846 26742 21475 20431 14140 8155 7536 1121
618 1121 -4970 -5286 -10323 -13919 -13544 -17378 -17769 -15375 -18421 -16725 -12251 -13780 -11540 -6811 -7537 -4728
634 -4728 -1712 -3014 112 1642 -1743 532 645 -3744 -2852 -4071 -8130 -6793 -9289 -13271 -10910 -12361
650 -12361 -15149 -11978 -12091 -12731 -8530 -7665 -5976 -440 101 2661 9050 9345 11930 17095 17180 18735 21772
667 21772 19585 21077 22043 17941 18138 17565 12290 11039 9264 3800 2897 507 -4530 -4333 -6370 -10428
683 -10428 -8772 -9807 -12346 -9831 -10013 -11033 -7292 -7687 -7334 -3264 -3948 -3849 -24 -1053 -963 1512 -584
700 -584 -554 976 -1866 -2239 -955 -4505 -4321 -3710 -6807 -5736 -5291 -7786 -6115 -4748 -6483 -3947 -2283
717 -2283 -3290 521 1819 1527 5060 5680 5568 8936 8971 8017 11277 10155 8613 10538 8480 6832 8225
$$ packed form
602A8604M586P70N958K315k354L908J6m592O35l104n267j044o291n985o19o415
618A121o091l16n037l596L75l834l91K394l046J696M474j529K240M729p26K809
634d728L016j302L126J530l385K275J13m389Q92j219m059J337k496l982K361j451
650a2361k788L171j13o40M201Q65J689N536N41K560O389K95K585N165Q5J555L037
667B1772k187J492R66m102J97n73n275j251j775n464r03k390n037J97k037m058
683a0428J656j035k539K515j82j020L741l95L53M070o84R9L825j029R0K475k096
700e84L0J530k842l73J284l550J84O11l097J071M45k495J671J367j735K536J664
717b283j007L811J298k92L533O20j12L368L5r54L260j122j542J925k058j648J393
$$ plain form
734 8225 4812 3764 4454 855 -58 541 -2747 -3334 -2462 -5370 -4679 -3559 -6435 -5000 -3464 -5626 -3660
751 -3660 -2795 -4137 -1865 -978 -2509 46 45 -1183 1457 740 -426 1511 494 -393 1545 155 -822
768 -822 953 -589 -813 878 -865 -955 818 -1170 -655 878 -912 -291 1263 -824 239 1169 -406
785 -406 788 1335 -404 1123 1322 -424 1229 1027 -424 1227 592 -840 1064 171 -1186 831 -171
802 -171 -1152 821 -462 -1517 764 -1009 -1499 -277 -1931 -1791 -203 -1771 -1604 -23 -1604 -457
818 -457 679 -660 488 1872 607 2177 3106 1726 3621 4101 2848 4637 4802 3283 4749 4086
834 4086 2416 3770 2357 790 1606 -6 -1719 -644 -2873 -4067 -2976 -5233 -5854 -4599 -6421 -6167
850 -6167 -4705 -5970 -5150 -3603 -4417 -3187 -1604 -2468 -617 673 -333 1398 2159 947 2548 2677
$$ packed form
734H225l413j048O90l599r13N99l288n87Q72k908O91J120k876J435J536k162J966
751c660Q65j342K272Q87j531K555jj228K640p17j166J937j017q87J938j390r77
768h22J775j542k24J691j743r0J773j988N15J533j790O21J554k087J063R30j575
785d06J194N47j739J527J99j746J653k02j451J651o35j432J904q93j357K017j002
802a71r81J973j283j055K281j773m90J222j654J40J588j568J67J581j581J147
818d57J136j339J148J384j265J570R29j380J895M80j253J789J65j519J466o63
834D086j670J354j413j567Q16j612j713J075k229j194J091k257o21J255j822K54
850f167J462j265Q20J547q14J230J583q64J851J290j006J731P61j212J601J29
$$ plain form
866 2677 1164 2284 1733 370 1616 727 -672 443 -743 -1489 11 -819 -1341 533 -38 579 2399
883 2399 1944 2970 4639 4103 5602 6876 6149 6881 7888 6487 6620 6937 4582 4780 4236 1462 1081
900 1081 -229 -3111 -3128 -4630 -7005 -6706 -7789 -9511 -8508 -9410 -10238 -8147 -8281 -8247 -5993 -5855 -5036 -2481
918 -2481 -2133 -1136 1425 558 1906 3545 2561 3425 4168 2445 2897 3197 1197 1556 1423 -442 141 -90
936 -90 -1661 -580 -603 -1246 202 588 563 2590 3145 3357 5805 6177 6222 8135 7910 7663 9018 8001 7123
955 7123 7600 5532 4482 4129 1493 -433 -987 -3886 -5237 -5701 -8283 -8966 -8834 -10669 -10450 -9907 -10846
972 -10846 -9475 -8227 -8532 -6047 -4883 -4714 -2252 -988 -417 1788 2119 2251 4053 3501 3242 4038 3416
989 3416 2460 2957 1523 867 1210 -250 -522 -129 -1249 -1022 -238 -947 48 1429 1051 2670 3583 3811
$$ packed form
866B677j513J120n51j363J246q89j399J115j186p46J500q30n22J874n71O17J820
883B399m55J026J669n36J499J274p27P32J007j401J33L17k355J98n44k774l81
900A081j310k882j7j502k375K99j083j722J003r02q28K091j34L4K254J38Q19K555
918b481L48R97K561q67J348J639r84Q64P43j723M52L00k000L59j33j865N83k31
936i0j571J081k3o43J448L86k5K027N55K12K448L72M5J913k25k47J355j017q78
955G123M77k068j050l53k636j926n54k899j351m64k582o83J32j835K19N43r39
972a0846J371J248l05K485J164J69K462J264N71K205L31J32J802n52k59P96o22
989C416r56M97j434o56L43j460k72L93j120K27P84p09R95J381l78J619R13K28
$$ plain form
1007 3811 5694 6635 6336 7516 8164 7344 8334 7823 6333 6243 5213 3208 2733 745 -1336 -1913 -3813
1024 -3813 -5731 -5847 -7842 -8636 -8376 -9466 -9645 -8772 -9203 -8272 -6816 -6762 -5389 -3474 -3389 -1687 -163 -61
1042 -61 1677 2656 2355 3045 3451 3024 3426 3302 2065 2373 1469 542 827 -224 -715 -176 -945 -1039 -224 -335
1062 -335 18 1562 1577 2068 3471 3783 4384 5604 5201 5969 6510 5836 5935 6014 4732 4193 4193 2142 1472 437
1082 437 -1590 -2285 -3485 -4652 -5180 -6095 -7000 -6799 -7084 -7439 -6547 -6277 -6208 -4831 -4271 -3992 -1795 -1908 -1064
1101 -1064 496 509 1246 2452 1988 2372 3149 2199 2099 2374 1198 1258 1319 19 166 367 -554 -756 -451
1120 -451 -993 -39 214 -137 867 1469 967 2432 2747 2647 3691 3927 3494 4476 3580 3419 3743 2961 2199
1139 2199 2635 692 139 143 -1540 -2089 -2092 -3312 -3587 -3339 -4422 -4580 -4058 -4498 -4088 -3365 -3684 -2923 -2171 -2341
$$ packed form
1007C811J883R41k99J180O48q20R90n11j490r0j030k005m75j988k081n77j900
1024c813j918j16j995p94K60j090j79Q73m31R31J456N4J373J915Q5J702J524J02
1042f1J738R79l01O90M06m27M02j24j237L08r04r27K85j051m91N39p69r4Q15j11
1062c35L53J544J5M91J403L12O01J220m03P68N41o74R9P9j282n39%k051o70j035
1082D37k027o95j200j167n28r15r05K01k85l55Q92K70O9J377N60K79K197j13Q44
1101a064J560J3P37J206m64L84P77r50j00K75j176O0O1j300J47K01r21k02L05
1120d51n42R54K53l51J004O02n02J465L15j00J044K36m33R82q96j61L24p82p62
1139B199M36j943n53Mj683n49lj220k75K48j083j58N22m40M10P23l19P61P52j70
$$ plain form
1159 -2341 -1006 -358 -505 674 917 594 1466 1720 984 1986 1280 1101 1704 946 704 977 209 -157 482
1178 482 -443 -194 12 -501 -409 20 -137 162 632 324 593 1222 677 923 1515 1095 1479 1622 930 1149
1198 1149 1256 300 742 601 -71 164 -279 -1145 -752 -1165 -1558 -865 -1477 -1667 -1242 -1485 -1629 -760 -1232 -1033
1218 -1033 -361 -778 -694 139 -334 135 632 82 549 703 686 755 964 377 887 733 322 691 702 516 565
1239 565 585 -202 222 94 -318 -4 -353 -703 -451 -829 -1027 -680 -1129 -1012 -771 -1373 -994 -289 -845 -845 -266
1260 -266 -586 -393 104 -217 456 857 384 825 1120 931 1232 843 788 1374 1193 289 949 489 5 569
1280 569 78 23 443 -29 -310 194 -119 -203 196 -122 13 592 338 812 997 800 805 1194 761 815 969 240
1302 240 500 155 -525 -667 -831 -1549 -1655 -1682 -2499 -2554 -2549 -2981 -2555 -2923 -2755 -2409 -2254 -1722 -986 -1254 -694
$$ packed form
1159b341J335O48j47J179K43l23Q72K54p36J002p06j79O03p58k42K73p68l66O39
1178D82r25K49K06n13R2M29j57K99M70l08K69O29n45K46N92m20L84J43o92K19
1198A149J07r56M42j41o72K35m43q66L93m13l93O93o12j90M25k43j44Q69m72J99
1218a033O72m17Q4Q33m73M69M97n50M67J54j7O9K09n87N10j54m11L69J1j86M9
1239E65K0p87M24j28m12L14l49l50K52l78j98L47m49J17K41o02L79P05n56%N79
1260b66l20J93M97l21O73M01m73M41K95j89L01l89n5N86j81r04O60m60m84N64
1280E69m91n5M20m72k81N04l13q4L99l18J35N79k54M74J85j97NL89m33N4J54p29
1302B40K60l45o80j42j64p18j06k7q17n5Nm32M26l68J68L46J55N32P36k68N60
$$ plain form
1323 -694 170 398 1105 1616 1321 1784 2693 2332 2729 2722 2511 2239 2250 2088 1786 1528 845 902 686 90 -102
1344 -102 -327 -864 -417 -389 -456 -296 -148 93 303 498 694 1237 931 823 1600 1066 1042 1025 458 328 89
1365 89 -570 -893 -1057 -2005 -2608 -2607 -3513 -3328 -3526 -4157 -3909 -3635 -3683 -2956 -2421 -2401 -1568 -1144 -554 557 930
1386 930 1197 2235 2579 2682 3213 3262 3421 3537 3237 3011 2972 2431 1879 1823 1091 541 538 38 -423 -299 -560
1407 -560 -659 -570 -720 -175 100 -87 728 606 683 1160 1125 1261 1586 1129 873 1286 582 30 -137 -882 -1572
1428 -1572 -1634 -2320 -2710 -3238 -3489 -4053 -3899 -4272 -4085 -3719 -3576 -3372 -2607 -2064 -1563 -604 -33 770 1303 1592
1448 1592 2439 2963 2929 3426 3560 3444 3532 3441 3151 2671 2483 1717 1468 1142 475 359 138 -662 -351 -523 -672
1469 -672 -597 -758 -272 -148 85 198 970 1011 970 1562 1056 1249 1368 1146 633 427 -56 -492 -816 -1428 -1789
$$ packed form
1323f94Q64K28P07N11k95M63R09l61L97pk11k72J1j62l02k58o83N7k16n96j92
1344a02k25n37M47K8o7J60J48K41K10J95J96N43l06j08P77n34k4j7n67j30k39
1365H9o59l23j64r48o03Jr06J85j98o31K48K74m8P27N35K0Q33M24N90J111L73
1386I30K67J038L44J03N31M9J59J16l00k26l9n41n52n6p32n50ln00m61J24k61
1407e60r9Q9j50N45K75j87Q15j22P7M77l5J36L25m57k56M13p04n52j67p45o90
1428a572o2o86l90n28k51n64J54l73J87L66J43K04P65N43N01R59N71Q03N33K89
1448A592Q47N24l4M97J34j16Q8r1k90m80j88p66k49l26o67j16k21q00L11j72j49
1469f72P5j61M86J24K33J13P72M1m1N92n06J93J19k22n13k06m83m36l24o12l61
$$ plain form
1490 -1789 -2066 -2706 -3025 -2989 -3612 -3478 -3073 -3611 -3460 -2826 -2874 -2060 -1359 -1171 -418 63 621 1088 1548 2014
1510 2014 2732 2419 2789 3046 2654 2809 2597 2570 2016 1723 1385 1020 575 79 -141 314 -429 -668 -196 -585
1530 -585 -116 -475 -409 170 46 246 344 676 862 951 943 717 967 834 475 126 99 -763 -679 -945 -1390 -1800
1552 -1800 -1995 -2006 -2100 -2602 -2447 -2211 -2378 -2034 -1932 -1649 -1369 -954 -686 -190 297 690 1045 1296 1489 1525 1889
1573 1889 1744 1722 1834 1618 1865 1288 1061 1244 599 510 521 246 -33 -20 -47 -264 -101 -345 -173 -20 -141
1594 -141 -150 105 -175 206 293 154 456 228 198 427 326 246 -49 -229 -67 -286 -587 -713 -542 -838 -1303 -1290
1616 -1290 -1400 -955 -1164 -1142 -1044 -809 -575 -736 -249 -495 -525 -15 -52 354 569 674 694 880 672 999 904 551
1638 551 725 690 554 288 402 264 349 298 -31 -161 -102 -187 5 -287 -201 -336 -238 -285 -288 -219 -493 -40 -484 -308
$$ packed form
1490a789k77o40l19L6o23J34M05n38J51O34m8Q14P01J88P53M81N58M67M60M66
1510B014P18l13L70K57l92J55k12k7n54k93l38l65m45m96k20M55p43k39M72l89
1530e85M69l59O6N79j24K00R8L32J86Q9qk26K50j33l59l49k7q62Q4k66m45m10
1552a800j95j1r4n02J55K36j67L44J02K83K80M15K68M96M87L93L55K51J93L6L64
1573A889j45k2J12k16K47n77k27J83o45q9J1k75k79J3k7k17J63k44J72J53j21
1594a41rK55k80L81Q7j39L02k28l0K29j01q0k95j80J62k19l01j26J71k96m65J3
1616a290j10M45k09K2R8K35K34j61M87k46l0N10l7M06K15J05K0J86k08L27r5l53
1638E51J74l5j36k66J14j38Q5n1l29j30N9q5J92k92Q6j35R8m7lO9k74M53m44J76
$$ plain form
1662 -308 25 20 -48 60 155 -27 -69 66 253 147 256 243 417 65 306 111 127 424 140 172 82 7 -23 187
1686 187 158 69 -26 -232 -257 -18 135 108 6 -348 -148 -207 -57 -44 83 101 -37 125 152 349 240 -8 -331
1709 -331 -25 -55 -191 -160 -287 -433 -464 -844 -519 -536 -865 -959 -708 -710 -688 -549 -642 -196 -183 66 401 517 645
1732 645 687 920 1428 1257 1122 1162 1111 993 1024 1159 664 594 653 590 60 237 -370 -128 -469 -908 -814 -453 -571
1755 -571 -768 -569 -411 -847 -451 -294 -452 -263 -151 38 365 -117 -112 239 163 -52 -334 -196 -122 -482 -347
1776 -347 -462 -698 -999 -1056 -968 -1049 -1077 -969 -981 -650 -327 -85 -198 174 764 653 914 1320 1333 1484 1862 1775
1798 1775 1668 1896 1706 1351 1512 1065 853 816 343 196 6 -63 -758 -809 -927 -985 -929 -1175 -999 -964 -1163 -838
1820 -838 -563 -684 -383 -271 -13 -45 75 13 424 151 -128 -203 -154 -264 -227 -481 -830 -880 -1083 -1297 -1123 -1051
$$ packed form
1662c08L33no8J08R5j82m2J35J87j06J09j3J74l52K41j95J6K97k84L2r0p5l0K10
1686A87k9q9r5k06k5K39J53k7j02l54K00n9J50J3J27J8j38J62K7J97j09k48l23
1709c31L06l0j36L1j27j46l1l80L25j7l29r4K51kK2J39r3M46J3K49L35J16J28
1732F45M2K33N08j71j35M0n1j18L1J35m95p0N9o3n30J77o07K42l41m39R4L61j18
1755e71j97J99J58m36L96J57j58J89J12J89L27m82NL51p6k15k82J38P4l60J35
1776c47j15k36l01n7Q8q1k8J08j2L31L23K42j13L72N90j11K61M06J3J51L78q7
1798A775j07K28j90l55J61m47k12l7m73j47j90o9o95n1j18n8N6k46J76L5j99L25
1820h38K75j21L01J12K58l2J20o2M11k73k79p5M9j10L7k54l49n0k03k14J74P2
$$ plain form
1842 -1051 -1280 -1006 -1140 -860 -443 -265 -539 103 380 652 1238 1269 1244 1924 1601 1778 1888 2060 1865 1870 1456
1863 1456 1315 1167 902 783 183 -190 -28 -522 -632 -863 -981 -1021 -1342 -1100 -1459 -1213 -1010 -1004 -461 -423 -728
1884 -728 -224 -119 -64 267 250 65 267 -96 -52 -138 -241 -459 -591 -586 -919 -1018 -1007 -950 -980 -1095 -931 -1001 -721 -471
1908 -471 -305 -158 95 399 839 1118 1262 1437 1493 1511 2032 1842 1717 1412 1538 1218 1095 1123 617 513 144
1929 144 -160 -316 -574 -810 -836 -807 -971 -1240 -990 -909 -844 -575 -706 -418 -253 -311 -175 -50 149 -93 308 15
1951 15 -41 120 -67 47 -207 -313 -262 -475 -913 -816 -980 -797 -855 -791 -830 -748 -463 -237 -87 -19 209 132 420
1974 420 718 955 1149 1106 1288 1242 1184 1597 1044 1401 1071 825 874 292 333 113 13 -280 -502 -616 -510 -545
1996 -545 -968 -642 -895 -762 -737 -488 -641 -440 8 -278 121 -35 -30 274 227 153 -49 227 156 -487 -288 -353
$$ packed form
1842a051k29K74j34K80M17J78k74O42K77K72N86L1k5O80l23J77J10J72j95Nm14
1863A456j41j48k65j19o00l73J62m94j10k31j18m0l21K42l59K46K03ON43L8l05
1884g28N04J05N5L31j7j85K02l63M4q6j03k18j32Nl33r9J1N7l0j15J64p0K80K50
1908d71J66J47K53L04M40K79J44J75N6J8N21j90j25l05J26l20j23K8n06j04l69
1929A44l04j56k58k36k6K9j64k69K50Q1O5K69j31K88J65n8J36J25J99k42M01k93
1951A5n6J61j87J14k54j06N1k13m38R7j64J83n8O4l9Q2K85K26J50O8K28p7K88
1974D20K98K37J94m3J82m6n8M13n53L57l30k46M9n82M1k20j00k93k22j14J06l5
1996e45m23L26k53J33K5K49j53K01M48k86L99j56NL04m7p4k02K76p1o43J99o5
$$ plain form
2018 -353 -335 -355 -493 -307 -475 -541 -699 -405 -450 -157 -253 95 -52 -179 140 625 583 381 478 752 729 807 913
2041 913 620 871 662 719 487 605 255 94 48 -134 -290 -309 -219 -163 -591 -321 -163 -442 -234 -614 -421 -354
2063 -354 -385 -242 -262 -74 -117 94 139 -5 7 214 103 -166 217 36 -213 -126 138 92 -177 -46 -228 -297 31
2086 31 -73 -198 -66 -45 73 61 -77 147 178 254 36 15 346 246 89 385 282 400 408 -88 416 269 128
2109 128 390 45 -225 64 -208 -85 -195 -135 -166 -176 126 -134 -18 -97 -265 -75 77 -42 -11 -145 -191 -35
2131 -35 -215 252 -122 -82 275 -143 55 260 280 172 40 448 -279 -16 203 46 89 119 129 176 167 -3 -285
2154 -285 -159 -175 -161 -365 -305 -109 -231 -33 -369 -203 -98 -107 -120 -32 64 -95 384 188 -21 238 24 247 69
2177 69 255 325 10 52 236 -103 -63 -162 -99 -313 -108 10 -49 108 189 -83 269 -96 -20 160 269 102 141
$$ packed form
2018c53J8k0j38J86j68o6j58K94m5K93r6L48j47j27L19M85m2k02R7K74k3P8J06
2041I13k93K51k09N7k32J18l50j61m6j82j56j9R0N6m28K70J58k79K08l80J93O7
2063c54l1J43k0J88m3K11M5j44J2K07j11k69L83j81k49Q7K64m6k69J31j82o9L28
2086C1j04j25J32K1J18j2j38K24L1P6k18k1L31j00j57K96j03J18Qm96N04j47j41
2109A28K62l45k70K89k72J23j10O0l1j0L02k60J16p9j68J90J52j19L1j34m6J56
2131c5j80M67l74M0L57m18J98K05K0j08j32M08p27K63K19j57M3L0J0M7rj70k82
2154b85J26j6J4k04O0J96j22J98l36J66J05rj3Q8R6j59M79j96k09K59k14K23j78
2177F9J86P0l15M2J84l39M0r9O3k14K05J18n9J57Q1k72L52l65P6J80J09j67L9
$$ plain form
2200 141 483 482 527 418 391 176 278 291 319 127 91 3 -205 107 -314 -144 -422 -609 -403 -519 -514 -544 -551 -359
2224 -359 -493 -403 -314 5 25 71 273 -135 -72 68 349 93 356 514 120 -106 140 168 140 -203 -65 88
2246 88 -76 -79 -51 -301 -48 45 -111 96 103 31 172 116 216 66 513 421 293 384 714 727 583 691 403 411 110
2271 110 28 32 45 -80 -17 -96 -515 -415 -404 -477 -443 -528 -381 -355 -635 -759 -334 -453 -110 -272 -62 -204 134 156
2295 156 489 32 140 442 83 134 303 306 -85 -214 218 -188 -204 -401 -242 -138 -187 -105 97 70 -180 19
2317 19 135 415 339 333 691 395 581 783 414 764 392 568 449 454 115 235 14 -91 -482 -434 -406 -416 -551
2340 -551 -489 -685 -391 -743 -672 -487 -580 -319 -466 -142 79 158 -188 30 115 -4 51 333 153 93 117 187 210
2363 210 -101 30 13 -60 -442 -86 -165 -247 -222 -100 -43 21 80 167 182 317 223 440 392 563 790 479 473 615 550
$$ packed form
2200A41L42jM5j09k7k15J02J3K8j92l6q8k08L12m21J70k78j87K06j16Nl0pJ92
2224c59j34R0Q9L19K0M6K02m08O3J40K81k56K63J58l94k26K46K8k8l43J38J53
2246H8j64lK8k50K53R3j56K07Pp2J41n6J00j50M47r2j28R1L30J3j44J08k88Ql01
2271A10q2MJ3j25O3p9m19J00J1p3L4q5J47K6k80j24M25j19L43j62K10j42L38K2
2295A56L33m57J08L02l59N1J69Ll91j29M32m06j6j97J59J04m9Q2K02k7k50J99
2317A9J16K80p6oL58k96J86K02l69L50l72J76j19Nl39J20k21j05l91M8K8j0j35
2340e51O2j96K94l52P1J85r3K61j47L24K21P9l46K18Q5j19N5K82j80o0K4P0K3
2363B10l11J31j7p3l82L56p9q2K5J22N7O4N9Q7J5J35r4K17m8J71K27l11oJ42o5
$$ plain form
2388 550 666 473 275 137 -134 -79 -75 -64 -124 -110 -572 -405 -625 -625 -207 -544 -436 -280 -648 -480 -405 -337 124
2411 124 -241 -4 -14 132 197 61 162 31 -3 72 180 203 170 85 74 -196 -220 -37 42 -242 -116 -4 -35 100
2435 100 -153 302 158 152 206 273 29 116 129 283 285 321 248 137 225 201 364 70 16 -76 -78 -37 -14 -340 -300 -471
2461 -471 -384 -470 -409 -313 -216 -161 -149 -221 -117 -137 -325 103 -62 63 289 -12 74 192 129 -162 -114 262 148 -226
2485 -226 173 -146 9 -104 211 -188 45 -275 -24 -39 46 -63 -140 18 -31 148 115 485 106 322 224 369
2507 369 380 215 -50 238 -183 86 204 45 -93 162 -216 -192 -117 -39 -112 -242 -225 -334 75 -499 -83 -119
2529 -119 -147 -157 -257 95 18 -94 252 -219 26 115 161 130 22 178 65 199 -248 -78 258 151 13 -49
2551 -49 -119 -181 -139 45 -127 60 -72 -160 243 -77 299 117 -150 104 -9 145 76 46 191 114 69 -51 -49 -217
$$ packed form
2388E50J16j93j98j38k71N5MJ1o0J4m62J67k20%M18l37J08J56l68J68P5O8M61
2411A24l65K37j0J46O5j36J01j31l4P5J08K3l3q5j1k70k4J83P9k84J26J12l1J35
2435A00k53M55j44oN4O7k44Q7J3J54KL6p3j11Q8k4J63k94n4r2kM1K3l26M0j71
2461d71Q7q6O1R6R7N5J2p2J04k0j88M28j65J25K26l01Q6J18o3k91M8L76j14l74
2485b26L99l19J55j13L15l99K33l20K51j5Q5j09p7J58m9J79l3L70l79K16r8J45
2507C69J1j65k65K88m21K69J18j59j38K55l78K4P5P8p3j30J7j09M09n74M16l6
2529a19k8j0j00L52p7j12L46m71K45Q9M6l1j08J56j13J34m47J70L36j07j38o2
2551d9p0o2M2J84j72J87j32q8M03l20L76j82k67K54j13J54o9l0J45p7m5j20Kj68
$$ plain form
2575 -217 21 -58 -56 -139 -190 148 82 55 -91 69 -176 -44 -173 162 -114 -31 26 194 -216 4 97 90 146 48 165
2600 165 -136 -150 -58 -253 -123 262 -4 -14 48 -20 87 92 98 -175 97 112 -48 252 165 -130 -210 -67 162 59
2624 59 -275 -133 -236 81 -141 158 37 -71 -183 -45 -36 -14 135 149 149 -125 115 66 201 160 -28 77 14
2647 14 204 156 139 120 206 7 -81 -58 -168 8 -17 -144 120 -30 232 204 -20 -5 51 71 109 212 118 -43 -10
2672 -10 24 -16 14 174 11 38 -55 26 105 -230 68 -182 -283 -156 -332 -8 3 -151 78 -124 -52 -167 -101 -215
2696 -215 67 -88 -318 28 171 10 76 95 -141 381 242 -85 356 148 -21 125 -204 -201 -142 184 -198 -21
2718 -21 172 39 -136 -163 -47 -94 109 165 33 11 154 28 97 87 337 142 -124 -24 98 9 378 -215 -90
2741 -90 -266 -104 -283 -220 -295 -177 222 -150 -265 -245 252 -110 11 -63 108 208 -48 189 167 85 186 235 270
$$ packed form
2575b17K38p9Kq3n1L38o6k7j46J60k45J32j29L35k76Q3N7J68m10K20R3pN6r8J17
2600A65l01j4R2j95J30L85k66j0O2o8J07NOk73K72J5j60L00q7k95q0J43K29j03
2624E9l34J42j03L17k22K99j21j08j12J38RK2J49J4%k74K40m9J35m1j88J05o3
2647A4J90m8j7j9Q6j99q8K3j10J76k5j27K64j50K62k8k24J5N6K0L8J03r4j61L3
2672a0L4m0L0J60j63K7r3Q1P9l35K98k50j01J27j76L24J1j54K29k02P2j15O6j14
2696b15K82j55k30L46J43j61O6J9k36N22j39l27M41k08j69J46l29LN9L26l82J77
2718b1J93j33j75k7J16m7K03N6j32k2J43j26O9j0K50j95k66J00J22q9L69n93J25
2741i0j76J62j79O3p5J18L99l72j15K0M97l62J21p4J71J00k56K37k2q2J01M9L5
$$ plain form
2764 270 -16 -28 118 225 -15 10 145 167 31 -27 -76 -29 -67 -407 85 -124 -131 -68 329 -382 -59 51 183
2787 183 361 213 90 -15 261 -7 110 110 21 277 5 -201 -213 160 -117 25 -128 -88 -108 -173 -299 65
2809 65 -43 -272 -152 -374 -298 -151 -125 -294 -54 -14 24 251 90 -27 84 189 102 -7 -48 312 247 207 66
2832 66 136 7 -185 110 -69 -216 -373 3 65 23 -7 -147 204 -154 -149 -4 -78 -5 214 71 60 147 182 124
2856 124 89 -105 129 3 25 -27 -67 -179 -181 -307 -371 -260 58 -231 -253 -127 -177 54 -106 19 -133 77 -142
2879 -142 -90 306 358 178 137 160 228 174 -70 276 213 -66 281 -111 148 -16 146 -187 39 56 150 -63 -120
2902 -120 -80 -134 -39 9 271 -56 -35 235 304 89 75 -70 52 -84 12 228 115 208 -43 -72 -78 -193 -169 -126 -120
2927 -120 -83 -126 -128 -115 -69 166 94 -91 -71 -84 36 215 -31 -41 329 57 137 118 271 49 -139 26 -214 118
$$ packed form
2764B70k86j2J46J07k40K5J35K2j36n8m9M7l8l40M92k09pO3L97p11L23J10J32
2787A83J78j48j23j05K76k68J17%q9K56k72k06j2L73k77J42j53M0k0o5j26L64
2809F5j08k29J20k22P6J47K6j69K40M0L8K27j61j17J11J05q7j09m1L60o5m0j41
2832F6P0j29j92K95j79j47j57L76O2m2l0j40L51l58NJ45p4P3K19j43j1Q7L5n8
2856A24l5j94K34j26K2n2m0j12kj26o4J11L18k89k2J26n0K31j60J25j52K10k19
2879a42N2L96N2j80m1K3O8n4k44L46o3k79L47l92K59j64J62l33K26J7R4k13n7
2902a20M0n4R5M8K62l27K1K70O9k15j4j45J22j36R6K16j13R3k51k9oj15K4M3O
2927a20L7m3kJ3M6K35p2j85K0j3J20J79k46j0L70k72Q0j9J53k22j88J65k40L32
$$ plain form
2951 118 24 154 235 112 140 126 27 111 171 6 -181 -466 -104 -297 20 -14 -259 -32 -45 -16 -172 13 -49 -8
2975 -8 171 273 -172 258 93 -6 199 -126 34 -15 -132 49 182 -156 361 6 -282 -169 -123 -109 34 -202
2997 -202 148 -85 -222 339 39 133 -161 -165 123 -113 84 270 -159 48 45 356 -14 -80 -38 231 106 114 -3
3020 -3 6 217 -159 -46 -274 55 -106 -10 218 49 18 3 -131 -142 68 22 -192 22 -135 67 -141 105 40
3043 40 140 33 242 138 272 -21 -39 95 -158 169 139 -91 -136 34 -84 17 59 44 -29 206 -65 70
3065 70 100 -172 2 -39 -49 99 -42 66 -314 100 -12 -116 107 238 196 203 -24 177 16 69 -19 -28 -63 44
3089 44 140 183 197 -168 86 -313 -46 111 -90 -219 64 280 43 194 164 206 50 102 235 -93 147 138 -142
3112 -142 -131 148 -275 -5 20 73 -266 203 117 -174 186 41 -24 4 98 -156 127 10 -92 238 130 381
$$ packed form
2951A18r4J30Q1j23K8j4r9Q4O0j65j87k85L62j93L17l4k45K27j3K9j56J85o2M1
2975hJ79J02m45M30j65r9K05l25J60m9j17J81J33l38N17l55k88J13M6J4J43k36
2997b02L50k33j37N61l00R4k94mK88k36J97J86m29K07lL11l70o6M2K69j25Qj17
3020cRK11l76J13k28L29j61R6K28j69l1j5j34j1K10m6k14K14j57K02k08K46o5
3043D0J00j07K09j04J34k93j8J34k53L27l0k30m5J70j18J01M2j5p3K35k71J35
3065G0L0k72J74m1j0J48j41J08l80M14j12j04K23J31m2Pk27K01j61N3q8rl5J07
3089D4R6M3J4l65K54l99K67J57k01j29K83K16k37J51l0M2j56N2J33l28K40rk80
3112a42J1K79m23K70K5N3l39M69q6k91L60j45o5K8R4k54K83j17j02L30j08K51
$$ plain form
3134 381 -91 111 -148 176 159 -94 21 -263 39 -37 -171 151 76 -23 -171 129 129 -62 -319 -231 -123 -255
3156 -255 276 -347 65 5 26 -46 58 195 160 1 170 18 -12 149 -64 239 49 281 176 -253 100 -85
3178 -85 -14 -307 -99 -47 -20 109 -174 -12 -89 -154 87 -259 213 -150 -142 -41 -175 173 -69 4 121 57 -113
3201 -113 -64 -39 -254 184 84 -79 -87 -140 -45 -100 -153 39 -227 -180 11 -176 131 -37 38 406 -171 -195 271 66
3225 66 380 60 118 480 99 252 -87 21 -67 188 -57 -200 175 -212 324 -339 -75 -23 19 158 59 -48
3247 -48 -44 63 -294 -100 207 -199 -18 48 -169 103 -168 -56 235 -3 183 25 65 96 26 140 40 -128
3269 -128 -41 -227 195 4 -4 -43 135 -7 135 50 -165 186 -152 150 -72 53 148 257 79 -62 33 50 -116
3292 -116 347 123 172 40 31 57 -190 142 40 -84 -108 -118 -3 -399 -304 -67 92 -99 -238 118 181 97 122
$$ packed form
3134C81m72K02k59L24j7k53J15k84L02p6j34L22p5r9j48L00%j91k57Q8J08j32
3156b55N31o23M12o0K1p2J04J37l5j59J69j52l0J61k13L03j90K32j05m29L53j85
3178h5P1k93K08N2K7J29k83J62p7o5K41l46M72l63QJ01j34L48k42P3J17o4j70
3201a13M9K5k15M38j00j63qn3R5n5n3J92k66M7J91j87L07j68P5L68n77k4M66k05
3225F6L14l20N8L62l81J53l39J08q8K55k45j43L75l87N36o63K64N2M2J39r9j07
3247d8MJ07l57J94L07m06J81O6k17K72k71J12K91k38J86j58M0L1p0J14j00j68
3269a28Q7j86M22j91ql9J78j42J42q5k15L51l38L02k22J25R5J09j78j41R5J7j66
3292a16M63k24M9j32rK6k47L32j02j24k4j0J15l96R5K37J59j91j39L56O3q4K5
$$ plain form
3315 122 159 -265 89 2 128 59 46 -74 172 54 12 -32 67 -178 -247 -186 -131 13 -15 135 -259 -86 -30 -53
3339 -53 -84 -37 -121 -200 -50 208 -142 -12 -82 2 123 89 -78 189 -2 127 71 -5 -64 87 113 -19 113 -108
3363 -108 101 230 -32 -179 32 32 -4 -47 -192 31 221 110 -72 -139 -31 -75 -159 -21 55 -13 -51 209 70
3386 70 103 239 -19 119 68 -31 -58 83 -7 -87 -123 -28 -109 119 112 170 -22 -259 153 -40 -52 -170 230 -358 -240
3411 -240 -145 -196 4 5 8 470 26 -121 161 98 160 75 124 148 332 -45 -343 -60 -136 37 67 -35 14 80 -29
3436 -29 -145 46 42 142 45 -94 248 171 69 -40 -186 -266 165 -66 -185 91 9 -95 -17 235 5 80 -243
3459 -243 135 -326 -103 149 302 -174 -8 61 -216 -32 -32 18 -52 -173 -157 38 150 -91 -158 22 -166 -63
3481 -63 194 22 -47 57 190 43 -31 239 -175 57 -206 194 127 -10 8 182 -26 -32 -23 123 91 -145 -140 -40
$$ packed form
3315A22L7m24L54q7J26o9j3j20K46j18m2m4R9k45o9O1N5J44k8J50l94J73N6k3
3339e3l1M7q4p9J50K58l50J30p0Q4J21l4j67K67j91J29n6p6n9J51K6j32J32k21
3363a08K09J29k62j47K11%l6m3j45K23J90j11j82o7J08m4q4J38P6o8l8K60j39
3386G0L3J36k58J38n1r9k7J41r0q0l6R5q1K28pN8j92k37M12j93j2j18M00n88J18
3411b40R5n1K00JLM62m44j47K82o3O2q5M9K4J84l77k98K83p6J73L0j02M9O6j09
3436b9j16J91mJ00r7j39L42p7j02j09j46q0M31k31j19K76q2j04P8K52k30P5l23
3459b43L78m61K23K52J53m76J66O9k77J84%N0p0j21J6J95J12k41o7J80j88J03
3481f3K57j72o9J04J33j47p4K70m14K32k63M00o7j37J8J74k08oRJ46l2k36NJ00
$$ plain form
3505 -40 10 -50 -103 -114 70 186 -129 341 23 187 164 112 238 -14 -46 177 43 -113 28 -63 47 -214 -183
3528 -183 -32 -125 -11 31 -225 -86 -72 -41 -116 -229 114 -10 -53 211 -57 -122 298 -164 152 218 27 204 -128
3551 -128 -224 -274 157 36 135 -94 -114 335 22 -20 193 -150 -14 191 175 -167 323 -46 -108 -103 171 334 141
3574 141 148 -31 205 57 -270 288 -174 -162 -19 -25 -145 55 -19 59 142 -211 76 -47 40 121 44 -196 -25 174
3598 174 163 10 64 -190 197 -317 115 194 298 -34 6 -166 -84 267 210 77 -42 -77 -232 54 86 37 -19
3621 -19 -168 -175 -232 -23 -16 -135 -152 86 -142 147 168 -167 83 39 120 9 223 -24 86 -180 313 202 269 -117
3645 -117 -250 58 105 -24 -62 -27 -172 -184 28 -77 -166 147 -185 26 25 -115 34 47 104 119 -49 237 -85
3668 -85 -200 -46 21 224 -135 38 69 -264 55 8 0 -164 48 -419 -106 28 -327 212 -78 176 -74 -54
$$ packed form
3505d0N0o0n3j1J84J16l15M70l18J64k3n2J26k52l2K23j34j56J41r1J10k61L1
3528a83J51r3J14M2k56J39J4L1p5j13L43j24m3K64k68o5M20m62L16O6j91J77l32
3551a28r6n0M31j21R9k29k0M49l13m2K13l43J36K05j6l42M90l69o2NK74J63j93
3574A41Pj79K36j48l27N58m62J2J43oj20K00p4P8Q3l53K87j23Q7Q1p7k40J71J99
3598A74j1j53N4k54L87n14M32P9J04l32M0j72Q2L51n7j33j19l5j55K86L2m9n6
3621a9j49pn7K09Pj19j7K38k28K89K1l35K50m4Q1j11K14k47J10k66M93j11O7l86
3645a17j33L08M7j29l8L5j45j2K12j05q9L13l32K11jj40J49J3N7J5j68K86l22
3668h5j15J54O7K03l59J73L1l33L19m7qj64K12m67L13J34l55N39k90K54k50K0
$$ plain form
3690 -54 181 45 137 273 -131 46 78 79 -6 155 -248 52 -92 -105 -23 -90 -113 -173 46 3 153 -212 82 -50
3714 -50 -37 -164 -132 -124 156 -153 -48 -180 -78 -7 -30 -126 -139 -120 258 -208 52 197 -8 176 2 34 24 54
3738 54 357 -65 -73 88 -75 -176 -22 -177 -64 -49 104 211 6 -85 134 77 -56 -90 -180 -208 13 330 165
3761 165 -177 -103 -135 -20 -229 -36 -54 129 -105 -67 8 -6 -162 -286 -58 59 -78 227 268 -33 -132 13 -91
3784 -91 90 96 163 231 88 -122 -152 81 228 -3 -231 80 48 -21 -237 -94 47 -234 -214 192 49 -230 -183
3807 -183 -4 -138 71 41 35 -101 140 -14 81 126 53 303 156 3 -265 -138 -203 -51 335 27 161 29
3829 29 77 -110 -100 0 -220 47 -179 -34 16 -62 314 -43 -123 -48 -62 -115 34 73 129 128 -112 236 82 62 -90
3854 -90 -37 121 -31 46 -168 -174 216 4 -29 -58 194 6 116 75 -240 108 -258 208 248 208 -249 -188 119 4
$$ packed form
3690e4K35j36R2J36m04J77L2Jq5J61m03L00j44j3Q2o7k3o0K19m3J50l65K94j32
3714e0J3j27L2QK80l09J05j32J02P1k3r6j3J9L78m66K60J45k05J84j74L2j0L0
3738E4L03m22qJ61j63j01J54j55J13J5J53J07k05r1K19n7j33l4r0k8K21L17j65
3761A65l42P4l2J15k09J93j8J83k34L8P5j4j56j24K28J17j37L05M1l01r9J45j04
3784i1J81OO7O8j43k10l0K33J47k31k28L11l2o9k16J43J41k81K0M06j43k79M7
3807a83J79j34K09l0oj36K41j54R5M5p3K50j47j53k68J27o5J52L86l08J34j32
3829B9M8j87J0J00k20K67k26J45N0p8L76l57q0P5j4n3J49L9N6jk40L48j54k0j52
3854i0N3J58j52P7k14oL90k12l3k9K52j88J10m1l15L48l66M66M0m0m57O1L07j15
$$ plain form
3878 4 11 -144 159 -176 -140 -122 -44 24 97 -139 42 -184 -26 84 12 -151 -16 1 -76 255 -157 184 -232 -218
3902 -218 -186 -3 -199 -165 10 281 278 171 -92 -116 -17 31 85 -31 -47 198 100 -83 226 73 172 -25 11 -124
3926 -124 35 200 -29 132 75 12 -88 -122 165 -109 -12 67 230 -25 142 -101 89 -18 93 58 95 94 -418
3949 -418 186 -50 -71 269 -214 72 79 -236 168 67 51 6 64 127 107 -94 55 -67 -200 116 -103 -97 -178 2
3973 2 136 31 112 -7 15 163 133 117 122 241 -42 -33 -39 -38 121 166 184 69 -58 -163 34 -51 70 273 -137 166
3999 166 108 74 -36 -105 10 152 146 -88 -30 -89 132 -3 96 -262 273 84 105 374 198 -59 213 327 76
4022 76 -212 -2 -25 -11 147 -62 -25 56 -72 252 -35 -225 -92 -62 28 -277 -34 -235 70 78 107 -142 162
4045 162 31 -56 125 84 -159 -94 95 173 -2 -82 -223 207 -25 212 69 31 -197 -15 103 137 -46 -203
$$ packed form
3878DPj55L03l35L6J8P8O8P3k36J81k26J58J10p2j63J35J7p7L31m12L41m16J4
3902b18L2J83j96L4J75K71lj07k63k4R9M8N4j16j6K45r8j83L09j53R9j97L6j35
3926a24J59J65k29J61n7o3j00l4K87k74R7P9J63k55J67k43J90j07J11l5L7jn12
3949d18O04k36k1L40m83K86Pl15M04j01j6m5N8O3k0k01J49j22j33L16k19Oq1J80
3973BJ34j05Q1j19K2J48l0j6NJ19k83RoJJ59M5J8j15j27j05J97q5J21K03m10L03
3999A66n8l4j10o9J15J42ok34N8n9K21j35R9l58N35j89K1K69j76k57K72J14k51
4022G6k88K10k3J4J58k09L7Q1j28L24k87j90J33L0R0l05K43k01L05QK9k49L04
4045A62j31q7J81m1k43O5J89P8j75q0j41M30k32K37j43l8k28J82J18L4j83j57
$$ plain form
4067 -203 -8 -211 -66 -84 233 -181 49 302 -409 209 168 156 -105 165 -21 -57 286 -46 70 -55 -170
4088 -170 -123 -202 -35 142 -96 205 3 66 269 -18 37 -79 178 138 48 -367 -53 3 54 104 -76 217 -147
4111 -147 40 64 15 3 -100 53 -8 32 -35 126 -167 -107 -42 26 130 131 78 251 78 126 -134 -36 15 279 128
4136 128 181 -92 14 -100 -272 359 -26 -185 -82 156 121 224 -78 253 -61 183 -54 14 -7 -133 -181 141
4158 141 36 171 85 94 -344 -168 -193 -57 -40 0 184 35 -117 -85 12 -198 -194 -42 118 -155 79 114 192 274
4182 274 -145 -76 -36 92 -148 23 -115 -64 121 -415 -3 -18 56 10 84 -166 200 -34 55 204 -24 -36 -38 -90
4206 -90 31 104 28 -309 -85 132 -126 83 202 84 -2 96 -12 -43 151 -122 1 259 -291 101 79 -129
4228 -129 -204 4 -30 88 256 -143 -325 -136 -36 9 -58 -75 -33 -89 31 -65 -54 33 -52 195 71 -288 -31 -147
$$ packed form
4067b03J95k03J45j8L17m14K30K53p11O18m1j2k61K70j86l6L43l32J16j25j15
4088a70M7p9J67J77k38L01k02O3K03k87N5j16K57m0r0m15L14N6N1N0j80K93l64
4111a47J87K4m9j2j03J53o1M0o7J61k93O0O5O8J04Jn3J73j73M8k60R8N1K64j51
4136A28N3k73J06j14j72O31l85j59J03K38l5J03l02L31l14K44k37O8k1j26m8L22
4158A41j05J35q6Rm38J76k5J36J7M0J84j49j52L2R7k10MJ52J60k73K34L5P8Q2
4182B74m19O9M0J28k40J71j38N1J85n36M12j5P4m6P4k50L66k34Q9J49k28j2kn2
4206i0J21P3p6l37K24K17k58K09J19j18q6R8j08l1J94k73J23K58n50L92k2k08
4228a29p5K08l4J18J68l99j82J89J00M5o7j7M2n6J20r6J1Q7q5K47j24l59K57j16
$$ plain form
4252 -147 -39 -57 32 25 -83 216 83 -51 106 165 65 -164 -61 82 69 -125 7 223 -149 -6 113 246
4274 246 58 189 -57 162 -57 -219 -233 158 197 38 87 3 -26 123 68 -45 -36 63 80 3 74 255 -14 22
4298 22 265 115 -111 81 104 -113 99 308 226 124 -98 267 118 47 123 244 -117 -43 49 128 9 -49 -203
4321 -203 -87 78 122 -19 22 -37 -183 -20 -115 -48 -130 52 92 99 32 -105 60 -254 54 31 -402 152 220 -74
4345 -74 30 -89 76 39 65 231 -83 174 20 -85 66 -179 -62 -333 -3 -80 25 125 -48 130 51 -16
4367 -16 33 141 107 165 50 -9 -28 30 148 248 47 2 180 299 426 -9 228 164 95 -8 -21 16 108 -188
4391 -188 186 210 14 188 -119 53 22 117 -270 -275 -141 -75 -84 -7 -204 -131 6 118 19 -174 -96 -74 38 119 -37
4416 -37 256 113 63 351 -133 104 65 -30 16 -8 -89 11 5 -116 -12 217 -36 74 -33 32 -98 -38 74 -47
$$ packed form
4252a47J08j8Q9pj08K99j33j34J57N9j00k29J03J43j3j94J32K16l72J43J19J33
4274B46j88J31k46K19k19j62j4L91L9j59M9q4k9J49n5j13RR9J7p7P1J81k69L6
4298B2K43j50k26J92K3k17K12K09q2j02k22L65j49p1P6J21l61P4R2P9j19n8j54
4321b03J16J65M4j41M1n9j46J63r5O7q2J82M0Po7j37J65l14L08k3m33N54O8k94
4345g4J04j19J65l7K6J66l14K57j54j05J51k45J17k71L30p7J05J00j73J78p9o7
4367a6M9J08l4N8j15n9j9N8J18J00k01m5J78J19J27m35K37o4o9j03j3L7R2k96
4391a88L74K4j96J74l07J72l1R5l87nJ34O6rP7j97P3J37J12r9j93P8K2J12Q1j56
4416c7K93j43n0K88m84K37l9r5M6k4q1J00oj21J04K29k53J10j07O5j30O0J12j21
$$ plain form
4440 -47 53 -78 13 63 -84 11 -54 -121 -9 129 157 196 14 -64 183 -117 179 38 191 239 110 285 161
4463 161 203 -153 -91 75 -176 19 -141 -21 55 62 -41 54 46 152 -8 94 -197 142 12 2 62 -44 232
4486 232 -151 -117 -10 -43 -10 140 -191 -28 130 -75 84 81 186 18 -342 -200 256 66 78 126 -153 -23
4508 -23 9 48 -116 113 -31 -134 -166 172 109 -110 -150 51 97 54 -120 -123 -134 -12 -26 31 -170 -232 40 5 -127
4533 -127 175 6 6 -79 30 100 129 -164 -38 -94 -48 -63 257 -139 -39 8 -39 60 -100 335 117 42 -136 -425
4557 -425 66 157 -93 -5 -69 268 -276 -137 -29 -62 51 5 147 -309 201 -10 60 -94 -226 14 -65 -126 17
4580 17 -24 -2 1 -54 211 -53 -249 60 144 -34 2 155 48 142 28 0 145 112 44 -136 175 68 21 -17 -236
4605 -236 -260 -33 -61 68 119 180 -70 -158 -307 -21 -124 -25 220 -55 171 -160 120 95 31 -97 120 176 49
$$ packed form
4440d7J00j31R1N0j47R5o5o7J12J38K8L9j82p8K47l00K96j41J53M8j29J75j24
4463A61M2l56O2J66k51J95j60J20P6Pj03R5qJ06j60J02k91L39j30j0O0j06K76
4486B32l83L4J07l3L3J50l31J63J58k05J59lJ05j68l60J42M56j90J2M8k79J30
4508b3L2L9j64K29j44j03l2L38o3k19m0K01M6m3j74lj1J22j4N7k01o2K72l5j32
4533a27L02j69%q5J09P0K9k93J26n6M6j5L20l96J00M7m7R9j60M35k18p5j78k89
4557d25M91R1k50Q8o4L37n44J39J08l3J13m6J42m56N10k11P0j54j32K40p9o1J43
4580A7m1K2Ln5K65k64j96L09Q4j78L6J53j07R4j14k8J45l3o8j80L11j07m7l8k19
4605b36k4K27k8J29N1O1k50q8j49K86j03R9K45k75K26l31K80k5o4j28K17N6j27
$$ plain form
4628 49 -72 176 208 -279 -292 194 125 189 -20 176 304 220 178 -93 34 -28 -382 -49 66 181 -48 22 56
4651 56 -73 0 -113 4 117 80 -74 32 -41 -172 224 -5 116 -89 42 -127 -31 67 -219 -135 -17 61 76
4674 76 221 -131 240 74 45 195 -14 -229 25 15 -124 -64 5 208 -7 7 188 46 -99 107 -16 107
4696 107 -79 193 180 120 -121 117 -65 -51 173 118 99 -101 -302 53 92 -140 -91 41 63 103 92 40 -320 -297
4720 -297 173 -66 -83 133 -49 20 -2 -338 82 49 244 293 212 -123 140 -19 -326 -73 15 -2 67 76 161 217
4744 217 -13 143 -63 -195 -89 -1 77 -189 -76 -11 -128 -87 65 110 -184 180 -41 160 110 263 -60 -219
4766 -219 206 2 13 -99 142 71 46 -193 -47 268 81 64 -126 -63 -7 -64 -42 -128 55 -227 107 23 -60 -18
4790 -18 348 112 179 92 226 -296 135 -106 -171 233 -106 53 -73 -62 -35 -35 -21 77 -139 25 185 -97 -231
$$ packed form
4628D9j21K48L2m87j3M86o9O4k09J96J28q4m2k71J27o2l54L33J15J15k29P0L4
4651E6j29P3j13J17J13l7j54J06p3j31L96k29J21k05J31j69R6R8k86Q4J18P8J5
4674G6J45l52L71j66k9J50k09k15K54j0j39O0O9K03k15J4J81j42j45K06j23J23
4696A07j86K72j3o0k41K38j82J4K24n5j9k00k01L55L9k32M9J32K2M0j1n2l60K3
4720b97M70k39j7K16j82O9k2l36M20l3J95M9q1l35K63j59l07K53Q8j7O9RQ5N6
4744B17k30J56k06j32J06Q8P8k66J13O5j17M1J52M5k94L64k21K01n0J53l23j59
4766b19M25k04J1j12K41p1k5k39J46L15j87j7j90O3N6n7K2q6J83k82L34q4q3M2
4790a8L66k36O7q7J34n22M31k41o5M04l39J59j26J1K7%J4R8k16J64J60k82j34
$$ plain form
4813 -231 -97 -48 -85 -57 86 214 94 147 -158 274 -110 65 95 -93 -45 -239 70 2 15 48 -177 151 326
4836 326 140 62 -47 -49 -134 -10 201 -128 -123 91 97 -350 -117 -162 10 30 -163 -31 21 -4 54 7 -97 -62 186
4861 186 -113 173 -281 23 -32 61 370 -54 -25 12 -120 89 -256 -184 354 8 -27 -281 209 -127 34 -188
4883 -188 114 -115 -96 -109 79 -26 175 -408 -177 -88 -11 95 -241 -100 -119 125 272 153 -248 -56 -253 -184
4905 -184 -108 -111 124 257 293 187 -43 39 83 -80 -127 -9 178 69 -209 96 -232 -113 133 -40 -170 8
4927 8 88 -170 134 123 -46 109 158 -96 -125 -429 -90 -25 -219 255 42 -9 -28 57 -215 -54 -308 35 103 -135
4951 -135 -39 -128 -34 -171 -333 265 -16 -113 61 -323 -9 88 82 75 -57 162 79 -189 50 -36 84 10 0 -120
4975 -120 94 -6 -116 60 -188 -23 -42 79 -44 55 -82 -117 19 -37 115 29 3 -158 55 -109 -75 -213
$$ packed form
4813b31J34M9l7K8J43J28j20N3l05M32l84J75L0j88M8j94L09o8J3L3k25L28J75
4836C26j86p8j09kq5J24K11l29NK14Om47K33m5J72K0j93J32N2k5N8m7j04L5K48
4861A86k99K86m54L04n5R3L09m24K9L7j32K09l45P2N38l46l5k54M90l36J61k22
4883a88L02k29J9j3J88j05K01n83K31Q9P7J06l36J41j9K44J47j19m01J92j97O9
4905a84P6lK35J33L6j06k30Q2M4j63m7J18J87j09k78L05l28J19K46j73j30J78
4927HQ0k58L04j1j69J55M9k54k9l04L39O5j94M74k13n1j9Q5k72J61k54L43O8k38
4951a35R6q9R4j37j62N98k81r7J74l84L14R7opj32K19q3k68K39q6J20p4j0j20
4975a20K14j00j10J76k48J65j9J21j23R9j37l5J36n6J52q6k6j61K13j64L4j38
$$ plain form
4997 -213 -169 -285 -156 -67 64 19 -52 5 -46 -191 40 24 -14 104 -244 -98 -127 -44 192 56 66 -216 202 307
5021 307 -38 -197 -29 124 121 -34 -48 -108 312 297 134 -208 119 -140 -15 5 291 -237 -24 -185 48 -32
5043 -32 -196 75 -41 -20 91 -21 14 -149 -322 -95 122 174 -39 -22 248 147 99 -68 4 -10 92 -152 413
5066 413 -90 29 234 61 210 -18 -58 -47 -150 -39 -125 -40 -107 -66 -175 -93 144 27 -62 112 -57 50 52
5089 52 17 203 -48 -102 306 188 -283 134 -24 97 -335 -17 82 -113 -3 148 -63 76 -184 6 -130
5110 -130 51 -226 24 2 -36 61 243 476 47 99 43 11 137 98 -49 134 -320 -10 301 127 57 101 -49
5133 -49 -63 26 -140 100 -32 68 -147 -86 108 -157 -137 -209 65 -52 -101 -168 65 186 -80 93 -120 178 134
5156 134 -47 -11 71 182 -82 -81 -4 -82 -114 -145 118 4 -10 -44 -80 7 124 -49 -293 -220 -11 149 152 3 -103
$$ packed form
4997b13M4j16J29Q9J31m5p1N7n1j45K31j6l8J18l48J46k9Q3K36j36J0k82M18J05
5021C07l45j59J68J53lj55j4o0M20j5j63l42L27k59J25K0K86n28K13j61K33q0
5043c2j64K71j16K1J11j12L5j63j73K27K17N2k13J7K70j01m8j67P2j4J02k44N65
5066D13n03J19K05j73J49k28m0J1j03J11q6Q5o7M1j09Q2K37j17q9J74j69J07K
5089E2l5J86k51n4M08j18m71M17j58J21m32L18R9j95J10J51k11J39k60J90j36
5110a30J81k77K50k2l8R7J82K33m29N2n6l2J26l9j47J83m54L10L11j74p0M4j50
5133d9j4Q9j66K40j32J00k15O1J94k65K0p2K74j17m9o7K33J21k66J73k13K98m4
5156A34j81L6Q2J11k64JP7p8l2l1K63j14j4l4l6Q7J17j73k44P3K09J60Lj49j06
$$ plain form
5181 -103 9 -42 96 -298 -118 8 -146 -119 -264 50 -104 125 -188 5 -76 -114 -112 6 -57 -69 -124 234 -89
5204 -89 -7 164 -320 -181 -47 -153 -24 231 101 -74 -174 43 132 30 232 58 -38 -68 260 -115 243 122
5226 122 -119 240 237 -192 151 40 79 35 7 2 -113 -137 44 -102 -33 4 -156 156 65 313 100 148 39 -205
5250 -205 -7 270 -205 -216 -139 -26 -177 -90 123 -261 -40 -104 226 -60 -119 -114 15 -207 -66 49 -90 100
5272 100 427 -27 -26 -157 -19 -78 -296 16 -40 355 -11 235 -126 222 222 173 34 150 -102 -376 151 -100
5294 -100 -345 -60 11 -195 91 -245 -66 86 -62 -51 95 -39 -16 -12 -36 -192 -16 248 124 -121 -126 -136 39
5317 39 154 -194 -112 237 -88 47 -20 296 -9 -76 64 -19 -39 116 -203 -128 71 -42 -151 13 51 -102 -90
5340 -90 29 -117 -52 76 -54 -268 24 119 -88 -26 87 -170 -6 85 -178 -145 -220 -128 32 228 109 195 171
$$ packed form
5181a03J12n1J38l94J80J26j54K7j45L14j54K29l13J93q1l8KJ18o3j2n5L58l23
5204h9Q2J71m84J39J34j06J29K55j30j75j00K17Q9j02K02j74r6l0L28l75L58j21
5226A22k41L59lm29L43j11L9m4k8nj15k4J81j46O9L7j60L12r1K48k13M8j09k44
5250b05J98K77m75j1P7J13j51Q7K13l84K21o4L30k86n9NJ29k22J41J15j39J90
5272A00L27m54Jj31J38n9k18L12n6L95l66K46l61L48%m9j39J16k52k74N27k51
5294a00k45K85P1k06K86l36J79J52j48J1J46j34K3Mk4j56J76K64j24k45nj0J75
5317C9J15l48Q2L49l25J35o7L16l05o7J40q3k0J55l19P5J99j13j09J64L8j53J2
5340i0J19j46O5J28j30k14K92R5k07O2J13k57J64R1k63L3p5R2J60J96j19Q6k4
$$ plain form
5363 171 -63 25 11 -46 -72 -81 34 214 263 -111 -180 -61 111 236 146 28 -68 161 -129 257 35 -19 -71 133
5387 133 161 42 165 141 71 -150 -125 51 337 57 -53 89 -87 -22 14 -163 -100 -82 -47 -141 -144 154 114 39 167
5412 167 21 -16 -210 100 -142 210 -176 -122 -162 -59 -113 -49 30 -54 230 118 -60 -597 140 -33 64 146 -1
5435 -1 -194 21 197 145 151 181 38 100 130 193 -48 212 16 92 209 67 -29 -91 299 -70 63 -102 232 -47
5459 -47 -132 81 -195 -70 -31 -107 173 18 -132 116 106 -167 11 123 -79 -6 -17 -60 144 -123 135 152 46
5482 46 -125 94 1 -194 32 -175 -141 -130 130 -177 -94 -13 -94 -99 330 -45 -163 49 -57 -230 -206 30 66 -97
5506 -97 107 47 107 -142 -18 -188 192 -25 98 189 -176 -107 171 -24 17 -84 -44 365 152 206 -134 -246 -171
5529 -171 -71 -55 -165 -132 -56 -18 -105 -161 -86 80 -251 -23 123 199 -21 -24 -88 -35 -47 -102 200 -311 201 4 27
$$ packed form
5363A71k34Q8j4n7k6rJ15J80M9l74o9J19J72J25r0j18r6K29k90L86k22n4n2K04
5387A33K8j19J23k4p0k21K5J76K86k80j10J42j76O5L6j77O3J8L5r4lK98m0p5J28
5412A67j46l7j94L10k42L52l86N4m0J03n4O4P9q4K84j12j78n37P37j73R7Q2j47
5435aj93K15J76n2OL0j43O2L0O3k41K60j96P6J17j42r6o2L90l69J33j65L34k79
5459d7q5K13k76J25L9p6K80j55j50K48j0k73J78J12k02P3j1m3K04k67K58J7j06
5482D6j71K19r3j95K26k07L4J1K60l07Q3Q1q1nM29l75j18K12j06j73K4K36L6j63
5506i7K04o0O0k49J24j70L80k17J23R1l65O9K78j95M1j01M0M09k13N4l40j12P5
5529a71J00J6j10L3P6L8q7n6P5J66l31K28J46P6k20lo4N3j2n5L02n11N12j97K3
$$ plain form
5554 27 151 -41 -67 96 -18 -49 -89 -86 -26 -48 68 -338 36 -259 -105 -202 91 -54 70 -122 29 -5 -28 60
5578 60 28 55 134 26 54 -239 80 -13 -59 150 -276 -79 -126 335 -67 -139 35 29 3 -125 -19 26 -159 254
5602 254 -199 250 90 -262 152 -220 -193 -46 26 -87 240 -117 136 109 -263 -28 106 -211 97 -165 340
5623 340 -207 21 -92 150 -49 -125 146 116 -1 -149 -181 135 -79 106 59 31 52 -186 97 61 85 -227 -87
5646 -87 -182 150 77 -150 -245 -10 46 -297 45 201 54 133 -6 11 -176 -114 -72 136 158 -103 -126 165 194 182
5670 182 11 213 18 -102 -78 -30 59 -12 16 -67 145 356 -30 195 -2 308 30 -109 13 -174 -102 29
5692 29 -180 -182 -180 54 27 -43 -104 91 290 -40 47 -58 -297 -64 28 -26 110 150 193 -17 -337 -125 -51 -122 -137
5717 -137 38 -22 93 70 89 115 175 -225 254 -1 -110 198 -91 -208 39 -18 -138 2 -118 -46 -47 42 -11 126
$$ packed form
5554B7J24j92k6J63j14l1m0LO0k2J16m06L74k95J54r7K93j45J24j92J51l4k3Q8
5578F0l2K7P9j08K8k93L19r3m6K09m26J97m7M61m02p2J74ok6j28J06M5j85M13
5602B54m53M49j60l52M14l72K7J47P2j13L27l57K53k7l72K35J34l17L08k62N05
5623C40n47K28j13K42j99p6K71l0j17j48l2L16k14J85m7k8K1k38K83l6K4l12J40
5646h7r5L32p3k27r5K35N6l43L42J56j47P9j39J7j87O2M2K08K2k61k3K91K9j2
5670A82j71K02j95j20K4M8Q9p1K8q3K12K11l86K25j97L10k78j39J22j87P2J31
5692B9k09kKK34k7p0o1J95J99l30Q7j05k39K33R2n4J36M0M3k10l20K12P4p1j5
5717a37J75o0J15k3J9K6O0m00M79k55j09L08k89j17K47n7j20J40j20P2jQ9n3J37
$$ plain form
5741 126 48 93 164 39 -62 75 -82 310 98 309 61 -89 -67 69 180 -260 55 152 -135 -96 47 -82
5763 -82 6 -66 145 31 121 -121 423 -123 28 96 94 -46 185 -130 -228 2 -32 -62 170 7 -84 -341 -105 -281
5787 -281 -67 203 87 68 -22 120 211 139 60 -130 -79 289 -57 -105 18 -194 -183 -79 -70 -99 -257 -47 -35 -99
5811 -99 58 -34 -96 198 -247 208 203 -350 -80 -101 -106 -188 -137 -16 -179 19 13 -54 261 176 -25 -13 84 -41 135
5836 135 21 -124 357 -132 -200 -9 55 270 -288 -95 -164 401 -31 -331 -127 161 89 -71 -236 -62 123
5857 123 -79 -67 139 87 -48 103 55 -257 -15 -148 106 -94 50 -194 52 -133 -81 159 -39 199 24
5878 24 56 121 37 -85 -40 -111 -90 94 167 146 87 155 158 86 239 177 -99 -65 155 65 103 81 -200 21 -244 8
5904 8 170 28 91 -79 278 157 -61 183 289 -51 45 2 -64 291 165 25 -218 120 83 132 -66 -66 -118 12
$$ packed form
5741A26p8M5P1j25j01J37j57L92k12K11k48j50K2J36J11m40L15R7k87L9J43j29
5763h2Q8p2K11j14R0k42N44n46J51O8kj40K31l15r8K30l4l0K32j63r1k57K36j76
5787b81K14K70j16j9r0J42R1p2p9j90N1L68l46m8J23k12J1J04Rk9j58K10J2o4
5811i9J57r2o2K94m45M55nn53K70k1nq2N1J21j63J98oo7L15q5k01J2R7j25J76
5836A35j14j45M81m89o8J91O4K15n58J93o9N65m32l00K04K88p2j60j65J74J85
5857A23k02J2K06n2j35J51m8l12K42j33K54k00J44k44K46j85N2K40j98K38j75
5878B4L2O5q4j22M5p1K1J84P3k1n9O8Lp2J53o2k76L4K20r0L8k2k81K21k65K52
5904HJ62j42O3j70L57j21k18K44J06l40R6m3o6L55j26j40k43L38l7M9j98%n2J30
$$ plain form
5928 12 125 37 282 30 -37 -177 266 -7 334 89 -105 177 92 63 -38 112 20 -77 -311 -223 50 -60 44
5951 44 -115 -252 103 -156 -132 -168 -9 -121 166 36 -151 -209 230 118 144 -227 98 48 -181 -1 -73 -10 -63
5974 -63 -53 181 23 -28 63 128 66 112 -72 -154 67 59 -79 80 274 140 -107 35 155 100 -26 -88 12 -65
5998 -65 153 -91 -19 230 43 255 112 21 -145 -26 291 -100 120 107 -2 10 -56 -53 3 91 -154 37 85 213
6022 213 78 113 -48 79 1 -233 62 -189 -197 -19 164 289 -61 -216 -289 76 159 -268 -99 239 -104 -29
6044 -29 180 6 -76 -212 130 133 230 -169 -110 -398 34 -125 -131 -37 0 67 203 -144 65 84 -74 -13 129 47 232
$$ packed form
5928A2J13q8K45k52o7j40M43k73L41k45j94K82q5k9j01J50r2r7k34Q8K73j10J04
5951D4j59j37L55k59K4l6J59j12K87j30j87n8M39j12K6l71L25n0k29J80p2O3n3
5974f3J0K34j58n1R1O5o2M6j84q2K21qj38J59J94j34k47J42J20n5j26o2J00p7
5998f5K18k44P2K49j87K12j43r1j66J19L17l91K20j3j09J2o6LN6Q8k45J91M8J28
6022B13j35L5j61J27p8k34K95k51qJ78J83J25l50j55p3L65Q3m27J69L38l43P5
6044b9K09j74q2j36L42LR7l99N9k88M32j59oR4L7O7J36l47K09J9j58O1J42q2J85
$$ [...]
8191d7
##END NTUPLES=NMR FID
##END=
