##TITLE=1H_Pr 4-MeO-B
 200.13MHz, CDCl3,
 8 sc
 
 1.10.2025
##JCAMPDX= 6.0         $$ Bruker NMR JCAMP-DX V2.0
##DATA TYPE= NMR FID
##DATA CLASS= NTUPLES
##ORIGIN= UXNMR, Bruker Analytische Messtechnik GmbH
##OWNER= pz
$$ XWIN-NMR		Version 3.5
$$ Wed Oct  1 16:23:41 2025 Russian Standard Time (UT+4h)  she@DPX200
##.OBSERVE FREQUENCY= 200.1313
##.OBSERVE NUCLEUS= ^1H
##.DELAY= (6, 6)
##.ACQUISITION MODE= SIMULTANEOUS
##.ACQUISITION SCHEME= undefined
##.AVERAGES= 8
##.DIGITISER RES= 18
##SPECTROMETER/DATA SYSTEM= spect
##.PULSE SEQUENCE= zg30
##.SOLVENT NAME= CDCl3
##.SHIFT REFERENCE= (INTERNAL, CDCl3, 0, 14.3821)
##AUDIT TRAIL= $$ (NUMBER, WHEN, WHO, WHERE, WHAT)
$$ ##TITLE= Audit trail, XWIN-NMR		Version 3.5
$$ ##JCAMPDX= 5.01
$$ ##ORIGIN= Bruker BioSpin GmbH
$$ ##OWNER= she
$$ F:/spectra/data/she/nmr/H-C/1/audita.txt
$$ ##AUDIT TRAIL=  $$ (NUMBER, WHEN, WHO, WHERE, WHAT)
(   1,<2025-10-01 16:21:59.87 +0400>,<she>,<DPX200>,
      <created by zg, POWCHK disabled, PULCHK disabled
       configuration hash MD5:
       00 E9 B6 7A A2 85 ED C7 34 08 36 98 17 FE 4E 26
       data hash MD5: 16K
       6E 72 E1 14 FB 07 5F B7 7A C8 DB F3 DA 1B 29 AB>)
$$ ##END=
$$ 
$$ hash MD5
$$ C1 73 49 81 6D 26 50 49 22 5C 9C 5B 5C 4E 47 0D
##$RELAX= 
##$RELAX= 
##$RELAX= 
##$RELAX= 
##$RELAX= 
##$RELAX= 
$$ Bruker specific parameters
$$ --------------------------
##$DU= <F:/spectra>
##$EXPNO= 1
##$NAME= <H-C>
##$PROCNO= 1
##$TYPE= <nmr>
##$USER= <she>
##$AMP= (0..31)
100 100 100 100 100 100 100 100 100 100 100 100 100 100 100 100 100 100 
100 100 100 100 100 100 100 100 100 100 100 100 100 100 
##$AQSEQ= 0
##$AQ_mod= 1
##$AUNM= <au_zg>
##$AUTOPOS= <>
##$BF1= 200.13
##$BF2= 200.13
##$BF3= 200.13
##$BF4= 200.13
##$BF5= 200.13
##$BF6= 200.13
##$BF7= 200.13
##$BF8= 200.13
##$BYTORDA= 1
##$CFDGTYP= 0
##$CFRGTYP= 5
##$CHEMSTR= <none>
##$CNST= (0..31)
1 1 145 1 1 1 1 1 1 1 1 1 1 1 1 1 1 1 1 1 1 1 1 1 1 1 1 1 1 1 1 1 
##$CPDPRG= <>
##$CPDPRG1= <>
##$CPDPRG2= <>
##$CPDPRG3= <>
##$CPDPRG4= <mlev>
##$CPDPRG5= <mlev>
##$CPDPRG6= <mlev>
##$CPDPRG7= <mlev>
##$CPDPRG8= <mlev>
##$CPDPRGB= <>
##$CPDPRGT= <>
##$D= (0..31)
0 0.7 0 0 0 0 0 0 0 0 0 0.03 0 0 0 0 0 0 0 0 0 0 0 0 0 0 0 0 0 0 0 0 
##$DATE= 1759321319
##$DBL= (0..7)
120 120 120 120 120 120 120 120 
##$DBP= (0..7)
150 150 150 150 150 150 150 150 
##$DBP07= 0
##$DBPNAM0= <>
##$DBPNAM1= <>
##$DBPNAM2= <>
##$DBPNAM3= <>
##$DBPNAM4= <>
##$DBPNAM5= <>
##$DBPNAM6= <>
##$DBPNAM7= <>
##$DBPOAL= (0..7)
0.5 0.5 0.5 0.5 0.5 0.5 0.5 0.5 
##$DBPOFFS= (0..7)
0 0 0 0 0 0 0 0 
##$DE= 6
##$DECBNUC= <off>
##$DECIM= 32
##$DECNUC= <off>
##$DECSTAT= 4
##$DIGMOD= 1
##$DIGTYP= 9
##$DL= (0..7)
0 120 120 120 120 120 120 120 
##$DP= (0..7)
150 150 150 150 150 150 150 150 
##$DP07= 0
##$DPNAME0= <>
##$DPNAME1= <>
##$DPNAME2= <>
##$DPNAME3= <>
##$DPNAME4= <>
##$DPNAME5= <>
##$DPNAME6= <>
##$DPNAME7= <>
##$DPOAL= (0..7)
0.5 0.5 0.5 0.5 0.5 0.5 0.5 0.5 
##$DPOFFS= (0..7)
0 0 0 0 0 0 0 0 
##$DQDMODE= 0
##$DR= 18
##$DS= 0
##$DSLIST= <SSSSSSSSSSSSSSS>
$$ [...]
##$SUBNAM0= <"">
##$SUBNAM1= <"">
##$SUBNAM2= <"">
##$SUBNAM3= <"">
##$SUBNAM4= <"">
##$SUBNAM5= <"">
##$SUBNAM6= <"">
##$SUBNAM7= <"">
##$SUBNAM8= <"">
##$SUBNAM9= <"">
##$SW= 18.0517328524113
##$SWIBOX= (0..15)
0 0 2 0 0 0 0 0 0 0 0 0 0 0 0 0 
##$SW_h= 3612.71676300578
##$TD= 16384
##$TD0= 1
##$TE= 0
##$TE2= 300
##$TE3= 300
##$TEG= 300
##$TL= (0..7)
0 120 120 120 120 120 120 120 
##$TP= (0..7)
150 150 150 150 150 150 150 150 
##$TP07= 0
##$TPNAME0= <>
##$TPNAME1= <>
##$TPNAME2= <>
##$TPNAME3= <>
##$TPNAME4= <>
##$TPNAME5= <>
##$TPNAME6= <>
##$TPNAME7= <>
##$TPOAL= (0..7)
0.5 0.5 0.5 0.5 0.5 0.5 0.5 0.5 
##$TPOFFS= (0..7)
0 0 0 0 0 0 0 0 
##$TUNHIN= 0
##$TUNHOUT= 0
##$TUNXOUT= 0
##$USERA1= <user>
##$USERA2= <user>
##$USERA3= <user>
##$USERA4= <user>
##$USERA5= <user>
##$V9= 5
##$VALIST= <valist>
##$VCLIST= <CCCCCCCCCCCCCCC>
##$VD= 0
##$VDLIST= <DDDDDDDDDDDDDDD>
##$VPLIST= <PPPPPPPPPPPPPPP>
##$VTLIST= <TTTTTTTTTTTTTTT>
##$WBST= 1024
##$WBSW= 4
##$XGAIN= (0..3)
0 0 0 0 
##$XL= 0
##$YL= 0
##$YMAX_a= 56179
##$YMIN_a= -71360
##$ZGOPTNS= <>
##$ZL1= 120
##$ZL2= 120
##$ZL3= 120
##$ZL4= 120
##$ABSF1= 10
##$ABSF2= 0
##$ABSG= 5
##$ABSL= 3
##$ALPHA= 0
##$AQORDER= 0
##$ASSFAC= 0
##$ASSFACI= 0
##$ASSFACX= 0
##$ASSWID= 0
##$AUNMP= <proc_1d>
##$AZFE= 0.1
##$AZFW= 0.1
##$BCFW= 1
##$BC_mod= 2
##$BYTORDP= 1
##$COROFFS= 0
##$CY= -3
##$DATMOD= 1
##$DC= 2
##$DFILT= <>
##$DTYPP= 0
##$F1P= 0
##$F2P= 0
##$FCOR= 0.5
##$FTSIZE= 0
##$FT_mod= 4
##$GAMMA= 1
##$GB= 0.15
##$INTBC= 1
##$INTSCL= 1
##$ISEN= 128
##$LB= 0.25
##$LEV0= 0
##$LPBIN= 0
##$MAXI= 10000
##$MC2= 0
##$MEAN= 0
##$ME_mod= 0
##$MI= 1.114404
##$NCOEF= 0
##$NC_proc= 0
##$NLEV= 6
##$NOISF1= 3.799351
##$NOISF2= 2.8
##$NSP= 1
##$NTH_PI= 0
##$NZP= 0
##$OFFSET= 14.38212
##$PC= 1
##$PHC0= -1913.201
##$PHC1= 2.992265
##$PH_mod= 1
##$PKNL= yes
##$PPARMOD= 0
##$PSCAL= 0
##$PSIGN= 0
##$REVERSE= no
##$SF= 200.129724274929
##$SI= 16384
##$SIGF1= 3
##$SIGF2= 2
##$SINO= 400
##$SIOLD= 16384
##$SREGLST= <1H.CDCl3>
##$SSB= 0
##$STSI= 0
##$STSR= 0
##$SW_p= 3205.1282051282
##$SYMM= 0
##$S_DEV= 0
##$TDeff= 0
##$TDoff= 0
##$TI= <>
##$TILT= no
##$TM1= 0
##$TM2= 0
##$TOPLEV= 0
##$USERP1= <user>
##$USERP2= <user>
##$USERP3= <user>
##$USERP4= <user>
##$USERP5= <user>
##$WDW= 1
##$XDIM= 8192
##$YMAX_p= 0
##$YMIN_p= 0
$$ End of Bruker specific parameters
$$ ---------------------------------
##NTUPLES= NMR FID
##VAR_NAME=  TIME,          FID/REAL,        FID/IMAG
##SYMBOL=    X,             R,               I
##VAR_TYPE=  INDEPENDENT,   DEPENDENT,       DEPENDENT
##VAR_FORM=  AFFN,          ASDF,            ASDF
##VAR_DIM=   8192,          8192,            8192
##UNITS=     SECONDS,       ARBITRARY UNITS, ARBITRARY UNITS
##FACTOR=    0.0002768,     1,               1
##FIRST=     0,             0,               0
##LAST=      2.2672688,     0,               0
##MIN=       0,             -71360,          0
##MAX=       2.2672688,     56179,           0
$$ Real data points
##PAGE= N=1
##DATA TABLE= (X++(R..R)), XYDATA
$$ [...]
1779C04j99K3J45l26K10j32j76L09k51M9Q1j7k79J98J29l31K28m7M41k18l98M54
1801A97n0k37N73o02k10M15j25K6K0j94J98Q9k46lK7K8L54j11j10J11M1l37K20
1824G4PK67k88k39M83l72K4m5J33l93N53l55K67K4l8Q5k01K07K63j14l24M35l22
1847A31J3j83K3J72Lm50K36l23J17J62J6l8R2J00qK68l59J20l8P7o3K4r2J25l56
1872b31lL45l13K31K3l19K40J39j87J18j76J44J65l59j91N00o7k34J37R6K24k46
1894C6n1j60J97k37l9R2K8K2K3J25k1j88P5K32j36J43j7J4K70k89j24J22n33L71
1918d5J75k81k7L1J20k4J45k05O7P3l51L31L9j58K80j54j60K21J13k73J26pK63
1941B99m13J67K96p09J29J01l%K32j24P0p2Jn0lL00K6j01j5op2p3j0r2RLj37J36
$$ y = [304, 105, 128, 273, -53, 157, 25, -151, 158, -93, -44, 37, 20, -259, -61, 68, -263, -35, -82, 359, 141, -257, 197, 147, -90, 483, -119, -329, 86, -39, -13, 7, -187, 11, 100, -146, -149, -122, -94, 260, 149, 39, 150, 191, -146, 74, 81, 348, 60, -179, 304, -68, -44, -89, 44, -349, 204, -151, 116, 140, 102, 187, -14, 193, 456, 342, 18, 453, 131, 144, -39, -16, 156, 159, -291, -55, -378, -261, -99, -83, -121, -29, 71, 63, 331, -28, 92, 54, 131, 68, 92, 0, 125, -231, -234, 111, -202, 29, 52, -267, -27, 112, -75, 43, -133, 11, 176, -183, -374, 126, 59, -175, -38, 58, 282, 36, -15, -175, 22, -215, -254, -162, -134, -112, -89, 36, 15, -173, -98, 134, -2, 141, 124, 138, 408, 119, -5, 117, -416, -45, 130, -151, -178, -147, -27, -51, 94, -111, -44, 29, -322, 9, 48, -110, 170, 16, -144, 77, 190, -83, 43, 36, 299, -114, 53, 349, -360, -231, -130, -133, -133, 99, -25, 45, -27, -26, -76, -79, 221, 247, 146, 131, 125, 53, -20, -30, -122, -113, -110, -247, -111]
1969a11Q3Q5Q8qm58J47L34J4O8k24K2K51p1j30J12k76P5J49l92K44k54K30J19
1992I7p9l0k2j68J83Lo4L2P3Jj60q7K34R3o8k41K10R2N6l85K39J06J1j17j68K66
2018A07K4j29K2j17K80l02R9j40P5N23m54K18k56j40M21k57n9J81M4k44J78LR2
2041A69k42j07J91K8J3k22K93j06Q3k92K28O1m4j61R8r6J32j92RK84j13l4J40
2064A20M1J70j73l7r6j75K26J55j80j21Om6K18n7j27l3P8P2J71k75NK45%l76J18
2089g1L29j51L4j19j28K19m15L01J52j09n8p9Q9k8J72n09L61q2j9J52j52N7J5
2112c9N7L7M0n4K36j01j70m7K4j86N20o79L03K60m10J48k2j0J04k45J07M46l71
2135e2m3K85r9k15L08l83J02p4J57K8p8M1R1k14J87o8j22Oj0K71j5j82j53J64
$$ y = [-111, -28, 57, 145, 137, -321, -174, 160, 174, 242, 18, 40, 291, 220, 90, 202, -74, 1, 150, -242, 2, -252, -22, 97, 18, -12, -34, -202, -19, -16, -80, -48, 25, 26, -134, -221, 13, 106, 38, -203, 7, 99, 155, -230, 9, 115, 126, 9, -159, 107, 131, 2, 24, -93, 187, -115, -16, -156, -81, 442, -12, 206, -50, -190, 231, -26, -85, 96, 140, -104, 74, 77, 169, -73, -180, 11, 39, 52, -170, 123, 17, 100, -192, 36, 97, 53, -108, -10, -106, 26, -166, -157, 127, 14, -20, 120, 161, 331, 158, 121, 25, -150, 76, 231, 51, -70, -64, -110, 108, 51, -76, -109, -31, 41, 212, -63, -58, 187, 187, -189, -71, 258, 107, 141, 22, -106, 113, -302, -1, 151, 42, -16, -95, -6, -34, 138, -371, -10, -92, -111, 41, -111, -54, -39, 18, 55, 95, 41, 277, 176, 6, -41, -17, -203, 317, -362, -59, 201, -209, -61, -83, -93, 11, -234, -127, 319, -52, -95, 190, 91, -124, 184, -199, -97, -171, -14, 14, -64, -23, 68, -146, 41, -27, -149, -143, -153, 118, 103, -79, -232, -68]
2159f8J00L9l03L54r5J28J75n56L39m70N71j99kJ65k00J0K28l39k2L14o35N72
2181A06J0L7k46L61q5m52O2m6M03k46J73j6%P3q4m55N20k88K69m1K19j49l25K89
2205H9J42j52k48K27Q3j38J92k84J28J51k10l0k8K59k48J58j24M8k9J13Q3j03
2227G9J61p5j95K03l44R1j49M49j94J7k0l2Pj55K74j38K39j85q3j34K38p7P0n4
2251gK9m9L1k37J13L01m16L76j61kn6N5q8M8J19p3J9n0L7j07P1J50K70l95J91
2276A69n6j97J58r1j46k10K47K26j68OJ8j86L36R1j60k34K33n4Q8p6k8K74q8l70
2300b18J81m50N72j20j74J61J07q7M6J00j77m4K22J9k0j72R4Q5j24j5j13J2K29
2323A14k54J07J47k8q1J0J65l23J58j60J65j69K79o8j9Nl3j39J57J72l62R7n2
$$ y = [-68, 32, 71, -232, 122, 27, 155, 330, -226, 113, -357, 214, 15, 13, 178, -22, -12, 216, -123, -145, 169, -466, 106, 116, 153, -93, 268, 183, -269, -207, -253, 150, -96, 77, 61, 61, 134, 50, -405, 115, -173, 96, 55, 274, 125, -200, 89, 231, 79, -169, 58, 141, 3, 195, -89, 39, 190, -20, -50, -78, 181, -67, 91, -33, 15, -14, 99, 182, 79, 240, 165, -30, 173, -171, -80, -229, 220, 26, 43, 23, -9, -2, -157, 117, -21, 218, 33, -50, -184, 54, -23, 47, -7, 22, -27, 4, -233, -120, 181, -235, 141, -20, -22, -78, -23, -111, -63, 56, -17, 2, -48, -11, -118, -47, 103, 373, -22, 169, 113, -84, 74, -17, -163, -373, -126, 100, -68, -62, -44, -230, 106, 197, 37, -197, 36, -18, 70, -6, -34, 240, 152, -218, -37, -487, 85, -35, -209, -48, 59, -28, 18, 118, -59, -103, 119, 138, 118, -54, 40, 125, 1, -14, -127, -115, 114, -140, -33, 114, 86, 5, 15, 180, -143, 15, -145, 20, -149, 130, 62, 43, 48, 15, -124, 33, 205, -157, -60, -112]
2346a12J97k84r4K46K81k77j1J10J19k00K05r8j03L2R8k15o1O4Q9J07p0J2J92
2369B27l06J15J5r7m3k2J35k43L65j27n8L24j87o7l6L0o6J57l6j90J41n7J4OQ
2394Bj49K2J70q4L47m67j81J36R4J4R4L9j45J0M9L9j25O7K73k84R0o7L39%m76
2419a93K21l1J68j18m3J84o6r9J28k37m7O9J73j90L6j96K06j14J47j15J4R9r4
2442i8P3O4j34K24J0M3l61K36k50K95k7l11L19k07K31L5n9J86j90j68K15l05J11
2465f8K31k42k96N47k40p3K57l7M8j43o3J55j47oJ51j35K1O0m3J19j62K52p0l42
2489b26K23J23J3k66MJ48L4j23J53j56K0K52l21j0j36L98k5m4j87Oq7j80M30k
2513D1j51K93k45L85p94M38J8K34j49J27l77R1j00K84m7l1r3n3J51K43l75J61
$$ y = [-112, 85, -199, -293, -47, 234, -43, -54, 56, 175, -25, 180, 82, -21, 11, 109, -106, -167, -103, -14, 93, 23, 35, 227, -79, 36, 51, -46, -89, -111, 24, -219, 146, 19, -39, 285, 98, 31, -5, 25, -41, 116, 80, -110, 31, -26, -12, -6, 2, -147, -125, 45, -39, 308, -159, -340, -204, -110, -96, -2, 37, -108, -98, -49, -10, -135, -68, 205, -79, 11, -56, 283, 283, -193, 28, -3, 165, 47, 4, 188, 122, 23, 151, -86, -133, -64, 109, -81, -45, -241, -35, -149, -2, -117, -103, -4, -98, -25, 39, -95, 129, 139, 182, -179, 57, -193, 102, 75, -236, 83, -124, 107, 142, 83, 269, 79, -89, 126, -179, -68, 163, -79, -375, 172, -68, -141, 116, 79, 127, -16, -79, 76, -71, -77, 74, -61, -40, 20, -23, 96, -66, 186, 116, -226, -3, 120, 133, -133, -129, 19, 53, -70, 83, -73, -53, 199, -122, -132, -268, 130, 105, 61, -126, -120, -207, -387, 43, 41, -110, 183, -62, 323, -471, -33, -15, 219, 70, 197, -180, -89, -189, 95, 48, 17, -76, -129, 22, 265, -110, 51]
2535E1p2O0o8k46K80O9j41p7O04k44l07M9J0j6J55m7Qq3J07k29K44m9K2J26N9
2560B65j83j6k94M26l43K34J51j84J6j83J87J29m8k15q7R5nj6J48J11R9m2j76
2583F9k37J79j31J74R1Pk12K4K5m5l6Q0J49k68m7K41p4j54J99L5l09J16p6K00
2607@Lj8J0k1j65J41M76m35k5M4j11L28l07J83L9j61r3K1K26k31J08J47j72j58
2631a71J05P6k62N00l16O6J14l04K09j29J66J27k80L71j61r6Q3j16j24jK18J2
2653H7k97L92p9k28o1N6J24j03K88q2M3k17Q1k38L97m15K28J90l67K21k3J12q6
2676B3j0P9k97K12J33j92J59J17n15Q4Q3MM3k48M33l56J28L25l69N2NJ54j50j4
2700a17L8J42j91J71l90M50m7j18n8R5QJ8k01K56N7kn4k54L42J22k07l60L32k25
$$ y = [51, -21, 39, -29, -275, 5, 74, -67, -144, 460, 216, -91, -42, -32, -48, 107, 60, 68, -15, 92, -137, 107, 58, 80, 206, 265, 82, 66, -228, 198, -145, 89, 240, 56, 72, -111, 76, 205, 157, -58, -145, -50, -55, -71, 77, 188, 287, 245, 69, -168, 11, -120, 54, 145, 152, -60, -36, -11, -56, -92, -12, 137, -131, -178, 63, -11, -165, 34, 69, -240, -124, -200, 0, 3, -15, -5, -26, -191, -50, 426, -9, -34, 10, -101, 227, -80, 103, 142, -19, -112, -91, 135, -96, 12, 159, -13, -171, -66, 10, -252, 248, -68, -2, 112, -192, 17, -112, 54, 181, -99, 272, 111, 15, 98, -18, -142, -143, 75, 87, -210, 182, 103, -125, -186, -130, -6, -109, 179, 97, 140, -77, 4, -234, 163, -252, -24, 166, -201, 20, -3, 109, 23, 13, 92, -205, 7, 140, -52, 107, 224, -291, -207, -124, -120, -77, -325, 108, -248, -120, 205, -164, -112, -107, 47, -103, -117, -79, 63, -128, 43, -347, 103, 56, -62, -120, -25, -17, 1, -200, 56, 113, 111, 57, -197, 145, 267, 60, -300, 32, -193]
2724a93L09j04L35m04N4k30J81J09l36K36j41L5K79p3j07Q3J21r2j41J54K80l76
2746b1J46l7R5K5j5p8N9k19m1R0l2J38j24n6J80Q3k12m2J97j09J23k12J29j20
2770e3O0o3J22k45M4K18j37N5J84k22K85l36jJ80j31J46j70J72R9k58m6J54L7
2793I4k17J96J07k03J85j54k12J04j3K00j80k7M2K53r1j60J03J4J7j68J43L24
2815C57o22N9J53j96M18k79J67K6j78l9k44L57J78O1q3k69K22j56q2J38j58K17
2837D7%k55L59j53m58K52K94p1j83R9n0J44or5l1j04L48l3l9ko2J39k26K60n9
2862A15L8j54j27R8KL59l81J33J09l05j5l6K56j6N4n4p6J05q9J9M1j28J6L9J91
2887A94j87j06K50j59l8j00L36k17K0lnNJ65j64J00j42J57q5k45J69J09j12P6
$$ y = [-193, 116, 12, 347, -57, -3, -233, -52, 57, -279, -43, -184, -149, 130, 57, -50, 33, 154, 62, -79, 75, 355, -21, 125, 88, 183, 208, 193, 115, 174, -45, -86, 4, -28, 110, -14, -70, 110, 193, -19, -61, 136, 27, 150, -62, 67, -53, 7, -56, 66, -179, -135, 83, -54, 1, 185, -37, 248, -88, -89, 91, -40, 106, -64, 108, 207, -51, -97, 57, 94, -123, 73, 180, -23, 162, 8, -204, -100, -113, 87, -93, -120, -78, 175, 84, -76, 27, 41, 58, -110, 33, 357, -265, -206, -53, -249, 169, -110, 57, 83, -95, -134, -378, -21, 157, 218, 135, -134, 88, -68, -150, -12, -170, 47, 47, -208, 151, -2, -460, -208, 86, 15, -168, -69, -119, 25, 19, -76, -107, -211, 137, 104, 65, 63, 1, 140, -86, 174, 115, 153, -1, -128, -30, -28, 331, -50, 83, 192, -113, -128, -164, 92, 76, 130, 76, 0, 105, 16, 35, 76, -52, -36, 3, 194, 7, -99, 151, -8, -46, -146, 190, -27, -7, -10, -15, -10, 155, -9, 91, -51, 106, 21, -224, -55, 54, -58, 18]
2910A8J7Q0n6j79pK01k83N49j44n3k42k43J43L52j58J19m2j07k38L35k12qO6K8
2934f4j70N36m75k5L49k76K27l18K93Q1k71J86k70J36K78j77P8k56j48N60m88
2955b14L72k98J0K91j08j80k7J58L34m48J79m8j26o5J70Q9O0k93P4L9j5o3j19
2978b28L28k20R1j11j10l8J97J46n4n7K36m29M84l30J98j57K83m61K57J61k59
2999g3R6J17l6k28K85n5j01Q8%J9k43J52k00K14j39l3J32O9q9Q1o1NpQ3l6K5L9
3026A04k35K24l56M62k8j17j04l00K93nkK17l04J93J97l14J02q5j16L55l6k80
3048a35P2J05N7k21j31K33J91k77R1M5mj38K55K8j44N8p6J41j02q7R2n9j65J55
3072a6K41Nl3k59k6L26n08L18j92P4p3J5J99m1j50o8J80J62o2k83Q5Q6r3k60M97
$$ y = [18, 35, 115, 59, -120, -127, 74, -209, 340, 196, 143, -99, -342, -199, 153, -5, 114, 72, -35, -273, 62, -150, -158, -92, -64, -234, 302, -173, -198, 151, -125, 102, -216, 77, 158, -113, 73, -197, -61, 217, 40, 118, -138, -286, 274, -214, 158, -140, -130, 161, 53, -127, -154, 4, 338, -110, 69, 21, -105, -170, 0, 89, 149, -144, -70, -31, -46, -109, -228, 100, -120, -29, -140, -250, -288, -91, 55, 1, -56, 180, -249, 235, -95, 103, -54, 229, -232, 25, 186, -73, 23, 140, 104, -124, 161, 106, 5, 93, 93, 112, -131, 21, -179, 35, -104, -137, -5, 64, -25, 56, -5, 0, -7, 76, 40, 65, 104, -131, 93, -263, 199, 171, 54, -50, -350, -57, -62, -64, 153, -151, 42, 239, -75, 27, -58, -174, 181, 145, -135, -63, 42, 99, -122, -253, -20, 171, -106, -15, 30, 26, -112, 143, 171, 27, 85, 9, 150, 48, -39, 53, -6, -171, -16, 225, 230, 197, -62, -88, 238, -270, 48, -144, -70, -143, -128, 71, 30, -120, -188, -8, 154, 92, -191, -106, -20, -113, -373, 124]
3097A24j96k71N03j84p6M7K27j50K21k09J0K36j19k99p7K87L8j62K03j27l7j93
3119b04j80M84j9l4k06J14m4J66Pk79L54j12l75K89j38O6o6K75o3j2r0rOm4J06
3144hk20M37j7j53J06l8j27L3j06J09j2J55k69L01k78K4K31m3k46K19l4OJ2j98
3168a16K31l27L42l9k34J93K76l50Q9l1n2J12k22l9L35j37j61K96O3m29O6J44
3190A0R9l04J99K10j50k6K33m91L3K78j28j16Q1L2Q2j68M9K38Jj67P4o6j82J41
3214c8k7J66j6k45L14j77J41r9o1M4j14N9j6j2J10l1k70P5J6K78k90J94Pm1J78
3239A45j51P8l7m38L72j41J77k91J5J85jJ01m3k1Q4k74J70Q1j15J65j21J34m2
3262C2j52QN9K6k76J72MK5l9J15K1K0J98J5k30j70L8J85K3J72r9l7j70oJ10k50
$$ y = [124, -72, -343, 160, -24, -100, -53, 174, 24, 245, 36, 46, 282, 163, -136, -213, 74, 112, -50, 153, 26, -11, -204, -384, 100, 81, 47, -159, -45, -89, 77, 84, -195, 159, 47, -328, -39, -177, -111, -177, 98, 35, 23, -67, -76, -70, -114, -8, -228, 209, 192, 39, 145, 107, -20, 13, -93, 16, 4, 159, -110, 191, -87, -63, 168, 125, -121, 98, 64, 70, 82, -116, 115, -212, 130, 91, -143, 50, 326, -24, 65, 34, -18, 94, -128, -167, 168, 31, -130, 166, 229, -200, -134, 10, 109, -195, 4, 214, 64, 38, 271, -220, -187, 91, -37, -153, -72, -40, 42, -126, -77, 161, 162, -5, 69, 3, -179, -38, -65, 101, 85, -160, 154, -23, 118, 19, -42, 2, -112, -53, -69, -81, 29, -2, -272, -197, -181, 97, -193, 1, 8, -33, 145, -6, 72, 35, -403, -31, -172, 5, -286, -271, -86, -87, 14, -29, -50, 34, -240, -70, 11, -104, 61, -60, 74, 32, -120, -112, -53, -27, -303, -131, -127, -102, -141, -26, -5, 15, 213, 228, -2, -172, -134, 51, 74, 246, 147, 110, -60, -66, 44, -206]
3288b06J6J83O6J5k54J70j05K4L8Q4j39J22L23l94p3J13m96N82J25k08J97j73
3310A0k13J91M5p6J01O9q3j65p4N9O3N8O6Q1j10mO1p4n2J30k45M93o71L87o3k7
3336d3Ql7K04k2k60J95k81k24M82J3j11M2PK03l89O5J29O8o1l7j2j36K86q0J00
3361A09k4m2j57K6P1j06N93o83J0J75q2J44nj69L16o8l23J21n3J09J75k26j02
3384a91K1J25j64K93j33j50K89p5K79j52k19K14j24j70M2J25j5p8J1q9o2L20P1
3407A68j17n9K26m82J93M07m87J93N1j97K84r5l23K78n4Q2l04M20k85K01r4Q7
3429I3j02m0J45j2O8j26n6k40K98N4J01l18K41p3L5JJ5q3J13j87K39q3r1p6K69
3454A85k24k71L02q8Q3O9k12O6J61l5j29L83o8k32J21k54J16K24k31K76l47l1
$$ y = [-206, -190, -7, 59, 74, -180, -10, -115, -91, -53, 31, -108, 14, 337, -57, -130, -17, -513, 69, 194, -14, 183, 10, -203, -12, 33, -43, 58, 127, 44, -121, -195, -136, -73, -15, 51, 132, 22, 18, 79, 5, -47, 83, -162, 331, -340, 47, -16, -43, -35, -72, 132, 110, -150, 45, -236, -460, 22, 35, -76, -34, -27, 176, -213, -148, -19, 49, -12, -49, -61, -197, 89, 9, 109, 85, 43, -114, -88, -17, -123, 470, -213, -203, -28, -110, 34, 29, -140, 176, 108, -215, -94, -147, -38, 137, -89, -191, -170, -45, -209, 84, -49, -199, 90, 15, 294, 142, -77, 137, 13, -157, -115, 10, -5, -83, -72, -161, -223, 97, 168, 51, -8, 218, -264, -71, 336, -151, 42, 93, -104, 180, 85, -238, 40, -14, 68, -236, 184, -101, 100, 6, 93, -9, -49, 96, 84, 152, 26, -30, -270, 28, 82, 183, -135, 106, 33, 68, 69, 84, 1, 114, -73, 166, 83, -8, -84, 185, -39, -310, -8, -96, -13, 56, -156, -90, 71, 36, -93, 290, 222, -10, 111, -143, -27, 197, -34, 242, -105, -136]
3476a36O7O0P3j20Q0N1k73O3K86R2o8j2J3R5j76k57r8k2P8L82j26j04J37k94M13
3501B04j32j27J61L7O4j05k7J56j36K70k83k66m5L2J09K42M1j62k92L60q0L02
3523C23l82O1L2L1j02N4J36j12R9k13J03k5l23L92R7n39L40k8M0k70K68K0J05
3546A07L9k36J53j01J60j60K34N0l2j71m8J23k7J55k25J20l5j77j01J88J78l20
3568a26J17P8j35J42n6J27k91n7N3L20k48J27J96j28j05N22m91k8j56l9N3K59
3590A34J56k75J16j88K1L00l95J98k32J80M0j35L3k4K25l77L58j88R2J3k09M40
3612B83l77J43k29K72P3l68L31m26R0K02j5k0J17r6J15j40K25k28J2M2j57L37
3634A86j19l76P9M40l40N4L34j36j74J35j77J72j7j44J45j00J63j10o9o9J3L03
$$ y = [-136, -69, -9, 64, -56, 24, 75, -198, -135, 151, 243, 175, 163, 176, 271, 95, -162, -260, -282, -204, 178, 52, -52, 85, -209, 204, 72, -55, 106, 143, 207, 102, 75, 231, 95, 365, 82, -184, -229, -197, -88, 154, 195, 33, -259, 101, 21, 323, -59, 2, 34, 65, -37, 17, 153, 41, 140, -73, 30, 5, -318, 74, 171, -368, -28, -56, -16, -286, -18, 2, 107, 146, -90, 63, -38, 122, -38, 196, 246, 214, 43, -5, 118, 91, 246, 21, 141, 106, -71, -172, 16, 194, -126, -9, 69, -66, 76, 20, 147, -144, -201, -148, 172, -76, 51, 247, 119, 14, 536, 45, 17, -139, -178, -125, 134, 290, 15, 131, -57, -36, 264, -131, 67, -165, 15, 55, -80, -47, -71, 154, -223, 135, -53, 39, 52, -157, 283, -94, 49, -180, 92, 165, -203, 128, -298, -208, -6, -21, -41, 76, -20, 95, -45, 180, -48, -36, 6, -151, 186, 67, -309, -230, 210, -130, -76, 258, 122, -52, 83, -94, 78, 61, -83, 62, -38, 125, 15, -54, -123, -110, 193]
3656A93l54K00n5r4l9j45M69k5k26L32j04j62n1J78q8R5q2m00N68j88R8l3k79
3679a92J20k44L99N2k30J61J7J2j47N0q3J05r0P4Q9pj49L27k55P2l22L5o4N53
3703B83k04O2J6k5jm9j95L71j54k44L06Nj96J8k99L91J45k21K39jk54j65K62k73
3727a83L47l09K77l2l5j57j03J98J55k19N6J59m9k8k74JL16J37k41mJ06j59J48
3750A07j36j39N2k36L20J31JJ55l05K65j58q2K91j36m33L53k89JK88J24P4k14
3772C4K60k97k04L56j29k1L32l70J58p3Q5k79Q2j85M67q9k45o6n0K32J25l65M36
3795A94k98K1M8J65l24L08m26J84J7J6L50j73k08K0L9P8O0k82K41q4j20L28L3
3818A87l56M1Q3K71k57J22J4n3J20k73N9J6QJ37l15K75k71J63J27Q3k88J43m62
$$ y = [193, -161, 39, -16, -110, -149, -294, 175, 150, -76, 256, 152, -10, -61, 117, 29, 124, 42, -358, 210, 22, 120, 87, -192, -72, -316, 83, 135, -95, 66, 83, 95, -52, -2, -85, 20, -70, 4, 93, 86, -63, 264, 9, 81, -241, -206, -270, 283, 79, 141, 157, 132, 131, 82, -113, 258, 104, -140, 166, 171, -25, -7, -306, 85, 230, 9, 248, 247, -7, -172, 90, -183, 164, -145, 132, 100, 65, -92, -195, 3, 158, -61, -5, 154, 105, 77, -197, -196, 120, 257, 16, 12, 118, -41, 107, -29, -168, -116, -352, -32, 99, 100, 255, -50, 215, 57, -25, 266, 130, -303, 50, -239, -238, 50, 174, 248, 34, 294, -3, -207, 149, 20, -1, 331, -39, 119, 46, 131, -148, -66, -251, 216, 127, -118, -184, -234, -2, 123, -242, 194, -104, -83, -35, 130, -194, 114, -312, -128, -111, -95, 255, 82, -126, -106, -67, 11, 71, -211, 30, -54, -174, 154, 187, -169, -128, -45, 226, -31, 91, 105, 52, 172, -101, -42, -26, -18, 119, -196, 79, -192, -29, 98, 181, -107, 36, -426]
3841d26N19m9k39J22j03L32l78O8J2L94k87p6Q5K07j17j42j08J89Jj24K24j26
3863b2P5j06J90k15J80L0l51K52m8p5K47j38JO5n2n5L66k25k59L26k91L20p9N2
3887A88j59J41k05j26J60K82l09j50K99l23N4K97j58M7K7J1k11M7J10j63J31J13
3909A03Jp5n2J25j35J79j26j89L06n0q1Q1l16L33j6j72N5L5NOM6j53m7K37m9o4
3935a3L8p5J63n05M32P9j90N8P0o5p7J8J37J65k03J92l39J24j40l7L81M5j60R4
3959A92l57K40K78L8m33o0J07L0l5Q1m1J53j27J6k5o3M6Q5j50n2j34J55K73j63
3983E4j91N2J39j6j32J5k15J54P1Q5Qj8j8K20j62j44J29J65j40J27j76M6j02j06
4007a55L12k53p3P2k14L88k5n0l2J29k92J33J38oJ8j97P5j11J13M16m73J22J09
$$ y = [-426, 93, 44, -195, -73, -176, 156, -222, -154, -142, 252, -35, -111, -26, 181, 64, -78, -186, 3, 4, -120, 104, -22, 53, -53, 137, -78, 102, 132, -219, 33, -15, -90, 157, 19, 20, 85, 33, -22, 344, 119, -140, 186, -105, 215, 136, 188, 29, 170, -35, -161, -1, 281, -28, -178, 121, -202, -148, 149, -9, 38, 65, 76, -135, -88, 22, -141, -10, 103, 104, 29, -23, 102, -33, 146, 20, -169, 137, 87, 6, 87, -229, 104, 88, -84, -29, 6, 11, 17, 63, -90, -137, 100, 51, -13, 25, -50, 113, -392, 40, 119, -71, -13, 57, -8, -85, -67, 70, 235, 32, 224, -115, 9, -131, -168, 213, 258, 98, 192, -165, 75, 353, 391, -42, -102, 5, 35, 0, 81, 40, 193, 66, 82, 57, -6, 40, 125, -25, -77, -211, -56, 217, 54, -137, -85, 54, 38, -94, -79, -294, -140, -69, 16, 24, 6, -12, 208, 46, -98, 31, 196, 56, 183, 7, 53, -49, -155, 157, -96, -169, -97, -311, 77, 52, 2, -30, 99, -193, -60, 78, 72, 90, -107, -32, -143, -30, 386, -87, 35, 144]
4030A44q8J02n7O5l51J89o6j5K50j34o9P7n36N84J87j65j2k45K35j80K8J79N0
4053A72k88J31J11L6k72o8K69k18J60l7j7q8N1N8L24j64o6o5l4M9m1j71K90k02
4077h0K60k77Q7j64K21j24o4J02j00J85k44J54k28M15M3j59J38k35K00q1o0j2
4099b3j18P6j05r7P4L26j1k06P1j5kK8k20J7L08j44joJ18k79K14J86j71L00l22
4124bj17k8P0K05R8l06J61n7q3O6o8K7l9j7J92o1M1L7j43J6k45L42p4m10M27k27
4150a95J59kJ05k43o4M37k97N8n7L54k20l43N26l39K23n9k65N81n19K68k76K8
4172a40O1k99L39K43m00M4J78r6K54l3q1j21M2K20j73j48K75m5m02K91K24m28
4194a95M67k43k55lL91k95N1K20j24k17J00J2l5k1j05J12P5P6N6N0o4n6j76L42
$$ y = [144, 56, 158, 101, 166, -185, 4, -62, -77, 173, 39, -30, 47, -489, 95, 282, 117, 105, -140, 95, -85, -57, 122, 172, -116, 15, 126, 162, -110, -178, 91, -127, 33, -4, -21, -109, -58, 0, 324, 160, 94, 29, -5, 44, 3, -168, 122, -80, 180, -97, -10, -174, 47, -77, -141, -39, -139, 46, -198, -44, -272, 143, 186, 27, 165, -70, 130, 49, -11, -23, -141, -65, -170, -267, -193, 133, 122, -84, -13, -28, -30, -2, -222, -205, 103, -41, -42, -48, 70, -209, 5, 191, 20, 320, -2, -119, -147, -77, 128, 226, -80, 81, 24, -59, 7, -61, -34, -73, -90, 102, 41, 82, 119, -24, -8, -253, 89, 15, -395, 32, -195, -36, -38, 67, -176, -240, 197, -100, -42, -99, 255, 35, -308, 218, -121, 102, 43, -222, 359, -160, 108, -168, -140, -79, -378, -39, 204, -196, -152, 26, -70, 184, 151, 70, -51, -9, 211, 38, -110, 165, 120, -282, 9, 233, -195, 272, 29, -226, -229, 162, -133, -82, 138, 14, -203, -103, -91, -126, -147, -252, -140, -65, 11, 67, 117, 53, -3, -179, 163]
4218A63k74j8K44j72J1l27N53J92j97J4r3j01R7J34k21L0OM4n3j87J1M3J74q1
4242hk6J04r9j20K51M6j76lO4j15J60k9K72j54j95K0k56J97k4J68o0J19q6n5J09
4267A04j93o0J47J34m50L15J53J4j57pJ58k47j63N05k17j43p3qJ52K09m79L02
4289dJ35j22J17k76J82k25N58j52J31l85L64m18K6k8J13k17K29k56m2K92k43J00
4311a21J04M4j32K91k35N3Q1j07k3K6O6k2m0K69k61j72qK48l8J10K7j18L44k07
4335A79l5j25o0Q6J98k86K1l4J06p3j88K92k5n8L25k34l32L07j36o0j09M28m58
4358b71M83m01J61J58k81P1K08j10j61K12j41J33k44J95J68o7o1J12J11j31L6
4379A80k82J95j49j83J85K68L65n21P8k78J23o7L53k89R1k32J85j93K7K02j11
$$ y = [163, -111, -129, 115, -57, -46, -373, 180, 372, 175, 189, 96, -5, 92, 226, 5, 35, 41, 85, 32, -155, -144, -101, 73, -8, -34, 70, -29, -149, 102, 148, -28, -31, 33, -82, 78, 49, 321, 167, -28, -8, -264, -67, -91, 77, 17, 136, 50, -5, 104, -89, -149, -2, 132, -318, -3, 150, 164, 7, 0, 158, -89, -252, 253, 36, -107, -180, -188, -36, 173, -306, -4, 131, 9, 126, -150, 32, -193, 365, 213, 344, -41, 323, -95, -69, -97, 16, -201, 28, -228, -270, 22, -221, -121, -17, 27, -105, 186, -49, 4, 85, -22, -45, -19, 47, 25, -15, 254, -7, -179, -187, 61, 23, 133, 160, 42, 386, 179, 144, 19, -41, 45, 243, -43, -22, -56, 50, -23, -211, 81, 56, -2, 323, 89, -243, 64, -72, -132, -241, 187, -271, 212, -189, -28, 130, -151, -80, 128, 18, -143, 69, -72, 61, -183, 12, 180, 113, 52, 164, 275, 144, 180, -102, 93, -56, -239, -54, 214, 579, 58, 136, -142, -19, -86, 267, -22, 69, -163, 22, -171, -144, 58, -53]
4400e3j28J00oR8j47J85L9k16K46K23k04P5M9m64L13j41M5j20K4j35L37j40q5
4423a05N4Q1k3j23J68k4J85k04O1o8L0j04r8K50j72j20K51J4l3k42K2J87j02J70
4447E5k07K8J52K6K3j73K71M1j86P1n8j05j6k33O22j21l55J71O3k97L19Q9j90
4470a0J59J0J60l17Jn6K87k36mL1j1l5N4j25K55j36k85K7j41L34p7J13oJ16q2
4495B6m6m0M0j6r8k3R8ll4J02r6J05r1J59P4j15p0j19J42Q5j29O7R0j68K45r9
4521H6lkj22K38l23k62K02J43L4j66J89kj46J2q0J97J55Nk56J39M7j05M29m85
4545g6J16Q4k67L00j56J63k56K83j24l3j40N1J75j84J97o7j75L11j31j55K69r9
4567H6K6j77K7J2N3L5l3J6k19L27m2j01M0k73K22n0K13L6o4j01k03N8mL06n18
$$ y = [-53, -181, -81, -87, 11, -136, 49, 88, -128, 118, 341, 137, 212, 261, -203, 110, -31, 14, -106, -82, -217, 120, -20, -105, -51, 30, 7, -116, 52, 28, 213, 9, 70, 2, 32, -72, -170, 80, -92, -212, 39, 53, 20, -222, -200, -13, -115, 55, -152, -124, 28, 54, 77, -96, 175, 216, 30, 101, 43, -62, -78, -311, 311, 190, -165, 6, 69, -228, 91, 180, -10, 149, 159, 319, 2, 3, -53, 234, -2, -6, 25, 14, -21, 33, -92, 163, 27, -258, -231, -372, -38, -115, -2, -8, 108, 26, -20, -60, -20, -36, -134, -157, -59, -62, -96, 6, -90, 15, -76, 83, 157, 42, -28, -147, -5, 80, -49, 18, 108, -60, 185, 86, 83, 81, -41, 197, -126, -388, -186, -43, -9, -175, 14, 12, -134, -122, -202, -5, 150, 155, -101, 38, 85, -20, 409, -76, 40, 124, -143, 157, 1, 164, -92, 191, 67, 34, -106, -55, 120, -64, 133, 66, -109, 202, 71, -84, 185, 86, 112, -65, -38, -26, 27, 62, 29, 45, -174, 153, 111, 10, 50, -223, -1, -51, 162, 198, 134, 33, -170, -112, -116, 190, -328]
4592c28N01o5j68L58k47K1k04L81l44J73j11j53K99k11N9M47o40J68K46j86Q3
4613G9L1j6j46L3k30L10m8K20m8m65K00Mj95RM55j77k32K97k07L32q9M6L4K0k74
4638e7k37j8M62k91O9M55n21JK64j38J95k0j56K5j7K4k40J35M2Qn4j59J44L46
4662B62k33j73K42n00L12J67k16J85k37K73N6k28R6K4l2m6O5j17o7J72j34j25
4684b54K24m2j26J39k00L58l11M4N5J75M3j42Q0o9j25J44k02M81l65J83J04j70
4706B4K8k22J94J22l53J63nJ16r7j14J24k0K4P0m3J7j78J64k6j47M47k53j30K43
4730A48j28K5n6n2L9k7n4k6J40m7Mk55Q1M10kj83l35K55K55k43J04l15K83j19
4754i8j86L99l7p7r9jj16J78R0r0j42L35r8J63O2j49q3m8J15m7k72J28M95k47
$$ y = [-328, 173, 108, -60, 298, 51, 72, -132, 249, -95, 78, -33, -186, 113, -98, -39, 408, -232, -64, 182, -4, 79, 110, 94, -52, -19, -249, 61, 13, 233, 185, -280, -80, -76, -271, -262, 193, 16, -216, 81, -126, 206, 117, 163, 197, 217, -57, -294, -312, 150, -141, -72, 383, -138, -137, 127, -11, 184, 164, 8, 33, 16, 40, -200, -65, -23, -15, -69, -228, -84, 262, 29, -144, 98, -402, -90, 77, -139, 46, -191, 82, 138, -90, 6, 30, -2, -48, 17, -100, -167, 5, -129, -254, -30, -72, -198, -59, -259, 99, -212, -168, -113, 62, 105, -37, 43, -26, -151, -7, -209, 272, -93, 90, 194, 24, 52, -170, 24, 146, -207, -44, -49, 67, -30, -144, -20, -40, -16, 54, 11, 28, -150, 14, -12, -159, 288, 35, -95, 148, 20, 45, -11, -63, -24, -51, -105, -131, 9, -38, -34, -289, -208, 202, 200, 17, -318, -63, 192, -51, 53, -262, 21, -98, -284, 115, 78, 1, -98, -99, -215, -37, 53, -37, -179, 156, 58, 221, 283, 134, 51, 3, 118, 71, -201, -73, 422, 175]
4778A75n4j71M4j91J62k12K92j33M7L93n89M22j78J26K5m1J35k72n0R0K1Oo6p7
4802i6N0M0n9J99N3j3p0m05P8L06l28K44Q7k67R2J1r2K15p3j45k8L10O0j13k58
4827b02J07R5M4Kk31J79j77M15l22l7K94m17K78j36M91n45J77N8K5k57K27m4m1
4850a7j6J25n9p9n2J3j1J1K38k40J22j81J22k29L84K1k57M4j04J38l6OK04k13
4874f6K56q9J77l14p7M10j11k64j41J15R4l08K24J5o7L14k8k82l1K20k30J04k4
4897a03K69m09K55R4k21L8J33M3j31K82l12MKj64N6L72q8n5l1j52K51k50P2P2
4921B7k29J29J19K56k88j5L0p6k23N36k77J92k88K46k49K0K36k10L2J38j48q2
4943a24K02j84J84j47j52M11k98MR9k73L83r7K1p0j46J00q3J47J65k64L64k84
$$ y = [175, 121, -50, -6, -197, -35, -247, 45, -88, -41, 352, -237, 185, 7, 133, 158, 117, 252, -20, -70, 20, 41, 47, -19, -96, -46, -6, -65, 134, 187, 174, 104, -301, -223, 83, -245, -1, 86, -181, -89, -78, -170, 45, -28, -173, -201, 109, 169, 56, -202, -95, 0, 44, 46, -185, -6, -183, 232, -90, -127, 167, -250, 28, -108, 383, -162, 15, 73, 98, -159, 68, 24, -17, -33, 92, 33, -46, -98, -85, -96, -85, 153, -87, 35, -146, -24, -253, 131, 152, -105, -61, -165, -27, -63, -57, 147, -66, 190, 101, 278, -36, -113, 297, 186, -78, -219, -104, -10, -318, -94, -79, -146, 168, 140, -142, -173, 47, -183, -79, -103, 166, -243, 12, 106, -115, -77, 56, 99, -32, 250, -62, -58, -56, -220, -164, 208, 120, 65, 34, -118, 133, -117, -45, 27, -202, -73, 46, 302, 14, -1, 29, -47, -270, 266, -11, 181, -107, 139, -110, -90, 146, -64, -32, 106, -42, -124, 78, -106, 78, -69, -221, 190, -108, -104, -5, -278, 105, 8, 29, -41, -187, -87, -170, -23, 142, -122, 242, -42]
4965d2K94j21j59m5nL37j29j72L19k39l9Q5K24k88q7n3J59o9j61O67k52j59j29
4988f4P3Nn3n5L13m36Q9R7o1L07k94K47j61K08j79K0P0q5j03J65j29J59J42j47
5012A28M8k46j53J98j02L50k31j8q7L3N1O7K17l72K1N0J07K8k0j15j2on3N6K67
5037B06j30J35j73j95O4Q6l2N2J35j87j14L16l74O7J19J0m4K0J90J98j48l61J90
5060C0j0J08n4pK84l05l5K11l41Mj56J81J49J28n22K53J70j40j30J21J11qj73
5083a31J87J61j48j70J06K8n3J35k0j18K4m1j31J80J9j63Q2M5J3J68j70R8R8j98
5107An9lQ8k52J65J87n0r8K38l14j39K73j66L10k62j1J11L9Q3j79J06j21N4j9
5131a8J11K7q7P1L2j63JJ01Q2j50M4k10L19pj03j52q1L49k88J71j21q4J25M63
$$ y = [-42, 252, 131, -28, -73, -78, 259, 130, -42, 277, 38, -1, 84, 308, 20, -67, -120, 39, -30, -191, 476, 224, 65, -64, 9, 14, -39, -94, 219, -217, -128, -31, -92, 215, -79, 168, 7, 215, 36, 56, 126, 41, -62, 103, -26, 133, 275, 128, 176, -70, -223, -25, -127, 223, -8, -26, -113, -80, -29, 38, 255, -117, -96, -46, 61, 89, 69, -46, -58, -64, -117, -61, 206, 76, 211, 38, -157, -93, -7, -39, 13, 148, -39, -153, 163, -211, -144, -25, -15, -59, -39, 151, 349, 201, -160, 30, 20, 128, 74, 67, 351, 46, 11, 222, -119, -115, -271, -90, 59, 187, -335, -82, 88, -52, -182, -61, 50, 42, -131, 56, 217, 69, -101, 5, 33, -20, 115, 95, -23, 1, -40, -171, 9, 28, -135, -53, -8, 5, 173, 3, 101, 199, 1, -58, -61, 27, -225, -60, 127, 77, -21, 217, -97, -236, 37, -129, 181, -81, -92, 19, 58, 141, -38, 68, -53, 1, -18, 93, 120, 33, 104, 136, -27, -26, 75, 157, 7, 51, -159, 160, 153, 50, -102, -183, 166, -122, 49, -72, -156, -31, 432]
5155D32o36L33m9k15k65M11r1J58l62K84J15m1k47M17j77M3j83Q3k46M7K88j03
5177dM2j79o7M35j87j8P1l9j05K02l85R1k5N75k95j81J32k75o5K74K6k36L47j13
5201B1p5K32l62L8K67k37l7J35k5%J35k7L7k25r5J08PN9J37n2k06K53o4j09L66
5226B81j20Rl65L21K81l99j33l0R7K21jj73J74j18j51j41O39o88PK89j26K60J27
5249B61j05j96O9J84j3k37j38J97j92J88J73l69J33j24K85K7j84L1o8J5J55j43
5271e1J27L4l17J62R1j20n7M63n31J13L78l79o1O5J09K6l26K34J04p8P1O0j88
5294g1K61j18p4j23J6K00j09k2O2J39r2o1K30m9O6k16L0j22m6K50k77n9K12kr7
5319g2O0k6m6K40k5j04K6q8Ln8Q4%J9j1Rk10J56J74k30J36J79m23L87l01L2J36
$$ y = [432, -204, 129, 80, -135, -400, 11, -80, 78, -284, 0, 115, 74, -173, 244, 67, 110, -73, 10, -236, -189, 99, -4, 38, -141, -208, 227, 40, 22, 93, 54, -51, 151, -234, -143, -168, 407, 112, -69, 63, -212, -277, -3, 23, -213, 134, 21, -54, 178, -184, -146, 121, -116, -153, -18, -43, -43, 92, 65, 102, -123, -218, -110, -103, -44, 93, 41, -165, 88, 24, -85, 281, 161, 170, -195, 126, 407, 8, -125, -155, -58, 163, 162, -11, 163, 45, -106, -247, 392, -296, -289, 0, -126, 134, 261, 156, -40, 29, 213, 200, -37, -175, 22, -170, 18, 191, -178, -45, -169, 116, 143, -41, -10, -78, -63, 92, -51, 76, 110, -207, -45, 46, -74, -131, 332, -199, -86, 292, -87, -148, -83, 26, 52, -274, -40, 64, -14, 57, 117, -71, 190, 72, -2, -125, -109, 91, -18, -40, 22, 161, 69, 8, 238, 189, 255, 39, 69, -53, -99, 151, -126, -185, 27, 25, -72, -12, -38, -84, 156, 131, 27, 53, -35, -32, -90, -6, -6, 13, 2, 11, -199, -43, 131, -99, 37, 216, -207, 180, -121, -89, 47]
5345D7p1L69k26j19%j57J54J47j15j33J22L1n0l8l1K3o1L4Q9k9n0J2j67K49k78
5370b48M14o8k60K87p3l2l9J9K31k55J03k09O9J47j19M34n01K37N4k52j23J78
5392fO1N0k18J6L27k14p7j6K01l17pK65K6J3j26J39p0L7j83L92m29P1J41J1p5
5417A2OJ88k92P8J46k89k4J72j19J8K1J7Q7k89N74k42p4q3J90j29J19L1j69j75
5441b26J47J15l32L83J9m00K04j85J54J91j68L31j48j96K44k71J16j79M32l48
5461a17K03pM7l55K25K58k90K83l20J14j29L50j40M9j84r7M4P5j05j05J66KL1
5484bj28J28K38m02L47l33J55K56k68n8M1j43R8Q6o7R9N5jj48o8k7M7K3N6j0P
5510a9j31J06N4Q9p4J78j24Q8j63k6K20k04j42N6J62J60j42m42J9M82m77M91j17
$$ y = [47, -24, 345, 119, 0, 0, -157, -3, 144, 29, -104, 18, 49, -1, -39, -70, -47, -108, -74, 15, -14, -64, -52, -219, 30, -248, 166, 98, -162, 125, 52, 20, -19, 0, 231, -24, 79, -130, -61, 86, -33, 401, -100, 137, 191, -61, -184, -6, 55, 105, -113, -97, 230, 16, -61, -77, 124, -193, -200, 65, 91, 104, -22, 117, 47, 84, -99, 293, -136, -65, 76, 87, 12, 18, 206, -86, -8, 138, -151, -175, -3, -122, -104, -83, -66, 21, -268, 306, 64, -10, -93, 97, -32, 87, 118, -51, -226, -79, 36, -296, 87, 106, -294, -90, -275, -121, 70, -98, 233, 85, -111, 133, -138, -22, -201, 231, -117, 86, 79, 126, -229, -4, 254, -36, 247, -73, 41, -88, 262, 122, 171, -13, -110, -66, 9, -96, -201, -35, -33, -2, -130, -2, 236, -166, 181, -152, 3, 259, -9, -67, -26, -169, -71, 15, -52, 47, 102, 101, -47, -115, -142, -95, -72, -16, -26, -19, -150, -44, 10, 99, 25, 203, 79, 167, 4, -22, 198, -6, -148, -92, 70, 230, 88, -354, -335, 147, -330, 161, 44]
5533D4p6L43j06j81K5J87l34K16j46K05J7q9k87J36n7k2J16k58K79J28k86n6J8
5556a84J63k5j03nK91j05J1j53L3J90o8l2j56J33K20k70J04l17L12k7O7p6k7m3
5580f7Jn0K17j15k74J90k16L94j80PK51J77k84o7L47j20m33N28m44J90j28j28
5602b04Q2K42j43j15m8R7O9q3J68o7J44p8j74N5q7k1L97m2j69j71M9Q9J06j45
5626d9L7o1L63n32L14j10J8L4o3J3Q6j02QK55N7l60J43K9k3k04L24j14n2R6j91
5651h4J3J65k63M72m24J87k63k27O01K9j62Q5O7Q0k87J07k31J33J07k89Q9j56
5673b51L54n2r6r2N5J95k13J47j64Q5j16P7r6J66O3J63k54k45L82q4L6l4M0Q5
5697A51j02j56L3J4K30o1m4j65k5J8L69k65n8J17p5M3j04ml7N4J25M0l72L16o1
$$ y = [44, -32, 311, 205, 24, 49, 236, -98, 118, -28, 177, 194, 105, -182, -46, -103, -125, -9, -267, 12, 140, -146, -202, -184, -21, -46, -149, -154, 137, 32, 43, -110, -77, 113, 45, 13, -143, -10, 210, -60, 44, -273, 39, 12, 79, 3, -24, -67, -66, -116, 101, -14, -288, -98, -314, 80, -100, -93, 158, 335, 51, -16, 331, 211, -222, 306, -138, 52, -76, -204, -122, 120, -23, -138, -186, -89, -20, -103, 65, -2, 142, 64, -110, -55, -142, -163, 234, 192, 23, -148, -99, -10, 96, -49, -12, -73, 290, -242, 72, -38, -20, 14, -49, -36, 50, -52, -44, 211, 268, -92, 51, 80, 57, -147, 177, 63, 11, 107, -84, -71, 94, -169, 303, -121, 66, -197, -424, 177, 206, 44, 129, 196, 276, -11, 96, -135, -2, 105, -184, -95, -251, 103, 51, -45, -137, -82, 113, -100, 47, -117, -32, -148, -71, -167, -1, 62, 225, -29, -274, 108, 24, 60, 26, 66, 151, 49, -107, -74, -60, 170, 109, 65, -100, -125, -107, 262, -3, -61, 56, -19, 24, -80, -84, -121, -67, 58, 98, -274, 42, -19]
5722a9K32l95L3M42j52k83J72j05QM4J56j63J02Mq7l4K6J4J84m1j4j09p4K53j06
5747H8j08K68k90K11k95P9J05j23K06j76J92m22K33J30j52k5R4j6K7r4O8J35j51
5770a6ol2J35j63J60J58l35R7nK78k52O4j09r4J77j21M3k63L00j15J08J8M5k40
5794a68j97K36J97k30Q6j45J54L56k84k03J28k9k03L04q5J08K29j41k84J93K07
5815B29k54r7K14K4l72M13J24m26K87j72L89k00j70n8j66K56k14J58n5M2l0J75
5837I7q0p5J3j8J28k33j38L60O3j37q3JK20k15j89M22j16m9k56J27J89k7M1J58
5861B03k25J63m38N20j93k7L07k02Nk31O4K74j72NJ23l29M55n24K36J48j95J54
5883A21Q9o4o0N7m14J74K9J3J74j98l5J33j99K76k39K74J10p3j3j45P1o8l57K96
$$ y = [-19, 213, -182, -149, 293, 141, -142, 30, -75, -67, -23, 133, -30, 72, 76, -11, -45, -19, -5, 179, 138, 124, 15, -59, 194, 88, -20, 248, -42, 169, -126, -47, 58, -65, 141, -35, 157, -265, -32, 98, -54, -79, 15, -1, 26, -68, 0, 135, -16, -22, -54, 81, -82, 78, 236, -99, -2, -7, 271, 19, 83, -26, -120, 57, -64, -21, -284, 16, -99, 9, 27, 72, -168, -365, -129, 68, -162, -76, -221, -67, 289, 5, -198, -70, -99, -302, 2, -83, 25, 254, 113, -171, 22, 229, -25, -122, 92, 116, -256, 157, 281, -145, 142, -30, 359, 159, -11, -69, -235, 21, -193, -35, -90, -48, -78, 97, 17, -58, -45, -63, 65, -168, -306, 54, 117, -20, -103, -102, 118, -97, -286, 136, 20, -29, -285, -158, 31, 4, 45, 203, -22, 141, -297, 223, 30, 3, 310, 108, 113, -118, -54, 220, 48, 53, 176, -153, 302, -222, 14, 162, -33, 121, 210, 146, 86, 143, -271, -97, -68, -55, 119, -79, -114, 19, -180, 96, -143, 131, 241, 168, 155, 10, 81, 13, -344, -48]
5907d8pk8J86j75J29o2j0L0j48J04K27l44J64j82J71J24l52J52L6j96K33K09k38
5930b5L66l58P2l9K4J48k42J01L3J12l49K11k2O8k62R2O9j22L90l32Q5J4J61l87
5954a92K84L4j53K2J1J2Q2n1M4J4m16L69k11N4l19M09l8l6K24l40K57j74N5q2
5978a41J45J42l59M26L0k08L9K03r0j32n5J95l15L7m2K91k13L00j48m2j07J36
6000I2m0k60N59l80o3pp0J68p7J40j12r8J73O1l66k2J68L25m20j05L42J22l33
6023b03K95j80L0Q1K8j72L2J62n4k61J21K00r6R2M6n44J77L30k98kJ76k2L4J24
6047I6l6M2j96o7K0K71j71O7K65l1j11n29M41P4j57M6Ln1l74K90L1N3N9n3l9n6
6073a13J15J04o5N6L7p8k61K62k98jL19r8j8M1o0J4m3J54k84K41J0n9K73m64K87
$$ y = [-48, -55, -83, 103, -72, 57, -5, -15, 15, -133, -29, 198, -146, 18, -164, 7, 131, -221, -69, -33, -229, 4, 213, -25, 341, -17, 55, 16, 40, 188, -54, 47, 80, 192, -157, 54, 32, 100, -162, -70, -1, -123, 267, -65, 20, 34, 195, -192, 92, 126, -27, -5, 6, 18, 100, 49, 93, 107, -309, 60, -151, -97, -416, -7, -45, -81, 143, -197, 60, -114, -59, -141, 4, 146, -213, 213, 243, 35, 74, 277, 187, 55, 0, 195, -120, -83, -125, 166, -47, 253, 105, 63, -44, 92, 52, -208, 351, -29, -92, -99, -169, -1, -78, 62, -50, -148, 25, 86, -280, -302, -134, 191, -229, -334, 8, 130, -203, 92, -88, -58, 23, 51, -121, -89, 73, 19, -242, -121, 79, -17, 75, 121, -423, -246, 84, -214, -216, -40, -62, -28, 96, 60, 102, -94, -161, -141, 130, -41, 26, 291, 260, 149, -380, 61, 135, -22, 24, 27, -24, -398, -108, -77, -24, 35, -18, -57, -113, 2, 106, 41, 97, 134, 56, -205, 57, -241, -242, 77, -21, -39, 2, -58, -44, -87, 67, -217, 24, 34, -25, 248, -216, 71]
6098G1j96J75N2J08k85j23K03R3K5k37K28k6k36L69q1J02m48J68Q0J30O8l10J24
6121E4p8J48j22k60M03k19m9J41j42J88QL9j3j49K23O9l74J78o1M7k62K97J33
6144A99j09n1k70K30O4k05K25m6kj17J18j33J80p9k09k1N1R6R8l18K48J14K26
6167B89k24j1J07J79m37J66j2R7j38k36K27J58j36on0L5J02J5p7o6q6LK29n5k93
6192b20L72j78k38L32j94K33j48J61m2j97K9J64O3J9l10L7M0L34l81J71K9L6J10
6215B22n35M37j52j61q5j07L41P8n7j05J88%o7J6k00K4M17n6k33r8J70k29j2K26
6239B2j79K42n3q9K58k99k35L74J17k01j8j22k2K98q5J14p7l58J84P9N1O9K1j96
6263a05K17l0P9j93k11M53p1Q6k19J44k36L09k81J7j25o1L57m6j80K9r4P7J43
$$ y = [71, -125, 50, 102, 210, -75, -198, 5, 98, 123, -114, 114, 88, -148, 221, 140, 242, -206, -38, 42, 172, 240, -70, 54, -24, 124, 2, -258, 145, -74, -123, 18, -124, 64, 72, 111, 98, -51, 172, 241, -133, 45, -16, 31, -231, 66, 199, 90, 39, -231, -1, 63, -142, 83, 37, 35, -82, 36, -97, 83, 4, -205, -226, -175, -79, 19, -299, -51, 63, 289, 65, 54, 161, 340, -97, 69, 57, 154, 16, -220, 7, 165, 29, 23, -27, 8, 110, 125, 48, -18, -104, -101, 128, 73, -220, 152, -26, -264, 68, -126, 107, -41, 120, 78, -119, -90, 74, 137, 156, -154, -117, -77, 257, -124, 47, 76, 112, 222, -313, 124, -28, -189, -274, -381, -40, 38, -19, -124, 64, 64, -3, 13, -187, -163, 254, 198, -35, -133, 37, -192, -204, 22, -157, 85, 32, -57, 201, -98, -333, 41, 158, -43, -61, -183, -205, 93, 8, 122, 45, -313, -129, -50, 1, 70, 91, -105, 112, 82, 161, -32, -243, 210, 139, 225, 6, 150, -86, 223, -58, -41, -166, -227, 130, 84, -96, -67, -161, -84, 59]
6286E9j16K70k39J06j06j12L35k63J5K53j04R5O6l27%J2O6j42o5J59L11l35M34
6309C72n03J79l9%k7p8J23N3q6j32J84p9l0J30k55K14J04j01J63k13j77J99l47
6332c46K60MK88j35k8R1m22L0K05J29J3m20J93L02j00L1j92N9j72K16J73r8M6
6355A27n68O92M9l59j49K80r8%J97k46k27M77j65j52J46K35r8R1j40M2j62o7p1
6378a66J16J42l29L10J42l18J75l24K45K19k36J32k34M60r9j84j34J53P1K3l2
6399A32k24M31l14P3o0o8j97J42J8K32k95J84J0j34K0K53j42j01M6r5r0M35k51
6422Ek01M14n17M03J12k76K9k42K26m3J72k27J15J75j90P6P8m5k55K83j00p0m0
6445a18P4m6J57r7LJ33k48L24O1n01R9J92j56K05j27r1k9J2O4l7L56m16J09r8
$$ y = [59, -57, 213, -26, 80, -26, -138, 197, -66, -51, 202, 98, 193, 259, -68, -68, -56, 10, -132, -197, -38, 273, -62, 372, -131, 48, 9, 9, -18, -96, 27, 80, -6, -138, 46, -33, -63, 67, -188, 26, 130, 29, 192, -21, -198, 1, -346, -86, -82, 206, 71, 43, 134, -288, -258, -53, 76, 89, -331, -138, 164, 64, 95, -97, -38, -210, 6, 179, 81, 127, -441, 251, 300, -59, -208, 72, -26, -26, 171, -75, -302, 175, 10, -142, 4, 239, 141, 232, 92, 134, -28, -95, -166, -50, 92, -237, 73, 215, -103, 72, -252, -7, 212, -24, 108, -126, 334, 235, 51, -83, 70, 141, 164, 132, -92, 339, 25, 98, 38, -30, -227, -85, -67, 165, -130, 54, 64, -70, -50, 203, 61, -40, 6, -89, -179, 256, 5, -196, 218, -299, 104, 216, -60, -31, -273, -47, -90, 82, -145, -30, 145, -45, 31, 109, 64, -191, 92, -8, -78, -118, -44, -90, 67, -30, -27, 106, -142, 182, 243, -258, -159, 33, -123, 82, -45, -136, -165, -153, -89, -126, 230, -186, -77, -175]
6469a75R5K19k56jM74l27j27L2J40q4q2L8J49lj73J17J07j78r5o0M86m30R0J91
6493A47k4n6j11j61J62j4j54R9Q0K68j47j4l9J99k53J55j56K9j99l2J92n7p6L90
6517B28l59K75n6J74k02j21M1J21K54k98J04n5j46R5k93L07r0J64k56J22J95j90
6539A4J7p0P5l8J90R7j91k4r6J10N0l34J36J3L15l6m90M20j6k26J5J92j69L0k08
6564b24M74m01O1L8J74n9J70k03j35J61J07J87k66q6J80k23K7j57J7L64k13P0
6586F3j79j68J93J82l03O3P3O4k5k5p4L52l57R3l2J3R4J83k38J95l6k3k10N4p4
6611a22N08k60J19j37k4m44L10J73LJ13l01l7K68q0j34J01r1R6j19J80m5j61K81
6634A97N1p5k04J80j65m6j5J00l07L52j01j26K76l05L71l83P2K66k31J53J6n0
$$ y = [-175, -80, 139, -117, -118, 356, 29, -98, -66, 74, -10, -92, -54, 95, 92, -81, 36, 143, -35, -130, -190, 296, -134, -44, 147, 123, 67, -44, -205, -43, -57, -211, -112, -32, 236, 89, 75, 36, 235, -18, 137, -19, 10, -189, -221, -29, -86, -162, 228, -131, 144, 88, 262, 60, -61, -20, 101, 355, 57, 161, 106, -40, 55, -238, 69, -21, 143, -113, 9, 204, 14, 31, -39, 36, -2, 188, 285, 94, 70, -26, 84, 134, -200, -64, -51, 264, 228, -262, 158, 142, -84, -69, 123, -46, -16, -224, 250, -151, -90, -52, 122, 63, 233, 30, -105, 56, 163, 350, 84, -2, 178, -45, -18, -175, -158, 206, -7, 63, -116, -284, -91, 91, -212, -149, -76, -12, -37, -62, -136, 216, -141, -48, -80, -67, 27, 210, -28, 167, 131, 108, -102, -48, -122, 386, 126, 245, 108, 84, -360, -50, 123, 126, 239, -62, -99, 169, 89, -45, 56, -35, 61, -58, 122, 77, -84, 197, 248, 173, -31, 149, -16, -62, -77, 23, -284, 68, -33, -159, 117, -188, 183, -200, -128, 138, -93, 60, 76, 26]
6656B6k3N6Q5k58Q2q3q9K88K86k10j54j27j41K74r5P4J85r7j92N51o37KO7K38
6680A08j60j13Q2K48k46J51r5K43j61l10L16o4J45P0j44k06k05K57M8J55k93J60
6702a4j57K36j96O3m1Q0o9J02k55q4L19lj5L31l99K5J98k6k9m5j21j31K94r1J67
6727A39Mj71r7J79j33L68m50J93J4K10j29N1k53o4L63J66m86j07M31k3k31O1j17
6750h2J81j35r1L35Q0j97J09p3K2O7k14J0l0J36L4j68K12m39K18R1q0M1P4l77
6774b76P2M40j12Q5j28q3K28l56J31j47K32r1j1k2J40j39N6M24o80M05r1j22J35
6797I0P4l04J75k06J91j0n6K61m79J03J25J55m2J01k07K30j71m05k7K50J39k0
6819c3K04l90J79J59k37R6N9k32Q0P0J30J14j85k62L55j08j59J01J22r2j28K36
$$ y = [26, 3, 59, 144, -114, -32, -115, -204, 84, 370, 160, 6, -121, -262, 12, -83, -9, 176, 79, -113, 438, -199, -197, -130, 108, -52, -165, -83, 165, -81, 70, -25, 218, 57, -253, 63, -1, 144, 214, 70, -136, -341, -84, -36, 119, -174, -14, -171, 65, -131, -68, -109, -29, -98, 4, -251, -335, -16, -19, -34, 297, -102, -77, 121, 95, 66, 21, -100, -231, 63, -28, 139, 143, -28, -125, 54, -79, 289, -161, 32, 46, 256, 127, 178, -75, -139, 224, 390, -96, -203, 228, 205, -26, 35, -82, 99, -36, -127, 208, 288, 91, 200, 127, 149, 216, 2, 12, -18, 118, 152, -16, 196, -243, -25, 66, -14, 27, 101, -276, -204, 236, 124, 209, 81, -2, 226, -130, 1, -146, 86, -5, -16, -38, 102, -37, 19, 443, -237, 168, 77, -45, 90, 164, -140, 35, -171, 20, 10, -46, 215, -264, -161, -36, 119, 77, 178, -29, 201, 30, -375, -402, -152, -13, -33, 171, -219, -40, 119, -118, -22, 37, -195, -115, -45, 85, 199, 14, -248, 107, -1, -160, -59, 63, -29, -157, 79]
6841G9K0k87J35J57k04k51M39J04r9j99J54j12l9K4R9L5q5K01k29K83n05M71l80
6864a89L45R2l82P7NJ15l9j02m5l1j53K37L1J91j7j40Q0r5n0j5J57k87N23l94
6888h6K3J94j65k9L10k05O3Kk17M53j52j78N5L9l20K04nJ06j4J19q3l30L0OQ9
6913i1K03j27J22j17r6J39j03J31o8K43l39L04l1l71K57J65j36L9j68K07r0k9
6935D4j62L03l00J74K52k57n3j02K49p3J96k68L47m00J80j8o1j07m5J55J29m33
6957b50J48K93k87P2p5J61K14k04O4j61J79k82J57j21j40L7J23J51j85O2j7L9
6979b2j40O3k09M80j07n6J06j23J7k49J29K5QK5J3L9Q4K89m62l18J76J64p5o5
7003b08K13k26M33j63k1l9M3K89k46k06L04l86L06K51j77l00k8Q7Q6P3m06M88
$$ y = [79, 99, -188, -53, 104, -100, -351, 88, 192, 93, -106, 48, -64, -103, -79, 20, 55, -30, 171, -58, 225, -280, 191, -189, 156, 248, -134, -57, -52, 63, 24, -78, -123, -154, -307, -70, -39, 152, 135, -5, 75, -20, -70, -85, 72, -215, 308, -86, -63, 131, -34, -63, 247, 42, 105, 107, -110, 343, 191, 13, 68, 107, -213, -9, -14, 92, 78, 197, 114, -216, -186, -180, -91, 112, -15, 107, -10, -106, 33, -70, 61, -7, 236, -103, 201, 170, -201, 56, 221, 85, 124, -44, 163, 73, 44, -118, 185, -115, 59, 311, 54, 1, -101, 148, 75, 271, 3, 350, -50, 130, 112, 51, -56, -101, 54, 183, -250, -102, 191, -96, -24, -99, 62, 276, 72, 136, -25, 154, -128, 29, -92, -232, -195, -72, 79, -106, -44, -61, -22, -162, -99, -308, 172, 65, 9, 115, -8, 9, -240, -111, -86, -78, -53, -40, -1, 83, 372, -90, -408, -232, -68, -143, -208, 5, -221, 212, 49, 28, -11, 32, 321, 75, -131, 173, -213, 93, 344, 167, -133, -161, -74, 12, 85, -321, 167]
7025A67k83K52j65n6J38L3l1Q3O9m6l6k37J55m2J38j8j06j7j61OK68p5p3o9L2
7050g4J26k44J58J89k44O4k0N2m8R1q5j65L04j91l55M83L10m50L60l08L40l29
7072c6J5J64j41j12J17J44k96J36R1j04K8J37m58K24J09%M8j92J31N3l5j61Q9
7095d9O3J69n9j6j21j19K78o5k91K33N3m3j63J65k67L19j93k58N27l39J33j8m
7118f5Q2o6m7K59j79J12J4P6k6j31k89L54k87Q4K0J31k16K60L7j83j76K46J50
7141A60k22l6J42J36k38L7J74r7K03m62L57m30k11O25k19k6P2k15L53j31j33J22
7163c9J45k13K97l18n4L25k24K0J01k20J76KK4k4J8j90k5M54j00n6j97K47j79
7186c0n0J80R6q0j12M6q8l69K93K84k38lj05J85j6J74p5j52o4N0j38K23p0K53
$$ y = [167, -116, 136, -29, -85, 53, 86, 55, 138, 207, 161, 125, -112, 43, 1, 139, 121, 15, -2, -163, -157, 111, 36, -37, -106, -74, 52, -192, -34, 155, -89, -25, -45, 7, -41, 50, -35, -200, 104, -87, -442, 41, 351, -99, 261, -47, 293, -36, -21, 143, 2, -110, 7, 151, -145, -9, 82, -22, 6, 143, -315, -91, 18, 18, 66, -126, 5, 58, 23, -138, -49, 14, 183, 124, 108, -13, -132, 146, 81, -210, 23, 76, 33, -130, 35, -232, 87, -106, -364, 163, -176, -43, -61, -65, 17, -49, -96, 163, -16, 96, 110, 186, 160, 29, -260, 94, -193, -109, -89, 42, -174, 86, 123, -60, -236, 10, 160, -62, -98, 44, 180, -58, -21, 153, 56, 259, -203, 154, -276, -487, 138, -81, -107, -35, -250, 103, -28, -161, -39, 106, -107, 190, -128, -182, 143, -81, -61, 40, -180, -4, -2, 22, -2, 16, -174, -199, 255, 155, 99, -98, 149, -30, -80, 100, 196, 116, 4, 50, -38, -407, -114, 170, -68, -71, -176, 9, -7, 167, 92, -60, -124, -74, -212, 11, -59, 194]
7210A94l62N5M04j35k37L07p4j72K01m08L20j88J40j14m7K57K3r7r7O5L1K08l44
7233g0q4J92j00L2r8K21l41OP0L04l65J61k8N9L05m8o1L0k33l28L07k5O7k48J92
7258h3O6j05L7J92o4n3o0K31J17J9m7k34Nk33R1J53j1J25j40j72J53J5O3j30K84
7283B19l33J49K28l24J81j18L6j52jL2Lo3m5M3MJ66r4q6K69q4K9r4M6j80n1K79
7309E9L9o9k28N47m54J1L3j61J91q1J91j5k38J5qK25k82K84j44j08rK7l6J24J00
7334A3p5J21Nn8r6K4K12k60O3K32j18j39k9J44j05K06P4l36L25j92p8j03M6O2
7358f2QJ99r4L1m39L79J2k13J57k05K14rj20J0L5J21J4%K55j78k5J31k41J28j81
7383g3J76J42l80J96n9m7J09O1j1Q6k79J48k0R6q5n2Oj52K60j06mj2q8J71J49
$$ y = [194, -168, -113, 291, 156, -81, 226, 152, -20, 181, -227, 93, -95, 45, -69, -116, 141, 164, 67, -30, 35, 66, 274, -70, -154, 38, -62, -30, -128, 93, -248, -242, -172, 132, -233, -72, -100, -41, 264, 216, 155, 185, -48, -376, -69, -94, -27, -275, -83, -17, -122, -85, 107, 43, -10, -70, 161, 278, 297, 250, 16, 21, -212, -121, 32, 21, 146, 6, -166, -13, 2, 65, -65, 219, -114, 35, 263, -61, 120, 2, 38, -114, -115, -83, -80, -143, -188, -145, -141, 25, -69, -155, 114, 30, 59, -35, 11, -169, -220, 59, 98, 29, -199, 348, -106, -95, -62, -223, -32, -113, 78, 63, -175, -160, -168, 57, -225, 59, -85, -193, -202, -175, -211, -87, 13, -62, 59, 64, 6, -90, -66, 146, -114, -51, 181, 63, -76, -105, 39, -66, 140, 214, -122, 203, 11, -67, -170, -124, -62, -54, 145, 51, 82, -357, 22, 34, -179, -22, -227, -13, -22, -142, -132, -97, 24, 38, 38, 293, 115, 90, 221, -20, 108, -73, 103, 245, -135, 61, 2, -45, 64, 125, 114, 200, -79, 69, 49, 145, 60, 8, 14, -138, 122, 16, 12, 0, -88, 83, 232]
7408B32l88o1L89k52K9L8k0j21J39P6k7l6L61j62j57q4p6K44k66J80K8j7J90l44
7432a05j00K61j31L5J75l9Q7l99J60j89K15j3K03j16o7L7J33k31J37k72J80j17
7454a56M1K27j14Q1k74K75QN8k33L19l15r6J63J6K69l53K84M2j71K03n20K08k90
7477c28M32j18lK36k68J14k73J71J73K7k20kq4Qo4L88J0k20k33L08rk5j43K24
7501A01o6J06j50K39k63p9K57p8J41k97m2L31l65J56k09Q7J08K13k38k41NL26
7523D2j51k09M53j77K18R6m31M4L17j22j95r0R3J50k8l1k35K85j55M1J93j46J51
7546A13j18M0M5j00N9m7j12N8j91M14k66J44j11J62j50J77j66J60j1l17J27K77
7568A87r3j74J62j95J55J94l1k24J17k5k08N8O1M1j01L29k68J31J4r9r4J68j53
$$ y = [232, -156, -217, 172, -80, -51, -13, -33, -154, -15, 61, 34, -2, 359, 197, 40, -44, -120, 124, -142, 38, 66, 49, 239, -105, -205, 56, -75, -40, 135, 96, 183, -216, -56, -245, -30, -43, 160, 44, -23, 14, 147, -84, 53, -219, -39, -156, -115, 112, -2, 79, -195, 80, 88, 146, -87, 232, -83, -179, -16, 0, 269, -84, 200, 242, 71, 274, -246, -38, -328, 104, -14, -17, 219, -49, 65, -208, -37, 136, 163, -57, -59, -143, -135, -199, 189, 199, -21, -254, 54, 45, 20, -123, 101, 35, 141, -9, 230, -33, -112, 145, 67, 208, -89, -131, 200, -165, -9, -218, -131, -23, 190, -48, -289, -284, 42, -109, -318, 135, -42, 176, 272, -159, -115, 202, 80, -115, -205, -112, 38, 10, -21, -256, 29, -126, -85, 108, -38, 113, -5, 35, 80, -20, 39, -8, -120, -62, -253, 161, -105, 39, -72, 90, -60, 117, -49, 111, 100, -217, -90, 187, 94, -80, 82, -113, 42, 236, 205, -19, 98, 73, -135, -77, -16, 25, -76, 253, -15, 116, 130, 31, -63, 105, -48]
7591d8J66k07r5M3L8J1kJ74j46K8M4J34k66N7P1o4Q6J0n4J9k63L79j47k15K15
7616c2J96m4k48N0K35j3r0n8J50l2k40L06m21K20lJ00Q4j99r7K73k06N0K3P2k40
7641a64L38j13j60P1Mn9k05M05k95KJ77k73K51kM4O6j01J68J0N3q5j41J21l55
7665b43r3J36P3L25k25J63j21R0k63M02k21j45J79p5l03L37N4l35M7L83J88l3
7687C20l95M83n60P9k1j2J8K23j81P0J71j80J02k21p8K3L6J27j39q6K62J10j69
7710a8j9K69k04J4j67MK36l1j37j1Q5j72K24n3L0P0L0J40m08J9P1J5q6j6R6J4
7736ej22K73j10l89M19k80J30N6L46k54j69J73o1L5j7k64J60K3o8rO2J5o1K29
7760A12j39k51J73l3R4R7J06j89K51n3M6j59M0l62J67J84j62J57K9N0j87m2J98
$$ y = [-48, 118, -89, -184, -141, -103, -92, -94, 80, -66, -38, 6, 140, -126, -69, 2, -62, 24, 34, -20, -1, -264, 115, -32, -247, -32, 164, 120, -128, -78, 157, 144, 54, -4, 146, 114, -126, 180, -241, -21, -24, 76, 160, -39, -136, 137, -69, -19, 4, 76, -164, 174, 61, -99, -28, -24, -83, -288, 117, -178, -176, 1, -272, -21, -23, 21, 87, -14, 154, 164, 217, 132, -9, 112, -243, -336, -200, -127, 198, -27, 136, 15, 105, -158, 244, 23, -122, 57, -18, -321, 16, 70, -265, -218, 165, 353, 320, -75, 408, -152, -73, -94, -106, -88, 135, -46, 24, 195, 15, 117, -104, -182, -159, -123, 4, -135, -221, 41, 151, -18, -37, 232, 28, 42, -125, -121, 115, 84, -53, -64, 21, -151, 73, 20, 50, 120, 150, 290, -118, -99, -28, -13, -99, -115, -19, -5, -127, 146, 36, -353, 66, -214, -84, -28, 318, 64, -105, 68, 7, 42, 25, -239, -79, -56, -124, -133, -71, -56, -117, 112, -27, -278, -105, -138, -44, 53, 159, -30, 221, 168, 214, 55, 95, -267, -100, 84, -78, 79, 108, 158, -29, -71, 127]
7783A27j96O5P4K6O5k17J12m6k16J07K08n21N63k19J48j9R7j71j32J47j92L0j24
7806b84J48K83l20J3J96K39k84qK02k29k00J44MK00J37m50K87N7l79J22j71J70
7828a23J14l61L67K38j60l55J79R9n0K17k03J38J43n4l34J58J31k06n3J11k7O0
7850B9J09l69K80k19J80j32J22k59M31n4N5k28M42k84r0o8K34k47l0k7Q3J50l21
7873b13J34J09k24n4K58J26k61K15j59n4L80j34k47L7qj00K05j37K3K28k74M8
7895a02K55o6J32r3J57k76J14l03J28K20k51m6j39K39k7r6Q2k21M03p6l7J03l19
7918b19K22O6l2R6j80J0l1jK20k20P2j01L5K33j23l9j35K01q0k46J61K63j86l1
7942d5QJ47J33l82J94k32K0L5J90M2j81O8p5O7J39n9n5k37J44p2K05J06o6K49
$$ y = [127, -69, -4, 70, 96, 161, -56, 56, 10, -206, -99, 109, -412, 151, -68, 80, 61, 158, -13, -145, 2, -190, -160, -284, -136, 147, -173, -160, 36, 275, -9, -17, 185, -44, -244, -100, -96, 104, 241, -209, 78, 135, -244, -122, -293, -123, -9, -370, -3, 235, 75, -280, -101, -2, -52, 165, -38, 100, 243, 189, -145, 13, 144, -62, -115, -4, -31, 29, 138, -231, 49, -170, 10, -122, 0, -259, 172, 118, 173, -55, 387, 103, 13, -55, 179, -68, -98, -125, -42, 108, -213, -79, 30, -194, -248, 10, 136, -125, 90, -69, -123, 257, 123, -124, -87, -95, -195, 10, -127, -104, 124, -150, -102, 153, 87, 219, 126, 283, 7, 121, -182, -54, 166, -85, -131, -270, -31, -58, -154, -72, -293, 110, 34, -3, 100, -219, 3, 69, 37, 133, -47, -37, -68, -69, 151, -69, 3, -98, -63, 170, 47, 8, -127, 74, -6, -252, -91, 172, -14, -45, -37, 110, 243, -139, 55, -177, -157, -122, 68, 110, -71, -3, -78, -11, 128, 69, 14, -223, -79, -151, 54, 160, 94, 343]
7966C43k93J81k84J41k52O1K83l18O3L5q5J31j11J52K28l17M9Q4n9K2j31Qk05
7989b74J17j41J82k67M32j7k44J96Q5l39N11j19j51K9n7j57K82l4N4l83M85j10
8011H0k40K78k19K48k04j07K35jj85j93M67k47k28N47j54q7K15k44J7J75m90J40
8033a97Q7j10K88p4J61p1m6l05M63j03K2j84O7J87k31k70j1L53N0Ml40L51j68
8056g7J98l41J26K51j68J4Q1j28o5p9m0K26J40j51j34J37K39k80j05K79m48N69
8078B44k47N4M2l53P7K82k18J72r5J96k58p4K60j50k18K94k0n8J97p5j72l4K57
8101A03q7nN1j21K0KJ32l46K09K03O4K12l92o6J27N8j37j01K22K61k19p2k90N6
8125a16O5m6J16J13n2j5k5J70m78j0K37P1n5l9J33k07L6M4j10R0K68k48o8M7j27
$$ y = [343, 50, 231, -53, 88, -164, -103, 180, -138, -75, -40, -125, 6, -105, 47, 275, -42, 7, 91, 32, 54, -77, -69, -274, -157, -298, -116, -383, 49, 32, -212, -16, 69, -270, 241, 122, -29, 0, -57, -214, 68, 34, 88, -295, 190, 80, -160, 118, -101, 147, -57, -164, 71, 70, -115, -308, 159, -88, -316, 231, 77, -10, 205, -39, -22, 153, -337, -197, -110, -220, 68, -6, 155, 84, 38, -267, 196, 93, 115, -69, -2, 185, -46, -316, -327, 26, 76, 80, -260, 91, -77, 121, -220, -94, 157, -11, 3, 84, -44, -109, -188, -228, -2, 138, -13, -147, -10, 229, -51, -156, 123, -325, 244, -3, 51, 93, -260, -183, 99, -119, 53, -42, 154, -104, -178, 82, -68, -286, 8, -12, -70, 127, 52, -120, -154, 103, 16, 11, 62, -59, -39, -37, 95, -251, -42, 161, 225, 437, 45, -21, 106, 164, 27, -74, 148, 409, 190, 118, -172, -116, -51, -97, 19, 132, 80, 65, 40, 210, -268, -278, -41, 30, -25, -64, 69, -138, -102, -58, -168, -78, 190, -58, -126, -79, -206]
8150b06J10l3j37K90j07J07l5J73j40Q4J32l88n6L32l31P0N20k97k2R1l47K33
8172D3J60k60K13j10K22k70k3J57l86K3J69J95ll9k35P6r6J56J32
$$ y = [-206, -96, -129, -266, 24, -83, 24, -11, 162, 22, 106, 238, -150, -206, 126, -205, -135, 385, 88, 66, 157, -190, 43, 203, -57, 156, 46, 268, -2, -25, 132, -254, -231, -62, 133, 130, 91, -144, -68, -164, -8, 124]
8191A24
$$ Imaginary data points
##PAGE= N=2
##DATA TABLE= (X++(I..I)), XYDATA
0@%%%%%%%%%%%%%%%%Qj6J6j6J6j7K5l2L3m1M9n7O5p3Q8j01J12j25J43j65J85k07
38a10K31k57K88l20L53l92M34m79N30n85O44p09P82q62R49j047J157j279J418
57G46j575J757j972K225k531K915l406M060m980O388q836J4302n3908L0669P0325
72E6179m9716k8774O459J9123j5019M913L3625j978m6211R930K8116o587j5047
85d987N662J1619q702k4195J6879K0021k0865j1943J4801N130j701o878J961N845
99B647p912M742J7010j1105j0922N650J332L107J506l282R74r989k923J3531l495
114H71n283O057o820l246Q624K461j32p580k95J6397l536j3090P264L271k585
129B378J160k663J757k839o496Q981l79j2653O410R255l440p303o868J0915J2469
$$ y = [0, 0, 0, 0, 0, 0, 0, 0, 0, 0, 0, 0, 0, 0, 0, 0, 0, 8, -8, 8, -8, 8, -9, 16, -16, 17, -24, 25, -32, 33, -40, 48, -53, 59, -66, 77, -88, 97, -110, 121, -136, 152, -168, 185, -207, 227, -252, 278, -307, 337, -372, 410, -452, 497, -550, 607, -672, 746, -829, 928, -1044, 1181, -1350, 1565, -1841, 2219, -2761, 3627, -5209, 9093, -44815, -14146, 56179, 6463, -22311, -15852, 3271, -11748, -6835, 26790, 24812, -21399, -11469, 16647, 10060, -4987, 675, 12294, 3592, -20603, -3724, 16297, -4568, -16511, -1710, 3420, 1719, -5159, -3198, 2647, -5265, -523, 16487, 5382, -5540, 110, 1442, 4549, 6055, 2773, 3747, -6242, -9165, 4366, 871, -4412, 1645, -5175, -8421, 203, 2664, 2532, -5048, -5343, 11054, 7518, -5572, 1692, 4963, 2378, 3538, 875, 2632, -207, -6703, 2278, 1899, -10754, -4344, 4911, 1471, -5832, -12700, -1785, 10684]
144A0684q128l230K679n239L512N395J01M22q532k013P586n386j890P388l188
159A61l665k556k451J0156K666o661J643j402Q49P236k933j072J788m913M113
174B959L523o732n55r42j223N259l366k411K481o295J479Q462o96o04l288m188
190f137Q798L019l370J950m235j174N159k806k89R12n218K399R12m972L774O01
206f77k661K478k603J714O137m348p04J696j401N458J127o473L81o74J91M989
222D630l927l462J217l678L440L433m444J442j56k649M822O96k63L180m733n59
238a011M945j797J733l22o115K146R16j323L319l940l961L343r44K013L339m430
254b089N76J339j873N465J064l988J838k042p87M457k593j276L72m309L021J647
$$ y = [10684, 2556, -674, 2005, -3234, 278, 5673, 5774, 6196, -2336, -4349, 3237, -2149, -4039, 3349, 161, -3504, -6060, -8511, 1645, 4311, -2350, -707, -2109, -1260, 5976, 3043, 1971, 3759, -1154, 2959, 6482, -250, -805, -1747, -2970, 2289, -1077, -3488, -1007, -7302, -5823, 2639, 1943, 1339, -1949, -6137, 2661, 5680, 2310, 4260, 25, -1149, 4010, 1204, 915, 1827, -3391, -992, -80, -5052, -1278, -677, -3338, -860, -3463, -1749, 4388, 40, -664, 1032, -369, 5089, 6216, -257, 124, -550, -359, 4630, 703, -2759, -1542, -5220, -1780, 1653, -2791, -1349, -1505, -4154, 668, 1364, 1101, 4281, -452, -1011, 3934, 2137, 3870, 3548, -2567, -421, 495, -828, 2491, -1449, -5410, -2067, -3011, -998, 2341, -2089, -1513, -174, -2047, 3418, 4482, 494, 2332, 290, -497, 3960, 1367, 91, 463, -3846, -825, 822]
270H22l451J628r42k332M321j086k25L178l034Q86L174k388K190M10l732K746
286B165l53k049L371l445l058K819j584J457J333m516J706J097j550M634k7l288
302a288K366j145Q17M107l173p96N93l759K840J776l023J106l058k134M457k99
318f13m31J855l831P52L517j225L042o11l483K824n3j164L353l065j873J583k835
335b258J963J452l429N54l9j690M029o97j531K706k080P12L430k056L18R93l006
352f29K717J12k574J485k032j578L102j828l62J577l467J751K670k147K076o69
368B04j635K911o6k61K954l575r63K191j782J650J20l617R12o43j295L745j469
385f19j867J986j448R38K724k299J567P56k554K552L88j330J631k333j070K030
$$ y = [822, -2629, -1001, -1943, -4275, 46, -1040, -1265, 1913, -1121, -235, 2939, 551, 2741, 3151, -581, 2165, 1812, -237, 3134, -311, -3369, -550, -2134, -677, 656, -3860, -2154, -1057, -2607, 2027, 2000, -1288, 1078, -67, 750, 4857, 1684, 888, 1481, -2278, 562, 2338, -685, 421, -2637, -4771, -314, -613, -1044, 811, -3020, -2268, 1249, 24, 3066, 2455, -1028, 1796, 1743, 579, 3932, 867, -1006, 577, -2258, -295, 1157, -2272, -1718, -1757, -3447, 582, -115, -1646, 1060, -1020, -308, 3122, 1066, 1384, 2377, -629, 2088, 2200, -374, 1111, -921, -2499, 603, -1225, -1587, -10, -3477, -1726, 944, -1203, 873, 204, -1431, 1480, 1414, 1153, 4107, 532, -431, 1760, -22, 1628, 1748, -1869, -957, -1600, -2895, 850, -619, -2486, -500, -1948, -1010, 1714, -585, 982, 1738, -816, 1736, 2124, 794, 2425, 92, -978, 1052]
401A052k180L79J402l342Q01R34q98K192r78j610K606k19p2K241k251R35J364
418B356j918J198J68k520J095n53j249K059j738p41J903k452J044K002j646J175
434A83o9j431L179l12j182K128j509p39J616j467P33N1l048P41O50j074J571q50
452h29j427J580q38J549J983k770L1J996m95J230o81j667K207j247q66J462j637
469d19Q1P45k665O95J561j415J223o62j538K870J72J28Q28k451Q15K309j076N98
487A799j034k005J880O8j970J617j474o72J676j868J255J278j802R60L60j021
503i53K783O8j677J090j093L71J735k274n8Q02k047N54J52j528J921j018j244
520b416K176k03J28J597k166N96J758o34J588j192k563K325N08q21K80k244j70
$$ y = [1052, -1128, -749, 653, -2689, -1888, -954, -1852, 340, -638, -2248, 358, 139, 67, 2308, 57, 992, 2356, 438, 1636, 1804, -716, 379, -174, -1423, 636, -1102, -1843, 60, -2392, -1348, 654, -992, 183, 114, -1317, 1862, 1550, 368, 2496, 987, 248, 1864, 397, 1130, 1181, -1867, -1126, -476, -1550, 21, -829, -2256, -676, -1514, 35, 2018, -752, -721, 1275, 780, 2010, 1329, -338, 1869, 622, -244, 1218, -419, -338, 407, -2258, -1563, -2, -1417, -194, -856, -2394, 476, 648, 776, 1604, -847, -32, 2277, 1201, 1799, 765, -1240, 640, 708, -1262, 355, -1119, -1791, -115, -1983, -728, 550, -1252, -292, 68, -953, 1830, 1898, 221, 1311, 218, 589, 2324, 50, -8, 794, -1253, -699, -547, -2075, -154, -1172, -2416, -240, -443, -315, 1282, -884, -288, 1470, 836, 2424, 1232, -1331, 994, 1502, 681, 961, -1283, -1453]
537a453J697j036L8J65j336J933Kj857K173K03l22J012j930M90K471q73m08p72
555A97j877K762L47k303N65j332J01K283j392n50J197j468J167J043j369J573
571I44J76j376J535q09J42J408k211n42J181p19L42r2k374J782K72o81R86q25
589h61l09K185j187m4J907j545J231K21j822J236M37j335O40j817k65K032j370
606f66l66J89j085J958N20j821Q10M91J67J521j624k20J651n58Q3j2k097J404
624C45J094j867L18j298j9J943j087o39J489j140R12P65j384J061O97j112R88
641A066l86o94J491j036p63P03j134R51o2j764N12N72o05J270p28n89J649n49
659i6J36J015q27N48K36j137J237l9r15L71j184o05J656n45o95J56j480J580J460
$$ y = [-1453, 244, -792, -754, -589, -1925, 8, 10, -1847, 326, 529, 207, 1219, -711, -221, 2250, 1377, 969, 197, -1680, 1082, 1429, -874, -309, -1641, -1540, 743, -649, -1199, -2, -1470, -303, 740, -629, 944, 1120, -256, 1279, 470, 612, 2020, -191, -733, 448, -271, 71, -21, -2395, -613, -341, -1022, -36, -861, -1170, 1015, -172, -216, 1691, 146, 1377, 1598, -224, 1012, 1449, 114, 754, -1063, -1328, 704, -666, -1032, -843, -1928, 30, 550, -1271, -461, 30, 197, 1718, 94, -126, 1525, 967, 1050, 1038, -1059, 345, 1439, -428, -110, -1408, -1427, 516, -571, -1210, 279, -861, 51, 816, -568, 493, 1190, 78, 1066, 680, -14, 1477, 441, -322, 381, -753, 198, 136, -1628, -1116, -544, -1149, 121, -607, -1196, 453, -96, 40, 1055, 228, 776, 1012, -125, 1112, 1073, 158, 529, -655, -1260, 396, -149, -844, -688, -2168, -588, 872]
678H72j467L78j52l35J882k06p02J098j236M48M63j271N97M21j394L33l13o82
696a266J630r26p25J029l43N28P09j037O88P09n77J057o47r12J337p60l20L67
714E41j258K58J05j026Q19O36j240J060n73l35J476J32p11O93q05R32J012j529
732A87O19j52j229R01j6o21M26j129J01Q26r79N27P38j139J082k07k33J304k60
751G46n78Q51m48J35L10j215L17M55j288P37j50j073Q49M0n57Q73o49K14J054
770F23j094O54O75p08J086l54j116J154l63o48O56j290m2R61j314P46p3n43R01
789h9j59n24J341m83j93J065r77L69Q65j011M21j85r23J039o09o09O48p58m79
808a251J234p99K84Q11r72P65O6l64J100m33n76J107n57r1N09j022L80J11p55
$$ y = [872, -595, -217, -369, -704, 1178, 972, 270, 1368, 132, 580, 1043, -228, 369, 790, -604, -271, -584, -1266, 364, -562, -1287, -258, -601, -73, 636, -401, 287, 996, 419, 1476, 829, -83, 1254, 494, 174, 541, -717, -459, -354, -1380, -561, 75, -1165, -105, -678, -1013, 463, 595, -116, 577, -228, 704, 1716, 187, 806, 654, -575, 326, 310, -311, 115, -1014, -913, -87, -1066, -539, 199, -940, 142, -65, -298, 1006, 746, 168, 1019, 571, 706, 1016, -199, 118, 573, -715, 22, -128, -1201, -352, -312, -869, 4, -645, -431, 623, -471, 183, 858, 150, 1236, 882, -234, 920, 557, -91, 565, -725, -767, 194, -1120, -374, -447, -990, -89, -248, -772, 569, 86, -107, 958, -19, 350, 1215, 204, 625, 440, -483, 556, -53, -662, -14, -772, -1251, -17, -816, -532, 279, -693, 72, 138, -226, 874, 441, -135, 972, 415, 324, 833, -189, 191, 302, -453]
827d53O56j08j392J309n77j78J005l83o61R25k98N33N00p72L98L52p61P56n74
846B77n73Q77j119o2O92o29K80L10j163Q94N15j101J160l97k2J023p20j26Q66
865I82o55J03K53p04M14j98q19P39m80l57O22o96K12O66o15M61Q9k32O28O49r35
886A27P36l80m72J007j137J19N11j150J86M05p79N48J1n03O77j61q8Q57p45L60
906A29N01m25K05M74p53O81j31r96P86n36m46P45p38J4N76j082O68L78m99P23
926B74k15l52O37l21K19Q52r20R0R2n72N90P9j135P22n17j80M73l34jO33p54O32
948hM43q65R02J02n80N15j4l66O54q61m1N17m10k14J40o00P17J32r44N98l10K57
970b36Q42o44r8N43n69Q55R7p83O01k65k95Q4p7l36O30j035P6N37m67M27q7o32
$$ y = [-453, 203, 95, -1297, 12, -565, -743, 262, -121, -782, 143, -155, 378, 878, 106, 504, 856, 95, 851, 277, -296, 581, -538, -600, 92, -537, -257, 53, -1110, -216, 299, -802, 358, -39, -61, 962, 242, 116, 982, 327, 430, 683, -21, 393, 195, -624, 115, -365, -722, -100, -796, -584, 82, -533, -72, 17, -215, 413, 1062, 127, 863, 483, 11, 1018, -119, 0, 511, -639, -453, -48, -827, -279, -268, -771, -94, -255, -343, 514, -231, 129, 630, 205, 410, 884, 131, 812, 681, -315, 471, -65, -511, 234, -504, -490, 86, -996, -328, 50, -449, 274, 59, -293, 344, 23, 242, 1094, 174, 264, 356, -216, 374, 453, -682, 40, -477, -657, -184, -518, -519, 114, -640, -8, 435, -430, 472, 574, -6, 509, 495, 129, 783, -78, -119, 398, -12, -226, -86, -686, 31, 163, -781, -183, -493, -236, 606, -38, -136, 407, -162, 693, 790, 7, 608, 343, 48, 132, 55, -281, 349, -686, -610, -73, -540, -113, -200, -832]
992h32Q00J10k30J217q75q0P56q54K74L44q62P16k93o46L50l05l59R59q34Q3O45
1013H4n58K39K06l57O22K77n98N84ln08Q28o86k12L75m00l6K57r76N70O3m35P30
1035F6n55J79Q26o18R8O45o93N35L98j243P00J01o82O23m73n36Q13o70j70O66
1055A0p42M97L19r87Q31N5j82N16m3k94Q79m63j87L02p36N06K70r50L62m67r1
1076e95O71m13j88M64j63j56P70q35Q55K54o39M12j05k63O06k81k98K57l84j52
1096a83L59q85K75N22o83M96l78j25R36k61j15J2n7L49O44q16K71j54l57O89l71
1117A68n97O70l60p07P55p25M48O23o65k41J043m56N98l13l95N37j23J6M36r80
1137b68K95M38o31k0k1l35P78j42q97P04k5J7L27l96O0O02j74Q3P2j94J86k74
$$ y = [-832, -32, 78, -152, 1065, 190, 110, 866, 12, 286, 630, -232, 484, 191, -455, -105, -410, -769, 190, -644, -561, 84, -474, -235, -29, -386, 236, 513, -85, 499, 496, -12, 816, 130, -82, 293, -107, -143, 114, -862, -292, -229, -664, 66, -489, -310, 516, -102, -4, 641, -52, 483, 881, -362, 338, 439, -243, 380, -93, -629, 184, -486, -656, 10, -732, -235, 84, -903, -72, -17, -199, 317, 274, -20, 859, 396, 209, 511, -225, 281, 551, -399, -37, -504, -595, 76, -337, -525, -61, -224, -380, 390, -445, 410, 664, 25, 437, 332, 69, 675, 394, 96, 353, -31, -183, 176, -709, -434, 88, -595, -99, -477, -602, 334, 73, -42, -30, -87, 262, 906, 90, 361, 207, -150, 539, 168, -429, 241, -119, -826, -71, -796, -348, 275, -390, -631, 412, -44, 554, 241, -154, 383, 260, 276, 712, -268, 27, 465, -166, -186, -207, -542, 236, 94, -803, -99, -124, -107, 220, -176, -116, 486, 312, 395, 467, 273, 459, 185]
1159A85k90K06m85K9N67o92J93J46n82N74pm27P62L1l42N93k61L4J85j40J45j98
1181B26m08N70k93n44N82n20j46M87n65L63L06m92K72K74l85O21j58k8M33n68
1201B7J60M15m47j93M01n16P6km14P5L86o11L75j1j13M82k84L38K89l23M13k96
1223B27j43N37n17N5k47J80k42L75r09L14K2k23J04L38l18P98j67m65P33l38O1
1244A75L10n92J09N41m64K76l39k98L19o5j76L8j74j46L60j57L32L42q08O19N9
1265B61l39N38l17j68M18l45n1L05m33J83M9n31L21p5l25N94n12O7O56n77N73
1286B92j74k44M75J14m01N38k03o17M12R7m46K06m25J00K23l48M39p4j02K12N4
1307A28l3L40m4k25K33k68K51J92p47N02j22k31O2l5l18J96k23J50r9K30J3J41
$$ y = [185, -105, 101, -384, -355, 212, -480, -287, -141, -723, -149, -156, -583, 179, 210, -132, 461, 200, 234, 419, 279, 424, 226, -182, 388, 95, -449, 133, -387, -533, -46, -611, -248, 58, -434, -162, 112, -273, 348, 190, 162, 595, 27, 187, 602, 155, -38, 363, -153, -77, -79, -493, -418, -32, -643, -268, -279, -392, 90, -194, 144, 433, 110, 523, 227, 84, 621, 104, 159, -88, 92, -150, 225, -684, -370, -348, -571, -467, -129, -447, 351, 184, -281, 452, 114, 175, 485, -107, 2, 543, 79, 355, 16, -282, 37, -28, -204, -166, -340, -486, -126, -283, 49, 391, -417, 202, 261, -78, 460, 143, -25, 393, 48, -3, 302, -131, 52, 101, -430, -109, -184, -509, 85, -427, -360, 296, -281, 292, 118, -126, 349, 463, 62, 600, 397, -220, 192, 289, -157, 49, -376, -276, -53, -401, 38, -36, -138, 74, 128, 95, 435, 391, 166, 399, 131, 382, 574, -173, 329, 207, -24, 38, 3, -315, -119, -342, -192, -291, -61, -48, 93]
1329I3j17P8K34k38L66k61kK23pm10K06m14J17M12n68K60k92k17K84J62l1J11
1351a1n6N4K79k74L15j04j99L28l5k93O72o86l08N93m91n6L84m39J19J20k17M67
1373A62K08m68J95J89l07L56k63J15L89p58J74K64l07O7j81l27K31K03k29L01
1393A4j70K01M4l74L89L53n10J88o5m3O0J83k92L08l48j23M27o31L99r5l79K68
1415a96K27o21P16j62L8K41j99L12N6m85L80J09n85N37n15r0L09k48j8omJ56k41
1438b89j82O29p0k08L88j46j38M47k19j90J15j62L48l10K9k71O9m56P24k09p6
1459a77L37n84M82J03k62K40K41l91J94M19m46O5j66KK98m27l9J66m67M97l20
1480b35k88N06J14j78J37k17M37J26k50r3P6mJ0j48J6J26q6M5k08l9k82M99m06
$$ y = [93, -24, 54, 288, 50, 416, 155, 153, 376, 369, -41, 165, -249, -132, 280, -288, -28, -320, -537, -253, -91, -122, -11, -67, -13, 266, -8, 307, 203, 4, 332, 297, 4, 676, -10, -318, 275, -216, -272, 112, -327, -208, -88, -305, 162, 370, -98, 97, 286, -21, 335, 72, 187, 576, -182, -8, 256, -51, 16, -165, -492, -261, -58, -287, 14, -156, 45, 89, -285, 104, 457, -53, 135, 70, 27, 87, 270, -22, 286, -62, -185, 242, -389, 10, -85, -464, -196, 31, -590, 126, -36, 2, 243, 44, 356, 412, -73, 307, 416, -169, 368, -147, -237, 72, -176, -194, -200, -204, -48, -289, -471, 158, 88, -120, 268, 122, -16, 431, 212, 22, 137, -25, 323, 13, 42, -229, -160, -616, 108, -101, -177, 160, -424, 58, 161, -101, 139, 380, -11, 183, 602, 156, 221, 55, 57, 355, -72, -111, 55, -412, 85, -235, -523, -17, 97, -81, 56, -161, 276, 402, 152, 59, 135, 131, 141, -7, 9, 135, 49, 94, -114, -153, -435, 64, -342]
1503c42K18J53k22J59L3m6L60k47j47M93j80J4K99o24K33K57k62l60K20M6j88
1524a33j74r8K29j30J90J18R7K2J29j97q4K37j79L6O8O2l2l98L66j37l90M63P6
1547A41m08J19l17K09J73j08M62J5j95J47J48n80M08o2l10L01m28K64J54l02K1
1568a48j28K23l77K85m22O63m4l02L72K9k11L98k63j33M33k95pk25j9R9q4M9J79
1591G2n1o7K7K8k08M59m58M09j57l3L17k3k49M02l39M4K69n77n9K59j49mn5m4
1615a87Nj68J31K46j40nj01N0K10K97n13L22n5J54l02J47j39Q0p2l27J51K0k71
1638d67O96o23L23jk31O06J0m10J22M2m5K78q6l4p3r6j57J76l48L92j94k77L87
1661a0j53N1Q5j54K47J70j20J12k6m67M23Q0k99J00K80p13M46l0j48J51j68K47
$$ y = [-342, -124, 29, -193, -34, -1, -47, 313, 66, -81, 412, 232, 246, 545, -79, 154, 411, 149, -211, 9, 55, -133, -307, -405, -176, -306, -116, 2, 99, 121, 250, 53, -31, 206, 27, 63, 131, 193, 161, -237, 129, -8, -398, 65, 141, -267, -148, -465, -256, -83, -191, 271, 286, 91, 238, 386, -194, 214, 152, -158, 143, -285, -21, 133, -169, -148, -276, -53, -430, -145, -567, 96, 52, -250, 122, 151, -60, 338, 75, -58, 375, 80, 73, -152, -171, -72, -156, -107, 72, 21, -46, -19, 9, -199, 260, -198, 211, 54, 21, 338, 315, 66, 468, 129, 173, 442, -135, -194, 65, -84, -88, -143, -187, -182, -350, -219, 27, -113, -118, -219, -169, 41, 338, -175, 147, 92, 246, -56, 91, -48, 32, -40, -367, -216, -196, -467, 229, -394, -71, -72, -303, 303, 313, -97, 25, 67, 22, 300, 214, 180, 107, 11, -146, 30, -318, 74, -120, -397, -10, -163, -112, -27, -181, 66, 236, 116, 228, 202, -265, 158, 238, -61, 39, 319, -394, 52, 22, -126, 25, -143, 104]
1683A04j17L6K9j12j85N68k73K35r9k46J70K15l52M7J48o44M61Q9j34Lj85m6K60
1706b8j61j98L56k3o8M09k68K16k09j9K46n10J72K68l02L1r8Ko6J85J96j57k78
1729c04J21K85j24k8K02j94J91p9q4j0K33j11j99Q8j43K40j44j9J70l84J68K00
1751G5k37l9J15K42J8k2m89O16j84J44l32J57J6m6m2q7P8o8J15j88j35L39k79
1774b33K14J29j08l6LM1J85M2QK07l05j97L34n67M55j88m5Po9K86k05N8j97K56
1798G5O6j79K35k12J70n4J20j13j03j9K28K27o02K59k98L5J58k02J52P1l42L42
1820A4J23l07N46l90r8L72k42J03K13k85k56N0o9L42l34j71N53k52r2L77l77l2
1842b12L75m56J70N41m30M02k67J23K45l09m39L65k73J70j36l2J94pk67K85q4
$$ y = [104, -13, 23, 52, -60, -245, 323, 50, 285, 186, -60, 110, 325, -27, 20, 168, -476, -15, 74, -60, -57, -242, -288, -28, -189, -387, -31, -54, -122, 287, 19, 235, 26, 7, 253, -257, -85, 183, -119, -88, -186, -184, -250, -65, 131, -26, -304, -183, 102, -22, -50, 152, -42, 149, 70, -14, -24, 209, 98, -101, -13, -156, 84, -60, -79, 91, -293, -125, 75, -162, -201, -86, 156, 174, 152, -337, 279, 95, 239, -93, 64, 80, 34, -8, -95, -17, -85, 30, -158, -293, 46, -233, -19, 110, 2, -34, -31, 10, 195, 237, 245, 452, 147, -50, 284, -283, 172, -16, -61, -54, -123, 163, -42, 16, -181, 75, 141, -38, 197, -15, 155, 101, 221, 108, 5, -14, 214, 441, -161, 98, -200, -165, -7, -209, -57, 14, -328, 14, 137, -170, 376, -14, -112, 260, 18, 121, 334, 49, -207, -157, -226, 116, -218, -389, 164, -88, -180, 197, -180, -212, 163, -293, -123, 418, -12, 390, 123, 246, 491, 182, -257, 108, -165, 5, -131, -163, 31, 24, -243, 42, -42]
1863d2j93L47l22K38J28j6On9j39J1j37K24J49ro53M36r6%j04K47j10J91l30J77
1887e6l9j43K66J21O0r5K1P9k7k66L03r5k99J81j37j9M38l03j39J63N8k69K50
1910E3r6k89K98R6o7N0p6K14n3k46K80N5l48M84o97M39j12l48M72k53Q2j58L48
1933A28j67P1r8j9K40l32M78k67k7K24j54k12P8Lj59K08n3m8J0j75M57k46k67
1956c27M74k61L61j96k01RJ94J43j1k67J67j91p9m2L03k20J46j37j70J78Q0q4
1978a31K42j16j16L0J51o3O1k28L35j81Qk18K73Jm39L73k03Q5J15k01P9l7K33
2001E3o6J32Q6m56K15N4J11j06P3j01K82l50J68l35K29r1j27K69q5K8j9q6J43
2024B1J29o1J24l36K36J31l25J68J18l95K81j3j0K12m25J92j27j59K21q8l6N4
$$ y = [-42, -235, 112, -210, 28, 156, 140, 146, 87, -52, -41, -178, 46, 195, 186, -467, -31, -127, -127, -231, 16, -94, 97, -233, -56, -95, -238, 28, 149, 209, 114, 135, 214, 187, -79, 224, 129, -170, 11, -126, -145, 293, -10, -149, 14, 72, -197, 53, -43, -332, -34, 62, -5, 45, -31, 183, 130, -116, 164, 219, -129, 355, -342, 97, -15, -363, 109, -144, -62, -220, 128, -39, 32, -66, -85, 155, -177, 301, 34, 7, 231, 77, -135, -57, -54, -213, -5, -58, -106, -96, -271, 186, -60, -327, 147, -114, 247, 51, -150, -141, 53, 196, 185, -82, 85, -106, -185, -227, 76, -144, 2, -135, -305, -127, -47, -131, 111, -5, -121, -91, 60, -3, 58, -170, 165, -16, -8, -226, 47, 48, -391, -18, -221, -136, -21, -222, -143, -180, 53, -13, 119, 205, -251, -36, 18, 129, 23, 96, -5, 277, -73, 95, -240, -11, -102, -229, 40, -45, -17, -36, -122, 21, 150, 89, 213, -123, 113, 244, -81, 87, 205, -190, 91, 78, 68, 280, -145, 47, -80, -239, -18, -106, -142, -88]
2046h8M5j26K01O5J0q9l9J63P0l25RJ06j31J13K42k77K44k92J11Qj86L7L27R8
2070B96l23K41n6J12p5k22P4j81K45j20j4L48l73kqmk01L8J49k25J72j91J76L91
2094B47l93K29J20j63j57K14r0p1j24K54j8J2mk58J83M9k34L26k25j51M27l2k73
2117a32n0L31j17K57m75K55j51L27j32k96J4m6L76p5k21J3K77j63K46m63L39p7
2139C7J81j87J49k65j37L10k04K20L7k52J80k90M55l90M56l66J03k6r0J0j32M1
2161a60K16P2j49k29L23J32k53J13j65j11J36P8j13p5K52l19M72l78J62K8J94
2182B26l72L41k34L42l26q1J99k44n3J14P3R2N0j02J04j22j8J71j18m6o8j04J50
2205b6J58k94J64j6k23K62j02M1K79l63nj79J74K49p0J76k55j81J93o0O0j72L99
$$ y = [-88, -43, -169, 32, 97, 107, 18, -21, 142, 212, -113, -104, 2, -129, -16, 226, -51, 193, -99, 12, 20, -166, -129, 198, 296, -27, 214, 158, 270, 195, -27, 47, -134, 111, -9, -23, 325, -48, -50, -58, -62, -263, -225, -76, -301, -129, -320, -144, 247, -146, 83, 203, 40, -117, 97, 7, -64, -188, 66, 48, 60, 56, -202, -19, 30, -204, 122, -103, -254, 173, 141, -132, -182, 149, 32, 289, -186, 69, -82, 245, 113, -183, -169, -215, 161, 86, -135, -122, 155, -8, 238, -225, 114, 37, 218, 31, 180, -85, -222, 88, -116, 104, 141, -111, 69, -221, 234, -156, 300, -66, 37, 11, -79, -69, -201, -160, 56, 128, -21, -250, 73, 205, -48, 65, -100, -211, -75, 3, -110, -185, 67, -252, 220, -158, 4, 32, 226, -146, 195, -39, 303, -23, -104, 95, -149, -202, -88, -15, 77, 127, 25, 129, 7, -11, 160, 42, -4, -72, -176, -26, 132, -162, 2, -14, -237, 25, -77, -36, 243, -120, -125, -304, -130, 119, 49, 225, -30, -211, -18, -78, -18, -190, 209]
2228B09m15K68K23k28r1j88J79K4K26l88K02K57k80N0r0K58k88N5K8j96L17r9
2250C3k0l4O6k70K86J16j35r2L10k55J32j42j9j85K45R6j19L7J89j21l16Q0L22
2273B04l56J21J09j68j24M05N8l2k19Lj71K79k26K52l1k29K94k79L76j71j48J42
2295H9j37j7L7q5k42N19k31J33q1n5k92L97q0k7J0l2L3j47K34q2K21k49K04J1
2319A31j74j01K29rj5mJ68j4l57M18l74K05N0k80J99j14oO0J25k82L89k66J86
2342A64k97j8K98N2j70j28L33l38J87j40rJ42k03K45Rj86p5J7l0L76j24m0M1O
2366A12l84K14P3k01K65l41J21L4j80P0L16j26o1k1mP0R1J13l87J86K1M2j83K15
2390E5m4L9J25j25M0N3j69J67k37N2K19k64l5Q0Q6j37N84m55l3J13o5%r4k82N20
$$ y = [209, -206, 62, 285, 57, -34, -222, -43, -19, 207, -181, 21, 278, -2, 48, -42, 216, -72, -17, 11, -185, 132, 33, 13, -21, 45, -225, 61, 177, 42, -50, 260, 5, 137, -5, -24, -209, 36, 132, 13, 50, 239, 118, -198, -118, 204, -152, -31, 78, -90, -214, 191, 249, 217, -2, 1, -170, 109, -117, 135, 104, -125, 169, -110, 266, 95, -53, 89, -48, -65, -28, -113, -355, 164, -67, 66, -15, -70, -362, 35, -45, -72, -62, -94, -61, -208, 26, -56, 165, -84, 120, 131, -43, -144, 85, 76, 61, 57, 225, 211, -146, 272, -102, 103, 153, -127, 72, -42, -48, 12, 137, -145, 244, -22, 164, -133, -151, 147, 199, 29, -99, 234, -104, 83, -57, -66, 76, -127, 118, 127, -59, -134, -117, -147, 229, 105, 65, 106, 112, -272, -58, 15, -186, 79, -262, -141, -107, -287, -217, 99, -27, -88, -109, -113, -43, 48, 161, -226, -40, -19, 23, -160, 55, 11, 50, 175, 50, 90, 143, -26, 141, -96, -44, 175, -89, -124, -44, 42, -95, 489, 34, 1, 114, 49, 49, -45, -327, 193]
2415A93j5j45k2j49j10L96m7P3j05k17J40qJ77l00K21m31M15J38p6j26k07lJ28
2438h0k7J60L23q80N45J5K70l28k5K71j55K6p9k31K49j47j55N82m18K02rj15J10
2461A04l29N64k84Q7j31m0J43O2j76J69l4j39L5j53J37m37J52K19Q5LRj17j23
2484a94J20m4J2K26j62P0k77K17J84j75o3R3M1j96l8J51J71K2k26P5k08K48n6
2507iJ72j59K12r8j86M0om3O3M5l3p0j07L30J44k42J46j10l3j1r0n7P2M8J53k44
2533g3M2O0p2l6J81j81q4M37j45j38n6J96j13L8l33J79J37j52r0M0M10j7k93L4
2557b9L15q3k68KK8J18j17J64j85P2O9K51m00K26j84l5K18N9n00M82k35K86l51
2580i7K50l03L07m88K78j14M1K06k00n0Q1l6j09J12j2J37n2L5J64k10J08k92K63
$$ y = [193, 178, 33, 11, -138, -248, 148, 101, 174, 69, -148, -8, -16, 161, -139, 82, -349, 66, 204, 128, 2, -205, -208, -80, -107, 53, 376, -504, 41, 56, 326, -2, -27, 244, 89, 115, 36, -195, 54, -93, -248, 334, -84, 118, 109, -6, 104, -225, 339, 55, 142, 11, -29, 114, 176, 0, 169, 135, -4, 31, -122, 15, -422, -270, -51, 34, 37, 46, -71, -194, -74, -118, -106, 120, -42, 28, -249, -32, 152, -23, -86, 7, 48, -148, -186, -35, 136, 158, -68, 7, -201, 47, -9, 163, 4, 216, 118, -68, -28, -34, -77, -14, 31, -2, -72, -179, 151, 295, 53, 199, 89, 56, 45, -45, -102, -30, 18, 171, -73, -31, 29, -43, -79, 102, -79, -163, 274, 129, -9, -65, 131, 18, 56, -277, -98, 39, -113, -203, -163, 247, 230, -63, -29, 286, 203, -65, -63, -35, 83, -34, 130, -55, 17, 86, 337, -63, 163, -21, -56, 162, 221, -279, 203, -32, 254, -97, 153, -150, 157, -331, -53, -167, -126, 80, -120, -170, -89, -125, -234, -122, -134, 3, -49, -14, 150, -60, 48, -244, 19]
2603A9J05j30l22K46L57k81J75l21L23j75Kj11P9M2J52k37K39m56M29l24J61Q2
2625E4p0K20k43J64j50m0l8P7j41K96m41K89q7J86o2J44l25Q5K9K76l51K00k60
2648a88Q5N2P2k6M6R6j03k8r3L0p2r1K01k10N75k38LJ82l08N3j50J83j53j03L95
2673B10j85L2j17J09j12n5K00k91K15N4Pj25O5R3j93K24r2J52k55L7l1J3q3J20
2697hN2m3j82Q2R4p1K29k61K12J83l65J19K47m75kM64k12m1k58J4K16k03J58R3
2721D2n4P8l44K00O1K35k93M0K84j05j77J57j30j28M11j67R4k67q0L5J83k25K57
2744A07l6j5j91N41l91j38K01k30J3J05L36m12J9K93l03K89J07l98J06j31O0J67
2766I9n12J94K92L7J7j47N7n4j83K02L0k88K72J17k29m9J52L0J43j33l6j27K10
$$ y = [19, 124, -6, -328, -82, 275, -6, 169, -152, 171, -4, -2, -113, -34, 8, 160, -77, 162, -294, 135, -189, -28, 54, -16, 204, -39, 125, -25, -65, -103, -26, -167, 129, -312, -23, -110, 76, 14, 158, -167, -82, -53, 223, -128, 72, -188, -103, -51, 21, -5, 41, 137, 34, 6, -87, -57, -129, -220, -19, -229, 346, 108, 111, 293, -15, 38, -112, 71, -82, -185, 210, 25, 57, -60, 49, -63, -118, 82, -209, 6, 60, 67, -58, 7, 100, -93, 131, 39, 191, -64, -27, -58, -45, -128, -8, 44, 1, -181, -99, -5, -76, 153, -108, 104, 287, -78, 41, 288, -187, -189, 275, 63, 22, -236, -222, -6, -209, -51, 42, -12, 66, -278, -78, -17, 218, -75, -35, 249, 144, -33, 124, -6, -134, 277, 110, 204, -63, -143, -108, 75, -150, 107, 71, 56, -135, 406, 15, -123, 78, -152, -139, -34, 302, -110, -91, 202, -101, 188, 295, -103, 3, -128, -68, 99, -413, -219, 73, 110, 127, -20, 37, -17, -200, 2, 32, -256, 16, 133, -96, -145, 7, 37, 180, 47, 11, -116, 94]
2789I4j31Q9Pp2K12l23L91j21N0j03O0o0k83M75j39l6k88K60j72L08k76R9l91
2812c50N84j97J58k19j58M28k37J65j30Nj39K10l49L45M1j65J24k48O7J46O2m3
2834A00j38J88j79J04L9l83K69R8J07k37J87m67M80k44J17K47o27J71K98l38K13
2855El8j53J99%j89N06k90l9N1L4m4k94J38R7J17k77L25J45k29m1j78J86J44l14
2879a39p7M20n10O05l70R8pJ63k62K10p9K21j67p3k02K53j26J16r3k02J64O4l88
2902c81N54j68qJ46kl35L25n36M92j23P6j55J5R4N4J31j29L4J9o4k60P7K5KL00
2927A83K35k55j52K11j64j05l1P5N8Nl06J36J5J60J18O7l47J1n9L8K31k08J10
2950B6o3k8J25J78j79k09R0J32J97l68J26J16k40j04K52j99K35l51K29KR5p2P8
$$ y = [94, -37, 52, 59, -13, 199, -124, 267, 146, 196, 93, 153, 93, -190, 285, 146, 110, -178, 82, -90, 218, -58, 41, -350, 234, 37, 195, -24, -182, 246, 9, 174, 44, 49, -90, 120, -229, 116, 157, -8, 116, -132, -65, 81, 143, 100, -38, 150, -29, 75, 114, -269, 0, 98, 205, -32, 155, -312, 168, -76, 41, 288, -339, -168, 130, -208, 5, -33, -186, 13, 13, -176, 330, 40, 1, 52, 86, 42, -252, -114, -17, 100, -177, 148, 293, 64, 23, -155, 31, 175, -139, -216, 204, -306, 299, -71, 27, 20, 183, -79, 131, 52, 273, 106, 33, -169, 84, -42, 74, -19, -221, -57, 7, -381, 173, 5, -3, 143, 141, -194, 131, -405, 87, -36, 40, -115, -100, -6, 48, 179, 50, 84, 103, 39, -221, -144, -119, -117, 183, 418, 163, 11, 222, 58, -47, -78, -3, 55, 60, -246, -110, -95, 65, 183, 250, -97, -86, -145, -107, 124, -84, 26, -37, -65, 60, 238, 59, -150, -60, 72, 269, -99, 27, 143, -97, -201, 51, -148, 87, -264, -35, -33, 62, -10, 68]
2973F8k69r5K09O3l9L9k76N3L44K58k74q1M0k74M57m54K74K11k07ok56J89r6J42
2997B0K8J42j58j58R8p1M6j98L11j95J98k23L01l19K60k09J44q5l9M8j2N4KJ97
3021A82k40J5J70j24j37K08P5P4m04q7K68p2J7O4o1LJ98l55J51J38rP6p6j75R1
3046a0J54k03Q0q0K4P6l41L26K90l33J74m5l5l47M33j38J33l94K55k50J47J73
3068H9j55J2J41j33K29L1k02K36l27K02j01j01j68K11J16l84L88q9P4N0k46K43
3090A16k36O99n36lNj43j49K84j5j28J67l09J03L1K00j03J19ok32J07O0Q4j2m4
3114E9N7k20K40k25K12l00M11m53M64j32j04J6M5r6j63L08j39m5J51k8j52M30
3136C36j14j62l38J98p5J16L39m97J78Q1m7J17k6k37J12J56k62j80L82k89K56
$$ y = [68, -201, -296, -87, -24, -63, -24, -300, -247, 97, 355, 81, 0, 40, -234, 223, -231, 43, 254, 47, 41, -215, -26, -122, 20, 48, 190, 32, -126, -28, -99, -53, -251, 60, -135, 63, -160, 141, -178, 82, -127, 17, -68, -107, -59, -71, -17, -15, 182, -58, -43, 127, 3, -134, 74, 149, 223, -181, -268, 0, -72, -55, 9, -52, -49, 149, -206, -55, 83, 74, 150, 74, -101, -10, 144, -59, 21, -59, -35, 41, -300, 26, 316, -17, 157, 112, 77, -270, 163, 25, 158, -236, 19, -231, -84, 89, -66, -54, 87, -46, 183, 214, 12, 248, -79, 123, 22, -79, -247, -36, 80, -304, 84, -5, 69, 119, -127, 116, -120, 579, 43, 40, 45, -98, -247, 37, 22, -106, 61, -248, -145, -114, 86, -17, 102, 96, -136, -29, 31, 115, 103, 59, 116, -104, 136, -89, 123, -177, 234, -219, 245, 113, 9, 25, 70, -26, -189, 119, -20, -65, 86, 58, -94, 336, 222, 60, -278, -80, -155, -39, 300, -197, -19, 62, 15, 132, 106, -131, -19, 137, -125, -305, 77, -212, 44]
3157D4L13k65Jq8M8j62J13k25L08j72L74q9k7k00J02Nq1K14m48J27M33j66p2J05
3181A92m93P8K73J54j72j00L3j07J02O0j1Q4L1j87J89l62K60j61J15j69Q4J16
3203IN8k91L52j86K3K17k41K6Q9k57K46lj31J95K46n16K73k43k77M13R9J99j67
3226A33m3J4l94K83M7o8j71J00K09L1j9k22M4J10l08K93O9O7j95o8N7J97R9m55
3250a90J09J07q5j56L36l19Q9J28k91P3J70O3r7J18j68K13j56k5J8m9Q2kJ41l36
3274b27O15m05r0J43k27J06m6O8K0J4L9j00k7J84q2n2J54k35j1J23L7K09q5k05
3298h0Q1m6m1k3j11lL26J23n6l97J42J9J75j60j8j78R7K68j13J37m8j74K0j84
3322b44K7K02N0j21J94l09L39q1k6J66j02r9J28l5K5k73L53k89L12j76J25j79
$$ y = [44, 357, 92, 93, 5, 53, -109, 4, -221, 87, -85, 289, 200, 173, -27, 75, 80, -1, 213, -235, -108, 325, 159, 87, 192, -301, -223, 50, 204, 32, -68, -35, -142, -40, 20, 9, 93, 124, -63, 126, -236, 24, -137, -22, -191, -107, 9, 67, -224, 128, -58, -35, 182, -59, -33, 56, -201, 45, 42, -89, 106, 352, -164, 109, -134, -411, 2, 101, 300, 133, 90, 104, -290, -7, 40, -28, -199, -99, 110, 141, 122, -100, -56, 54, -254, 39, 108, 175, -20, -88, -31, 166, 265, -190, -81, 26, -59, -215, 121, -198, -109, 19, -272, -199, -29, 34, -63, 55, -113, 100, -56, -81, -63, -112, -30, -32, 109, -227, 388, -17, -107, 36, -191, -85, -131, -63, -43, -29, 10, -90, -117, 67, -15, -67, 87, -148, -159, -36, 1, 210, 125, -80, 1, -45, -86, -109, -220, -223, 103, 226, 170, -227, -85, -66, 109, -51, -69, -247, -150, 118, 5, 142, 94, -80, -60, -244, -217, -15, 35, -86, 108, -201, 138, 57, 31, 197, 95, -4, 124, 89, 114, -159, 194, -95, 217, 41, 166, -13]
3344a3n0L1J70k08NNj67J72j6j4J45k96N03j11j18k41K7L12K7n6n5k55K47l05
3368b61J51J97j73K32j11O1k80J86l94M8J16Q8J94m9q0J66j67j40L40l17M1M33
3390B81k37J76k05P5j88k04K90J45j47k13K57j11r6L65j22J03j81j53k6J37Q9
3411C5R1m8j25j54j6L90k68j28L0K25k74J91J41p3K41l08J18pJ4j4Q1k85K0J34
3435A1J61j84K0QM6r3L52k29k6k1J3ok1On3L29l1k51L9K25k58K37k72j2J03o8
3461B5q1k8J38j82j32N55r1k21K03n3k02j0K56n04M70j73N7k1mL4j80K32j51J59
3485I6J4k38q3J29L06j32j73J19J32l15J19J29j2j14K2O1j68J01m6J93q4j66J40
3508C0k35K90k82K18p0K11j24%N0q9o3J9N9l6Q4j37j24J49j09j9J16j87M73J6
$$ y = [-13, -63, -32, 138, -70, -65, -60, -227, -55, -71, -85, 60, -236, 267, 156, 38, -203, -176, 136, 163, 107, 52, -203, 44, -261, -110, 87, -86, 146, 35, 96, -184, 2, -392, -344, -228, -140, 54, 5, -75, 91, -76, -216, 124, -193, -152, 281, 44, 220, 15, 90, -98, -302, -12, 133, -14, -227, 30, -81, -177, 188, 66, 169, -12, -165, -191, -54, 35, 126, 78, -47, -201, -217, 173, -95, -223, -193, 32, -242, -51, 90, 17, 258, -50, 68, 61, 75, 61, 142, -143, -123, 11, 172, -12, 8, 16, 62, -31, 321, 92, 66, 45, 58, 52, 31, 37, -16, 313, 282, 31, 70, 295, 37, 274, 2, -10, 93, 25, -56, -84, 54, -128, -260, 295, 204, -17, 186, 133, -69, -79, 177, -327, 143, -30, 27, 6, 2, 36, -144, 88, -63, 96, 110, -128, -211, -82, 224, 92, -81, 38, 170, -145, -26, 103, 91, -23, -1, 60, -108, -7, -53, 140, 56, -110, 30, -205, 85, -197, 21, -49, 162, 38, 38, 88, -1, -64, -45, 14, -22, 62, -75, -199, -50, -159, -178, -62, -249, 224, 240]
3532B40l33K9J70P5j17%J96j88k58%K39O0k58K73k30K24m3j43J89p0l6P5M4l00
3556a62K21k1L2Lr5j7L5j68J25M6k04L11J77k12J12k62j5J51r8J44j39J5K26k69
3580f4J74Q9j54Q3k19K70j76J04j90J67K80m49rJ33k59JL55n2R0k09L0j82K43
3603E6n6K9k40L89m6o3p5r2l8n9J78L3j34K75l24M56j25k40J42r0P4l04J53Q9
3627a2rn0r8N6K37K92m41o8P7L6j45K55k61K76j91o1J33J42j59J71J24l83O4k
3651a7J73j20k54M20M0k77J06N7J02k34j26K33J16k21J41l40j26L13Q7K79l73
3672b1K75l36L5p1R1j58L0K29r9N7J54j26M3k21j00K28j44M9O1J21K63l15k9J86
3696B02k87J02p4O5k62L87l8l3J11L1k58J07k34j26N05J56m08L6j6K74m11J22
$$ y = [240, -93, -64, 106, 181, 64, 64, 260, 72, -186, -186, 53, 113, -145, 128, -102, 122, 79, -64, 125, 55, 19, 94, 138, -162, 59, 38, 70, 73, -22, -39, -4, -172, -47, -1, -205, 106, 283, 71, 183, -79, -94, 57, -41, 103, -36, -21, 205, -64, 110, 199, 45, 128, -91, 179, 3, 107, -83, 84, 364, -85, -94, 39, -220, -219, 136, 84, 174, -35, -5, -187, 56, 0, 29, -211, 178, 132, 69, -6, -98, -136, -195, -17, 16, -118, 157, -167, 289, 164, -76, 66, -24, 50, -254, -101, -12, -21, -71, -169, -113, 124, 416, -25, -93, -16, 20, -125, 130, -131, 145, -46, -107, 26, 168, 9, 180, 304, -79, -15, -17, 156, 36, -218, 202, 242, -35, 71, 128, 230, -4, -130, 103, 219, -2, 139, -201, -327, -14, 73, 352, -21, 254, -82, -47, -118, -27, -185, -155, 74, -25, 32, 186, 60, 103, -118, -218, 10, -134, -85, -24, 97, 360, 45, 16, 202, -85, 17, -57, 8, -254, 133, 95, 62, 173, 204, -54, 53, -181, -307, 198, 354, -54, -18, -34, 240, -171, -49]
3718d9K18R5k70o9M3J44J05q8k30l2R0J10j60K99j84Q1j26N9J8kM7p2K4j96J65
3743B0J14j13o4R1j09jK02k78J34J32J7l17O4M05k55m1r8K25j20L7Q5l71M24l25
3767a42K36L1k34K92k89l22K75K22p6j50J70j7Q3L20m03r0k52O83k27Q8k9k78
3789a09J29L8J91k52j99M6J56k10M84m38J88N1j50n0OQ9k2j42O3L37j03m80N85
3812B08k04j35L25j83j38K74l45J41j34J66k18K04K08j83J13j77O8J49p4PKqj03
3835c7J17J52l24o5p2M10j96R2l08K01k2J63J6j0J43l20J79k13J39L7K06l19K70
3858B39j30k47PK20Q3J6q8k19K46J70m29N1k9k03N69j59J87n13M91l32Q2K7l9
3881@k74K28K79l77J58K06m00L16l13J37J05k63J09K11K0J50l96L78k75p8J75
$$ y = [-49, 169, 264, -6, -75, -32, 112, 217, 129, -101, -133, -43, 67, -93, 206, 22, 103, -23, 36, 54, 52, 99, 27, 51, -145, 20, 134, 21, -43, 48, -61, -62, 140, -138, -4, 128, 145, -172, -108, 297, 42, 1, -97, 128, 8, 45, 130, -241, 183, -142, 94, 125, -109, 183, -106, -428, -153, 69, -7, -157, 13, -4, 79, 399, -4, -94, -346, 337, 110, 198, 169, -109, 20, 58, 249, -3, -202, -156, 0, -210, 274, -164, 24, 75, -75, -125, -119, -30, -52, -194, -131, 206, 103, -377, 208, 4, -131, 194, 11, -127, 147, -198, -57, -191, -25, -243, -39, 169, -14, 99, -78, -10, 139, 65, 72, 74, 66, -37, 80, 232, -92, -157, -229, 181, -15, 77, -231, -30, -52, 111, 127, 117, 260, -60, 119, -94, 45, 82, 288, -31, 239, 109, -138, -131, 89, 172, 188, 100, -119, 127, 297, -132, -81, -110, -313, 256, 97, 284, -229, 262, -70, 12, 39, 0, -274, -46, 233, -144, 14, 220, -180, 136, -177, -40, 65, -198, -89, 122, 142, 292, -104, 274, -1, -79, 96]
3902I6m5J98k68k7K95j95j68r7J71K05j15K97m59j0K23j06k2j55L12k48rP7mJ92
3926A38l20J85R0k49K4J54k6mJ92j19o1J49j90jj8K41J69q01N93k5j01r5l2J55
3950D8n2k22L19l9l36K60o3K18o3r2M6j60K17j4K1P9l06o9kj70N50j36J05j51
3974a2K1j31K57j00j50K74k67m2j8Q4M5j18K22j80J9J15j92J73M0N0k87K88j24
3997c3J59r5K13l99K14j94J07l11K72o6K51j4j57K08l66M84m09R6J88k00N1k42
4019b43K33p5J15nM4j63Q9j02j41L6N77j41k71J44j55r1K45k13k0J42l1L4ll3
4043b8P0k40P3L40o0J32k37k41K26J2j19j8K88j44J97m33J70L9o6K9j94J54%O3
4067A3o9n6m5J23K80k66MP5j47J78J58q4k10o3L20k62K98j33q6j61J22j99L54
$$ y = [96, 51, 249, -19, -46, 249, 54, -114, -211, -40, 165, 50, 347, -112, -122, 101, -5, -27, -182, 130, -118, -127, -50, -54, 138, -182, 3, 93, -156, -132, 22, -4, -8, 184, 65, 4, 153, -37, -38, -56, 185, 354, -447, 146, 121, 20, -75, -107, 48, -4, -226, 93, 54, -282, -22, -85, 133, 70, -22, 24, -136, 81, 67, 88, 167, -139, -208, -210, -380, 170, 34, 139, -12, 9, -122, 135, 35, -115, 159, -108, -150, -168, -84, -39, -157, 65, -115, -96, 19, -173, 0, 40, 90, -197, 91, -33, 126, 31, 244, -155, 59, -135, -28, -339, -67, -133, 118, 104, -53, 155, -211, 273, -136, -40, 148, -52, -1, -243, -10, -85, 30, 25, 69, -94, -5, -107, -248, -212, 365, 224, -47, 97, -58, -149, 96, -117, -137, 5, -26, 8, 5, -28, 42, -198, -125, 215, 155, 287, 50, -191, 35, 47, -72, -90, 198, 54, 251, -182, -12, 27, -39, -10, -204, -50, -50, 13, -56, -112, -157, -34, 246, -20, -16, 59, -88, 90, 248, 164, -46, -109, 211, -51, 247, 114, 28, -133, -11, -210, 144]
4090A44J79r1k0k58j40M46q9l07J55j30K03k34L31j51o5O0j88J93m77O47jl75
4112a68K89R0k53m0k1J79K45j66m7j9p1L88o02Q4K9K2L69l11j3l4j24K6k83M58
4136B7J34j05l5J37P6k87K39k07k6r9O6K01l02J02q2J93j55J26M3j13L6J32p6
4159B5j49L76o2l10K26k3N4k74n0M17k50J89k40j29J42J3j43k7J89J20O7l01L02
4182A62j11J70N1j74j99oJ22K71j80m3L4N7O9m78K40M9J48n34L69OJ82j76J23
4205A52m6K4L9k02K05j36M9j14ll5J71j91j84L89o3Q0j27k06K17k73K54j25K82
4228A57j24P0M8M1j47j60q0L03j85J92k25J2N01j66l69J1J28k75L98k66J92q7
4250c1J4j16M39p8r4J06j01j65L67j69j22k7j40l6N0n4P6j24J3M7j24J20J66j9
$$ y = [144, 323, 232, 212, -46, -186, 260, 171, -136, 19, -111, 92, -142, 189, 38, -27, 33, -155, 38, -439, 208, 207, -168, 121, 211, -42, -82, -103, 76, 321, 155, 108, 89, 18, 406, -196, -112, -83, -61, 308, -3, -16, -50, -174, -148, -431, 27, 161, 56, 21, 158, 234, -53, 186, -21, -47, -146, -80, 121, -181, -79, -161, 32, -123, 3, 46, -67, -31, 101, 25, -124, 252, 190, -120, 106, 83, 137, -137, -187, 230, -20, 169, -71, -200, -58, -45, -188, -215, -26, 94, 161, -140, 162, 51, 221, 272, 98, -101, -107, 15, 286, 106, 63, 97, 154, 223, -255, -15, 34, 182, -352, 17, 23, 205, 29, 152, 106, 130, 169, -33, 172, 36, 85, -29, -32, -67, 104, -87, -271, 118, 55, 135, 8, -198, 19, -254, 0, -125, 157, 33, 103, 151, 192, 45, -115, -195, 108, -77, 115, -110, -98, 403, 237, -132, -121, 7, -268, 130, -136, 56, -31, -17, -133, 306, 228, 134, 240, 139, -26, 341, 172, 50, 23, -117, -153, -103, -157, -81, -205, -192, -145, -269, -149, 17, -2]
4274bM0n4L3Q5J93l94r7J09K58j30m2l47L33r6L33o4k20K47P0l99J40k20M67j10
4298A33n2J0O6k6L8n6k49M19l77N1Ok88R5l2O8K70k2J77k7q3l39M3j25L57k86
4323b29L62k11J08m6J63q8L3j95J83k81K61m7p1J27j38L6j77K93r6J09j64J31
4345F3j07K77r9j89L20m41K32M1k28L17j47j27PN0J55k36L24l04jK0K8Ko7jj95
4370c06L52j03l17P1K95j2J3j73M45l75M3K16l15K85k96M2RP8j6l40M17j10L11
4393B14q4j75N2j57L70o0m18K50L9j68K37j19J5J30k02mj26K13O1%k69K36j09
4416g4R2j77j07K85J64n8j27pj68J82Qn9L37k31J46j26O3k8o0M8p2l1p4J10P3
4441A09k7j46k08N17j86jk98K92l9k47L79j34m4%j12N4O2J44k10P0Q5j21M8J45
$$ y = [-2, 38, -16, 17, 102, 295, -99, -196, -87, 171, 41, -1, -348, -15, -111, 222, 158, -62, 185, 255, -144, -4, -224, 243, 133, 81, 91, 157, 131, 169, 113, -136, 283, -94, -43, -37, -325, -230, -262, -194, 76, 54, 231, 204, 121, -218, -175, -300, 57, -229, 133, -78, 30, -16, 147, 59, 92, -103, 80, -201, 60, 13, -58, 69, -69, -33, -210, 83, -13, 96, -68, 63, -44, 233, 134, -55, 265, -176, 56, 97, -131, 186, 39, -88, -81, -31, 124, -112, 212, -92, -93, -73, -45, -43, -110, -111, -306, 46, -57, -374, -303, -8, -20, -7, -180, 265, -110, -67, 149, -166, 119, -177, -135, -126, -48, -64, -404, 13, -97, 214, 130, -45, 7, -150, 220, 160, -258, -8, 31, -137, 100, -19, -4, 126, -76, -80, -206, 7, 68, 68, -201, 35, -74, 18, -159, -266, 19, 183, 125, -2, -9, -177, 5, 13, -46, 291, 60, 206, 80, 143, 115, 55, 103, 31, 0, -74, 36, 109, 82, -64, -272, 245, 59, 58, -240, 52, 13, -234, 145, 11, -33, -33, -145, -91, -29, 115, -95, -25, 60, -61, -13, 132]
4465A32o0qj59k50J99j86R9L66k28M60l01j09J0j50K61k8j68L10k7j14j79P3Q3
4488B6j36N03k41m75J67j57M29kl41J89R4J64k57k45J48K21m1l15M73j67K4k07
4510a46K69j00Q4oj86K49j05J74n15N07m12K83L9j1nl8p4J51j83L18m12l5k59
4533d13L53J81j2j79J15J9j61j22M5K77m9P6q4o5R4k6P8l12L30J63j55k33J7J29
4557F6m7k89L63j71N7K23l43J09r6J56j65P4K3p1L59k24m9j91K34q2n3J24J22
4580A29m15K06R5L7m3J57p5q0k82J25L16J4o0J4j91J30J57k47k11K05J2N9j45
4603i3j08n1J27j03K23JJ38nj14r9J67r0L8k4l1K99m20L68k61K46lM9l77L37m79
4628b65K24J73l40K71j04J11n5Q1op2j08J54o0rJ89j00O2q9L3j71J09K2J70l91
$$ y = [132, 72, 64, -95, -345, -146, -332, -233, 133, -95, 365, 64, -45, -35, -185, 76, 48, -120, 190, 163, 49, -130, -57, 26, -110, 393, 152, -323, -156, -313, 116, 114, -227, -38, 56, 220, -37, -282, -134, 87, 46, -269, 204, 37, 61, -146, 123, 23, 107, 101, -85, 164, 59, 233, -282, 225, -187, 96, 135, 124, 119, 81, 7, 158, -25, 293, -119, -154, -413, -60, 121, 109, -70, 45, 64, -97, -219, -174, 103, 54, 130, 46, -19, 75, 49, 127, -185, 145, 308, 153, -80, -63, 66, 19, -270, 93, -78, -21, 202, -141, -32, -128, 28, -137, -63, -40, -111, 248, 24, -25, -216, 18, -64, -117, 7, 129, -286, -80, 15, 52, 9, 166, 91, 11, -271, -146, 170, 184, 124, 138, -53, 77, 234, -13, -224, -19, -7, 52, -93, -201, -252, -125, -228, -5, -4, 134, 129, 15, -84, 83, -7, 31, 7, -24, 275, -145, 223, -38, 208, 205, 254, -123, 214, -265, -41, 132, -208, 63, -41, 70, 15, 96, 90, 18, -90, 64, 4, -5, 184, 84, 146, 57, 90, -81, 28, 50, 220, -171]
4652a71J22J63p4j33J30ro9L0M9N2j90K6K69l31J08L9K01l8j01j50J70J49m28
4675a86l3K33j61P0K75K9l54K34j90Q3m8K57j5j52j69K18k14k7K88Lk58j81J69
4698a29L83r7J71k91l08J12M68k99k60K00QJ66k63K05k2j71L2J49N2k76J04R3
4720B7J2r4j14K23k66L08p1j66Q1M8R3j55Q4J15J06k00j48J96O8l98L22l12L71
4743A30p3m3Q7L3o4k4j8K60l45K05m2k54J71o7j14J28J18K8m08K21k30J38L94
4766B31r7j94R2J79pk39q6M03l37L53l90J23Q3o1J31l48K64lj06j7j7k15K64r2
4790h6j18K12J35j07J49j82M2n8o9J67j73J3K25j81J33j26o6J39k3K0J12k81J01
4813b2J95j8n8N4k28J51R2l32J86Q1l58j3J37J6j05K96j5j62L46J51l06k27K11
$$ y = [-171, -49, 114, 40, -93, 37, 28, -41, -11, 38, 90, -100, -74, 195, -136, -28, 11, 212, 174, 73, -77, 93, 242, -186, -219, 14, -147, -77, 198, 227, -127, 107, -83, 0, -48, 209, 194, 42, -127, 91, -123, -150, 138, 141, -117, -298, -129, 254, 157, 328, 37, -271, -159, 309, 10, -250, -50, -42, 124, -139, 66, 44, -127, -95, 54, 106, -170, -66, 27, 39, -55, -169, 54, -212, 96, 25, -141, -60, -12, 81, -74, 10, 125, 231, 31, -117, 79, 147, -251, 71, -241, 130, 57, 14, 101, 134, 70, 46, 28, 288, -57, 148, 106, -148, 23, -44, -158, -30, 88, 116, -292, -71, -301, -163, 231, 134, -60, 32, 211, 204, -35, -121, 282, -55, 298, -92, 31, 114, 53, 184, -164, 100, 97, -9, -26, -43, -258, 6, -86, -204, 8, 143, 36, 185, 3, 45, -13, -82, 85, -88, -75, 150, -31, 102, -24, -90, 49, 26, 46, 158, -123, -22, 173, 155, 97, 151, -77, 74, 166, -166, 20, 101, -257, -270, -133, -117, -222, 74, 59, -103, 243, 394, 88, -139, 72]
4836G2J76l83J4J50n0o6P7R7n51M47J34k08j51L98j30j71k8K73l27J98j82L83
4858A72k17K5J41N3k74K64j3k51J98l88K16L19l16J5J71j3J35l26J03K03m71J42
4880a12R4p4M8n7R7j25J89p6k26J49RK53%k54j29K40K10m03j53J77K5L2J51Jj7
4905D9L3q5q2J20rj26J27n8K59k58L33l91L01m24K55j31J4K40j32j91K84k05R8
4928B1j30L28q1j03j65J08j84O3K16m92M40j9J1q9m4n0M59m19RK37R6l71J33j04
4952a30L84l11K7k03K50r3k96L65O1j78L75l12K00l3k80K12j3k22J90J30o1O3
4974A25k18pK1Q8K9o2j18K09m78N87j6k94K45k39r8K41l2j36K23j14M9K81Oj53
4998A39k71K95o6j64J64j18nJ8%m3J62j50M0O3J54j38k1Q1j85L04j40o5M6N3l43
$$ y = [72, 248, -135, -121, 29, -21, -87, -10, 87, -464, -17, 117, -91, -242, 156, 26, -145, -173, 100, -227, -29, -211, 172, -45, -20, 121, 174, -100, 164, 151, -100, 98, -290, -74, 245, -71, -56, 115, 102, 237, -89, 14, 217, -254, -112, -18, -92, -44, -101, -4, -129, 60, -16, -242, -93, -84, 169, 169, -85, -214, 26, 236, -167, -320, -143, -118, -86, 65, 66, 49, 82, -3, -85, 35, 26, -100, 27, -31, 228, -30, 303, -88, 213, -211, 44, -87, -73, 167, 35, -156, 128, -77, 21, -109, 219, 138, 35, -130, -22, -206, -143, 73, -419, 21, 2, 13, -76, -120, -170, 289, -130, -121, 116, 212, -159, -26, -130, 254, -57, -30, -233, 17, -76, -372, -7, 54, -124, 251, -61, 139, 106, -174, 38, 25, -197, -7, 123, 62, 125, -93, -100, -79, 9, 38, -24, -142, 67, -411, 176, 160, -134, 111, -128, -226, 15, -17, -153, 70, -44, 5, 286, 292, 139, -132, 163, 97, -67, 97, -21, -26, -8, -8, -51, 111, -39, 1, 64, 218, 80, 59, 140, -45, 259, 119, 54, 100, 153, -190]
5023a90m5L0K75K6j03j82J98K0j84L45j45K8k98K47O9r3L1J72p8MJ21l84J30o0
5047f6O6J24j79J16m8j80O9j01L23j69J09l8j13J53k9n8j27nJ67l46O21j53k23
5070h7K12j90o1o9J31M8L81l40P0j90J57j35J2M34m32J93Q1k08Q0j23j04L44k05
5093aL4L6J38n74M11n0r3J11rJ36Qj07j33K75Lj49j48L28j12l59M79l47M05j60
5117A22k10J38O6J21k73k05K77j81K17R0l84J83Q3l7k72L46n3k7K0q5L9j44k9
5140a98L79k12J38k83J61o2O6q0J97k94K71k4O6k83K14M7l17K47k99L56j09L23
5162C04j42O1j73J59k7k84o4k6K49j32R4j03r2K59j82J28o4k09M3L09j81O1j54
5185a66J84l8rM9n6mJ35K0j01J6m8P0n02O64Q1k81K1L28l52k8q0K90k20J39m8
$$ y = [-190, -235, -205, 70, 96, -7, -189, 9, 29, -155, 190, 45, 73, -225, 22, 91, -2, 29, 201, 123, 127, 248, -136, -6, -66, 0, 124, -55, 61, 13, -167, -98, -199, 124, -45, 64, 26, -87, 66, 37, -21, -148, -153, 14, -332, 289, 136, -87, 125, -65, -126, -195, -64, -16, 365, 25, 95, -95, 62, -73, -61, 373, -59, 134, 215, 7, 87, -36, -140, 204, -1, 33, 69, 207, -367, 44, -6, -99, 12, 3, 139, 147, 40, -93, 182, 185, 36, -112, 216, 104, -255, 224, -123, 282, 122, -88, 50, 116, 237, -36, -241, 36, -145, 72, 162, -222, -39, 44, 7, -265, 81, 28, 1, 21, -64, -25, -169, -198, 181, -31, 107, -176, -15, -77, -11, -91, 106, -188, 83, 59, 125, -158, 56, 103, -214, 33, -266, 90, -19, 304, 162, 223, 50, 209, 182, -102, -166, -192, 57, -75, 19, -84, -176, 83, -99, 29, -35, -244, -201, 108, -73, -12, -166, 18, -20, -29, 20, -36, -40, 95, 115, 14, 30, -18, 52, -450, 214, 295, 14, 35, 363, 11, -17, -97, 193, -27, 112, 64]
5210F4j54p6L37k08r7J35L0k29L32j49j20J73p6M8l47K06J68K1j48J37j89J55
5232A3j87J23K28k17n5j22M49l72O5K60j67J41m7M6l20K78k1l7j67L7J44j91K61
5255A42m5R3k84L7O2l74K99J08K15j87l95L17p1j1L27k20q5J82J1j00k5j94K7
5278a71J20N5R2l5q2J23m8n4J4o8r9J74j16L9L9P3r6N8N1n2k87K42r8K45k1k20
5304a22l3L76k82n8n2J95L1k30K51j27l2N5K13k3k97J65M2j08Kl18R3K23l6k7
5328i9L5Q8k27J6k6J23L15l10K23k89K17j57K66P4m65K06J04O0r8l30L12K1J40
5351A99q6j96K04j63L7Q9q0M8j02P4j20P4r2J14N0p1M0k13J59k28K39Q3j48l9
5375a28K43l25J28J50J87k20j20M06l87N9K14m10J81K13k49J72J12l20o0K45k23
$$ y = [64, -90, -166, 171, -37, -134, 1, 31, -198, 134, -15, -135, 38, -38, 10, -337, -131, 37, 58, -90, 47, -142, 13, -174, -51, 177, -40, -95, -217, 232, -140, -75, 185, 18, 159, 112, 158, -162, 116, 95, 58, -109, -72, 72, -119, 142, 97, 190, -94, -57, 5, -369, -70, 38, 253, 66, -329, -12, -83, -94, 233, 13, -72, 110, 121, 21, -4, -198, -171, -51, 4, 96, 61, -21, 102, 54, 0, 14, -54, -153, 21, -95, -56, -17, 56, -40, 18, 69, 17, -270, -28, -126, 119, 98, -122, -155, 221, -61, -119, -171, 24, 55, -175, 76, -51, -83, -28, 185, 162, -135, 30, 72, -36, -34, -352, -259, -36, -72, -99, -64, 24, -203, -187, -213, -90, 225, -85, 138, -151, 66, -91, 175, 249, -216, -10, 94, 154, 56, -274, 38, 59, 199, 113, -83, 121, -42, -5, 84, 4, 52, -50, 24, -96, -22, -114, 0, 50, -21, 19, -194, -35, -263, -24, 59, -89, -128, 115, -210, -82, 68, 255, 35, -85, 321, -66, -7, 207, -203, -22, 191, -58, 114, 226, -94, -154, 91, -132]
5396a32J54J61N5k49k48M27k39j79J58J64l77P9L51j25o3M54l76J15j36J50k86
5417a42K99P7j87J3Q9r3N9k64J26J44J06m44K68R8j42k42L05l04J27J78k29K24
5439F6j22q7P7%J95m25J36J56r1K54j36r9o8L81m03J38J22K2l35L68j29%k5K11
5463B06J23m38R3K04j80j66p0J90J98k72K79Ql63J76J54q3j85R8j71K71q2j13
5485a23K24J67l40J84J13k10j81J51j8m0Q1L5j77O3K97l95L5J94j76J01J55j12
5507B8j33J45P8n4j16j9j7K65m66Q0J87o7L14l45Q9l0K59M4j46M4m07K91r1K30
5531A63k34q2K85m32J98J2R7j40K42m9k2l21K70J05k25L16j96j26K42j31j51j00
5553b79O01l94LK99J0j23j55j50J52R4j51J94p5k21J24N9oJj37K54j95L49k55
$$ y = [-132, 22, 183, 238, -11, -259, 168, -71, -250, -92, 72, -305, -226, 125, 0, -63, 391, 15, 130, -6, 144, -142, 157, 234, 47, 60, 149, 56, 115, -149, -23, 121, 227, -217, 51, 149, 7, -235, 70, -234, -107, 71, -158, 66, -56, -143, -66, -66, 129, -296, -160, -4, -95, 159, 23, -76, -144, 237, -166, -28, 94, 116, -219, 149, 20, 20, -5, 206, 329, -109, -16, 188, 8, -158, -228, -38, 160, -112, 167, 175, -188, -12, 142, 59, -126, -28, -199, 72, -10, -123, 101, 268, -72, 112, 225, 15, -166, -15, -33, -73, 8, 43, -134, -71, 226, -169, -134, 60, -116, -15, 140, 28, -105, 40, 118, 64, -52, -71, -88, 177, -289, -209, -22, -89, 225, -120, -31, -61, 198, 242, 96, 140, -267, 24, -67, 163, -71, -153, 132, -300, -102, -90, 7, -133, 109, 60, 38, -283, -13, 92, -133, 183, -13, -139, 103, -28, -179, -279, 322, -72, -69, 230, 240, 117, -38, -188, -36, 58, -93, 101, 26, -195, -71, -12, -18, -17, -154, 100, -95, 254, -1]
5576al5R2o0Kj66J88J28k61K38K72l73J53k21k83J77K1M09k7k15P5n8k9r7j43
5600b14L90k50O8J8J3n7J84j63M8j28K63l22L29Q1l80j8k53J62K5J44J54q8j36
5623a30RN0j29J38J05r9j0L16r6n8k27J85j55K47p0j96J16r3L7j54l6K93k5j37
5647a19K26k82J89k51J03K6L8K5J86j22J41Q8q5J12m79L96r7j93P6m4p1J48p0
5670e9J33l8l1O3j5J77j83Q0j28L72l87L9m7Q1j04J2p9J73J21j31k5k58J16QL58
5695B48j77p4J34r1K51k42o3k34J71K83k23J75L1k06j44R1l1m5K66l42J38l0J77
5718F3j35m2J76j73J51m6Q4L5J16k82m8J48j85N7N7j76L56j20%j41K12j49L9r0
5742i3j23K37l9K47k50k14L75q8p8j99K38J45J14k90j84K06J26k45J51j15K75
$$ y = [-1, -36, 56, -4, -2, -168, 20, 148, -113, 125, 397, 24, 177, -44, -327, -150, -129, 280, 253, 38, 113, 55, 26, -71, -214, 176, -74, -6, 12, 25, -32, 152, -11, 37, -91, 172, -150, 179, 260, -120, -138, -391, -229, -204, -60, 94, 6, -130, -121, -71, -200, -62, 43, -56, -66, 250, 154, 96, -131, 54, -101, 146, 76, -120, -4, -97, -60, -214, -250, 43, 18, -119, 107, -175, 14, -237, -134, -108, -70, -45, 141, 19, 160, 248, 163, 275, -204, 192, 95, -98, -22, -66, -137, 11, -59, 74, 36, 5, 68, 53, 230, 47, 127, -1, 371, -16, 23, -24, 57, -47, -35, -114, 59, 180, 49, 24, -234, -118, -110, 248, 71, -3, 131, 40, 291, 49, -14, -248, -77, 206, -17, 158, 189, -17, -161, -70, -101, -146, 120, -222, -84, -114, 63, -72, -114, 62, -111, 40, -6, 78, 113, 229, -53, -101, 47, -138, -81, -24, -200, 156, 36, 36, -105, 107, -42, -3, -93, -216, 21, -18, 229, -21, -235, 140, 52, -26, -225, 13, 158, 272, -18, -202, 4, 130, -115, 36, -79, 196]
5763A96j74Ok15k9J80J97j47J90k36L4Q7k36N6q0K47M2l04K50P5k0J65l34q6K70
5787A34k75L24j24j12n7K18j60J14J3Q5k01K02j16k52L14j9J5r5m0j96L59m31
5809c00J59N1J36K06k62R5j28j46J70j22K18j16J94m79L23m3J1N1O2q8O8J32j8
5832A74rl23j6J02o3P8QK16l03K06lm0r5J98m2l4q3k1J79P4j78k77j1M43j69m9
5858c8p7L11j22k53J99j59J41R4q9J21Nk7j21M5L04l31M6mR3j66j94K82J43k27
5882b4p6k1K40j71j18L7M8J18K3l97J71Q9k9L6j77K74j35o8M24j33Q3m85M64k42
5906f9J99p7K0J6j00J2K7p2J59k46J64N7k33K21Q4k77J89j23m6j03K98j08Q7j02
5930b3lj1j6K4j94L49k22P2j13J35P1j01k3j18M80l29l9Q1J64k40j6J28j84N9
$$ y = [196, 22, 28, -187, -216, -36, 161, 14, 204, -32, 2, 89, -147, -91, -171, 76, 118, -186, 64, 139, 119, 284, -50, -136, 134, -141, 183, 59, -53, -110, 108, -52, 62, 75, 160, -41, 161, 45, -207, 107, 88, 103, 8, -32, -228, 131, -300, -141, -90, 46, 252, -10, 85, -43, -189, -19, -141, 77, -39, 155, -324, -1, -44, -33, 18, 80, -8, 60, 192, 174, 165, -158, -174, -72, -135, -57, -49, 167, -136, 70, 67, 27, -68, 130, 88, 54, -29, -50, 129, 203, 25, -252, -263, 180, 11, -38, -115, 196, 74, -179, 20, -139, 2, 96, 7, 128, 133, 106, -15, 30, 334, 3, 49, 45, 138, -28, -222, 60, 203, -24, -100, -121, 119, -52, -170, -133, -85, 33, 56, -341, -170, -81, -110, -74, -251, 23, -112, -180, 244, 111, 194, -291, 173, -69, 130, 53, 73, 89, -11, 1, 28, -44, 115, -131, 33, 90, -143, 78, 162, -115, 74, -49, -95, -198, 100, -8, 79, -23, -26, -37, -53, -29, -223, 126, -96, -24, -137, -2, 69, -32, -55, -173, 307, -22, -61, 20, 184, -56, -72, 56, -128, -69]
5954f9q2K74K58l60j17J47R5k72J10K0j01J75j85K91k07p8p7L52j28o7RN8p2j1
5978c7J74j79R4L2k47L16J8p0j40j47K01K38l12Mo0L56k22O1j31r0O3K08j78k51
6002b99J61J48lj98J67j14J73k12P1J53j77J56Q4m80L90pM3R2j76L3k04M38k13
6025B6O4l31K34O7j21P9r7k0O4j21M34k40j38j18K93Nj14J53j38J27m54N05j79
6048b0o7R1j1K30k43Q3N2j72N3q5J67q8r8K99p9k0M0Q2k12m8j58N3L54j40m4j9
6074@j93K21m5k28j7L64p3q6J55m7n7j2R5k50K70K09m86J83n0j04K39j58j33J65
6098c8K58l07k1K47m21M31k72L49j22k60L96l02J92l82K14J91j31o0K09O0j58
6119G3j76p4J10K81k00l2L3j55N6q0K65k2mk25K39%k27J65J44k07J34j95J99j40
$$ y = [-69, -151, 123, 381, 21, -96, 51, 146, -126, -16, 4, -97, 78, -107, 184, -23, -101, -178, 174, 46, -21, -12, 46, -26, -37, 137, -42, 52, 84, -163, 153, 171, 101, -39, -186, 15, 253, -59, -55, -115, 241, 19, 80, -51, -141, -78, 130, -48, -299, -138, 10, 7, -191, -24, -138, 35, -177, -106, 47, -130, 26, 110, -370, 20, 13, 56, 148, -28, 5, -199, 239, 26, 90, -241, -7, 60, -61, 18, -79, -99, -35, -156, 278, 38, -100, -218, 75, 80, -34, 119, -19, 108, -346, 159, -20, -87, 4, -7, 223, -20, 63, 115, -57, -4, -89, 78, -10, -108, 191, 112, 92, 132, 214, 2, -46, -204, -151, 203, 63, 19, 0, -193, 28, -17, -245, -262, 102, 29, -57, 98, 51, -6, -18, 77, -173, 97, 306, -180, 3, -47, -151, 88, -70, -203, -38, 220, -87, -108, 139, -282, 149, -123, 226, 104, -156, 240, -62, 130, -252, -38, 153, 22, -38, 171, 231, 73, -103, -177, -67, 214, 14, -18, 15, -140, -84, -164, 101, 79, 75, -150, 89, 89, -138, 27, 171, -36, 98, -97, 102, -38]
6143c8K5k28L36m4kn9J31k16L11r5j78J5P6O3l34K23j10K55k62N6P2R6l05J25
6167h7K39l11J07p2M29j47j51J02k26J24J53l22K26l89K70P3j14J37j62L12O0
6188B51m99M44k05r1L10j89j69M4K06j87N6O6J3j94K65l1k56J65m2j93J29L80
6210B73l87K3N1p5J03J17j94Q1k5k48K17MP9l4J20j67oK55k80m8J44Q2O9j9l07
6235a72K54j65RM84n95R5K73p4j17J61m0q9J3k58J60K10j5j91J09N6m0k17m2J13
6259g8J47Q2l07K6nj88L11M36l85j1n2N7j27k2K77l11J20J97q8k51K48k7k07Q
$$ y = [-38, -13, -241, 95, 51, 49, -10, 121, -95, 216, 121, -57, -42, 34, 97, -237, -14, -124, 131, -131, -75, -3, 93, -212, -87, 152, -159, -52, -124, 305, 158, 7, 109, -117, 7, 160, -162, 64, -325, -55, 18, -96, 41, -121, 191, 251, -248, 196, -9, -100, 210, 21, -148, -104, 102, -85, -29, 37, 50, -144, 121, 90, -166, -1, -43, -236, -107, 273, -114, -91, -40, -115, -12, 105, -89, -8, -33, -281, -64, -60, 19, -15, 105, -62, -68, 187, -93, -141, 3, 85, 154, 135, -172, 82, -83, -74, 410, -185, -90, 183, 109, -8, 153, 113, 24, 37, -221, -61, 149, 134, -57, 52, 108, 68, -149, -191, -78, 69, 151, -156, -130, -135, -323, -12, 424, 39, 28, -24, 33, -94, -116, 161, -150, -30, 167, 79, -172, 76, 49, -158, -150]
$$ [...]
8191b74
##END NTUPLES=NMR FID
##END=
