##TITLE=1H_Pr 4-MeAm
 CDCl3,8 sc, 
 29.03.2021
##JCAMPDX= 6.0         $$ Bruker NMR JCAMP-DX V2.0
##DATA TYPE= NMR FID
##DATA CLASS= NTUPLES
##ORIGIN= UXNMR, Bruker Analytische Messtechnik GmbH
##OWNER= root
$$ XWIN-NMR		Version 3.5
$$ Mon Mar 29 12:17:53 2021 Russian Standard Time (UT+4h)  she@DPX200
##.OBSERVE FREQUENCY= 200.131506
##.OBSERVE NUCLEUS= ^1H
##.DELAY= (6, 6)
##.ACQUISITION MODE= SIMULTANEOUS
##.ACQUISITION SCHEME= undefined
##.AVERAGES= 8
##.DIGITISER RES= 18
##SPECTROMETER/DATA SYSTEM= spect
##.PULSE SEQUENCE= zg30
##.SOLVENT NAME= CDCl3
##.SHIFT REFERENCE= (INTERNAL, CDCl3, 0, 15.7039)
##AUDIT TRAIL= $$ (NUMBER, WHEN, WHO, WHERE, WHAT)
$$ ##TITLE= Audit trail, XWIN-NMR		Version 3.5
$$ ##JCAMPDX= 5.01
$$ ##ORIGIN= Bruker BioSpin GmbH
$$ ##OWNER= she
$$ F:/spectra/data/she/nmr/H-F/1/audita.txt
$$ ##AUDIT TRAIL=  $$ (NUMBER, WHEN, WHO, WHERE, WHAT)
(   1,<2021-03-29 12:16:19.14 +0400>,<she>,<DPX200>,
      <created by zg, POWCHK disabled, PULCHK disabled
       configuration hash MD5:
       00 E9 B6 7A A2 85 ED C7 34 08 36 98 17 FE 4E 26
       data hash MD5: 16K
       4C C0 A9 D4 B1 4E E7 20 D0 63 28 44 7B BC D2 C8>)
$$ ##END=
$$ 
$$ hash MD5
$$ 21 99 87 5E 47 58 37 CA C6 9F 3E D8 9A AC C7 21
##$RELAX= 
##$RELAX= 
##$RELAX= 
##$RELAX= 
##$RELAX= 
##$RELAX= 
$$ Bruker specific parameters
$$ --------------------------
##$DU= <F:/spectra>
##$EXPNO= 1
##$NAME= <H-F>
##$PROCNO= 1
##$TYPE= <nmr>
##$USER= <she>
##$AMP= (0..31)
100 100 100 100 100 100 100 100 100 100 100 100 100 100 100 100 100 100 
100 100 100 100 100 100 100 100 100 100 100 100 100 100 
##$AQSEQ= 0
##$AQ_mod= 1
##$AUNM= <au_zg>
##$AUTOPOS= <>
##$BF1= 200.13
##$BF2= 200.13
##$BF3= 200.13
##$BF4= 200.13
##$BF5= 200.13
##$BF6= 200.13
##$BF7= 200.13
##$BF8= 200.13
##$BYTORDA= 1
##$CFDGTYP= 0
##$CFRGTYP= 5
##$CHEMSTR= <none>
##$CNST= (0..31)
1 1 145 1 1 1 1 1 1 1 1 1 1 1 1 1 1 1 1 1 1 1 1 1 1 1 1 1 1 1 1 1 
##$CPDPRG= <>
##$CPDPRG1= <>
##$CPDPRG2= <>
##$CPDPRG3= <>
##$CPDPRG4= <mlev>
##$CPDPRG5= <mlev>
##$CPDPRG6= <mlev>
##$CPDPRG7= <mlev>
##$CPDPRG8= <mlev>
##$CPDPRGB= <>
##$CPDPRGT= <>
##$D= (0..31)
0 1.2 0 0 0 0 0 0 0 0.06 0 0.03 0 0 0 0 0.0002 0 0 0 0 0 0 0 0 0 0 0 0 
0 0 0 
##$DATE= 1617005778
##$DBL= (0..7)
120 120 120 120 120 120 120 120 
##$DBP= (0..7)
150 150 150 150 150 150 150 150 
##$DBP07= 0
##$DBPNAM0= <>
##$DBPNAM1= <>
##$DBPNAM2= <>
##$DBPNAM3= <>
##$DBPNAM4= <>
##$DBPNAM5= <>
##$DBPNAM6= <>
##$DBPNAM7= <>
##$DBPOAL= (0..7)
0.5 0.5 0.5 0.5 0.5 0.5 0.5 0.5 
##$DBPOFFS= (0..7)
0 0 0 0 0 0 0 0 
##$DE= 6
##$DECBNUC= <off>
##$DECIM= 32
##$DECNUC= <off>
##$DECSTAT= 4
##$DIGMOD= 1
##$DIGTYP= 9
##$DL= (0..7)
0 120 120 120 120 120 120 120 
##$DP= (0..7)
150 150 150 150 150 150 150 150 
##$DP07= 0
##$DPNAME0= <>
##$DPNAME1= <>
##$DPNAME2= <>
##$DPNAME3= <>
##$DPNAME4= <>
##$DPNAME5= <>
##$DPNAME6= <>
##$DPNAME7= <>
##$DPOAL= (0..7)
0.5 0.5 0.5 0.5 0.5 0.5 0.5 0.5 
##$DPOFFS= (0..7)
0 0 0 0 0 0 0 0 
##$DQDMODE= 0
##$DR= 18
##$DS= 0
##$DSLIST= <SSSSSSSSSSSSSSS>
$$ [...]
##$SUBNAM2= <"">
##$SUBNAM3= <"">
##$SUBNAM4= <"">
##$SUBNAM5= <"">
##$SUBNAM6= <"">
##$SUBNAM7= <"">
##$SUBNAM8= <"">
##$SUBNAM9= <"">
##$SW= 16.9725357007746
##$SWIBOX= (0..15)
0 0 2 0 0 0 0 0 0 0 0 0 0 0 0 0 
##$SW_h= 3396.73913043478
##$TD= 16384
##$TD0= 1
##$TE= 0
##$TE2= 300
##$TE3= 300
##$TEG= 300
##$TL= (0..7)
0 120 120 120 120 120 120 120 
##$TP= (0..7)
150 150 150 150 150 150 150 150 
##$TP07= 0
##$TPNAME0= <>
##$TPNAME1= <>
##$TPNAME2= <>
##$TPNAME3= <>
##$TPNAME4= <>
##$TPNAME5= <>
##$TPNAME6= <>
##$TPNAME7= <>
##$TPOAL= (0..7)
0.5 0.5 0.5 0.5 0.5 0.5 0.5 0.5 
##$TPOFFS= (0..7)
0 0 0 0 0 0 0 0 
##$TUNHIN= 0
##$TUNHOUT= 0
##$TUNXOUT= 0
##$USERA1= <user>
##$USERA2= <user>
##$USERA3= <user>
##$USERA4= <user>
##$USERA5= <user>
##$V9= 5
##$VALIST= <valist>
##$VCLIST= <CCCCCCCCCCCCCCC>
##$VD= 0
##$VDLIST= <DDDDDDDDDDDDDDD>
##$VPLIST= <PPPPPPPPPPPPPPP>
##$VTLIST= <TTTTTTTTTTTTTTT>
##$WBST= 1024
##$WBSW= 4
##$XGAIN= (0..3)
0 0 0 0 
##$XL= 0
##$YL= 0
##$YMAX_a= 524620
##$YMIN_a= -361927
##$ZGOPTNS= <>
##$ZL1= 120
##$ZL2= 120
##$ZL3= 120
##$ZL4= 120
##$ABSF1= 10
##$ABSF2= 0
##$ABSG= 5
##$ABSL= 3
##$ALPHA= 0
##$AQORDER= 0
##$ASSFAC= 0
##$ASSFACI= 0
##$ASSFACX= 0
##$ASSWID= 0
##$AUNMP= <proc_1d>
##$AZFE= 0.1
##$AZFW= 0.1
##$BCFW= 1
##$BC_mod= 2
##$BYTORDP= 1
##$COROFFS= 0
##$CY= 11.3945322036743
##$DATMOD= 1
##$DC= 2
##$DFILT= <>
##$DTYPP= 0
##$F1P= 15.9154993809931
##$F2P= -4.1035820241983
##$FCOR= 0.5
##$FTSIZE= 0
##$FT_mod= 4
##$GAMMA= 1
##$GB= 0.15
##$INTBC= 1
##$INTSCL= 1
##$ISEN= 128
##$LB= 0.24
##$LEV0= 0
##$LPBIN= 0
##$MAXI= 10000
##$MC2= 0
##$MEAN= 0
##$ME_mod= 0
##$MI= 1.114404
##$NCOEF= 0
##$NC_proc= 0
##$NLEV= 6
##$NOISF1= 3.799351
##$NOISF2= 2.8
##$NSP= 1
##$NTH_PI= 0
##$NZP= 0
##$OFFSET= 15.70392
##$PC= 1
##$PHC0= -11117.73
##$PHC1= 9.40094
##$PH_mod= 1
##$PKNL= yes
##$PPARMOD= 0
##$PSCAL= 0
##$PSIGN= 0
##$REVERSE= no
##$SF= 200.130013532006
##$SI= 16384
##$SIGF1= 3
##$SIGF2= 2
##$SINO= 400
##$SIOLD= 16384
##$SREGLST= <1H.CDCl3>
##$SSB= 0
##$STSI= 0
##$STSR= 0
##$SW_p= 3612.71676300578
##$SYMM= 0
##$S_DEV= 0
##$TDeff= 0
##$TDoff= 0
##$TI= <>
##$TILT= no
##$TM1= 0
##$TM2= 0
##$TOPLEV= 0
##$USERP1= <user>
##$USERP2= <user>
##$USERP3= <user>
##$USERP4= <user>
##$USERP5= <user>
##$WDW= 1
##$XDIM= 8192
##$YMAX_p= 0
##$YMIN_p= 0
$$ End of Bruker specific parameters
$$ ---------------------------------
##NTUPLES= NMR FID
##VAR_NAME=  TIME,          FID/REAL,        FID/IMAG
##SYMBOL=    X,             R,               I
##VAR_TYPE=  INDEPENDENT,   DEPENDENT,       DEPENDENT
##VAR_FORM=  AFFN,          ASDF,            ASDF
##VAR_DIM=   8192,          8192,            8192
##UNITS=     SECONDS,       ARBITRARY UNITS, ARBITRARY UNITS
##FACTOR=    0.0002944,     1,               1
##FIRST=     0,             0,               0
##LAST=      2.4114304,     0,               0
##MIN=       0,             -361927,         0
##MAX=       2.4114304,     524620,          0
$$ Real data points
##PAGE= N=1
##DATA TABLE= (X++(R..R)), XYDATA
$$ [...]
1738g5K6O55o22k85J82M11j27R7l15j31J05N03L9o52P2L31K14j69j76j15k66O11
1760C13K56r02L12N43k26R0k74k67j2M86j61l09Ml2R9J83K2p22M49L34nj75j25
1783a19l3mK75J66n65j41K99L39j86O9k09j28M71j08k36l28K65J99o3k4l43q6
1805d90L11N54l28l88j19N18k06K86m57k20L96N05k96l91K60j67M97p8k56k46
1825c15K75M33j52j51k61O9K88L98l39n73O3N14J68j97k92R7R0J86J55q80M19
1846eM35k89J84k37m39M00K35P6m72J53r4j18L46L65r50L05J13N5n1J17k68P3
1868f6K39O5m06K35L24l74J42j56q7q2L64j10j92M1K02k38J78o5l11P7L99L4m46
1891b33J47k7J24O7K9O8k62J00m2J32k35r3J91J81J0q4n07N27L26l97j24j37J85
$$ y = [-75, -49, 606, -16, -301, -119, 292, 165, 262, -53, -184, -79, 424, 463, -189, -117, 214, 428, 259, 83, -32, -298, 313, 569, -333, -21, 522, 296, 386, 112, -155, -167, 319, 158, -151, -147, -179, -80, 103, 125, -597, -148, 186, 181, 6, -119, -152, -156, 119, 285, -280, -421, -122, 217, 31, 100, -109, -237, 234, 126, -110, -438, -173, 26, -37, -61, -404, -490, -179, 375, 47, -341, -460, 58, -148, 138, -319, -539, -143, 362, 66, -325, -65, -232, 265, 187, -69, -315, -40, 393, 241, 90, -171, -102, 186, 584, 245, -328, -265, 249, 417, 220, -72, 25, 115, 301, 456, -424, -5, 430, 141, 325, 88, -351, 49, 284, 360, -112, 41, -53, -171, 175, 540, -410, -105, 8, 63, 12, 129, -139, -66, 173, 238, -168, 67, 391, 17, 159, 3, -84, -166, 198, 88, -104, -63, 139, -99, 79, 14, -297, -220, 179, 213, -233, -86, -113, 11, 78, 107, 175, -87, 13, -29, 103, -132, -225, -34, 147, 157, 73, -434, 93, 419, 22, -102, -239, -54]
1914e4K81mk04m08K61M28r8j07n7k56J64K33j23l54J46l9M23K62k59l78M0L31
1936B28l2l80j70Q0N03o5K3m26P1L96j38j42qj45J54J38M1k73l33M66K28Lj94
1959B5o3j29M54j1k90j51K93J22j0l40o6l2L18K41l76k53K22K04N2k64j47j09
1981c10N26p9j30j9j14P2J47J56l71M6J60Q1o2k19l23L51J79L51m68qN1J74J69
2004C60m10p3j69qN47l32pj03J30K7n4n0k4Q1L73k07j89N7OK02j86o4m61J31N34
2029A11j56j66J21j16J39L2j11l04K45O8J37J85m0l91Q1L33j44l49p9L00K49k04
2051e9P1k30K39K43J8l37j47K84J3J62j49k89J98J65K78k42k02J45j16Q6L21n24
2073g2j40M91O3j32k80R1J73J17J14j97j54O1J27pK6l64j65K63K47k88p4j8O1
$$ y = [-54, 227, 223, 19, -389, -128, 300, 202, 95, 38, -218, -54, 179, 56, -298, -152, -191, 232, 494, 235, -143, -103, 228, 196, -184, -354, -274, 229, 164, 187, -239, -168, 228, 90, -52, -60, -205, -51, 87, 128, -145, -478, -12, 216, 219, 25, -38, -167, 287, 276, -14, -165, 128, 250, 240, -100, -166, -198, 120, 361, -15, -268, -46, 158, 210, -54, -201, -310, 216, 137, 7, -12, -126, -54, 93, 249, -122, -76, 84, 165, 103, -116, -439, -88, 91, 442, -26, -34, 17, 191, 360, -50, -123, -292, -300, 247, -85, -92, -195, -65, -38, -92, -142, -166, -85, 288, 81, -108, -51, -45, 157, -29, -93, -554, -423, 111, -45, -211, -90, -206, -67, -35, -146, -450, -205, -137, 0, 185, 145, -246, -165, 168, 24, -325, -404, -104, 145, -59, 12, -218, 21, 264, 282, -55, -202, 82, 95, 257, 108, -181, 17, 182, 460, 218, 16, 161, 45, 131, 452, -72, -212, 279, 342, 210, -70, 21, 194, 311, 425, 228, 74, 135, 262, 255, 281, -83, -248, 15, 262, -26, -100, -118, -57]
2096e7J47J5l15j01J93L94K8m66J00J60r8l0j16Lj54K54J3r9r3KL77k09J61n06
2120c97oK59J45o3k76o4N34J63o1k05l94K92N5J79j76l93M19M29l85P9n97K80
2142a83N49j84o4k86j41L82J19j86j3k79J07J20M9n5j83J36L56k74M0Lk8J27J84
2165B96k48n0J0m5J89j39j50j38L52PJ80o86K66L03M4k14j66K10k5J76j47j00
2187g5j62L26n0M9q9k56J84K37j13j10k3q6K21J75j39j62K44k1J14j57k53J64
2209A8j6K23J47l63Lk58M57R4j21k94m3K55J70k60m1J35j62N28o51K54p8L14k17
2232I4J36o8k21j48L77J72o33J48J28k5j2k04J28j13o4N12m00j34Q1K49l3J42
2254A12n9l46O5L79k61j52K52k05L17j11l75o8M80J59j60k34j1J21K72j1l58O9
$$ y = [-57, 90, 105, -210, -311, -118, 276, 304, -162, -62, 98, 0, -30, -146, -143, -297, -43, -30, -129, -222, -220, 157, -52, 109, -397, -403, -144, 1, -62, -338, -402, 132, 295, 234, 29, -365, -73, -18, 161, -15, -408, 11, 440, 55, 134, -463, -183, 366, 182, 118, -168, -309, 73, 192, 6, -7, -286, -179, -59, -10, -65, -248, -112, 244, -30, 10, 13, -15, 112, 296, 48, -2, 8, -37, 152, 13, -137, -275, 77, 84, 264, -422, -156, 147, 191, -23, -189, 21, -4, 172, 25, -75, -237, 89, 39, 88, -1, -257, -73, 164, 51, -59, -82, -168, 53, 228, 89, -73, 171, 150, 264, 107, -146, 18, 2, 225, 372, 9, 12, -246, 211, 305, 184, -110, -153, 102, 272, 12, -29, 106, -56, 472, -179, 75, -3, 311, 94, 230, 162, -59, -207, 170, 342, -291, -143, -15, -40, -52, -256, -128, -241, -305, 207, -193, -327, -246, 3, -30, 112, 53, -293, -228, 151, -110, -262, -10, -215, 102, -9, -384, -452, 28, 187, 27, -207, -218, -97, 175, 164, -194, -125]
2276a25O7J94j18R6k01K05j56L10k49r8l17M41k5J65k50J16k98M48l0j37J5k7
2298B6J99o6k21j47K16K46Km77K54M1N5M13m49m05J86L64j15Pm5J08j37J85p1
2321A69k99j7O1J0N4j01J03q6L95l37r2K16j00J58q8j42j24r1L24M06n43J35j63
2344a52J28J97m08j13j11M23L8K9n8k63M24j08L61l40l71K80L13l73k16K26K28
2365A34J68K2m30k22K44J75j6k20K02r9L00k62M7J00l38N4J78l0K6j97L12J05
2387B53j4j79k19kP1L10j10l28j15K35K10j40MJ13Q2K5l3l73R2J64P6r1r0j05
2411a64p9N10j59m33L90n3M2k58J34n7j02Q1L83k34O8l2j17P9M5q0K29j45j8K13
2435B43k50LJ18j1O1q0n8J38q9J25q4k34P7J10L08n29Q1K1K17m5j82j1m5L77j3
$$ y = [-125, -58, 136, 18, 114, -87, 118, -38, 272, 23, -75, -392, 49, 24, 189, -61, 55, -243, 205, 175, 38, 53, 26, 225, 159, -62, -209, 7, 253, 255, -222, 32, 73, 128, 541, 92, -313, -127, 237, 122, 129, 84, 192, 55, 240, 169, -130, -147, -86, -76, -22, -123, -20, -106, 289, -48, -140, 76, -24, 134, 46, -96, -220, -311, 13, 419, -124, 11, -152, -24, 173, -235, -348, -459, -36, 2, 31, -27, -290, 134, 26, 387, 47, -324, -44, 269, -104, -320, -94, 134, 302, 324, -106, -328, -84, 91, 75, -145, 57, -42, 258, -4, 43, 143, -195, -141, 37, 7, 33, -164, 148, 253, 239, 60, -159, -161, -90, 220, 110, -218, -333, -98, 112, -28, -24, 89, 171, 196, 163, -210, -118, 46, 122, 31, -59, -164, -243, 267, 108, -325, 65, 12, 54, -204, -70, -127, -229, -148, 235, 1, 69, 37, -80, -1, 44, -36, 193, 48, 30, 243, -7, -4, 114, 103, 164, 84, 26, 164, 75, 200, 116, -118, -41, 69, 377, -152, -71, -50, 167, 122, -60, -71, -116, 261, 248]
2460B48l70J90j88L57P7m03L13m02K59R3k43j0J21r5K35j12o7r6K9J86m0k03j24
2483b45P7L37r4k66R1L29l27M1J41m23N5K46J85p6j78j95K64m3K03j84k53L3L15
2506C3J06l25K17j48J34J02j3j25M8M8j33N7k03K91k50J73K17l17M8K09pk40J29
2529E1k03J71P2M9L4n40J99M29j91m6JK5n3J62Kk62K26j62K58o2O4l49J16J54
2553A45r5k27L16r4K52k79j79J88j65M67l73Q1k35l0J88Q3j71k6K00K16l64l5
2575a37K21k16J58J00k54K75j35j56p9M11%m54K05J50o4k51M07l10J13J9j81K29
2597E1k98N80n6k69N9k5O5N2j90J96k56J25K92k66J4k03L25k85L30j22j62o7L18
2620B08p7j5j98k23K14K28l07J42J14k00Oo6K2J45L6m3O1k74J55k5J24KJ72l32
$$ y = [248, -122, 68, -120, 237, 314, -89, 224, -178, 81, 174, -69, -79, 42, -53, 182, 70, 3, -93, -64, 122, 82, -121, -245, -168, 169, 75, -191, -100, 229, -98, -57, 84, -339, -284, -38, 147, 71, -107, -302, -38, -81, 122, -62, -315, -282, 33, 139, -186, 31, -117, 17, 119, 106, -19, 29, 77, -56, 1, -202, 89, -161, 12, 229, -88, -40, 169, 162, -78, 51, -152, 19, 91, 140, 174, -366, -167, 262, 71, 25, 26, 51, -2, 160, 162, -100, 126, -36, 222, 160, 224, -125, -9, 145, 50, -177, 139, 45, 297, 18, -161, 27, -138, 329, -44, 37, -198, -228, -40, 43, -128, -154, 46, 262, -102, -137, 84, -132, 26, 126, -128, 147, 12, -144, -223, 188, 188, -266, -61, 89, 25, -226, 181, -129, -16, 3, -178, 51, -247, 333, 277, 8, 67, 42, 107, 159, -31, 165, -91, 34, 326, 60, 74, -129, 196, -89, 241, 119, -43, -110, 208, 131, 116, -82, -305, -91, 137, -170, -28, 86, -114, -108, -174, -152, -7, 29, -14, 47, -227, -72, -97, 27, 29, 201, -131]
2644a31J3J41p9R4m73K56J07L24k56m0J22j63L6K14j74l6Q2n3J33J9M1l92K06
2667iL0M2j56R2l6J14j34J0L8n8k18J19M7L51j97J13j12j73Q8J31J4J33n22K36
2691e7O1Q3J95m54K63k74K11L6j25J38k25J53J88k88J06M4L13j64k18k72J50K02
2713F6k75P5j22M6J98K44l30J87r9M5M5p8o3j20J19N5K5k7n4j15R0J88l02ML49
2738A51k82J70j51n9o8J59J46j67O7o8K63j31J89k66N5M1R7k66n5K70p6J33j11
2761D1j09Q2J35m2J9j93P0J24j13J89k19k41L24J6J62n19J72K94j60K40j97p6
2783aO6J85l02J46l98J76J88L6j51o7J4n4J76r6m1Q6j79R1L10j44j09L0J83k71
2807a26J24O4l12J92J24n2J11k53J45J38q3P7k40J57j3k91K30j40K60j05K25m07
$$ y = [-131, -118, 23, -56, 38, -435, -179, -72, 252, -4, -44, 78, -85, -49, 165, -9, -45, 37, -16, 117, 136, 177, -215, -9, 21, 63, -93, -1, -37, 77, -57, -47, -9, -67, -285, -166, -119, 232, 35, 148, 36, -137, -49, 82, 96, 229, -293, -57, 4, 87, 282, -172, 91, -183, 28, 64, -61, 77, -148, 5, 193, -95, 11, 55, 368, 204, -14, -286, -136, 66, -209, -134, -256, -210, -12, 232, -98, 89, -10, 35, 80, 2, -61, -181, -62, -7, 18, -9, -63, -178, -88, 100, -202, -198, 151, -131, 39, -112, -171, -239, -80, 66, -101, -34, -102, 161, 30, 219, -47, 8, 49, 146, -120, -175, 95, 19, 152, 41, -68, 14, 149, 107, 126, -67, 3, 127, 14, 203, -16, -257, 67, 83, 245, -274, -102, 192, 32, 272, 75, -1, 65, 250, -52, 94, -304, -128, 60, 96, -55, -122, -108, -162, 14, -82, -123, -37, -216, -125, 185, 41, -68, -38, 145, -126, -2, 62, -250, -58, 66, 14, 125, -128, 17, 155, 72, 149, -91, 66, 53, -238, -8, -148, 112, 7, 232, -175]
2829a75L42j4rk24K01k50J64J51j65rN7Q3j25J00L3o2j19K62j96n3j1P1m3K90
2853B99l29l6J9J42q8m4P0m4m9M9K38k67j5P0J17N2k96M9N5J42k74K76n74L86
2877e2J88j14K0k13n9K98k24J20L8p8J27p1J55L50n82j1K26j17K23k76j2K28j43
2900B1K0l3J17k77L01M6k3k02L1J28J0o6j82J92j79K70ml02n8K17n5J41l75K15
2924d7l1L1Q8o9L8Q0N2j53p3j4K0L65k31r9k30K72P5k25l9j2j66K54J6j32J63
2949f7N1o4L03j61m75K37n0J8M12m48L24j47j03J5J3K2J21k2Q3j8r0r7L32l6l4
2974A19j85p0J01q8R8J7r5K07o7J63l38J19M4r6n6K13k9j10N2J64p0p0M9p5J60
2999A57L6l78J99m3r1J1J64p6K0j64L54j12ol56K54l3j61L01j90R7K4n7J23J42
$$ y = [-175, 167, 153, 144, -80, 121, -129, 35, 186, 21, 12, 69, 152, 27, 127, 160, 98, -21, 241, 45, -8, -19, 52, 9, 299, -30, -66, -47, 95, 7, -37, 33, -11, -60, -11, 227, -40, -55, 15, 132, 184, -112, -63, -8, 134, -140, 136, -438, -52, 136, 22, 42, -171, -230, 68, -156, -36, 2, -76, 51, -20, 135, 485, -97, -108, 118, 1, 224, -52, -64, 164, 21, 41, 8, 125, -152, 149, 195, 172, -30, 1, 129, 139, 73, -109, 83, -96, 174, 170, -132, -190, 27, -28, 113, -262, -47, -78, -47, 41, -28, 10, 90, 142, -11, -84, -98, -78, 287, 56, -43, -273, -1, 74, -151, -190, -202, -368, -114, -98, -230, -67, -16, -80, 223, 62, -413, -176, -226, -208, 204, -244, 80, -67, -170, -155, -142, -120, 1, -21, 62, 44, -46, -143, 189, 153, 119, -66, -136, -35, -123, -25, -8, -103, 104, 37, 200, -138, -19, 25, -71, -127, 86, 57, -53, -1, 163, 93, 23, 72, -3, 157, 193, -185, 14, -29, -120, -109, 55, -21, -1, -165, 189, 77, 71, -285, -31, -64, -225, 76, -114, -17, 7, -50, 73, 215]
3023B15l78K34k52J52N6O6NQ5j66q7j94L45rm16J77K21o3m9J9N6P9j78J58K68
3047C44k76J2J49j63k22j26O6K93k20J50K04rk57J67k46J30j08L72k97N2o2j82
3069b29J95J32j1j01r8P8k10K76j70J11N7NP5m00L06l2r5J09P1k84J35K03j70
3092d7r3R6r9K61j13J76j81l4r9Q2j74K01N7j97K86k27J46k92K79Q8J17l42K67
3115A58j18r4r8K71n4p9K91j68j58M3J84j19n6Mq5N7K03j67J8p4J09l1L09k67
3139G9j60J73j43nL5j95J8K95Kk25L69j17j04P8J79k91m6K14rL1j71j99p9L32
3163F1k62R2J06j20j51K70M3O1L5j93R5j25M8j03K41j68om0K80j38K39k4l70L7
3187i2k64K21J41o1P1r7QK48n5o5m4LO2k26K48k21J88j64J01N2POM3J50j43j15
$$ y = [215, -163, 71, -181, -29, 27, 93, 98, 183, 17, -70, -264, 81, 72, -344, -167, 54, -9, -58, -39, 17, 96, -82, 76, 344, 68, 80, 229, 66, -156, -282, -216, 77, -143, 7, 211, 202, -55, 112, -134, -4, -112, 260, -37, 15, -47, -229, -34, 98, 87, -14, -112, -34, -244, 32, -138, -27, 30, 35, 110, -290, 16, -16, -111, -2, 69, -215, -80, 123, -47, -140, -44, -143, 118, 5, 181, 0, -34, -133, -51, -225, -24, 33, -164, 122, -105, 41, -251, 28, 116, 233, -109, 158, 40, -54, -152, 119, 65, -14, 277, 109, -49, -6, 178, 59, 3, 7, -78, -21, 182, 15, 33, -41, 68, 37, 346, 79, -81, 92, -51, -56, -21, -216, -198, 97, 99, -126, 243, 126, 22, 100, 279, -12, -58, 156, 147, 178, 7, -192, -271, 61, -201, -109, -3, -123, -274, -4, 39, 100, 135, -58, 37, -88, -40, -143, 98, -70, -76, -116, 164, 26, 265, 241, -129, -92, -356, -135, 6, -55, 16, -81, -73, 175, 120, 55, 11, 14, 76, -150, 98, -123, 65, -99, 2, 54, 61, 67, 110, 260, 117, 2]
3213Bo7LJ16M7l05Q9L51k0r9K9j18j37L12l75M4R2K29j70pJ2O1j73j68L56j85
3238h1K94k06k3p6k3oK41l1J8k10j37J93J1J20Q9n36J72K09q8J8k4r5L55p3j81
3263g0j95K82k71K50L0K0j46J8P4k58K21J91o4l04K30P5Q2j14j05L4j42N4K10
3286A02j29Q5j1L9J43r0P5k27R7j26P0J26j47p1o6J22j04K48k93J43K4O0r1l7
3310e8Q0K78k87J25j2j22j53kL37j50j05J38j44J02m7k3o5Q7J06l65N78n1m04
3333a57K11j04P7j15K55j63n0J5R8k8q0k9K6P6O2j9K8oj29k00J61j14K67j20q3
3358a21K60l05R8J2j22j4J57J19j95J91j4r6J81K9j43NP2K0k41O2j12L16q0j01
3382b2k33L43J6j66K1j74J85p6k76M21Q5k54J50j35q8k61L94l6N9j34pj79K87
$$ y = [2, -65, -62, 54, 101, -204, -115, 236, 216, 117, 146, 28, -109, 203, -172, -128, -36, 193, 23, 16, 28, 89, -84, -252, 104, -81, 213, 7, -16, -92, -115, -121, 120, 89, 107, -103, -240, -47, -36, 84, 173, -363, -191, 18, -70, -52, -76, -171, 184, 111, -70, -265, 17, -254, -4, 26, 46, -100, -82, -8, -266, -45, 146, 82, -222, 8, 83, 165, 51, -54, -20, -162, -108, 102, -27, 58, 47, 86, 229, 139, 214, -13, 84, -42, 28, 154, 7, -64, -130, -8, -112, 136, -157, -14, 10, 70, -21, -58, 22, 300, 13, 138, 126, 4, -149, -151, 186, 36, -69, 69, -75, 27, -20, -43, -108, -21, 85, -280, 298, 247, -157, 54, -50, 27, -88, 167, 4, -46, -31, 67, 39, -41, -70, -44, 32, 94, 75, 103, 97, -32, -232, -71, -185, 82, -38, -121, 139, -166, -68, -56, -178, -192, -35, 84, -111, 80, 66, -30, 151, 180, 37, 42, 114, 134, -107, -45, -157, 159, 79, -22, -255, 88, 104, -62, -41, -215, -30, -106, -382, 39, 124, -130, 20, -115, -203, -464, -70, -106, -47, -181, -188, -367, -80]
3405h0J92j46J59k7m02L80k1J9qk29L2K53j90J13k29L04J74l09j3k02j2R0J36
3428a6j76M67m31L56l39L6k59K93K79j13j97O9j19J59j16Q7J43l06L30j54KJ8
3450A3o3J8M1L9J35j74k00K41P4M4l51K10o5J87j50J06j99L34k68J42n5k6j45
3473a12R4N4n8l7j32J89j25J28n6l8J36k34J87J0oQ5k81K87J84j96j85J00R2r8
3497a2r6M0m3J43m6J12k08J84Nj79L8j18J17M5R0n4j0P6O1l1j90j3R9J36j81k39
3523b74L89k10K85J04k75j14n1q1J64K9k7J46P8J3j45j42n9J79J10m51K0J48P2
3546i2j62K57K00l53J87k41M70m21J51n5Q2K04m77K57j97L48j84J9KK6M0L6Qj00
3570En6j26K72k37J82Q5j91K02M2l11OM7J40p2m9j3J21j09J19k90M98n39J47J51
$$ y = [-80, 112, -34, 125, 98, -304, 76, 55, 74, 66, -163, -131, 122, -68, 45, -184, 120, 294, -15, -28, -230, -242, -152, -16, -192, 275, -156, 200, -139, -103, -362, -69, 210, 97, -100, -31, -150, 9, -107, -20, 123, -183, 147, -7, -5, 13, -50, -32, 9, 48, 183, 9, -191, 50, 124, 168, -183, 27, -38, 149, -1, 105, -94, 240, -28, 114, 59, 33, -112, -18, 36, -22, -59, -191, -2, -127, 1, -55, -93, 43, -191, -4, 6, 0, 85, -196, 91, 275, 79, -106, -6, 86, -12, -108, -68, -111, 32, -14, 98, -110, 74, 79, -100, -62, -180, -63, -18, 72, 18, 8, 84, 145, 114, -76, -89, 10, 146, -35, -274, 115, -95, 190, 294, 19, -95, -146, -227, -63, -34, -61, 85, 163, 176, 31, -111, -170, 9, 119, -332, -312, -164, -92, -254, 3, 203, -150, 37, -204, 266, -155, -4, -59, 23, 227, -250, 7, -190, 158, -26, -7, -5, 21, 61, 97, 105, 5, -51, -177, 95, -142, 40, 125, -66, 136, 178, -133, -127, -80, 60, -12, -61, -74, 47, -62, 57, -233, 265, -274, -127, 24]
3594B4J2J61l33L85j67J63j13k77N9N6N4O8j08K07j45K16j47k66j06L73k10J00
3616Fk95J28K46p3j06k9J69j77L2m5J17J33k46J70q6N7j47K11n5n2K1M8k10P3
3640a10N1RR3k48J93O1J29r4n7J07n8l1n1m4j1L22k57k73L59q1l3L48l41n2L5
3665c4K16o4m1q9M82n53L3K76j37q7j34J10j55m3K78l6k8p5M1J91j13k2M2L4j01
3690ink5J26k5j10J47r0R6p2j92J36P0J5j03j02L15k80L77n16M14k99j15K39N0
3714D2J9q5J21k19MJ44M7J85k27J2M9k71q1K33K33m20%L04J44k53K6J08j97J97
3738A15o9l19K17J80j60j20K03r9j56K36J52j85p0M0M2J14O8p0J2N0k99N6P6O2
3762G6j61J66j16Nk59L07l4r4J49j53P1j23L25l15p8L64J8j30L9J84j09J16m1
$$ y = [24, 36, 197, -136, 249, 82, 245, 132, -145, -86, -30, 24, 92, -16, 191, 46, 262, 115, -151, -257, 116, -94, 6, -289, -161, 85, 12, -94, -123, 46, -131, -99, -144, -27, 106, -140, 30, -56, 1, -146, 65, 10, -42, -21, 27, -183, -110, -59, -50, 43, -205, -12, 49, 178, 84, 27, 134, 76, 45, -6, -50, -61, 261, 4, -269, 90, 9, -24, 324, -17, -69, -34, 182, 118, 77, -12, 470, -83, -50, 226, 89, 2, -132, -22, -177, -220, 58, 22, -6, -81, -40, 151, 38, 16, 58, 92, -9, -14, -39, 87, 62, -48, 99, 9, 105, 33, -159, -23, 47, 62, -41, -143, 172, -108, 269, -247, 167, -132, -247, -8, 42, 61, -24, 97, -122, -118, 26, 73, 258, 31, 43, 92, -179, -260, -27, 206, -214, -214, 90, 234, -19, 7, 115, -82, 115, 46, -273, -56, 124, -36, -156, 47, -52, -208, 28, 180, -5, -75, -35, 7, 121, 189, 119, 131, 181, -118, -62, 14, 76, -85, 81, -35, -30, -289, 18, -16, -110, 39, -114, -43, -166, 159, -156, -234, 130, 148, 18, 57, 241, 132, 248, 207]
3785B07l95K76l24J78P5J30j73P5m5m1j9K08n2K9J8R2j16O2k09m7K36j28m0k37
3809b40K26K47n6j44n5J04j52K6L7J03L2k70N80k15k20M5Mq5K30r3K0j81O3l4
3833b8j5J26j09Kj25pK56j42j24J77p9P4j4L0n1J95O3k36L77m90J49J22r1p4J3
3858aMJ2j23k26K63K90m3k51L69k33j04M6o2J84o7k2n6Q0j48M8J40j9q4p2n3J54
3884B6P5j13J58M9j33j91J60j04R2M8q2P4j21K21kk60Mq5K85j63J6J32j34j27
3908a75N9L68j72j39J75k07K80J05k21M0j16N0O7k45m0J01Q8m4K50m80L20m7r5
3931g8Q1k68K17J28Q0n10K77r1R1K43n7l09K21J76k67K01j52J99k84j8R6N0j18
3954i2K06r5j5J00m9r5m5j6P9j64J08O1j33J19P1j78k5J51K5n6n5P1k7n9J80J08
$$ y = [207, -188, 88, -236, -58, 17, 147, -26, 49, 4, -37, -56, 152, 100, 129, 147, 239, 123, 185, -24, -71, 165, 37, -3, -240, -14, 233, 177, 33, -22, 82, -70, -44, -7, 96, 128, -142, 438, 223, 3, 48, 52, -33, 197, 104, 124, -57, 6, -28, -43, 83, -26, -24, -149, -156, 100, -42, -166, 11, -68, 6, -8, 22, -29, 166, 229, -7, 370, -120, 29, 151, 60, -14, -1, 3, 15, -108, -334, -71, 219, 176, -75, 294, 61, -43, 3, -59, 125, 58, 36, -20, 60, -88, -40, 100, 81, -3, -75, -128, 26, 101, -12, 146, 195, 62, -129, 31, -73, 19, 67, -15, 59, -62, 159, 157, -103, -99, -184, 101, -62, -46, 86, -48, -175, -116, 252, 80, -59, 116, -91, 189, 294, 73, 113, -3, 47, 114, -131, -171, -70, 18, -26, 224, -256, 64, 17, -78, 3, -265, -48, 80, 160, -350, -73, -164, -73, 170, 113, -196, 25, 201, -66, 135, -17, 182, -102, -120, -24, 26, -92, 114, 19, 4, 104, 55, -40, -85, -101, -22, -186, -78, -17, -150, -31, 40, -138, -163, -12, 13, -43, -98, -27, -54, -113, 67, 175]
3980A75j12l90J15o7J91q8O1P8J3k42L64j33J90j37k81J90K00j53L06k16n6oK9
4003C1K7P8j86J76l41K33J1Q9r5lj04R0j3J47j12Oo2N8k97L90j2J16k21j13K26
4028A19j79L25j19k15j7P2k23K68m8j44%OJ57M2J5J15k5J4m40K89J67k38l6P5
4052b0o5q3J28k17R3M82k08J0k83N0r5J38K08l29K52j31Q5K86k53j52J53J12k77
4075a16q7L19k60l7k3O9k1J41l47M38k78mL70l15m1K06q0P6j53K37j64L32j39
4098A23J26j94P7j00j6l00K16J53k38K91N1n57L66P6K3RJ11k34j13K21k73l3L72
4121A57p3O4o1q3n3k19N17k56q5QK59k68K38j03k72L50j95J29j16K32j35J79r7
4144A17k13L60o52L84J0J85L7j23o8o6J88j89p0K7n1K18j15k50J06K73L5j96K81
$$ y = [175, 63, -327, -212, -279, -88, -176, -115, -37, -24, -266, 98, -35, 155, 18, -263, -73, 127, -26, 280, 64, 8, 2, 31, 58, 136, -50, 126, -215, 18, 29, 118, 23, 20, -84, 6, -7, 140, 28, 34, -28, 30, -267, 123, 111, 227, 6, -107, 119, -60, 265, 146, -69, -86, -14, -237, 31, -17, -161, -161, -155, 2, 44, 59, 174, 149, 163, -277, 12, 179, -59, -95, -20, -85, -168, -40, -257, -164, 318, 110, 120, -163, -113, -208, -70, 138, -191, 61, -70, 15, 301, 48, -104, 49, 161, -116, -203, 116, -144, -181, -204, -135, -156, -15, -362, 76, -202, -206, 164, -151, -192, 14, -66, 10, -143, 94, -70, 262, 123, 249, 55, 132, 32, 16, -284, -68, 85, -153, 138, 189, -368, -2, 74, 97, 106, 217, -17, -130, 91, -182, -215, 157, 84, 148, 87, 4, -49, -268, 249, -7, -92, -84, 175, -93, 145, 42, -230, 120, -75, 54, -62, 170, 35, 214, 117, -96, 264, -388, -4, 6, 191, 228, 105, 37, -29, 159, -30, -100, -73, -124, 94, -21, -271, -165, 108, 143, -53, 228]
4167B28j78J39p0k53O4l4J39j31j77K79J11m07K39oj00J34Nj63K42J34l4k58J67
4190G0loP0j37J88j60r5Q6j29q3K25m4j13j80L60L6l02L24k94K08n3K78m30J88
4214DJ72k62J04j89L12n2j42j0K8O6J21k98K8J42j50R3L0P4R3j95O8J31k05Q7
4238E0j1Q1M3k6j31j61O4L09j8k9j07J27j46olk01K32k23J49j25J23qk4n2p7M77
4264C07m40K00j05q2K55j73Q5Q2R0k55n5P3l7J52J11k90K55j06k20J33M4j75J48
4287cR3J14k48r0K93k16R3k6j16q1L93l59K24j82k59M33j8k96K11pp4K72k83K13
4311H1j23l7N7j26r1L62l4k3j35J0n9j58M36j54K4k27K94k07L34o4k88J97J4k09
4335a26K77J61m04J22k45K06J14l90J13K7J09K10l09K34m43L86J84k75J89j18
$$ y = [228, 50, 189, 119, -134, -70, -104, 35, -96, -273, 6, 117, -290, -51, -57, -157, -23, -18, -181, 61, 195, 161, -97, 70, 67, 61, 131, -6, 182, 22, -73, 13, -116, -199, 26, -18, -131, -311, 49, 85, -217, 107, -187, 21, -32, 246, -184, 4, 176, -86, 18, -171, 141, 89, -53, -63, -35, 31, 152, -146, -118, 24, -126, -33, -3, 71, 164, -31, 37, 168, -37, 50, 39, 120, 163, 137, 6, -155, -91, 218, 200, 171, 64, 191, 45, 39, 36, -165, 67, -156, -7, -132, -9, -17, -41, -93, -170, 307, -133, 67, -38, -120, 135, -38, 47, 129, 219, -36, -91, -18, -55, 97, 208, -82, 173, 67, -153, -20, 24, -151, -3, 90, 204, -44, -134, 159, -57, 36, 10, -106, -187, 206, -153, 71, -111, -370, 63, 45, -251, -40, -47, -121, 151, -132, 81, -42, -79, -22, -148, -239, 123, 89, 66, -69, -59, -118, -276, 160, 6, 30, -197, 97, -110, 224, 160, -128, 69, 83, -126, 151, 312, -92, 30, -215, -9, 105, -285, -172, -145, -36, 174, -135, 99, -344, 42, 226, -49, 140, 22]
4355B2j90J64q4K29j01k33J94%jk71K57j91K43N8j1P8k54r6J1J29J75k55K26j41
4379d2J74j37j15J46o3P2k91L48j47O5L4r0j66M48k75j19J91l9J25l56N45n55
4401b47K43k65J82J40J1Q1j31j41l1J44K38l11K19m47M22k46K93k99J53j44J85
4422D9ln9q3J82r8MJo6k51P7M88p8k80j2K78j56j80L06j49L1J25l4j02PoLM4m9
4450a1j35J05J58k44OK11r4LJ91O2k67j87J14M6J89j28J2n5M3N2n8j20J84k36
4474a59O32n29q6lOm5J98oP7j83r8L70o1j22M2Q6k9p7Lj44l8J64k16K95j55N3
4500b5J02nJ3r3K4o7j85J31j43K36j12L10k67K30m11K33j36N6J73J70k40p4J34
4523E4k01K43k02O5K00J78k69N2j16m8l18M37K59m50K40M2j91JP4rk7q9J29q0
$$ y = [22, -168, -4, -88, 141, 40, -193, 1, 1, 0, -271, -14, -205, 38, 96, 85, 163, -91, -187, -176, -47, 128, -127, 99, -42, 132, -5, -120, 26, -37, 35, -256, 92, -55, 10, 44, -46, -212, 236, -39, -158, 33, -6, 119, -237, 308, -247, -4, -269, -87, 53, 64, 145, 14, -127, -158, -14, 224, -87, 132, -315, 107, -139, 154, -145, 8, -136, 49, 46, -13, -96, 86, -12, -8, -7, -73, -324, -247, 241, 163, -117, -129, 149, -7, -187, 119, -30, 1, 126, 92, -10, -3, -9, -6, 38, -11, -146, -41, 117, -127, -121, 90, -4, -1, 190, 252, -15, -202, -88, -42, 147, 19, 31, -24, 19, 71, 13, -107, 77, -159, 473, -56, -142, -145, -139, -184, 14, 8, 85, -98, -196, 174, 113, -9, 33, 119, 90, 13, 16, -128, -166, -2, -218, 77, -78, -25, 77, 72, 85, -8, 16, -51, -236, -105, -248, -12, -124, 186, -81, 149, -262, -29, -165, -109, 64, 234, -6, -80, 54, -147, 96, -106, -41, 159, 337, 68, 120, 4, -44, -362, 75, 334, -116, 124, 166, -25, -24, 50, 41, 14, -75, 54, -26]
4547b6J5l8j1j59J63j5J71n1q2L45l87j33K86k97K14J76j89L5J8j2j70M3K77j1
4571A62J23k70M6J32k60N2m8K91k35k6j92K64j07K01j51j47R6j54Q7J63K71j64
4593A34k14R5j08J21kj10J81n0L10k76k50K81n6n1P6j66J17r0J84l93J87l5k6
4616a41M9j99L78l6l4P5q3o0J98l51mK48J16N9k16o9q1J00N3p5J82JQ9j15m29
4641c45L30m4Q9K18m34J42R4L0k07L06j35q7l2P8p3K79j48K34l25N9J1j0J29k99
4665a40K80Kk0k11nK42l53J51jK2m9k5j03K67J1J77k69J09j07k31L65j67k0K53
4689A78k4p2r5l25l3K45J86j14Q4L0j51R7J12J08l25K46m14L06J18j3l8l42K54
4712A8mj09M4L1Q0j88K46k3k4L1Q3p5j12p6k2J59j2K9J8m3m2n0J44M4l91K42j4
$$ y = [-26, -11, -49, -60, -219, -56, -71, 100, 49, -33, 312, -75, -208, 78, -219, -5, 171, -18, 17, 35, 23, -147, -104, 173, 162, 285, 15, 61, 193, -67, -15, -63, 228, -7, -33, -225, 39, -68, 133, -18, -165, -69, -223, -136, 27, 298, 134, -80, 15, -93, 28, 26, -84, 97, 47, 357, 81, -169, 112, 56, 5, 81, -85, 32, -58, 126, -267, -80, -115, -141, -92, -291, 87, 51, 17, 92, 9, -51, 147, -204, -208, 40, 156, 215, -1, -70, -151, -51, 2, -73, 109, 110, 199, 84, -345, -15, -59, 30, 248, -186, -44, 50, 80, -127, 179, 44, -43, -75, 3, -70, 209, 61, 295, -30, 29, 40, 30, 159, -140, 140, 142, 122, -89, -94, 148, -205, -54, -55, -33, -82, -107, -210, 57, 68, 245, -24, 85, -22, -253, 112, -55, -75, 178, 154, 82, -13, -338, -371, -126, 60, -54, 30, 60, -91, 6, 118, 226, -99, 147, -267, 39, 157, 144, 106, -236, 18, 14, -95, -51, -20, 60, -128, 118, 95, 71, 102, 185, 110, -2, -78, -100, 59, 47, 76, 94, 51, 9, -41, 103, 147, -244, -2, -16]
4739a6L71l73k2R1m8j07J15NJ60j73K22n9Q1l36K76k95n1J43J05n4j47K42k14
4762h4R7l4J23k13m1L06n9j70K24L1k45j27K24O7k2q2l72L66J21m01M07k89K0
4785a53J53j80J24j28K78j47K99j79k10J51jo9J22K9pn6K8j55k01M44j86R4R8
4808A48j86L42l77j2J67l28O47l92K23l34K9J47R5l33J91jj11K59j47k12K0m9
4830b14Q6K65j31P0J1J14l41J52r9J9M6K2K24m38J71J42m8p6J37J06l86J59R4
4853H5k52J18P9j31J14K50l70J93Mn3k52K01K87p7K3l1m2L3j98N1k06J39j00J65
4877C0M0r9R6j56K62M1n4r0k99K46j32K81j33R6L7mk4j76J31J31l61K29m9o5K7
4902EO9O3o3k92J07P0LN7j58Q0n0J24J7R1q4L1j98L21j98p3Q5p2K8K48j09L6l3
$$ y = [-16, 355, -18, -40, 51, 3, -104, 11, 16, 176, 3, 225, 166, 247, -89, 187, -108, -159, -16, 89, 35, -112, 130, -84, 13, -21, 102, -111, -152, 154, 95, -75, 149, 180, -65, -192, 32, 99, 77, -5, -377, -11, 110, -291, 116, -173, -153, 0, -180, -56, -184, 94, -53, 246, 67, -143, 8, 7, -62, 60, 89, 82, 26, 54, -101, -302, 142, -44, 50, 148, -38, 304, -73, -85, 82, -246, 401, 9, 232, -102, -73, 74, 169, -164, 27, 26, -85, 174, 27, -185, -165, -214, -128, 137, 6, 76, 87, 201, -140, 12, -87, -68, -22, 0, 224, -214, -43, 99, 51, -25, 112, 218, -168, -9, 85, -167, -49, 30, -101, 13, 263, -107, 86, 90, 37, -215, -14, 273, 196, 219, 188, 146, 179, -19, 32, -174, -35, -135, 30, 70, -29, 67, -89, 173, 214, 160, 70, -229, 17, -115, 166, 33, 129, 166, 162, 138, -38, 93, 224, -137, 92, 43, -22, 5, 74, 137, 74, -218, -111, -41, -38, 19, -139, -59, -109, 15, 32, 123, 39, 70, -128, 193, -5, -78, 7, -65, -37, 211, 102, 138, 105]
4929A05N1k09J35J77l33J78j91L04k41m0K92k62m7J76O5j79j08K02m62L67J55
4950A35m9m7l99K68J19j34M9k8K59j40k54J55r2L19o3Q2j28j99J94k30M08l80
4972a55K96j89J32k01P3J61J3j11k16J33J41j12J63k31J56n5r7J5Q7k14J96q9
4994a04K9J29j00j63J96j27K05j39J10k50L18k68j39L41R4o4n1MJ09J88l42K4
5016@J07p9l2K3p9K36J21l59J49k27l9K61j01R7j06k28L19k25M17j90j11J10O3
5039A27L4k91K62M8l62J12MR4J99j12q9j95J86J99l77J35K75l59M3k53L83n7n9
5062e3j16J94l7J26N4n2Mj69M2p4pJ28p9o7K20j79J37o0lK34j36j41J7np9L78
5088B77n39M09k23r6K90J07l37L04k13L65l16K79l29j52L36j33q5P4n4K54q3j27
$$ y = [105, 156, -53, 82, 259, -74, 104, -87, 217, -24, -64, 228, -34, -81, 95, 160, -19, -127, 75, -387, -20, 135, 86, 39, -360, -92, 27, -107, -58, -86, 173, 33, -221, -66, -158, 161, 98, 180, 52, -147, 47, -183, 225, -155, 141, -48, 84, -117, -44, 117, 130, 19, -197, -64, 77, -35, 128, -103, 53, -2, -99, -84, 3, -211, -15, -104, -75, 54, -46, -209, -13, -140, 65, -74, 36, -214, 104, -164, -303, 38, 132, 68, 17, 21, 130, 318, -24, 0, 107, 28, -4, 19, -60, 176, 297, -62, 87, -140, -179, 82, -19, 78, -28, -256, 63, -162, 255, 65, -46, 64, 127, 161, -130, 132, 180, -182, -70, -66, 28, 227, 115, 26, -169, 17, 216, -161, -26, 249, -110, -67, -320, 63, 6, -53, -169, 25, -12, 114, 168, 116, 120, -49, -7, -81, -88, 40, -39, -106, 114, -65, 72, 12, 9, 243, 107, -34, -17, -22, -101, 277, -262, 147, -76, -172, 118, 225, -112, 192, -21, 344, 28, 307, -22, -174, 162, 29, -56, 18, -36, 218, 135, 8]
5110HL9POl5K6o2l2M06l44r3K00K2j02K2j21J31j7J5k00q4P7P5j22Q9P8L50j65
5137A74p2J29k20j61o2J85K0j29J41q1o3Q0J52k43K1J16j0J35l16J91k35J42K66
5160A60o7J62l25M7M5N6k87K70Rn7j29K65o1j80J56R4k34K5q7K19j97p8J74J98
5184A78j21j03j42O95m37Q3k7J25m37M23k63j22oj05K81Lj73J2J32P4k12j05J92
5207e5m1P6n2J65j8m41N48Nj94J74m85P31n88N50k76n25O22j76q1M4J94k04J05
5230G8N8r4Ml08J89R7n7l6p6K64l23J90K57j50K06k33q2M5P3k4j46J83O0j20k43
5255a88L37j39L0Q3j07j22K86j28J1K00m13K72R4q9j62P4j03J50l0L00m16m3j86
5278b89L76j5j15l2q9J37m2j16K14k64J49R9k37J96j36J83J7r9n7K92k16J29j02
$$ y = [8, 47, 54, 60, 25, 51, -11, -43, 363, 19, -74, 126, 148, 46, 68, -53, 78, 61, 76, -124, -208, -131, -56, -178, -89, -11, 339, 174, 102, 231, 11, -150, -212, -27, -7, -136, 5, -76, -139, -59, 93, -150, -129, -13, -23, 112, -204, -13, -248, -106, 160, 93, 255, -70, -23, 22, 78, -209, 61, 70, 13, -116, 149, 88, -92, 64, 158, -76, -51, -138, 81, -116, -194, -20, 178, 57, -46, -188, 507, 70, 153, 126, 251, -186, 237, -26, -148, -154, -259, 22, 25, -148, -136, -4, 70, -142, -247, -55, -96, -20, -72, 93, 75, -366, 182, 187, -7, 167, -318, 413, -175, 375, 99, -426, 196, 20, -61, -17, 177, -27, 78, 136, 42, 46, -262, -73, 24, -33, -69, -145, 119, -204, -14, 243, 93, 299, 66, -16, 29, 102, 78, -68, 115, 175, 55, -188, 149, 10, 40, 123, 16, -106, 180, 52, 63, 263, -150, 122, 216, 127, -35, 39, -64, 86, 56, 356, -60, -103, -289, 87, 72, -43, -75, -164, -27, -69, -185, 29, -235, -86, 13, -224, -28, -164, 19, 36, -63, -120, 172, -44, 85, -17]
5301a7J94j10j50K1o1R1M7j35J61j49N0J04O4L1m5q4K29k13j88J86jk6J81k59
5325g9m0J23k1R8J57J42l34m9r6k7M46l19J31m7q4J4Q8k05J49j20J67m6j16l3
5349a01N4J99l90J77N3p8K38l26J90L1M6l23K99O6j41q5O0O5J16M7k90L59m47
5372a81K87q9J51k49K97j39j76J09Q0j72J65l38L75n9L0j03o6j51L98j77k32L37
5394I7l6j35K2pJ17k78J14L03l43J70j0J3J44j52J8k3p1K13j35j63K04j65M7J68
5418A12j09n1P3J5l63J91J35o2RM0k46N18m57Q2J09K11j32j58o1J3J04J36J33
5441B42N1l41j32K49k30J45N3j3J58k08Q6O6j58N5KK12J5l10O9j38P1K59j61J01
5465A43l07L66k2m21M43j68j66P5L9M1L4j63J73j13L42k99j14M04m39K92j02p2
$$ y = [-17, 177, 67, -83, -62, -123, -32, 15, -120, 41, -108, -58, 46, 110, 141, 96, 12, 241, 28, -160, 26, 25, -1, 180, -79, -119, 4, -17, 81, 238, 380, 46, -3, -99, -126, 320, 1, 132, 85, 1, 15, 103, -102, 47, -73, 94, 48, -68, -101, -47, 152, -238, -61, -8, -86, 152, -174, 16, 47, 93, -230, 69, 135, -6, -91, -31, 34, 150, 197, -93, 266, -181, 106, 17, 168, -81, 216, 77, -99, 10, 90, -82, 83, -255, 120, 61, 91, -12, -78, -229, 169, -8, -240, 97, 61, -74, -52, -59, 58, -220, -106, 197, -146, 24, 14, 27, 171, 19, 37, 14, -57, 156, 21, -142, 62, -103, -56, 112, 3, -48, 25, 40, -323, -132, 3, -59, -50, -10, -256, 262, -195, -113, -4, 207, 75, -83, -144, -131, -27, 109, 242, 293, -48, -180, 69, -161, -16, 37, 24, 182, -26, 60, 126, -32, 23, 25, 237, 252, -58, 11, -127, -56, 203, 42, 143, -164, 202, 180, -241, 202, 34, -132, -57, -18, 23, 57, -106, 67, -46, 296, -3, -117, 287, -152, 140, 38, -34]
5487c4l9j4j62J34J43L23k32m8l0m2pk06K09N1J57k9j39n4P6N6j85K89l63J43
5511cL9J25k37K92j63k7j03L7N2n1l4j86K24K3P2m5K92k27K3k28nJ60j00L1p2
5536a11mL1J38j5K91j15m45K90k09Q6k74L28lnj9O2j11L67m53K15m3lK54M9k06
5561I5j5j11k43L11p4R1M6k17L6j64K76J0j07l5j17J7K02J10Q3j90j86K75l06
5584b13L01k5J78l16K24m3k90K80j9J41k66%k23K96k63q0K30J27K43k23j90L89
5606B58l21M1LQ9m2K4P1R8m19K42J3j81L19m05Rn1j40M45o0R4k26J49K5J35j53
5631A7j48J82R0n2r6J19j08M7k68J01K16j22R0O4j76K73l8j68k44K07j42J45J56
5654A45pj35J31l21N8O2J7o6J81j88J95k08m0M53l26k16M95m34K69k18Q2K7J02
$$ y = [-34, -73, -87, -249, -115, 28, 351, 119, 71, 41, -1, -8, -214, -5, 46, 203, 174, 35, -19, 57, 113, -72, 217, -146, -3, 36, 161, -76, 216, 53, 26, -77, -40, 12, -39, -73, -259, -35, -12, 60, 15, 307, 80, 103, -125, -130, 30, -70, -39, -111, -115, -84, 54, 39, 330, 215, -230, 60, -149, -63, -337, -9, -12, -17, -36, 26, -85, 282, -171, 44, 1, -2, 252, 301, 95, 80, -31, -274, 37, -37, 54, 100, -117, -81, -245, 31, 41, -66, -101, -218, -201, 1, 111, 194, 4, -182, 93, -213, 88, 63, 241, -75, 149, 106, -184, 96, 77, 218, -48, -48, -271, 25, -238, -318, -88, 39, 282, 59, -131, 258, -63, -22, -19, 70, 28, 52, 123, 221, -198, 44, 57, -124, 195, -210, -201, -252, -392, 53, -7, 87, -139, 10, 35, 170, 17, -131, 51, 141, 89, -7, 112, 4, 51, -217, -116, 100, -22, 68, 132, -44, 229, 191, 23, -221, -14, -156, -11, 145, 138, 3, 134, -187, -129, -67, -50, -116, 65, -123, 72, -136, -176, 277, -49, -265, 230, -204, 65, -153, -71, -44, 58]
5677E8j55R9k4k42L65j02q7j1J77p5Op8J49q5N5k28J57j51M89l4l68Q5L9K32r9
5702A72j43k71M88k45p3K98j58j71N0r5M1J6K05O1l14L29k31K39k06k87K60L4
5724am4J81j12k0k2Q4j44J15p8J47l51L14j44j51K14r2J80j37k32L59j0m0k7j71
5748a82R9K71l78j00N35j68o8Oj32J71n3J43j39OK10k44N7q2P4J08p5J5j09P7
5772D2P0j19j4L5k59K41J09j33J02j22p9N6N1k1J05p5j01l1J04L01l32K29o4J3
5796A08j32p2L3j69K48j90L04j12J09r7J49j48q3J52k51K83k02N4J64o4k68M75
5818B91k23K2l33K16JK52k72J75j93j14K05j04q0J73k05L03j30K16j65J46j40
5839D1K4J41l26J67M9k33M1n4K45N9k00J48j85RM7J13L80n91J38J91l29M7J79
$$ y = [58, -97, 2, -22, -264, 101, -1, -88, -99, 78, 3, 9, -69, 80, -5, 50, -178, -21, -172, 317, 283, -85, 0, 39, 271, 172, 29, -242, 246, 1, -72, 226, 68, -103, -53, -148, -107, -91, 114, 175, -139, 190, -41, 198, -8, -295, -35, -1, -45, 136, 24, 4, -18, 66, -78, 37, -41, 106, -245, 69, -75, -226, -12, -104, 76, -61, -293, 66, 56, 16, -11, -182, -83, 188, -190, -290, 245, 77, 9, 15, -117, 54, 1, 144, 5, 11, 221, -23, 34, -48, 26, 134, 59, 74, -35, 42, 112, -7, -21, 14, -245, -4, 105, -28, 74, -48, -127, -71, -20, -41, 64, -11, -112, -143, -39, 262, -70, 159, 95, 108, -24, -96, -63, -232, 16, -174, 130, 18, 127, 30, 179, 31, -52, 100, -151, 132, -70, -16, 148, 84, -184, 291, 68, 90, -243, -27, -26, 226, -46, 129, -64, -178, 27, -77, -157, 16, -189, 114, -16, 200, 35, 181, 41, 65, 206, -120, 47, 96, -137, -96, -150, 95, 154, -46, 102, -83, -74, -27, 86, 466, -125, 13, 204, -125, -78, 101]
5862A01K1L1r5J09j56j5N1l3k0j84mK87r8l53K56o6J44m9K98l23l0m3L05k71L16
5887A79j00k2J18j38L3j25J21N4k08n7J76r8o0K96k33p8L25p0n4o7J6j0j59KL79
5912B20k96M6j86Q4J08j19J22P8Jk4km8p0K17K39n28L82l47j29K37j59J12R6j49
5936a15L6k1O3K84l19K49J46m19Kk4K22n8p2N8k89O73m48P3J0o7M3j99Q4j97N20
5961B35l61J64k14R7K17J15k00k97J69J30K0j43K25L9k26M0k10M83j0l45K11o2
5983G7n1o3J12j65J25m2K4j37q1r9K34k83L90J5l2k39K94j02R4l19J46M52o40
6006b90L36J65k88k9L7J07J41l23r9K85K6R7PL8j65n5j17J13q7P6k8K72k32j30
6030a43M8o5J59nj00J97j83Q3k97L08O5j04J65j17j88m7K65l7K39Mp0LO9j7n0
$$ y = [101, 122, 153, 58, 167, 11, -4, 47, 14, -6, -190, -194, 93, -5, -358, -102, -168, -24, -73, 225, -98, -128, -171, 134, -137, 179, 79, 57, 175, 37, 70, -55, 66, 120, -88, -145, 31, -67, -127, 169, -64, -142, 183, 113, 59, -8, 8, -2, -161, -159, 220, -76, -30, -216, -132, -24, -143, -21, 57, 58, 34, 32, -16, -86, 131, 370, -158, 224, -123, -252, -15, -174, -62, 34, -115, -79, -100, -37, 247, -72, 177, 323, -96, -94, -118, 104, 46, -26, 32, -257, 416, -32, 41, 51, -16, 27, -172, -88, -285, 235, -126, 38, -176, -79, 138, 253, 53, -244, -75, 55, 75, -68, 157, 196, -30, 10, -200, 283, 273, -72, 139, 77, 26, -37, 75, -90, 35, -7, 17, -120, -201, -300, -66, -349, 41, 56, 24, -215, 79, -23, 71, -248, -102, 350, -290, 46, 211, -77, -106, -69, 38, 179, -144, -243, 42, 68, 165, 172, 210, 45, -10, -127, -14, -101, -25, -53, 219, -13, -143, -95, -160, -1, -6, -106, 91, -92, -9, -306, 2, 67, -37, 128, 11, -177, -224, 41, 4, 243, 247, 177, 180, 249, 232, 182]
6055A82j06k95L16Q6O1k85K60n14L14j66K79k47L1j60J58p8L0L93l85k0J77j80
6077a49L7K9J47k34Q5L5N8j72J81L9k54K00J12Jj65K21j08j41K86k41J22l%M5
6101A31q8m9J47k47L09l38Q9j14J33J61j41J14j36R7j74J98Q1J39o5k16j84K6
6123a27P0K2k5p5q8K36k64K68j47L9j5Q1j74M65m10J46P1j37p6J68Q6l09K48j6
6147C7J89n1n8k41L79j61p6j01J55j03O3j08J86r7j54M49k08Q8l87L00j18J2J98
6170A93j80k25K52j41J27Q4r2q2L16n53M34n9p8P4o0k23L46l6j39J66k81kJ99
6193D0l76L29j56L51j82j22K11P2k08p6J44j25J32l4j28J54L9N4k78k0K84j29
6215b4j5p8K6Np1K81m4R7k46P4L8q8j00K39q1k6j34L32j89j61L44k35k0J64p2
$$ y = [182, 76, -219, 97, 183, 244, -41, 219, -295, 19, -147, 132, -115, -84, -244, -86, -164, -134, 259, -126, -146, 31, -149, -112, -83, 64, -170, -85, -50, 8, -164, 17, 56, -198, 2, 114, 115, -50, 171, 63, -78, 208, -33, 89, 86, 86, 131, 43, -6, 141, -106, 203, -135, -46, -160, -27, 134, -7, 107, -29, 68, -106, 92, 173, 312, 247, 31, -153, -127, -57, -35, -60, -135, -223, 13, -251, 17, -130, -91, -106, -25, -199, 266, -144, 2, 73, -64, -140, 28, 114, -195, 53, 37, 226, 175, 117, -124, 255, 94, 18, -83, 72, -31, 32, -76, 110, 13, -141, 308, 100, 188, -199, 101, -17, -5, 193, 13, -212, 40, -101, 26, 110, 18, -64, 252, -301, 133, 74, -4, 70, 10, -213, 133, 97, -42, 124, -157, -159, 40, -336, -7, -163, 188, 6, -116, 95, 167, -41, -117, 27, -98, 34, 0, -128, 26, 65, 119, -159, -179, 105, -24, -39, -117, -91, -86, -157, 124, 80, 177, -69, 5, 43, -45, -145, 94, 13, -13, -147, 185, -4, -165, 179, -56, -76, 88, 16]
6240A6K2j54J20K13o3l84K39n4Q4Oj0K37k00j83R2r7J47J37k21j6K1J20k91K28
6264IJ84k68K38P8k92j23L08k06P0L1j54K01J29k92J60p1j0L6l2K0j29J83L6o6
6288D0j39P0J81k34J80k13M21j0k83L0P8j65n7J17j60K6j04K36R7k12K64l6j52
6311b5J0NJ29j21p0k2K48k39j10K33L6Ml86L09j82J63j77J83O3k92L29o6Q4k24
6335a18J74j74N5J2J41O9l7r3O3j02m6j15J88J49Jo6K5k91L05j77k0J24j98K10
6359G9M4k56J97n0n6L2j60J03p9K33r8K10l40O7Q1n4J08j26J66j93J06j69J30
6382b5k18K7L46M1p5K98n36K18p3j18K23j95Q6p7p6L26l8k63p4J75J88k04P9M20
6406D55o51J84J44k47J54k02K58J30k10lP4J4o7j87K1k3l7N80m12J5J13j8j10
$$ y = [16, 38, -116, 4, 217, 154, -230, 9, -45, 39, 45, 35, 272, 72, -111, -19, -116, 31, 168, -53, -69, -48, 72, -219, 9, 193, -75, 163, 241, -51, -174, 134, -72, -2, 29, -125, 76, 205, -87, 73, 2, -8, 28, -4, 16, -113, 70, 106, 40, -99, -29, 152, -82, 98, -115, 306, 296, 13, 43, 121, -44, -101, 16, -144, -118, -222, 14, 111, -101, 163, 127, -25, -15, -10, 119, -2, -72, -94, 154, -85, -195, 38, 74, 78, -308, 1, -181, -18, -195, -12, 51, -241, 88, 22, 106, -118, 56, -118, -63, -51, 90, 159, 122, 29, 92, -10, -56, -171, 17, 166, 167, 101, 126, -165, 140, -37, -57, 67, -131, 79, 123, -133, 64, 14, -42, -10, -170, -67, -146, 87, -11, 199, -141, -74, 7, -47, 61, -65, 101, -92, 14, -155, -25, -243, -216, 130, 171, 96, 394, -142, 76, 3, -115, 108, -87, -1, -78, -154, 172, 134, -129, -203, -28, 160, -44, 35, 455, -196, -12, 132, -115, 39, -163, 95, 225, 15, 12, 86, 100, 33, -154, -133, -156, -193, 387, -25, -10, 103, 85, -25]
6429b5j16m9K28lM1j3p9p8P0K85k80J49j21O4l2J6k67R3J45J70J9j13l55K90j3
6454B6o3l0J92r7M8J54l49K70l50J78j53L13k00K9K9k55N86p0l29J75l5n1l3L33
6478C18l64L6N7r1jO5r2q5K01J51k2j80k31M00m72L65J25j03jk20K59j45K55j85
6502D0J15m9O6k83J32J00p2J46j60L1j01j78K47k6P9k49K26j30K39j42J36j52
6524A5j21k1J27o8J04P5q5q5R4J86j54k29J97N0j9m9K09l23j86J24m1J95J3J81
6548A89j48L0l0j79J86J57p6j99k2K1N8J60m32M15q7k6j18J20q3pL1j5l3J07j01
6573h2K07Pl30P9K27p1j12J30l38K16j7J00l7l47N42k50k9J6J45j79L96l51o0
6596a38JJ74j5j36K01L9p1R0l40K52N4l46L38r1J64j20k4j65L53k05q7L26l12
$$ y = [-25, -141, -190, 38, 35, 76, 63, -16, -94, -24, 261, -19, 130, 9, 73, 41, 57, -210, -117, 28, 198, 217, 104, -251, 39, 26, -37, -67, 125, 28, 76, 230, -119, 151, -199, -21, -174, 139, -61, -32, -3, -258, 328, 258, -71, 104, 69, 18, -15, 318, -46, -10, 47, -44, -45, 20, -72, -157, 44, 195, 173, -7, -238, 162, -310, 55, 180, 77, 76, -144, 115, -30, 225, 40, 155, 106, 172, -111, 21, 121, 49, 195, 35, 66, -35, -213, 34, 8, 87, -162, 64, -66, 173, 31, 167, 15, -106, -127, 0, -68, 36, 111, 26, -59, 35, 221, 67, -162, 35, 85, 66, 17, 226, -97, -283, -159, -200, -5, 8, 189, 41, 71, 41, -138, 48, 205, 129, -70, -92, -71, -13, 147, -285, 130, 43, 17, -101, 19, -64, -71, -40, -55, -88, 19, -82, 125, 132, -198, -119, 108, 37, -75, 55, -283, -67, -84, 16, -21, -368, 174, -76, -105, -89, 56, -123, 273, -78, -138, -137, 37, 22, -114, 87, 126, 55, 145, -195, 57, 111, -235, 103, 12, 176, 56, 32, -133, 220, 15, -72, 254, -58]
6619e8J59j3j47J18J4j1l81K68j16J42J39r2l2J06j38j2P5j30j39L11J36q1j78
6642f0j83L00j39L46l89N4L2N7m7N4O7n7j63K63l71J56K22j84N7j74K23r7R5L5
6666I7O4o2JP1j56J96k27l8J0m3K12Pk46K07j17j73K03k9n8P0J70l14k3M31l31
6691g8J16j53K51k23J95J08k23n7J34J56k55k2L28j88Q4l73J07L04m41J91P2P1
6713A04m9j5j6j05j71N12k01K12l54Nj73k0L49K1k7j73J33lj04R5K9n0n8l6J1
6738h4J69j5k22K52j76k2L99l29K55k7k72O6k33K98l25L85l3l23J21M1q5n6L03
6761H7k38Q4M4K0J14k59K13J20M6m11K17L45l99R6j78J51k83J27o8M19k76R5m2
6784B4J07j58K1J96m09j2K82K56l85K2n9K54L6k13O0k26J15Q7j5K98p3j14J55
$$ y = [-58, 101, 88, -59, 59, 73, 62, -319, -51, -167, -25, 114, 22, -10, 96, -42, -54, 21, -109, -248, 63, 199, 118, -60, -243, 57, -82, 264, -125, -71, -39, 18, -29, 25, 92, 35, -128, 135, -236, -80, 142, -42, 15, -159, 64, -33, 62, 97, 161, 99, 100, 171, 15, 211, -16, -54, -44, -87, 125, 132, -114, 93, -24, -197, 6, -23, -81, -11, 159, -155, -178, 253, -78, 38, -115, 136, -87, 108, 216, -7, -64, 70, 226, -29, -51, 277, 89, 173, -200, -93, 211, -230, -39, 33, 104, 55, 40, 24, -81, -252, 260, 59, 271, -83, -78, -251, -271, 78, 99, 72, -101, 32, 29, -75, 20, 49, -1, -59, -95, -84, 85, 70, -152, 100, -76, -98, 301, -28, 227, 200, -72, -6, -239, 59, -266, 119, 86, -237, -116, -75, -160, -216, 87, -151, -67, -23, -3, 111, -148, 65, 185, 231, -180, 37, 382, -17, 79, -99, 52, -231, -104, -172, 247, -29, 66, 24, 131, -27, -6, 190, -219, -231, 51, 307, -78, -56, -115, 139, 175, -38, 22, -204, -89, -2, -17, 281, 208, 94, 249]
6807B49K3j01j84J20k0J8j73N1j16J73o8l41K36J7Q7K7j29K68q1q0L8N1p6j46
6831a57J18L0J71k12J02k14M29l69j50N50l75J09m0J99J48n75J60J63N1m04J81
6852h5Q9k03KJ18J88j05j48J84q5J02O3j55K65%j68p5J06j74N0L7Lj47L77j03
6876A36l11J32j37J57J02j38J40j43J19j18NQ9j35L23k34J33k67J47R4l8o0L5
6898C1j03j60M15k82J35P7k17J68k2l21K04J14k74J44j2J15J14k65J38J15J95
6919C09q0j75k1j32J74k37k1L37j87J40m1j08j46L49j61L1j12N4l0q5K9M9j3k2
6943i9j14M12n8k88J75O5r4oL9J4N5M16o05m5K55p3m0J22j29n9j4L6J34j7j85
6968a03K0J30J00j27j37o0J4K14p6j00K8J4O8L0n0k04M5K19j02Q5j51Q5k31K32
$$ y = [249, 272, 171, -13, 107, 87, 105, -68, -17, -133, 40, -28, -369, -133, -116, -29, -2, -131, 137, 56, -24, 14, 65, -11, -157, -39, -9, 162, -50, 52, -162, 267, -102, -252, 298, -77, 32, -8, 191, 339, -236, -76, 87, 138, -266, -85, 4, -199, -197, -79, 109, 4, -144, 40, -45, 57, 120, -35, 230, 230, 62, -13, 93, -81, -31, 6, 9, -138, 239, 136, -175, -43, -180, -23, 79, -59, 81, -62, 57, -61, -56, 33, -102, 221, -13, 120, -147, 0, 94, 56, -4, 31, -72, -232, 183, -99, 36, 113, -104, 64, 42, -279, -75, 39, -235, -91, -103, 12, 126, -139, -1, 114, 309, 229, 54, 33, -99, 75, -162, -183, 154, -33, 107, 66, -42, -188, 161, 0, 31, -81, -27, -57, -142, -113, -64, -77, -99, -213, 199, 141, -147, 28, 93, -1, -7, 32, 46, 101, 517, -88, -133, 122, 49, 9, 131, 2, -57, -71, -35, 99, 82, -103, -83, 47, 147, 20, -117, -177, -163, 51, -25, -125, -97, -83, -15, 15, -35, -239, -194, 25, -77, 8, -143, -58, -289, -57]
6992e7j19L15k53L19l05j67J92L69n32K51Q4j74K9n4J19q9J6m7J79j17Ml9n5J40
7016Ij15lJ74K7k72J59K84l10L2l7l32M18j8m7K05l22K99Rp1j19j23j4R5K53j03
7041G8n7j9L2Rk20K56j65l7K03K19j82j16p2Q0K07k14j4mj7J82l12M07j12k04
7065g2J71J04j45o9ko9M6l6o6K77j74M2mJ18J31j42j51qK6J15L6l42J89n8J6o1
7091a28jK19j62j6M6J7K06J6k14L0K96n24K44k1j92K28r7R1j1O9j67J04m4pK12
7116A94m87L51j92k35L09K15k89J95P4l7j00J07n9Lp0K54m8j20M3j33N4j43Lq
7140a19K69J6q0l20J04K97j47m5J43k29K24j71P1J26m06J94o2J04q6L35r3j29
7162dj5p8J29j20J50n0l07L25J43o2k50J73R5m85K08N9j97L46Mk19J05q5J74k13
$$ y = [-57, -176, 139, -114, 205, -100, -267, -75, 294, -238, 13, 97, -77, -48, -102, 17, -72, -56, -103, 76, -41, -37, -76, -131, 9, -106, -109, 65, 92, -180, -21, 263, -47, -15, -52, -384, 34, 16, -31, 174, -148, 151, 160, 89, -30, -153, -167, -72, 181, 78, 21, 2, 34, 43, -177, 79, -86, -123, 80, 299, 117, 1, -71, 9, 216, 2, -12, -16, -33, 149, -163, 244, 132, -72, 99, 203, 58, -11, -13, -82, -36, -72, -138, 139, -35, 7, 3, 121, 252, 110, -41, -49, -23, 92, 128, -214, -25, -83, -67, -128, -129, 90, -72, -88, -42, -25, 181, 197, -17, 13, 309, -215, 29, 8, -184, 44, -53, 38, 27, 96, -71, 33, -11, -18, 194, -293, 58, -134, -369, -60, 155, -134, 61, 135, 98, -2, 105, 46, 49, -21, 233, 185, 65, 108, -25, 29, -114, -111, -119, 150, 166, 86, -234, -130, 167, 20, -25, 118, -111, 113, -58, 13, 139, -267, -73, -135, -31, -117, 218, 125, -4, -19, -97, 32, -88, 62, 12, -295, 30, 173, 111, -139, 34, 129, -356, -148, -89, -286, 60, 64, -155, -50, -135, 39, -174]
7186a74N9J26J42j68J04k53j0L96k25o4J78j30O2j55K34j17ko0K74l23J03l4j30
7209a67l5L78j72K5q6R3j21L1m4K16j38R8j94p9L65j98JJ9k50J23K27j81N1l4
7233g2J79l02L32J65m21L13o7k87J61r8R2J58j43o7k68J37N47m36Q0J8J25k0l6
7256I0n8l18L72j51l6N4n8J46m7l7L35m00j9J12N8Nm4k6j73K03j16J3J24m0J59
7281A48m2m9k04j7j19K44l9J79k02j81L31l7J22j57P9k78J16R9J3J33k55R0n3
7304g9R8q6J18j97J97o8j7m0K2n5J31k2j90P8O4k05K89J11k08Q7Mj99K53q3Pk3
7330a3Q0j52lJ04j95J22N2l1j43j82N44l64L7K43k91J55q4M5K8M4j56K8p4L85
7354A79j63k75L51o9J01j09q6k83L34J12k96K84m51M11J98k14o7r3N14l01R6l27
$$ y = [-174, -115, 11, 153, -15, 89, -164, -174, 222, -3, -67, 111, -19, 43, -112, 122, 5, 3, -57, 217, -106, -3, -37, -167, -202, 176, 4, 29, -57, 36, -85, -54, -98, 118, -20, 78, -116, -195, 170, -28, -27, -8, -258, -135, 92, -89, -38, -72, 107, -195, 137, 302, -119, 194, 127, -160, 1, -97, -5, 153, 10, -57, -325, -188, 359, -77, 3, 21, 146, 126, 90, 32, -286, 86, -65, -101, -47, -105, 41, -6, -43, 292, -108, -127, -15, 43, 48, 4, -22, -195, 8, -108, -95, 29, -11, 148, 106, 57, -147, -164, -283, -39, -78, 101, -101, -282, 49, 12, 134, -23, 56, -222, -106, -7, 6, 139, -116, -26, -79, 19, -67, 51, -146, 51, -17, -34, -74, -52, -107, 24, 2, -188, -110, -46, -251, 38, 149, -59, 28, 32, -167, 86, 3, 10, -13, 67, -85, -88, 16, -179, -57, -5, -36, -179, -361, 183, -181, -144, 99, -192, -37, -121, -76, -48, -4, -160, -132, -206, 179, 16, -259, 92, 23, 124, 15, -71, -354, -20, 92, -204, 80, -371, 40, 238, 24, -43, -136, 378, 77, 173, -154]
7376a54K37j8j12J44k19K82l00k2K6p3m2K60j39J88j27%O5m9k7l1J46j03q1L07
7400A58p7N9J01l32L3J77l65K89j35j33J08j52L58j23o0K08k18J78k6Jj43J02
7422HP7J87n00K21J47k15l26N13k6j21m4j14K21J54q0q7J4n5m7J76k37L44j21
7445H9j64J85m7N4k5j17O7K03j35l9N2lQ1j62pJ34j55Q3l8p4M0J14j25k5J79j42
7471B3j19M3p6j71M37l68J61M6K75l63j09J55j57K03K4R5k28K4L31k49k55K51
7493b7Q1J8j32K25m18N07j42k90R6j44L94k88J99k10R6q5J56j2j34O8J44o0r0
7516d8K55l45L8K85nqk17j63K04L1R7j47LO4n6M3o1K24j56l4j43J8K8O8L7l2L19
7543B99n2m12L4J42k43K90j52J16Pl5j10J1LK50j75J57k65J7P3m7n6j1K41n3L5
$$ y = [-154, 83, 65, -47, 97, -122, 160, -140, -162, -136, -209, -251, 9, -130, 58, -69, -69, -4, -53, -80, -111, 35, -68, -149, 158, 81, 140, 241, -91, -58, 119, -246, 43, -92, -225, -117, -269, 89, -34, -94, 114, -104, 74, 48, 49, -94, 8, 85, 272, -228, -7, 140, -75, -401, 112, 86, -35, -79, -193, 28, 182, 102, 15, 29, -26, -73, 103, -134, 210, 89, -75, 110, 63, 117, 92, -25, 42, 245, 110, 71, 123, 120, 201, 39, 32, 166, 11, 94, 56, -18, 22, 136, 11, -14, 165, 23, -96, -53, -129, -300, 137, -231, -70, -24, 251, -112, -221, -66, -223, -20, 4, 99, -129, -105, 226, -23, -278, -27, 54, 72, -60, 165, -253, 254, 112, -178, -82, -226, 168, -120, 79, -131, -35, -120, 36, 24, -110, -42, 102, 42, -48, 207, -138, -100, 185, 180, 172, -45, -208, -4, 27, 124, -23, -20, 44, -12, 31, -30, 194, 38, 4, -139, -121, -93, -25, 12, -20, 299, 247, -165, -131, 11, -232, 58, -94, 22, 29, -6, -116, -105, -102, 148, -27, 130, -135, -118, -45, -92, -148, -159, 82, 29, 64]
7568F4p6J36j87K40k65o6K34j95p0O4M76l62j72J49j59J6J06J69j60L6K42r0k19
7591h9J18n7R9j9o6p3KK32r8j37K1J67j40J43l20K26j59j0K42k51J47q6j43R0
7615a61Q1K02k83P5R3N1k63M0J80l06K30Q6O0L5r2J33r7k8lq4ql8M5o6J08P0r7
7642c7j30j20J91NQ7J5N9k58Q4J11J06J73l39J48j72Q1K9%K6k7J24j69n5k26K71
7667b3K74j60l26J15J73J29m54K41Nn8M0K02n2k1k2q2J14k7j17j9J43j09J24l12
7691b22M19l56J65nj47K08n0m7J53j42Q6j44J57J58o8k08N5j48O4p3J23Q3j90
7714a29%rK49k44L11l08L19l19J66j68K33J25j95N3l87O32m14LK01j8k7j12q2
7737a20J75j53J39o3m9J01N8m6j99J37M1m6K8n3o1J87M2k23NK8l9J26J40k21o
$$ y = [64, -12, 124, -63, 177, -88, -154, 80, -115, -185, -121, 355, -7, -179, -30, -189, -173, -67, 102, -58, -22, 220, 130, -89, 29, -28, 71, 52, -14, -87, -85, 147, 49, -88, -67, 100, -40, 103, -217, 9, -150, -160, 82, -169, -22, -108, -251, -161, -80, 122, -161, -86, 7, 58, -205, -165, 15, -291, -61, 25, 85, 120, 28, 161, 64, 36, 33, -51, -59, -97, -52, -118, -10, 60, -37, -167, -287, -96, -91, -4, 11, 70, -188, -104, 7, 113, 286, -53, 95, -77, 4, 33, 33, 59, 32, 156, -13, -68, -294, -23, 251, 91, -235, -120, 53, 182, -272, -31, -26, -84, -44, 158, 106, 85, 63, -19, 95, 68, -49, -68, 75, -34, 90, -222, 197, -159, 6, 1, -146, 62, 12, -35, 118, -24, 62, -82, 75, 233, 165, -43, 12, -136, -72, -145, -22, 61, -129, -129, -138, 111, -133, 178, -130, 189, -130, 36, -132, 101, 226, 31, 84, -303, 329, -85, -82, 119, 101, 74, -38, -120, 55, -98, 41, -22, -71, 30, 88, 42, -157, -20, 21, -25, 3, -50, -111, 76, 118, -105, -100, -72, -111, 15, 155, -66, -72]
7762g2l0K08j03o1K64k99J60J90p2l33J66K00L0k40j08Q7j05J76K05Jn17J84r7
7785a66K94j99m1J50p8L8k5j04J02J54k33M30j63l82L54k04m3J03L66l57O6j76
7807a14J04lL21l45J62p9k44K43OR4o0R6j39p7j20P7K56j32n1k4O1N5l3k42K11
7832B3oj08J22j12J07mj53K36j18O7r5j6J64k7k34K65o4m4j15Nq3K16O1j09o2
7857h4J22K54l20j36L56n1j15q2K69k82L37j26k88O9K99l50J64j0j32J99q0J9
7879C2k18K53jo5L21m03l8K09Pp3j90L27r2O5j15KK06m13J28M7J14j01j55L87
7903B34k18o8K8j5Q6K8Kl9j62m1K69M5j48k54L69j01m0j79K55j75m2j35R4K44
7927C7j73K50p9P7j31k42K71j34L20j22J01n0j77j5M7l1j65K26J57l86O0K08l64
$$ y = [-72, -102, 106, 3, -58, 206, -93, 67, 257, 185, -148, 18, 218, 248, 8, -100, -13, -118, 58, 263, 264, -253, -69, -166, 128, -71, -112, 38, -40, -2, -27, -131, -29, 125, -108, 322, 159, -223, 131, -73, -116, -13, 353, -4, 62, -114, -10, -13, 308, -37, 125, 46, -198, 45, 51, 145, 85, 181, 42, -35, -155, -78, 178, 46, -5, -29, 32, 87, 54, -188, 23, 17, -91, 31, -81, 26, 22, -131, 105, -13, 54, -41, -57, 107, 80, -154, 111, 47, 3, -112, -107, -190, 26, 87, -22, -84, 38, 292, -28, -164, 192, 141, 26, -56, 213, -69, 268, 142, -146, -77, 222, -128, 36, 26, -106, 93, 13, 32, -186, 67, 66, 1, 322, -81, -119, 90, 97, 24, -166, 161, 69, 134, 19, 21, 227, -186, -58, -11, 103, 2, -153, 234, 16, -52, -24, -39, 47, 75, 77, 38, -124, -165, 104, 149, 1, -253, 116, 15, -25, -204, 51, -124, -166, -301, -207, 37, -136, 114, 35, 112, -19, -261, 10, -124, 196, 74, 175, 125, -52, -67, -20, -51, -216, 10, 167, -219, -159, 49, -315]
7950c15L12j67j17L12m8j60J74M9j31P9l50M27k25M0J71R9K3q5Q1k77J96J38l46
7973a20N4K14K76m06m0K8j29PJ1j02L13l7J9J19k77J58o0p8j79J47K9J05j22j86
7997b56K99k29jJ65n3J67j28j2j8J47k4Jn3N1k61M35m3k88M5J77j48N1k71L69
8021A22k57M16m81L13k42L08k22lM1Q1N2P2O0j76m0j86L8J37j58L05j60K4q6J05
8045F3J02l56J48Q1j93K65J93j37k94K35L7k8j13j22R1K63k89Q7k70L97j29M2
8067G3k27M77m85P1l2J77J55k64j6qJ2k71J66K97j45j12P9J63J26k03l7p7m1K68
8091A46j6j48q3k6KJ11l17K44K28j3J37n1P8m47M8K33j1l61K53j0%r3K0J70j46
8116e2K02o6k2k11O2K71j50L6k85K33j24K06j16K5j45L4K79m06J25j11J50o5M0
$$ y = [-315, -3, -170, -287, 25, -23, -183, -9, 40, -91, -12, -362, 65, -160, -120, 51, 150, 173, 88, 169, -108, 88, 226, -120, -66, 148, 424, 18, -22, 6, -123, -116, -105, -207, 106, 69, 88, 207, -70, 88, 28, -50, -229, -82, -53, 52, -70, -256, 43, -186, -187, -22, -75, 92, -36, -48, -66, 81, 57, 58, 5, 56, -205, 230, 187, -101, -56, 121, -27, 24, -247, 122, -135, 281, -200, 113, -129, 179, -43, -46, -5, 76, 128, 200, 260, 84, 44, -142, -104, 33, -125, 180, 20, 44, -42, 63, 165, -191, -43, 38, -155, 110, 303, 166, -128, 107, 144, 116, 3, -119, -28, 235, -54, 33, -237, 160, 31, 73, -154, 323, -162, -91, -123, 54, 209, -55, -71, -79, -67, -338, -172, 125, -20, -132, -53, 110, 236, 33, -4, -81, -122, 146, 130, -18, -101, -127, -125, -14, -331, -87, 141, 128, 265, 214, 292, -155, -107, 126, 115, -246, 7, -3, -3, -96, -76, 94, -52, 150, 84, 62, -149, -87, 184, 34, 70, -215, 18, -106, 100, -16, 9, -136, -102, 177, -229, -104, -215, -65, -130, -90]
8139i0L0j33J35p6J4L0J09k4P9n2R9j25k5R6k3j76K13p8J75n9j38Q3kJ14k46N
8165f5J1j25J12N69m35j89J53J3L6j33J13j3J83j51j72R2m%k1k16K55J07j48j28
8189a56J80j31
$$ y = [-90, -60, -193, -58, -134, -120, -90, 19, -5, 74, 22, 121, -4, -29, 67, 44, -132, 81, 3, 178, 119, -19, 64, 62, 176, -70, -65, -54, -179, -67, 502, 67, -122, 31, 44, 80, -53, 60, 47, 230, 79, -93, -1, -5, -5, -26, -242, 13, 120, -28, -156, 24, -107]
8191a07
$$ Imaginary data points
##PAGE= N=2
##DATA TABLE= (X++(I..I)), XYDATA
0@%%%%%%%%qJ6j6J6k4L2l3M1n6P2q8J04j26J51j77K09k49K94l43L99m61N32o12
31c27O95p91R02j020J150j295J453j627J820k029K258k509K782l081L407l765
47a977M155m579N047n559O122o746P438q209R072j0045J1154j2432J3920j5675
61h314J7785k0386K3679k7996L3946m2739N7225q6667K51485m46833M5801O93769
73D90755n56155j35504M31183j31787k48541K28834N5121o0035j82199r2954K40045
84C8763M3503k93931J32048J61542j67442N9446J35129j57277l9651L7526L3290
95a7054J16271j19268j49724K64392N1225k39781R5598O9356j98908O4381J39717
106G6205r8815p2718J7548Q4500P1153j42486n7252J31498n5481m2573J33624
$$ y = [0, 0, 0, 0, 0, 0, 0, 0, 0, -8, 8, -8, 8, -16, 16, -17, 24, -32, 40, -48, 56, -70, 81, -96, 113, -136, 158, -185, 214, -247, 285, -327, 368, -423, 479, -541, 609, -686, 767, -860, 960, -1069, 1189, -1320, 1462, -1619, 1788, -1977, 2178, -2401, 2646, -2913, 3209, -3537, 3901, -4308, 4764, -5281, 5873, -6559, 7361, -8314, 9471, -10915, 12764, -15232, 18714, -24025, 33200, -53467, 198018, -248815, -203014, 490755, -65400, -200904, 230279, 98492, -150049, 78785, 133906, 73871, -108328, -201282, 38763, 82266, -211665, -79617, 81925, -85517, -26071, 109058, -48219, -87870, -50344, -17054, 99217, -20051, -169775, 94617, 145842, -93939, 1659, 71015, -127893, -63512, 76205, -22610, -95328, -77780, 6720, 77873, -64613, -121865, 9633, -45848, -88421, 45203]
117D5203q3709q7290J43520R12l9958L7977j35427K4735K01343j63404r3597K13562
129F3867j15386r4644K62938j01443k31900K22265N5195j73445J22421K6368j55487
140a19251J27911J12183j40211k4702P2872p352j516J2777L026l7914l7978J10242
152G0087M7748j87469q7J70651j02274o7232J49851q1588j20531J75039M3820
163I8015j56100J5944O8784k3568J1808J6359l3649j5959L0875N0989j7812o9372
175b3686K0562L7443j5709K5701j6966p2772O1590O2344p4941M159K5481o8769
187c5563N7371P8401j12925k5322R8332l9246j2363O5942p6384m8975J03800R001
199F2069p4190O405R494q919K5335O516l8148l1395K4450N0055k0427n0446J9591
$$ y = [45203, -38506, -125796, 17724, 18636, -21322, 16655, -118772, -94037, 107306, -56098, -149695, 63867, -51519, -146163, 116775, 15332, -216568, 5697, 60892, -112553, 9868, 36236, -119251, 8660, 120843, -19368, -44070, 28802, 21450, 19934, 32711, 35737, -2177, -40155, 70087, 117835, -69634, -69721, 100930, -1344, -68576, 81275, -313, -120844, 54195, 98015, -58085, -42141, 26643, 3075, 14883, 31242, -2407, -18366, 12509, 63498, 45686, -23686, -3124, 34319, 18610, 44311, 27345, -45427, 16163, 78507, 3566, 7725, 33206, -35563, 21808, 100209, -12716, -38038, 60294, 21048, 8685, 74627, -1757, -50732, 53068, 62069, -12121, -5716, 3778, -5141, 20194, 26710, -11438, -42833, -18383, 31672, 11245, -39201, -19610]
212a9610J0896m903M6461k5373p3619O0868M9241o5034K1138K6559q4006L8330
224a9052J02320q7132p3463Q9928J3534o0473L4511J9297p2073K356R0374j3653
236B6474r2308K0143O9659l4658j8657M6793m2319l9820Q7073J6423q5088J5825
248c0460L5112k9931L2881J6831p4188P744O9819k3960k7180K1761k0465r126
260c1162N1897O440n8439m706N0772Q816k6964N580P77k3544L4209L7403n3111
273b032k9459N2278M144k0326K4698k7360l4540O0825K1438o1194M882K6048k5224
286e822K2385L0149n2734k5608N8197J5802l9793q88J2417j7113J2224L6582l3510
299A2288m6851M0746L4847l8294o753J8087l3159J0123N4033l7803m9405M4598
$$ y = [-19610, -8714, -13617, 32844, 7471, -66148, -5280, 43961, -21073, 65, 26624, -57382, -19052, 83268, -3864, -77327, 12601, 26135, -34338, 173, 19470, -52603, -50247, 40127, 26474, -65834, -45691, 23968, -10690, -29347, 17446, -24873, -64693, 22380, 38803, -46285, -30460, 4652, -25279, 7602, 24433, -49755, -42011, 27808, 3848, -23332, -1571, -22036, -31162, 20735, 27175, -31264, -35970, 14802, 23618, -3346, 2234, 3011, -20533, 13676, 51079, -2032, -31491, 20787, 24931, 4605, 29303, 1943, -32597, 28228, 49666, -11528, -6646, 19402, -5822, 16563, 46712, -6022, -31630, 26567, 42369, 2576, 1688, 14105, -3008, 9216, 45798, 12288, -34563, 6183, 41030, 2736, -4017, 14070, -19089, -8966, 45067, 7264, -42141, 2457]
311B457J7655l0129K1138j260m6139K7355N0292l7254l4588L0050O859j4187K1156
324A3405j092m6152J1308N2386j8968m0382J8276Q435j6895K7462N165n3488P484
337c3056N1785j8827k5915K1062j5506j2005M7752k108n6268J3053M1113j7741
349f661r775J7630k1820j4183M3998J1898m8334l353L4825k948o765J3428j9519
362a1579j5493L9016J3127l4274j982J5300p971J6317J5200m0630j1005M6143
374B2169J042l1333J1568K091k2274K4956K5955m1490k4294M1825J1948k7110
386d947N511M912k2764J7563L4019l1076k7983L2158J1908j8055J4548j415l4593
399b0214K5149M0164l5090k5696L2279L10j4689K5941o666l8440J9960L5795k2846
$$ y = [2457, 20112, -10017, 11121, 9861, -36278, -8923, 41369, 4115, -30473, -423, 6436, -7751, 13405, 12313, -33839, -22531, 29855, 10887, -29495, -11219, -2784, -19679, 7783, 12948, -40540, -33056, 18729, -98, -26013, -4951, -20457, -32462, 15290, 13182, -43086, -30033, 11080, -6661, -16436, 1194, -20626, -34809, 9189, 21087, -27247, -30600, 4225, 1277, -5488, 7940, -11579, -27072, 11944, 25071, -9203, -11185, 4115, -3856, 12461, 27661, -12969, -23974, 22169, 23211, -8122, 3446, 5537, -16737, 8219, 34174, -7316, -31610, 10215, 22163, -4947, 564, 5476, -17288, 275, 34294, 3218, -24765, 7393, 19301, 1246, 15794, 14379, -20214, 4935, 45099, 10009, -15687, 16592, 16902, 2213, 28154, 21488, -16952, 3008, 38803, 15957]
412A5957j8763J2352n489L006K3047j8469k9916K3467J6471j9813M623M093k9445
425a8879R692M3084k3804m2723K7226K5144k5566j211J9954k3896j3463L8255
437A3813J1573m1151r025L3507M595j6294L052j101j0729J4462J3306j6629r543
450a0164L105J934J6662J635l8398J138M3240j6262l0245K9765k509m0152L6956
463c295L3014o0256j5929N7362o996l4363K4492Q7k8924K6378K2382l3004q714
476b7766K1975l128L359J0462k2821q114L0966N898k2337Q55Q403l973O820J0885
490A1484j1960j6878J2389K2011p016k0598L546J1762j955L566Q4j6886K251K0072
504A1872m992q148K965j2694N355L1592j7466l5266L0046K0133l1978Q915K5379
$$ y = [15957, -2806, 9546, 4057, 7063, 30110, 11641, -18275, 5192, 21663, 1850, 6473, 10566, -18879, -9187, 33897, 10093, -32630, -5404, 19740, -5826, -7037, 12917, -10979, -24442, 13813, 25386, -15765, -24790, 8717, 13312, -2982, 70, -1031, -11760, 2702, 16008, -621, -10164, -7059, -5125, 11537, 13172, -25226, -24088, 19152, 2890, -27355, 2410, -99, -40251, -3295, 29719, -30537, -46466, 10896, 3900, -30463, -5971, -5884, -34808, -8430, 13952, -19052, -27766, -5791, -8919, -5560, 4902, -17919, -26033, 4933, 10831, -11506, -10651, -2248, -6221, 599, 11484, -476, -17354, -4965, 17046, 10030, -10568, -7022, 4740, 2785, 6351, 6435, -10451, -8200, 11872, 6880, -1268, 1697, -10997, -5642, 25950, 8484, -26782, 3264, 23397, -8581, 334, 25713]
517B5713l5720q888N2832p878m5872J9869K4691j8882K685J0570k0049J559K0406
530B1036o811n473J693j5758J0969K8628k6277k7196L1591R893k8355J1212J4649
543A9801l0316k895L5970l609l6035L059K8221m351j9325R014O881k0264P832
556f017K7548k0770k6276K5528J4401j9622L682L679j6112J2524J7988j9740q161
569a1348J3097n170K823J3533j8368j4968K4901P720k0477L013N951j3365R104
582c554J7879k1015j5848K2752N126j4446P699n26j7847J5184J9521k2265j2471
595a9811J9562P49p187J0473n622j4972J3122J4358j0148r502K865M378M614K052
609D931o329p737M935J2074l594q292K130j205j172J5723l733k4885J0996K1925
$$ y = [25713, -10007, -18895, 33937, 26059, -19813, 56, 24747, 5865, 8550, 19120, -929, 630, 21036, 14225, 8752, 10445, -5313, 5656, 34284, 8007, -19189, 12402, 22295, -6060, 5152, 19801, -10515, -13410, 22560, 18951, -17084, -14025, 14196, 9845, -9480, -466, 6415, -13849, -6017, 21531, 761, -25515, 13, 14414, -5208, -1526, 2153, -13959, -1435, 16553, -3187, -11348, 1749, -3421, -598, 12935, -5433, -20401, 4500, 12220, -8257, -5244, 707, -12658, -3554, 14325, -6690, -22538, 214, 5340, -9106, -1407, -1933, -19780, -4596, 14925, -7340, -19811, -249, 500, -6687, 3786, -1836, -16808, -3686, 10672, 524, -8978, -6113, -1735, 2879, 4931, -1398, -9135, -4200, 7874, 4280, -4012, -1882, -3087, -4259, 11464, 7731, -17154, -6158, 15767]
623A5767j6423p571J7007j2913j0360K8026M21l0642P828K1042j0230n565Q928
636E315q439o360J7113M768j7844k255J2276q25j015M452j0137o130J8725L010
650A2654j7029K378P341p812O973R700j8187o213J8881J638j1598K518l22m591
664c669R231N060j2199n773R630M038l896l08l385n431R266R549j3990p923J2484
679B684L71n664Q504m644j5154J3864J3483j6526o017J0922l775j420J0956q027
693d43j2682J0957J0023q896m323L404l046K364R437n658j3672Q315J0553p827
707a494k230N161q294o27J7200n850j7307R927R663r008J835N472j2277P1J7051
722I293l898j3715M279O372k889K758J845r463r60J2766P82j0594J007L665k298
$$ y = [15767, -656, -8227, 8780, -4133, -14493, 13533, 13954, -16688, -8860, 12182, 1952, -3613, 5315, -3124, -9484, 7629, 12397, -5447, -7702, 4574, 3749, 2734, 7186, -2951, -9081, 9644, 12654, -4375, -1997, 5344, -2468, 4505, 14205, -3982, -10195, 8686, 10324, -1274, 1244, 922, -3669, 5562, 10622, -1577, -7350, 2280, 6318, 2422, 2114, -1271, -6702, 2564, 12113, -1877, -9800, 2684, 3055, -2609, 5895, 1251, -13903, -39, 13444, -3082, -9099, 1823, -1952, -3372, 7584, -443, -13125, -2168, 7855, -1041, -5364, -1960, -5006, -2642, 6795, 1137, -12535, -4220, 6333, -1494, -3724, 1437, -6857, -7484, 9716, 3866, -13441, -3514, 6149, -2859, -1024, 4448, -7829, -7758, 9293, 5395, -8320, -4041, 2331, -558, 2200, 4045, -5418, -6378, 6388, 7170, -3424, -2417, 1248, -1050]
737a050N715L321j2449j782J3992j137p367L716j796m796J0876L571j4428p96
751d410J1041j396l281L410n203m247J0438L799j0913l399P629p47p37M080o808
766g44o443J0703N750j1119k163N666l242J260P768q461r468J2290N583r788m87
781b895L519n508L455R232q632q840R027N515o314O48Q64o780L884R910o394r940
797i249P023M549m541K371O02q762K919J1235n048r169M876K369k423M714r75
812D91r636L974R764m543n440L667j427j259Q580j303j1502L047J0175l596m316
827c324L809k883k293Q714J356j0648P0Q365r91k392J659l797k170Q512J828r280
843c465q1N272j852J379L153p566l060J0327J750r227J300M137m252L480N153
$$ y = [-1050, 4665, 7986, -4463, -6245, 7747, 6610, -757, 2959, 1163, -3633, 7243, 10814, -3614, -4410, 6631, 5235, 1954, 5364, 161, -4086, 6352, 10151, -762, -4161, 3468, 2721, 1984, 6064, -744, -7187, 3516, 9266, -1853, -4016, 1650, -1592, -332, 7436, -1025, -10493, 1797, 7380, -2408, -2895, 624, -4884, -1429, 7803, -829, -9669, -642, 4873, -1441, -793, 71, -6709, -2825, 7085, 691, -9249, -2226, 2323, -2218, 153, 755, -8007, -5088, 6147, 1099, -8070, -3194, -825, -3248, 1466, 491, -9145, -5171, 4593, 50, -5390, -1723, -3150, -4409, 4171, 2868, -8634, -5587, 4588, 992, -3324, 485, -2398, -4691, 4023, 5379, -5269, -5199, 3166, 2175, -217, 1442, -2355, -4525, 3987, 5815, -3465, -3546, 1726, -126, 1253, 4406, -3160, -6220, 4107, 5857, -3370, -2070, 2067, -2185, 1295, 6448]
858F448q256m596J0123K143o529R23J195l896N295N253q785l932Q587M33l875
873E31L206j838n900P022O393q854m203O845L39k592L260j913n591M021N914l792
889B848m747J418K359Q20P94k144l945K158N436k325l957K045j311q88P052j890
905C723j0458M979Q681o934k848O368n027l409J0652q60j1450L195O938l737o44
920h31K020n104K60O683j659n350J894K27n92M393j265p191K014P548l365l680
936c998K746j270j604N224Q20p102n34O016O57k929l92m59J92K422J956l548l477
953e280L996L470l198k08N29l189K772O440o436n056P608N27m443M734o61p961
969f356O301O575p835j847N120k832P00N467n997l883O899J245m198K024l32m318
$$ y = [6448, -1808, -6404, 3719, 5862, -667, 256, 1451, -2445, 2850, 8103, -682, -4614, 3973, 4406, 531, 3737, 1899, -4001, 3021, 9414, 560, -3643, 3202, 3541, 949, 4209, 2296, -3295, 726, 6640, 2848, -1899, -481, 1878, 2698, 3492, 1348, -2597, -439, 4997, 2672, -1285, 760, -551, -1439, 5613, 3723, -6735, -1756, 6925, -9, -2857, 3511, -1516, -4925, 5727, 4867, -6583, -3388, 3550, -187, -831, 1189, -3915, -3655, 3028, 1369, -3981, -2087, -1860, -2452, 1941, 676, -6515, -4501, 3047, -318, -3998, -1252, -2522, -4126, 1098, 1918, -5184, -5718, 298, 955, -1974, -2366, -2825, -2633, -211, 1745, -1803, -5280, -1284, 2186, -1012, -1220, -691, -3880, -1108, 5332, -1104, -6160, 1448, 1975, -2468, 2266, 1605, -6356, -55, 6520, -1315, -3162, 1958, -874, -174, 5293, -704, -4587, 2312, 3557, -641, 1383, 1051, -3267]
985c267M547M351n420m272N502K008l582J284L47l176J065N322k138n337J843
1000i23L470j015n26l82k250R09L321J2l375r57K291N61Q71p26l400P1N188n69
1018B571m780K107J035l105M158K185p724j62P855k475m063L630j545l052N997
1033B632J285p428J309M249j832qJ244l430o10N088K93m574J39K241m14K84J364
1050A832k570k321M300J927l753j094K051j157J222K532l831k561M146J733k909
1065d53j10J42j506K166K826l564k947L330K113k324O8L76k441J325M197k520
1081F78m264K941J898k044J520ml861K186M243l244k304K325n37RK687j762l727
1098c260K594L144k004j385P73o92J36K856o10l998Q16L644q32j906J277j241
$$ y = [-3267, 1280, 5631, 211, -4061, 1441, 3449, -133, 1151, 1498, -1678, -613, 4709, 2571, -2766, -923, 2547, 1532, 1006, 624, -1626, -717, 2604, 2616, -759, -1716, 575, 1136, 2007, 1281, -2119, -2048, 3140, 2571, -2209, -102, 933, -2172, 1986, 4171, -3553, -3715, 4140, 1665, -2398, 1232, -313, -3365, 2632, 3917, -3511, -2202, 2047, 215, 207, 1451, -1979, -2589, 2499, 2792, -1782, -1643, 598, 184, 468, 1832, -738, -3059, 1241, 3168, -585, -1679, 372, -785, 437, 2969, -862, -3423, 723, 2456, -453, -563, -421, -1927, 239, 3065, -499, -3446, -116, 1997, -327, -259, 117, -2324, -999, 3198, 678, -3586, -645, 1253, -791, 729, 725, -3136, -950, 3293, 49, -2255, 70, -467, -458, 2229, 467, -3260, -666, 2478, 474, -911, -138, -830, -694, 2162, 1552, -2446, -1630, 2014, 1182, -724, 553, -688]
1114f88r44L930K43m850O29L343j048l76R49k378o25M141k10l471M23J487o39
1131h4Q58R79l118j007L723Q14l032j69J235p88J171J478l312j464L637P03k496
1148h72N58L09j926K468J933l973r39K776K68j058O24j121j493K553J856k369
1164d06j860J376J145p51R21n03k989K114L073k281j812J832m47n09K663j428
1180A38l295K884K332k048l28M36j527J181K470j464k585J449J613o38l71J1j031
1197g73L70K780q79k741O55K189q95m9P41k185j86L390l20l149R36Q26n94J628
1215A744m6k846R8K723K8k185N36J20j86J456K58k428p08K819J48j700L27j42
1233A6j164K110J554l339p70K796o77o65R94j368j092K288J120k539n45J382l44
$$ y = [-688, -1632, 2298, 2541, -2309, -1680, 1663, 615, 239, 1188, -1190, -1815, 2326, 2116, -1355, -932, 555, -84, 774, 1753, -1365, -2372, 1351, 2165, -867, -1036, 199, -589, 582, 2060, -1252, -2716, 921, 1624, -872, -314, -5, -1931, 537, 2470, -1503, -2442, 334, 602, -456, 168, -953, -2446, 107, 1963, -406, -2266, -890, 255, -496, 425, -78, -3067, -953, 2120, -161, -1973, -141, -588, -1097, 1566, 138, -3157, -273, 2059, 11, -317, 119, -1408, -227, 2243, 779, -1806, -357, 1256, 618, 247, 258, -773, -403, 2377, 1498, -1243, -588, 1601, 706, 657, 1398, -787, -973, 2417, 2097, -1052, -116, 710, 116, 1744, 1698, -1148, -1050, 1673, 1701, -484, 52, 172, -14, 1442, 1700, -728, -1436, 1383, 1531, -169, 158, 16, -1148, 962, 2516, -823, -1593, 1203, 526, -139, 855, -513, -1605, 683, 1803, -736, -1281, 101, -243]
1250b43L70P24j935p57J839J507j511j277Q40R5Q6J147j115k242K054J699j535
1267b54n79P60j098P39K096j532k331J868J294r87K23k64j318P94J861r50j513
1284a191K78J309m29J15n6j703M61K438q67j830Q41N09m32J091kk486L51K697
1302A094o33j444L72l11K23J482J88k386R8J989j11p35P2p02L3J719L90k108m01
1321a171J690k48K0N09j392o37J917O86j855k43N78J48K75O16j502o17J591R00
1339A265j239l35J89k75R48N22r71j421J530J204j318l0J98o90J073J539j351
1356H38j895J538J167j132J03N3j252O34J872j139j517P28O16m60Q32o47j562
1373a223J205J508j074j043O69m94J04J556q11j702O99J669o54o67l2n08L20J110
$$ y = [-243, 127, 851, -1084, -1841, -2, 1505, -6, -1283, -443, -348, -262, 885, -230, -2472, -418, 1281, -254, -833, -73, -1171, -432, 1664, 132, -2199, -331, 963, -24, 199, -65, -1383, -589, 1272, 322, -1191, -913, 396, -33, 82, 26, -1677, -1216, 1222, 355, -1475, -634, -125, -557, 534, 532, -1954, -1603, 1094, 461, -983, -611, -922, -699, 783, 971, -1415, -1317, 672, 561, -174, -102, -804, -771, 948, 1338, -770, -1171, 519, 271, 291, 800, -592, -1229, 688, 1374, -481, -724, -146, 2, 277, 893, -609, -1226, 365, 1265, 26, -309, -120, -395, 553, 1075, 104, -1317, 213, 1417, 99, 69, 267, -423, 650, 2189, 838, -1057, 481, 1648, 516, 619, 672, -580, 54, 1926, 787, -730, -2, 614, 154, 986, 339, -1223, -18, 1490, 416, -627, 42, -452, -348, 1208, 397, -1305, -606, 1063, 409, -258, -290, -798, -478, 632]
1391F32j43j710N9J405K96l88k36j23k12P02N79j673L8Q98J77k83M69j085n29
1410a127J678L73j750k87P40R0L00P35j311j149J754P75j378J48J18n55J113P93
1428A060j645p40J675K68p57L69m79p74J639N14j383o19J203O5J04O6p90m54J016
1447C38L30l05o57j17O52Q2N9m58o11J85J101k41j190N03J59Q2O11j1j486J67
1467h07J527m15q25M04l42k27J356J7j930Q44Q03l33k2J02q23r4J689m39j283
1486g98P42J74j24J86K36j479M11J353j8r62j5j9L10K04J51q48j55R83L17n68
1506H1k46k41K61N89L10r44o65J047M34n73L53m73l46M54Q05p26r93J105J51k50
1526A33J38n20m92R24O83o35p04N87l46L36K81m32j063J348O30l71q45P5J8K19
$$ y = [632, 489, -1221, -1162, 243, 539, 151, -85, -208, -420, 282, 861, -812, -774, 124, 301, 18, 487, -598, -1127, 551, 924, -826, -1113, -373, -283, 17, 752, -559, -1708, 46, 821, -557, -409, -291, -846, 267, 1060, -585, -1325, 350, 618, -139, 230, -249, -1023, 616, 1130, -253, -872, 331, 396, 500, 566, -224, -678, 338, 668, 363, -294, -411, 241, 323, 382, -76, -687, -502, 599, 358, -832, -329, -170, -88, 523, 512, -974, -807, 720, 305, -520, -116, -458, -685, 671, 688, -1242, -398, 405, 72, 50, 152, -671, -765, 924, 485, -798, -56, 118, -6, 180, 416, -1063, -652, 701, 683, -279, -294, -313, -3, 201, 352, -496, -651, 332, 649, 81, -165, -406, -145, 444, 754, -190, -855, 192, 626, 53, 406, -67, -413, 41, 846, 120, -873, 232, 383, 133, 271, -249, -741, 183, 866, 231, -473, 114, -232, 104, 385, -47, -1110, 238, 868, 497, -348, -273, -255, -36]
1546c6P07o16j001O64P08j63l80K20o80L03R67m80p12L79L18K62l30n1o59L52
1566b28J021n00o66k7N33J19K36k68n51K1P30L16r33k17N42k01O17j1j105K21
1586c51Q43j40q5q8j49p7N80k76p45L54L05M12m28k04j78j11O21K55n10q31P06
1607i7K02L10j31n47k18N88K00l16l40J77J85j40N90p81l13O57M19o22R9k83r6
1628d57M35N00o05p50N82N59l37k14O3n69O61N40n30m70L13O6J46q6J46o60N40
1649a27O77o03m13j08M40L14L84n84m92L53N65K39q25n0L4J95N01J72j056J17
1669b67Q93k89l26J57l63lQ72k62o15q2O99q7k27J53m23r9O04M7p93J04L82K68
1691C43k07K12r12J76P07J35l60k56K25J51K33M2n28p6L50L27k69k32r7j28L25
$$ y = [-36, 671, 55, -946, -282, 426, 263, -117, 103, -577, -274, 693, 213, -499, -120, 198, 460, 130, 79, -580, -228, 793, 293, -373, -400, 133, 252, 488, 220, -331, -310, 420, 736, -197, -414, 128, -73, 544, 533, -572, -351, 492, 352, 267, 179, 30, -47, 533, 257, -488, -134, 171, 583, 155, -49, -227, -338, 283, 538, 28, -803, -97, 105, 415, 284, -263, -481, 107, 307, -9, -349, -172, 13, -127, 463, -318, -631, 26, 445, -177, -78, -361, -457, -22, 478, -127, -877, -295, 264, -73, -287, -224, -793, -132, 408, -122, -592, -279, -213, -67, -153, -7, -667, -127, 550, -53, -466, -574, -134, 180, 564, -20, -512, -159, 406, 645, -180, -230, -196, -1, 500, 672, -384, -267, 626, 337, 11, 168, -195, -198, 674, 412, -203, -285, 414, 327, 100, 253, -170, -269, 335, 382, -411, -307, 75, 343, 136, 348, -564, -388, 319, 454, 94, -162, 63, 214, 447, 489, -39, -115, 235, 562, 293, 61, -36, -164, 161]
1712A61J64m29l43O85N2r3n07J53j69K29M83l59l36Q1L99j80L5j41k16M18N52
1733F39l16m69m0L71M0K83m50l24J38M74k39l1j05j99J74L48l25l86J1O19n6j60
1755cj6j38R8M58l47o10N38J53j74j28M8m64J93P89k96l88p9J46nN78m42n56J84
1778d61M31J38k41m37K02L07J96M2m42k18N50N44r24J57k62K77N19J33q23M2J82
1799h8N2O6J23l92n8K49K79m10o1N20R4j76J32p05N0N51rq2j13J39J0J64j60m6
1823A29m16N73L52l81m5n2k54L48J18L1o72J3N46j38K2j84J13j29K06M1k73j80
1845b32L70j25o9j0j00J18N55l71n28K69K46l50L53j67j80j01O95j20m15l7j2
1866b11J65K25k97k02p4L88K62l56l0R1p4M92k02n03K02Q7L67n5k96j67n7N70
$$ y = [161, 325, -104, -447, 238, 290, 197, -310, -157, -326, -97, 386, 27, -309, -228, 171, -9, 26, -115, -331, 87, 639, 323, -146, -186, 185, 225, 508, 58, -266, -128, 346, 107, 76, -29, -228, -54, 294, -31, -417, -406, 213, 157, -3, -19, -157, -59, 399, 52, -558, -20, 133, -41, -169, -121, -585, -392, 397, 101, -287, -366, -220, -225, 353, -89, -645, -461, -30, 108, -133, -570, -368, -61, 135, 177, -265, -483, 67, 611, -313, -156, -418, -141, 378, 511, -312, -270, -88, -36, 30, 153, -239, -297, -48, 231, -179, -240, 280, 374, 198, 330, -375, -325, 226, 217, 135, 22, 161, 171, 335, 175, 129, -287, 286, 638, 257, 212, 160, -94, 254, 372, 403, -269, -256, 290, 152, 174, -10, 103, -26, 180, 221, -52, -232, 138, 13, -56, -66, -166, -48, 507, 136, -392, -123, 123, -227, 126, -41, -221, -322, 373, 253, -162, -199, -211, -46, 179, -118, -320, -394, -6, 256, -100, -130, -39, -113, 379, 177, -326, -124, -37, 330, 275, -21, -188, -245, 325]
1888C25o6m62o9K05K73j40l01J04j26M11P2q1k06m7K50J09J53m86j25M2N21k26
1910A30nl46L01j04J96j61m66K17M97k14r9J99k81L31M9k73k41J97K51o1Pk24
1932a00l75N96K53m63k19N1R1M17p3k76k29K20J82J20k10j98n1M7M81q4m68K44
1954d4K57L4k37Q8q5l7K48j96j63P1K33m4j8k39q0J17J67J33l91l07O37r3M1K3
1978A15k50j54M78P9n30LK52j75J49M27m24k52N39j27p6r1j62J41M07j59j56l12
2000b78J67K20K72n01k12J08J95K90m12j16J33Q5K32j55k54j66K99J09kj33q6
2021b05N5M8J05k40M06j45M9p7l3r5K36o1K30k00j94K61L22J1n14m5J52k2L47
2044C91j14j77m0j26N57l25J6k53M3N08j26n33J71J9K03O4k19l90J48M46l4k55
$$ y = [325, 259, -203, -272, -67, 206, 66, -235, -131, -257, 154, 226, 145, -61, -108, 142, 251, 404, -82, -207, -165, 356, 130, 125, -221, 80, -24, 172, 11, -455, -238, 259, 45, -54, 145, -136, 195, 244, -29, -270, -73, 178, 117, 124, -100, -475, 121, 374, -89, -308, -257, -166, 251, 178, -98, -327, -107, 75, 195, -15, -213, -264, -217, 264, 180, -288, -44, 213, 247, 10, 98, 13, -24, 224, 28, -135, -64, 169, 125, 107, -132, -212, -95, 72, 205, -186, -493, 144, 51, 92, 115, -135, -289, 189, 268, -262, -259, -7, -182, -33, 394, -30, -282, 257, 130, 54, -37, -199, -58, 349, 190, 34, -278, -111, 109, 381, -120, -332, -224, -29, 261, -151, -267, -134, -49, 183, 28, -226, -392, -93, 16, 14, -119, -205, -150, -102, 3, -237, 169, 24, 73, -4, -37, -132, 104, 43, 273, 73, -121, 140, 462, 473, -41, -86, 66, 44, 391, 277, 100, 60, -66, 491, 166, 182, -71, -28, 480, 354, -179, -8, 11, 214, 278, 59, -331, -183, 263, 229, -26]
2066b6j86K62J14LJ37m34k24M33J28j3p4q4K75j10J30m95j07K17K27r1j96j73
2088b87j21J70M33k10m07J32M32k72o2j05j19L87J95l19k29J34J36J55m8j77l62
2109e44M99N14l32p2j50k49M98lj73j58j2M06m1j00j98j83M34J1j3m61j25M43
2131iJ67J55n11j27J57M32j10m32L09J03k1L6k18k63K08O7J53j66M2j77K70J89
2153B54k38Nk60L08J75j52k38l0K28K49l25k7k44K87K67j68k35J02p8J11O4k36
2175a81p9J68R9K03m01K12K32P0j11l07O6O6K39l87L81l38k16J75L17l9k72J33
2197C0j14K63J53l7m94J85J62j13j80O0O2J20N9j16l76K27J08J36m10J27m8K09
2219A3n5K21l75J59J1K%k12L1k34O28k78j87k4L26k29J49k06j41Q0K51L08j98
$$ y = [-26, -212, 50, 164, 167, 304, -130, -354, 79, 207, 194, 120, 36, 311, 201, 331, -164, -271, -54, 173, 82, -114, -287, -408, -238, 195, -15, -422, -290, 142, -130, -192, -297, -416, -29, 166, -153, -382, -248, -112, 43, -5, -182, -544, -45, 469, 137, 65, -85, -334, 164, 161, -12, -170, -182, 224, 183, 83, -115, -298, 136, 147, 134, -327, -452, -9, 158, 313, -198, -325, -168, 264, 154, -278, 31, 134, 113, 149, -69, -332, -124, -57, 96, -70, -28, -205, 65, 254, 16, 21, -239, 69, 244, 92, -146, -176, 52, 301, -24, -51, -295, -8, 259, 91, -144, -42, -120, -9, 55, -181, -260, -92, 7, 210, -191, 21, 253, 323, 212, -95, -29, 37, 276, -111, 270, -68, -284, -109, 208, 169, -103, 30, -84, 179, 332, 295, -199, -14, 148, 35, -145, -85, -23, 97, 156, 40, -336, -109, -1, 135, -275, -148, -196, 13, -42, 179, -196, -37, -26, -24, -24, -236, -205, -439, 189, -89, -276, -300, 26, -203, -54, -260, -401, -321, -70, 238, 40]
2242D0l42J96J98j3J13k77l3P9J12J8J3q4J1K13n0n70K56j4K37j88J00J46j10
2265E1qL7j40J72L5K22j52o2k08k11J90N07m13q3K3k9K59R6o9l63L6L57N1j93
2289A05k3j6J3O3K0m16P0K71J23k68J18l53L38J34L8j42n03M28j6Q6r2l70J65
2312b27M37l02k43K76L3k08L61k5m15J17K01R2k6q6k50K59K97m80J15k26K89R6
2334H5j2j58kK7J88J12l83K13m6J48J43k03l89K72r3K50p9l71L85Q1j75J91j23
2357F1k58M45j68N7k92K90M8j55K71k59J2N1J39j70p2k41J83K84j5j12l29M06
2379A76PJ13q0j69k51K78K30p8k29J86k03K77k17m4l56M19qJ06l43j71M30j48
2401g5K09J12k64q7J09M15p89M96j25j31L95p4k92n3K12Qj29J38j68J3K66j21
$$ y = [40, -302, -106, 92, 79, 192, -85, -118, -39, 73, 91, 104, 20, 31, 244, 194, -376, -120, -134, 103, -85, 15, 161, 51, 43, 80, -60, 112, 147, 369, 217, 155, -53, -264, -74, 433, 20, -63, -40, -69, 190, 286, 217, -146, -110, 247, 298, 105, 82, 66, 79, 142, 162, -254, -184, 87, 210, -58, 60, -293, 45, 179, 217, 75, -428, 0, -16, 70, -22, -392, -227, 210, -92, -335, -59, -26, -234, 127, 102, -313, -196, 5, 97, 71, -15, -265, -6, 291, -189, -74, -300, -11, 85, 73, -85, -87, -60, 128, 240, -143, 70, 24, 172, 315, 112, -277, -5, -98, 152, 73, -298, 87, 168, -7, 184, 61, -197, 248, 80, 137, -155, 135, 183, 28, 299, 40, 52, 103, 242, 72, 0, -241, -58, 226, 211, 99, -230, 176, 183, 296, 216, 47, -204, 74, 304, 226, -3, 183, -20, 257, 40, -4, -360, 59, 51, 157, -186, -357, 73, -75, 134, 246, -18, -105, 4, 419, -370, 126, 1, -130, 265, 191, -101, -154, 58, 66, -63, 75, -93, -80, 186, 65]
2423F5k04K38R4j24p7Q1j19j67M67j37L9k25q7J38l2O1k18K40j59K99k37j62R3
2446a33j5K29r3j49N4J39M4k39r3N7J39J47J6j52r0J31j17J97p1l01K58k02K33
2469a1J83n47K00L86j47K3k52j87L89N3L51o85J31N7p0J37o5J6pL98m32J11k88
2492b56j4N22pk74j75J99P2J74J63l69J6j63K09qk95J7P8J19J80j99k14J47M1
2515c7K03q4M6q7k0P8J29l09j76O48m13pm5rJ15J0K35m41J55M5k7k7J3L2j72L86
2541B41j93j10k73K27N4Q6K5K0l8P7K1n33J91K01J99l64J29p9N0p1L13M0l45J6
2565a16k9J60J59j56j47K39k36J04J26j40j29J97J72j36k87R5L1J80p8l1j65J7
2587a70M04k41p3j51L11n1J1r8j19J02K83q1j37j64K14J84J20k27l60J76R1O5
$$ y = [65, -139, 99, 193, 69, -8, 73, -46, -213, 254, 117, 156, -69, -156, -18, -50, 11, -207, 33, -126, 173, -64, -226, -133, -148, 81, -12, -161, -107, 32, 76, -163, -256, -199, -60, 87, 103, -49, -139, -8, -125, 72, 1, -300, -42, -244, -11, 172, -375, -175, 211, 64, 87, -165, -352, 37, 90, 441, -244, -113, -56, -126, 11, -54, -38, -45, 353, -79, 32, -256, -270, 252, 245, -29, -204, -5, 67, 241, 404, 35, 51, -112, 97, 89, -206, -189, -111, 8, 188, -11, -225, -78, -37, 166, 82, 128, 41, 21, 99, 228, -81, -257, 391, -22, -29, -74, -83, 32, 42, 277, -164, -9, 36, 9, -18, -5, 27, -145, 241, 48, -62, -335, -108, -54, 32, 57, 77, 39, 116, 137, -396, -205, -4, 195, -169, -40, -119, -69, -140, 173, 213, -132, -116, -145, 15, 174, 18, -129, 110, -126, -22, 104, -36, -165, 32, 204, 68, -219, -124, -93, 87, 9, -22, -187, -170, 234, -7, -80, -231, 80, 29, 40, -58, -177, -75, 208, 127, -10, -174, 40, 224, 344, 117, -243, -67, 24, 89]
2609H9k35L05l47N4K06j33J55n8k51N18l34J3r0J37o8j86J18pK67Oj63J8k44L30
2633A00J58j1l25K02j7j05J27K58m08k00M19N1k25o9K04j96r5J32K53n38L60J21
2655A96j59j68R9lJ42K04j59l14L04j03j79J16j79J08K8L77j55k15l5J52j22p7
2677a42Qk9J94n0j62j43K21m5L21k93K20k62J29n1L6r6K62j09K3j69R9k82M20
2700A00l00M49j67j64J01k3J42j57J47m76L23J88j12r5J82k79O74l25p08J02N44
2721A46k32J23J48k47j50K25O2j83J60O2k59L22o5k20r5j1L40l10P4Q2O1q6p0
2744a23J15r4K96k6J77l27k09K23J05J7k56O0K30k72L45l24r5l6L64J22l05m7
2766f0J13j18K89j59J35Jj62j54K05j13j12J42q9O5J58k95P8j18J97l3m2m9%K11
$$ y = [89, -146, 159, -188, -134, 72, -61, 94, 36, -215, 303, -31, -18, -108, 29, -39, -225, -107, -114, 153, 159, -4, 14, -230, 100, 258, 247, -78, 124, 107, 2, 129, 387, -21, -221, 198, 249, 24, -45, 159, -37, -132, 0, 253, -285, 75, 196, 37, -131, -32, -35, 107, 311, 152, -162, 142, 39, -140, -24, -203, -95, -67, 310, 155, -60, -95, 57, -65, -142, -134, -163, 31, -19, -181, -324, -103, -148, 173, -120, 100, -162, -33, -84, -48, -144, 118, 9, 32, -137, -38, -320, 100, -200, 249, 82, -82, 19, -4, 138, -19, 128, -348, -25, 163, 51, -44, 138, -141, 533, 208, -500, -398, 146, -86, 37, 185, -62, -212, 13, 75, -108, 52, 114, -145, 177, 112, -108, -203, -214, 126, -184, -110, -28, 33, -53, -123, -8, -102, 194, 168, 345, 18, -191, 32, 137, 154, -102, -42, 188, -84, 261, -63, -158, -194, 170, 292, -13, -60, 53, -65, 224, 65, 200, 201, 39, -115, 90, -23, -135, 7, -82, -17, 141, -154, -76, -194, 3, -30, -72, -121, -121, 90]
2790I0J49m5l89R9J92j41j43p3l4N46j09k08K28rn8J62Kl74k00M05r5k28K58k42
2814b17L37J54ql29L7J1Q3j20j63K17n0k2N4j93p2K72M2qJ36K7k74p9K41j7j70
2839a11K17j87J55J01k28r7J4L93l09p7K58j07L4J0m9j35K73l14K03k47J82L1
2861A0N2q7j30J1k8L05j85J2J61j07Q3J34o0j75J73jk53J28k03j66J67K39j27
2884d7Q6O5j56P5M8J71k61J87j08J7q8r9K20J40o2k01p6J56J1L5k46K22m7n9J13
2909I6j49M0l17L05J77m57N58k15j66L79K2l45J13j49J46R6k95M6j2J82o5N9j25
2932g6J76j7J36j17j53J44N9l29K78O1k33m10N04J4j54k7J65K58m73lk4L03L8
2955A20j69J32j31J32j43R0M9L7P8N2l55j33K15J34k62J46K4k7R2k0K06k99Q2
$$ y = [90, 239, 194, -195, -96, 96, -45, -188, -261, -295, 251, 142, -66, 162, 153, 95, 257, 259, -115, -315, 90, -5, -233, 25, -217, 120, 274, 266, -63, -26, -15, 68, -52, -215, 2, -48, -70, -16, -209, -281, -9, 33, 25, 161, 188, -86, -165, 76, 59, -111, 106, -81, 74, 175, -53, -150, -136, 257, -52, -129, 129, 22, 56, 66, 17, -118, 155, -159, 44, -203, -21, 10, 62, -25, -155, -144, -172, 133, -52, -40, 121, 14, 97, 231, 171, -4, 169, 168, -85, 43, -160, -326, -159, 80, -47, 39, 104, -52, 23, 71, 242, -19, 168, 60, 77, -11, -110, 110, 250, 188, -13, -89, 67, 78, 113, -133, 89, 42, -17, 96, -53, -13, -330, -25, 152, -305, 253, 38, -128, 251, 273, -72, 41, -108, 38, 134, -161, -115, -127, 55, -10, 49, -76, 100, 83, 219, 102, -51, 93, 152, -177, 101, 162, -71, -481, 23, 37, -117, -144, 21, 279, -194, -197, -221, 82, 120, -49, 83, -48, 84, -59, 31, 80, 117, 195, 247, -108, -241, -26, 108, -154, -8, 16, -11, 81, 61, 267, -32, 50]
2978E0J35j80j87L31k46L6J02P3r8R7k21j86J81K56K76l93k14K25j96J21J18k28
3000a48K44r7L39m23K7L7O0K07k15j89K37O5l24L67k52j07J71J35p6j07J4j5K6
3023b4l4K73l73R0N0K08n33L15K11j21m2J3Q5r9j45J34m7OK39m83L06J36j17p6
3047b8j39L62j70J38j40k25L42M6k67K22k87K01K9l49M30j73J24J15k57L0j06
3068a02K50l9j83mL6L3O5o5j27Ko4O10k65P9l17J34q9J03j48K9o1K62R5j82k09
3093a57Q6lj8l4J9K00k32l9JJ7J16K36m1q2k60M92j10k90J5l4j12K25Oo7K59m81
3119b88K3N32p3j09k27R5q7j75K55J9K8j88K04J01j07l1o1K05n7j08K6l2N9kJ87
3144A89k43J92j28J72j72L5j18q8j55J87j07K7L47n4j30L1j31J49Q2j68K8N9m2
$$ y = [50, 185, 5, -182, 149, -97, -61, 41, 114, 16, 113, -108, -294, -113, 143, 419, 26, -188, 37, -159, -38, 80, -148, 96, -1, 338, -85, -58, -21, 39, 246, 31, -158, 79, 144, -180, 187, -65, -172, -1, 134, 58, -49, -35, -50, -24, -58, 215, -158, -68, -18, 190, -343, -28, 183, 62, 20, 33, 118, 19, -126, 8, -39, -33, 206, -277, 29, 165, 48, -28, -167, 195, 25, 163, 23, -202, 140, 186, -81, 141, -146, 55, 84, -265, 165, -8, 116, 231, -26, 4, -102, 148, 109, -74, -78, -42, -9, 56, -9, -136, -134, -198, 412, 147, 226, -91, 43, -46, 57, -91, -62, -123, 139, 234, 52, -157, -71, -74, -92, -126, -107, 93, -139, -178, -177, -160, -44, 192, 151, 69, -191, 301, 191, -99, -84, -118, -230, -5, 1, -66, 193, -288, -265, 267, 194, 85, -142, -47, -134, -309, -54, -35, -7, -195, 9, 110, 3, -28, -89, 116, 59, -49, -23, -55, 4, 2, 189, -54, 138, 10, 182, 10, 45, -73, -161, -316, -129, -236, -209, 138, 84, -46, -15, -146, 3, 85, -83, -55, 4, -38]
3167c8j2O4m7L19j50k56K60r9Oj22Q0j23O3q1N11l66N6J14k62K14j00j2j03Op1
3192a49J3R6J39m31L90r5J55l2k10K39j93J6J09l49K97j4J6J36j08n8J82j73n8
3215h2K49k6k17j17J26K64Mk49J44k4k9N0m01M86Njj80J16q3J3k05K62l42J16
3239a21j12M18k08l09N35j63nM0L3j46j4J95j47k60J59j13L00l5k05O7J50N2j91
3262h0J10j02J27J69k21J34j33j01j01%K84K7j47R9M3K21l54MJ56j42J31jk74
3285a51k0K14K6l38J66J49k48K39Q8q1K2q1J19j67O6q4J14K27j74m2o4q3K99j80
3309A6J04oK18j43j77K8O0J35k77Q8l78K73j32r0J66K80k39K03P0k04J19j16K35
3332B33j93L5m1j79K33k6j29Q9j40J00J2J07p6J10j0k43J70Oj47J41p4K60r1j79
$$ y = [-38, -50, 14, -33, 286, 136, -120, 140, 41, 47, -75, 5, -118, -55, -136, 375, 9, 65, 179, -83, 131, 31, 19, -84, -78, -149, -136, -40, 99, -332, 58, -37, 118, 86, -124, 115, -78, -62, 47, -302, -5, -19, -3, 133, 25, -33, 149, -24, -82, 167, 141, -76, -193, -67, 197, 201, -48, 96, 72, 43, 93, -308, 178, 183, 182, 2, 118, 35, 48, -157, 105, -237, -121, -233, 185, -23, -332, 203, 40, 35, 75, 108, -38, -52, 143, -4, -264, -105, -218, 82, 47, -158, -91, 59, 111, -80, 30, -72, 55, 224, 3, 137, 4, -97, -198, -198, 86, 113, -34, 65, 108, 329, -25, -21, 135, -7, 124, 123, -151, -171, 43, 69, -269, -103, 46, -202, 37, 125, 44, 66, -15, 104, -63, 3, -81, 33, 260, 86, 44, -20, -103, 196, 16, 120, 114, 332, 189, 12, 40, 100, 235, -42, 46, -332, -59, -191, -281, -115, 165, -74, 129, 199, -5, 114, -2, 233, 40, 75, 34, -145, 88, 62, -67, 22, -118, -18, -6, 101, 25, 135, 125, -118, 52, 58, -89, 52, -22, 238, 147, -32]
3356c2L0l3q6K66l16r0L83k50R6K41M1l35j37L79j82R6j60J48r1K53l79OM02k93
3380d3J46k14O9r1K11l13J80o0N3M7MNj16M4J90J62m00m4K52q7Kk2K82k44p5J89
3406A27o9O8l7j31j02M84l76j43J03J73o5k01J16J53q7J29r6Qo6j69K33Q6j30
3429HN1l36L66n6j70J39O8R8k24J80j01N9j64k18P3L51j58j52L01M4M6Mj88K5
3453D6K82l53Q2m60L60P7O0j46n3L0P6k2j32L87j88k21k6J16L3J18q9k5J27l5
3477D4k52L53O2l45K61k42J1KJ77o7p0J41q1j65J27K15k70j09M8m0J48J27k62
3500a87L03q8O2j41l7j61K33j44K4N9m0j64L04J2p3J76j24j4p3j28J27O4k02N4
3524a58J68L8k34J59r8J40j12o9R0m2J71P4k77J12K06l02J52r9L13k67Q7J93j24
$$ y = [-32, -2, -35, -121, 145, -171, -261, 122, -128, -32, 209, 250, -85, -222, 157, -25, 71, -89, 59, -32, 221, -158, -152, 250, -43, 103, -111, -42, -133, 78, -235, -55, -115, -62, -15, -11, -6, -122, -78, 112, 274, -126, -170, 82, -5, -3, -25, 257, 13, -62, 127, 58, 126, 89, -42, -144, 340, -36, -179, -76, 97, 32, -169, -53, 100, 13, 142, 46, 54, -12, -181, 52, 138, 8, 59, -277, 89, 33, -137, 2, 70, 168, -56, 124, 23, 82, -82, -300, -227, 124, -34, -186, 115, 159, 205, 209, 21, 46, 328, -25, 57, -403, -43, 34, 94, -52, -105, -75, 1, -21, -153, 234, 46, -175, -201, -85, -52, 66, -23, -48, 79, 44, -208, 145, 207, -138, 123, -119, -108, -106, 71, 4, -66, 75, -6, -171, -44, 171, -99, -208, -160, -200, -52, 75, -187, 116, 28, 90, -51, -88, -249, -16, -160, -136, -77, -117, -281, 23, 35, -38, 138, 14, 0, -73, -201, -74, -10, -212, -158, 10, 48, -186, -27, -125, 15, -97, -166, -76, -118, 53, 127, -150, -38, 168, -134, 18, -81, 232, -35, 52, 245, 121]
3547A21k17o3J12R8J39l63M44k83L1j42L23k10J22k4o9Q7%J37j75N0q1p6PR8l30
3572b64J22M9J86k34P5j63L16j10J68j22j8l3L56n26K9J17n2M53k76Pj44K52l56
3595a68o5K33p8J60K05l08k45K56Q9k39P5J84m57M07k0k0j34r1L70j15j35j42
3617b38%J88J30J24l40K45o3r4Jl8K7l2J89j71j54L96J5l4o0p6k4J21j00J7Q9
3642A18K63j74k70L9j81K50q9M4J23p3k00J41n6N8M1K00k3j18L4j65J1K70k54
3665a1k41%k4L89j9L6k6k27L77l05L1J58j78Q2O9j44J13p5M0o2j30J75r7K17l86
3690b38L64kj11Q5k37m5L93n9l72r3M47k36Q7Q8r0k12L05m0n1Np0r9M35k92o9
3715a07J32J02J6j16l5p8K05k53K9J6K12l51K28%j70k4K28p8k28K94j00LK89k98
$$ y = [121, -96, -159, -47, 51, 190, -173, 271, -12, 19, -123, 200, -10, 112, 88, 19, 106, 106, 243, 68, 118, 37, -39, -32, 66, -264, -142, -93, 93, -141, -66, -229, 87, -23, 145, 23, 5, -28, 328, -198, -169, -52, -104, 349, 73, 80, -64, 188, -168, -233, 0, -78, 82, 287, -21, -266, -10, 79, -160, -85, 99, -358, 49, 29, 9, -125, -216, 154, 39, -96, -238, -238, -50, 80, 204, -136, 109, 46, -48, -47, -85, -58, -90, 99, -72, -226, 170, 185, 151, 91, 15, -9, 112, 12, 29, 118, 381, 207, -63, -24, -205, 45, -44, 0, 123, 50, -150, -9, -65, -7, 34, 234, 211, 93, 127, -38, -27, 243, -11, -252, -252, -276, 113, 94, 130, 104, -123, 254, -51, -20, 138, -40, 42, 111, -33, 80, 5, 45, -17, -147, 28, -69, 148, -238, 126, 124, 13, 98, -139, -184, 209, 150, -222, -315, 132, -104, -17, 71, -19, -231, 74, 34, -17, -12, -82, -181, 254, -38, -107, 25, 127, 143, 27, -8, -86, 119, -134, -105, -89, 123, -228, 0, 0, -170, -194, 34, -44, -272, 22, -78, -75, 214, -84]
3739h4J2N9nL1l33J58L70j29n3j46pj75L30j49J43o5K70j96J16j65J09k61R9j02
3763a73K32J00k35J14j20K19k54L14l11N6K41j38l7j87J26K96k02j43K40k92J42
3784a2M9j28K00r3L9Q8q7k9K31j76R0k26n5k98L46j48L18k49rJ2L27k15k3m7J53
3809E8RMp3K63k98J4O4j88J38K65lm69L13L9k09J35j15J65K9k72J57q1J47j52
3833f0p9K74k12J3J86j39J26o1k18K42m74K86M3L27m6l10k1K35k14J3L0K19q7
3856G3j17o9O6K59j80P4j04N1j16K07K21j85l14J52k37K29O5J3J07l70J68J39
3878A32k15K6J50P8j04p6K3P2o0j59m1J52K88l42K42m25M67j75J97m28L49j12
3900C9l35L19j04L55l88K02j88J1K46k13J61j15o7k02K02M0P4o6j59J96K6j92
$$ y = [-84, -72, -13, -18, 13, -320, -162, 208, 79, 26, -120, -127, -302, 28, -121, 22, -43, 227, 31, 147, -18, 91, -170, -71, -173, 59, 159, -76, 38, -82, 137, -117, 197, -114, -58, 183, 45, 8, -179, -53, 243, 41, -102, 138, -154, -12, 37, -91, 109, 16, 55, 143, 56, 27, 258, 82, 172, -54, -109, -407, -61, -209, 109, -140, -149, -137, 190, -25, -48, -95, 58, 67, 71, -2, 261, -37, -23, 41, -147, -9, 256, 253, -216, 97, 136, -73, 62, -53, 112, 141, -131, 26, -55, 92, -60, -139, 135, -77, -64, 122, -17, 109, 48, -170, 72, -402, -116, -73, 254, 208, -102, -123, 112, -102, -89, -59, 160, 73, -44, -113, -47, 212, 32, 106, 2, 53, -63, 144, 365, 180, -134, 18, -219, 10, 75, 88, 195, -175, -7, 132, -83, -57, 93, 171, 67, -9, 14, 86, 26, -133, -174, -22, 266, -76, 166, -259, 208, 33, 230, -198, 151, 39, -296, 23, -81, 274, -114, 88, -100, -89, 157, -56, 105, -10, -77, -279, -77, -37, 37, -29, -188, 8, 34, -158]
3922a58K51o9N2N8Jp6r0J06k84K39l3l19L38O6l8j39J40P6m6j44M1Q2J05l62L14
3947A11no2k43J42R8pJ03K0j30k12M9j1K81k90K15r3L0J42q5k6k38J88k3m9K50
3972A55j32j60K17j49O7J21r5j32L21l7j20o6J77j52Kk50M78l62J35o6J48k72
3994a72J33J09l42J72R9K9j95J94N1J82k51k01K02J29k56J97k65L82l52J38R9
4015H2P7r2k56N7j26J84K8J25j87K19j54O2q3J70K7p2j23N0k1O2L2l6l3J77l87
4040b18J74J67l43J66J44P9J30j82q6R6k81P9oJ42J7Q1m08J93N8J20j63J30j16
4063b7J29kj82P9K58j80oq3J21j27j99P7L23k08O4J78k59j56R5J5J4J5J28j96
4087a29J42j99M02ok97K24k07K48k59l8K17j71J11j01j27O3J98j95J62q5R3k80
$$ y = [-158, 93, 24, 76, 134, 135, 59, -31, 75, -209, 30, -3, -322, 16, 82, 44, -95, 45, 121, 75, -69, -28, 54, 159, -203, 111, 106, 44, -199, -57, 41, 34, 137, 157, 27, -185, -136, -147, 134, -156, 59, -34, -4, 138, 53, 27, -211, -23, -46, -95, 155, 23, -137, 80, -69, -2, 119, 24, -108, 213, 176, 56, -10, 167, 15, 17, -233, 245, -117, 18, -48, 100, -172, -39, 70, -272, -100, -1, 28, -167, 27, 78, 260, 9, -192, 10, 139, -117, 80, -185, 197, -155, -17, 82, 159, 67, -189, -132, -258, -74, -46, 79, -108, 111, -43, 19, -64, 106, 133, 61, -62, -12, -33, 29, 61, 25, -8, 169, -218, -44, 123, -220, -54, 90, 169, 299, 117, 31, 127, -154, -75, -81, 61, 78, 159, -249, -56, 2, 122, -41, 89, -27, 102, 100, -82, -3, 255, 75, 69, -14, 107, -20, -219, -142, 181, -27, 37, 215, -44, -200, -105, -90, -76, -61, 67, -129, 13, -186, 216, 210, -87, 137, -70, 178, -81, -119, 98, -73, 38, -63, -190, -127, 71, -124, 38, -47, 46, -234]
4109b34K11j38K77m6j75MJ21kJ6K4M6o9j73K04k27J80O9n5Q1K7k02K25j62k4J61
4134A39j70l24K09K46Q6k49k7l6P4mJ71j43r5R9j63p1R1O0j44M61m5l48J39J77
4158A33j11J07k13j16J37k0r5M7Q4J96k85P0k43M05k45K85k28j10K91k5k04J69
4180B9M8j99K07j03L2n6R2j4q5J90p9j37L49k79J46n2m3l09M00r9j28Q7J89j89
4204cR3J3j16k06J84o0o3J52j75K01j21K95l03J73j41K20K50m93QL48n07K90j6
4227B3N2m9J64j45n5O5q2J23j62J89j83R5k9O3Q2k19J13R4o4m2K29L9k47J24n4
4252A24j89K21j42L5K14k55J60j31k79L08j22p9Q9j00O8j74PK54M9J42j81p8J8
4275d1K6j65L58k40J03p2k99N19l13O8J21OJ1j43M4J70J08k17j10P0k46J65j57
$$ y = [-234, -23, -161, 116, 70, -105, -101, 20, 18, 34, 58, 104, 35, -138, 66, -161, 19, 88, 33, 114, 141, -61, 164, 2, -22, 139, -31, -355, -146, 100, 186, -63, -90, -126, -52, -56, 115, -28, -123, -24, -187, -258, -167, -107, -251, 210, 165, -183, -44, 133, 22, 129, -84, -200, -63, -83, -178, -131, -47, 149, -136, -66, -309, 96, -149, 136, -92, -202, 89, 64, -140, 29, 77, -122, 85, -18, 14, -42, 50, 36, -49, 141, 62, -75, 274, -5, 141, 89, 46, -263, 137, 38, -90, -3, 186, -3, 90, 103, -13, -219, -35, -95, -158, -6, -181, 20, -101, 194, -109, 64, -77, 143, 393, -100, -92, 256, -251, 39, 23, 75, 26, 190, 45, -10, 55, -27, 96, -66, 123, -60, 35, 6, 69, 151, -68, 45, 139, 75, 33, 262, 301, 54, 178, 124, -65, 156, 14, 49, 263, 8, 168, 37, -242, 66, -56, -135, -46, -146, -78, -252, -245, 9, 58, 200, 19, -59, -41, -15, -180, 178, -62, 41, -31, -330, 189, -124, -56, 65, 71, 82, -61, -17, 153, 261, 44, -66, 4, -242, -77, -234]
4298b34J24K80j82O5R1k71J26O2k07N9n8J07o8K83m02L97l46j76L64O3q6m1j28
4321a78L21j36J21n8k10l3K0K15j35J77j05k38J01K22q1j4M7Jm8j7j64K20O4j72
4345h0M0K21j46N5%M9P3k68J5J10r6j08j4j12M11k48J10k19J74K9J41j57K71k07
4369D4L8k70J65l5m6k11K73j9k7P4J45j91J70j4Rl1M1j79P0J33k80K45j22p1J99
4394A10n3j96J07L9K9O7L4J6k88O3J31J53j69kJ02o2q0R6k09K22Mj03q3L02j85
4419D5N0R2j05k8k28L31q0j57O0J66k52K42j25l7j83K35P3k07j77J79J55j94Q0
4442f5K84j85k17J49K74k3j20Ol0J04O2j69m3J4k09K35j57P8rJ7j23J96k00J22
4466ij39J64Q0J7r8k4Q9n2j84K34j06n8J50o9J57k08j19o6N2K82J98k50J01k33
$$ y = [-234, -110, 170, -12, 53, 144, -127, -1, 61, -146, -87, -145, -38, -106, 177, -225, 172, -174, -350, 14, 77, -9, -50, -178, 143, 7, 128, 70, -140, -173, -153, 62, -73, 104, -1, -239, -138, 84, 3, -11, 36, 37, -11, -28, -192, 28, 92, -80, -40, 181, 35, 90, 90, 139, 212, -56, -41, 69, -27, -135, -149, -261, 150, -98, 12, -207, -33, -4, 137, -20, 251, 44, 82, -188, -23, -58, -104, -315, -42, -61, -88, -14, 131, -60, 110, 96, 105, 74, 115, -64, 6, 139, -141, 104, -18, -89, 110, 57, -139, -32, 7, 36, 103, 137, 153, -135, -72, 59, 212, 43, 41, 143, 81, 1, 97, -112, 110, 114, 11, -72, 230, 45, 95, 187, 82, 54, -174, 157, 77, -80, -20, 146, -106, 136, 11, -26, -209, 26, 99, -108, -285, -106, 49, -145, -65, 219, 34, -183, -34, 240, 217, 97, 103, 73, 177, 239, 70, 27, 41, -168, 67, -90, -12, -21, -4, -127, 69, -131, -9, -148, 16, 96, 113, 15, -9, 80, 28, -156, 78, -28, -86, 64, -5, 152, -56, -175, -241, -189, 93, 291, 41, 142, -91]
4490i1MO4Q9J33p0q0k95N8K00l05L16l16L45p5r2J67j93o1Q2q1K19q0Q4q4r7L
4516a56L2p8K61k58N5J66M4k4m1j64R6J83N9l19Q4J42l51K21K42k23P4J09qP5
4540B21k50J44j23oj69K60k56K00k38K42r1P6k45Q7M03j67q2p0M0J79n4k96J20
4563g5P5m7M7P3P4n5p9P4k54J72l7k7Q4j08j16J91j19K06p0Mq4J43k12j31L03
4588C2j13J25n7k9QO6l13J67L6L12k59N1J02J12k86N2q1k3N2k47L78j82L14l19
4612a02L20jq7J03l03j93L80k55K71k29J34j25R9K85n27K37MJ58j30j07L01l97
4634a64K77k21j88K72J2J36j87m4P0J34j19p6j61L55k60K51M4k41L05j98m9O0
4656Hj03J24j7k1R2k39M29m68J45M8j68P4q3k5J07J28N0j85j26K86j56K05K4N6
$$ y = [-91, -87, -23, 66, 199, 129, 49, -246, -188, 12, -293, 23, -293, 52, -23, -115, 52, -141, -202, -120, -201, 18, -62, 22, -62, -159, -156, -124, -202, 59, -199, -144, 22, 66, 42, 1, -163, -67, 116, 175, -144, -60, 82, -269, -48, 194, -29, 45, 154, 146, 221, -29, 115, -8, -14, -183, 77, -179, 21, -217, 25, -66, 10, -235, -148, 255, 88, 6, -64, -24, 155, 101, -195, -75, 0, -47, 0, 73, 147, 92, 13, 87, -167, 5, -32, -59, 25, -83, -199, -8, -127, 79, 9, 13, -71, 72, -140, -271, 32, -81, 44, -13, -42, -34, 32, -281, -114, -78, 234, -25, 26, 128, 240, -46, 6, -75, -98, -46, -293, 85, -97, 217, -102, 218, 217, 130, 233, -70, -263, 117, -138, 133, -96, 38, -87, 12, 297, -230, 7, 11, 169, 39, -68, 233, -164, 113, -108, -296, -24, -12, 124, -63, -107, -37, 97, -22, -98, -259, 96, -164, 87, 131, -110, 195, -3, -52, 8, -95, 29, 12, -9, 83, -156, 273, -195, -50, -2, -170, -96, -179, -204, -97, 31, 81, -104, -230, 56, -100, 105, 129, 185]
4680A85l59J15J46j63p3J50J49k50L09k87L8J90j27k30K23J27k11O7J41Pk98J45
4702fL9j13K79k39N8k25L59j92J11N4j72K52l46J00P9Q0k02J71j94J34R0l59O2
4725a80K50j0j89K25J7m4J61m46K16j19J48j28J40j04J00J6K25j89j1j78L5L33
4747B68k95P4r0K63l67R4K03o9J70j16l0N6j98k9J29j98L15j11J07j17K1j19N3
4770A4L6k85N1K08J17j35K5j50K3K01oM2j66J57k0k83R8N5Ql5K46k31K58m16J88
4795@M0j86K7J38K28m61L02j8k63L04jl96M45K8q6j29q0K32j55o4K31k38L62k60
4819@k39R6Q8j55J63J15j7k43J61K3l2J23qo9p0m8L09l47R7LL52k64l27L75j62
4844g6O9M5R3J59p5n80J89j77O08n9k29J11J2n5j6q0J3K1L9J52j62K7Q8k3j44
$$ y = [185, -174, -59, 87, -76, -149, 1, 150, -100, 209, -78, -40, 150, 23, -207, 16, 143, -68, -1, 140, 147, -151, -6, 33, -80, 199, -40, 18, -207, 152, -40, 71, 125, -47, 205, -141, -41, 38, 118, -84, 87, -107, 27, 117, -242, -180, 70, 60, -129, 96, 113, 69, 230, -216, 0, -119, 29, -99, 41, -63, 37, 53, 278, 89, 78, -100, -65, 268, -27, 47, -43, 220, -147, -53, 150, 81, 251, 135, 105, 161, -37, -66, 63, -135, 180, 69, 176, 59, 80, -39, 14, 50, -235, -184, 24, 141, 6, 31, -119, -96, 105, 99, 141, -25, 132, 112, -171, -73, -18, -10, -45, 201, -30, 228, -188, 0, 40, -146, -119, 19, 247, -214, 88, 70, -193, 111, 110, -286, 159, 187, 101, -28, -108, 124, -31, -95, 136, -102, 260, 0, -239, -143, -55, -210, -47, 68, 51, -192, -31, -8, -40, 83, 75, 6, -64, -112, 197, -150, -53, -50, 302, 38, -289, 86, -76, -7, 38, 131, 290, 215, -365, -176, -353, 255, 196, -33, 78, 90, 35, 19, -61, -48, -27, 12, 164, 2, 29, 117, 94, -50]
4869e0J14k61J56q1L09k05J72j23J35j27j15L0J65l52L33J77k72k4Lrk6j61L13
4892A01j6j55k9K41O2k39K59l59J74j03L3K31k59M7J74j29J02j74l0R2j16K38
4914A45k73P0J42j13M3K62j51n7m8j25J12o1J94q5R0j27r3K70j70L15l72J21l11
4937b22K24L1k17M08j84J03l83J95J25l4l8j6J82j02k08J62N7O4j23M4j81J93
4959H0k68o9L52q8RP8p8J55k31j00J91J05j6r1r0j53O6N8J26M9M0k03M6K6m4K20
4985A70k20K33j13j40K16n3o7k15J76o6O9l2L2j21L13Kj59L0L3Q9Jj66m1J80j83
5010c2n1J87k14K02j07m1K76j07k32J36n3J68k27K52j95J04r5N9p6Q0r8J72j57
5033d9j04M74k02q0j46K30n8k52K71J3l21K70j33N7m3j48L68l10J42K4q8j6n4
$$ y = [-50, 64, -197, -41, -122, 187, -18, 154, 31, 166, 39, -76, -46, 119, -233, 100, 277, 5, -19, -16, -25, -51, -212, 101, 85, -70, -99, 142, 204, -35, 224, -135, 39, -64, -31, 200, -59, -12, 162, 33, 135, -39, -69, 23, -93, 145, -128, -58, 84, -29, 14, 276, 125, 68, 20, -105, 7, -54, 140, 55, 145, 18, -75, 195, 25, 340, -32, 89, -222, 2, 33, -184, 224, 40, 143, -240, -45, 80, 46, 8, -8, 174, 72, -136, 26, 83, 147, 24, 68, -113, 80, -188, -257, 95, 7, 16, 94, 16, 171, -60, -160, 31, 136, 120, 29, -61, -214, -148, -90, 36, 85, 125, -78, -32, -6, -50, 170, -50, 183, 70, -70, 146, 93, 26, -189, -13, -79, -10, -42, -10, -131, 182, 184, 25, 55, 88, 177, 178, 12, -29, 151, -32, -83, 104, -110, 92, -15, -56, 220, 113, -119, 17, -36, 132, -95, 157, -38, 66, -29, 30, -46, 34, -64, 108, -49, -153, 321, 119, 39, -107, 123, 65, -187, 84, 97, -224, 46, -87, -30, -73, -221, 147, -163, -21, 3, -85, -101, -155]
5056a55N2J73j03k39J83K4J91l17J77J12p4OR8l95O03k41j58K87l94L22j19L3
5078F6j78K19j3k77O9k0K07K9k56K32j17J77r0P1L8k68R4N7N6J3j17j63K21m8
5102Bp3l3J17k74P6J05j05J14n6K03l47M87j30J20j25j72K44j98N2J81j45k06
5124a63j6O1J54J2j41RJ60j92K95j64O0k24q1L35k72J82Q3m4j89J98K6K2N2p5
5148H8o2Pj75j18K34m6M2q5j37J89J47J73j79J43k07rj70K12k17J84Q8j94j30
5171b22R2n2K60m7k3j15J3J15j05P3l3J98k99M7K24k03M5L0j23K13k90K56m7q8
5195h1J27j17J64r8j17K68l53K48J0J27l05K75l01j5M10p1k06M7J05j14Mk6J51
5218A32j39n9K98k11o8j70M5jJ26q3J08J6j3l5j6p2K96j35J43j64LK82l1l84K03
$$ y = [-155, -103, 70, -33, -272, -89, -65, 126, -191, -14, 98, 24, 30, 128, -267, 336, 95, -63, 224, -170, 152, 33, 66, -112, 107, 94, -183, -114, -134, 73, 102, -154, 78, -39, 138, 48, 119, 157, -111, -17, 40, 96, 109, -8, -171, 50, 2, -71, -104, 13, -261, -185, -80, -185, -71, -127, 76, -271, 216, 86, 206, 81, -91, 153, -45, 7, 188, 43, -163, -179, -118, 36, 48, -93, -84, 76, -116, 179, 15, 75, -149, -230, 105, -167, 15, 98, 54, -135, 63, 89, 111, 163, 88, 26, 33, -142, -260, -26, -72, -30, -115, -252, -63, 84, 257, 78, 221, 14, 5, -165, 47, -170, 14, 102, -92, -222, -130, -182, 78, 31, 8, -107, -94, 21, -84, -11, -44, 154, -145, -98, 126, -77, -32, -2, -125, 88, -202, 54, 7, -81, 46, -71, 93, -5, -122, 146, -207, 41, 51, 178, -127, 148, -153, -168, 242, 171, -35, 12, 117, 3, 7, -19, 132, -7, -66, 232, 21, -47, -217, -172, -173, -47, -130, -22, -6, -19, -54, -70, -142, 154, 19, 162, -2, 1, 283, 252, -132, 71]
5243G1j72K1J45K21m31J47J58k03J50j2j31j04l8J74N0j89J55p9J24n5J12k26
5265a12Q0j57J96k28K17JQ7j81K8q2J60lN5kn2N3k34K04J2p5L8%J4n2L3l5n2n6
5293a43L18j04l00L06j47J46k06P1Q4l9l0L1lK8o5J0J88k52J06J24J27l83L47
5316B14k65KK5k24M03rJ47j77j64J80k07J13O4J9J3k12J47L5J68m12J86Jj08J60
5340I9n8p1J25j72P4Q6j10J00l0r8K0p3j54J70J17p3n5N05m81q7K57j11p9K11
5364A12j39J06Nj39N7n8J73r8o6O7J5K98m19J50K5n1k7l43M85q7Q7j70n5lp6J50
5390am4o5m7P2M22m37J63r8Q6k0R0qO7q0j29R1l00J63q2J10j1K72o3m12L34n6
5416A7k3J61l56N04l95K1K26k7n35L78J89k17j17K9L21l21L36m72K72j06k47L77
$$ y = [71, -101, -80, 65, 286, -145, 2, 160, -43, 107, 95, -36, -140, -178, -4, 46, -143, 12, -67, 57, 2, 114, -112, -32, -189, 7, -221, -4, -3, 84, -97, -69, -151, 9, 6, 61, 59, 7, 60, -174, 30, 42, -33, 5, 5, 19, -33, 0, -35, -87, -143, 175, 71, -229, 77, -70, 76, -130, -59, 25, -14, -44, -13, -16, 12, -53, -43, 145, -107, -1, 123, 250, -133, 214, -51, -49, -24, -248, 155, 146, 293, 116, -48, 132, -75, 38, 102, 121, 134, -78, 69, 104, 272, -140, 46, 47, -61, 99, 41, -30, 95, -77, -3, 83, -27, 73, 43, -55, -35, -108, -262, -92, 25, -48, -103, 402, -79, -166, 91, -20, -99, 112, -27, 79, 84, -55, 2, -56, 117, 19, -47, 20, 35, 333, -86, 64, 89, 38, 11, -332, 153, 66, 153, -17, -72, -75, -151, -1, -45, -110, -157, -85, 337, -100, 63, -35, 51, 31, 121, 113, 180, 100, -29, 62, -238, -75, -157, -47, -58, 214, 151, -261, 73, 17, -6, 155, -201, 303, -92, -71, 155, 128, -407, -29, 160, -57, -174, -145, 176, -145, 191, -281, -9, -115, -362, 15]
5438A5J07l25J13L50m34L22q6j9j48m3j6l6K21n9L18m10L10k54L6O4P5j63K92
5461B30k54J41l22J38M9l2j7L2L25k32k76lJ98L4P1k9mQ1m1L9j9k90n1M13k48
5486f7J57N0k75M30l05n2J99k35K31r5k05J30K01p3j85P3L6j50K17l48L29j2m4
5509GK02m67L93k33L34k8r8J3n2j7K8j64O3q2n7l5R0K36k16J91m10J66L05j56
5533A3J45k24L19l01o3K5M5m2J06K31r0j58p9Q4N2Q5k35L26k72M7j60N34m51J92
5557A29r7j14J46m3j59J77R8k00k1JL2P4M0j11L00l22M3K97n70N28J08l20J55
5580A71l32K24J20k54J12k09J76m01K97Q6N7l2K8J05k02J88j06J58j19J75m02
5601a60P8K50j56q6K59l47m1K22N4j42J51k99L49j84J54j7j13Q1p3j29K24mJ94
$$ y = [15, 122, -203, -90, 260, -174, 148, 62, 43, -105, -148, -164, -200, 21, -38, 280, -130, 180, -74, -38, 26, 101, -62, 230, -24, 117, -205, -67, -18, -50, -67, -35, 290, 58, -218, -221, -23, 11, 82, 53, 49, 130, 89, 128, 109, -181, -232, 181, -67, 90, 140, -135, 295, -10, -62, 137, -98, 133, 38, -167, -37, 164, 91, -94, -21, 15, -135, 82, -266, 63, 51, 7, 209, -258, 135, -98, 236, 208, 110, 123, 71, 54, 82, -82, -19, -101, -158, -193, -103, 133, -83, 108, -302, -136, 169, 13, 158, -66, 253, -48, -111, -86, -41, -83, 23, 254, 164, 6, -73, 11, 63, 148, -87, 239, -33, 14, -146, 388, -63, 129, 32, -82, 64, 21, -138, 39, 137, -63, -84, -83, -51, 23, 63, -48, 252, -70, -27, 270, -300, 228, 336, 16, 171, -161, 63, 183, -71, 41, -168, 8, -393, -96, -10, 47, 15, 43, 148, -54, 134, 28, 186, 67, 242, -160, -82, 168, 12, -74, 185, -162, -203, 19, 73, -69, 82, -217, 132, -52, 102, 85, -28, 53, -20, -149, 75, 71, 265]
5624B65j36j0k39Q1k2J56l4j3j57k9O5j17j53L55L7r1j7J83k16R7O1q1J44P4l57
5649a54M34j06n3j64K09k62J70j59P9l5K29j15J2L1l32J62P7J67l05M06j18l45
5671a72K14n1p6J94j13J88l54R1O2mj19K91K2ml49o4L57j8l48J14J52K72k12j84
5695a11K18J33m14P5J08q9K15k66K50j8l0P0k90J50J26k19O23o70Q4R5r2j03K43
5718H8p7j54J37J02j98K14j73J84n4j78K80k17J28k51L37q1J87k50J60k07J90
5739A67j75k7k4O8j3J39k71N7j30O06k39J6n8l02R1J6L2k03K19l56L06J05j6L14
5763C22n36K21R8P8m20L18j15q8n9M9J6K66j19k0J7k06J76j52Ok9J85j65n8J75
5787d0l8q9J94k21J63J4Oj96K66q6Q8k33J99k1J91k45N7J71q6j88K8j07J70K33
$$ y = [265, 129, 119, -120, -39, -61, 95, 61, 48, -109, -138, -73, -190, -343, 12, 49, -42, -59, 124, -92, 5, 66, -15, 129, 203, -154, 280, 174, 121, -43, 166, -96, 74, -85, -6, -41, 188, 73, 85, 116, -216, -54, 23, 190, -115, 291, 173, -172, 42, -9, -85, 109, -4, 184, -170, -79, -17, -21, -140, 151, 173, 169, -180, -244, 113, 95, -253, -139, 13, 285, 73, -111, 107, 240, -174, -99, 9, -80, 135, -131, 119, 101, 71, 141, -149, 1, 127, -92, 531, -139, -55, 40, -52, -155, 88, 11, -143, -6, 96, -102, 112, -61, 123, 69, -109, 171, -46, 82, -169, 168, 87, 274, 24, 184, -23, 167, -8, -35, -59, 9, -4, 135, -136, -79, -209, 397, 158, 174, 116, -186, -95, -79, -47, -250, -31, -387, -81, 24, 8, 322, -214, 7, 105, 183, -237, 81, -34, -122, -181, -132, -116, 150, 31, 11, 28, -178, -2, -154, -148, -177, 8, -157, -215, -40, -78, -167, 27, -194, -31, -17, -11, -207, 59, -27, 61, -172, 27, 6, 197, -48, 9, 180, 94, -94, -66, -173, -3, 230]
5811B30k02r5K42j42n9j03k57K80Q5J98o3Q3P5m18K27k9N7k73J75oj95K81r0M2
$$ y = [230, 28, -67, 175, 33, -26, -129, -386, -106, -21, 177, 114, 197, 272, -146, 81, 52, 109, -164, 11, 5, -190, 91, 1, 43]
$$ [...]
8191i8
##END NTUPLES=NMR FID
##END=
