##TITLE=1H_Pr 4-Me-TU
 200.13MHz, CDCl3,
 8 sc
 
 30.9.2025
##JCAMPDX= 6.0         $$ Bruker NMR JCAMP-DX V2.0
##DATA TYPE= NMR FID
##DATA CLASS= NTUPLES
##ORIGIN= UXNMR, Bruker Analytische Messtechnik GmbH
##OWNER= pz
$$ XWIN-NMR		Version 3.5
$$ Tue Sep 30 15:27:13 2025 Russian Standard Time (UT+4h)  she@DPX200
##.OBSERVE FREQUENCY= 200.1313
##.OBSERVE NUCLEUS= ^1H
##.DELAY= (6, 6)
##.ACQUISITION MODE= SIMULTANEOUS
##.ACQUISITION SCHEME= undefined
##.AVERAGES= 8
##.DIGITISER RES= 18
##SPECTROMETER/DATA SYSTEM= spect
##.PULSE SEQUENCE= zg30
##.SOLVENT NAME= CDCl3
##.SHIFT REFERENCE= (INTERNAL, CDCl3, 0, 14.3821)
##AUDIT TRAIL= $$ (NUMBER, WHEN, WHO, WHERE, WHAT)
$$ ##TITLE= Audit trail, XWIN-NMR		Version 3.5
$$ ##JCAMPDX= 5.01
$$ ##ORIGIN= Bruker BioSpin GmbH
$$ ##OWNER= she
$$ F:/spectra/data/she/nmr/H-C/1/audita.txt
$$ ##AUDIT TRAIL=  $$ (NUMBER, WHEN, WHO, WHERE, WHAT)
(   1,<2025-09-30 15:25:08.64 +0400>,<she>,<DPX200>,
      <created by zg, POWCHK disabled, PULCHK disabled
       configuration hash MD5:
       00 E9 B6 7A A2 85 ED C7 34 08 36 98 17 FE 4E 26
       data hash MD5: 16K
       D6 9B 8F BA B9 15 D4 60 7D D5 EE 58 FC F4 B5 E7>)
$$ ##END=
$$ 
$$ hash MD5
$$ 4E FF 77 03 95 B0 FB 25 E4 E5 90 99 A2 D5 3A C3
##$RELAX= 
##$RELAX= 
##$RELAX= 
##$RELAX= 
##$RELAX= 
##$RELAX= 
$$ Bruker specific parameters
$$ --------------------------
##$DU= <F:/spectra>
##$EXPNO= 1
##$NAME= <H-C>
##$PROCNO= 1
##$TYPE= <nmr>
##$USER= <she>
##$AMP= (0..31)
100 100 100 100 100 100 100 100 100 100 100 100 100 100 100 100 100 100 
100 100 100 100 100 100 100 100 100 100 100 100 100 100 
##$AQSEQ= 0
##$AQ_mod= 1
##$AUNM= <au_zg>
##$AUTOPOS= <>
##$BF1= 200.13
##$BF2= 200.13
##$BF3= 200.13
##$BF4= 200.13
##$BF5= 200.13
##$BF6= 200.13
##$BF7= 200.13
##$BF8= 200.13
##$BYTORDA= 1
##$CFDGTYP= 0
##$CFRGTYP= 5
##$CHEMSTR= <none>
##$CNST= (0..31)
1 1 145 1 1 1 1 1 1 1 1 1 1 1 1 1 1 1 1 1 1 1 1 1 1 1 1 1 1 1 1 1 
##$CPDPRG= <>
##$CPDPRG1= <>
##$CPDPRG2= <>
##$CPDPRG3= <>
##$CPDPRG4= <mlev>
##$CPDPRG5= <mlev>
##$CPDPRG6= <mlev>
##$CPDPRG7= <mlev>
##$CPDPRG8= <mlev>
##$CPDPRGB= <>
##$CPDPRGT= <>
##$D= (0..31)
0 0.7 0 0 0 0 0 0 0 0 0 0.03 0 0 0 0 0 0 0 0 0 0 0 0 0 0 0 0 0 0 0 0 
##$DATE= 1759231507
##$DBL= (0..7)
120 120 120 120 120 120 120 120 
##$DBP= (0..7)
150 150 150 150 150 150 150 150 
##$DBP07= 0
##$DBPNAM0= <>
##$DBPNAM1= <>
##$DBPNAM2= <>
##$DBPNAM3= <>
##$DBPNAM4= <>
##$DBPNAM5= <>
##$DBPNAM6= <>
##$DBPNAM7= <>
##$DBPOAL= (0..7)
0.5 0.5 0.5 0.5 0.5 0.5 0.5 0.5 
##$DBPOFFS= (0..7)
0 0 0 0 0 0 0 0 
##$DE= 6
##$DECBNUC= <off>
##$DECIM= 32
##$DECNUC= <off>
##$DECSTAT= 4
##$DIGMOD= 1
##$DIGTYP= 9
##$DL= (0..7)
0 120 120 120 120 120 120 120 
##$DP= (0..7)
150 150 150 150 150 150 150 150 
##$DP07= 0
##$DPNAME0= <>
##$DPNAME1= <>
##$DPNAME2= <>
##$DPNAME3= <>
##$DPNAME4= <>
##$DPNAME5= <>
##$DPNAME6= <>
##$DPNAME7= <>
##$DPOAL= (0..7)
0.5 0.5 0.5 0.5 0.5 0.5 0.5 0.5 
##$DPOFFS= (0..7)
0 0 0 0 0 0 0 0 
##$DQDMODE= 0
##$DR= 18
##$DS= 0
##$DSLIST= <SSSSSSSSSSSSSSS>
$$ [...]
##$SUBNAM0= <"">
##$SUBNAM1= <"">
##$SUBNAM2= <"">
##$SUBNAM3= <"">
##$SUBNAM4= <"">
##$SUBNAM5= <"">
##$SUBNAM6= <"">
##$SUBNAM7= <"">
##$SUBNAM8= <"">
##$SUBNAM9= <"">
##$SW= 18.0517328524113
##$SWIBOX= (0..15)
0 0 2 0 0 0 0 0 0 0 0 0 0 0 0 0 
##$SW_h= 3612.71676300578
##$TD= 16384
##$TD0= 1
##$TE= 0
##$TE2= 300
##$TE3= 300
##$TEG= 300
##$TL= (0..7)
0 120 120 120 120 120 120 120 
##$TP= (0..7)
150 150 150 150 150 150 150 150 
##$TP07= 0
##$TPNAME0= <>
##$TPNAME1= <>
##$TPNAME2= <>
##$TPNAME3= <>
##$TPNAME4= <>
##$TPNAME5= <>
##$TPNAME6= <>
##$TPNAME7= <>
##$TPOAL= (0..7)
0.5 0.5 0.5 0.5 0.5 0.5 0.5 0.5 
##$TPOFFS= (0..7)
0 0 0 0 0 0 0 0 
##$TUNHIN= 0
##$TUNHOUT= 0
##$TUNXOUT= 0
##$USERA1= <user>
##$USERA2= <user>
##$USERA3= <user>
##$USERA4= <user>
##$USERA5= <user>
##$V9= 5
##$VALIST= <valist>
##$VCLIST= <CCCCCCCCCCCCCCC>
##$VD= 0
##$VDLIST= <DDDDDDDDDDDDDDD>
##$VPLIST= <PPPPPPPPPPPPPPP>
##$VTLIST= <TTTTTTTTTTTTTTT>
##$WBST= 1024
##$WBSW= 4
##$XGAIN= (0..3)
0 0 0 0 
##$XL= 0
##$YL= 0
##$YMAX_a= 383637
##$YMIN_a= -940698
##$ZGOPTNS= <>
##$ZL1= 120
##$ZL2= 120
##$ZL3= 120
##$ZL4= 120
##$ABSF1= 10
##$ABSF2= 0
##$ABSG= 5
##$ABSL= 3
##$ALPHA= 0
##$AQORDER= 0
##$ASSFAC= 0
##$ASSFACI= 0
##$ASSFACX= 0
##$ASSWID= 0
##$AUNMP= <proc_1d>
##$AZFE= 0.1
##$AZFW= 0.1
##$BCFW= 1
##$BC_mod= 2
##$BYTORDP= 1
##$COROFFS= 0
##$CY= -3
##$DATMOD= 1
##$DC= 2
##$DFILT= <>
##$DTYPP= 0
##$F1P= 0
##$F2P= 0
##$FCOR= 0.5
##$FTSIZE= 0
##$FT_mod= 4
##$GAMMA= 1
##$GB= 0.15
##$INTBC= 1
##$INTSCL= 1
##$ISEN= 128
##$LB= 0.25
##$LEV0= 0
##$LPBIN= 0
##$MAXI= 10000
##$MC2= 0
##$MEAN= 0
##$ME_mod= 0
##$MI= 1.114404
##$NCOEF= 0
##$NC_proc= 0
##$NLEV= 6
##$NOISF1= 3.799351
##$NOISF2= 2.8
##$NSP= 1
##$NTH_PI= 0
##$NZP= 0
##$OFFSET= 14.38212
##$PC= 1
##$PHC0= -1555.152
##$PHC1= 4.19226
##$PH_mod= 1
##$PKNL= yes
##$PPARMOD= 0
##$PSCAL= 0
##$PSIGN= 0
##$REVERSE= no
##$SF= 200.129724274929
##$SI= 16384
##$SIGF1= 3
##$SIGF2= 2
##$SINO= 400
##$SIOLD= 16384
##$SREGLST= <1H.CDCl3>
##$SSB= 0
##$STSI= 0
##$STSR= 0
##$SW_p= 3205.1282051282
##$SYMM= 0
##$S_DEV= 0
##$TDeff= 0
##$TDoff= 0
##$TI= <>
##$TILT= no
##$TM1= 0
##$TM2= 0
##$TOPLEV= 0
##$USERP1= <user>
##$USERP2= <user>
##$USERP3= <user>
##$USERP4= <user>
##$USERP5= <user>
##$WDW= 1
##$XDIM= 8192
##$YMAX_p= 0
##$YMIN_p= 0
$$ End of Bruker specific parameters
$$ ---------------------------------
##NTUPLES= NMR FID
##VAR_NAME=  TIME,          FID/REAL,        FID/IMAG
##SYMBOL=    X,             R,               I
##VAR_TYPE=  INDEPENDENT,   DEPENDENT,       DEPENDENT
##VAR_FORM=  AFFN,          ASDF,            ASDF
##VAR_DIM=   8192,          8192,            8192
##UNITS=     SECONDS,       ARBITRARY UNITS, ARBITRARY UNITS
##FACTOR=    0.0002768,     1,               1
##FIRST=     0,             0,               0
##LAST=      2.2672688,     0,               0
##MIN=       0,             -940698,         0
##MAX=       2.2672688,     383637,          0
$$ Real data points
##PAGE= N=1
##DATA TABLE= (X++(R..R)), XYDATA
0@%%%%%%%%%%%%Qj6J6k0K8l8M6n6P0q2J00j20J38j62J90k22K58k97L42l91M45
33B37n07N76o52P34q24R26j037J158j291J435j593J767j955K160k385K632k903
50a522L197l519L876m272M712n202N751o372P083p904Q861j0000J1378j3087J5279
65H259j8200K2315k8646M0083j02659M62485l3752j70003J16602l32254m72862
76e08632M7599M63591k81645j4794M20217j03278j26243J18537Q1757k49329j44112
87b96332L46486m5675o341J87178q5127j04304j59568K5115N1136J0858K39978
98A63404N0231P8764j07426l03419K1422o3443J2195K06734J75293j7409k71638
109e5292J07070q182k67882J97982J47406j01966l3864K44650R3002l60271P2583
$$ y = [0, 0, 0, 0, 0, 0, 0, 0, 0, 0, 0, 0, 0, 8, -8, 8, -12, 16, -22, 24, -32, 38, -44, 56, -64, 74, -88, 102, -120, 138, -159, 183, -208, 237, -270, 306, -346, 388, -436, 490, -547, 611, -680, 755, -838, 929, -1026, 1134, -1251, 1381, -1522, 1675, -1844, 2032, -2240, 2472, -2730, 3021, -3351, 3732, -4172, 4689, -5311, 6067, -7020, 8259, -9941, 12374, -16272, 23811, -78848, 383637, 349885, 179882, 296484, -35770, -508632, -461033, 2558, -279087, -293881, 126336, 23058, -103185, 15352, 97109, -152220, -296332, 50154, 4479, -1862, 185316, 100189, -4115, -163683, -138568, -87432, -76574, 163404, 213635, 292399, 184973, -118446, -97024, -160467, -148272, 58462, 233755, 216346, -55292, 51778, 43596, -224286, -26304, 121102, 19136, -14728, 229922, 322924, -37347, 35236]
120C5236P5450l17788P8450L03394P6568k01886O1397J11250l68632K7404K52427
131A33270j02569o0962J05086R4805k53992q5619J61607j87043K5538K44072R8223
142A72416k2618r2391J2679k09220j21032J50303O869J15774Q2538K5087J6699
153A37104j43213m4949q5510R988Q8867k725J86938r448j37271R993n6397n4315
165a00938n0174J69077J00881j11244J78037J9869k28112q7915K3903J5520o6328
176a37424K45200J72797k23197m926Q472j53452p5153J31993J54269j25065R3331
187H6845J40032j97150o9591J8265k3623o1640Q6302K05442q9567k3614L4174
198A05875j47584n9119m271Q4923K9026J8230J13313p4442m6663m8152q6303M9004
$$ y = [35236, 110686, -207102, -128652, 174742, 251310, 49424, 110821, 222071, -146561, -119157, 133270, 30701, -30261, 74825, 169630, -84362, -169981, -8374, -195417, -169879, 74193, 172416, 149798, 57407, 70086, -139134, -260166, -109863, -102994, 12780, 95318, 120405, 137104, -6109, -51058, -136568, -126580, -37713, -40438, 146500, 137052, -219, 9774, -46623, -100938, -151112, 17965, 118846, 7602, 185639, 205508, -22604, -110519, -86616, -71096, -137424, 107776, 280573, 57376, 52450, 60922, -92530, -167683, -35690, 118579, -6486, 86845, 226877, 29727, -39864, -21599, -45222, -106862, -20560, 184882, 95315, 71701, 105875, -41709, -100828, -105099, -20176, 8850, 27080, 140393, 65951, 19288, -28864, -115167, -66163]
210f6163K750R1535Q5593m119j7026j15237J007m7134m6166J46412K8600P977
222F8029J4537j2907o6235j41082P5755K4180l5122J39619L9303m6036q0636r159
234b9754j5093j13590J12106Q1129k9765O5616J4595l2806j19893j9176M1848
245d4783o2613J11504R6060j4253j9216o5899k1941q6009J6499J04423m067P0331
257H0036J7870l1377m4177q4626J5780l0165L6299R9311P054L6067n2086n6037
269f051l9053o0289O0358K3103N2031N4875l3250J815p3791l3673K728j4108Q3742
282A8437K5200L7552J3924o3622j5348p0320l583L5626J8764Q7656J373j546l9637
295D4476q8747j0766l2486N2863O6019K0691M3404n9419l4063l5165m2903M2078
$$ y = [-66163, -63413, 28122, 113715, 109596, 92570, -22667, -21660, -68794, -114960, 31452, 60052, 68029, 82566, 69659, 3424, -137658, -61903, -37723, -72845, 66774, 106077, 60041, -20595, -29754, -44847, -158437, -46331, 34798, 5033, 70649, 85244, 52438, -67455, -86631, -44783, -107396, 4108, 100168, 85915, 66699, 800, -21141, -107150, -90651, 13772, 9705, 80036, 97906, 66529, 22352, -62274, -46494, -76659, -40360, 58951, 66005, 102072, 49986, -6051, -45104, -105393, -45035, -21932, 30099, 84974, 51724, 53539, -20252, -53925, -51197, -65305, 18437, 43637, 81189, 95113, 31491, 16143, -54177, -57760, -22134, -3370, 84286, 85659, 84113, 44476, -44271, -55037, -87523, -34660, 31359, 52050, 95454, 36035, 1972, -33193, -76096, -34018]
307c4018N458N0212K2997o322K6588o8250k2139j6644k9310M3647L2337P4227
319G8783l759l9829l756j00445k3728L8785M1091N0457J1496M1413p1143p5614
331e6249L3057l1699R375N1796M8594m878m9232M0984n3479p0660M9337R235J3109
344a0710L2210O4419j642q5902J2227m4374n5605N3579N1313M4069r819R151k3101
357C5815q7783J7960Q787J4347M3954L073J6662m1470l0221j6687k8402L6522
369b7443J310M7862N7344l4304n886k7920m2648m2178J4175Q1789j6279L1355
381C7177O0650o5117n3831r80J8392l6730K1694J07377m6621l9537L8174m2507
393a859o5010L346P9082j4631r732R9262l5714p6462J050l782l4710p772R8641
$$ y = [-34018, -28560, 21652, 44649, 38327, 64915, -3335, -25474, -42118, -71428, -27781, 4556, 78783, 75024, 35195, 31439, -69006, -92734, -53949, -12858, 37599, 49095, 90508, 19365, -56249, -23192, -54891, -45516, 6280, 54874, 49996, 764, 41748, -11731, -82391, -33054, -23819, -10710, 21500, 85919, 84277, -1625, 10602, -33772, -89377, -35798, 15515, 59584, 49765, 58916, 35815, -51968, -34008, -25221, -10874, 33080, 36153, 52815, 11345, -18876, -35563, -63965, -27443, -26133, 21729, 79073, 44769, 38883, 10963, -31685, -73863, -59688, 22101, 5822, 37177, 97827, 32710, -21121, -22101, -3709, -40439, -18745, 88632, 42011, 2474, 40648, -1859, -66869, -63523, 15559, 928, -8804, 90458, 54744, -21718, -20668, -24450, -59160, -66932, 31709]
406C1709J4489m3004M0126k9429n7284j3455L0396K9156q762N7375P371m9403
418I285j0420l9005r345m14K2007N3831J1952J6712k9432k9289j2271n6028K6861
431d5556M4958N611J6055J3344n45p4063q951M7667l8152K2189O9167K903m7880
444F747j1390K4348p9759j5978R0342m299o398M8160K0934p2774m7372N1768l9611
457c5282k2635Q8479K6384k7706q704J7974n1990n3747O1220J2150m110M6866
469D8899J1794k4996m5077l784j4099j8119M8793J8028K0061J2144l5515j5760
481B369k6162j5940P4L3972M5018k4951J8305R745p2807k1662K4241P537j4988
494c5249N0513N4698p1111j5444K9646n7012l0493N4967N0578l6260J6682N5622
$$ y = [31709, 46198, 3194, 43320, 13891, -43393, -56848, -26452, 2704, -6058, 51317, 58688, 9285, -1135, -40140, -49485, -49899, -27892, 25939, 37891, 54603, 25171, -4118, -16389, -72417, -45556, -598, 5013, 21068, 34412, 33867, -40196, -49147, -1480, -39632, -17443, 51724, 54627, 6747, -4643, 19705, -60054, -76032, 14310, 10011, 3613, 51773, 72707, -67, -47439, 4329, -35282, -57917, 30562, 56946, 29240, 20536, 38510, -13480, -67227, -6007, 6143, 2033, 48899, 60693, 35697, -9380, -13164, -27263, -45382, 3411, 21439, 41500, 53644, 18129, 2369, -23793, -39733, -39659, -5687, 39331, 14380, 32685, 42430, -30377, -52039, -27798, -20261, -35249, 15264, 69962, -1149, -16593, 13053, -43959, -74452, -19485, 31093, -5167, 11515, 67137]
506F7137p7937m7461L9458m054k2709M0722O9599l7570l0629L4992m8176m2905
518e9533K6979L2806L096O945M3603k6331m4266L523j7966J879J7924K9298K4704
531D2661j2854p153k9433j9208n321j0630M6474K6436m352J2121p003l1712m2331
544d2305K1152K0439k1070M7430L3851l3445k5150N555r898m5463L8110N4524
556D3730k8019R382K3920l4765n4914M764K9518k9655K6549O0060k2470k6867
568A233N41j0183m1125K881N3538n984L290K8536j7546l1833j6150J2773k661
581b2690P188M4075L456o513r396k6578j5157j6247J3717K1556J9274J9986j2652
594B0019l564k2018l3720Q606J1170J2203J4536K2158o49m0858N23j729k3426
$$ y = [67137, -10800, -58261, -18803, -22857, -45566, -4844, 64755, 27185, -3444, 31548, -16628, -59533, -32554, 252, 3348, 10293, 53896, 27565, -16701, -13178, -31144, -29265, -11341, 17957, 42661, 29807, 22654, -6779, -25987, -31308, -41938, 4536, 30972, 26620, 38741, 31738, 26, -42305, -21153, -714, -21784, 25646, 59497, 26052, 902, 6457, -3441, -48904, -10794, 43730, 15711, 25093, 49013, 14248, -40666, -35902, -6384, -36039, -9490, 50570, 28100, 1233, 1774, -8409, -49534, -46653, 6885, 901, 4191, 32727, 15181, -16652, -32802, -20029, -22690, -15502, 28573, 32029, 25516, 16120, -10458, -25615, -41862, -28145, -6589, 12685, 32671, 20019, 16455, -5563, -39283, -30677, -19507, -7304, 7232, 29390, 28741, -12117, -11594, -13323, -36749]
607c6749K1287L5433J3192j3157Q282m494n4266l98K3047k723J5163L1253J1447
620D7317l7782j2701L817l4936N782L3575J3397R61J758J211l8144j8121J3553
633b0313m361J7844K4593J2554m864j9692r618k3682m668J7085J1361K7648O883
646C0770o333j0196k2761j1336o418J8661J8059K530J8830r866k5603j2947p468
659b4078N50K270L0610J6965j2915L423j5377k6022j0757J0565K0197N500K5164
672B6095R259k6557j3279j2561q186J929K0865K7805k993K300o395k7519j2303
685b1540l641J2962J1345J4790J7771j3318j2802j3792j6155k32O985K3245J2480
698A8098L115J686k2331j5328j0089q6J5709J1790J9700J539j1086j0154k0850
$$ y = [-36749, -15462, 19971, 33163, 20006, 28288, 23794, -30472, -30870, -7823, -10546, 4617, 35870, 47317, 9535, -3166, 651, -34285, -28503, 5072, 18469, 19430, 21188, 22399, -15745, -33866, -20313, -24674, -6830, 17763, 30317, 25453, 5761, -3857, -27539, -32207, -15122, -3761, 23887, 30770, 24437, 14241, -8520, -19856, -26274, -7613, 10446, 12976, 31806, 21940, -3663, -16610, -24078, -23528, -21258, 9352, 26317, 13402, 16825, 1448, -24574, -35331, -24766, -4569, 931, 26095, 35354, 8797, -4482, -17043, -25229, -23300, -2435, 25370, 22377, 24677, 18282, -9237, -21540, -25181, -12219, -874, 13916, 31687, 18369, 5567, -8225, -24380, -24612, -17627, 5618, 18098, 21213, 22899, 568, -14760, -24849, -24935, -9226, 2564, 22264, 23803, 12717, 2563, -18287]
711a8287n253K460J3096K0016O537P755j1903j9166j0087j0715Q319J2107J8460
724A3339J4629p386n789j8455j6995j854M672J9480J2108J0364J251j8570j0895
737d101j3771k037J0817J1518J8800K604m039j1311j9259n283m442J0746J8906
750I148P405O199q476j2765j7482j1140J0483M768J3609J8394j906j0929j4835
763g527o197j1419l52K6243R524L157P404p241k0275j6136P650K518K922K7103
777A7374P386j0524q959p476j4101j1753J8917J4268J350J4388j816j6237j6471
790a3654m545J908M85K0753J3304j446j903j3966j1364p525K001J2951J1083J3450
804B1532l458o582n872k0201l216J0203Q527Q506J1980Q062k1017j4198K134j5199
$$ y = [-18287, -23540, -21080, -7984, 12032, 18569, 26324, 14421, -4745, -14832, -25547, -17228, -5121, 13339, 27968, 20582, 14793, -3662, -20657, -22511, -17839, 1641, 13749, 24113, 25364, 6794, -4101, -17872, -19909, -9092, 2426, 21226, 23830, 19791, 8480, -10779, -16062, -20504, -9758, 9148, 16553, 22752, 14276, 1511, -15971, -27111, -16628, -11860, 1749, 20143, 18237, 7308, -7527, -13724, -25143, -25495, 748, 10272, 13429, 20833, 13592, -6683, -22819, -15169, -12651, -9729, 17374, 24760, 14236, 5277, -2199, -16300, -28053, -9136, 5132, 6482, 20870, 19054, 2817, -13654, -18199, -16291, -15806, 4947, 18251, 16805, 14902, 936, -10428, -17953, -15952, -3001, 8082, 21532, 18074, 11492, 5620, -14581, -17797, -7594, 933, 9439, 21419, 29481, 8464, -5734, -3600, -18799]
818a8799p83K1769J5778m800r90O045k6306j8340J5000L689J36J6673J6535j6185
832I422j8673O527j2633j2228K0174J8302O48k96Q418j4863k4543M220L533l71
846a2363J3601J5491J202j4119m443p770j2814O416J1013J1162N791k448l639
859G080j3866j0163k899P748J4114M235J1616M081j6685j2695l263j987l982J6259
873d07K1456q345m061M196j7006j7528Q414J6981m490P285K0754j5490k1302K256
887g287k261j2636R200K8313j335p040J1705j2139k3114j150J1475n51M381K2227
901A9788j822j6352j853n681q231L050J5616Q527p59L601r518j3411n196m785
915a7026O770J0998P422N048Q06o502j8175l927L828m976J0471J8353J73j0166
$$ y = [-18799, -19582, 2187, 17965, 13165, 12175, 18220, -8086, -26426, -11426, -7737, -7601, 9072, 25607, 9422, -9251, -2724, -15357, -27585, -7411, 10891, 11539, 11243, 19661, 4798, -19745, -15525, -11992, -12363, 1238, 16729, 17931, 3812, -631, -8401, -21215, -14799, -3786, 7376, 13167, 10719, 7080, -6786, -16949, -19848, -12100, 2014, 6249, 17865, 21946, 5261, -7434, -10697, -12684, -16666, -407, 21049, 12704, 8643, 12839, -4167, -21695, -13281, 3700, -790, 6495, 27249, 11759, -9543, -7287, -9548, -22184, -12984, 15329, 13994, 6954, 18659, 6520, -16594, -17744, -6269, -6820, -2439, 19788, 17966, 1614, -239, -5920, -14151, -11101, 4515, 13042, 12283, 15884, 6366, -7045, -12241, -17026, -10256, 742, 8164, 13212, 14018, 7516, -10659, -14586, -10758, -15734, -5263, 13090, 13263, 3097]
929C097m91l100k0006M296K0401l06J928J3618l583k2529m567P878j1638L352
943a1650K3742K663q202J678r14j9894o704J4562N95J881J3775J648j2446q994
957h260K10n767K49J5328P534K016o46p125q422q896M67N022R124Q806Q39K075
973A2554p491j3717k271K114K072N674J2801L243j2456j788l349j1953J548J3660
987F41P404j905P068J234j8854n314M684k405J253J3956R745r068l552J440j3629
1002g302n654Q738P259P98N157N761j1679j0472P90l867j05Q987J0285K61m115
1017D842j321r689p892K098M305P719N770M725k097q709n371n436J488N693O282
1032B407Q511O58m643o896o602l158q59Q269Q125J586K248l911q631p912m93L801
$$ y = [3097, 2606, -494, -20500, -16204, 4197, 3891, 5819, 19437, 15854, -6675, -11242, -3364, -15002, -11650, 12092, 14755, 6553, 8231, 7317, -12577, -19281, -4719, -4124, -2243, 11532, 13180, 734, -8260, -8050, -13817, -13568, 1760, 9294, 11310, 10664, 3539, -4883, -13779, -13312, -8290, 834, 9640, 10479, 12554, 5063, -8654, -10925, -8811, -6739, -1065, 11736, 14979, 2523, 735, -2614, -14567, -13019, 641, 8045, 6140, 13208, 14442, -4412, -9726, -5042, -7447, -6194, 7762, 17507, 8439, 4887, 6327, -7302, -12956, -4218, 3041, 3839, 8996, 14757, 3078, -7394, -6604, -10471, -10576, -1589, 8696, 8957, 4842, 3521, -6168, -14060, -11962, -7657, 62, 5832, 10557, 8460, -249, -5620, -11056, -9568, -3875, 2407, 10918, 11576, 6933, 37, -6565, -9723, -10582, -2313, 5812, 7398, 9646, 5735, -2896, -10808, -11301, -7500]
1048g500K441Q893O100l409m695n392m886l369M101Q978L054M245J356o288o950
1063c321m136J037J279O347R040L95j901l672o702n608m83O252M861M567M641
1078A2596m239p061o252l105l18L200R665L550j020j020p095p431l501L788N286
1093b957L953Q005j16o696m994m381k453P11Q796P087K60J817m208q214n048J76
1109h262L685L775P072L833l846m292n681m864r57K985P614M141K302j207n572
1124G26m525n190O95N275M160M822K766j604p368n351P96k397L226R421M266k660
1140G058k183k074r544n330P872L449J381P043L881q419q326J581l679m191J0764
1155g17Q739k349j036K184p694j0975N545M812j364P171Q070m590q819k78k383
$$ y = [-7500, -5059, 3834, 9934, 6525, 1830, -3562, -8448, -11817, -7716, 1262, 4316, 8561, 9917, 3629, -3321, -7457, -6420, -5141, 1206, 10246, 10641, 8740, 5068, -1634, -7242, -7725, -1473, 3388, 7955, 12596, 8357, 1296, -4956, -8061, -8379, -5179, 4486, 8036, 7016, 5996, -1099, -8530, -12031, -8243, -2957, 996, 9001, 8885, 2189, -2805, -7186, -9639, -8928, -132, 6955, 7215, 9032, 4824, -3390, -8438, -8262, -4577, -802, 6270, 10103, 6257, 1965, -3716, -8580, -9537, -6552, 1062, 5203, 7505, 6298, 726, -3799, -8989, -8294, -3019, 1141, 5963, 8729, 7125, -243, -5594, -4798, -7195, -3969, 5452, 9718, 7058, 4875, 2801, -6743, -12073, -4201, -752, 629, 7672, 11553, 3134, -5192, -3611, -7290, -11481, -717, 8022, 5673, 4637, 6821, -873, -11848, -6303, -1491, -2855, 4316, 12386, 7796, -1023, -1301, -3684]
1170c684o822N535R112J491M13J136m068q996k331L034J007N597M928O36k435
1185D553o436l974j961J628K817O438O803l056m307p1p158o071N447P624o70L168
1201D774Q237q335j0558L365p51n889O483J2237l718n716N545o591j2035M784
1215h168Q297k092K591J0685l983j1681J441j361o321M047J0951J428k029K660
1229F465m104r165l94K168K108M790N013J67l237m266o091j502L726J076N940
1244B694O887j920n892j461k783p507L540R953l24K41O684m148j1708K35M719
1259g90m634K615J2875n90p606J028q15j1028q96J1611J057j154P849L5j1395
1274a838m053K509l053q33J0554M577m343n84j501o737m960M640M916J436M947
$$ y = [-3684, -10506, -4971, 4141, 5632, 6045, 7181, 3113, -5883, -8214, -5180, -4173, 1424, 6352, 6988, 4553, -1883, -5857, -7818, -6190, -3373, 3065, 9868, 6812, 2505, 2434, -4724, -10795, -5348, 2276, 1606, 4774, 13011, 4676, -5882, -2517, -3268, -9157, -2674, 9563, 5845, 129, 5674, -917, -12952, -8168, 129, -1963, 628, 11313, 7330, -4351, -2910, -4271, -10592, -6545, 4406, 5834, 3805, 6465, 2361, -6804, -7198, -5030, -2922, 1868, 6881, 7048, 3811, -455, -6546, -8048, -4322, -3246, 2694, 9581, 7661, 1769, 308, -2475, -9982, -6442, 3511, 3187, 3428, 10112, 5964, -5744, -5509, -790, -5424, -2809, 10066, 9476, 1870, 2898, 2083, -8945, -9841, 1770, 2827, 1673, 9522, 9557, -1838, -5891, -3382, -6435, -7268, 3286, 7863, 3520, 2936, 1435, -5302, -10262, -5622, -706, 730, 5677]
1289E677J381l920n348m281p88J552L490N770M027m94n769k930k246n053K493
1304f439P995K805j575L363j612j0553k831N294o32O85R612L554q368k271K009
1319A036q438l061J0494M740k701M187L936j0719o742M997p44j719Q815O505m575
1334F011l517R70o656n707N620M669J113L400K374m715o848j091j504Q2N199M410
1350C810K304p68l852m349k962j060J449O030N025r83O0j263o955m139L333L047
1366a273J3O115M303o075m457M6m021k857O593O306j496R26J997p244o570K028
1382e666J800K73N476O006k590m321j357l978l513L270N509K375J594J720l819
1397B779n435j798p41J677L751M823J030j251l063m827k152M2J601M616L834N10
$$ y = [5677, 7058, 3138, -2210, -6491, -7279, -5727, -2237, 3533, 7560, 7066, 1297, -1633, -3879, -8932, -6439, 1556, 4361, 2786, 6149, 4537, -6016, -8847, -3553, -4185, -3500, 6112, 9666, 1298, -973, 1036, -7402, -10463, 31, 4771, 2070, 6257, 10193, -526, -7268, -2271, -3015, -4734, 4081, 10586, 6011, 2494, 3464, -3192, -8899, -3279, 1390, 2503, 5903, 8277, 3562, -3286, -4377, -5881, -5799, -600, 3810, 6114, 5346, 1494, -2855, -5817, -6877, -5428, 602, 5627, 4644, 4704, 3441, -3514, -7653, -4320, -1273, -1260, 4855, 9158, 3083, -1374, -1328, -5349, -8206, -1613, 4693, 3197, 4123, 6120, -1124, -7694, -5666, -3866, -3593, 1883, 7889, 5299, 978, -379, -4357, -7870, -4600, 909, 3284, 4878, 6598, 2779, -2656, -4454, -5195, -3518, 233, 5056, 6086, 4835, 1772, -3055, -5207, -5165, -3564, 1052, 4886, 5396]
1413E396j516k687m506l313J646L262K509M053J606k824m875k248j134o91M186
1428a136N454J345n15j506l927m999o28L073K121L707L770j237m048l166k215
1443c907k175J973M904K700J261j79k971m832k128Q58K167L299L936J147j933
1458D120l405l066k467K12L488L769K164R79j778m087l920r71Q82K095M243K390
1474D648o24k238l335l065k061K385L312K797K545K65l474m147j657m84R83M167
1490A7L729Q57o52k183l843k911J43K670K861L267J440j516l185l767j428p1K680
1507a892L395K737Q67k030l673j752k316M89L562L572J381M04q65m278l630N45
1523c484J335J531L728L104j704l181j047l026k504L000M030L60J360J269l320
$$ y = [5396, 3880, 1193, -3313, -6626, -4980, -1718, 791, 4844, 6450, 3626, -1249, -3497, -4631, -5322, -1136, 4318, 5663, 5148, 3642, -285, -5284, -5912, -2839, -718, 2989, 6759, 5522, 1474, -1692, -3907, -6082, -4109, 795, 3495, 4756, 4577, 1606, -3226, -5354, -4496, -2329, 970, 4906, 6053, 4120, 715, -2351, -4818, -4606, -1118, 2651, 4815, 5794, 4016, -71, -3991, -4962, -4080, -1985, 2258, 4648, 4024, 1786, -1549, -4614, -6675, -4290, -978, 1819, 4364, 4629, 1155, -2992, -4649, -5133, -4150, 17, 3746, 4603, 3951, 1768, -2075, -4986, -4843, -2173, 688, 3955, 5395, 3879, 694, -3073, -4501, -4572, -1892, 1503, 4240, 5107, 3077, -596, -2348, -4664, -4175, -613, 2959, 4340, 4744, 3879, -399, -4029, -3484, -2149, -618, 3110, 6214, 4510, 1329, 282, -2744, -5248, -2248, 1782, 2142, 3502, 4771, 1451]
1538A451m918j75L39k38L147L968J83k258r26k694l382R31L273J868K132J503
1554D204r96l529k538o41k2K355K912K121J95k027k740k283j105K30K589L787
1570B512O80n58o34l098l997P02K456N55K340L949j687m175m30o89k526J454N351
1587B205J551j557J984j364n649o66K864K78K88M734J082m463r37J80l676p41
1603c887M222K296j014J761k68m228k720O18K54J058K952K276r19j756j884j790
1619c029o08N70K535K739J297r46o66j807l619Q0L320Q53O14L219j65n255p72
1636a640P59k564K5N654J213k637J308Kn517j831M230N85j235M596J819n150j503
1653a886J257k494j153N094K036j370R17N27l799k706J674P29L04K763J950j273
$$ y = [1451, -3467, -3642, -3303, -3541, -394, 3574, 3757, 1499, 573, -2121, -5503, -4572, -1299, 569, 2701, 4204, 3208, -321, -2859, -3500, -3522, -1167, 1745, 3866, 4061, 2034, -706, -2989, -4094, -3864, -1275, 2512, 3192, 2634, 2000, -1098, -5095, -4393, -1937, -1382, 958, 4907, 3220, -955, -1385, -2074, -4600, -3146, 2205, 3756, 2199, 4183, 2819, -2830, -3496, -632, -354, -66, 4668, 5750, 1287, 350, 530, -3146, -3887, 335, 2631, 1617, 3378, 3110, -1118, -3838, -3220, -2966, -1908, 1044, 3320, 2401, 645, -1239, -3029, -3637, -3067, -532, 2207, 3504, 2558, 1892, 85, -3534, -3454, -134, 719, 1333, 4552, 4387, -868, -1640, -881, -3445, -3420, 2234, 3447, 810, 2118, 2120, -3397, -5228, -998, -413, -1648, 2948, 4767, -383, -1886, -629, -3123, -4276, 818, 2854, 1484, 2401, 2928, -871, -3577, -1903, -1174, -870, 1893, 3843, 2570]
1669B570j927j375j655n34R81J662K124P97j147j199j158k371k86K790J545K18
1685A035K001J39l373j996J080q93k95L898K495k430n85R72l782k493L105J669
1701E47o19J983J946l201k723Q42p00j446K774L401o70q69P27j975l076Q66J672
1718e21L59J645J828p73j969r46q78q93R43J686J600K85o34j717j182j343n56
1735c066J621K215J54M82M91k481k477O35R40p17K242K890j233j728O48j377k808
1752c569J451L411q69M26K517j498l762K87R25j907J584L563o9j897O18p32l113
1769b634J4K090N69N10J928k88j995j003m82n69Q04K017J207K07o16j135j457
1786h33n78j52R58J958M60R5k16j150k319m6J002O0J345J764m40j986j79k96k466
$$ y = [2570, 643, -732, -2387, -2921, -1940, -278, 1846, 2643, 1496, 297, -861, -3232, -3518, -728, 817, 1035, 3036, 3175, -198, -2194, -1114, -2007, -2302, 1596, 4091, 1661, 1076, 2048, -1734, -4227, -1122, 547, -72, 1911, 3857, 656, -2067, -1225, -1925, -3371, -597, 2804, 2134, 1265, 1992, 17, -3059, -2193, -521, -162, 1483, 3311, 2538, 569, -377, -1255, -2148, -1205, 481, 2081, 2366, 1732, 15, -1167, -2510, -3066, -1445, 770, 924, 1406, 1897, -584, -3061, -2426, -1486, -2203, 39, 2929, 1696, -32, 616, -761, -3569, -2118, 1293, 424, 850, 3367, 1869, -1893, -1606, -681, -2588, -1004, 2559, 2490, 593, 1211, 479, -2634, -2620, -530, 39, 549, 2477, 2189, 194, -809, -1291, -1860, -1056, 961, 2168, 2375, 1759, 624, -833, -1411, -1563, -605, 1353, 1813, 1908, 1692, 542, -1777, -1823, -821, -761, 584, 2348, 1908, -78, -257, -553, -3019]
1805c019J044K660j87K72J342o02l123j94P21o45N29K466R85j779j03n43k185
1822b361J61J704P31M71J191l95j431j148k28n36M04K050P85j37j84j071j319
1839a313o24K83Q57J380J014Q3n98r37j261o47P48R53Q31J254J87j354r19p05
1857g68q82L94J783R95n6L80o42j829j370N03L23L71J801J002j033o38p93j003
1875a462n34J259J383M98L92j13j047j540m02K25P20J336Q68R1n19j121j115m14
1893a495L86Q18Q12R24M32q62j110j274n99N11J034J444M96K9j090q89r14l50
1911a697L46J223R11N05o1q14q08r75j66O85J250J241k39j29r27q95j110L40O61
1930f59J102Q98O9l20j068j205l49O7P10J245O97K63q52p58p50q75P21R01R78
$$ y = [-3019, -1975, 685, 498, 770, 2112, 1510, -1613, -1807, -1086, -1731, -1202, 1264, 2249, 470, 367, -176, -2361, -2200, -496, 235, 706, 1897, 1502, 71, -1077, -1305, -1841, -1437, 613, 1398, 1261, 1077, 6, -1313, -1937, -1654, -797, 583, 1597, 1680, 1082, 145, -1116, -1763, -1015, -62, 769, 2023, 2210, 856, -63, -768, -1650, -1256, 527, 1522, 1466, 1846, 1204, -625, -1995, -1492, -1169, -798, 1003, 2005, 972, 334, -459, -1462, -1996, -737, 646, 1144, 1536, 1423, 376, -1164, -1566, -1341, -621, 715, 1583, 1674, 1155, 34, -1081, -1495, -1109, -291, 521, 1445, 1877, 1015, -95, -1369, -1968, -1457, -423, 1021, 1517, 1546, 456, -433, -1347, -1697, -1351, -128, 783, 1288, 1227, 413, -395, -1370, -1536, -851, 399, 1640, 1401, 1272, 345, -550, -1660, -1320, -659, 443, 1341, 1410, 1090, 22, -1183, -1532, -1465, -755, 490, 1187, 1450, 598, -160, -910, -1785, -1064, -163, 815]
1949H15M77L44q78j064o43j45k12J091J251N23l19n70q19j013m21J109M89O57
1967F72J247n75j196m68m07m24K1J970O68k28k26l55j490p92P53M65Q03Q05N21
1986A764j039q34p79n01j00J149J030L27k4l38p91j150m59P03L57J203K25L15
2004A058r01j051l32o9L35N70J299K29q8p00n77j151k89J100J069L2P90J49j464
2023Ij142L44j33k31J717Q32l71p30J31j081j099Q18R34L79M89Q42n75j925j05
2042h97N7j73Q68J387J66r7o87o92q63n12R32Q79P44M9J91q61j372n08K88M16
2062f85Q57Q34M98r02j128K31p11p46J562Q54k96Q0P94j274j451M66N04m27J030
2081I0J557q89j048M83q97j145P10J585l3j01J021o30j621q7N49n29Q20J291m7
$$ y = [815, 1292, 1636, 758, -306, -949, -1094, -1306, -215, 1036, 1559, 1240, 670, -149, -1162, -1583, -474, 15, 672, 1919, 1344, 148, -320, -727, -1151, -1130, 840, 1508, 1280, 1054, 699, -791, -1583, -830, -365, 438, 1243, 1764, 725, -109, -888, -1389, -1489, -340, 690, 1017, 993, 655, -136, -1286, -1745, -1042, -685, 518, 743, 1058, 157, -894, -1226, -1295, -960, -390, 909, 1138, 1050, 350, -227, -1378, -1667, -567, 502, 534, 1324, 1473, 9, -1133, -789, -922, -1153, 564, 1396, 1025, 295, 426, -655, -1754, -936, -2, 377, 866, 1708, 1133, -792, -897, -840, -1013, -145, 1242, 1408, 1311, 624, -68, -931, -1443, -511, 368, 1112, 1161, 1352, 491, -881, -1389, -1101, -685, 172, 1006, 1504, 602, -526, -295, -1006, -1752, -190, 664, 368, 448, 1242, -32, -1483, -1017, -513, -940, 90, 1647, 758, -290, 193, -704, -1849, -1139, 446, 413, 312, 1333, 703, -918, -1005, -456, -985, -165, 1126, 1079]
2100A079n56q2r25p66L16L90P08P41R1k74l84j154k06j4O97N08Q80N17r10q43
2120a87m48j50n48J359J115L1m96L40r65j217K39P03K16J80J346o29j366K54m41
2139f64p27M98J472N0o4L10p39r03n98N37J27Q39P58K66o69l79k94n13m18J129
2159A8P27J14K73k07r18o57l92J59P68N15M94q6k47j329j71Q9m5O13R13M09q43
2180A97K1j13j026j33N88M75O85L21j53q24n47q3j15j28J344L63n21O5j87j058
2200h29m33N13N60K87O58J31n64m46m83k70jL49J086j7j25K31o78m22k50J45L88
2221a70Q75J64L77o88p54m12J6K21L94O37K41m74m98o8p19j00Q05L81M86N2j29
2242F37j095k28J34l18J84J381L04l58k83k55p87pm6N38M16O50k45o55o14Q6k55
$$ y = [1079, 523, 441, -484, -1250, -934, -544, 164, 905, 996, 722, 338, -816, -1022, -1036, -339, 169, 1049, 1566, 656, -187, -635, -785, -1333, 26, 1141, 1172, 676, 1016, 51, -1166, -927, -224, -8, 172, 1518, 889, -477, -223, -664, -1391, -893, 579, 629, 565, 875, 136, -767, -1365, -828, -701, 138, 896, 1162, 493, 114, -180, -693, -1111, 18, 745, 859, 1132, 925, 7, -650, -1042, -883, -115, 400, 894, 808, 561, -768, -939, -850, -895, -282, 631, 1040, 197, 218, 105, -921, -1054, -466, 9, 694, 1015, 862, 38, -509, -592, -707, -835, 509, 872, 351, 416, 229, -829, -1262, -749, -189, 98, 756, 887, 323, -123, -606, -876, -877, -528, 558, 541, 416, 647, -31, -453, -703, -558, -170, 705, 869, 1246, 558, -196, -608, -592, -371, 23, 660, 901, 427, -71, -139, -858, -958, -153, 228, 714, 766, 637, -458, -686, -552, -870, -686, 695, 999, 641, 358, 103, -684, -691, -737, -199, 217, 867, 622, -33, -647, -561, -816]
2263h16k8J037J44K70l27k67l32n46k00P75L42L31L05M5p99k44m70K55M97J32
2283A04P52q4n13k1m17m88K35N06L70N7K80m03l80j53o75L33N48N30k9K77o83
2304A46m49j99j88K33N22L36K55O9m14m42k60j40J11O93J83K18k38l71m69k64
2324f68j23N15P75j8K01m77k89m24q0M5K05M49N28j63j60l30n01j71qO78L39L86
2346G09p0m91n36M0j57N3P30lL68k47J04p32l82m8L53K80N80j02j13k59o02P3
2368d52j43K10M85L43L06l55l31m31k93L37L11K27rM45l99Ko97M18m09L02L78
2389B45J70j44j22P1p12O1L9K98J01M40k0n41l84j51J81J45M71L98J2p1o03j04
2411b20p47M37K97K07O06P2k38l76m47k1k03O40K49K09k32R3m55l59o8J23M56
$$ y = [-816, -844, 193, 337, 607, 280, 13, -319, -865, -1065, -290, 52, 383, 688, 733, -66, -310, -780, -525, -28, 104, 856, 772, 259, 238, -179, -667, -432, 74, 444, 501, 781, 378, -2, -155, -830, -497, 51, 581, 552, 829, 146, -303, -502, -690, -457, 65, 401, 656, 725, 311, -131, -391, -531, -420, 273, 456, 674, 436, 65, -404, -668, -791, -276, 499, 481, 682, 205, -84, -508, -588, -543, -338, 111, 639, 476, 316, -14, -515, -686, -694, -16, 323, 709, 639, 148, -388, -348, -505, -452, 278, 275, 643, 396, 500, -232, -614, -662, -309, -29, 551, 449, 336, 77, -525, -452, -595, -385, 100, 443, 749, 394, 63, -368, -661, -324, -13, 214, 205, 650, 251, 253, -444, -26, -435, -133, 245, 415, 271, 149, 220, -492, -431, -392, -94, 7, 447, 427, -114, -498, -649, -468, -323, 148, 546, 558, 487, -116, -220, -967, -530, -233, -26, 580, 652, 414, 38, -409, -430, -633, 7, 256, 465, 233, 326, -129, -488, -556, -433, 23]
2432B3J07K53J78l21o51N8j26n4N33L01L22l55k26m27K14m32K04N72p1L62j26
2453C38l67l63j35L48j01M46J73J00n21J0j53p36K33N96J75J21L03o0n14l28K89
2474a46k99K42N26j9j08k4j66k79j08L35L1L04R3J00m13k74K3k8J96l65K66P32
2496F19l78n3l79J13k48J05N55K65l74J46m50m07K64l9L1J52M32J34n39L8l32
2517c45k90LO09k5m3P04m68l99j08Q9j88O5M23L45m42L4R6l27j3j33N21J24J66
2540C98Rl83j71l1K9J34J07J71L24n39j04j40Q0k13K04L74M0K27k5m58k98k75
2562e40L32K49o1M72m9k88k6j09l37K02L84j69j45M89r8k58k64K9R6Q6m9L89j61
2585A74k07m8j83o89N96L55O3M23k33R2l17n55J16K18j8N33J0l06J16j65j55j30
$$ y = [23, 130, 383, 561, 240, -411, -353, -479, -533, 0, 301, 623, 268, 42, -385, -171, -603, -399, 173, 102, 464, 338, -29, -392, -527, -179, -280, 166, 339, 439, -82, -72, -225, -961, -728, -132, 43, 164, 467, 407, -107, -435, -146, -445, -203, 323, 304, 196, 172, 6, -273, -381, -46, -15, 289, 382, 482, 69, -205, -182, -210, -14, -379, -113, 619, 241, 188, -191, -78, -326, -221, 334, 599, 225, 371, -79, -486, -222, -261, -230, -78, 354, 488, -51, -13, -345, -635, -632, -23, -48, -91, 613, 145, -254, -362, -273, -461, -396, 27, 372, -70, -36, 60, -267, -280, -413, 108, 232, 398, 407, 24, -147, -178, -149, -15, 92, 263, 587, 48, -56, -196, -116, -329, -125, 249, 289, 516, 491, 33, -265, -540, -208, 41, -20, 452, 403, 115, 89, -20, -357, -155, 229, 60, -85, 404, 306, 48, -216, -187, -91, -5, -54, 335, 174, -33, -81, -264, -953, -357, -2, 61, 484, 251, 343, 26, -529, -413, -195, -213, 320, 330, 24, 140, -25, -180, -310]
2607c10J07J88K14J7r5k35j54J55l98K92L69K79J23m39k23k52n6J41K77K56j53
2628A03J40o7j79k26L0p3J43R9N41k42l53R6l20q0K93P0K88j62r2J15m41J70q4
2651b31p3M79K07K9j13k78j41m6j23K55J01K89j8m43o9q6r6pM14N2R0K15m04k39
2675b36j47O4N1K37J60J75Q5l01l00N3l07P3M03J30K22k4m62J1o5k35L34R8L0
2698D9L13l7l51m36J3N2L51j3N68k56J16l98m35M7J70L3M64K83n96n5j50k52J16
2721d04R2K33M86O1k94j09N2m77J42o3M00J95k8J71l51l68o5R2L49j25N06J11
2743F06m17j57j73j37R9L16J32j29L71l26k65k13P8N0J09J65K89j49L8m99J54
2764e8j22J21P9J18N5N6k5k64k59r5L79K48j72K90n9k90Pk05l53J73M98J27J66
$$ y = [-310, -203, -15, 199, 216, 121, -114, -268, -113, -511, -219, 150, 429, 552, 113, -110, -362, -418, -277, 0, 256, 103, 243, 176, -3, -229, -199, -272, -129, -30, 511, 269, -84, 12, -308, -388, -95, -25, 263, 101, 9, 124, -317, -147, -231, -304, 175, 382, 411, 298, 20, -121, -167, -290, -35, 66, 355, 337, -106, -175, -261, -357, -364, 50, 102, 192, 407, 3, -236, -383, -319, -268, -31, 129, 304, 389, 88, -212, -159, -466, -393, 10, 140, 362, 338, -124, -113, -178, -413, -79, 19, 49, 362, 325, -26, -462, -449, -397, -46, -59, 509, 253, 369, -29, -464, -417, -247, -214, 250, 533, -63, -118, -268, -520, -404, -312, -79, 407, 468, 174, 65, 117, -360, -218, -281, 119, 314, 286, 457, 106, -262, -327, -235, 114, -11, 495, 606, 189, 32, -141, -278, -179, 137, 269, 140, 511, 185, -80, -293, -215, -165, -56, 109, 398, 249, 287, -212, -58, -180, -59, 20, 138, 193, 249, 224, -40, -299, -394, -15, 233, 61, 351, 292, 2, 9, -196, -549, -376, 122, 249, 415]
2787D15o7m22l47K98j53J12r6O75k11j30J49n88j44K14L27j85L39J87m12R9k20
2808a60j68o4L13K31L60l11q0k67j32l16L97K04K05N1J43m27j58p3k9p4L60J65
2830A70L99l26k85k91L4j82K53N12l03L55K85q51Q2k92P3L22J26J88J97o06ok72
2852d18j23K08K32R5J69p1Q0m10j62N2L11pJ44L86l34m0k15n7k78R4N85K5o1K33
2876D38m84k76k11L38K1L45P6L24m25j7k66q7j45J74N05M4m67K89J19n45m4K46
2898d8J42k49L57K14l40n6j82k43K68L08J68j77R2l31P6l97J69O6J13L33J52m32
2920CJ77l29j09k5J59O11k56L48k12l30m01K6J36L31L25j53M9J82q72J95Q1k12
2942b76J55M72k1k47n6k81O0l25O42n1K06j28N6r3l43j54L30Q8m79P89k3q2k07
$$ y = [415, 348, -74, -421, -123, -276, -164, -260, 415, 204, 74, 223, -365, -509, -295, 32, -153, 186, 373, -39, 60, -160, -328, -392, -79, 152, 512, 201, 121, -146, -278, -594, -197, 7, 212, 263, 406, -21, -179, -252, -281, -355, 5, 170, 569, 243, -42, -333, -299, -481, -228, 284, -19, 336, 621, -230, -148, -440, -367, -45, 81, 269, 466, -140, -146, -418, -541, -333, -101, -6, 163, 92, 172, -238, -400, -348, -37, -44, 100, 486, 152, 112, -103, -160, -438, -344, 241, 266, 205, 438, -46, -322, -533, -195, -174, 171, 247, 571, 146, 129, -137, -224, -369, -195, 310, 354, -113, 176, 295, -250, -294, -48, 94, -155, 202, 416, 76, 20, -162, -405, -137, 171, 339, 162, 254, -77, -1, -398, -229, -163, -50, 283, 435, 3, 180, -149, -258, -283, -124, 487, 231, 579, 367, 37, -364, -338, -202, 129, 454, 301, 350, 532, -340, -145, -64, -276, -121, 351, 330, 83, 27, -254, -194, -519, 123, 72, 278, 150, 206, 113, -230, -384, -54, 34, -445, 344, 321, 239, 32]
2965C2k04l9R1PJ80L68p3l10k57k0J55qj35J72L85m4j70j95K9k28K13Q4K82L7
2989C52l1j96l95J67p0J8O3K77j83L95l88l82J30r8L2L86J41J78k41j95P0k39
3011b09M0J74K9K14k9k25J80l57j2q5K06M21L4J10n36K02k12k02j53N69r3P2P3
3034B11p2j44l68R8J70J27j53M16J13l01k37j45K89q0l5K74J7l47O6l10l7K10
3056b38p4K68L42k7l99J87j49n2M9J65nM38k26l3l80J65k86j28L21L43J80k17
3078B44k71N3j98k42L76K84o7O2Om97J5j5L1J65J08P4J21k8l72j55L45k01J29
3101c3J75K59k65L0%Qm24J90R5K36Q1k91Q7j55j45j13J82r3K54N9J13j13k17o4
3125a44l0J3K90k98M97k73Q1j23k29L5N5M36m51L24j72l21K85j59K44o8K2q8J94
$$ y = [32, -172, -211, -120, -113, 67, 435, 362, 52, -205, -225, -70, -78, -213, -41, 344, 300, 130, -65, -36, -264, -51, 33, 315, 352, 321, 125, -270, -103, -173, -155, -92, 185, 2, 397, 9, -373, -243, -341, -309, 77, 218, 396, 155, -40, 30, -209, -169, 5, 34, 248, 219, -6, 174, -183, -195, -280, -74, 347, 381, 491, -45, 157, -55, -257, -410, 159, 66, 138, 211, 139, -5, -373, -275, -105, 22, -131, 285, 398, 97, -140, -285, 4, -76, -111, 163, 180, -167, -101, -411, -448, -238, -312, -44, 298, 271, -128, 59, -90, -142, -93, 72, 67, 505, 279, 246, -134, 31, -255, -383, -62, 281, 461, 244, -27, 26, -172, -414, -38, 246, 179, 241, 247, -250, -235, -250, -219, -54, 54, 128, 249, 221, -151, -306, 39, -162, -33, 142, 401, 136, 166, 166, 174, -250, -60, 35, 271, 352, 61, 148, -7, -152, -265, -83, -176, 78, 137, 250, 137, -80, -144, -174, -161, 129, -169, 328, 55, 136, 13, -216, -181, -126, 310, -141, 183, 11, -310, -25, -184, 60, -8, 14, -74, 120]
3148A20J84l10m11K00J60K7o8J71k51J24P9k68j68L12J6K25J38L2j78l13OJ03
3170g0k26J58L90p9j80Q0k75J59j42L68k75N5R0N19n73o4j55J03K47k6J53r4Q5
3193B48n8j21n1j40l0o8N59l37J81m4k15J59j18j59J88J79j1n45K69Ok43K32J07
3216a2J28l4M35m77r7k40J1J85J7L92k3k28J20m0l39j19n0L39p8L60j83k34J3
3239a54j90J08oK71K9L20m07J48l03j97J22J33N9J67N8P6l15O9k79K34J3P7j12
3262g9K33l60K41n2j21Q9KL32Pj91J69n38J02K08j21J26J58J00l14l0J23l15M
3285b27J71J53n1J69J63l04l59J55j47K00M0J32K81n05J87q3m12PM14k2J01r5
3307c2R0j77j41lK66jjK60l77L62n43J24j62L46J0j66J94m2j21r0p9L19k49K7
$$ y = [120, 304, -6, -417, -217, -57, -30, -98, 73, -178, -54, 25, -243, -411, -99, -83, 142, 280, 312, 134, -179, -173, -70, -296, -138, 252, 173, -7, 73, -202, -43, -185, 183, -92, -37, 53, 572, -1, -65, -220, -117, 130, 104, 257, 163, 248, 190, 69, 18, -122, -152, -220, 339, 2, 183, 139, -76, 83, -35, -194, -6, 173, 162, -383, -114, -108, -351, -119, -12, 116, 82, 517, 40, -57, -297, -286, -101, -84, 308, 285, 57, 177, 137, -202, -321, -371, -32, -110, 250, 67, -167, -154, -344, -236, -242, 29, 58, 378, -29, 119, -184, -381, -259, -126, -67, 100, 158, 234, -81, -12, -291, -57, -44, 33, -79, 154, -206, 35, -17, -138, -49, -47, 285, 292, 101, 270, -268, -166, 42, -79, 47, 205, 305, -9, -39, 84, -231, -227, -56, 97, 46, 215, 378, 74, -285, -130, -277, -77, -37, 95, 376, -129, 58, -25, -437, -430, -16, -38, 63, -32, 58, -119, -260, -263, 3, 2, 1, 261, -116, 246, -297, -173, -335, 11, 21, -145, 49, 7, -114, -204, -283, 36, -213, -186]
3331a86L59K32j53l04K00k71q5J03L46j27j6L7j26j15k20j74Q44j70J62j05k43
3352a2j4k87O4K41j41J26L56k77Q0k25m7L46l37Q4K28p7J94m23J81l84q6lL67
3375d6K96k01q2k59K08l6j94J71J27L0L92k08m20K04p1K2k9P3K84%l9k33j33o6
3399b10P3N7J80J29N2k89l62K56m50M15K51m0n5J11J74l62k57K59j25K16K11K82
3421E16k20k12k92J67r8J24R0J67l5j28oo4k98L2J59M64j64l0P4l69m0K6L6P4
3445b7K25k51L40j50l9k47p6J54p6M55o5j05n8J11m97P8M4L12o9P8M9k88n2p4
3469b28O9l6K98k15M73l9k34r8p2R6jo0P2L55l07j29k14r8O5J38J48K94k32j77
3493a32j2j44p6K08L39m2jJ22j3m20j31m3J06M41J29l24L12m74L04j79n3l08L71
$$ y = [-186, 173, 405, 252, -52, 148, -123, -208, -105, 241, 114, 98, 135, 9, -106, -326, -500, 344, 174, 336, 231, -12, -26, -313, -249, -8, -149, -23, 333, 56, 136, -89, -136, 210, -127, -43, 185, 108, 302, -121, 60, -324, -410, -413, -46, 250, 49, -33, -292, -84, -120, -314, -143, -16, 14, 406, 198, -222, -18, -89, -67, -96, -23, 261, 261, 222, -11, -144, -210, -137, -80, 100, 229, 281, -8, -370, -114, -564, -149, 102, 62, 7, 118, 292, -70, -327, -68, -193, 23, 234, 516, 296, 84, -208, -41, -139, -15, 75, 242, 207, 79, 73, 9, -289, -257, -98, 366, 202, 172, 246, -123, -163, -137, -101, -27, 198, -53, 287, 137, 98, -149, -225, -71, -147, 308, 243, 138, 80, 191, -306, -228, -184, 128, 59, 137, 186, -102, -154, -228, -159, -195, 103, -112, 361, 322, 88, -10, -82, 14, 13, -47, 25, 380, 73, -56, -270, -368, -303, -165, -17, 277, 45, -132, -144, -288, -364, -156, 183, 141, 140, 262, 249, -171, -302, -345, -239, 202, 331, 7, 319, -155, 149, -30, -83, -391, -20]
3516b0J55j74L27l54O0l44O4L18k8K18k55L99l07j70M3l9p3O83n32MK60k91j69
3539b25J07j25K2M19jj82m5j78K88k00J97j11k2M80n25J90l09L21l34K32j0K06
3561A95J50k47o6o0n80M17P8O0j37L24L1k07m7p2O8Q4J38P4k6j60O0n3k11J1J66
3586a0P3J26j89j44N4Mj97K52PK29k30J44o2j67j97K02j87K46K64j31P3l9j07
3609A4l76K82j98K60O6K22k37n2o1N9k67J60J59p6K59k51n3l68j5O94j94qJ67
3632A86J95j48N5l12p1j82K88K31Q5l27j20m6j12K53k33K05J95J52k01j37j50
3653a94k11M18k46J44M2K5%K70p2l85K2P2K72J77j56j60j72l8J1j4J24r1J29P1
3677C8J16j75l00j8M53j85K48J83l25l7J9k89k5K61JJ18J77J7k03j70J2j93K89
$$ y = [-20, 135, -39, 288, -66, -6, -350, -286, 32, 4, 222, -33, 366, 59, -111, -68, -107, -180, 503, -29, -25, 235, -56, -225, -118, -243, -221, 198, 197, 15, -30, -208, 80, -120, 77, -34, -56, 424, -101, 89, -220, 101, -233, -1, -11, 195, 345, 98, 32, -28, -608, -191, -113, -53, -190, 134, 165, -42, -89, -161, -93, -9, 129, 203, 177, 17, 77, 24, -187, -176, -10, 63, 189, 0, -144, -90, -86, -283, -31, -24, 205, -25, 119, 57, -110, -307, -105, -292, -46, 218, 87, 160, 121, 14, -362, -80, -278, -18, 48, 270, 33, -19, -80, -21, -288, -128, 31, -45, 214, -37, -90, -458, -473, 221, 27, 19, 186, 381, 233, 288, -24, -95, -277, 11, 242, 327, 0, -120, -166, -278, -25, -258, -53, 142, 294, 93, -44, -194, -405, 13, -233, -89, -47, -22, -22, 248, 176, -209, -187, -115, 157, 334, 178, 18, -154, -192, -181, -195, -71, -162, -33, 38, 154, -21, -321, -339, 114, -71, 177, 360, 35, -2, 17, -272, -297, -36, -35, 83, 260, 277, 74, -96, -84, -277, 12]
3700A2j06Q9K53j1m20K59j50k25R7L40L64l31k57K17l6m75K16J35J09R2lO5q3
3723A51k78qJ53j52K20J2J39k89j09p6K24j1q7L78k85L0k3l36L83k62O6J91J0
3746D1K64K0k81k9k86J24J49j80K35l0k5J86l90Q2p3L58k69K25M1%l66J40M4m13
3770d33L26J55rj72L68l03q8P0P0J38m9O7j76k22K27j81P6k59N34j45K10o0L1
3793A75n17M04k33r5L20l3J73K13n67N8l2J1J14J61l9m16O03O6n59K48k22m5K70
3816E8o4Lp3r8J05N9m16L46L44k87J48J4k68n5L1K10r0k49L11K32n63J74J32K3
3840B7j89J32K40j46K87k96K5n1j23L0J68n3J93k25Q6M1m70L16Qj5m4K0J82l47
3864b04J23j71L70j73O7J06K03j60j01k20q6L11j47K23O3q2J25k48J22j35r4K01
$$ y = [12, -94, -5, 248, 237, -183, 76, -74, -299, -202, 138, 502, 171, -86, 131, 95, -380, -164, -29, 80, 172, 169, 234, 151, -127, -135, 18, -134, 86, 98, 237, -52, -161, -237, -13, -24, -111, 267, -18, 12, -11, -347, 36, -226, -160, 31, 41, 305, 325, 44, 15, -271, -147, 2, -178, 57, 27, 2, 188, -202, -120, -193, 165, -104, 121, 162, 162, -204, -64, -20, -433, -107, 48, 39, -133, 235, -68, -156, -86, -16, 122, 73, 140, -36, -258, -31, -212, -136, -395, 139, -6, 204, 144, 175, -342, 62, -171, -266, 54, 21, 194, 407, -160, -102, -134, -123, -9, 152, 113, -303, 300, 366, -193, 55, -167, -212, 58, -6, -3, -76, -174, -69, -10, -426, -80, 264, -23, 125, 139, -129, -184, -153, 57, -33, -282, 29, 261, -302, -128, 4, 27, -162, -30, 210, 64, 351, 55, 80, 29, -94, -64, 104, 51, 244, 19, 105, 146, -324, -8, 0, -15, -59, -39, 143, -204, -81, -252, 118, -55, 12, 118, 321, 161, 60, -160, -246, 65, -82, 141, 204, 122, 247, -1, 121, -14, -108, 93]
3886I3j43R6J27j26k78J84JQ0j47j23N27k42J15q7j01J33K4k89M95l59Q1q8M2
3909A5r6j19P7N1K50K37q7m9j55j35M0J80k96K04J11m7l08j66J1J1K92PN2J04
3933A84m59L89o8m44K05J49pq0J45n2l79J69K29k44K72j26K67l2p1j94J94j25
3955g8M0o5J32O9k45J72p9o6N1k8K78jq5j2k63J07P4J81m03N73q4k70j51K30n7
3980B0p6K0j7j31N32k27l66P6K83k56O7J19k38M67j92J31j56k02j46R3j85N52
4002A68k41N86m94l12J10l5J15P8J22K18n6m7j61j45n7k21L23K16k06O4k51M40
4024B14l69mK32j47q8K75k13QP3j63k1K69J38kl09N8L6K7j99K04j82K75J51Q4
4048C47j78K4k44j16J86K6R7r9o9J13L2l05k8r1J56K64n1Mj21j61j29K38PO0M7
$$ y = [93, -50, 46, 173, 47, -231, -47, -46, 34, -113, -236, 291, 49, 164, 77, -24, 109, 133, -156, 339, -20, 61, -27, 15, -81, -200, -123, -72, 178, 415, 328, 279, 124, -11, 29, 209, -87, 117, 228, 181, -127, -293, -282, -271, 21, 28, 80, 184, -275, 114, 46, -398, -193, -44, -51, -131, 14, -38, -417, -248, -19, -263, 9, -117, 150, 118, 47, -147, 47, -78, -38, -103, 29, 98, -147, 25, -54, -120, -69, -97, 181, 180, 95, 83, -180, -73, 1, 182, -221, 352, 268, -2, -153, 77, 20, -56, -36, -53, -184, 348, 121, -245, -169, 114, -142, -75, 44, -194, 273, 81, 212, 56, -146, -292, -199, -384, 168, -73, 513, 19, -293, -183, -218, -103, -25, 97, 315, 259, 212, 51, -94, -151, -372, -49, 167, -39, 25, -226, 214, -155, -159, 73, -74, -162, 113, -100, -92, -19, -182, -203, 66, 204, 202, -107, -49, -13, 14, -185, 19, -163, 112, 263, 347, 169, 193, -51, -167, 19, 45, 142, 43, -26, 87, 119, -186, -214, -305, -149, 115, 64, 68, -53, -214, -343, -105, -98, -38, 9]
4073IJ77K44n04L63m92J13k65K09K42N0L5k55r5J79p3r3R7J47k28J9J87K8k12
4096a18K49l05K86m9nj33J30k99J49PK41l98K34K74j96Pk17L4j84K57qK95k07
4119D4J22j61p2k40K81K01j26j76J88k51L53l59J58j7K53p0k38N3r0K2k2l5jK71
4143H8R5j83K44j64k50l6N32l37L0Q0j89P5K09l42r8P6j8M70o9K4k00j9j07J07
4167A8M0j23J85j79M26o3j97l08K36N3r6k5Q1J5j84N9j34J12J91L2J99m28J1K61
4191A82j18k1l69M10Q3K87o22l5P0j06L05J21K04j15k30J18j62k9j03j02K24j05
4213a13L6J22J24o7j97J2r3J19J49n9L01j85j02j95k43K65J18K2%L36p7k61j86
4236a74K67j24k02K40q6J09J04k8m64K51J33K03j05J49Lj29j89k5j17j26M1M48
$$ y = [9, 186, 430, -74, 289, -203, -90, -355, -146, 96, 146, 181, -74, -169, 10, -63, -156, -59, 88, -140, -121, 66, 94, -118, 131, -174, 112, 63, 58, -75, 55, -244, -95, -88, 153, -245, -11, 263, 67, 74, -143, -109, -293, -36, -44, 251, 44, 166, 5, -67, -307, -26, 175, 49, -127, 61, -190, 163, -196, -38, -55, 198, 128, -110, -57, -147, -125, -147, -182, -183, 88, 183, 0, 244, 80, -170, -206, 326, -11, 19, 99, -90, -15, 194, -148, -246, -170, -188, 282, 213, 237, 37, 18, -89, 18, 58, -65, 120, -59, 367, 304, 107, -201, 35, 88, -8, -33, 48, 63, -121, -62, -196, -84, 107, 139, 338, -90, -79, 182, 64, 43, -326, 84, 167, 454, -168, -203, -133, -239, 66, 187, 391, 276, 46, 164, 2, -27, -130, -232, -8, -113, -77, 45, 169, 102, -95, -83, -176, -57, 92, 33, 334, 149, 47, -148, -391, -126, -8, 14, 14, 350, 273, 12, -174, 93, -31, -233, 7, -79, 30, 134, 106, -358, -107, 26, 229, 124, 273, 276, 147, -42, -67, -184, -310, -269, 179]
4258A79PJ56k95k60M44k14J09j67J0K10k99Q7O2m0k62K84J27k85j4J54M7m0l7
4281c7N1k5J41J43k74O0L6k08J37N8o6K88m58L08K7o2j11k22J37p9rK63O1l62
4305b03J6JK10n34L94L13l36K53L7m1j02M2j15pQ5Mjk1j08K50k53J30P2q9j49
4330a52K50k95m7L68K4p4nJ04j46J85k10k81J50J73J32j00M0O0j53o8k33K82j5
4353a1J09J21j49K79j97j76j34NJ77j01p2J14R2J88k55j24j17K96r7O6L17l65
4375c4k2J99l03K99N5Q9m53K21L4K4k35j29n2K98Q1m1j11O9j4m4o5j01L16K82
4399C63k22P7m70N92m52K1O5j26K44J86k29R5o0l42L33j08J10j47R4J37j47J1
4421B5m7k88M20k4l5r5N3j13K4pj06L07j03Q9j82J68J45n01L06j96K70P8k45M1
$$ y = [179, 186, 342, 47, -213, 231, 17, 126, -41, -31, 179, -120, -33, 29, -11, -273, 11, 138, -147, -161, -7, 40, 0, -37, 14, -11, 130, 273, -1, 59, 95, -113, 24, 82, 16, 304, -154, 154, 181, 119, 8, -214, -77, -156, -165, 98, 159, -203, -187, -186, 24, -510, -116, 197, -139, 114, 151, 110, 8, 50, -65, -72, 13, 17, 16, -5, -113, 137, -116, 14, 86, -3, -152, 98, -197, -244, 124, 148, 74, 69, 173, 27, 212, 2, -279, -129, 44, 176, 76, 116, 176, 23, -45, -278, 4, -11, 98, 219, 70, 349, 152, -24, -158, -153, 24, -77, -149, -35, 57, 245, -10, -134, -251, 45, -52, 14, 331, -34, -56, 143, -160, 139, 194, 283, -170, 51, 85, 109, -126, -255, -307, -9, 72, 31, -80, -11, -25, -69, -134, -235, 81, 363, 141, 218, -252, 340, -112, -91, -26, -152, 92, 278, 49, 144, 84, -258, 75, -33, 77, -70, 24, 161, 14, 25, -22, -310, 110, 86, 51, -44, 9, -104, -80, -87, -193, 114, 11, 100, -82, 86, 231, -270, 36, -160, 110, 188, -57, -16]
4445a6l9Q0j43L2r1M54j08j16J88K0j86j28K48m66K94o0l6K00o8o3Q0j93j73K37
4469e3pr5J6O8j5k5Q4J6J58R6r2k74N2j02J4j3K1J22r1L24J33m42P2K67l26J3
4495g9L04j71j49J74l94K36m1J60k04K91j0k76L06l87K50j7R7L2j10j09R2l7k21
4518b63J40K48j44K04j88j8p5J74j78J96j09M1j66J52j26K49p8m0m5J14k26K17
4540G9Ql9n6J09k96J36k22J11K78l6j17j30K00k17J59J20R9k8j21k3n6N5J9j33
4564a01K97k25n2J93K04j53l29j17K77O8n6n7K38l2j80K07m52M5k6M02jj49Q3
4587H4l6l19L93k21q0N40l43J66j38k9j95J73K97n82J40J95k24J68J37r9j02O9
4609fq0N2K40k79L15j36l43M58m02L60r8L7qq1l70M19J6j99L25l12n7J63JL2p3
$$ y = [-16, -55, 25, -118, -86, -177, 277, 169, 53, 241, 261, 75, -53, 195, -271, 23, -37, -73, 127, 59, -4, 76, -117, -290, -53, -60, -155, -139, -71, -86, -111, -27, -11, 147, 243, 151, -123, -71, -173, -159, -172, -151, -29, -120, 204, 337, -105, -33, 234, -92, -79, 225, 54, -95, 79, -315, -79, -120, 40, -164, 127, 117, -159, 147, -240, 10, -7, 90, 122, 12, -97, -5, -42, -263, -123, 125, -19, 185, -3, -21, -96, 78, -100, 96, -13, 28, -138, 14, -112, 137, 59, 19, -26, 88, -138, 79, 87, 48, -8, 101, -195, -59, -281, -170, 108, 72, -45, -175, 25, -192, -33, 87, 186, 158, 37, 14, -42, 13, 32, -101, 196, -29, -81, 112, 316, 163, -166, -283, -6, 62, 6, -51, 187, 155, -25, 182, -270, -225, -251, 151, 150, 1, 84, 48, -271, 122, -99, -179, 361, 18, 184, 46, 17, -178, -5, 292, -290, -150, 45, -179, -11, 126, 27, -75, -6, -86, -34, 206, -73, 242, 106, -237, 221, -181, 179, 81, 118, 110, 29, -341, 78, 94, -105, 220, -92, -149, 14, 15, 47, -26]
4634b6K31k92L35r6l94K99j29K36j75J74j86j02o2J49K61k83J95m28K45J74k62
4655a36O6J64M9l56K02L9J9j71K42J66l16L65k61k60K67Q4j90Q8l05K77n9J5j7
4678b8J37k26M10j0l72K29k33L2K10j28M8J90k23N9qj1N6k75K00k7j95K71k28
4701a22J07J0J7K14l41R3J30r5J27l29L74j54j18L4K94k17J17M3p5k03p0P8J10
4724B4K05k81R8j0m6m8p2J98K2q3j04J46k23K51j48M0j06j58L25l2M8J7K04k07
4748F0l13L34j82m7K93n4r7j17PP7K12l24K01l3L05o29K4L51o9O9j92Q7N2K8m7
4773dj30K07L3j18j8M7L32l11j32r2N0M0L9J29q8K05k21k9K26j58K36j1l03J27
4797E6j5K2Q6k06j93M88l69J40K96k42j38K0M6k20K49J41j00j8J70n6j74J21m7
$$ y = [-26, 205, -87, 248, 152, -242, 57, -72, 164, -11, 163, -23, -125, -187, -38, 223, -60, 135, -293, -48, 126, -136, -70, 94, 143, -213, -11, 28, 47, -124, 118, 284, -32, 333, 72, -188, 79, 163, -27, 61, -244, 33, -26, -11, -28, 109, -117, 293, 283, -89, 140, -93, -61, 149, 21, 69, 259, 36, 95, 87, 76, 132, -143, 57, 30, -165, 106, -122, -15, -5, 12, 226, -115, -22, 108, 13, 140, -189, 185, 31, -87, -53, 241, 24, 141, 184, 109, -94, -164, -86, 24, 229, -52, 46, 36, -10, -58, -130, 68, 90, 7, -97, 49, -174, 77, -71, -31, -137, -295, 30, -2, 46, 63, 267, 60, -253, 81, -101, -148, 145, 91, -6, -123, -116, -39, 173, -151, 50, 17, 322, -307, -283, 68, -1, 68, -124, -37, 15, 43, -4, -134, 73, 106, -12, -30, 17, 349, 38, -94, -186, -136, -96, -57, 72, -16, 189, -32, -61, 165, 7, 243, 232, -71, 56, 41, 63, 149, -57, -250, 238, -131, 9, 305, 63, -75, -55, -9, -229, 20, 161, 61, 43, 213, 157, -17, 104, 57]
4820E7p5L2K9N2J26k91KJ93L3k36M27k38p5P6k03J25j34R3L8j81J9m6K91O5m03
4845b24J85K2M9p0J47m2j06P7Ok6j30k16K52O8M3J5j0q1J69P9k96r5J80M32l47
4870H1k73J47L5j00J17j35J2J76n09L84J30Mj30j75K83N7l63N32m67P3L68n78
4892c31M07j1J22l0l4k00J17M2K10k02l0k02L6qJ08o3%j0J65l86M13j08j32J16
4916a1k59p3L85J6n9n0Q0N4p5J84k32l9R7M5J05j72o3J14l1J50j3k74K12J06l55
4941a58L00j67j6J47N9J3L6k87N4J96l70p6R0J11pK56k0j58pj32J33P0N9Nj75
4966d4J0Q8j18L5J12n7J69K43l76j90k81M44o1j01J85j8k1J28N5j36k16J1J91
4989E2K9j2M3j6l96L16k63J75Q4j00q8k06N74j10j21L0N8n7J06j42K6q3P3k34
$$ y = [57, -18, 14, 43, 95, 221, -70, -68, 125, 158, -78, 349, 111, 36, 112, -91, 34, -100, -7, 31, -150, -131, -177, 114, 179, -224, -39, -17, 32, -38, 109, 67, -39, 38, 44, 18, -112, -328, -76, -8, 35, 50, 40, -41, 128, 207, -89, -184, -4, 428, 81, -192, -45, -10, -110, 7, -128, -116, 60, -449, -65, 65, 69, -61, -236, 47, 104, -259, 273, -194, -121, 247, -331, 76, 65, 187, 157, 123, -77, 40, 82, 292, 90, 60, -142, -106, -114, -6, -69, -69, -79, 86, -300, 113, 5, -127, -11, -270, -343, 42, 58, -1, -51, 29, 83, 8, 192, -40, -79, 18, 63, 168, -4, -67, 47, 16, 166, 153, -121, 91, 197, -158, 142, -25, -41, 106, 165, 178, 214, -73, -19, 177, -193, -269, -179, -68, -75, 181, 161, 3, -4, -136, -3, 67, 126, 131, -44, -34, 54, -64, -29, 83, 26, 195, 438, 62, -128, -409, 35, -26, -127, 58, 40, 19, 147, 202, 66, -150, -139, 52, 81, 69, 112, 96, -300, 16, -247, -72, 12, -88, -176, -382, 192, 82, -39, -9, 49, -8, 98, -44, -18, -101, -28, -262]
5013b62K64J35j47J04j90K01r9J75j54j09k65L99KJ37k47J11j59Q4J94J51l67
5034d2q0K82j88J83k47J84m3l92K88K81om07M61k28K8k13J0m6K11L6k08K84q6
5057F2l18K24J42j69J95j07L36k79l69K08L4N9j3K3k16J76k17L29k36J21J59l65
5079b21Q7R9l70K18Q5r4L00ql33L00k3ml36L25L0O2k24l8K51k44K32m9L0j35m6
5104a06kL80j07OR2l13n0K2J9p8Q3Q8j24r9n7J76M7J8K69m18R0K08l98J76k24
5129c02N70k34j76L34p0k52J69l3J35j22m7k6r7M24k89J60p6M4l14J81P2q5K82
5152B48k33L4L1J83k38m8j88J73k7J09Jj71K49K04k58r5N9O1q8O7j61L3n4o4J09
5177f4k7N5k39K49j56K02J51l09O8L6K4Nk26Q8J71N3j87L45m95L42j09J34k07
$$ y = [-262, 2, 137, -10, 94, -96, 105, 6, 181, 27, -82, -347, 52, 54, 191, -56, 55, -104, -20, 174, 325, -42, -122, 160, -28, 155, -92, 92, 49, -343, -55, 226, 220, -187, 274, 46, 74, -139, -129, -175, 36, 72, -136, 148, 62, -256, -32, 110, -59, 136, 29, 365, 86, -283, -75, -41, 18, 5, 28, -188, -12, -229, 100, -136, -15, 144, -221, -134, -35, -405, -187, -102, -196, 104, 96, -237, 63, 40, 36, -300, 25, 55, 117, -107, -145, 106, -138, 94, 45, 75, -60, -106, -108, 272, 165, 171, 263, -50, -100, -78, -59, -137, -54, 34, -90, -189, -246, -70, -23, -5, 264, -154, -64, 144, -254, -78, -302, 268, 34, -142, 192, 122, -130, 39, 6, 141, 19, -28, -54, -151, 273, -16, 144, 68, 112, -202, -21, 51, -34, 248, 15, 49, 80, 263, 25, -23, -211, -38, -65, 44, 45, -126, 123, 327, 69, -26, 33, 94, 6, 73, -88, -55, -109, -173, -64, -91, -36, -275, -26, -182, 20, 171, -138, -70, -34, -10, -5, -231, -143, 28, 81, -106, 239, -256, 86, -23, 111, -96]
5200i6j54K34K46M4k54R1k09O1K52j35j40K71j53j86R3j66J46l5p4l0J69r4j9
5223a38p7j16L10K95j11k50K21j85L1J14n2j82J44r6J37j46pL88l92P1K99l07
5245d9l2J85k93J96k28r1M33l00K53M1l4l46K89j97M6j49ML22p0m14J64M77j99
5268HM9j49PJ31n0k57K62Q4j24J51k25k2J83j80J70K94m87J21K36l65J24j10J23
5291b6O9j28P9kJ4j31J76l6j89l3K60m15L97J43M3p7j43K69k03Q3k69M5K3j70
5315b21K03M0r1K94j75j13m3L91k91J08L1N1j48lj04R7J63j95M3l17L81Q2k47
5338f4J08n0m3p9K92k1l60M41l34J45l53M02J92l91K03p8J31k02M2p1Lj0M3N7
5362CJ47k53O6J66l47L47n3l8r6l75L91K43nj58p2K87L6k34R2k30L25j05j96J72
$$ y = [-96, -250, -16, 230, 274, 20, 111, -98, -37, 215, 80, -60, 211, 58, -128, -35, -201, -55, -90, -164, -194, -25, -119, -138, -215, -331, -21, 274, 163, -87, 134, -51, -20, 94, 42, -140, 4, -92, 45, -101, -108, 280, -112, -41, 258, -49, -81, 104, -189, 7, -221, -312, 121, -179, 74, 115, 81, -265, 24, -173, -127, -276, -272, 50, -20, -434, -270, 207, 8, 57, -92, -85, 46, -4, -261, 1, 85, -39, 112, -113, -135, 48, -132, 38, 332, -155, -34, 202, -163, -39, -149, -26, 43, -85, -6, -8, 6, -125, 51, 15, -174, -207, 53, -362, 35, 178, 221, 144, 1, 270, 67, 150, -119, -74, -51, -221, -18, 22, -69, 225, 50, -63, -106, 285, -6, 102, 133, 184, 36, 33, -71, 26, 189, -6, 37, -280, 101, 183, -64, 44, -6, -49, -128, 164, 143, -217, 224, -110, 35, -318, 84, 276, -115, 88, 10, 141, -61, -19, -90, -87, -97, -54, 3, 150, -103, -37, 129, -218, 129, 76, 38, -58, -433, -42, 201, 196, 38, -34, 253, 289, 55, 147, -83, 242, 137, -59, 113]
5386A13M6j63NJ02l02L09l51M07j53m5J50J6j9Oj70L1j21K75j36RJ13k03N8K67
5410B44k75K7Ol4L3j05m2K87lj3Q5l6j33j00l46L71o1j31L22j32K24j61J43k04
5434c4P3j76M0N5O7R6j90j5J03J9k12L05j39QL0J94j2l52K3K29k7l5J85l86J70
5459A9j90J19k02P1p4K29J9Q2k01J89q8J30m9j85K3L42l1j40P0l93J75mj12K34
5483C3J4R8k17j99M01k43k31M64O4Q8k28n6oK10j19j02M6j33P3J20j95K57o0M0
5507A19k18K3K6R2k8k78K27k26L10j20Q1K40j5m14J8r5L50l96J48K02j85K01L6
5530I8m0J74k92N5Q5k18n6j4J38R0J19r5J40j08k6j37K31n26M27k5l14K4N95l40
5554a5j56K12J06N6k99P5k9R5J2Lj22R6L2j31N1M8j11J66o6j75J56j39L1j26J56
$$ y = [113, 159, -4, 1, 103, -199, 110, -241, 166, 13, -32, 118, 134, 115, 121, -49, -18, -139, 136, 0, 9, 122, -81, -23, 244, -31, -4, 2, -32, 1, -104, -146, 141, 138, 125, 210, 174, 41, -59, -405, -34, -95, -226, 96, -36, 188, 27, 170, -34, 39, -137, -97, -42, 25, 121, -69, -84, 19, 38, -174, 131, -8, 0, 30, 224, 212, -140, -117, 112, 85, 50, 235, -151, 19, -171, -52, -254, -183, -257, -28, -9, 73, -128, 61, -27, 103, 54, -131, -108, 234, 203, 63, 133, -260, -85, -89, -201, 33, 47, 145, -72, -271, 130, -113, -344, 120, 184, 272, 44, -12, -18, 192, 73, -29, 17, -116, -43, 77, -118, 139, 79, 119, -99, -76, -50, 42, 14, -264, -37, -263, 47, -73, 8, 248, 233, -181, -163, -258, 92, -304, -156, 46, -139, 62, 98, 58, 232, -60, -5, 80, -138, -194, -208, -70, 20, 139, 44, 184, 76, 50, -87, 144, -382, 45, 20, -294, -270, 325, -15, -171, 41, 147, 203, -96, -21, -50, 45, 57, 60, -62, 34, 66, -65, -14, 34, -77, 89, 23, -152, 4, -135, -104, -230, -74]
5579g4M8m2K15k23J58k28J51j83J46l8K92m78J81J59ml3Rn4j56J47k7K31k82J21
5603C6j88J11j2J81r7J12lk40J61k78K49p9K05k60J09O3j87J02n0n5N4j9K1j8
5627h2r3RK01o0R1N8j69J83J16j39l54J31J00p7J88k59L10k97J3N3J29q0j81M35
5651B26j93l8J24l14M6K20Ok18O2k5K73pj06n0Q7MJ59j11j70J53j69O0K28k20
5675B7n4P4k56M42n16K78M0m28R3L45J24J36n38J39J16J27j68M1J36k23L3o5J70
5698G3Nk86R3J08J44j51J24M0k13K8L2l3j10J1Q4P6k54J93J64k00K82k76K41m36
5722b61M54o4r0p2j45K41M2k43J02K12j7K4k46K18j09JkQl20J75J03j91J42K2
5746a6r0K26k07K93l8m22K13j05j70J18L34l20O9J65K06k31j64K24p6K39m19K9
$$ y = [-74, -26, -68, 147, -76, 82, -146, 5, -178, -32, -70, 222, -256, -75, 84, 80, 47, 56, 2, -154, -7, -34, 197, -85, 36, -152, -41, -53, 128, 31, 143, 140, -100, 61, -217, 32, -47, 158, -102, 7, 70, -117, -15, -65, -120, -66, -85, -64, -82, -175, -166, 35, -25, 66, 124, -45, 138, 254, 115, -239, -108, -8, -85, 103, -156, 154, -143, -130, -77, 52, -28, -209, 226, 33, -5, 119, -195, -149, 71, 77, -141, -79, -104, 169, 162, 56, 6, 93, 97, 256, 145, -25, 128, -41, 19, 247, 27, -27, 47, -209, 233, -283, -5, 35, -393, -300, 45, 169, 305, -233, -94, 22, 149, -19, 22, 158, -65, -32, -97, 73, 78, -208, -115, -7, 137, -14, 110, 150, -63, -35, -3, -36, -146, -135, -51, 25, -229, -36, 128, -72, 210, -66, 175, -261, 193, 129, 39, -33, -178, 63, 105, -138, -36, 176, 159, 183, -63, 155, 46, 47, 45, 53, -267, -92, 11, -180, -38, -16, -106, 120, -87, 206, 168, -254, -41, -146, -316, -198, 136, -184, -115, 50, 256, 25, -139, 85, 9, 248, -171, -142]
5768a42J62J20K55m30l28L07M6n8Q1k5j67J44j4M4M0J31k7J34m08K28R7n05M48
5791A33p6M0j02l7J10j42Q8J7o2N5N3n7k0n9J26K96l71J88k10jK13j13j42J36
5815F3P8o4J80l12J91J71l73J39K61k36k36L46l45o0l6J49K75l20J04M5K24l15
5837g1J1j30M42k04J49k28J03J28j57K04m3m90k3J08L04j60%Ol1K05j54N7j96
5860a70J34j86J84O5K17k04k79L12q3j99J12j7J54o0j2J74k97K53J32j95j44J99
5882I0j14o5j06l2m5M16k47l2J62k3km85M80m3J31P7j62l0j48Q7J48k32o6L31
5906I0Kj33J19o9K81l32Q8j5L8k06j11J79P9j56J63J00Lj0m2qq5J0j29K47qN6
5932A51k43R2N8j01J94L9k10r2N8j6j19L89m25k24N05j90J3K38l18L20j16j09
$$ y = [-142, 20, 140, 395, -35, -363, -56, -10, -68, 13, -12, -179, -35, -49, -5, 35, 166, 139, 273, -135, 93, 190, -315, 133, 57, 97, -5, -42, 68, -74, 14, 31, -31, 24, 77, 20, 0, -59, 67, 363, -8, 180, -30, -31, 182, 69, -73, 63, 141, 77, 257, -55, 136, 307, -66, 73, 334, 98, -138, 208, -137, -197, -233, -84, 191, -129, -25, 20, 244, -71, -60, -190, 252, 48, 197, -31, 72, 200, 43, 247, 204, -286, -309, -201, 103, -57, -57, -51, -82, 123, -31, 26, -170, -36, -222, -38, 27, 244, 40, -239, 73, -10, -209, -97, -114, 40, -20, -32, 142, -155, 98, 230, 35, -109, 90, -24, -89, -195, -227, -272, 144, -103, -135, 27, 4, 2, -483, -3, -46, 85, 162, 0, -30, -178, -91, 57, -175, -241, 90, 92, -41, 78, 9, 290, -42, 46, 31, 69, -137, -248, -69, 10, -146, 17, 117, 120, 110, 68, 60, -25, -15, -144, 103, 95, 151, -92, 0, 58, -43, 151, 190, -20, -112, -54, -70, -189, 200, -225, -449, 56, -134, -121, 117, -201, 119, 3, -106]
5954a06m0M12m54K55k56j35J04L12r3j45J92L0P3L9m6j11l8J44k51L58k14J14
5976A44m7%q6K69k49l92N23k69O9K65r7l54N1J48L4J48p5k58O4P7J99q2j00mJ55
6001A33j62k9j01K6J31Q1k9j68K21k84L10q0k91J11o1L45j62P7k3R8J05j72j04
6024b8k03K01J41N0L9m02PK05J46l44J98P7k82J60J48L8J2k31K18n6j89L64l91
6047a22K78m33J29k12M02m0N1l03L01K70m65l9L6Q7L65j61k03m9k40M05P4j85
6069e4Q3R5j8l1J14k09o8J98L22j46j66r8Q7K2j92P5O8j19K2J30n5J05k38O2J70
6094A59k84R1j04J69k88Q9lj4o0R7J1J45J65k7k38J76j56Q6j19L9J99j47J13K18
6118C17l20P3K7K43r3l84J06l5j59Q8J30J8J83n7J57n80J20K35j54L06o0k47K37
$$ y = [-106, -146, 266, -188, 67, -189, -324, -220, 92, -1, -146, 46, 76, 149, 188, 142, 31, -7, 137, -114, 244, 30, 144, 97, 97, 11, 280, 31, -361, 162, -107, -38, 227, 130, -224, -173, -25, 9, 157, 82, -176, -112, -35, 164, 82, -18, -22, 133, -29, -58, -159, -133, -2, 79, 50, -118, 103, -181, 129, 49, -242, -131, -192, 153, -9, 68, 45, 143, 248, 76, -28, -231, -30, 111, 161, 200, -202, -195, 10, 156, -188, 10, 87, -195, -35, 113, 151, 163, -68, 150, 94, -95, 269, -122, 156, -277, -148, -360, 42, 2, 53, -250, 51, 321, -144, -183, -147, -60, 305, 144, -59, -108, -348, 57, 131, -54, 29, 124, 106, 75, 189, -20, -88, 110, 432, 286, 120, 22, 109, 131, -61, 14, 82, -37, -15, 115, 60, 165, -73, -11, 159, -125, -34, -138, 31, -257, -168, -171, -185, -245, -148, -137, 8, 173, 146, -92, 84, -72, 14, -105, -66, 133, -14, 99, 317, -3, 70, 97, 340, 247, -137, -31, -66, -225, -137, -7, 11, 194, 137, 294, -286, -166, 69, -85, 221, 161, -86, 151]
6141A51k04m8L62m55K61J2kJ45n2k29Q9q0l3RnJ5k9R3L2k54K64k57J56r7J03L18
6167B65l37j15rJ93J08jj15j12J51K7j5J5p0j87K39k50L40k23J50o2K18o1k32
6190h3K96k65j3p4M15j81j57j24K85j49K66k76N9L4O2j31M3plK51m24K16Nj22
6214g7lQ0K89k61J6o2N2R8k9j12j02N8n2J12J18nm6p0J01l02j0K02m0r2M08k73
6240bp4Q7J58k47OP2r2l19K79O2p1K44j61J70M6j00L5m55M56r9J8j66R4Q9j49
6265a19L7N0J44k01K22k31M31m68J62J0k31m9J64J76j09Mj81J36J35k21M3Q2l1
6288d5k53J10J95J00o0M4k08k1J20kK27l61K07o0k6K3J55r2Mk23K12J27j62pk11
6313b07JJ22qL55l99k5J54J50j31j73J08o4L68n4l73K14K20l81J08o2Lk42L84
$$ y = [151, -53, -101, 261, -194, 67, 79, 77, 222, 170, -59, 30, -50, -83, -74, -79, -64, -93, 0, 32, -222, 42, -215, -59, -156, -53, 265, -72, -187, -196, -3, 105, 104, -11, -123, 28, 55, 40, 55, -15, -202, 37, -213, 127, -96, 54, -8, 210, 149, -83, 213, -52, -65, -139, 276, 95, -62, -186, 99, -50, 216, -60, -1, 33, 95, -36, 7, 0, -3, 248, -176, 40, 45, -77, -80, 0, 289, 28, 44, -18, 34, 132, 103, -9, -111, -53, -105, 7, 125, 120, 74, 4, 105, -197, -207, -5, -45, -137, 271, -2, -76, 11, 169, -78, -72, 0, -92, -411, -132, -70, -141, 103, -58, 112, 158, 58, 93, -362, 94, -5, 13, -153, -59, 30, -119, -82, -32, 112, -89, 133, -98, 333, -135, 27, 37, -194, -243, -79, 97, -12, -8, -189, -53, 82, -139, -96, -14, -45, -298, -188, 7, 107, 47, 91, -117, -138, -18, -20, 207, -154, 53, -7, -33, -10, 145, 53, 57, -166, 46, 173, 11, 4, -207, -206, -84, -92, 263, -136, -161, -7, 143, 12, -161, -53, -117, 251, 197, -176, 38, 258, -123, -15, -77, -74, -316, 68]
6336F8m2j81J50j37K58m05L45j32J15J16m17K76j21Q5J39l5L7q6L02l67j8j58
6358b08K78l05J55L63m34K19j25k05k2L05l4N9j97L71o5j46l51L40L00n24K86
6379F0j99K36k99M01k85r0L38k15j7J85j1jj2J55k61j14J85k4L02o3n13K37j63
6402a68L49j49J90k08j14M3J27K37l08j00n9K18K0K02j49K32j86m4m01K39j34
6423a63O0J82J83j82J46l8m84L00j12K85k17L35r5k14r0NP1o7M81m95J6j97J28
6446a62N03l17Q3l43L13K05j85J64k19l22K25J88J1n7j86O7l2J55K7j43o5N5J61
6469A26l37J33J02M7r2J18n4L9RL1mk02J91q2j51K13j42K42j02q6K66j49k0m54
6493c58K84J29m12N69k43j86J28J81j15J20k71lL97J0k06k3q2J3j53L65k38J78
$$ y = [68, 26, -155, -5, -142, 116, -289, 56, -76, 39, 155, -262, 14, -107, -22, 117, 82, 119, 33, 335, -32, -50, -208, 70, -235, -80, 283, -151, 68, -57, -262, -284, 21, -13, 46, -151, 220, 155, 9, -342, -2, 298, -226, 60, -139, 97, -202, 199, -86, -176, 162, -53, -70, 115, 104, 103, 91, 246, -15, -129, 56, 32, 334, 271, -242, -5, -168, 181, 32, 222, 14, -100, -57, 70, 307, -1, -101, -160, 58, 78, 280, 131, 363, 177, 133, -268, -29, -163, -103, 79, 262, 80, 226, 188, -296, 4, -108, 177, -40, 295, 200, -14, -104, -99, -28, -95, 386, -109, -93, -290, -162, 341, 24, 107, -236, 77, 282, 97, 261, 42, -280, -55, 133, 144, 87, -99, -32, -64, 91, 118, -25, -90, -35, 126, -211, -78, 24, 71, -21, 97, 43, 82, 91, 122, 118, -84, 107, 25, -126, 87, -55, 187, 85, -1, 265, 116, 96, -358, -74, 55, -357, 212, -31, -217, -89, 92, -23, 97, -174, -177, 220, 230, 24, 1, -81, -68, -221, 144, -94, 84]
6515H4J6j86P2n9K93l95J64K47k65J00J41j07j82P2j15J24k31M23l1L7j95j70
6537a63K63k80J03k26K76onN7K5M1l01N3M16m54O0J13q2jK35j62n9Q8K9N8j46
6562f8J67j06K06k89L0M6j84L72k60K22L5m2o6N5k16J31j80K04j20k8%J65M7j60
6586c9j49N23o04M11K80j51k36k07K00q4P4k48K97k99M46l42o7J03M6Jj23Q7J94
6609A13k3l45L98l34J79Or6J42k6j19J51K41k47j78J31Q7k10J20J30j85j70K26
6631ir0Q6J76o8M8j56J47j84J44K53m77L03l89K13k5J47k56J31k24j3K33j59L14
6654A45j47Pk80K00m5O0K20m48N04j62j15J81j05k57J61L5p5m5j41J62j81O71
6676C45k54j19J88k14M1K5R7l43L6Rk1K03mJ7k08J35j02J25j17j90L25J97j57
$$ y = [84, 100, -86, -14, -73, 220, -175, -11, 236, -29, 71, 212, 105, -77, -5, -120, 4, -227, 196, 165, 202, 7, -163, 100, -180, -77, -303, -27, -33, -38, 19, 44, 85, -216, -163, 253, -201, -141, -28, -110, -111, 124, -38, -97, -9, 20, 78, -68, 99, -7, 199, -90, -60, -14, -198, 174, -86, 136, 171, 129, 63, 118, -98, 33, -147, 57, -63, -91, -91, 74, 121, -39, -188, 335, -269, 142, 422, 271, 35, -172, 28, -56, 18, -230, 67, -232, 214, -128, -195, -92, -46, -45, -168, -81, 113, 90, -255, 143, -191, -12, -6, -102, 40, 14, -105, 46, 287, 40, -138, -7, 80, -130, -10, 120, -65, -235, -9, -99, -13, 163, 95, 143, -13, 134, -50, 94, 347, -130, 173, -216, -3, -28, 119, -137, -6, -230, -243, -10, -169, 145, -2, 5, -275, -75, -120, -60, 160, -288, 216, 54, -61, 120, 15, -242, -81, -46, -121, -166, -307, -145, -326, 345, 91, -28, 160, -54, -13, 12, 109, -234, -198, -189, -210, -7, -11, 6, -202, -67, -169, -44, -161, -351, -26, 171, 14]
6699A4k21L61j09O0J22l63P0k62K00K76m32LM30k62L55l82J67L82m30n5K78L4
6721B36q6l43J65J96r5p7k86L20j57K40J47q5l76J40J12k08K10J82k76j16J71
6742A4M7j80J06K05j90L8m2j32n9K56k24K20M4j98R8j8j0J46J3k15K77k46J26
6765G6l5j72K50Lk26Jl1K47K4l6mj6k9l33K68L5q1r0R5L3J21k10L55m26P3J00
6791hk13J53J25l38J22K09O8k18J58J57j31j02M40k45K1l6j60o6m2M6N2J44l6
6814A00n5l6O7Q9k56J78K23j87n1j16L75j89N6l68j69K89l46L09K92o1j42R6j35
6837c7Q6K36m08K43J5j78Q9R6k84k6L72o7k66K75m3n3n6n7Q0k09J22K74l02L44
6861B46n59N6L01j34p2K34r6J39n37J84K16Q1Rl5p1L9k7N5J85m56K04J81q9O2
$$ y = [14, -207, 154, 45, 105, 227, -136, -66, -328, -128, 148, -284, -281, 149, -113, 242, -140, 27, 409, -21, -76, 202, 236, 150, -193, -28, 168, 73, -4, -290, 30, -127, 113, 260, 175, -201, -61, 51, -157, 53, 235, -41, -157, 14, 61, -119, -13, 192, 2, 40, -2, -134, -193, 63, -161, 59, 103, -95, 3, -15, -25, 121, 134, -81, 196, -50, 76, 41, -131, 119, 122, -104, -103, -134, 113, 137, 101, 97, 81, 52, -281, -13, 22, -59, -149, -54, -21, 100, -110, 245, -181, -108, -8, -221, -68, 57, -281, -159, 50, 118, -100, 58, 215, 84, -18, 422, 177, 198, 162, 2, -64, -106, -60, -8, 136, 100, 45, 9, 76, 165, -91, 87, 310, 123, 72, -44, 331, 142, 198, -170, -339, -50, -396, -87, 205, 144, 2, 98, -37, 49, 285, -123, 120, 135, -43, 46, 142, -142, -168, 204, 137, -129, 146, 103, 50, -6, -63, 17, -192, -70, 204, -98, 246, -313, -257, 44, -90, -162, 72, -24, 115, -422, -238, -22, 59, 68, 33, -38, 1, -26, 29, 214, -242, -38, 143, 54, 116]
6885A16r2o8NK31k66r5K46pK65l07J45p4k95L30m22M08J74n68L97r1o5p0j35L26
6909H8k10L17k88J78k90K64J28n0n3r2l63L51J81k24K05l14J04J5J0J78k20J18
6931C3l7J14j44j2J65j01K6j19j4J72j91J54J97l63Q0j61J76P2%J09j16K09k61
6954a2K2J28K1r4r3o3j25K89m96L97J85j59o3p6r4J19K51o2k49M35k1k87J98j21
6978C0L4j25J09J75j63pj54L43j79m0k9n8l91M08L22l07k36K34J47m11L98Q3j1
7001A72k52J17l50K98p9J84m0l91K93J05Pj20J74P7o1l75K01j1K03k90K59K43
7023C64m11K40j28J49j77m46O43j62J24j51k89K02m5J21J1j96N0n0P0J35M6j95
7045i5K76l04j16K27J2J16K3k26j19K18K87q5j23l43J93K6j38L06m14J52J00J26
$$ y = [116, 24, -44, -39, 192, -74, -169, 77, 70, 335, 28, 173, 99, -196, 134, -288, 120, 294, -274, 123, 32, -33, -103, -238, 88, -122, 195, -93, 85, -205, 59, 187, 137, 84, -8, -371, -20, 161, -63, 142, -172, -68, -53, -43, 135, -85, 33, -4, 110, -34, -46, 119, 18, 44, -75, -89, 83, -108, 46, 243, -120, -40, -201, -25, 47, 47, 156, 40, 249, -12, 10, 138, 159, 65, -28, -91, -216, 73, -423, -26, 159, 0, -63, -139, -233, -114, 137, 75, -174, 261, 240, -47, 151, 30, 64, -61, 48, 223, 60, 53, -101, 242, 63, 23, -6, -64, -455, -47, 275, -32, -268, -34, 113, -298, 100, 183, 172, -80, 37, -313, -15, -94, 90, 50, -341, -48, 57, 64, -56, 118, 195, 134, -241, -40, -51, 152, -138, 121, 364, -47, 193, 65, 214, 37, -409, 234, 72, 196, 45, -244, -42, -87, 34, 45, -151, -101, -151, -81, 54, 100, -95, 181, -123, -239, -12, 0, 116, 139, -87, -206, 12, 299, 214, 91, -252, -59, -33, -171, 135, -279, -127, -27, 99]
7067I9k52J91k5o4Pj83J42k4J35R6O3%j52m6k6K0p5P8R6N3q3K47l70O3K2P3%k92
7095b07M14k32J12j72K43l16M5o1J94%j42J31J11q2L5lm2r5j09L14N0r9N3k32
7119i0K62k69K62R9l09J1k73K26P8j83J01RJ51j86J68k67O3K14j33j13M33J4j92
7142G6Q4k8j66J30j09o9Q6kj32j3k4K24j27K01R7j78j11K97K0k16l12J69M23j42
7166A78j97K68m59J34j94Q2M07k77K0K53j95k16K22k45Q8K78j83J49k15J16m5
7187c1J09j66J90J06k65J90k62J63k26Q7R3J49k13J22j43K08j58PL8K5K15p6j07
7210E5o9K55j03o4Ro9K50l76K42j97J17o2K46l38pL23J18k31j6n1j7J71j50J24
7234A60Rm7j10K25k05kK0N6j2r4j48j53K65Q8j38j06K85j93K19k90M6j7r3J71
$$ y = [99, -153, 38, 13, -51, -44, -227, -85, -109, 26, 122, 185, 185, 33, -13, -39, -19, -94, -16, 80, 133, 50, 297, -73, -10, 12, 85, 85, -207, 207, -25, 87, -85, 158, -158, -113, -174, 20, 20, -122, 9, 120, 38, 73, 70, 28, -67, -176, 138, 188, 89, 142, -90, 172, -97, 165, 264, -45, -34, -307, -81, -3, -186, -85, -76, 75, -111, 57, -210, -147, 67, -66, -179, 254, 268, 76, 160, 132, -34, 96, -13, -82, 4, 2, -130, -143, -167, 57, -70, 131, 228, 50, -61, 236, 256, 40, -272, -103, 320, 178, -19, 249, -210, -76, -270, -188, 219, -58, -38, 215, 20, -196, 26, -219, -131, 147, -36, 113, -102, 14, -31, 78, -88, 102, 208, -57, 133, -129, 34, -192, -105, -12, 137, -76, 46, -97, 111, -47, -40, -2, 23, 238, 162, 55, -14, 241, 138, 74, 83, 14, 264, -112, 130, -67, 50, -12, 234, -104, -111, 212, 330, 99, 83, 32, 15, 186, 36, 160, 169, 122, 12, 237, 32, 30, 50, 106, 94, 0, -148, -301, -36, 52, -86, -192, 93, -100, 119, -171, -125, -142, -235, -64]
7258f4K4P1Qm7K7K0J2q8M4J16Om0q4k7Q0J78k24J61j69k70K19l9J79r0P7k34K88
7285A34j83K25k72J29q1J41R6l02n3J44p4K21j3m26O31n05K24K7m72L75M5K67
7307B78m33J71P8k26j8K59k53j9J66K45j88P0l19L09k07J41k6q6O3L5p2J06k5
7330D9K5r7n3M2R7K11k45R3j21r7J33m2J82r1k76L27K47m22j46K65k37K43l45
7353b58L78j06j90J78PM9l3J66k01K09l04Q5K36l30j2N5J78J00p8M6j5k88J33
7376Ek6j20K95j84J44p0k4k19K48l30Q8K9K13J2j95J43j41k0L38k62O5J89L5j83
7400C0k32J39N0j86J67k8q1J30k07K84k90K78k7j20K09j73n0O3J47n1j67K06J09
7423B00l00K37k52KN4r8k7o7J96j2J33j48K03K4k20K25j34L8j03J28j88K42j34
$$ y = [-64, -40, 31, 39, -8, 19, 39, 51, -37, 7, 123, 129, 89, 5, -22, 58, 236, 12, 173, 4, -266, -47, -86, 93, 3, 80, -154, 134, -49, 176, -96, 33, -48, 93, 189, -113, -166, -22, -96, 125, 112, -314, 317, -188, 36, 63, -409, -34, 11, 278, -155, 16, 94, -132, -150, 109, -144, -163, 3, 248, 60, 130, -189, 120, -87, 54, 28, -58, 5, 40, -32, 74, 49, 74, -23, -76, -34, 63, 274, 29, 122, 1, -96, 37, -5, 177, 86, -190, 137, 384, -38, -184, 81, -156, 87, -258, 120, 14, -176, 2, 9, 58, 25, 191, -10, 199, -105, -20, 216, -114, -126, -71, 107, 207, 129, 175, 160, -128, 5, -21, -141, 154, -30, 114, 44, 20, -199, 49, -281, -193, -164, 49, 61, -134, 9, -132, -152, 186, -76, -11, 178, 213, 30, -202, -63, -13, -199, -32, -60, -141, -11, -218, 66, -224, 54, 27, -93, 116, -57, -107, -44, 103, 52, -115, 91, 200, -100, 137, -115, -113, -59, -157, -184, -251, -55, -67, 66, -82, 121, 145, -75, 150, 16, 54, -49, 79, -109, 133, -1]
7446al1P2r8R0L2J58m35K94r9P2k47M04n00K50R5j40M1K78k79J11J1J47k23j15
7470a13L50j21j42j37N3n5K03k3j12N0J40j59L32l18j30O04l30l32J76L37j88
7491H5j27Q5j22Q8J66q3k13j47L94j20K12k12J33k34K3j15J73l76L80k5l7%N2
7514b0j8j49m3J55J10o7K63K1k02KQ1n0P2r3k60o5L59k70K20m1N5m7n9n5Q9J41
7540A29j96J0j8K47k2k71%K93k04J93m3j74J63j93J53k5j1q3J01k3L56n24j01
7563b43K14pJ5L33m73K02J32k15O2K51j82j2R1N1k63K76j34Q0j30J55k52J45R
7586A05k94L09J92m10K71k24q8K09l17M25j15j05R8k5OQ7l70K87q5J46q7J30K81
7609D26l97P5k2k06K10j78P7o9J03J85j42o1j1j06J24m2J61p2k15P9L08k03Q0
$$ y = [-1, -32, 40, -58, 32, 64, 222, -213, 81, -18, 54, -193, 211, -289, -39, 56, -84, -43, 235, -44, 67, 78, 225, 2, -113, 237, 116, -26, -163, -110, -165, 38, 15, -97, -47, 93, -66, 266, -52, -182, 422, 92, -240, -64, 273, 85, -42, 43, -79, 9, 175, 92, -121, -268, 126, 6, 218, 6, 139, -95, -72, -187, -14, -390, -10, -35, -72, -72, -20, -38, -187, -230, -75, 35, -32, 231, 252, 50, 52, 133, 83, 155, 62, -198, -263, 96, -174, 46, 5, 60, 13, -46, -101, -12, 129, -67, -57, -75, 172, 150, -121, -121, 172, -32, 161, 118, -56, 107, -86, 67, 42, 31, -52, 49, 26, 382, -142, -243, -29, -36, -21, 312, -161, 41, 173, -42, 20, 271, 89, 77, 168, 219, -44, 232, 98, 178, 48, 203, -49, 96, 105, -189, 120, 312, -98, 173, -51, -139, 70, -247, 178, 63, -42, 56, 31, 37, 124, -246, 41, -44, 102, 15, 145, 426, 29, 104, 82, -124, 86, -92, -15, -84, 19, 204, 62, 1, -10, -116, 8, -34, 127, 55, -160, -81, 227, 24, 104]
7632A04M9k46K50o8j19k43J0M59J14m40J85N4m0j06o0j17J06j7NJ89j8j05K12
7655A58k16k7J28J04l60K74Kr7r2j38M29k53J33j71L9p3J1L47j00l9K14m45L4
7678a38J29J87k10k2K24j6p6k5j0p5Q8j48O3kK27m1j45k3j4m7l23L97J20J11l28
7703i7j84K75l25L57j20P8K9JMJ45n9pq7k18K25L3M5k5L3p4lk32K87q6J25j33
7729a3M6j2j44K10j6m5m4l9j27J20J24J81J8o61M25L56k71m5j43RK23j68J31l69
7753b54M02k55k13L59N6p3k8r5j20P9M12l25L1j9P3K43j35l52L43Q1k30q6J34
7776B8k0k13L07k18p0M77k53j05R5K7n9K9j34O8LN9j94L42j87P2R9p7J29k20K80
7801B65k18oJ39j23k10J18J29o5N7k70M23q5qj11P0J9R2l32k72K62L32m22L8K12
$$ y = [104, 153, -93, 157, 89, -30, -273, -263, 196, 310, -130, 55, 109, 69, -37, -97, -214, -108, -125, -120, 69, 51, -54, 158, -58, -85, 43, 147, -213, 61, 63, -34, -126, -264, 165, -88, 45, -126, -87, -160, -149, 198, 98, 59, 273, -172, -138, -9, 178, -32, -54, 170, 154, 78, 53, 43, -32, 56, -92, -29, -31, 196, 155, 10, -13, -27, -74, -397, 0, 120, 231, -97, -281, -6, -331, 26, -94, -16, 13, 14, 18, 163, 104, 97, 10, -208, 17, 50, 95, 70, 103, 29, 26, -206, 81, -5, 120, -13, 33, 21, -123, 87, 71, 26, -18, -57, -184, -64, 60, 241, 259, -402, 23, 379, 108, 63, -80, -71, 152, -16, 115, -254, 148, -107, -320, 39, 95, 22, -6, -101, -221, -142, 270, -55, -24, -43, 30, 273, 138, -214, 129, 210, -20, -106, 28, 8, -205, 102, -116, -186, 291, 38, -67, 28, 55, -4, 25, -109, -41, -38, 21, -173, 169, -18, 54, 153, 76, 205, -15, 265, 47, 41, 180, 57, -153, -35, 94, 29, 86, -184, 239, 154, 146, 35, 105, 124, 216, -116, -388, -126, 206, -216, -178, 34]
7825C4n4P7q6p0J69K1Q1k42Kj73J80K32o3j79J01J45k60LK51m2k26J27M8p6K26
7850B26j14QN0l42Q8R0j21r7J97J13k24j23K59oK1j87R9M8rj72J91J71l52r4M84
7875B04k24o7j0L04k68J64Nq3j05P5L9j68J10L5J05k8k43QK92N3l08J41J25Q2
7899B38l61K40p4j61j0K74M9k21J05O1k68M0M7N6J88j08j94L79j10j10M0k25R
7922a16j37M50j35N3l30K31J37R0r1k03N6oj58R6j45L11k8K57j98k65o7M3L28
7945A73m01O0J14J31j34K24j51j5j5q2p7K80l28J62o3J30J66j24k94J23K04J34
7967B17q5J02j20o3j37m3Q2j21L65m5J2k16N1j71R1N6J57j45j20L62J39l21k40
7990a93L95J4j65k55R8o9J47%q2lO6J93k15J38J9q0k7K31n68L09Q1j30L84j31
$$ y = [34, -20, 57, -29, -99, 70, 91, 172, -70, -68, -241, -61, 171, 108, -71, 30, 175, -85, -82, 169, 127, -99, 28, 76, 0, 226, 112, 120, 170, -172, -84, 6, -115, -212, -15, 98, -126, -249, 10, 4, 25, -162, -63, -15, -24, -196, -5, 166, -186, -280, 204, -20, -87, -97, 207, -61, 103, 108, 25, -80, -5, 34, -134, -24, 11, 116, 88, -155, -147, 145, 198, -110, 31, 156, 238, -123, 117, 43, -118, -128, 146, 195, -26, 79, 140, -128, -88, -41, 15, 203, 95, -99, 280, 170, 60, 100, -125, -116, -253, 197, 62, 115, -215, 16, 153, 243, 152, -51, 5, -1, -159, -63, -208, 103, 75, 332, 134, -131, -198, -155, 173, -228, -168, -54, 77, -57, 167, 16, 1, -14, -96, -173, 107, -221, -59, -122, 8, 174, 50, -244, -121, 83, 217, 132, 234, 114, 51, -86, -129, -47, -168, 197, 152, 164, -52, -1, -172, -81, -25, 132, -13, -133, 229, 368, 47, -193, 202, 216, 51, -204, -106, -175, -28, -28, -110, -113, -47, 146, -69, 69, 88, 8, -19, 212, -356, -47, 34, -96, 288, 157]
8014A57j55K49k54j37nJ75Q4j47L26k89J93k57J88j81R8j67j32K87R0k12j9r9
8036b07J25k6J42r5Q2J24j21n8O5k05j3J34j20J56J04K0J33m60N8L21l78K30n5
8059d4P6j83Q4K11L8j67jj3j07J1J81p5m7j38K42mq2K95m48K01l49L93j27L93
8083C40k21l09K15k39J36K28j73k00L37j60p9m1j50K94k34M0J91l89N41J3j35
8104Ej8J33k6r5N7j51k32K47J59M9m92K68L40M7l25j31J94p7Nk22M60K80n04L0
8128Ap2j66J54P5P2j87P7L4PJ04j23J36K6j42M5o3n0J00N2j1k38J86L28j71m00
8153b26J05J78Q5j44J45m8q2j74J47O8k1j58J4j13J87l07Q32k65Q8l87J38n5O9
8176G6j15J82k72J40N7k97J12Q0L2j36L3J81j51J25j2
$$ y = [157, 2, 251, -3, -140, -145, 30, 114, -33, 293, 4, 197, -60, 128, -53, 45, -122, -254, 33, 123, -89, -108, -207, -82, -108, 34, -61, 21, 145, 24, -34, 31, -174, -187, -53, -173, -17, 87, 107, 240, -220, -162, 159, -219, 11, -44, 32, -151, -67, 144, 182, 15, 14, 1, -106, -95, 86, 11, -36, -174, 68, 64, -18, 277, -171, 30, -319, 74, -53, 340, 119, -190, 25, -214, -78, 150, -23, -223, 114, -46, -125, -166, -316, -22, -256, -216, -25, -414, 127, 140, 5, -13, 120, 94, -1, 56, -95, -327, -80, 79, 128, -364, -96, 244, 291, -34, -165, 29, -48, -43, -265, 195, 475, -29, 1, -71, -237, -83, -8, 64, -123, -46, -12, -5, 99, -24, 112, 138, -4, 41, -22, -72, 28, 80, 69, -169, 17, 345, 174, -226, -121, 57, 142, -2, 143, 95, 13, -161, -14, 54, 33, -125, -111, -224, -37, -344, 488, 223, 311, -76, 62, 7, 76, -39, 143, -129, 11, 68, -229, -117, -37, -5, -141, -108, 73, -78, 47, 35]
8191C5
$$ Imaginary data points
##PAGE= N=2
##DATA TABLE= (X++(I..I)), XYDATA
0@%%%%%%QqQj6J6k4M0m8N6p2Q8j12J36j60J92k32K80l28L84m48N20o08P04q08
30d32R24j052J197j357J533j728J941k176K433k716L027l364L732m133M572n053
46b652N577o150O779p468Q227r064R988j1017J2167j3460J4930j6613J8561k0850
60a1045K3581k6910L1072l6443M3677n4004P0046r8565J64533n95118m51522P02037
72b38661p3109L12195K66190j18784n68638J53282K30034l78266R0791L25553
82E87r8526j9058J62908J63166l49033n5980J97726j37306J04326J68042L4143
93A70995m9293j81252O262j44833k482J44942R9678K75272o8890j48219j0668
104I1512j99687n1645J11899K73226j6855j62273K13969j52543k38172J51940
$$ y = [0, 0, 0, 0, 0, 0, 0, 8, 0, 8, -8, 8, -16, 24, -24, 32, -40, 48, -64, 72, -88, 104, -128, 152, -176, 208, -240, 280, -328, 376, -432, 492, -560, 637, -720, 813, -915, 1026, -1150, 1283, -1433, 1594, -1770, 1962, -2171, 2401, -2652, 2925, -3225, 3554, -3914, 4313, -4751, 5237, -5780, 6387, -7073, 7857, -8756, 9805, -11045, 12536, -14374, 16698, -19745, 23932, -30072, 39974, -58591, 105942, -489176, -940698, -238661, -311770, 425, 266615, 147831, -420807, -267525, -37491, -415757, -324966, 587, -97939, -116997, 45911, 209077, -139956, -195936, 1790, -135516, -31190, 136852, 170995, 121702, -59550, -53288, -198121, -200603, -55661, 44017, 319289, 250399, 102180, 91512, -108175, -159820, -47921, 225305, 208450, 46177, 260146, 107603, -130569, 21371]
114B1371N8363j36261p1846L42084L8543k60145K04719o9640l52151o332K39311
125H016N8942j68973K36834L7820l69477P8688J24674r3232n8157J77939J27250
136A60324k51597M1667M1525k69384o452J37471J52799K6653O4513Q8779k43979
147e7681q4175q093o5181R2915M0229J32195M8529m4959k3587j46561O858n4670
159a64181L676K17162j3032j6251J7507l4110j14738j17364J72243j8706m1392
170a09186K65198M7790j18117q8855P525j17040j43515K90350J18659j00590R9761
181A51980J656j57385j55843J14643N1006j42215J95050J13831j12460k1777n426
192C3060o1972j61928R6232J50945o1438J03690L5581q9801q3312n5542M6889
$$ y = [21371, 79734, -56527, -128373, 213711, 252254, -7891, 196828, 127188, -224963, -231295, 8016, 66958, -102015, 134819, 172639, -196838, -118150, 6524, -86708, -144865, 33074, 160324, -91273, -49606, -8081, -277465, -283917, -146446, 6353, 33006, 97519, 186298, -57681, -141856, -149949, -215130, -122215, -81986, 50209, 98738, 53779, 30192, -116369, -109511, -164181, -160505, 56657, 43625, 27374, 44881, 10771, -103967, -221331, -49088, -67794, -109186, 156012, 203802, 85685, -3170, 4355, -112685, -256200, 34150, 152809, 52219, 151980, 153636, -3749, -159592, -44949, 6057, -136158, 58892, 172723, 60263, 38486, 33060, -28912, -190840, -94608, 56337, -5101, 98589, 134170, 44369, -38943, -94485, -47596]
203d7596m9716P0288J12319k2632L9648q1543o6317k8112o1601Q2766N9652Q2724
215H9880N108o2149K5891j35959m5111Q1890P855N0867L9835P5054q1578j22592
227g1009N5976q5306k4464J18114P0115J3496m9669N0411q3168j29502Q5348j386
239e1044N654P4706P4484J2809j11473J3612n4475r8675Q9639O0175N5364R351
251H0127l890k2451j36014P467J2142r426Q4387L0241M5659m0349n0261j5615
263a7983r4486K9764M1681M4873P7435j6728O627p2956o3691P034k7311P2003
275a3738L9548L1340L1349o4195j3870o5773l0448L7220N509Q2700K0363L567
287F3572p919q6509j5119m2641J4257O9727K6535O9896k3939m1013m3905p7640
$$ y = [-47596, -97312, -27024, 85295, 62663, 102311, 20768, -45549, -73661, -135262, -52496, 7156, 89880, 94988, 32839, 58730, -77229, -122340, -40450, -32595, 18272, 58107, 133161, 51583, -71009, -15033, -100339, -124803, -6689, 63426, 76922, 27253, 77664, -5504, -135006, -49658, -51044, -45390, 29316, 103800, 116609, 5136, 18748, -35727, -134402, -44763, 15412, 70776, 80127, 76237, 53786, -82228, -74761, -62619, -72045, 12342, 42583, 88242, 47893, -2368, -17983, -112469, -82705, -41024, 3849, 81284, 64556, 71183, -1773, -65464, -58430, -85741, -13738, 25810, 57150, 88499, 24304, 10434, -55339, -85787, -48567, -43058, 39642, 60005, 63572, 55653, -30856, -45975, -88616, -74359, -4632, 21903, 91799, 67860, 26847, -17058, -94698]
299i4698K7037J1630O0141O2407j6639J5807n8629l3534o814k0044N0599j4M6743
312D3992L5258m0552N199n5638l8467j4924J7075Q6532K187L9348L756r8763m0343
325e5340k6800K3643J9558N0004Q3339o3754k6203Q43o0825j1336K5416P0198
337B8743j0201L482O9331p1942m6540O381k3136j2195J9156J00393K856k4581
349D1747L6238p7381o2239m105K9920L6777Q513O3888k6370o1699J830l4587J6103
362c1365J9406K9397L8842k2167J077m2619k7991k320l4928O1988M4365P303K9240
375G0228p537l3129q3901N515L3328m0437P0333O3293l0957l8481j969l501q5017
388h2232L8275R0261m2744J5427M5587l1840q2476q519N1350o0604K6261J07313
$$ y = [-94698, -67661, -56031, 4110, 66517, 49878, 65685, 7056, -26478, -33292, -53336, -2737, -2751, 43992, 79250, 38698, 43897, -11741, -50208, -65132, -48057, 38475, 40662, 80010, 83766, -14997, -55340, -82140, -58497, -38939, 11065, 94404, 30650, 4447, 5290, -55535, -66871, -41455, 28743, 18542, 22024, 91355, 19413, -27127, -20746, -43882, -56077, -36921, 63472, 66328, 41747, 77985, 604, -61635, -65740, -35820, 957, 9470, 73358, 46988, -14711, -12881, -47468, -31365, -11959, 17438, 56280, 34113, 35190, -7429, -35420, -37740, -72668, -10680, 33685, 40988, 70228, 62691, 29562, -54339, -48824, -15496, -55933, 14400, 77693, 46736, 8255, 6286, 2785, -82232, -43957, 46304, 3560, 18987, 64574, 32734, -49742, -58261, -6911, -67515, -41254, 66059]
400F6059j8437k8543N088p302p4969k1086Q5262j1725M383N7348j8875m5108l7176
413d5081J7428j2318o380P3358R401j32m177l7004k0033m0314R896K8067K9675
426B386M3692j1509J4206k7877o6039J2257J0448R084J7906M8331J2902p5476
438i689J0571N985o1185K1030O2996K1833l3604L0207J8849j06396j0854M4661
450e596k6264L78O5329M7022o7381j2662L3486q1830k2142O1337K3847j0594K0536
463B5466L9976o8658m3126L2920k4771L527M3779L5593m698k5926M480m6246k4275
476e1959K0500L416M4123J9488l496k193k7580k8787l1763L3354K5746j3826N9498
489D6521J4121n4441k2516P264j9964l7590P1849M8276n0831K6422K1431o5198
$$ y = [66059, 47622, 19079, 24167, 16865, -58104, -79190, 6072, -5653, -1270, 56078, 37203, -7905, -45081, -27653, -39971, -46351, 27007, 36408, 36276, 32099, -4905, -24938, -65252, -55356, -27289, 2386, 46078, 34569, 48775, 20898, -45141, -32884, -22436, -13352, 4554, 52885, 65787, -9689, 882, 6867, -54318, -33288, 29708, 51541, 17937, 48144, 66993, -39403, -50257, -5596, -31860, -31482, 33847, 80869, 13488, 826, 34312, -47518, -69660, -8323, 15524, 4930, 25466, 65442, -3216, -46342, -13422, -38193, -34666, 9113, 44706, 40008, 14082, 18562, -27684, -51959, -31459, -28043, 16080, 35568, 32072, 29879, 2299, -26488, -58251, -24897, 849, -12977, 46521, 60642, 6201, -16315, -9051, -29015, -66605, 5244, 53520, 2689, 29111, 50542, -14656]
501a4656m8073M0637K7076m4150N8837N9746o6373k3311J9484k7713m7818M1983
513b4331O4689l4889J5773L9395m9715m2273K463J4397j6568K1585N5926j8369
525B8083j3886n910k9485j4145n633L0541K4559J3261J1703k2440r599l4882k5604
538e3437L2447J1485J3613K8681J7868k7331m5856J7203j8828k8774N1095L3352
550C1518j2184j0179K0368k8817o2115L6165K5352k0595L3762M0426j7905n1301
562a5505J0049p99n1157L3983N0743m904j904J6768p789n6871J169K8627j7753
575a5343K1274L3303r66k5284j7110p62l0588M818L3813R196J8340k92j1239k2392
589c232l1178l838j202K4000K2050P401K1173k1871k8047o644o080J510J0908
$$ y = [-14656, -62729, -22092, 4984, -39166, 19671, 79417, 13044, -10267, 9217, -18496, -66314, -24331, 40358, 5469, 21242, 60637, 10922, -31351, -28888, -14491, -31059, -9474, 46452, 28083, 14197, 8287, -21198, -35343, -40976, -10435, 14124, 27385, 39088, 16648, 7049, -27833, -53437, -20990, -9505, 4108, 32789, 50657, 23326, -22530, -5327, -24155, -52929, -1834, 31518, 19334, 9155, 29523, 706, -61409, -25244, 108, -20487, 13275, 53701, 35796, -15505, -5456, -6255, -57412, -23429, 27314, 22410, 20506, 37274, 29485, -27386, -26217, 2410, -15343, 5931, 39234, 38268, 12984, -4126, -4888, -35476, -30658, 3155, 12351, 30691, 30399, 19160, -3232, -34410, -38248, -39450, -15450, 6600, 14001, 35174, 13303, -14744, -21388, -27468, -25958, -15050]
602a5050M1874N215k2851J2254k0524l3637L610K6949J2217j911L6418m505m8604
615h545l687m255j7804N153L9017K0186k3142J0681p174m2545l510J5356J3400
628f869N957K4211J3633l3059j0719p858j7495Q878J8839K6855O534J154m651
641B5410l1155j2364r238L360K5310J2186J4913j175j4195j9864k1224Q986J178
654a7872J1600L0030J692q259j3048j0920j8068j1029K9098J1721O992J9268o402
667B4803k1431k3616p20p65k71L5544J4983n963m556j5758j8109j7843J4145J8715
681h42N555K1818L82j5772j8387j4428q44k946K0873K2547K038M283j3980j6911
695f614j6051n620J6353R526J9980J2370q949r820k1100r721l195O818K3488Q776
$$ y = [-15050, 26824, 32039, 9188, 21442, 918, -32719, -29109, -2160, 10057, 8146, 44564, 40059, -8545, -12232, -16487, -34291, -29138, 9879, 30065, 6923, 17604, 10430, -32115, -35625, -20269, -6869, -912, 23299, 36932, 3873, -6846, -14704, -32199, -23321, -4482, 22373, 28907, 30061, 25410, -5745, -18109, -27347, -23987, 1323, 13509, 28422, 27247, 13052, -6812, -28036, -19050, -17872, -6272, 23758, 25450, 17191, 4143, -6777, -24845, -35874, -6776, 4945, 11937, 31205, 24803, 3372, -20244, -20964, -21729, -22000, 13544, 28527, 22564, 18008, 2250, -15859, -33702, -19557, -842, 4713, 26531, 26913, 11141, -7246, -21674, -22518, -25464, -4591, 17956, 19994, 24277, 10297, -6614, -22665, -28285, -11932, -2406, 17574, 29944, 20995, 11175, -9925, -19646, -22841, -16023, 7465, 16241]
709A6241P992m344j8043j3721j4943M090R449J2950K0105r92n475j4952j7357
722a9000n974k205J9547J5755R614Q608j3617j4348j5826o060Q576Q368K1915
735A5353Q871l249o544j9795r672o098O342J7991J0106J1871n291j2060j2650
748d825j8021K473Q881J3106J5272N549m72k0028j3627l327q667J2408J9191J1552
762A9465k0n180m818k5314p875J3432L345J1678J6467N703j6806j5409L23j6642
776b1651r67K3901J0728K722R00p27k2121j8060R243J013O205K0738Q807n460
790A5271j4343o231j2793q152J6266J1154J1907P075n101r498j6435o713m55R525
804h523J6576L262Q711l242k0812r545l353j42L010K0795J6207j2163n71k519
$$ y = [16241, 24233, 19889, 1846, -11875, -26818, -22728, -13279, -329, 19776, 18784, 13309, -1643, -19000, -24974, -27179, -7632, 8123, 17737, 26345, 12728, -1620, -17446, -23506, -14930, -6562, 15353, 24224, 20975, 14431, -5364, -15036, -21134, -14792, 3199, 13305, 25176, 19885, 7825, -4825, -22846, -20373, -11492, 1614, 16886, 22435, 21963, 1935, -11692, -15019, -23686, -11278, 7913, 19465, 19445, 14265, 9447, -15867, -23742, -10310, -6965, 4713, 21180, 26883, 10077, -5332, -5009, -21651, -22618, 1283, 12011, 14733, 15633, 14906, -7215, -25275, -16032, -15019, -8814, 11924, 20731, 15271, 928, -5303, -18096, -26248, -9982, 1172, 13079, 20154, 15053, 5555, -10880, -17593, -18048, -8523, 8053, 11315, 20026, 16784, -4028, -13573, -16926, -17068, -14058, 6737, 22944, 10781, 10210, 7691]
818G691k2795j0182J3329J3906j989J5775J4467k4958j3715M772p529n517J8983
831B238K3129j0505m717P178k2775j7231R147J1702P78J0058J9709j2269j8931
844b489r13r854p823P887J9224P030k999L587j1864j5461l693K176J1238Q438
858D484R072M369q325j1837j3340Q55K615K749K0175J0902o634p328m160j1658
872h061j5891J3470J6608m473R303R395j5267k0839K737O369j2054J5954K4566
885B1817q662j0056L450q792k3286N024K2153l856P471K0366p509j9656m986J880
899d642j1918N103K4365J253m300J700q821j4997m722R733N019P591J2077l772
913A3669n998r767j2046j547L477P609Q911J2465K29j4186j738o413j2949O914
$$ y = [7691, -15104, -25286, -11957, 1949, -40, 15735, 30202, 5244, -8471, -3699, -11228, -16745, 2238, 25367, 14862, 10145, 17323, -5452, -22683, -13536, -1834, -1056, 9002, 28711, 16442, -2489, -3402, -13256, -21079, -13192, 6032, 13062, 10063, 13650, 1786, -13675, -17368, -15192, -3954, 4484, 13556, 17925, 9600, -2237, -15577, -14722, -12107, -9358, 10817, 21719, 15085, 7757, 3597, -8061, -23952, -10482, 6126, 1653, 10956, 20351, 5084, -15755, -13018, -6649, -18703, -2749, 21817, 13155, 3099, 6549, -2243, -25529, -20505, 1648, -2208, 5263, 25629, 18120, -1536, -6522, -4642, -16560, -11457, 12908, 14161, 9861, 11561, 2740, -12257, -16979, -7246, -2227, 5364, 17441, 13669, 7671, -2096, -14142, -15689, -12212, -4603, 4308, 16773, 17002, 2816, 1078, -5335, -18284, -11370]
927a1370J6702L683k860R443n266k5156J847R053n633O549K0557J939j7949P95
941B334o11k1475J514J8302L370o29J1363K748k0745o390N420p044L068J5920
955G145Q216n578m169k118j4138m439P907O337Q380N220J202o517j1433o944m053
970a4982N257O218N342J0816l617r610m830m206n427J938J5520N423l626N155
984I371n154j4648m418Q394L214O15J6405L903j3395l510j703r169m188J3589
998f94R934m160N835K081j4590r068K293K206j091J1329J1315p602m084k547r112
1013g955n354M807J0240L668M487L913p906q260m996j032K743N538R299K613j955
1028I850m653r268l486j924L573R001N308J991l800m968q221o780M810M179M991
$$ y = [-11370, 5332, 9015, 6155, 15598, 10332, -14824, -12977, -3924, -9557, -3008, 17549, 19488, 1539, 2334, 1723, -19752, -18238, 64, 3434, 2805, 14168, 16916, -3829, -10219, -4799, -11843, -8775, 7145, 15361, 9783, 5614, 3496, -10642, -15081, -7174, -837, 7543, 12763, 13965, 7448, -3985, -10929, -14982, -9725, -3507, 1835, 12651, 9034, -576, -5406, -9612, -15039, -13101, 2419, 7842, 4216, 9371, 4217, -10431, -14849, -6455, -3241, -2626, 13779, 17682, 4287, 777, -926, -10095, -14283, -694, 9240, 5080, 10915, 12996, -1594, -10662, -8369, -6163, -7254, 4075, 15390, 7788, 3704, 1157, -7955, -13309, -8502, 1738, 5406, 9893, 13806, 5900, -2360, -7356, -8388, -5645, -107, 9192, 11805, 9850, 5197, -4071, -7557, -9481, -5908, 3093, 8401, 10392, 6592, 1624, -6597, -13377, -8567, -4388, 603]
1043F03P463J490m530q952l797l143j761R231P650K755O91k388o536r159K29L290
1059f864K841Q495N690j018n386n985l780n357L952P452L821M280L0m237q230
1074d296n031R89O26O977P921J643j494n214m414o484l47P312M556N148M239l094
1090I037o981o732n81j293L913R795L464o62k961n155p719m783N070M495M277
1105C184O749n55n630p082m115k247n34Q026O269K477O65m029n859o009j145L580
1121f255M033O900K702K4l175p602k648k28J492N002O680K756m853l023k949p675
1137h819J0O866N072R70L164J399j1365o121K342j690M79R844Q136m774l854J599
1153C258r488p141P802O721O2M771P028p982j0802K165k048m079P841J0150k57
$$ y = [603, 8066, 9556, 5026, -3926, -7723, -10866, -12627, -3396, 4254, 7009, 7700, 5312, -1224, -10383, -10154, -6864, -4023, 4472, 10162, 9144, 3758, -2227, -6007, -11364, -7412, 40, 3861, 8141, 8171, 3934, -4296, -9327, -8338, -7712, -735, 7186, 8829, 7335, 2121, -2293, -8777, -9124, -1812, 2744, 7892, 12131, 9037, 2056, -4676, -5257, -6550, -2637, 7158, 10622, 9960, 6999, 1844, -5875, -10658, -5588, -1093, 3184, 9933, 9378, 3748, -3334, -7449, -9696, -10230, -2204, 4065, 6542, 7207, 3178, -2681, -8690, -9835, -6255, -2222, 4678, 7380, 7404, 4229, -3373, -6021, -6249, -4757, 245, 6925, 9681, 4828, 1805, -1144, -8819, -8809, -1943, 3129, 4099, 7263, 8662, -2703, -8824, -6482, -8172, -7693, 2151, 10287, 5513, 1659, 3258, -6230, -13371, -5569, 1152, 1214, 5985, 13013, 5031, -5771, -3606, -5654, -9733, -1892, 8258, 8001]
1168H001l776J983o177j0388K224M932J661L865N905r36p484k510k774j769L533
1183c710M960N285J395k913l970m632l028j893O374P547q17K270K130q529q553
1198h084K325K866l870P838J0998o156n919L111n063j0094N913J1231l394J309
1212C011R520p171j2255J641K668n677M883J3858j854n801L090n156j0107N80
1226h770P427M36K501P214k753p289k558k551j675L145N981L380J353j558o982
1241b699k775j629k533N529Q174J169j300K134m067j0707J383N780k220M231J0118
1256A0588j781r515N56j23r693K735J2271K65k296N712j609j3247k187O028l170
1271e466J373J1667K736p003j846K24q409l050Q794L857L8L909J067o841o560
$$ y = [8001, 4225, 6208, 31, -10357, -8133, -3201, -1540, 2325, 8230, 7294, -190, -2700, -5474, -7243, -3710, 1250, 6535, 7930, 5017, 1047, -3585, -6613, -8506, -2132, 5415, 4598, 6868, 8998, 469, -8084, -5759, -2893, -6763, 1075, 12073, 5917, -2, 3109, -1954, -12048, -6135, 5096, 1702, 3011, 12531, 5360, -6895, -5254, -2586, -8263, -3380, 10478, 8624, 2823, 5913, 757, -9350, -8770, -1343, -907, 1594, 8808, 6055, -1234, -3792, -6343, -8018, -4873, 1108, 4488, 5841, 4283, -2699, -5474, -7103, -9636, -4107, 4067, 5236, 3936, 6070, 2003, -8704, -7321, -1541, -3761, 470, 10588, 8807, -708, -152, -275, -9968, -7233, 5038, 5303, 3007, 8719, 7110, -6137, -8324, -2296, -5466, -4093, 7574, 10310, 3307, 1461, 1685, -6724, -9774, -980, 2877, 2915, 6824, 7891, 1050, -5510]
1286e510R84PJ209O507M129O43l987m142l365l036K38M416O426K000j860j3m404
1303B42q119n59N034J661J060Q030P28r796k406Q70n440j204J1269M887m552L002
1319D707J625j1379n077O606R68j018Q924N948q558m017K270o915m103P950O695
1334D626j534J984K708p967o541J771P59M49N754N857j773l018k286m955k332
1349f498K524L607M928K599n02l301l386m851k572M388M077J723L917J006o000
1364A659n664K45j842j313P851N385k213o54q9o668n694L768M047o06O011M286
1380H509m623n494p28k460l031N506O599M36M66M72m973n808l07K500J104M436
1396B604M192j355l119l487l403j710J685M182L515K291n92l720l370l831q29
$$ y = [-5510, -4526, -4519, -3310, 3197, 7326, 7969, 3982, -160, -3525, -6561, -6323, -1907, 4519, 6519, 4659, 4646, 242, -7877, -8436, -3402, -1741, -681, 7349, 8077, -1719, -4125, -3255, -8695, -9899, 1370, 6257, 1705, 4707, 6332, -5047, -10124, -3518, -2550, -3568, 5356, 11304, 2746, -1271, 999, -5916, -10019, -2069, 4626, 3092, 5076, 7784, -183, -6724, -4953, -4194, -3745, 2009, 7866, 6093, 3075, 789, -4166, -6498, -3974, -367, 4561, 7160, 6658, 3357, -29, -4880, -7452, -3064, 1013, 2736, 6653, 7659, 1659, -4005, -3760, -5602, -6915, 936, 6321, 4108, 3454, 3365, -3303, -8997, -5229, -1182, -1788, 4223, 8509, 3886, -1608, -2336, -4796, -7827, -2321, 4278, 4714, 5180, 5652, 679, -5129, -5436, -2936, -1832, 2604, 6796, 5441, 2322, -1165, -4568, -6278, -4593, -411, 3104, 5395, 4803, 1083, -2287, -6118, -6947]
1411f947K822M310L116J977Q0l811n042j529K68J270M708M516L58k557j964l664
1427b089m487J445M086K565K790K198k543n263k646j305o18L319N242K397j090
1442D001j502k967m795o28K755K440L224L156n71l820l538j568j380J983M562
1457A352L323J044j077k739m309k950J051J862L416L878J035j981l530k677k613
1472d915j21L679L083K766O69j197m010l865o27O22K322L887K987m74k502k680
1488c76l317j804J832L212K420K020L0k796l822k445k39R41L668L590J028r98
1504B944k648k989k481Q8K200L572L331O75r72k393l960k251J256K542K430L221
1520D565J906l522l252j752k317p47M160M427J15q7K7m216m147P69J474Q68L472
$$ y = [-6947, -4125, 185, 3301, 5278, 5358, 1547, -3495, -5024, -4756, -3486, 1222, 5738, 6096, 3539, 1575, -2089, -6576, -5131, -1045, 1520, 4310, 6508, 3965, -1298, -3944, -5249, -5867, -2548, 2694, 5091, 4001, 2499, -468, -5263, -5891, -3136, -696, 2528, 5684, 5113, 1293, -2245, -3813, -5193, -3210, 1352, 4675, 5719, 4642, 1903, -2406, -5356, -4305, -2443, 973, 4851, 5886, 3905, 375, -2302, -4915, -5036, -1357, 1726, 4492, 5161, 3964, -46, -3911, -4538, -3916, -1594, 2293, 5280, 4806, 2304, -376, -3693, -5497, -3665, -453, 1967, 3987, 4017, 1221, -2601, -5046, -5285, -4344, -676, 2914, 3942, 2944, 296, -2693, -5174, -5086, -2886, 686, 4017, 4692, 3720, 1327, -2633, -4884, -3628, -1086, 1344, 4565, 6471, 2949, -303, -2055, -4372, -5119, -959, 3468, 3583, 3496, 3523, -693, -4840, -4071, -2597, -1729, 1743]
1537A743L702j652l091r65k298j980K017M163J654K10J499k761m170j062L03J098
1553a590K366L185R77j745k224k659k229K46J823L376K254k8j391k656k946k376
1569e617J370K926J572K095J954k281m229j084p1j679L180M901L73j478N69k032
1585D69m643m1L948L09R25L997o96m625j328O19k514j68N586J579j977P82l39
1602A883m714j853K818Q45K54L740J262k758k156p25j804r8K745K889R24O18j466
1619B404j955k210j820J341K572J584P19J825j610m439j153N64r75J010M995J041
1635C893l035k53pn006p16M651J057q75L599J049n385j752K591k380m16N225K603
1652D843l488L89Q91m661k196L316J421n84L176J099l122k342m41j270o33K862
$$ y = [1743, 5445, 3793, 702, -263, -2561, -4541, -2524, 1639, 3293, 3503, 5002, 2241, -1929, -2991, -2688, -1590, 776, 3961, 4938, 3193, 969, -1690, -3919, -3673, -1850, 1526, 3780, 3752, 2361, -295, -3241, -5617, -4247, -1321, 251, 2346, 4300, 2019, -2210, -3294, -3365, -5044, -1864, 3037, 3410, 1932, 2501, 469, -4174, -4215, -267, 42, 967, 4964, 4268, -357, -1685, -1066, -3580, -3748, 1838, 3417, 1440, 2222, 1883, -2831, -4684, -1866, -1021, -767, 2973, 4235, 1477, -679, -1404, -3208, -3306, -561, 2328, 3252, 3870, 2404, 449, -1761, -3581, -2240, 332, 1916, 2635, 4460, 2850, -1589, -2742, -2178, -3153, -2143, 2852, 3893, 858, 605, 598, -4408, -5124, -473, 584, -291, 3308, 4357, -1028, -2780, -189, -2569, -2985, 2240, 4843, 1355, 1744, 2635, -2026, -4222, -906, 515, -69, 3107, 4206, 1084, -1258, -1699, -2969, -3602, -740]
1668g40K215N92j43p99k098j579p02N23K649J949J96O87n26l425j430J228k05
1685a608M34L826J250k518j081R9k677j689L081K247j332J724J488l875k856J882
1701a605j03r64L724K597k133j299P83k556k532K132L184m53J182J941k083k864
1717a049m28K40q08J810K451P35j052o08j657j504o15Q29J785J452N28K0q87k237
1735i95j638N56J102O36K208J500j307k135K06j054k081J944L269r63k78J664
1751B634j948l663J162R66j252J535L743j155k932O58n12l233J003L497J7J97
1767G17J748o26l464m90Q27p89J019K921R27j486l13r79j686l00R26J369J432
1784A753L44m09p42j526j450J90J213O36J192J296n46k404j60p41p76J228K609
$$ y = [-740, 1475, 2067, 1924, 1125, -973, -2552, -3254, -2731, -82, 1867, 2063, 2750, 2224, -1201, -2631, -1403, -1608, -1174, 2652, 3902, 1384, 303, 402, -2275, -3964, -883, 1364, 32, 1756, 3244, -631, -3487, -1605, -1708, -2672, 1052, 3649, 1516, 217, 1000, -1556, -4088, -1956, 1228, 775, 1957, 3898, 1815, -1049, -1477, -1237, -2045, -235, 2216, 2951, 1899, 1291, -366, -1870, -2485, -1656, 129, 1581, 2109, 2129, 1242, -995, -2633, -2077, -975, -339, 1869, 3369, 2062, -73, 133, -921, -3002, -1058, 2211, 1248, 970, 2634, 686, -2977, -1815, -849, -2101, -566, 3177, 2022, -910, -252, -764, -3997, -2994, 503, 520, 717, 2465, 1839, -1625, -2115, -1288, -2077, -1058, 1863, 2790, 1304, 991, 12, -1674, -1974, -1048, 321, 1753, 2097, 1688, 946, -580, -2030, -1840, -627, 9, 1201, 2497, 1951, -453, -613, -1354, -2130, -902, 1707]
1801A707k89m42J096j411k463J15J534m67P21L164o09k420J35o86j877M14K342
1818E64R91l93R76n10k628r22L62J70N86K123O23q98j081p91j182p1P64J403Q92
1837I78P75o89p21r00j322K74P01P93J256P54o62j491o33l20k05N30J613R74l34
1856A371k2j086j500q85J114R49j2J699Q7r69j358l63o88j97K009R00K52j2k14
1875A075j354j394M67N02N30J680O82o89p94j045j098l10M96J811M81N79l38r72
1893C09j207p33L42O16R37J222J03p29q00j132o22M94J091Q66N86L54o50j094
1911d7j178l22L86J018R34R60j1q92j234j087k37O19J076P68Q69l72j109q55p40
1930a454l10Q35P28J297L56m60p30j139o98j76J024R23J026K35m04p40j224o57
$$ y = [1707, 1418, 976, 2072, 661, -1802, -1687, -153, -620, 101, 3265, 2656, 236, 371, -315, -2192, -1778, 564, 1555, 1162, 2138, 1628, -1000, -1922, -1560, -1390, -804, 1319, 1942, 1044, -37, -828, -2010, -2081, -1317, 86, 978, 1753, 1064, 343, -557, -1879, -1605, -904, -111, 1145, 1899, 1237, -254, -887, -1207, -1412, -882, 731, 1705, 1371, 1349, 263, -1237, -2122, -1008, -59, -71, 1628, 1715, 746, -612, -975, -1663, -1860, 149, 1049, 1301, 1289, 1075, -279, -1673, -1206, -704, -174, 1506, 2188, 1499, 705, -340, -1438, -1748, -1252, 559, 1040, 1619, 1281, 309, -898, -1631, -1289, -673, 264, 1486, 1589, 860, 60, -1072, -1694, -1200, -109, 757, 1343, 1697, 1047, -47, -1225, -1547, -1161, -143, 791, 1751, 1740, 848, -386, -1473, -1710, -1091, -15, 753, 1622, 1250, 141, -714, -1454, -1764, -929, -201, 1096, 1452, 992, 262, -877, -1575, -1751, -727, 196, 1222, 1457, 1053, 313, -911, -1568]
1948a568M25M69J014J280j73j018n29n70j030K98J182O36M12M50o14j474o67K97
1966a180k02P81J595N87o78j83p86j222l17J087Q79M42J266l45j281j178m62K48
1984i49Q8J158J314k26m70n56j052q92N32O47R81N85O09n07j393o09k62K12N40
2003b50J091N36J05p97p70o81n15j43J280J188k43J65k14j479j039P37K85q9J436
2022F03R94q86o96l19r49p89J504J163j14L75N20j259j620N51j9K67J018J219
2040A563o5r43%r75r66P8J335M36M18L93l58j130n56k68L8R48N76P12J50j127
2060B59r34J29n40m7J624J110o32j77M12j468j430P60Q88j44J260Q05q60j257
2078b42M5k87j084R99J572k31l76R15j262j613J42R46k21P35J311o55o09m93j91
$$ y = [-1568, -1143, -674, 340, 1620, 1447, 429, -100, -670, -1700, -1402, -220, 416, 828, 1278, 664, -810, -1477, -1180, -1382, -601, 994, 1581, 903, 720, -66, -1288, -1605, -518, 361, 803, 2069, 1724, 443, -735, -1197, -949, -861, 297, 1611, 1385, 915, 359, -693, -1585, -1053, -406, 575, 1160, 1769, 1262, -131, -740, -1002, -790, -250, 841, 1377, 1482, 685, -85, -766, -1281, -1424, -144, 1044, 801, 966, 752, -727, -1766, -1029, -744, -833, 603, 1597, 711, 15, -304, -1253, -2042, -538, 625, 511, 886, 1406, 147, -1473, -922, -941, -674, 344, 1563, 1498, 555, 555, -420, -1386, -1308, 27, 463, 881, 1274, 916, -214, -770, -1038, -1000, -52, 524, 1236, 1386, 259, -675, -546, -1086, -1133, 491, 1601, 969, 792, 1204, -264, -1694, -934, -46, -190, 1070, 1875, 1015, -242, -197, -484, -1568, -569, 1003, 772, 396, 1311, 49, -1564, -1422, -476, -697, 38, 1349, 694, 85, -408, -599]
2097e99j005K80J289L97N44J12m82j262l99q3O11L68R69L96j45o38p43n50K19
2116g21MJ303R02m99o19K30q30j254Q72Q01J3M43Q77r40j114j23r4m86N59J786
2136A110k91j25J55q65j366J11J002KN19R56K15j404m47j8n30R8J187L94K3J7
2156G43m32p66m55M20Q0N38P99J95p58p9q37m37M4O23O31O30J37o83k78l39p19
2177i43K78N89Q16J13L78m75j247l66J06J9L09J147N70q54j13j59r08p48J163
2196c25M35k5O22K9p18p38M7j38J92P21N32k32r6op20n42K81K41O79J5N53m10
2218C97o00p19j72K99N70O55K72Q8p09m20m10L3j24J070L74L04j01k40j250R3
2238e90K95L6L07R45M0l20l86l91l23j89N62KN99L64k68o70l13l89L9K24Q05K98
$$ y = [-599, -1604, -1324, -35, 362, 906, 1018, 536, -726, -1125, -1208, -597, -229, 740, 1136, 991, 353, -390, -940, -721, -717, 586, 1488, 989, 370, 600, -230, -1484, -612, 189, 202, 645, 1522, 582, -532, -655, -749, -1235, -676, 1110, 819, 694, 849, -16, -1382, -1271, -269, -267, 252, 1208, 1423, 19, -428, -446, -976, -878, 309, 703, 726, 743, 311, -455, -910, -490, -410, 128, 927, 1122, 364, 285, -552, -989, -945, -322, 309, 939, 1076, 393, 115, -224, -943, -665, -76, 740, 853, 1231, 756, -491, -857, -751, -732, -423, 724, 1294, 440, 327, 168, -740, -1488, -325, 110, 85, 707, 736, 18, -720, -673, -811, -619, 102, 634, 402, 306, 300, -420, -962, -681, -440, 239, 254, 807, 397, -203, -922, -1094, -795, -225, 430, 702, 790, 81, -339, -749, -716, -840, 230, 604, 908, 807, 567, -683, -590, -295, -259, 48, 993, 1033, 713, 327, -64, -387, -576, -14, -12, 587, 951, 683, 13, -300, -689, -650, -426, 379, 677]
2260F77Om75k88o19l40L86N00O03L83l52k62n40j72k84M30N38L10j10R2k65m96
2281b78n55r7M75N86J04R1k08p5o10k68J02K51N04K91l7L79o54k49l07N4L95O51
2303E45J42N4j35o37n58q7L72K89N69K03l15k52m48m6n79N69L50M89Q8j09l40
2324A64m59j15j87K69O92L82j00j22m21m42l22P3M43K96L65N90m08r11j92J10
2344b95L5l60R84L78O8o50m0m59j97J96o3O42K38p0n95L2k97j24M3N72O24p0k12
2367C80o4l65m56j80M43M19L37n8J48n57m84K26n1j22N11L36J64k03m60j77o1
2388b74l98L36L31L09L18m14l76m35J38N4J32Q41J02k90m71J12o44P7M17L48j07
2409A06K60M44q81l74j36l2K97K63M93o8l9l50k34j15k9K54M97p1J42k4l67k68
$$ y = [677, 683, 208, -80, -699, -1039, -653, -153, 450, 833, 481, 219, -321, -493, -777, -347, 191, 501, 391, 483, 218, -278, -833, -930, -455, 131, 235, 326, 118, 43, -567, -835, -733, -482, 22, 313, 276, 655, 1, -248, -555, -501, -106, 545, 687, 741, 606, -31, -589, -676, -304, -15, 554, 757, 442, 190, -258, -304, -883, -314, 36, 525, 613, 504, 164, -295, -410, -597, -328, 364, 746, 646, 524, 103, -339, -661, -588, -145, 151, 516, 1106, 698, -213, -405, -295, -260, -620, 364, 742, 810, 160, 120, -339, -536, -340, -403, 239, 477, 407, -188, -156, -453, -577, -534, 38, 662, 592, 380, 316, -49, -505, -685, -242, 177, 514, 456, 604, 47, -437, -211, -262, -384, 127, 463, 627, 424, -36, -213, -274, -672, -336, -5, 304, 622, 208, -168, -603, -465, -411, -279, 562, 664, 374, -97, 15, -629, -552, -135, 213, 106, 366, 810, -71, -445, -581, -613, -316, -53, 440, 372, 333, -17, -251, -366, -395, -141, 356, 285, 427, 403, 36, -232]
$$ [...]
8191C4
##END NTUPLES=NMR FID
##END=
