##TITLE=1H_Pr 4-F
 CDCl3
 8 sc, 
 4.04.2022
##JCAMPDX= 6.0         $$ Bruker NMR JCAMP-DX V2.0
##DATA TYPE= NMR FID
##DATA CLASS= NTUPLES
##ORIGIN= UXNMR, Bruker Analytische Messtechnik GmbH
##OWNER= root
$$ XWIN-NMR		Version 3.5
$$ Mon Apr  4 11:15:30 2022 Russian Standard Time (UT+4h)  she@DPX200
##.OBSERVE FREQUENCY= 200.131346
##.OBSERVE NUCLEUS= ^1H
##.DELAY= (6, 6)
##.ACQUISITION MODE= SIMULTANEOUS
##.ACQUISITION SCHEME= undefined
##.AVERAGES= 8
##.DIGITISER RES= 18
##SPECTROMETER/DATA SYSTEM= spect
##.PULSE SEQUENCE= zg30
##.SOLVENT NAME= CDCl3
##.SHIFT REFERENCE= (INTERNAL, CDCl3, 0, 15.7039)
##AUDIT TRAIL= $$ (NUMBER, WHEN, WHO, WHERE, WHAT)
$$ ##TITLE= Audit trail, XWIN-NMR		Version 3.5
$$ ##JCAMPDX= 5.01
$$ ##ORIGIN= Bruker BioSpin GmbH
$$ ##OWNER= she
$$ F:/spectra/data/she/nmr/H-F/1/audita.txt
$$ ##AUDIT TRAIL=  $$ (NUMBER, WHEN, WHO, WHERE, WHAT)
(   1,<2022-04-04 11:14:36.29 +0400>,<she>,<DPX200>,
      <created by zg, POWCHK disabled, PULCHK disabled
       configuration hash MD5:
       00 E9 B6 7A A2 85 ED C7 34 08 36 98 17 FE 4E 26
       data hash MD5: 16K
       55 6E FA 65 BD D7 C2 86 EA 0D 81 3D E3 6B 9E EC>)
$$ ##END=
$$ 
$$ hash MD5
$$ 2A E4 11 89 14 91 F0 FA 14 21 77 F5 ED FE A4 D3
##$RELAX= 
##$RELAX= 
##$RELAX= 
##$RELAX= 
##$RELAX= 
##$RELAX= 
$$ Bruker specific parameters
$$ --------------------------
##$DU= <F:/spectra>
##$EXPNO= 1
##$NAME= <H-F>
##$PROCNO= 1
##$TYPE= <nmr>
##$USER= <she>
##$AMP= (0..31)
100 100 100 100 100 100 100 100 100 100 100 100 100 100 100 100 100 100 
100 100 100 100 100 100 100 100 100 100 100 100 100 100 
##$AQSEQ= 0
##$AQ_mod= 1
##$AUNM= <au_zg>
##$AUTOPOS= <>
##$BF1= 200.13
##$BF2= 200.13
##$BF3= 200.13
##$BF4= 200.13
##$BF5= 200.13
##$BF6= 200.13
##$BF7= 200.13
##$BF8= 200.13
##$BYTORDA= 1
##$CFDGTYP= 0
##$CFRGTYP= 5
##$CHEMSTR= <none>
##$CNST= (0..31)
1 1 145 1 1 1 1 1 1 1 1 1 1 1 1 1 1 1 1 1 1 1 1 1 1 1 1 1 1 1 1 1 
##$CPDPRG= <>
##$CPDPRG1= <>
##$CPDPRG2= <>
##$CPDPRG3= <>
##$CPDPRG4= <mlev>
##$CPDPRG5= <mlev>
##$CPDPRG6= <mlev>
##$CPDPRG7= <mlev>
##$CPDPRG8= <mlev>
##$CPDPRGB= <>
##$CPDPRGT= <>
##$D= (0..31)
0 1.2 0 0 0 0 0 0 0 0.06 0 0.03 0 0 0 0 0.0002 0 0 0 0 0 0 0 0 0 0 0 0 
0 0 0 
##$DATE= 1649056475
##$DBL= (0..7)
120 120 120 120 120 120 120 120 
##$DBP= (0..7)
150 150 150 150 150 150 150 150 
##$DBP07= 0
##$DBPNAM0= <>
##$DBPNAM1= <>
##$DBPNAM2= <>
##$DBPNAM3= <>
##$DBPNAM4= <>
##$DBPNAM5= <>
##$DBPNAM6= <>
##$DBPNAM7= <>
##$DBPOAL= (0..7)
0.5 0.5 0.5 0.5 0.5 0.5 0.5 0.5 
##$DBPOFFS= (0..7)
0 0 0 0 0 0 0 0 
##$DE= 6
##$DECBNUC= <off>
##$DECIM= 32
##$DECNUC= <off>
##$DECSTAT= 4
##$DIGMOD= 1
##$DIGTYP= 9
##$DL= (0..7)
0 120 120 120 120 120 120 120 
##$DP= (0..7)
150 150 150 150 150 150 150 150 
##$DP07= 0
##$DPNAME0= <>
##$DPNAME1= <>
##$DPNAME2= <>
##$DPNAME3= <>
##$DPNAME4= <>
##$DPNAME5= <>
##$DPNAME6= <>
##$DPNAME7= <>
##$DPOAL= (0..7)
0.5 0.5 0.5 0.5 0.5 0.5 0.5 0.5 
##$DPOFFS= (0..7)
0 0 0 0 0 0 0 0 
##$DQDMODE= 0
##$DR= 18
##$DS= 0
##$DSLIST= <SSSSSSSSSSSSSSS>
$$ [...]
##$SUBNAM2= <"">
##$SUBNAM3= <"">
##$SUBNAM4= <"">
##$SUBNAM5= <"">
##$SUBNAM6= <"">
##$SUBNAM7= <"">
##$SUBNAM8= <"">
##$SUBNAM9= <"">
##$SW= 18.0517287032376
##$SWIBOX= (0..15)
0 0 2 0 0 0 0 0 0 0 0 0 0 0 0 0 
##$SW_h= 3612.71676300578
##$TD= 16384
##$TD0= 1
##$TE= 0
##$TE2= 300
##$TE3= 300
##$TEG= 300
##$TL= (0..7)
0 120 120 120 120 120 120 120 
##$TP= (0..7)
150 150 150 150 150 150 150 150 
##$TP07= 0
##$TPNAME0= <>
##$TPNAME1= <>
##$TPNAME2= <>
##$TPNAME3= <>
##$TPNAME4= <>
##$TPNAME5= <>
##$TPNAME6= <>
##$TPNAME7= <>
##$TPOAL= (0..7)
0.5 0.5 0.5 0.5 0.5 0.5 0.5 0.5 
##$TPOFFS= (0..7)
0 0 0 0 0 0 0 0 
##$TUNHIN= 0
##$TUNHOUT= 0
##$TUNXOUT= 0
##$USERA1= <user>
##$USERA2= <user>
##$USERA3= <user>
##$USERA4= <user>
##$USERA5= <user>
##$V9= 5
##$VALIST= <valist>
##$VCLIST= <CCCCCCCCCCCCCCC>
##$VD= 0
##$VDLIST= <DDDDDDDDDDDDDDD>
##$VPLIST= <PPPPPPPPPPPPPPP>
##$VTLIST= <TTTTTTTTTTTTTTT>
##$WBST= 1024
##$WBSW= 4
##$XGAIN= (0..3)
0 0 0 0 
##$XL= 0
##$YL= 0
##$YMAX_a= 24064
##$YMIN_a= -27814
##$ZGOPTNS= <>
##$ZL1= 120
##$ZL2= 120
##$ZL3= 120
##$ZL4= 120
##$ABSF1= 10
##$ABSF2= 0
##$ABSG= 5
##$ABSL= 3
##$ALPHA= 0
##$AQORDER= 0
##$ASSFAC= 0
##$ASSFACI= 0
##$ASSFACX= 0
##$ASSWID= 0
##$AUNMP= <proc_1d>
##$AZFE= 0.1
##$AZFW= 0.1
##$BCFW= 1
##$BC_mod= 2
##$BYTORDP= 1
##$COROFFS= 0
##$CY= 11.3945322036743
##$DATMOD= 1
##$DC= 2
##$DFILT= <>
##$DTYPP= 0
##$F1P= 2.36226072786647
##$F2P= -0.459571619588291
##$FCOR= 0.5
##$FTSIZE= 0
##$FT_mod= 4
##$GAMMA= 1
##$GB= 0.15
##$INTBC= 1
##$INTSCL= 1
##$ISEN= 128
##$LB= 0.24
##$LEV0= 0
##$LPBIN= 0
##$MAXI= 10000
##$MC2= 0
##$MEAN= 0
##$ME_mod= 0
##$MI= 1.114404
##$NCOEF= 0
##$NC_proc= 0
##$NLEV= 6
##$NOISF1= 3.799351
##$NOISF2= 2.8
##$NSP= 1
##$NTH_PI= 0
##$NZP= 0
##$OFFSET= 15.70392
##$PC= 1
##$PHC0= -17307.77
##$PHC1= 11.40078
##$PH_mod= 1
##$PKNL= yes
##$PPARMOD= 0
##$PSCAL= 0
##$PSIGN= 0
##$REVERSE= no
##$SF= 200.130013532006
##$SI= 16384
##$SIGF1= 3
##$SIGF2= 2
##$SINO= 400
##$SIOLD= 16384
##$SREGLST= <1H.CDCl3>
##$SSB= 0
##$STSI= 0
##$STSR= 0
##$SW_p= 3612.71676300578
##$SYMM= 0
##$S_DEV= 0
##$TDeff= 0
##$TDoff= 0
##$TI= <>
##$TILT= no
##$TM1= 0
##$TM2= 0
##$TOPLEV= 0
##$USERP1= <user>
##$USERP2= <user>
##$USERP3= <user>
##$USERP4= <user>
##$USERP5= <user>
##$WDW= 1
##$XDIM= 8192
##$YMAX_p= 0
##$YMIN_p= 0
$$ End of Bruker specific parameters
$$ ---------------------------------
##NTUPLES= NMR FID
##VAR_NAME=  TIME,          FID/REAL,        FID/IMAG
##SYMBOL=    X,             R,               I
##VAR_TYPE=  INDEPENDENT,   DEPENDENT,       DEPENDENT
##VAR_FORM=  AFFN,          ASDF,            ASDF
##VAR_DIM=   8192,          8192,            8192
##UNITS=     SECONDS,       ARBITRARY UNITS, ARBITRARY UNITS
##FACTOR=    0.0002768,     1,               1
##FIRST=     0,             0,               0
##LAST=      2.2672688,     0,               0
##MIN=       0,             -27814,          0
##MAX=       2.2672688,     24064,           0
$$ Real data points
##PAGE= N=1
##DATA TABLE= (X++(R..R)), XYDATA
0 0 0 0 0 0 0 0 0 0 0 0 0 0 0 0 0 0 0 0 0 5 -8 8 -8 8 -8 9 -16 16 -16 20 -24 25 -32 33 -40 41 -49 57 -61 66 -74
41 -74 82 -93 103 -114 126 -139 153 -168 185 -204 225 -248 274 -303 336 -371 416 -463 522 -590 675
62 675 -780 921 -1109 1385 -1818 2623 -4619 24064 12423 -11867 15517 22531 10921 -854
76 -854 8204 9395 2911 3320 2693 -8403 -3033 5142 -793 -13634 -13118 -326 1404 -11582 -10190
91 -10190 -2846 -2457 -3403 -3838 -3208 -1638 -128 5112 635 -6032 1732 7449 2232 -1767 -1566 1341
107 1341 966 -559 -1019 -6431 -6420 2086 -1564 -10293 -7875 -818 836 -7017 -9163 347 3034 -723
123 -723 -1156 -188 3595 4523 3826 6724 4682 3826 9557 8226 2867 2315 7435 10174 1724 -3297 3799
140 3799 4242 -1493 -2352 -1449 -619 -4481 -5265 -1807 -4445 -5202 -1668 -2630 -4827 -4174 -1436 1470 -1941
157 -1941 -2438 2386 768 -434 2061 2487 1963 1162 2078 2775 -1823 -67 3371 -286 -2459 -1239 -1117
174 -1117 -1012 -3037 -2352 -1572 -3807 -1745 -868 -4352 -1584 1403 386 -1974 -1624 3992 3954 -1056 1414
191 1414 4553 3207 2223 1512 3543 3831 1552 1934 1343 -132 2163 1065 -1583 -1612 -1872 -1027 -2528
208 -2528 -3676 -1089 -1610 -3997 -2414 -2490 -1722 -1527 -1570 124 10 -851 1275 1156 1564 2488 1082 1928
226 1928 2661 2159 2545 1249 1723 2560 103 -26 513 2 724 -547 -2094 -844 -1311 -1294 -1486 -2471 -655
245 -655 -986 -1948 -594 -728 -322 692 -428 218 679 369 2089 1182 357 1713 910 767 914 -129
263 -129 862 -227 -1032 -392 -1657 -1356 -589 -1870 -1870 -2277 -2175 -783 -1654 -1394 -519 -1392 -177 430 149
282 149 888 1105 1550 1891 867 2009 2657 1808 2247 1870 1073 2109 876 646 635 -286 198 -402 -1663
301 -1663 -667 -863 -1491 -1302 -1911 -1087 -1196 -1883 -435 -898 -720 435 -92 429 945 762 1427 931 831
320 831 1844 1015 1285 1474 332 565 -84 -323 336 -1147 -1425 -505 -1843 -1559 -1466 -2207 -1110 -1702 -1957
339 -1957 -801 -1613 -549 -11 -682 420 853 504 1138 1036 1416 2040 1124 1625 1472 856 1544 1022 612
358 612 680 -58 140 5 -666 -464 -1014 -1708 -562 -1042 -983 -660 -1197 41 -302 -698 691 117 681 1232
378 1232 316 1067 1202 893 1724 728 636 1292 139 374 502 -637 27 -312 -1207 -819 -1719 -1045 -1059 -2039
398 -2039 -1326 -1380 -1412 -616 -959 -991 -249 -349 378 279 10 1646 1411 1096 1332 725 1611 1720 768 700 501
419 501 464 791 -162 -423 351 -510 -102 -978 -1598 -533 -713 -1088 -746 -1360 -481 68 -561 -113 -230 580
439 580 1124 277 891 1335 702 1391 871 499 941 588 654 437 -730 -208 -221 -666 -664 -1150 -1358 -523 -1349
460 -1349 -1112 -1027 -1219 -481 -729 -955 -437 -395 679 886 -185 811 1269 1094 1228 878 1229 1886 966 892
480 892 383 461 1026 61 -407 129 -723 -723 -640 -1142 -837 -881 -1159 -796 -1628 -760 -153 -1188 -636 33 121 402
502 402 -59 333 1288 820 561 405 792 1382 535 -14 882 187 241 -67 -581 -397 -740 -721 -612 -1549 -1016
523 -1016 -362 -1089 -926 -888 -462 633 -123 -364 280 456 1482 467 696 1827 1241 889 1378 707 909
542 909 961 754 585 -416 -445 380 -446 -708 -1030 -1050 -354 -1454 -1935 -872 -647 -696 -944 -1099 -580 -454 -271
563 -271 860 -110 80 1411 974 637 635 702 1597 1113 342 697 410 596 113 -800 -293 -362 -790 -451 -1178
584 -1178 -1139 -554 -529 -243 -1039 -1211 95 377 -124 35 46 1062 1103 53 430 1446 1575 1270 466 874
604 874 812 396 684 275 -700 349 129 -923 -1210 -987 -288 -665 -1579 -607 -645 -657 -450 -1101 -458 385 -428
625 -428 322 526 330 1029 757 921 607 64 757 949 680 360 707 -299 565 -570 -355 -833 -269 -694
645 -694 -724 -287 -573 -958 -640 36 -1169 -99 232 -52 88 115 638 1012 387 1004 713 709 970 784 405
666 405 1017 315 290 97 -2 56 -398 -319 18 -873 -496 -568 -829 -563 -683 -669 -564 -549 -88 166 -262 267 406
689 406 524 915 465 740 994 484 822 612 482 328 156 89 194 -284 -287 -362 -976 -444 -587 -887 -461 -807
711 -807 -523 -732 -713 -247 -462 -264 328 110 106 378 468 804 987 427 931 308 402 696 55 273 307 13
733 13 384 -70 -514 -79 -386 -619 -367 -767 -702 -686 -737 -269 -453 -338 -80 -392 -19 154 153 755 211 339
755 339 783 396 739 632 452 639 551 185 252 -164 -127 -35 -667 -455 -317 -725 -539 -641 -485 -384 -682 -498
777 -498 -261 -285 -245 4 109 474 130 661 653 342 610 599 467 699 207 407 191 -219 178 106 -312 -137
799 -137 -291 -599 -308 -639 -628 -400 -771 -252 -567 -390 -58 -253 -122 279 140 496 684 531 864 691 581
820 581 658 473 470 583 243 313 -91 -313 -15 -246 -546 -575 -543 -390 -967 -796 -354 -344 -407 -396 -329 49 206 -177
844 -177 20 189 255 420 527 549 631 339 583 305 392 460 4 -80 -84 -400 -54 -514 -385 -314 -867 -445 -521 -562
868 -562 -318 -368 -330 19 -205 232 286 36 438 639 330 870 662 371 594 177 517 454 76 227 168 -158
890 -158 -207 -458 -213 -319 -615 -103 -562 -431 -304 -378 -418 -346 -179 60 -147 -88 383 154 251 464 128 431
912 431 619 414 651 391 194 454 89 49 15 -269 -183 -543 -816 -307 -662 -595 -453 -547 -267 -256 -413 -142
934 -142 -65 94 415 8 195 251 265 575 433 222 493 235 717 377 68 48 -160 -123 229 -382 -484 -117
956 -117 -578 -638 -626 -472 -434 -630 -500 -396 -484 -139 -242 -176 158 296 326 437 79 410 416 328 715 255 415
979 415 462 180 -33 137 -319 -65 -51 -161 -360 -397 -371 -344 -631 -45 -191 -811 -272 -291 -72 107 -52 168
1001 168 190 188 458 430 300 534 201 424 510 102 -13 27 15 -294 -287 -366 -76 -767 -215 -382 -726 -447 -443 -487
1025 -487 -580 -166 -62 -196 -106 313 2 182 368 129 363 426 378 466 458 347 469 217 -52 -14 -195 -243 28
1048 28 -474 -214 -157 -712 -131 -404 -458 -384 -238 -23 -13 -26 297 -170 72 287 185 285 532 450 540 93 184
1071 184 241 131 537 198 -318 -70 -178 -27 56 -413 -543 -274 -386 -212 -455 -228 -253 -228 -153 95 -73 70
1093 70 369 199 304 73 471 381 54 312 295 92 162 184 14 85 -48 -75 -4 -259 -213 -144 -360 -527 -298
1116 -298 -35 -44 -303 -269 -12 -166 158 -82 -1 298 -79 338 583 441 363 328 243 560 90 272 420 -59
1138 -59 20 -266 -122 -135 -626 -349 -99 -231 -427 -455 -378 -278 -239 -26 -140 -357 71 65 126 519 226 83 334
1161 334 310 131 246 74 289 320 -24 202 -171 -103 160 -218 -260 -113 -337 -429 -308 -532 -406 -272 81 -35
1183 -35 -133 296 -169 106 149 110 182 134 226 255 583 278 443 305 -101 253 -317 -24 -66 -177 -224 -240 -173 71
1207 71 -249 -229 -204 -533 -214 -298 -378 34 -87 -109 146 91 300 170 106 508 135 384 420 374 384 212 -55 214
1231 214 -6 -82 1 -31 -30 -161 -405 -136 -366 -540 -143 -184 -174 -329 -206 -21 -32 -104 210 93 244 348 -16
1254 -16 332 231 187 442 451 -60 451 -35 66 -80 -303 19 -46 -184 -61 -483 -130 -78 -640 -360 -285 -313 -113
1277 -113 -224 -1 144 2 300 292 202 309 361 352 431 327 584 134 226 248 359 84 52 -282 -313 -285 -579 10
1301 10 -291 -701 -90 -492 -288 -96 -185 -312 -125 -61 -42 91 -158 265 366 577 275 59 212 132 142 369
1323 369 96 -197 214 -282 -101 -73 -178 48 -85 -318 -129 -471 -267 -224 -212 -15 -384 51 -42 -5 87 314
1345 314 197 370 519 297 180 370 395 235 20 290 267 -68 73 -194 2 -188 -208 -459 -156 -402 -337
1366 -337 -529 -206 -225 -437 -110 106 -13 -62 -95 46 224 132 181 184 217 137 335 290 -46 -69 -6 105 -60 4
1390 4 -103 -128 -170 -137 -409 -83 -255 -11 -462 -134 -33 -2 -39 107 18 -18 52 -131 59 348 -78 132 414
1413 414 130 173 125 277 269 225 235 -103 -238 5 -105 -241 -253 -444 -327 -32 -336 49 -302 -360 108 36 374
1436 374 236 225 270 282 219 133 -92 110 155 274 122 253 435 59 -64 -84 -76 -305 -193 -315 -260 -201 -79 -203
1460 -203 -10 -76 -227 68 -202 5 -72 363 153 -68 280 416 130 206 292 -28 83 306 -2 126 43 126
1482 126 57 -378 -103 -117 -68 -135 -301 -210 -451 -294 -101 169 -158 105 -48 132 232 105 431 286 157 153
1504 153 -78 34 377 377 202 140 50 180 -186 -117 -4 -368 -39 -398 -241 -123 -51 -380 -286 -200 -80 -457 -230
1527 -230 226 -45 -109 199 338 189 388 51 107 289 226 301 88 48 269 -37 101 91 -157 136 216 -73
1549 -73 -62 -279 -187 -258 -432 105 -254 -87 23 43 102 292 38 197 419 -33 269 406 39 103 132 327 -61
1572 -61 -166 2 -8 -264 97 -140 -229 -422 -241 -15 -260 -583 -202 -321 -44 -59 -50 43 -24 -5 -86 147 315
1595 315 175 180 327 -11 153 338 71 200 335 29 -22 -208 -162 2 -138 -181 -333 -296 -66 -63 -227 -349 -186
1618 -186 -352 -20 -229 -7 62 112 291 146 -78 411 22 160 246 63 227 51 133 279 86 -33 -68 -251
1640 -251 -282 -243 -205 -258 -433 -266 -124 -141 70 -119 66 63 20 50 -43 12 340 595 137 44 275 195 340 186
1664 186 191 -58 119 -113 -292 -218 -289 -87 149 -132 -104 -200 -117 -150 -192 -108 -15 -145 28 302 178 148 47 295
1688 295 105 113 139 42 404 34 194 215 -108 0 -211 -140 131 -119 44 -125 -184 -64 -321 -211 43 -181
1710 -181 40 -177 -230 -218 153 146 233 118 62 204 153 272 156 -199 186 125 -46 34 -1 243 -141 -120 -207 114
1734 114 -50 -22 -292 -95 -61 -252 -115 64 -110 -46 178 0 162 131 -44 -6 -100 398 215 266 229 101 -128
1757 -128 154 66 -56 55 -31 9 -77 -319 -164 -437 -9 -18 -247 121 -184 -385 -275 -44 -85 121 74 321 210
1780 210 229 97 159 6 3 241 324 428 -58 24 -79 -4 -79 44 -177 -425 -134 -286 58 -322 -157 -251 -175
1803 -175 197 -324 80 138 -39 105 -257 47 183 -82 206 152 210 176 119 61 219 -95 269 -262 104 234
1825 234 -45 46 -248 144 31 -255 -33 -11 -375 19 -5 -292 -59 -88 -271 7 197 -10 165 117 189 435
1847 435 43 105 142 148 -7 -8 -23 14 -140 72 151 -178 63 99 -177 -222 167 -38 72 -231 -142 9 -10 -144
1871 -144 139 -115 189 -6 77 136 -131 22 -100 260 503 492 356 244 -156 135 -199 107 -151 134 -278
1892 -278 68 44 -51 -87 -404 93 3 -148 -93 -63 16 -12 260 149 142 190 311 248 59 153 105 118 -49 22 138
1917 138 94 -177 1 -5 -17 -251 -98 74 -305 -66 42 49 -145 -48 -350 -126 -162 46 42 -33 289 65 245 133
1941 133 338 266 20 -45 35 138 170 210 -57 10 -112 -111 -119 -128 -81 -151 -105 -52 42 -212 -273 -68 62 -52 -1 -107
1967 -107 31 102 27 235 94 43 179 -20 127 186 139 253 5 -164 -99 -7 -130 -130 -8 -197 -36 -76 85
1990 85 79 -5 29 -315 -133 -210 -13 206 77 101 -58 113 226 158 162 28 174 21 133 -76 178 -63 -122 -199
2014 -199 -254 -61 -78 -79 -8 74 -43 25 3 -99 -4 -60 -75 -82 91 234 75 105 306 61 228 311 0 -273 163
2039 163 149 -9 154 -86 96 -153 2 -67 -200 -109 153 -92 87 -72 -96 81 -137 -214 145 -55 285 187
2061 187 -20 159 234 112 -47 219 206 57 -127 82 57 165 189 191 -88 -60 -137 -40 -252 -118 43 13 -263
2084 -263 -143 -28 -79 -60 107 9 89 154 116 268 314 81 55 296 191 -12 -18 -49 135 0 -165 -59 -139 60
2108 60 -135 -271 -374 27 -294 -154 -226 -22 -195 -36 6 52 -144 154 94 -132 -53 50 21 5 45 272 -29
2131 -29 -133 179 81 40 142 -255 -32 -8 -227 -272 -125 99 7 -161 -47 -399 -84 158 -41 45 -95 -70 145
2154 145 97 115 112 227 -166 115 9 91 11 120 76 -89 -156 -111 119 -251 -19 11 -24 -148 -118 -97 75 -184
2178 -184 -98 -27 -76 214 10 196 -79 126 197 202 -14 215 412 162 370 177 -158 69 105 108 -73 7 -338
2201 -338 -195 -115 -76 -45 -265 -284 82 80 -253 82 117 -314 32 68 29 39 159 386 115 -255 139 34 -60 11
2225 11 -180 191 147 94 -196 47 5 22 -22 -143 -54 -133 -91 94 -150 -77 -101 -124 43 -136 126 216 89 374
2249 374 85 18 83 -38 -46 351 171 56 129 -108 46 -14 107 53 52 11 36 218 120 34 105 20 -101 109 2
2274 2 28 251 215 41 223 17 -4 211 -173 227 -77 -100 -34 -24 264 197 -141 41 36 -63 -23 -233 -76 -15 -174
2299 -174 -281 -120 -136 -375 27 30 27 20 -92 166 -8 107 122 152 135 133 236 247 41 -13 91 -2 30 -71 121
2324 121 29 -94 282 57 15 -2 -111 -27 41 -16 -41 66 -83 -89 64 -266 155 -142 37 66 53 133 56 135 17
2349 17 -153 -103 37 -124 -117 -23 0 -93 -167 -59 80 62 -110 -86 -242 353 -34 30 283 -90 -198 -169 91 211
2373 211 183 -53 90 -268 -93 138 -110 93 45 133 -14 -43 -64 138 131 -126 35 -95 13 10 -200 -48 57
2396 57 -96 113 164 -129 101 224 84 267 46 153 17 139 238 134 354 -38 101 -59 94 30 36 54
2418 54 -26 -101 -190 -54 -96 -120 19 -69 116 -136 -55 -52 -75 82 -69 -33 20 78 46 134 29 -37 39 312 9 156
2444 156 67 49 -74 192 -91 104 -170 0 181 -103 -148 -25 -69 -13 -147 -185 246 -166 96 175 33 125 25
2467 25 195 136 134 123 -76 -98 23 1 -57 -110 99 125 -130 -224 -52 21 125 -200 57 -34 -15 -4 -110 134 -89
2492 -89 70 -208 -144 65 -64 105 -29 28 250 -128 220 -98 336 310 -161 28 3 102 -86 246 -123 -225
2514 -225 -178 7 -213 203 -74 -21 46 -182 -161 45 -9 96 191 -168 -12 -10 108 -58 130 188 216 89 -111
2537 -111 -80 23 -121 42 116 -23 74 -238 -192 37 159 -105 -173 -214 20 73 8 233 -88 227 156 15 101
2560 101 72 -34 -28 185 134 -45 -83 299 209 53 -8 153 95 -120 84 -79 -247 -133 -78 -42 -117 -38 -270 90
2584 90 65 83 -189 42 -70 91 233 62 61 116 85 32 -86 82 280 48 -336 -95 98 115 -275 -212 -52
2607 -52 -336 -245 -224 -98 -107 -180 -24 154 -114 53 34 101 -151 193 78 92 85 129 101 166 40 -9 185 -125 70
2632 70 81 -148 -106 19 4 120 -180 82 -36 -21 -158 -39 -91 -15 -243 8 58 42 96 -86 88 302 286 336
2656 336 303 125 153 42 -94 191 109 -41 91 8 -33 -300 94 -163 24 11 72 -244 -230 -194 -265 135 84 -17
2680 -17 1 73 60 113 -133 -16 21 145 -234 140 -54 120 120 133 77 105 15 -142 76 -14 -119 -46 -43 -69 -118 -171
2706 -171 -200 -182 -29 235 174 4 101 58 -6 319 25 117 284 -31 103 73 201 -86 56 67 168 -171 -8
2729 -8 -71 -51 25 -317 -102 -166 -224 81 -62 -299 187 -139 37 110 24 -12 -57 116 43 51 239 58 77 238 5
2754 5 -154 75 60 -32 24 -48 233 -47 24 -74 153 307 -148 -97 50 0 57 -90 -60 -33 -245 267 125 -73
2778 -73 94 2 3 66 82 171 150 -224 -52 -1 -45 7 32 -93 -71 -108 -312 46 -91 -166 124 -230 -132 -209 29 -68
2804 -68 72 -22 23 7 13 126 171 74 65 130 -1 -185 -51 139 -249 -119 272 48 -291 -96 36 135 -65 -55
2828 -55 -69 -133 -71 -188 -97 2 0 35 -177 153 14 112 -83 -19 175 -196 129 -26 -11 -9 194 8 -215 -151 -113
2853 -113 128 -267 -155 8 -55 -294 -46 -97 4 -137 -117 -86 -127 -168 -85 -121 152 -113 245 313 93 118 38 386
2877 386 -104 119 -127 94 163 -71 33 143 9 -110 -217 -217 26 61 20 10 -91 346 152 -28 -203 6
2899 6 155 -89 -215 195 -90 278 62 -21 174 57 152 -202 -9 84 -33 -118 109 119 -114 -48 -20 -33 149
2922 149 -101 85 31 -47 211 -36 -46 69 234 76 177 -77 35 -206 55 12 -141 73 34 -51 61 -113
2944 -113 115 -163 -42 -18 -132 -236 101 -151 -30 -185 2 175 -227 4 183 -72 167 366 -18 2 151
2965 151 62 -100 -355 82 28 -124 -169 -7 -25 -83 -41 -311 237 -60 -316 -72 189 -105 26 -56 -82 -125 -65
2988 -65 -89 -87 -146 201 19 166 -73 136 -53 12 -66 41 126 -5 130 97 -103 147 5 -96 82 -110 121
3011 121 29 84 239 -95 72 -10 -76 -41 201 -42 -89 175 38 -79 60 -47 -32 39 255 50 19 -262 -83
3034 -83 123 73 -233 -76 191 31 29 -141 112 -123 -138 -26 -116 -44 -49 -75 1 69 -15 -179 36 43 151 -112 -75
3059 -75 8 216 128 83 218 111 223 -216 -90 -188 -192 -124 -126 -315 3 -261 35 2 -164 143 -118 -150 -74 -15 -122
3084 -122 -199 15 119 232 168 -58 -80 -107 260 30 138 171 -65 -208 2 -103 -170 124 37 -243 -44 146
3106 146 -57 -3 -11 -83 -3 142 117 -35 -83 -3 30 7 272 5 -21 38 190 75 -192 -51 -85 209 1 157
3130 157 38 -253 129 9 -73 81 8 76 -142 -158 93 51 -31 208 84 128 190 59 59 -7 157 53 -87 41
3154 41 98 206 43 129 -131 72 -247 116 19 -54 -22 87 13 -215 -95 -57 85 -42 19 16 120 19 -69 27
3178 27 156 -20 11 -18 100 -18 -3 -220 246 -47 -70 -4 207 -15 114 125 143 15 215 84 -118 30 61
3201 61 -51 28 40 -78 -27 298 -70 167 -47 109 -48 -15 145 -11 99 -5 -101 -45 122 -136 134 -105
3223 -105 -127 115 134 83 -172 103 -45 -147 61 65 52 96 81 137 89 72 62 -8 -184 -107 -38 -202 -16 40 -154
3248 -154 96 -265 15 -22 -3 -122 81 -4 21 -79 56 -236 8 9 -181 138 -31 92 139 -219 23 26 -53
3271 -53 -65 42 33 345 178 -58 -99 8 59 -40 51 31 41 139 -193 119 -190 -260 52 -217 204 -138 -49 -69 -81
3296 -81 -185 -82 -90 61 -85 107 -113 -79 -42 146 137 300 -155 52 147 -202 205 -162 161 27 -51 -7 241
3319 241 -173 -120 -16 -12 -99 -9 23 -104 70 -59 -183 264 35 93 166 82 319 17 111 -118 102 34 272 44
3343 44 154 186 82 -137 -8 -69 117 -43 120 -142 -6 -68 -121 -211 55 4 148 47 53 -112 -12 -19 0 10
3367 10 -111 16 96 31 -79 -277 -22 24 18 54 197 76 -273 -174 -163 -67 118 7 -144 0 66 87 -53 66
3391 66 27 93 205 -256 138 -532 162 155 229 89 316 78 -155 1254 558 -104 -90 -128 191 59 -63 -334
3413 -334 -243 -155 16 -169 83 188 107 -111 169 55 -49 -78 -124 74 -16 326 -48 37 230 -57 3 119 -64
3436 -64 168 13 -106 71 143 -55 138 -296 -237 33 -143 23 37 47 100 -126 -84 -112 96 266 146 29 -43
3459 -43 -72 -104 -113 123 32 -49 204 157 -10 -413 25 78 -25 152 -100 -71 -45 -212 -78 69 68 142 98 -352 216
3484 216 9 132 295 -167 210 -103 286 65 413 -13 31 -47 11 108 4 -341 -25 -183 60 -49 -154
3505 -154 184 -132 -13 -144 -156 -22 -407 98 47 -239 146 -84 5 74 -62 -60 -62 -196 43 44 -54 20 -304 107
3529 107 -47 -33 -14 -55 -147 39 -88 123 -112 -75 -204 49 39 20 235 -23 226 9 -129 -3 102 181 188
3552 188 -134 39 -54 133 163 -70 49 -37 -40 -2 -6 -98 -125 22 65 -11 207 -130 212 277 -57 -198 -192 156 98
3577 98 54 141 260 -1 -31 226 80 7 -174 -126 103 42 115 25 181 -42 182 -12 -106 83 60 -53 -88 -20
3601 -20 -39 -71 119 -56 -44 5 31 67 -3 228 -49 202 -2 -71 32 -177 158 41 -6 -136 209 209 -118 -104
3625 -104 20 163 -128 36 126 22 44 -219 -100 10 72 -117 -55 25 248 -191 -149 39 -207 96 -143 34
3647 34 -30 -127 15 394 -46 6 115 10 -88 -144 20 -138 143 -56 -109 -60 -222 178 19 134 -25 -78 215
3670 215 -171 101 -94 -26 110 -18 -14 258 15 -28 -88 91 140 28 268 59 -91 -17 -247 8 -122 -167 72
3693 72 129 -108 -19 36 -18 197 7 -67 -114 -64 112 148 91 -233 -183 -88 132 29 -127 -258 -12 -143 152 -68
3717 -68 -148 12 55 -35 -35 13 -59 97 104 -169 -91 9 -136 10 6 -24 -61 -99 -82 11 107 -113 13 35 137 125 -120
3744 -120 -74 112 80 -127 -44 -91 -20 156 1 -214 66 -129 4 -18 153 59 147 95 57 -272 -187 13 149 66
3768 66 35 125 174 183 -23 79 34 29 42 119 30 -31 -169 -17 61 -161 -80 30 -47 -272 -93 34 80 4 -251 -50
3794 -50 22 214 -42 26 43 33 15 169 51 10 -91 -74 19 -183 189 -133 16 -186 23 121 -257 -106 -33 148
3818 148 -96 -19 -275 -15 -152 147 10 -117 33 -11 52 -146 -20 56 128 -82 -5 9 -181 -158 83 85 154 104
3842 104 -254 -111 -34 -140 58 107 106 6 -133 -135 11 -264 -169 36 81 101 78 63 -98 -136 27 -103 11 -123
3866 -123 93 -122 221 87 109 -2 60 177 -271 348 16 -73 61 79 84 -354 109 -73 -176 -202 49 300
3888 300 109 25 -6 -9 65 58 218 -109 55 57 -30 84 279 -72 179 79 -255 -90 -33 -131 -422 -146 -81 -91 -140
3913 -140 -83 -16 -75 32 -202 -134 -102 205 115 -74 -87 -31 -97 -26 8 138 -23 208 -52 73 -41 -46 307 81
3937 81 -105 -52 168 237 7 -110 88 -63 50 -172 -132 11 5 16 0 -49 176 -108 30 -95 96 155 -35
3960 -35 -9 128 94 -188 -137 148 -71 26 -34 -54 23 23 127 -53 91 -111 -97 112 121 89 285 -152 -40 116 -220
3985 -220 24 78 -35 -81 319 -37 6 146 217 84 -110 -98 225 46 144 39 -139 90 145 167 19 -143 -161
4008 -161 -116 18 4 2 87 174 42 -236 57 148 191 96 -53 101 -11 126 -19 242 -149 8 -54 116 -193
4031 -193 -169 125 137 -64 -64 17 202 -26 80 -251 71 53 144 -206 -110 50 -167 143 159 157 -2 -22 130 -62
4055 -62 -95 -11 57 192 -110 -72 223 -281 -143 205 -97 -231 -133 -46 43 -233 -210 -91 -148 -88 124 16 -143 308
4079 308 91 -96 63 29 349 -58 79 77 -5 118 -184 77 -132 267 174 54 32 -56 -226 -118 -163 -128 247
4102 247 -68 -219 81 -28 -80 177 117 -21 -5 37 -241 -135 82 -12 -243 27 -82 51 -22 -45 -64 -18 -269
4125 -269 -24 -195 -160 -13 79 136 1 -89 -25 -20 -55 8 -56 -131 164 -58 235 133 94 167 79 -52 -57 38 -62 -138
4151 -138 -160 76 -67 -83 40 -180 107 41 -158 -286 -60 -23 -55 74 43 138 -15 34 5 60 -121 167 55
4174 55 349 140 137 138 93 -117 -62 -146 68 -115 102 65 -58 22 10 -29 -123 -25 -131 -55 75 -38 185 -19 202
4199 202 120 -223 265 151 -47 -54 20 -12 254 71 105 173 96 23 128 -118 199 -32 -5 120 -156 9 105 -56
4223 -56 -53 81 -192 234 201 -2 -218 258 140 153 -30 342 31 -184 83 -94 -85 72 -5 58 162 -272 230
4246 230 -299 75 -73 -116 311 -23 137 22 -154 -76 278 -247 -158 36 23 223 -19 -24 -14 -122 -11 -258
4268 -258 -63 164 -33 105 279 -24 75 -20 -119 26 118 38 125 -104 -146 210 -90 155 215 48 199 -166 29
4291 29 254 31 -40 -168 235 -239 80 89 103 -97 146 346 103 84 139 91 -236 -180 4 -39 -182 19 3 212
4315 212 -62 24 -140 12 116 -95 85 -69 -241 114 144 124 120 32 75 -12 -55 -14 169 -12 71 127 -7 100
4339 100 31 270 64 156 -2 -93 -38 162 -261 188 -66 -64 36 51 -49 -90 105 77 -83 172 166 200 143 118 129
4364 129 -67 -239 -72 -38 134 156 -149 85 51 7 -192 -62 171 -41 230 89 118 23 60 -122 -63 -137 -124
4387 -124 11 -39 151 28 -222 45 88 18 61 16 -159 7 162 278 67 -372 186 1 -82 -28 135 104 -147
4410 -147 142 -34 79 -32 -71 57 -25 1 -116 46 173 11 123 -183 73 28 -10 -8 -138 330 58 391
4432 391 217 97 126 -110 -47 -102 -264 -69 188 -21 -128 33 -151 142 -76 -43 137 12 -22 203 -171 150
4454 150 150 126 251 11 -299 -259 -102 78 178 9 63 -55 43 -52 -21 -50 134 18 41 36 -140 -71 -1 -52 87
4479 87 82 22 -75 1 -155 -155 -227 -244 -20 22 101 50 -63 59 37 -75 -120 -59 -160 49 -97 115 46 9 119 178
4505 178 -80 32 86 -149 -109 56 -98 -242 -151 16 88 -173 222 157 41 219 -79 -107 26 -206 29 132
4527 132 -151 -6 -19 -52 -27 -88 -23 70 -18 -30 -9 47 143 21 -168 -148 -143 168 29 -89 303 -153 -14 -9 30 -18
4553 -18 -88 -34 179 -4 63 73 297 -79 -58 67 -222 -9 -61 115 -116 58 158 62 -55 -123 3 -83 -160 210
4577 210 -162 195 187 337 -106 131 -35 -68 189 -44 145 144 -22 -125 -102 -171 -184 -336 -180 131 24 -11 112
4600 112 36 108 128 75 -294 138 263 -79 268 52 -147 -10 -258 -186 45 -57 0 0 78 -135 158 60 -64
4623 -64 -184 -120 -37 -122 -93 -118 -29 89 223 49 -201 -41 46 -83 -23 146 -100 -113 -264 46 94 -106 5 -28
4647 -28 215 37 -63 -91 -93 80 189 -20 -42 -77 -145 11 31 211 177 -219 -264 68 28 -42 -32 -38 53 -9 50 229
4673 229 254 269 103 -23 70 167 238 136 187 -146 40 265 119 -105 -13 160 -212 -51 -69 -238 6 65 -15
4696 -15 -134 -23 -52 53 -239 234 256 45 91 -133 -103 -29 265 92 -293 20 -185 111 -201 60 22 179
4718 179 19 -86 69 -88 -37 -42 -74 91 -76 -153 -113 64 51 -175 -136 63 84 44 53 -5 109 -35 123 56 -58
4743 -58 -73 71 49 -40 -150 37 186 62 -201 247 97 172 184 -1 -159 53 -24 78 207 162 213 96 -183
4766 -183 -25 60 156 231 -52 74 177 -180 225 3 -160 -135 -37 77 55 27 46 -15 97 -169 78 61 197
4789 197 -3 1 241 -109 108 -55 -192 -6 132 -204 22 -166 216 0 -195 80 -179 -129 -139 -21 -23 46
4811 46 -168 -52 -184 -22 -279 -114 -16 -165 9 154 -213 -60 -142 -68 -236 -24 15 -28 -203 -99 200 39
4833 39 55 59 144 41 -15 41 -34 -48 -123 -12 -25 -53 -193 185 -123 -11 -55 -43 -104 -138 -2 -209 202 -140 -31
4858 -31 -62 103 -56 78 -37 24 -15 -196 138 -151 -43 -41 402 -149 -118 -247 -261 -40 15 -124 -77 66 -125
4881 -125 -66 6 288 153 -132 -125 -59 94 103 12 59 237 160 12 -106 83 256 -157 40 -61 98 -62 67
4904 67 122 12 -110 -152 -219 123 -45 -52 -77 -137 49 -152 -171 17 -253 -97 116 210 55 22 -89 136 38 -172
4928 -172 19 34 15 95 -231 32 -111 74 173 3 -217 -53 -57 104 74 -257 78 -76 -92 24 40 54 -180
4951 -180 -72 34 -139 12 181 142 -35 -205 -41 108 83 38 -137 -69 141 47 68 99 -37 -45 59 17 168
4974 168 5 -79 -149 214 -29 -47 280 26 -202 136 19 124 77 -80 184 -75 255 -43 102 196 -51 56
4996 56 -136 -247 8 -22 -36 -2 245 -90 9 -26 -300 -82 -68 152 -73 40 281 -82 -239 106 -99 58
5018 58 67 166 48 -232 -208 184 139 -14 32 357 389 -78 -7 -72 3 -74 -21 67 -117 -51 13 69 -123 -95 70 -76
5044 -76 -34 -171 -205 -91 138 225 130 -23 -125 -288 -73 -24 36 53 19 79 -125 -132 -176 21 -194 -142 -122 -47 131
5069 131 -106 53 -5 -256 -149 115 -35 141 25 -58 -100 -116 169 25 15 -127 -131 55 -246 57 50 206 43
5092 43 52 -15 -6 25 35 -83 192 -207 -94 -104 -114 -212 -110 28 -147 52 107 32 88 -45 5 -230 -217 256 49
5117 49 94 119 -28 -26 -30 -96 -125 188 -14 -25 74 -77 33 -6 189 -108 198 -90 129 44 -244 119 -161 50
5141 50 -53 39 1 145 38 106 -7 120 -17 -112 -116 150 -148 15 91 -71 -53 -38 -54 113 11 -117 -49 188
5165 188 -270 115 -5 -121 -48 25 146 19 59 -37 21 -68 117 -118 16 40 180 28 -63 135 35 -113 -82
5188 -82 -53 -145 -135 72 148 -31 30 -1 74 -250 24 46 -75 131 -203 110 69 254 -192 -86 -337 61 76 -310
5212 -310 248 -63 -17 -109 -200 57 -285 144 21 -3 -21 -136 6 37 -13 -105 29 -216 -49 -32 309 61 30
5235 30 -66 -362 -224 -3 9 138 -167 -122 -218 194 12 -150 -252 53 46 -102 135 -75 6 -155 209 162 -23
5258 -23 32 102 -39 -91 83 17 163 217 28 64 84 120 -28 54 -233 10 -93 304 136 -29 -84 61 289 30
5282 30 -36 -161 51 99 192 -90 26 39 22 -82 98 52 239 96 -135 -14 -161 -81 292 -96 -164 148 -79
5305 -79 -40 149 215 -83 173 -19 -231 -60 -25 162 -81 277 -22 -71 -132 165 -8 60 296 321 -44 147 26
5328 26 89 -61 47 147 -1 -30 107 40 -220 232 -477 -20 -85 14 -144 -118 -151 198 25 -26 0 -274 140
5351 140 -163 -173 109 -109 216 220 -3 223 -56 10 53 106 -28 -79 -9 -135 126 -134 -317 -106 174 -27 -55
5374 -55 -62 -132 136 50 -15 -68 152 46 -285 -125 22 -203 -54 40 -51 -4 -67 197 53 -283 -23 183 -101 -3
5398 -3 -204 14 132 63 -22 -186 -94 -46 61 -57 -131 77 185 -288 9 -38 14 215 187 65 -50 51 12 -106
5422 -106 71 293 28 150 -90 -39 -5 17 -202 -12 20 148 -34 -134 46 -185 -167 -78 -66 63 95 112 -83
5445 -83 -42 -93 113 297 158 35 -57 62 141 200 -93 14 -45 131 115 -401 164 -6 -69 -324 42 -5 -154
5468 -154 -231 70 -10 -149 -115 77 -47 -150 -20 -10 -88 37 20 -164 -5 -14 -49 -68 26 -1 120 -225 -225 -75 126
5493 126 -192 4 129 151 -254 -198 -121 -164 249 -160 -28 -21 -29 107 -200 -7 131 135 -5 -115 19 -77 -37 203
5517 203 -62 136 41 -46 329 -3 22 162 98 -16 389 105 18 97 -96 36 -2 -163 14 -130 -113 -98 9
5540 9 -251 255 177 -96 -49 97 122 157 52 76 68 -105 192 144 294 15 -34 53 -82 -173 27 120 268 26 -86
5565 -86 11 152 -23 -141 166 114 71 63 -53 92 -34 -48 191 -82 141 278 219 117 -181 -252 -76 -23 112
5588 112 -24 -190 -209 -102 134 -2 -20 -144 -130 15 -13 14 -249 -178 128 -96 -109 -229 232 7 27 -71 81
5611 81 -10 -252 112 -8 3 4 -282 -136 -32 -306 30 -115 40 61 -293 -169 -103 46 -21 -20 -90 -69 158 55
5635 55 -15 38 39 2 117 -2 -220 -172 203 22 19 76 215 11 -143 31 -21 106 -74 64 15 -60 2 72 215
5660 215 -228 -100 -76 -32 -75 -61 -151 -144 108 -14 93 -30 212 -70 -217 -61 -231 -104 21 -78 -148 106 110 31
5684 31 -122 -114 95 -50 91 68 -135 -319 -155 18 -25 -63 25 -53 11 157 246 133 -125 12 -64 6 -41 57 20
5709 20 117 13 -79 -54 65 9 -68 -23 -89 28 -129 -115 53 85 -229 179 203 -87 -38 -194 -119 338 -27 -43 18
5734 18 -60 1 81 -142 -89 209 -82 30 -80 -41 -43 -18 85 -64 -146 -25 98 -10 -192 162 -127 -53 79 -80
5758 -80 -29 -171 -153 -6 94 -23 -49 81 -45 -207 0 19 333 -75 147 -41 13 -215 -127 -155 77 91 41
5781 41 -65 -126 98 -30 -118 94 -96 -68 -142 187 -20 -49 140 -35 -174 180 -139 -32 -33 -156 89 65 -18
5804 -18 84 91 38 -184 176 -67 -62 -31 -66 61 -65 101 -181 -191 -115 -2 56 110 -93 46 -124 24 110 21 73
5829 73 -79 249 -13 124 -99 -124 59 123 -50 59 -23 193 132 -201 -64 0 -64 -17 201 8 59 -83 -6
5852 -6 -37 -23 -8 -74 -130 -327 -43 -88 -113 138 63 -83 -49 -8 -219 -199 -204 -96 254 119 -84 -30 224 -106 226
5877 226 -132 -60 5 22 14 -102 92 -10 154 155 -156 -78 35 235 221 -76 49 160 -140 -143 -30 28 -151 2
5901 2 103 192 -193 8 54 -107 76 -66 -22 -52 77 -148 -237 -27 238 177 97 -23 -207 11 65 -82 -98 -50
5925 -50 113 6 -71 -54 -48 -16 -295 91 2 107 143 -341 268 8 -146 167 217 -47 -210 169 -177 -179 50 -215
5949 -215 -122 237 169 33 314 49 -119 34 -88 -152 -9 -88 -105 96 -149 90 128 65 139 21 -24 -40 -45 -220
5973 -220 -124 -6 -44 79 155 -126 6 26 -91 128 63 102 296 210 -137 29 -86 73 -86 -201 -188 85 5
5996 5 22 100 7 187 8 -97 19 -13 -65 146 119 17 -93 83 -85 79 5 -50 95 40 -127 -25 -55 -158
6020 -158 163 -37 -39 -122 -28 -104 -69 317 16 -41 -39 125 -265 68 -7 -237 70 -25 -334 -48 -33 53 -99 108
6044 108 -160 183 70 178 146 18 131 45 8 -6 141 -153 62 -18 -90 99 -69 121 3 48 -5 -29 89
6067 89 -97 78 -98 54 182 -214 5 93 194 -102 311 107 11 -18 219 119 53 65 116 3 60 -70 -98
6090 -98 -38 -95 289 -87 24 65 -57 -19 -111 8 -176 -67 199 -58 -347 -57 -100 94 106 48 191 89 71
6113 71 -165 -89 8 64 10 95 23 -63 134 -165 -82 -127 46 -83 54 78 119 -10 140 167 -158 -97 -84 169 76
6138 76 26 16 -86 27 -131 146 95 -136 158 23 45 61 147 -53 137 99 137 -54 -237 207 141 -28 54 -175
6162 -175 -245 59 -10 11 -62 -322 34 48 -166 85 46 149 -11 -50 43 -129 -134 -137 -29 -52 21 31 58 153 8 -208
6188 -208 -89 94 -28 -249 3 139 -110 -229 5 26 -48 -95 -67 32 56 -165 110 114 300 67 208 -39 -55
6211 -55 -59 101 174 -178 86 41 -93 -112 -146 73 -123 74 243 26 121 -57 -21 100 -79 243 47 184 -55
6234 -55 -2 -123 20 226 -18 38 -36 -181 208 156 221 79 -88 -228 15 182 -144 51 -102 186 89 -267
6256 -267 -56 -76 160 214 173 -214 126 -16 159 74 9 43 -119 27 56 -56 -27 -13 78 -3 58 -20 -216 13
6280 13 -194 123 -158 162 90 -145 74 63 23 279 91 16 -135 72 32 157 -62 111 78 -116 -260 -116
6302 -116 238 44 -110 77 32 84 146 -32 81 -125 -162 77 159 -186 -235 -73 -78 -218 242 46 -110 105 25
6325 25 -11 -52 -216 118 -97 73 -114 -157 125 45 19 152 11 -95 112 91 30 -171 -133 -161 -148 -142 -143 157 -13
6350 -13 -185 -65 -160 -7 46 89 103 79 124 33 34 -154 -31 258 -194 -51 -52 43 90 188 140 -180 -222 56 -287 -161
6376 -161 304 96 -114 -27 167 150 307 159 68 -237 -56 -83 95 -158 81 -99 -258 11 30 -61 70 207
6398 207 70 -204 159 58 -4 -203 -10 232 145 -164 9 -38 -1 119 160 111 139 -20 21 278 -105 -184 -95
6421 -95 16 -352 81 -97 -57 -52 -89 101 -47 69 83 22 10 230 -204 -239 5 188 -29 21 -170 -17 114
6444 114 110 114 23 109 89 -17 -57 21 87 -161 92 57 164 71 112 186 -169 49 -260 -25 54 -51 79 -68 157
6469 157 -129 96 -116 -75 -38 86 -12 102 44 68 165 -14 30 19 -237 -241 -17 3 -55 -9 -139 -37 -162 17
6493 17 -66 170 -126 -44 53 117 179 151 -14 -30 -113 -78 -137 -99 -74 -120 115 -21 96 -137 -197 75 -232 25 35
6518 35 -23 34 -2 96 47 213 -191 -58 260 -164 211 26 -39 277 43 -27 -81 -201 78 -287 35 -89 -93 -68
6542 -68 22 -160 25 50 103 -37 152 -53 -50 -195 -182 147 -56 234 21 -142 -107 358 19 20 -20 96 -68 -120
6566 -120 116 -175 40 150 127 118 190 -258 64 54 -6 -2 8 48 -140 87 -233 -96 12 13 -164 91 -96 156
6590 156 23 -252 -88 -97 -174 32 -148 75 -162 61 -110 76 -42 89 -11 116 108 -51 68 -32 -124 -249
6612 -249 -24 45 109 131 155 145 41 -62 297 -61 72 -158 -28 -64 317 200 2 71 -42 141 -82 67
6634 67 -192 -55 44 274 10 -7 -205 20 174 -102 119 80 71 148 -188 -17 -207 104 -65 75 93 -64 48
6657 48 -315 11 93 32 -124 -13 122 -59 -56 175 10 -7 48 -162 204 159 -121 123 -80 -32 -114 24 49 68
6681 68 15 91 86 -193 146 157 -300 132 148 -93 191 -288 -171 167 -89 -100 -227 137 8 99 55 -68 -235
6704 -235 -133 -76 -2 135 16 123 -149 143 359 63 -197 78 -40 -3 62 -51 -11 63 122 137 -40 -128 92
6727 92 -37 -19 91 -108 -72 -23 100 55 166 193 30 -45 379 -229 -137 -64 -65 -77 10 -114 29 -96 15 -88
6751 -88 116 -17 3 41 108 8 78 216 -99 -78 -59 267 -82 24 -7 -238 -82 236 194 109 232 23 -79
6774 -79 -12 -72 55 153 110 -10 0 196 23 -144 -37 34 -58 -56 69 -139 37 -43 -66 177 -61 241 -166 134
6798 134 -10 -73 131 21 192 -10 -92 61 -111 124 -59 65 286 67 55 174 -109 7 -43 -232 -176 -34
6820 -34 254 -34 -188 13 -115 90 49 -65 -226 -400 260 -146 -26 199 -38 -190 -61 21 -56 -18 -121 -9
6842 -9 15 83 -71 -158 182 9 46 56 -197 52 189 92 80 -54 -89 52 -73 179 42 -215 178 -275 27
6865 27 -129 -12 31 -151 152 -29 55 -73 -78 -59 -38 108 72 -86 -130 51 43 -244 -69 201 93 84 -110 145
6889 145 -27 112 139 89 -99 122 -54 67 60 -42 47 157 -124 -171 -45 44 81 125 10 -159 31 -81 -230
6912 -230 -144 125 -291 31 151 5 280 265 -187 31 -155 -87 16 -176 214 -133 -24 -150 -5 196 21
6933 21 81 -106 -15 313 -31 -12 23 -87 -17 -193 198 235 117 -99 127 -60 -299 -123 61 -114 -145 -56 131
6956 131 -157 -64 -109 -98 -101 292 -3 -31 -13 20 209 194 201 -73 -21 -210 -59 65 -167 246 -6 82 -173 3
6980 3 204 -89 34 69 -114 -30 -3 114 50 47 -42 -106 63 122 -101 -134 -40 -118 122 -99 130 -71 52 41 87
7005 87 61 411 -47 -10 29 -99 57 -123 0 -122 -9 39 326 107 15 -13 -33 -122 -133 -67 182 -52 62 45
7029 45 26 -32 88 66 10 68 -68 -20 -24 -64 -134 -144 -62 141 -73 114 56 -134 -82 -253 114 35 17 -49 -198 18
7055 18 -191 -12 91 -90 56 133 -74 100 21 27 61 -343 120 -217 -101 209 -7 83 78 -4 -73 -275 159 -3
7079 -3 122 129 -12 -106 -255 213 -157 167 -88 -150 -91 6 54 -9 57 -194 -15 61 45 -243 -112 -134 -17 87 -174
7104 -174 197 -16 107 158 -51 126 34 -40 -83 17 -35 -28 130 170 -73 68 66 87 179 -201 -90 -99 -59 -149 13
7129 13 -379 -177 -46 -36 -117 -39 25 -44 -160 261 -1 100 -106 -59 90 124 -45 -281 35 -322 -87 107 22
7152 22 -153 -68 27 267 -117 128 -12 -88 -88 -86 -3 37 -132 -117 43 33 65 -59 42 -22 6 -2 -109 83 -26 32
7178 32 -139 116 -54 -247 -41 -41 298 37 34 240 126 333 119 6 96 54 -170 209 140 -10 -187 93 319
7201 319 -89 -1 -216 -38 -3 -94 163 119 -103 -159 -74 66 89 -43 -30 16 -31 -17 -207 53 -289 46 12 -183
7225 -183 40 -63 194 -17 -38 -50 -134 -176 -178 -54 122 -109 26 -27 -181 -5 -73 17 -177 38 15 -100 132
7248 132 -117 16 -51 -154 110 -22 15 84 95 60 16 5 -53 -80 34 -119 204 -201 -169 63 -133 -100 -72 19
7272 19 -19 143 -449 256 -175 -111 174 150 13 -166 50 -73 -175 -10 97 -195 -45 -51 34 55 -37 -136 38
7295 38 155 -109 -182 -99 -135 38 84 -10 -76 -33 71 14 -47 54 59 14 -60 6 -220 27 -51 153 -60 -20 285 -162
7321 -162 59 -225 55 -44 -166 -170 -140 -173 201 -70 190 20 -86 41 65 -64 91 -47 -147 303 -97 13
7343 13 254 -96 -233 151 -88 125 198 137 236 -166 -190 6 -85 254 97 95 -115 -256 -112 14 -11 27 -45 29
7367 29 34 -97 108 -41 30 -103 -13 137 88 127 200 37 171 -111 83 26 187 6 -109 56 -114 81 253
7390 253 19 3 -12 -135 -114 196 -271 81 17 -60 43 -92 -154 -79 -290 -69 184 -281 -140 -128 -19 128 80
7413 80 111 -18 12 137 234 247 -160 -219 -166 -63 -156 -49 305 125 236 212 -92 60 45 26 -84 -34 -220 12
7437 12 -146 293 17 36 -79 92 102 -44 -55 11 210 101 -120 7 82 -33 95 9 126 -106 -46 -144 -62
7460 -62 47 -104 316 -14 -13 166 184 134 -75 -169 34 -116 -37 23 40 186 10 153 64 -3 37 70 -37 -16 -162
7485 -162 -266 39 -28 33 -149 -141 66 -121 -31 168 -14 231 -12 -175 184 -211 55 -91 -134 104 146 133 -30
7508 -30 -45 -173 -224 92 -52 26 -168 104 142 -38 95 83 -261 180 -66 97 -156 -12 66 -83 -35 240 -34
7531 -34 -110 29 94 -33 -50 20 -82 60 -119 -48 -152 -25 -84 -74 -57 81 -109 -25 201 -66 42 -16 -5 -76
7555 -76 -179 -45 43 -54 84 128 195 175 131 30 -23 -24 19 17 -170 -1 -122 177 20 138 -211 190 -126 -188 71
7580 71 -165 -142 -18 56 2 -24 -51 87 92 67 -134 -166 -121 -244 -50 -127 -26 53 56 109 31 -27 -22 -263 -319 214 -23
7607 -23 -16 -226 79 -268 49 -6 -43 140 -192 53 20 23 -110 -240 -26 93 -160 -21 -176 35 -74 226 3
7630 3 -65 127 -210 -149 -134 -28 -161 47 -119 -17 148 73 170 -101 -85 -186 -106 -127 16 65 63 -85 22 -35 -181
7655 -181 -67 -217 -36 -145 -36 43 109 93 -104 370 -118 -128 96 -174 285 -102 -60 -8 352 -21 -129 221
7677 221 181 96 -95 236 -51 -251 -127 61 -135 -113 333 -53 12 139 -22 -227 182 -164 63 -138 -130 218
7699 218 -57 138 40 316 104 -100 -298 41 35 13 -55 -109 -32 -83 124 -151 189 -163 -152 103 22 -8 57 196
7723 196 -188 88 -75 -99 37 26 -56 197 -112 20 -73 313 181 28 -203 -52 -418 -84 -57 -8 24 295
7745 295 -153 0 15 -103 83 -28 -34 -105 -33 146 -92 277 -56 68 -62 28 50 21 -93 48 27 -132 -127 27
7769 27 -152 177 108 222 168 -141 132 56 161 5 74 -119 100 239 192 169 -254 -201 -59 -46 -36 140 -157
7792 -157 -60 218 -91 -27 -219 20 15 -104 133 67 -31 140 91 175 -66 31 35 198 -105 115 -99 122 16 341
7816 341 -64 -99 61 11 13 7 -19 -140 -8 69 -181 98 -123 128 -38 98 154 -23 46 -48 134 81 -84 83
7840 83 112 67 -327 134 70 97 100 28 -215 223 18 9 -204 -9 109 -74 -165 24 -79 282 146 84 114 144 -127
7865 -127 -51 96 -104 53 -48 131 -35 66 -44 -183 240 -176 -83 39 21 88 -274 149 293 -77 4 49
7887 49 10 20 -73 -224 132 15 -24 181 26 -18 82 -249 47 -87 -141 -22 -199 25 -29 -232 -196 -128 -29 -135
7911 -135 105 139 -338 125 -194 146 -47 -100 -86 24 -4 -203 115 -36 269 -168 183 113 -67 -70 -10 73 100
7934 100 -80 223 19 -74 -55 76 -41 12 57 -415 137 -140 154 96 52 -125 119 -62 30 9 -39 59 -15 -8
7958 -8 109 9 105 -192 119 -35 -43 -104 -57 47 -15 130 101 127 167 -74 -226 -108 -38 -113 209 -219 -129 21 6
7983 6 201 -172 -132 95 -34 -128 121 2 144 42 112 147 60 28 177 -10 -158 -117 18 36 13 193 -150 -42
8007 -42 12 -197 92 -102 -120 -93 51 229 47 -123 120 331 296 128 26 165 124 -66 -58 -188 26 60 -87
8030 -87 3 55 5 227 -133 -152 74 -188 -39 -171 -216 14 -235 -133 21 173 -171 -99 44 77 -122 -2 84
8053 84 -49 101 114 201 113 138 135 238 -26 -4 -26 57 297 -119 166 -56 248 -163 -80 163 216 22 -148 -149 5
8078 5 -39 -42 -144 82 -117 -56 -74 254 -102 34 -20 -151 99 -77 134 115 35 -44 46 -89 33 78 179 -26
8102 -26 81 -53 -163 -106 -11 165 160 -29 -3 264 -19 19 50 58 -6 -26 142 -43 202 50 -5 -451 -219 43
8126 43 165 59 102 -237 27 -39 99 143 -57 -183 -55 -66 -25 -43 -48 210 228 92 273 95 194 -15 -275 -57
8150 -57 33 220 6 72 27 322 -99 -204 -136 -29 54 240 97 -148 -55 33 79 97 -233 52 91 -47 93 -174
8174 -174 -37 222 -39 -62 58 29 51 184 -195 -106 15 243 23 -210 155 28 76
8191G6
$$ Imaginary data points
##PAGE= N=2
##DATA TABLE= (X++(I..I)), XYDATA
0 0 0 0 0 0 0 0 0 0 0 0 0 0 0 0 0 0 0 0 0 0 0 0 0 0 1 -6 7 -8 8 -8 8 -8 9 -14 15 -15 16 -20 23 -23 25 -31 32 -36 40
45 40 -44 49 -55 60 -64 72 -79 87 -97 108 -119 131 -148 164 -187 213 -246 288 -343 424 -541 738
67 738 -1124 2173 -11013 -27814 3888 17176 2370 -6498 5379 12912 6938 6031 10154 3292
81 3292 6685 15403 8184 -3720 -1232 9566 9638 -5356 -7090 1922 306 -4432 -5513 -5453 -3768 -3394
97 -3394 -1161 -3363 -9161 -1732 6199 -175 -3499 -538 3893 4939 2635 2551 871 297 7276 4889
113 4889 -5206 -2386 4378 2808 -5766 -8999 -898 1214 -6206 -8010 -6102 -3726 -2743 -5136 -3113
128 -3113 -2859 -4018 1110 2157 -2163 84 5680 8393 2383 -1246 7337 10564 4253 3568 6216 5985
144 5985 3042 1200 4131 2261 -1314 1395 143 -3765 -3399 -1541 -445 -3980 -6262 -1734 -2272 -4694
160 -4694 -1777 -871 -1766 -1748 -261 1032 -926 -421 4006 1791 -1279 1748 2612 1993 403 -43 1467
177 1467 -1044 -802 425 -2930 -2669 558 -2126 -4534 -3670 -233 227 -5149 -3491 1595 -174 -1152
193 -1152 -269 1393 3245 1281 1656 3282 2635 4502 4426 2008 2782 3202 3496 2653 633 2236 2498 -1140
211 -1140 -692 -204 -873 -1066 -2426 -2158 -2000 -3644 -2211 -1464 -2621 -1667 -2704 -2220 -27 -857 -656 16
229 16 173 1724 623 -56 2036 1735 1695 1176 -83 1200 1411 152 206 -644 -181 34 -2057 -1180 -529
248 -529 -1660 -790 -1579 -2309 -868 -1334 -303 -411 -1105 825 873 382 1343 1019 1842 1809 970 2385 1671
267 1671 1252 2261 1275 363 643 -82 582 -351 -1325 -626 -1728 -2037 -733 -2039 -1676 -1247 -1470 -942 -1713
286 -1713 -998 633 -30 -170 1037 497 1421 1595 845 1910 1152 1618 1995 470 1684 1772 126 315
304 315 -371 -337 94 -1354 -1036 -1108 -2263 -1331 -1633 -2051 -1257 -1621 -1080 -911 -1416 414 -19 64 954 570
324 570 469 1598 1270 1722 1543 906 1790 1087 384 927 196 252 90 -927 -604 -1053 -1475 -679 -1878 -1638
344 -1638 -1070 -1765 -1009 -962 -868 225 -766 -36 890 236 1109 1402 972 1911 1334 1231 1830 902 1530 1203
364 1203 309 920 332 -260 196 -773 -480 -554 -1691 -827 -1001 -1358 -730 -1185 -1375 -154 -492 -47 19 -300
384 -300 1026 556 454 1250 674 1206 1381 449 895 767 523 1049 -440 -571 89 -961 -665 -973 -1831
403 -1831 -931 -1247 -1610 -1358 -1860 -549 -657 -1423 -784 -540 235 987 265 386 1296 886 1693 1324 1073 1837
423 1837 1165 1084 813 263 1219 839 -354 12 -458 -515 169 -1025 -815 -968 -887 -128 -1286 -911 28 -515
443 -515 -268 395 -84 439 940 793 1045 544 765 1583 863 690 839 -48 672 74 -424 -221 -906 -803
463 -803 -1109 -1651 -1227 -1431 -1218 -885 -1886 -1580 -563 -1195 -680 -797 -473 402 138 -32 850 916 1626 1179
483 1179 685 1733 1021 815 1372 903 786 742 320 306 -70 17 242 -989 -740 -398 -715 -677 -920 -732 171
504 171 -577 -732 -180 -144 575 442 104 1106 1052 775 829 601 918 952 543 509 -319 -10 457 -604 -925
525 -925 -863 -872 -383 -1235 -2114 -1219 -1074 -716 -1187 -1192 -311 -332 -525 327 210 233 1042 808 848 802 865 1892 1420
548 1420 298 1225 869 1164 428 -768 171 688 -295 -672 -1045 -890 -646 -872 -495 -1325 -1290 -107 -399
567 -399 -893 -460 -22 634 448 -53 917 1183 1181 1237 592 910 1144 408 645 483 -86 334 -69 33 -907
588 -907 -1057 -141 -408 -1631 -1238 -915 -678 -414 -1521 -904 162 260 25 -69 290 1054 541 1017 1089 321
608 321 1378 1536 341 570 644 954 481 -564 -458 6 -591 -572 -1162 -909 -118 -1291 -1380 -704 -1043 -783
628 -783 -356 -605 1 -499 206 480 192 976 1530 307 780 909 854 1134 450 993 86 -39 231 -341
648 -341 89 465 -937 -946 -519 -821 -1073 -896 -645 -178 -529 -552 -252 -423 68 75 -424 779 500 287 631
669 631 849 709 947 497 842 220 361 539 -438 14 156 -295 -553 -680 -516 -544 -1219 -755 -473 -977 -476
690 -476 -642 -469 205 -298 1 289 202 694 493 535 913 542 461 655 231 538 589 -75 165 352 -349 -201
712 -201 -371 -610 -450 -1095 -566 -528 -941 -632 -831 -713 -192 -419 -81 91 222 472 166 158 652 694 860 448
734 448 328 934 871 217 534 -24 420 164 -155 -388 -533 -740 -343 -301 -782 -483 -711 -334 -477 -636 -295
755 -295 -407 -331 498 -58 227 526 510 650 511 422 886 234 594 382 134 376 35 -144 -44 -237 -199 -229
777 -229 -844 -460 -655 -945 -476 -484 -685 -169 -372 -502 -9 189 395 303 157 730 587 615 814 402 716 636
799 636 260 255 -27 176 203 -418 -58 -353 -818 -455 -690 -583 -527 -741 -507 -320 -592 -96 -408 -189 218 -67
821 -67 318 456 499 632 951 473 619 332 464 553 306 594 500 -16 -158 -122 -463 -348 -612 -411 -359 -687
843 -687 -781 -517 -578 -157 -439 -62 173 -138 82 223 37 426 568 508 823 326 583 482 80 422 132
864 132 12 112 -334 -356 -264 -677 -581 -428 -885 -159 -470 -517 -546 -736 -1 -87 -227 204 -50 187 532 329
886 329 485 777 534 605 583 506 616 537 529 -5 -173 -81 -284 -538 -18 -560 -583 -386 -586 -241 -333 -532 -257
909 -257 -223 -556 -28 -41 -27 173 55 385 529 269 695 459 412 584 99 74 156 -166 217 -338 -214 -25
931 -25 -529 -502 -450 -430 -456 -466 -685 -541 -408 -55 129 -249 19 462 10 373 297 552 465 640 491 393 312 429
955 429 648 43 9 -29 216 -140 -21 -83 -325 -412 -206 -667 -735 -70 -529 -80 -147 -196 -74 72 400 346 -1
978 -1 580 651 142 219 198 468 636 -22 128 -18 135 242 -206 -109 91 -553 -443 -306 -654 -181 -450 -207
1000 -207 -333 -537 -181 -24 -175 46 238 -126 345 207 550 687 415 584 307 333 455 180 379 517
1020 517 -232 267 144 -342 -384 -169 -277 -183 -588 -184 -285 -499 -55 -268 -119 -5 -160 93 135 -6 292
1041 292 566 346 543 495 401 231 107 536 307 -36 256 298 -164 167 -528 -62 -194 -499 -440 -536 -383 -160
1063 -160 -470 -295 32 -402 -19 433 55 312 276 215 622 114 482 285 166 604 388 21 360 68 190
1084 190 -99 -168 -75 -239 -533 -287 -666 -396 -372 -296 -320 -185 -331 -91 -62 -138 319 -175 224 -43 319 273 432
1107 432 434 542 174 341 458 7 -12 -78 -43 140 -440 -286 -399 -318 -368 -450 -515 -327 -529 -335 -165 -463 89
1130 89 50 76 87 499 2 195 500 381 232 162 665 289 103 242 377 222 9 -64 -208 -129 -216 -192 -538
1153 -538 -399 -418 -638 -259 -34 -266 -195 -117 -158 147 11 60 53 251 397 376 169 366 80 140 521 247 226
1176 226 179 4 -42 91 -127 -91 -183 -116 -365 -442 -354 -371 -395 -228 -385 -227 -109 58 -158 149 190 323 270 271
1200 271 336 129 397 415 342 116 88 -2 -77 -196 5 -232 -469 -271 -484 -334 -156 -180 -403 -175 -198 -223 -263
1223 -263 -35 231 -222 164 135 217 325 410 233 272 373 90 497 8 578 164 -17 439 -114 -115 -72 -65 -434
1246 -434 6 -210 -368 -198 -384 -145 -186 -280 186 50 47 265 -50 266 255 78 241 328 242 370 -69 114
1268 114 472 -87 -121 -86 -117 -66 -374 -101 -104 -507 -270 -235 -350 -331 -378 74 -272 -190 210 123 11 266 292 188
1292 188 460 54 529 288 326 416 301 262 282 257 169 138 -139 -24 -137 -399 -46 -61 -232 -430 -116 -220 -288
1315 -288 -68 -112 -246 -272 20 140 167 -88 255 250 170 295 214 152 88 193 -38 140 210 -149 -26 -62 -275 -89
1339 -89 -209 -295 -147 -281 -193 -394 66 -129 -296 -211 214 245 392 77 143 762 190 323 146 257 223 189 173
1362 173 319 -100 149 -64 -57 -290 -100 -217 -346 -525 -323 -160 -232 -330 -397 -165 74 -175 -99 176 -457 108
1384 108 223 83 349 235 73 296 335 63 264 -117 -23 -76 -248 -131 -230 -190 -310 -486 -71 -159 -204 53
1406 53 -462 -408 68 -183 -174 163 31 224 240 128 292 -92 -38 265 256 438 30 185 204 -32 -103 -184 -285 -140
1430 -140 -324 -274 -148 -444 -333 65 4 2 -147 -309 -143 -206 -287 -149 -119 235 257 108 302 264 225 319 -107 403
1454 403 246 -44 237 -6 -43 34 -144 -157 -130 -25 -320 -291 -204 -142 -201 -352 -293 -236 153 -25 -117 273 72 -96
1478 -96 265 -79 163 224 253 186 208 212 421 7 123 105 -158 -180 -103 24 -230 -363 -186 -137 -352 -214 -258 -410
1502 -410 -122 -7 -235 25 246 202 172 132 450 75 53 256 201 160 308 -4 112 -42 178 59 -78 -177
1524 -177 72 -6 -234 92 -389 -372 -131 -305 -311 -293 -257 9 -141 60 -114 23 339 7 204 422 87 267
1546 267 176 46 -70 103 134 230 130 -10 25 -377 100 -270 -206 -164 -192 -353 -350 -150 157 45 114 125 45 209
1570 209 199 5 250 304 154 60 209 115 232 309 -10 62 -88 -112 -121 -292 -122 -316 32 38 -288 -182 -238 -126
1594 -126 -221 -227 -67 148 -306 -88 47 166 509 339 203 205 72 226 92 -13 267 120 -34 -16 -107 -180 4
1617 4 -176 -309 -175 -297 -44 -207 -124 -299 -42 9 247 -206 144 130 -136 111 -26 220 46 10 170 262
1639 262 38 211 206 -94 154 -217 -116 48 -100 28 126 -380 -444 -244 -25 147 -264 60 -158 -50 -39 25
1661 25 312 38 111 148 97 16 300 245 62 55 -1 134 41 36 -48 -243 -76 -157 -204 -90 152 -423 -267 -69 -626
1686 -626 -99 -4 24 31 -283 176 173 45 126 196 -17 179 213 307 371 305 21 212 -81 176 -81 -30 179 -147
1710 -147 -80 -180 -134 -437 -505 -304 -230 -167 78 -87 -56 56 -274 -26 11 222 80 256 -185 176 39 -119
1732 -119 -80 -73 34 114 -65 -149 -128 -124 -166 -268 -77 -347 -193 -154 -76 -137 157 -228 -20 -44 -60 31 -140 227 354
1757 354 -38 231 229 436 466 119 2 247 78 -154 76 -100 -142 -73 6 0 -84 46 -253 -35 -151 60 -51
1780 -51 -175 36 -122 -242 -145 -114 -146 43 -6 99 58 202 290 213 159 72 88 -56 -60 113 -217 121 52 -212 -257
1805 -257 -72 -242 34 -164 -48 -144 -173 -252 178 -216 73 239 126 122 130 247 200 165 251 210 -62 286 208 4
1829 4 160 -45 -61 -109 24 -193 -384 -38 93 -98 -248 -275 -234 -239 -322 -203 9 1 -59 190 -126 259 70 -345
1853 -345 321 -15 254 71 49 235 -73 -156 -142 -141 -88 95 -116 -222 -71 -67 -71 -214 -437 48 -14 -192 -307 236
1877 236 132 184 -204 -366 -270 -154 -83 41 448 113 282 45 363 92 -34 -89 36 72 22 -283 -88 -260
1899 -260 -35 -278 -122 -13 -111 -257 27 -251 -19 -95 183 90 -2 -32 81 67 223 124 145 111 167 183 -110 -120
1923 -120 -23 120 379 -34 166 -147 -11 -121 -128 272 41 -59 -352 -250 23 -283 -78 26 -342 349 -51
1944 -51 100 -75 -90 110 -91 36 9 -2 -173 64 38 -35 -60 68 102 42 -98 193 -74 -1 -211 -151 -310 -264
1968 -264 123 295 57 34 144 78 188 118 11 118 102 17 71 31 -86 174 9 32 1 6 -157 -149 -82 -117 -325
1993 -325 -326 -72 -384 -61 -135 -196 70 -8 -210 114 -146 109 -145 -165 156 188 336 8 64 -47 166 35 229
2016 229 -43 30 127 -83 55 -7 13 -347 -33 -239 -161 11 124 -184 -61 138 124 65 -25 37 0 -60 -71 129
2040 129 -138 -15 63 259 -4 127 96 -116 172 -129 -127 320 -18 11 -68 -101 -358 -312 -223 67 -153 -100 48
2063 48 -12 325 133 55 -10 79 -45 225 -1 73 216 33 222 128 9 148 -136 176 -52 -148 82 63 -57
2086 -57 56 -121 -30 -23 -113 -82 60 -182 94 59 14 56 -120 -182 205 45 238 118 219 -42 113 215 67
2109 67 118 33 69 -65 121 -88 200 -258 -195 -62 -180 -227 228 -239 -80 -11 -32 109 -15 25 227 142 111 218
2133 218 184 76 248 168 25 -31 152 298 126 -14 63 -64 77 -46 -227 -6 -69 97 49 -65 -146 -81 -111
2156 -111 14 17 -34 -123 145 237 129 117 283 151 33 47 292 227 -160 -147 335 251 54 -60 97 -47 -301
2179 -301 35 -306 -360 47 -231 31 -180 47 0 -85 -45 148 -92 -98 -22 79 95 95 142 -72 -173 10 151 145
2203 145 71 -211 -47 -10 159 -308 -181 4 -196 -93 -82 27 -24 227 93 -201 -123 153 67 28 132 116 243
2226 243 208 228 251 -225 -103 -73 78 -10 -5 -9 -36 -64 4 -8 -29 63 -65 -165 -173 206 -54 -56 35 151 190 23 26 -33
2254 -33 -1 118 -5 -74 -24 10 -17 91 118 122 -110 36 -144 222 224 148 -396 -257 -66 -104 -111 -338 -151 -103 -235
2279 -235 -52 -83 7 -57 -29 168 -27 24 -77 115 146 229 -135 82 -148 341 166 161 -71 -38 34 133 44 -67
2303 -67 -87 -191 199 -18 -40 4 17 14 82 -6 15 131 73 -56 -34 209 191 64 64 324 143 378 118 181 72
2328 72 320 39 -423 7 -20 -86 47 -142 -323 -63 -34 -59 -18 -65 115 -38 -85 96 178 84 301 128 366
2351 366 -47 -24 229 0 -274 -44 -88 223 103 -57 -100 -93 -36 -32 -71 -94 27 -268 -83 -61 -150 156 83 21 162
2376 162 76 -62 65 8 266 138 103 -93 -185 75 86 97 -53 -86 -26 198 43 -154 33 19 -84 -108 -68 59
2400 59 -21 -46 -170 -198 61 -25 172 68 107 5 54 -75 -1 -173 108 -122 -8 305 199 328 -39 41 18
2423 18 70 33 -247 -22 2 -168 -190 -272 -158 -15 -42 227 -286 -93 91 107 -82 299 -198 76 115 29 121 17
2447 17 338 -84 -2 111 144 112 -80 -264 -110 -182 -159 -60 -28 -128 -21 -179 -76 -332 -134 198 -133 -1 232
2470 232 56 -44 -130 -8 -98 -79 80 175 42 45 131 44 -221 -50 145 134 -82 163 -99 -195 200 -200 -107 -56
2494 -56 -130 -78 153 -52 64 267 116 241 183 3 39 -105 -127 -167 -18 96 105 -96 14 181 290 22 81
2517 81 16 -204 -212 -77 -186 -98 33 -101 76 71 -142 86 -1 -84 68 82 -59 -4 145 -167 220 59 160 25
2541 25 61 -159 275 -58 -79 -271 -90 -3 -329 28 48 -225 -80 -149 -130 227 -68 -14 -73 -72 -53 136 -407 -78
2565 -78 -209 161 88 -148 100 -115 -108 24 71 65 272 18 -27 206 21 13 1 -51 -86 -222 77 79 86 -185 -104 123
2591 123 12 89 2 -271 -7 75 -37 210 -130 146 -1 160 -78 39 565 30 -2 -55 22 111 -202 30
2613 30 -172 39 107 4 156 -381 -91 -97 -42 -90 73 -139 -161 74 72 -65 86 91 -153 240 -96 -87 -38 20 -69
2638 -69 45 -21 -137 143 -166 -61 131 79 -160 75 152 -281 82 -60 -212 -10 59 -39 -54 -71 175 322 126
2661 126 34 -34 -26 -25 -79 -109 -117 183 -100 70 174 -63 28 -286 59 25 66 -190 -190 10 -272 -62 256 -234 -142
2686 -142 -53 96 90 -2 -3 115 -36 78 135 105 179 17 -123 -394 14 59 170 112 -50 83 -246 -154 -82 -247
2710 -247 71 248 -51 -74 5 -78 67 239 47 78 -15 31 -64 369 174 49 200 73 -39 93 57 -31 -108
2733 -108 211 -276 219 115 -70 -360 -104 -51 62 -52 -42 17 76 92 -88 126 -248 -145 -42 57 266 96
2755 96 255 41 136 -89 -193 -67 104 185 49 -20 -34 -18 -214 69 96 35 -46 -181 199 126 -242 47 -65
2778 -65 112 14 -125 175 125 196 -69 146 -226 41 35 79 -70 -50 108 7 -149 -133 100 70 54 -245 -224 7
2802 7 90 -256 -161 -105 0 82 -256 28 -91 -328 102 133 149 92 131 119 82 -21 163 77 -103 -68 -159 86 -35
2827 -35 102 46 -107 -44 3 -41 24 -70 -196 -214 16 -194 -8 -42 59 -121 -19 190 161 34 -160 212 163 -63
2851 -63 -52 66 235 10 -27 65 19 -133 -141 -96 26 96 -59 -76 -43 55 31 -80 -69 104 76 161 107 62 200 57
2877 57 -14 -112 49 7 149 118 128 -26 167 23 34 63 -162 -10 104 135 -80 -22 -104 -46 -14 -38 -152 -315 60
2902 60 -118 69 -126 -42 -43 1 -18 101 15 -100 103 158 -46 88 -33 33 -160 32 -119 -23 -141 -103 -99 53
2926 53 2 -320 -202 -103 190 -149 48 97 17 -77 129 179 12 -65 -27 100 78 209 54 303 124 15 -143
2949 -143 10 -26 -191 -68 35 -141 -214 -267 -115 -16 -43 -44 70 -179 -58 122 -33 -47 -39 -133 -30 -142 95 -90
2973 -90 28 19 -158 -2 -161 -186 -210 -165 21 -71 84 34 -31 -45 162 0 78 -63 5 156 262 -78 302 25
2997 25 72 50 -163 -115 231 66 -185 -220 78 -115 -2 10 127 161 -10 6 20 200 16 116 101 138 25 -190
3021 -190 -119 -111 64 59 -238 222 7 -101 -373 -183 136 89 -143 73 162 29 -40 -77 -127 73 -124 -291 16
3044 16 -183 -1 -195 31 -94 -9 -8 27 -424 34 -114 -5 95 -66 -182 2 91 20 70 5 -42 -74 145 -66
3068 -66 -83 81 59 -116 -12 -40 27 -60 -81 59 -215 -105 -14 19 8 218 -92 117 -278 -133 -117 -63 -66 -85 -323
3093 -323 158 187 182 87 57 158 2 131 -128 -41 104 107 -5 -140 -29 10 -166 35 -146 -186 76 -113 -280
3116 -280 -39 -70 -97 -87 -69 -99 -41 -72 142 32 50 44 41 0 11 -72 344 -141 257 231 10 -10 56 140 -69 -303
3142 -303 -22 14 -50 -16 -84 40 69 -83 -30 77 61 59 -208 -9 38 -145 40 -67 247 191 236 93 110 69 69
3167 69 -124 -93 -100 -66 -11 -214 -87 -15 169 -82 -52 -271 -92 -47 66 58 15 -172 75 212 -117 34 107 -64
3191 -64 -27 86 -243 170 -148 -157 -199 -145 10 -35 -17 116 66 28 -52 -94 -28 -20 -23 65 -207 -7 -17 65 -8 94 -45
3218 -45 282 -65 -107 -21 231 77 -125 172 35 167 -78 102 -307 157 91 -132 141 -28 -139 21 -96
3239 -96 59 -169 -181 -142 -80 -97 124 22 -26 -165 9 148 -66 -44 -69 402 151 23 7 -312 -33 -92 -222
3262 -222 120 -124 -6 81 -218 -146 -42 -65 13 -127 50 -40 -104 -43 124 -33 -90 -15 -97 226 197 -18 13 151
3286 151 33 -2 16 150 12 -236 177 11 99 -5 71 -63 -95 12 -62 -249 15 164 155 -109 -119 -38 138
3309 138 -80 121 195 61 -158 218 -157 154 4 -100 -24 73 -91 126 53 -7 6 -123 123 -220 -40 -171
3331 -171 145 45 118 71 73 339 -98 -149 -32 35 -20 204 92 26 40 -149 -123 -55 64 8 -217 158 -140 47
3355 47 124 35 -218 -160 -42 -89 -116 86 148 6 -12 220 35 43 -12 -108 164 138 360 256 -19 109 472 -50
3379 -50 121 167 -120 149 -86 55 111 -249 72 -182 -125 22 -117 -63 65 -11 107 2 235 -69 -337 1
3401 1 -204 -370 72 398 491 -215 114 30 39 1 42 159 28 8 163 65 -180 61 -112 113 35 -138 16 -45
3425 -45 -58 -53 -326 230 159 -86 140 -217 -170 157 -80 -105 42 54 5 50 -201 -133 6 -56 -121 187 -195 -5
3449 -5 98 -20 89 -35 148 -57 -370 154 127 -87 43 -165 -3 -42 179 -41 -37 -156 160 252 155 34 12
3472 12 71 -174 5 23 51 4 121 -137 102 -129 61 28 -51 -92 -14 -173 152 -326 -256 145 33 177 -1
3495 -1 -151 -135 33 -261 -15 -223 49 -223 -81 -212 325 -18 -15 -11 -87 -37 -173 -206 71 21 58 -64 -315 -136
3519 -136 -6 -193 8 112 -106 50 60 13 -58 38 -55 -18 -95 137 371 20 97 45 248 -277 104 -17 -321
3542 -321 -56 -44 366 -67 86 2 -206 -242 -154 91 106 -15 -156 78 9 -38 108 -130 -201 70 -156 -109 252
3565 252 -154 191 -38 292 -96 44 19 128 95 33 -202 59 -24 -21 -81 72 -120 89 -100 204 -157 -68 195
3588 195 330 6 269 25 -13 99 -259 191 174 152 126 -25 -208 113 130 122 -123 39 249 -137 66 -128
3610 -128 -211 -41 -274 -295 56 -232 29 112 -332 -48 104 -371 -63 51 37 -10 -42 -33 146 29 165 -40 -157
3633 -157 29 -141 -85 -151 -475 83 -112 -16 -110 -47 29 -36 -2 19 -64 -103 -90 175 -98 -212 -74 -101 -190 105 22
3658 22 38 269 -135 -114 -13 57 80 -118 -177 -156 -158 60 104 -119 -181 -30 -112 -88 -220 75 261 -167 76 56 32
3683 32 40 49 -114 -85 138 47 -29 -97 13 -34 315 -162 -51 -147 -210 82 -4 -94 263 -211 -300 137 -13 182 -225
3708 -225 -141 -212 87 47 70 230 41 -84 1 -127 -130 33 77 107 147 -27 -190 -146 -307 137 315 -25 -128 -16
3732 -16 76 -115 26 43 -118 -123 71 61 -92 115 96 -8 -222 -59 27 222 325 -20 -86 24 77 -126 -7
3755 -7 -192 67 177 -22 -38 25 -50 -95 7 157 -165 157 -120 -114 -108 -14 32 -7 48 -161 -83 79 174 -32 -5 32
3781 32 -13 40 141 197 149 -106 -29 -25 152 46 -204 -92 74 54 21 134 -156 109 -205 -166 121 69 -9 169
3805 169 40 -213 386 -37 72 -5 129 154 68 -5 32 -161 96 80 -306 87 117 -23 47 25 217 28 284
3828 284 0 48 -282 -156 -200 -102 -3 -27 -434 -21 -30 -86 189 2 23 -50 39 205 -28 47 -7 -91 -179 131 -63
3853 -63 -40 -93 44 147 76 -19 -254 -34 252 -37 0 -73 -8 -51 -206 81 -56 -26 23 124 231 -63 273 -57
3877 -57 -304 -70 -47 -31 58 -175 -16 231 -30 168 34 33 -12 -39 -112 -215 130 242 100 -56 80 13 -236
3900 -236 51 -151 108 -56 -42 63 94 64 -270 -4 -88 120 68 -31 -72 122 190 34 -72 38 -13 96 -54
3923 -54 273 27 85 160 345 9 274 -17 206 156 63 84 187 29 66 28 -138 89 -5 -42 -32 80 252 70
3947 70 -92 -57 -45 82 -281 -130 -161 -178 -122 60 31 -190 89 52 -29 123 131 255 -29 40 130 -223 119 108 141
3972 141 63 30 118 85 33 -232 -50 -267 -39 -117 71 176 -179 87 -34 172 158 -7 -7 -137 87 163 -206
3995 -206 11 175 -104 142 1 2 -92 209 -128 137 144 116 119 19 98 -168 -32 -260 34 -133 164 -72 98
4018 98 -339 38 -186 21 -100 -10 -57 342 -28 -25 -130 -90 13 23 -17 -159 -8 133 -203 44 -98 213 23
4041 23 8 -132 -70 115 -84 82 -182 -271 -252 174 -184 -202 56 -35 286 -85 -66 194 -178 -8 -25 219 97
4064 97 -42 -186 90 63 -201 -11 275 39 -65 119 214 -134 56 -3 -14 338 -164 -16 133 -316 -11 79
4086 79 89 68 97 -11 12 128 -59 110 99 288 0 140 87 -58 0 -7 2 14 86 -126 351 122 37 210 69
4111 69 10 1 36 10 38 -130 179 22 41 163 114 -101 31 -16 -78 250 3 21 -258 -183 48 -50 138 -201 11
4136 11 -79 -16 218 -61 -96 204 89 -68 -35 -220 -365 12 -55 129 193 144 260 92 -157 72 78 276 48
4159 48 31 -135 86 -133 -60 7 -106 -72 49 -292 -100 32 -182 -196 -213 107 86 -81 9 -80 67 46 -187 -41
4183 -41 20 89 -73 19 85 77 -162 299 -121 -56 -33 29 -24 -20 -41 20 -106 23 77 -118 52 133 130 80 192 138 32
4210 32 168 245 215 -116 45 -43 -120 215 -77 -35 73 -23 -177 -218 -178 -43 107 -21 63 -32 42 -132 -122 -10
4234 -10 -37 56 -13 -80 -27 176 68 225 99 88 -87 96 221 205 -212 -317 80 55 -6 148 63 -66 99 18
4258 18 19 -165 -18 -127 -120 -19 135 -144 191 -146 27 184 171 -53 -27 -135 25 280 -181 175 56 4 30
4281 30 152 -25 -77 -161 41 188 94 -41 38 -76 74 77 32 -110 -30 -45 22 -123 32 -109 -147 172 -35 14
4305 14 -142 115 -256 -83 94 -163 -21 84 -84 37 46 -200 70 71 -258 11 -34 -77 -233 -1 -89 66 -76
4328 -76 50 9 -144 -22 -164 64 -30 -121 263 1 -27 -39 39 215 13 -306 10 -98 -142 99 -239 -35 37
4351 37 -132 -226 113 -72 -48 -45 -62 153 -127 -9 -22 -54 64 59 43 -152 114 243 82 -38 21 -65 -163 118 11
4376 11 67 50 6 54 -119 150 -181 -60 324 178 -168 42 -58 -104 104 156 -21 -56 74 85 -91 186 -116
4399 -116 43 -61 10 25 136 263 -66 141 -27 -41 142 29 87 -95 -16 109 -19 -130 -186 -11 -35 -132 58
4422 58 -181 -67 160 9 77 -258 5 -40 171 80 266 98 -97 29 -65 -30 284 30 -74 -103 107 14 -189
4445 -189 -67 11 -3 -98 42 -174 -46 265 -126 -68 -126 -9 225 -218 -31 -57 -167 -15 160 127 29 67 -186
4468 -186 83 -148 147 20 36 -48 46 22 25 139 102 -104 118 -64 64 68 -45 69 150 49 52 174 -219 10
4492 10 5 131 -42 182 -64 -72 208 -62 143 325 149 306 -39 -138 -172 -198 -232 43 -17 60 40 -90 -126 -277
4516 -277 -116 -17 -229 82 85 -2 40 -72 91 218 27 154 -88 71 -88 255 60 -319 168 129 20 19 -161
4539 -161 79 -95 -63 -75 99 -305 -110 -8 -213 21 30 9 -133 180 186 -9 59 -210 32 52 -253 72 15
4562 15 114 -82 33 240 -165 -261 14 -194 -106 -44 -142 95 -139 -191 -159 139 163 81 65 11 89 -88 -57 -13 121
4587 121 63 179 234 85 168 -146 -12 -156 -67 -49 89 -49 -115 -96 22 -224 116 -294 -161 -237 52 10 179
4610 179 -70 -95 54 116 -89 122 -43 -14 68 43 280 265 232 -143 -75 45 55 60 90 90 -12 -202 -42 -112 -28
4635 -28 -46 -144 -111 -153 74 16 -255 -105 -13 -77 -127 -181 -31 -114 79 -76 -199 120 -173 99 26 182 109 -104
4659 -104 40 139 75 42 -142 109 12 4 -310 71 23 -80 102 -68 5 -152 47 109 -29 29 -101 284 59
4682 59 106 163 -107 132 -228 113 231 267 -166 155 -16 258 -195 -16 -5 -187 -45 -132 -135 -36 44 34 73 170
4706 170 68 73 19 -89 -164 46 139 -3 62 33 -180 105 -165 79 -73 21 7 -13 14 -140 193 -110 59 -167
4730 -167 -164 -96 80 133 120 28 -52 146 70 -188 -2 196 58 -43 18 -17 -88 112 -160 291 -15 16 16 292 28
4755 28 75 48 95 108 -59 25 110 -29 -129 -10 117 269 -46 5 232 -262 205 31 45 -221 92 111 -283
4778 -283 -199 329 169 -75 -18 43 44 -58 -125 69 92 -88 -125 -46 -66 -198 314 153 197 141 25 -97 56 -66
4802 -66 192 -9 -117 67 103 54 -84 -148 -50 -248 290 123 -173 -42 81 -176 -27 -191 -140 100 130 -18
4824 -18 17 -3 -177 -127 -132 90 25 -140 -39 63 235 -64 262 -167 195 100 38 63 -107 -51 112 -51 91 -45
4848 -45 -165 144 -31 -3 -59 -53 -77 -142 -19 -370 63 165 80 -42 -122 -58 137 75 83 64 17 67 -137 203 58
4873 58 -103 43 -107 11 37 -163 9 -45 48 147 -63 -201 99 -6 -82 39 19 -233 17 -46 -120 17 192
4896 192 -45 77 -91 -78 -110 138 -159 196 -223 10 -6 47 -8 -83 -3 -219 109 -138 64 74 41 -82 57
4919 57 -177 -34 -282 124 44 204 -69 243 87 20 -112 145 119 60 89 68 -146 133 169 -16 -100 -287 -102
4942 -102 43 -173 -75 10 196 42 -130 121 -148 57 57 140 112 44 124 -112 142 -182 -174 42 75 181 -15 195
4966 195 1 139 -97 -32 69 153 80 -4 -16 95 -324 -138 62 2 161 -24 92 -238 125 270 -6 242
4988 242 442 -118 67 -69 110 93 1 -126 175 177 0 85 -104 111 -55 -6 -39 54 -88 -82 -280 -2 -95 97
5012 97 27 9 66 93 56 95 -30 -139 31 -248 138 -149 55 -156 5 101 -110 -214 -22 -38 -50 -118 94 146
5036 146 93 -163 123 104 91 -10 -23 -63 -316 -90 189 -74 46 131 -10 74 118 -92 -11 31 121 397 308 5
5060 5 -28 38 357 -185 -132 5 50 -300 55 -46 110 -293 -54 -24 -32 -28 61 3 -359 -69 -21 189 -158 161 44
5085 44 -101 5 -119 14 -47 -98 84 9 19 75 72 71 -204 21 49 137 22 -277 217 84 4 238 94 48 -146
5110 -146 -106 -104 115 -88 27 -97 17 -135 -52 96 27 147 -34 -23 13 80 -46 -74 -211 245 51 -12 -92 41
5134 41 -72 136 -155 -127 -94 -132 -29 -67 -38 146 36 -18 -50 -34 -29 -140 17 295 247 197 49 7 -64 -92 -157 -128
5160 -128 36 -19 -156 -268 234 -124 -344 -70 125 40 433 199 -78 -268 -47 -3 105 103 -154 -97 12 -53
5182 -53 -156 96 150 -139 -65 64 -220 -58 -21 34 133 -89 70 -245 -187 46 -14 -70 -226 20 134 19 204
5205 204 92 -99 -143 108 183 -75 21 -84 246 83 39 -8 -4 23 -58 -42 22 102 268 68 37 -57 -75 37 -182
5230 -182 101 -210 -142 104 7 -223 123 96 158 64 108 -42 -88 -76 97 -170 62 248 -169 98 -3 159 -158
5253 -158 -26 14 -70 -136 -163 -67 -34 -116 4 -256 -23 113 40 -81 -65 63 -68 64 -22 11 -15 99 112 -48
5277 -48 -190 -133 153 11 124 17 -9 83 -13 -70 -236 76 -127 -129 -147 92 -131 -126 55 -6 52 44 67 123 -238 77
5303 77 37 80 119 8 -27 -43 4 -70 -100 -11 56 161 -177 129 124 -98 -137 71 -24 -132 -68 -170 -58 -119 97 91
5329 91 122 -82 -195 -56 99 12 -63 -64 -42 15 17 186 -51 94 -80 89 206 124 51 133 -65 -171 31 3 -12
5354 -12 -19 -130 -23 251 -58 -34 109 -54 -179 -66 178 136 -8 -25 180 130 310 -81 195 -21 -8 35 -10
5377 -10 4 -81 -233 24 -4 58 278 -105 -138 -115 212 -87 329 74 -12 -11 270 -203 18 33 -202 77 -136 195
5401 195 44 3 161 -87 -89 184 66 -119 175 -274 -86 19 -108 126 125 38 21 205 -151 42 150 -90
5423 -90 -84 101 3 -87 129 70 101 -7 380 113 36 23 -195 -44 200 139 -142 -36 -201 -333 -197 -179 7 -20
5447 -20 -165 -64 3 -336 40 12 -52 242 297 38 218 107 -95 19 17 -101 -195 32 -118 -82 30 -84 -308
5470 -308 -53 -165 -137 217 -148 -7 130 -99 -145 174 54 -76 -78 18 -27 70 42 40 -14 -57 106 -22 -166 56
5494 56 106 79 66 36 -18 -37 284 183 -6 -191 -29 -98 72 -101 -77 -245 -118 -95 14 6 2 -128 30 244 67
5519 67 71 190 43 108 166 -116 258 -76 99 -24 -156 -102 -149 -85 173 360 11 -331 -59 -1 -82 -54 -50 -108 147
5544 147 -128 258 -73 -44 -120 117 102 145 -191 124 245 -82 210 -39 -94 28 -143 -255 209 33 -205 -5
5566 -5 62 -87 128 -95 -38 21 -339 -40 -182 -73 -91 -106 3 -144 63 -77 -106 -37 -167 119 -78 -84 -107 -147
5590 -147 218 3 186 153 -39 50 -181 62 84 -189 116 -97 15 115 -180 13 -61 -8 -70 189 106 -35
5612 -35 -50 74 -64 178 -83 -182 -95 -4 -31 -9 123 -98 110 -160 128 159 169 -143 -7 112 59 -35 -72 130
5636 130 -21 -53 -105 -35 179 126 -211 95 180 -54 51 -67 -282 204 18 -37 -118 27 -154 -64 173 77 -39
5659 -39 -110 -225 -183 -118 113 142 -18 -167 213 -201 -223 268 23 -163 -238 -13 114 -52 -135 219 118 5 6
5682 6 -12 -273 -151 -151 39 -83 -81 111 111 -42 46 47 234 -334 -114 218 -12 -12 313 98 364 77 -108 163 -107
5707 -107 145 146 152 46 -36 -142 74 129 239 -2 348 -128 19 -200 -166 -203 1 61 -87 -122 2 49 -65 -127
5731 -127 56 -34 -68 209 -85 187 -74 -139 -83 140 -8 146 -19 -20 -143 64 -60 80 239 -48 -72 -199
5753 -199 -106 -79 149 -110 44 -129 -138 18 39 -300 -76 40 -34 122 309 200 -27 232 -64 26 -104 -21 46
5776 46 -238 10 63 -193 -228 62 -102 -67 133 -55 -8 -30 136 172 -120 408 40 -4 -34 101 186 -136 -31
5799 -31 209 -178 -173 16 -66 253 -26 253 -222 77 142 155 -31 -21 -226 -37 115 61 -16 52 34 -107 78 150
5823 150 164 -201 -94 94 -38 21 145 143 -86 -79 -245 -262 58 -14 -33 42 192 70 -148 130 -16 -214 69
5846 69 -125 -138 64 -27 -40 -289 -101 41 -60 37 22 -30 -178 -121 53 -7 -117 99 -93 8 -136 73 -21
5869 -21 -75 -163 191 69 50 -269 56 95 -26 48 -41 -169 23 -1 40 -108 -18 61 218 -83 143 -30 -78 335
5893 335 44 10 90 -190 70 46 -182 122 59 76 113 41 1 94 144 -72 88 1 1 -137 56 50 -113 -49 152
5918 152 -162 125 172 37 -87 11 37 54 246 -50 15 66 210 143 164 90 72 174 28 -76 132 -201 -42
5941 -42 139 -179 10 18 -65 -41 70 82 22 10 59 185 70 -44 246 82 -85 17 10 52 -35 41 -191 239 10
5966 10 -54 -28 -123 128 -208 -104 -88 85 51 -24 -149 -17 -94 -178 -389 146 -2 -85 93 -17 13 -158 90 112
5990 112 133 9 123 162 25 -146 -86 16 -24 28 4 55 -277 25 70 33 142 207 -224 -140 -16 -186 -96 86
6014 86 84 -94 99 -45 84 -81 -77 90 -98 -154 209 125 -85 -198 -129 1 75 -63 74 -169 -57 64 -157
6037 -157 -67 -151 -62 29 38 -110 229 159 -53 -96 -61 104 -25 -53 207 -3 167 172 -101 210 7 96 149 -58 20
6062 20 -14 -264 128 -125 -27 54 153 -91 95 -247 59 160 -137 -77 -191 -1 45 -155 -23 -99 -181 104 -73
6085 -73 81 16 61 68 265 173 -80 -30 1 -69 185 -165 -85 -34 4 39 -490 -195 -69 -109 -9 168 -143 134 -8
6110 -8 203 101 26 205 206 210 -118 42 26 52 126 219 -67 -189 43 -25 42 -95 18 -45 -4 -7 31 -30 111 2
6136 2 67 -79 97 -154 65 -45 -5 262 54 -39 -253 111 -44 209 110 67 318 -96 -117 -56 26 5 -153 -129
6160 -129 38 -111 193 208 -78 -2 189 -75 37 109 -14 -55 -14 -30 -143 -251 65 -51 -100 105 -240 93
6182 93 -80 -8 -80 -80 132 88 -62 232 -6 -142 -3 36 25 -244 168 -42 57 56 -211 -57 -125 -36 116 135 67
6207 67 -93 43 -36 -105 -287 -103 169 96 -174 -10 -129 -204 -6 -18 -84 235 -56 2 -106 -315 103 -127 -58
6230 -58 -54 223 20 -27 93 -44 -46 43 -36 -96 81 252 51 -95 -53 24 139 39 136 -154 96 37 238 16
6254 16 2 55 200 -38 11 40 -55 57 -277 -40 38 -57 160 62 -37 -89 190 167 61 65 50 147 -32 281 113
6279 113 13 86 -66 74 -21 117 -53 -34 -74 -89 43 -141 -318 192 112 -19 -41 62 -118 -105 229 -21 93
6302 93 107 6 108 92 11 -205 25 207 200 -159 -63 130 -94 -86 -265 239 80 133 96 -147 -49 -322 -84 80
6326 80 -10 122 -33 -106 162 52 -14 195 159 162 -135 -14 133 -100 -50 -1 -61 -53 -15 76 85 41 481 -12 111 30
6352 30 -65 -98 -179 66 -179 -19 -83 -29 -17 261 91 29 236 -220 268 -55 14 -55 38 -16 25 152 -6 -155
6376 -155 183 -111 -44 41 70 122 208 257 202 -54 117 -261 122 -54 -302 39 -153 4 115 -21 -125 -202 -167
6399 -167 -41 94 -69 -80 -87 114 69 70 35 -26 -14 156 -93 104 10 -73 -50 -135 117 -83 -159 81 -212 -115 -49
6424 -49 75 -136 -68 -15 -64 175 -6 36 107 2 57 54 -49 80 47 29 -262 71 78 -285 -38 71 -31 -149
6448 -149 -131 144 -175 132 -220 159 -28 -35 -99 -49 322 184 81 -13 162 -131 -91 186 -170 -32 -79 156 -91
6471 -91 121 154 -82 -7 -92 44 178 92 216 -113 -297 298 142 198 -152 25 70 -220 -229 169 -33 -138 67
6494 67 -23 215 32 58 -36 38 330 -83 163 167 42 16 -19 -51 97 -36 -128 38 248 85 125 190 -100 -15 45
6519 45 182 119 -225 -96 -19 -16 73 97 -326 58 -163 -27 -54 -153 172 -145 -105 148 -47 -32 69 4 202 -185
6543 -185 -33 -27 69 -278 -198 -21 -169 32 44 -6 176 96 -95 -66 177 -42 29 111 -138 -15 -283 153 88 6
6567 6 -122 -7 -5 -336 7 17 74 80 -48 -206 38 -76 142 -168 3 -279 -55 238 -148 215 31 -77 -25
6590 -25 43 18 -71 -103 -8 -210 -129 -160 -145 -107 -105 131 -30 38 51 91 -156 -55 110 109 -52 159 112 -268 39 -194
6616 -194 -98 15 37 95 -306 43 102 -33 94 89 -182 -237 170 -165 31 92 234 -66 -176 -291 -243 -4 40
6639 40 79 73 -43 -320 66 108 27 -96 81 10 99 -103 32 42 -148 70 -59 214 29 13 94 70 19 -54 -47
6664 -47 -102 -181 245 -127 -66 22 94 89 -45 60 43 112 -35 71 115 14 81 -120 96 111 -163 -54 -134 98 -94
6689 -94 10 306 -181 -65 41 217 -98 113 174 73 70 61 58 -65 24 130 8 -239 -124 -235 -31 71 218
6712 218 -195 -53 -181 -67 21 5 -22 -42 -127 13 -50 -161 -136 3 150 -149 124 284 -88 -22 146 -79 69
6735 69 -16 -11 72 -108 -5 -116 -223 -47 123 158 -147 -139 25 -32 -107 -105 -42 8 -250 18 125 51 71 -16 84 47
6761 47 102 49 -46 183 104 151 -216 -35 -74 56 -71 134 -307 20 146 -173 -90 -62 45 -210 9 -119 -13
6784 -13 -72 14 -187 35 -146 41 88 135 -116 -202 -119 32 94 -8 25 -219 77 -50 30 -295 42 332 -79
6807 -79 -18 254 -201 6 -1 35 61 -248 29 -167 88 44 -18 119 -77 182 -100 65 18 -23 22 -217 75 87
6831 87 167 337 -178 -61 265 100 -132 47 -83 83 -116 -158 36 -61 -184 -188 -218 -113 -37 35 -17 18 -12 135
6855 135 -216 -102 276 38 107 262 -151 88 100 -192 -24 -103 -99 -84 234 -38 -82 -4 43 53 186 21 271
6878 271 75 91 -136 59 -173 -206 151 -2 132 -37 150 71 99 -68 32 -162 -75 1 -144 -134 -46 20 -303
6901 -303 149 -37 29 -42 157 -23 -67 -20 207 -3 -240 -75 104 -40 -52 32 -118 181 17 240 137 102
6923 102 -34 -17 66 -39 14 12 186 79 -112 -82 -40 -127 -154 186 31 176 89 -128 208 -79 144 -245 -133
6946 -133 244 -215 -5 -48 -57 -75 145 -37 -147 -46 155 -107 124 -127 52 -38 -29 -241 95 -31 81 -56
6968 -56 -62 49 -169 6 -205 -369 -162 47 113 104 96 -14 129 -44 -91 -111 -31 81 -26 -87 48 -11 37 -82 73
6993 73 -11 -19 162 221 -116 -172 85 284 -113 -101 64 98 -8 -61 38 -137 -35 -26 148 43 -42 52 -45 -29 206
7018 206 -59 198 11 -16 19 -47 -114 -76 148 166 -75 268 112 -183 116 103 -159 49 239 6 -39 103 -143
7041 -143 66 255 195 231 -78 102 41 75 88 -21 -219 68 -78 6 12 -211 -25 -151 3 -89 74 147 112 -254
7065 -254 75 41 132 217 -118 50 22 18 119 30 87 -79 83 -218 -28 81 15 47 -138 -78 -123 71 -4 43 144
7090 144 -27 -1 -164 64 -130 -21 32 77 191 -46 -16 -63 140 25 207 24 302 126 84 209 101 -86
7112 -86 123 -40 -18 -43 -66 -115 -49 -90 -72 -81 125 53 -142 -162 186 -71 -81 -194 -132 73 106 -390 16 111 -119
7137 -119 -16 171 88 17 44 209 107 -71 244 -37 144 -148 -16 -1 -6 -165 -51 -67 224 -20 77 126 -24
7160 -24 -180 32 -123 72 -33 -3 181 9 -42 -115 9 76 -82 67 -99 13 12 207 87 -11 49 -71 294
7183 294 -131 -175 -31 -92 -174 164 34 55 241 17 -85 -11 100 -235 100 21 22 128 54 196 -58 -124 36
7206 36 -126 122 -99 -201 -41 -49 -48 -77 -7 -106 208 200 -114 69 143 -71 11 -184 131 4 -330 59 -141 -95
7230 -95 -261 -77 -64 -67 132 36 140 -67 -8 -138 -95 -99 -107 127 -15 -147 139 111 108 -140 4 -69 -85 -26 199 -44
7256 -44 -83 -157 24 -20 58 5 -88 -143 -82 144 81 40 -44 -225 -9 -61 -92 72 -22 199 -316 -56 135 -49 49
7281 49 -117 148 -36 -95 174 89 -55 -41 76 -117 -346 -171 -36 202 219 -203 166 -28 22 160 155 -203 26
7304 26 36 189 18 26 -245 369 28 75 24 -182 130 183 15 -80 -331 -18 -70 -72 -150 -49 -118 -125 -47 -8 148 172
7330 172 -146 85 -204 26 326 240 -200 -56 -133 132 36 -148 120 -84 -213 -14 210 -8 179 -36 78
7351 78 114 -33 48 197 -94 10 -157 57 -106 8 175 141 45 65 -37 -44 -162 23 -80 -84 -269 -27 50 -151
7375 -151 -4 145 -73 -22 39 -145 -395 -9 77 -37 156 60 203 248 102 -127 -90 105 70 -3 39 -38 29 -251
7399 -251 69 97 -171 -166 307 154 -140 108 -85 130 39 -122 19 -173 22 75 -358 -81 4 42 234 -140
7421 -140 -137 -175 -170 56 24 -264 -113 -124 243 250 -32 -104 -121 21 -121 156 -207 -238 258 21 61 200 23 193
7445 193 -78 -35 216 256 -32 -86 -5 181 317 -18 37 132 -85 -155 97 -39 57 215 -23 14 -79 -130 -18 29
7469 29 -85 -129 54 -14 137 -43 -89 114 -162 -167 -222 -243 -53 -237 -115 -154 -26 -36 -126 28 -39 -139 21 51
7493 51 -247 -215 -143 121 91 54 94 -25 214 75 8 182 36 105 8 -104 86 244 115 -6 13 82 93 -148
7517 -148 -162 -86 -153 17 74 66 167 51 61 49 -30 49 -148 -222 104 201 56 -52 -16 28 62 145 104 -3 -4 0 88
7544 88 -259 -285 -45 -144 -110 21 125 266 -88 72 -62 270 -42 -25 -178 32 42 311 -140 -82 263 136
7566 136 144 79 248 16 41 206 186 -48 83 -101 26 -219 -79 95 -110 -123 -286 -47 67 -148 -89 95
7588 95 244 -29 -53 64 -197 58 93 -143 12 -67 -115 1 -29 26 221 -206 -52 157 -22 -220 89 -57
7610 -57 138 -164 -222 80 -89 40 -55 -2 -47 -118 -41 -10 11 259 -50 -33 97 227 83 -22 -234 -9 -106 -11
7634 -11 73 56 77 -236 185 97 -17 107 -15 -101 170 -10 126 230 -12 -84 -98 23 141 101 241 113 -47
7657 -47 -148 -169 2 -111 271 31 51 300 59 -151 40 -7 -64 -83 -181 -12 35 -9 -82 -43 161 46 17 191
7681 191 -58 -11 0 -31 65 -1 39 -28 87 -96 133 46 132 -45 248 -223 203 -8 -29 -118 -54 -348 254 -20
7705 -20 34 -34 -151 59 275 -53 -129 -58 108 -17 -109 128 -4 -37 146 -65 -178 -30 -162 -53 -149 -75 65
7728 65 -156 99 0 -103 93 47 -95 -147 141 27 -58 -79 -374 129 -139 31 -8 113 -39 -55 -143 181 -73
7751 -73 136 -18 -74 82 42 105 -11 -164 182 144 192 160 199 -59 -129 23 -195 123 -11 -35 179 -46 -91 101
7775 101 -232 41 -55 -60 251 76 -139 -44 175 176 39 36 -83 113 73 -49 -43 170 141 14 -55 39 119 -175 -57
7800 -57 -39 -33 60 -52 -224 -67 -125 183 -331 -116 -201 28 221 -3 -499 294 322 -34 -178 265 -135 18 -44
7823 -44 86 306 -85 113 -271 -42 -194 -69 73 30 -63 155 -137 39 -163 -104 -223 150 25 -1 -25 38
7845 38 208 37 -94 123 15 11 103 -149 -141 160 109 198 123 -58 -19 130 -56 -102 62 -201 -26 82 -230 -78
7869 -78 91 184 -280 5 -10 -83 -250 200 -73 35 97 125 -154 74 -52 36 -48 -19 173 -77 86 43 -174
7892 -174 -91 103 -101 77 198 -149 194 -58 -196 25 69 42 -179 239 286 -89 -112 65 -22 143 28 404
7914 404 -74 183 -139 24 44 69 340 94 135 -94 -52 -194 90 182 29 -167 311 -166 14 135 42 1
7936 1 64 300 17 100 -44 -29 64 121 67 -160 -90 -159 13 -15 68 94 76 23 -80 258 93 232 113 -192 -2
7961 -2 -68 4 113 -312 65 -320 -68 90 91 66 60 24 -233 -24 -61 -133 216 -129 28 49 -132 -51 -198 159 142
7986 142 52 -75 -74 -351 145 190 43 14 -95 -86 -13 -2 -195 -46 287 226 317 238 194 46 -27 -57 40 -23 217 202
8012 202 -177 -27 76 -137 189 7 -30 -323 -85 39 -172 -36 -70 -106 271 185 86 -77 -70 -18 18 19 30 110
8036 110 29 -49 11 134 112 -56 139 163 35 -44 -69 -35 -63 -67 105 122 -165 -10 -12 143 42 162 38 67 118
8061 118 125 -61 189 243 95 153 -65 -2 -16 -106 74 111 64 -25 -129 -192 120 -109 -16 -39 -25 -296 -61 93 139
8086 139 -258 222 116 76 -88 98 162 -90 -84 198 53 28 -66 48 -15 -128 -12 -225 184 -172 -49 -41 -140
8109 -140 132 -88 172 202 69 -9 -15 -49 32 -38 -201 84 -142 -147 -130 57 107 -88 24 55 -77 -19 -21 -58 -100 316
8135 316 134 -29 151 243 -164 3 164 -268 -185 41 -293 -325 -87 -22 64 60 -130 -63 -11 38 172 -121 189
8158 189 103 33 375 -76 -109 -206 4 159 85 160 -169 -99 93 -5 -21 -104 -137 72 -17 -75 -42 9 49 98 63 12
8184 12 -26 51 -147 250 0 97 86
8191H6
##END NTUPLES=NMR FID
##END=
