##TITLE=1H_Pr 4-F-0-2
 CDCl3
 8 sc, 
 7.04.2022
##JCAMPDX= 6.0         $$ Bruker NMR JCAMP-DX V2.0
##DATA TYPE= NMR FID
##DATA CLASS= NTUPLES
##ORIGIN= UXNMR, Bruker Analytische Messtechnik GmbH
##OWNER= root
$$ XWIN-NMR		Version 3.5
$$ Thu Apr  7 16:11:18 2022 Russian Standard Time (UT+4h)  she@DPX200
##.OBSERVE FREQUENCY= 200.13135
##.OBSERVE NUCLEUS= ^1H
##.DELAY= (6, 6)
##.ACQUISITION MODE= SIMULTANEOUS
##.ACQUISITION SCHEME= undefined
##.AVERAGES= 8
##.DIGITISER RES= 18
##SPECTROMETER/DATA SYSTEM= spect
##.PULSE SEQUENCE= zg30
##.SOLVENT NAME= CDCl3
##.SHIFT REFERENCE= (INTERNAL, CDCl3, 0, 15.7039)
##AUDIT TRAIL= $$ (NUMBER, WHEN, WHO, WHERE, WHAT)
$$ ##TITLE= Audit trail, XWIN-NMR		Version 3.5
$$ ##JCAMPDX= 5.01
$$ ##ORIGIN= Bruker BioSpin GmbH
$$ ##OWNER= she
$$ F:/spectra/data/she/nmr/H-F/1/audita.txt
$$ ##AUDIT TRAIL=  $$ (NUMBER, WHEN, WHO, WHERE, WHAT)
(   1,<2022-04-07 16:10:03.84 +0400>,<she>,<DPX200>,
      <created by zg, POWCHK disabled, PULCHK disabled
       configuration hash MD5:
       00 E9 B6 7A A2 85 ED C7 34 08 36 98 17 FE 4E 26
       data hash MD5: 16K
       DD 05 9F 49 0F 3D EB CE 6E 0B 8D 56 56 BD 19 C8>)
$$ ##END=
$$ 
$$ hash MD5
$$ 9E 2F A5 66 D9 C1 E3 C2 88 43 49 C7 A9 D1 AA A4
##$RELAX= 
##$RELAX= 
##$RELAX= 
##$RELAX= 
##$RELAX= 
##$RELAX= 
$$ Bruker specific parameters
$$ --------------------------
##$DU= <F:/spectra>
##$EXPNO= 1
##$NAME= <H-F>
##$PROCNO= 1
##$TYPE= <nmr>
##$USER= <she>
##$AMP= (0..31)
100 100 100 100 100 100 100 100 100 100 100 100 100 100 100 100 100 100 
100 100 100 100 100 100 100 100 100 100 100 100 100 100 
##$AQSEQ= 0
##$AQ_mod= 1
##$AUNM= <au_zg>
##$AUTOPOS= <>
##$BF1= 200.13
##$BF2= 200.13
##$BF3= 200.13
##$BF4= 200.13
##$BF5= 200.13
##$BF6= 200.13
##$BF7= 200.13
##$BF8= 200.13
##$BYTORDA= 1
##$CFDGTYP= 0
##$CFRGTYP= 5
##$CHEMSTR= <none>
##$CNST= (0..31)
1 1 145 1 1 1 1 1 1 1 1 1 1 1 1 1 1 1 1 1 1 1 1 1 1 1 1 1 1 1 1 1 
##$CPDPRG= <>
##$CPDPRG1= <>
##$CPDPRG2= <>
##$CPDPRG3= <>
##$CPDPRG4= <mlev>
##$CPDPRG5= <mlev>
##$CPDPRG6= <mlev>
##$CPDPRG7= <mlev>
##$CPDPRG8= <mlev>
##$CPDPRGB= <>
##$CPDPRGT= <>
##$D= (0..31)
0 1.2 0 0 0 0 0 0 0 0.06 0 0.03 0 0 0 0 0.0002 0 0 0 0 0 0 0 0 0 0 0 0 
0 0 0 
##$DATE= 1649333403
##$DBL= (0..7)
120 120 120 120 120 120 120 120 
##$DBP= (0..7)
150 150 150 150 150 150 150 150 
##$DBP07= 0
##$DBPNAM0= <>
##$DBPNAM1= <>
##$DBPNAM2= <>
##$DBPNAM3= <>
##$DBPNAM4= <>
##$DBPNAM5= <>
##$DBPNAM6= <>
##$DBPNAM7= <>
##$DBPOAL= (0..7)
0.5 0.5 0.5 0.5 0.5 0.5 0.5 0.5 
##$DBPOFFS= (0..7)
0 0 0 0 0 0 0 0 
##$DE= 6
##$DECBNUC= <off>
##$DECIM= 32
##$DECNUC= <off>
##$DECSTAT= 4
##$DIGMOD= 1
##$DIGTYP= 9
##$DL= (0..7)
0 120 120 120 120 120 120 120 
##$DP= (0..7)
150 150 150 150 150 150 150 150 
##$DP07= 0
##$DPNAME0= <>
##$DPNAME1= <>
##$DPNAME2= <>
##$DPNAME3= <>
##$DPNAME4= <>
##$DPNAME5= <>
##$DPNAME6= <>
##$DPNAME7= <>
##$DPOAL= (0..7)
0.5 0.5 0.5 0.5 0.5 0.5 0.5 0.5 
##$DPOFFS= (0..7)
0 0 0 0 0 0 0 0 
##$DQDMODE= 0
##$DR= 18
##$DS= 0
##$DSLIST= <SSSSSSSSSSSSSSS>
$$ [...]
##$SUBNAM2= <"">
##$SUBNAM3= <"">
##$SUBNAM4= <"">
##$SUBNAM5= <"">
##$SUBNAM6= <"">
##$SUBNAM7= <"">
##$SUBNAM8= <"">
##$SUBNAM9= <"">
##$SW= 18.05172834244
##$SWIBOX= (0..15)
0 0 2 0 0 0 0 0 0 0 0 0 0 0 0 0 
##$SW_h= 3612.71676300578
##$TD= 16384
##$TD0= 1
##$TE= 0
##$TE2= 300
##$TE3= 300
##$TEG= 300
##$TL= (0..7)
0 120 120 120 120 120 120 120 
##$TP= (0..7)
150 150 150 150 150 150 150 150 
##$TP07= 0
##$TPNAME0= <>
##$TPNAME1= <>
##$TPNAME2= <>
##$TPNAME3= <>
##$TPNAME4= <>
##$TPNAME5= <>
##$TPNAME6= <>
##$TPNAME7= <>
##$TPOAL= (0..7)
0.5 0.5 0.5 0.5 0.5 0.5 0.5 0.5 
##$TPOFFS= (0..7)
0 0 0 0 0 0 0 0 
##$TUNHIN= 0
##$TUNHOUT= 0
##$TUNXOUT= 0
##$USERA1= <user>
##$USERA2= <user>
##$USERA3= <user>
##$USERA4= <user>
##$USERA5= <user>
##$V9= 5
##$VALIST= <valist>
##$VCLIST= <CCCCCCCCCCCCCCC>
##$VD= 0
##$VDLIST= <DDDDDDDDDDDDDDD>
##$VPLIST= <PPPPPPPPPPPPPPP>
##$VTLIST= <TTTTTTTTTTTTTTT>
##$WBST= 1024
##$WBSW= 4
##$XGAIN= (0..3)
0 0 0 0 
##$XL= 0
##$YL= 0
##$YMAX_a= 345353
##$YMIN_a= -449160
##$ZGOPTNS= <>
##$ZL1= 120
##$ZL2= 120
##$ZL3= 120
##$ZL4= 120
##$ABSF1= 10
##$ABSF2= 0
##$ABSG= 5
##$ABSL= 3
##$ALPHA= 0
##$AQORDER= 0
##$ASSFAC= 0
##$ASSFACI= 0
##$ASSFACX= 0
##$ASSWID= 0
##$AUNMP= <proc_1d>
##$AZFE= 0.1
##$AZFW= 0.1
##$BCFW= 1
##$BC_mod= 2
##$BYTORDP= 1
##$COROFFS= 0
##$CY= 11.3945322036743
##$DATMOD= 1
##$DC= 2
##$DFILT= <>
##$DTYPP= 0
##$F1P= 2.36226072786647
##$F2P= -0.459571619588291
##$FCOR= 0.5
##$FTSIZE= 0
##$FT_mod= 4
##$GAMMA= 1
##$GB= 0.15
##$INTBC= 1
##$INTSCL= 1
##$ISEN= 128
##$LB= 0.24
##$LEV0= 0
##$LPBIN= 0
##$MAXI= 10000
##$MC2= 0
##$MEAN= 0
##$ME_mod= 0
##$MI= 1.114404
##$NCOEF= 0
##$NC_proc= 0
##$NLEV= 6
##$NOISF1= 3.799351
##$NOISF2= 2.8
##$NSP= 1
##$NTH_PI= 0
##$NZP= 0
##$OFFSET= 15.70392
##$PC= 1
##$PHC0= -18390.75
##$PHC1= 12.00078
##$PH_mod= 1
##$PKNL= yes
##$PPARMOD= 0
##$PSCAL= 0
##$PSIGN= 0
##$REVERSE= no
##$SF= 200.130013532006
##$SI= 16384
##$SIGF1= 3
##$SIGF2= 2
##$SINO= 400
##$SIOLD= 16384
##$SREGLST= <1H.CDCl3>
##$SSB= 0
##$STSI= 0
##$STSR= 0
##$SW_p= 3612.71676300578
##$SYMM= 0
##$S_DEV= 0
##$TDeff= 0
##$TDoff= 0
##$TI= <>
##$TILT= no
##$TM1= 0
##$TM2= 0
##$TOPLEV= 0
##$USERP1= <user>
##$USERP2= <user>
##$USERP3= <user>
##$USERP4= <user>
##$USERP5= <user>
##$WDW= 1
##$XDIM= 8192
##$YMAX_p= 0
##$YMIN_p= 0
$$ End of Bruker specific parameters
$$ ---------------------------------
##NTUPLES= NMR FID
##VAR_NAME=  TIME,          FID/REAL,        FID/IMAG
##SYMBOL=    X,             R,               I
##VAR_TYPE=  INDEPENDENT,   DEPENDENT,       DEPENDENT
##VAR_FORM=  AFFN,          ASDF,            ASDF
##VAR_DIM=   8192,          8192,            8192
##UNITS=     SECONDS,       ARBITRARY UNITS, ARBITRARY UNITS
##FACTOR=    0.0002768,     1,               1
##FIRST=     0,             0,               0
##LAST=      2.2672688,     0,               0
##MIN=       0,             -449160,         0
##MAX=       2.2672688,     345353,          0
$$ Real data points
##PAGE= N=1
##DATA TABLE= (X++(R..R)), XYDATA
$$ plain form
0 0 0 0 0 0 0 0 0 0 0 0 -8 8 -8 16 -16 24 -24 32 -40 48 -56 72 -81 97 -113 136 -156 181 -209 240 -273 312
32 312 -355 400 -454 511 -573 644 -718 803 -894 994 -1101 1220 -1350 1490 -1646 1817 -2000
49 -2000 2202 -2426 2673 -2947 3252 -3593 3977 -4414 4915 -5498 6183 -7004 8012 -9277
63 -9277 10928 -13170 16417 -21559 30980 -53933 234704 127692 -252705 182570 345353
74 345353 102807 -47525 142616 177730 83845 -2568 -38081 -56753 52502 101086 -7934
85 -7934 -160952 -124588 27876 49885 -111426 -128867 29604 57671 -93141 -103160 27142
96 27142 63168 40575 66406 -9782 -92317 39783 157633 19422 -72051 53827 89942
107 89942 -54666 -88901 -3536 9545 -1997 118 -79231 -129605 -40440 15966 -68507 -122140
$$ packed form
0@%%%%%%%%%%qJ6j6K4l2M0m8N6p2Q8j04J28j53J78k10K49k92L37l90M49n13N85
32C12o67P55q54R65j084J217j362J521j697J888k095K321k570K840l136L463l817
49b000M202m628N099n620O199o845P570q391R329j0413J1681j3187J5016j7289
63i277K0205k4098K9587l7976N2539q4913K88637j07012l80397M35275J62783
74C45353k42546j50332J90141L5114r3885q6413l5513j8672J09255M8584j09020
85g934j53018L6364J52464K2009j61311j7441J58471K8067j50812j0019J30302
96B7142L6026k2593K5831p6188q2535J32100J17850j38211r1473J25878L6115
107H9942j44608l4235Q5365J3081j1542K115p9349n0374Q9165N6406q4473n3633
$$ plain form
119 -122140 -38917 24897 -48235 -121197 -47875 59927 15078 -85817 -21598 81192 7543
130 7543 -53220 61167 92672 -47018 -53636 98697 90901 -51867 -30598 78971 39856 -45972
142 -45972 -22799 26282 19070 -5472 -22325 -37336 -21949 13214 1104 -46536 -44941 9171
154 9171 28044 -27624 -58093 16668 63460 -15469 -64894 7782 52667 5610 -5441 33697
166 33697 10844 -24127 14978 33603 -2641 13393 51999 8943 -47499 -12469 35936 9455
178 9455 -12959 13056 7550 -26832 -19805 7534 4888 -6293 8819 13004 -24120 -34380 16537
191 16537 40290 -7429 -32912 18115 38130 -21690 -27149 49739 55813 -16370 -27275 21469
203 21469 26970 3478 12576 20922 3930 5695 6285 -21747 -13576 34587 30813 -26240 -38382 4772
$$ packed form
119a22140Q3223O3814p3132p2962P3322J07802m4849j00895O4219J02790p3649
130G543o0763J14387L1505j39690o618J52333p796j42768K1269J09569l9115q5828
142d5972K3173M9081p212k4542j6853j5011J5387L5163j2110m7640J595N4112
154I171J8873n5668l0469P4761M6792p8929m9425P2676M4885m7057j1051L9138
166C3697k2853l4971L9105J8625l6244J6034L8606m3056n6442L5030M8405k6481
178I455k2414K6015n506l4382P027K7339k646j1181J5112M185l7124j0260N0917
191A6537K3753m7719k5483N1027K0015n9820n459P6888O074p2183j0905M8744
203B1469N501k3492R098Q346j6992J765N90k8032Q171M8163l774n7053j2142M3154
$$ plain form
217 4772 11251 -26423 -24147 12793 12129 -23294 -32405 -3924 8195 -5621 -594 6978 -11181 -12460
231 -12460 17329 21271 -10365 -10266 22150 12024 -20210 -3135 24292 10993 -7257 -6837 -8862
244 -8862 -11335 3107 10646 -11870 -20869 965 1468 -23357 -22940 8601 20626 -7440 -23129 306
258 306 14488 2539 -1261 8929 10657 2834 5671 11022 3566 6946 17572 4051 -11301 986
272 986 15219 5365 -8371 -2951 -1776 -16726 -14712 2613 -669 -12316 -8083 468 -9606 -21629
286 -21629 -2122 18312 3313 -12491 -864 11743 2757 -4950 8832 18262 7449 1515 4228
299 4228 5110 8384 9838 3655 -4149 -3836 2951 -481 -7698 -1314 1932 -8737 -17018 -10060 1835
314 1835 -945 -7418 -2517 -3601 -11572 -5851 5353 5748 887 4115 7529 -1113 -2503 10358 12483
$$ packed form
217D772O479l7674K276L6940o64l5423r111K8481J2119j3816N027P572j8159j279
231a2460K9789L942l1636R9L2416j0126l2234J7075K7427j3299j8250M20k025
244h862k473J4442P539k2516q999K1834N03k4825M17L1541J2025k8066j5689K3435
258C06J4182j1949l800J0190J728p823K837N351p456L380J0626j3521j5352J2287
272I86J4233r854j3736N420J175j4950K014J7325l282j1647M233Q551j0074j2023
286b1629J9507K0434j4999j5804J1627J2607q986p707J3782R430j0813n934K713
299D228Q82L274J454o183p804L13O787l432p217O384L246j0669q281O958J1895
314A835k780o473M901j084p971N721J1204L95m861L228L414q642j390J2861K125
$$ plain form
329 12483 4219 3551 6207 3576 -805 1842 5674 -1387 -5890 -1535 -2630 -8733 -8458 -2134 -2281 -13270
345 -13270 -14572 -4090 -3931 -7933 -3550 693 -2966 -8422 -3562 4141 4848 6727 8435 4397 2650
360 2650 4520 6969 9443 9456 7984 3339 -1911 1420 5082 1266 -2576 -2845 -2401 -6071 -9227 -3487
376 -3487 -2270 -9096 -9443 -7018 -7444 -6000 -837 2331 -2178 -5165 1336 4646 3693 4907 7508 11031
392 11031 9646 3287 2617 7530 11526 11499 6903 2611 1841 4588 4406 -3854 -3542 7444 4099 -10213
408 -10213 -11896 -541 5856 1410 -5698 -6354 240 7970 3455 -3913 5559 15241 6644 -1300 2658
423 2658 11862 17662 13072 1590 -1691 9163 13731 -524 -6035 4145 5718 -1667 -8468 -14332
437 -14332 -10343 -459 -4178 -17875 -16740 -4210 -8455 -19417 -14670 -8659 -6311 -1356 -8681 -19585
$$ packed form
329A2483q264o68K656k631m381K647L832p061m503M355j095o103K75O324j47j0989
345a3270j302J0482J59m002M383M243l659n456M860P703P07J879J708m038j747
360B650J870K449K474J3j472m645n250L331L662l816l842k69M44l670l156N740
376c487J217o826l47K425m26J444N163L168m509k987O501L310r53J214K601L523
392A1031j385o359o70M913L996k7m596m292p70K747j82q260L12J0986l345j4312
408a0213j683J1355O397m446p108o56O594P730m515p368R472R682q597p944L958
423B658R204N800m590j1482l281J0854M568j4255n511J0180J573p385o801n864
437a4332L989R884l719j3697J135J2530m245j0962M747O011K348M955p325j0904
$$ plain form
451 -19585 -8296 7959 -11 -12893 -4533 4739 -1768 -3918 -1953 -4519 412 2635 -6754 -7457
465 -7457 -1502 -6292 -8007 1435 -3471 -17923 -6658 8860 -8313 -19171 1758 10067 -1616
478 -1616 -3545 -1062 -1134 8339 14959 5058 2455 17056 17925 5839 7063 10631 14781 27951 18484
493 18484 -9862 -1868 28186 18832 -10217 -1633 19609 9850 -6284 -7928 -5600 7064 12647
506 12647 -7297 -16057 1727 6320 -6159 -5463 1331 168 8735 11941 -15790 -20650 21742 30594
520 30594 -8735 -18287 8196 15145 -2040 -9701 -1153 11523 10368 -13706 -24886 65 8944
533 8944 -11582 -10329 1494 -11720 -18623 -1367 -2880 -19130 -2281 17391 -5679 -24047 -3889
546 -3889 9988 5311 4263 3399 2959 7195 3422 -2499 8478 17768 3306 -2126 10992 -18
$$ packed form
451a9585J1289J6255p970j2882Q360R272o507k150J965k566M931K223r389p03
465g457N955m790j715R442m906j4452J1265J5518j7173j0858K0929Q309j1683
478a616j929K483p2R473O620r901k603J4601Q69j2086J224L568M150J3170r467
493A8484k8346P994L0054r354k9049Q584K1242r759j6134j644K328J2664N583
506A2647j9944q760J7784M593j2479O96O794j163Q567L206k7731m860M2392Q852
520C0594l9329r552K6483O949j7185p661Q548J2676j155k4074j1180K4951Q879
533H944k0526J253J1823j3214o903J7256j513j6250J6849J9672k3070j8368K0158
546c889J3877m677j048q64m40M236l773n921J0977R290j4462n432J3118j1010
$$ plain form
560 -18 -16300 3608 18087 -3396 -15285 -3754 -3248 -11912 -7602 -2775 -5192 -1935 -5833 -18910
574 -18910 -9755 6736 1051 -2201 4407 -2642 -8218 8914 14042 -6706 -2892 24766 16314 -13532
588 -13532 -9343 12101 15023 4267 -5585 -3743 5866 583 -16827 -11551 11354 6052 -16325 -12083
602 -12083 -2186 -8013 -3800 4245 -4914 -8373 6267 6353 -9691 -4275 14643 12836 4634 4933 3003
617 3003 5918 13617 8455 2790 11960 13204 -2069 -5227 7740 6641 -2049 2590 700 -9531
631 -9531 -6322 -1894 -8085 -6878 332 -3687 -10122 -6256 -5239 -7395 1975 6253 -3779 -1440 6159
646 6159 -2524 -4089 12125 14327 -1124 -1335 10441 6463 -2233 1805 5315 5288 4285 -6449 -11075
661 -11075 574 4315 -7984 -10241 -100 -2885 -12854 -8978 -3488 -3386 838 -778 -10316 -5054
$$ packed form
560a8j6282J9908J4479k1483j1889J1531N06q664M310M827k417L257l898j3077
574a8910R155J6491n685l252O608p049n576J7132N128k0748L814K7658q452k9846
588a3532M189K1444K922j0756r852J842R609n283j7410N276K2905n302k2377M242
602a2083R897n827M213Q045r159l459J4640Q6j6044N416J8918j807q202K99j930
617C003K915P699n162n665R170J244j5273l158J2967j099q690M639j890j0231
631i531L209M428o191J207P210m019o435L866J017k156R370M278j0032K339P599
646F159q683j565J6214K202j5451k11J1776l978q696M038L510k7j003j0734m626
661a1075J1649L741j2299k257J0141k785r969L876N490J02M224j616r538N262
$$ plain form
675 -5054 6096 2876 -1936 4941 8153 1804 3212 6479 937 4461 12958 5544 -2102 2594 3591
690 3591 -1021 326 3035 -1608 -3361 -1315 -7010 -9094 58 275 -7094 -5406 -3757 -5578 -2315
705 -2315 1487 -2305 -3308 3607 3561 -3440 904 7307 3440 2849 5303 2728 2308 5230 3396 513
721 513 3280 4111 -2490 -2439 2064 -2212 -4701 830 -651 -6349 -5162 -1868 -2347 -3862 -2628 -2011 -1246
738 -1246 -425 -2792 -2219 4696 3843 -2117 884 5953 3654 511 2790 4547 2030 1468 2538 1506
754 1506 1925 1100 -2298 -950 888 -1402 -3035 -2112 -2679 -3874 -2939 -673 -2554 -3454 -752 -963 -1966
771 -1966 87 1580 1107 290 561 2656 3425 2311 1734 2002 3706 2315 50 1389 1425 -1387 -1571
788 -1571 -395 -1156 -3004 -4401 -3047 -3136 -4555 -3738 -3255 -3921 -4526 -4257 -1164 -129 -1974 -828 1166
$$ packed form
675e054J1150l220m812O877L212o349J408L267n542L524Q497p414p646M696R97
690C591m612J347K709m643j753K046n695k084R152K17p369J688J649j821L263
705b315L802l792j003O915m6p001M344O403l867n91K454k575m20K922j834k883
721E13K767Q31o601N1M503m276k489N531j481n698J187L294m79j515J234O17P65
738a246Q21k367N73O915q53n960L001N069k299l143K279J757k517n62J070j032
754A506M19q25l398J348J838k290j633R23n67j195R35K266j881r00K702k11j003
771a966K053J493m73q17K71K095P69j114n77K68J704j391k265J339L6k812j84
788a571J176p61j848j397J354q9j419Q17M83o66o05K69L093J035j845J146J994
$$ plain form
805 1166 1062 1168 2313 4840 3758 1534 2754 5221 4503 2691 2025 3334 3083 -122 406 2239 1346
822 1346 -1495 -2641 -954 -170 -2243 -2181 -1272 -531 11 -956 538 2275 997 1415 3415 4160 3938 3517
840 3517 4450 5115 3952 4901 5162 3087 1930 1378 2096 933 -1620 -1657 -1499 -4243 -5216 -3726 -3039 -5243
858 -5243 -7767 -5846 -3733 -4711 -4916 -4046 -2687 -2096 -2646 -1045 1027 1157 1753 1410 1516 2620 3159 3015
876 3015 1624 365 1797 2467 -105 -1184 -1624 -1529 -1241 -3345 -4719 -3962 -2644 -3085 -5754 -4236 -849
893 -849 -2297 -4344 -2337 -100 1220 935 703 1732 2080 3015 3732 4706 4460 2465 3672 5470 2445
910 2445 914 4456 3974 -746 -1237 1108 244 -2271 -784 -938 -4250 -2393 -374 -3599 -4930 -2081
926 -2081 -853 -1349 -2641 -2181 -625 1648 1553 -1416 1528 5003 1948 728 2905 2544 3500 6290 3160
$$ packed form
805A166j04J06J145K527j082k224J220K467p18j812o66J309k51l205N28J833q93
822A346k841j146J687P84k073O2R09P41N42r67J494J737j278M18K000P45k22m21
840C517R33O65j163R49K61k075j157n52P18j163k553l7J58k744r73J490O87k204
858e243k524J921K113r78k05Q70J359N91n50J601K072J30N96l43J06J104N39j44
876C015j391j259J432O70k572j079m40R5K88k104j374P57J318m41k669J518L387
893h49j448k047K007K237J320k85k32J029L48R35P17R74k46j995J207J798l025
910B445j531L542m82m720m91K345q64k515J487j54l312J857K019l225j331K849
926b081J228m96j292M60J556K273r5k969K944L475l055j220K177l61R56K790l130
$$ plain form
943 3160 -1507 1883 6489 1148 -2844 2540 2384 -2535 -1987 -1905 -3642 -1203 422 -4451 -5386 -613
959 -613 -617 -4716 -2642 426 -819 1007 1238 -3257 -2 5833 3965 1188 3450 4173 1084 3090 4527
976 4527 994 3230 6379 -1467 -4429 3378 1959 -4701 -972 2638 -4772 -7902 -1235 -1919 -7029
991 -7029 -2236 585 -4242 -4893 -3268 -2524 769 1773 -1331 -551 2813 77 -1822 5123 5989 -1464
1007 -1464 2733 7750 -2044 -5107 4996 6678 -1966 -2672 1542 -1783 -4688 -1182 -1513 -1647 1277
1022 1277 -3164 -8068 -2595 1277 -2034 -1343 1387 -1483 -2640 2879 1737 -2040 4085 8163 1849
1037 1849 -615 1411 1926 4571 5777 1302 -1016 3819 1436 -6423 -1370 7607 163 -7162 -1345
1052 -1345 -916 -6711 -3383 2338 -1758 -5315 -593 176 -4859 -3469 1405 3619 3031 -1013 -2543 1958
$$ packed form
943C160m667L390M606n341l992N384j56m919N48Q2j737K439J625m873r35M773
959f13mm099K074L068j245J826K31m495L255N835j868k777K262P23l089K006J437
976D527l533K236L149p846k962P807j419o660L729L610p410l130O667o84n110
991g029M793K821m827o51J625P44L293J004l104P80L364k736j899O945Q66p453
1007a464M197N017r794l063J0103J682q644p06M214l325k905L506l31j34K924
1022A277m441m904N473L872l311O91K730k870j157N519j142l777O125M078o314
1037A849k464K026N15K645J206m475k318M835k383p859N053Q977p444p325N817
1052a345M29n795L328N721m096l557M722P69n035J390M874K214n88m044j530M501
$$ plain form
1068 1958 3509 189 2349 7742 2672 -4768 982 5727 -922 -779 5707 907 -5509 -1849 755
1083 755 -2851 -1587 2093 -1697 -4206 -716 -3058 -4702 2268 3657 -2082 -1526 1266 -1528 -863 4946
1099 4946 4456 14 1914 2885 -1103 669 3179 1533 3099 3103 -3332 -4151 3091 863 -5617 453
1115 453 4483 -5972 -9028 478 -64 -4388 501 1609 -5407 -4521 2682 922 -1958 2591 3121 24
1131 24 1787 1218 -140 4983 5501 479 1956 5004 -1068 -3098 4284 4094 -2519 127 813 -6508
1147 -6508 -3746 3796 -1122 -5527 110 -512 -6766 -3196 2675 -1506 -2514 2713 605 -2914 1596
1162 1596 2845 986 3493 4245 1222 1334 2850 827 2081 5590 1087 -2341 2508 1721 -4392 -675
1178 -675 3532 -2267 -4610 123 -1204 -5862 -1455 1839 -2804 -2336 1082 -2192 -3472 1993 2865 -74
$$ packed form
1068A958J551l320K160N393n070p440N750M745o649J43O486m800o416L660K604
1083G55l606J264L680l790k509L490k342j644O970J389n739N56K792k794O65N809
1099D946m90m442J900R71l988J772K510j646J566Mo435q19P242k228o480O070
1115D53M030j0455l056R506n42m324M889J108p016Q86P203j760k880M549N30l097
1131B4J763n69j358N123N18n022J477L048o072k030P382j90o613K646O86p321
1147f508K762P542m918m405N637o22o254L570N871m181j008N227k108l519M510
1162A596J249j859K507P52l023J12J516k023J254L509m503l428M849p87o113L717
1178f75M207n799k343M733j327m658M407L294m643M68L418l274j280N465Q72k939
$$ plain form
1194 -74 623 1940 274 777 3116 2326 1513 2553 12 -307 2383 -392 -2552 918 538 -3757 -2956
1211 -2956 -226 -3851 -5862 -605 -353 -5815 -4248 -853 -3441 -4115 -183 780 -1912 -2202 364 839
1227 839 884 1504 1525 1958 2270 854 2006 3197 1692 1446 2451 1844 -120 722 1704 79 -1110 771
1245 771 198 -1976 -584 -145 -1763 -852 545 -383 -1633 288 1526 -197 -113 2503 2155 666 612
1262 612 2557 2927 1427 1901 3113 1625 319 867 2476 1360 -1225 -415 971 -820 -2064 -569
1278 -569 -732 -2291 -2810 -1379 -1058 -2784 -2096 -647 -1599 -1402 91 500 -202 -400 1256 2140 1140 1460
1296 1460 1750 1552 1886 1880 1598 1560 1521 1153 206 -208 756 -117 -1398 -1809 -970 -866 -2158 -2050 -947 -1440
1316 -1440 -2332 -1354 -454 -781 -1197 -162 733 -237 289 1894 1397 41 836 2003 1618 213 53 1385
$$ packed form
1194g4O97J317j666N03K339p90q13J040k541l19K690k775k160L470l80m295Q01
1211b956K730l625k011N257K52n462J567L395k588o74L932R63k692k90K566M75
1227H39M5O20K1M33L12j416J152J191j505k46J005o07j964Q42R82j625j189J881
1245G71n73k174J392M39j618R11J397r28j250J921J238j723Q4K616l48j489n4
1262F12J945L70j500M74J212j488j306N48J609j116k585Q10J386j791j244J495
1278e69j63j559n19J431L21j726O88J449r52J97J493M09p02j98J656Q84j000L20
1296A460K90j98L34ok82l8l9l68r47m14R64q73j281m11Q39J04j292J08J103m93
1316a440q92R78R00l27m16J035Q95r70N26J605m97j356P95J167l85j405j60J332
$$ plain form
1334 1385 244 -851 -476 -308 -966 -2123 -2301 -1521 -2039 -2741 -2113 -2429 -2149 -2097 -1561 -1297 -1358 -818 -282
1353 -282 -165 656 947 640 1254 1853 1481 1769 1566 2197 1352 1040 1473 1331 423 377 365 42 -460 -874 -385
1374 -385 -392 -1269 -983 -142 -308 -1101 -913 617 788 -476 618 1841 1190 1111 1477 2287 2440 2024 1820 1523
1394 1523 1995 1577 550 955 620 -343 -483 -237 -1085 -1675 -1223 -1126 -2316 -2422 -1589 -2050 -2237 -1968 -1869 -1387
1414 -1387 -245 -973 -1421 234 895 138 463 1543 1731 408 1796 2232 1190 2008 1769 1045 1053 949
1432 949 217 -101 462 -296 -1719 -926 -790 -2738 -2153 -53 -1492 -2399 -1185 -1016 -1871 -711 577 -14
1450 -14 -150 927 640 761 2245 1758 1218 2856 2296 74 580 2672 1468 -123 929 957 -1374 -1092
1468 -1092 -364 -1447 -1089 -740 -2142 -2948 -1509 -1750 -2599 -1012 272 -2003 -1418 446 -536 -983 1815
$$ packed form
1334A385j141j095L75J68o58j157j78P80n18p02O28l16K80N2N36K64o1N40N36
1353b82J17Q21K91l07O14N99l72K88k03O31q45l12M33j42r08m6j2l23n02m14M89
1374c85pq77K86Q41j66p93J88J530J71j264J094J223o51p9L66Q10J53m16k04k97
1394A523M72m18j027M05l35r63j40K46q48n90M52R7j190j06Q33m61j87K69R9M82
1414a387J142p28m48J655O61p57L25J080J88j323J388M36j042Q18k39p24Qj04
1432I49p32l18N63p58j423P93J36j948N85K100j439r07J214J69q55J160J288n91
1450a4j36J077k87J21J484m87n40J638n60k222N06K092j204j591J052K8k331K82
1468a092P28j083L58L49j402q06J439k41q49J587J284k275N85J864r82m47K798
$$ plain form
1485 1815 2873 583 344 1604 1334 1354 2621 2196 1340 1787 -121 -1273 1829 1676 -1151 -748 207
1502 207 -1906 -3724 -619 442 -2791 -2323 259 -2272 -3206 -872 -455 -147 1192 563 -1191 88
1518 88 1452 152 1635 4239 953 -1547 1378 1828 -536 1118 3223 26 -2060 -180 -599 -1903
1534 -1903 474 349 -2126 -713 -590 -3926 -1696 2343 -167 -2180 1146 754 -3129 -242 3654 743
1550 743 -228 3057 1298 -1116 1253 2255 1393 2562 2184 -835 -304 1528 -1039 -711 3924 1167
1566 1167 -4429 -1244 917 -2676 -1632 2365 -256 -4292 -717 13 -2003 -97 2004 -934 -192
1581 -192 1510 -1365 -1186 2910 2151 -521 1883 2572 -1801 -1267 3420 1613 -419 2301 -282 -3459
1597 -3459 -284 1147 -1333 125 1253 -2458 -3441 856 -157 -2716 1763 2610 -2398 -1829 1964 26
$$ packed form
1485A815J058k290k39J260k70K0J267m25q56M47j908j152L102j53k827M03R55
1502B07k113j818L105J061l233M68K582k531r34K334M17L08J339o29j754J279
1518H8J364j300J483K604l286k500K925M50k364J654K105l197k086J880m19j304
1534a903K377j25k475J413J23l336K230M039k510k013L326l92l883K887L896k911
1550G43r71L285j759k414K369J002q62J169l78l019N31J832k567L28M635k757
1566A167n596L185K161l593J044L997k621m036L575P30k016J906K101k938P42
1581a92J702k875J79M096p59k672K404O89m373N34M687j807k032K720k583l177
1597c459L175J431k480J458J128l711r83M297j013k559M479Q47n008N69L793j938
$$ plain form
1613 26 -680 3127 2567 -616 -9 931 -513 1186 2630 -636 -731 1138 -1575 -2801 1153 878 -2433
1630 -2433 -939 668 -3119 -3996 704 55 -2204 308 223 -3224 -1697 1197 476 267 1894 -125
1646 -125 -2441 563 1967 -571 745 1996 -750 -1247 545 4 -1005 493 374 -1241 -614 -226
1662 -226 -2755 -1175 1610 -420 -1715 672 -230 -2281 53 2689 494 -431 1664 547 -973 1341
1678 1341 2305 832 728 1360 209 -149 855 828 456 1097 387 -1861 -575 347 -1107 -571 679 -1008
1696 -1008 -1866 -766 -442 -1417 -65 731 -665 -821 979 309 -536 1509 2075 646 1224 1569 962 594
1714 594 2146 2487 1154 1044 1477 759 892 1252 809 456 101 -707 -512 136 -225 -1117 -509 435 -1163
1733 -1163 -1105 170 -464 -998 430 812 -228 -311 701 663 282 1603 1587 -112 448 967 -190 4 160
$$ packed form
1613B6p06L807n60l183O07R40j444J699J444l266r5J869k713j226L954k75l311
1630b433J494J607l787q77M700o49k259K512q5l447J527K894p21k09J627k019
1646a25k316L004J404k538J316J251k746m97J792n41j009J498j19j615O27L88
1662b26k529J580K785k030j295K387r02k051K334K636k195r25K095j117j520K314
1678A341R64j473j04O32j151l58J004k7l72O41p10k248J286R22j454N36J250j687
1696a008q58J100L24r75J352P96j396j56J800o70q45K045N66j429N78L45o07l68
1714E94J552L41j333j10M33p18J33L60m43l53l55q08J95O48l61q92O08R44j598
1733a163N8J275o34n34J428L82j040q3J012l8l81J321j6j699N60N19j157J94J56
$$ plain form
1752 160 -541 -1098 -1647 -1451 -1716 -1883 -1747 -2462 -2325 -2282 -3322 -2650 -1973 -2614 -2325 -1584 -1386 -1893 -866 326
1772 326 -461 -674 990 1342 53 870 1417 1383 958 1140 1502 1124 761 1043 929 533 486 -111 42 -223
1792 -223 -459 -53 -173 -241 -408 -159 92 -9 202 874 641 730 1510 1138 1197 1844 1966 1795 1737 2365 1899
1813 1899 1297 1584 1834 1223 460 543 392 -329 -1128 -545 -485 -1662 -1710 -1359 -1505 -1949 -1850 -1055 -1439 -1819 -895
1834 -895 -740 -592 -678 246 444 527 438 1109 850 818 1049 1111 932 905 662 637 326 17 334 -496 -974 -657
1856 -657 -785 -1024 -1165 -1158 -1123 -1705 -1335 -371 -890 -1236 -882 -1 264 -152 430 1137 454 576 1668 1393 870
1877 870 843 1253 1047 389 690 950 115 -96 -263 -200 -540 -876 -903 -877 -1244 -1521 -1120 -1151 -823 -1133 -859 -329
1899 -329 -217 197 133 -47 621 834 748 742 1439 1190 434 941 1797 1115 308 593 381 -658 -194 -303 -521
$$ packed form
1752A60p01n57n49J96k65j67J36p15J37M3j040O72O77o41K89P41J98n07J027J192
1772C26p87k13J664L52j289Q17N47l4m25J82L62l78l63K82j14l96m7n97J53k65
1792b23k36M06j20o8j67K49K51j01K11O72k33Q9P80l72N9O47J22j71n8O28m66
1813A899o02K87K50o11p63Q3j51p21p99N83O0j177m8L51j46m44R9P95l84l80R24
1834h95J55J48q6R24J98Q3q9O71k59l2K31O2j79k7k43k5l11l09L17q30m78L17
1856f57j28k39j41PL5n82L70R64n19l46L54Q81K65m16N82P07o83J22J092k75n23
1877H70k7M10k06o58L01K60q35k11j67O3l40l36k7K6l67k77M01l1L28l10K74N30
1899c29J12M14o4j80O68K13q6oO97k49p56N07Q56o82q07K85k12j039M64j09k18
$$ plain form
1920 -521 -1060 -1308 -815 -1432 -1306 -1465 -1279 -1030 -1275 -1456 -55 -363 -891 -271 517 565 338 609 1002 313
1940 313 645 1557 1209 1022 888 -107 348 767 340 -339 -87 292 -1012 -1580 -153 -670 -1522 -852 -707
1959 -707 -1299 -766 -654 -706 -327 312 332 329 772 684 220 1703 2069 810 1276 1825 785 114 1660 1860
1979 1860 185 -101 501 -374 -720 53 -283 -906 -450 -1455 -1892 -794 -307 -1562 -1077 195 -713 -1818
1997 -1818 291 924 -484 523 1554 583 132 1232 969 856 1887 1425 164 883 740 -1118 312
2014 312 1919 -217 -1714 -373 -483 -2215 -847 677 -1241 -1931 -704 -1318 -1696 223 -11 -896 574
2031 574 789 -772 104 1988 710 633 2195 1998 -781 742 2251 97 735 1503 -164 -1141 -305
2048 -305 -407 -972 383 0 -2524 -1749 -89 -2452 -2059 1026 -156 -2451 -674 178 -1323 -738 1881
$$ packed form
1920e21n39k48M93o17J26j59J86K49k45j81J401l08n28O20P88M8k27K71L93o89
1940C13L32R12l48j87j34r95M55M19m27o79K52L79j304n68J427n17q52O70J45
1959g07n92N33J12n2L79O39K0lM43q8m64J483L66j259M66N49j040o71J546K00
1979A860j675k86O02q75l46P73l36o23M56j005m37J098M87j255M85J272r08j105
1997a818K109O33j408J007J031r71m51J100k63j13J031m62j261P19j43j858J430
2014C12J607k136j497J341j10j732J368J524j918o90J227o14l78J919k34q85J470
2031E74K15j561Q76J884j278p7J562j97k779J523J509k154O38P68j667r77Q36
2048c05j02n65J355l83k524P75J660k363L93L085j182k295J777Q52j501N85K619
$$ plain form
2065 1881 689 -697 944 429 -350 1506 1616 343 1192 1603 -519 -682 1638 640 -1250 526 386
2082 386 -2446 -1625 140 -1111 -1156 324 -1021 -2482 -1013 -369 -1307 241 1393 -1440 -1490 1162 417
2099 417 -604 1915 1878 -4 46 1401 206 236 1485 1219 -117 364 -535 -1849 119 334 -953 -812
2117 -812 226 -1962 -2527 35 741 -1144 -381 846 -969 -837 1096 1030 708 1465 1365 244 909 1745
2135 1745 916 1339 2727 1321 -240 1010 973 104 842 1470 1 -602 -229 -387 -484 22 105 -685 -1
2154 -1 -9 -1349 -547 862 159 -324 738 210 -1411 -74 1664 858 -205 649 203 -936 -242 298 198
2173 198 -172 -299 -926 -1021 -463 -1335 -1442 -253 -821 -2086 -1288 -965 -1614 -1245 16 -42 -1197 -830 -65
2192 -65 -415 354 1126 273 144 670 842 83 1235 1556 164 246 1138 256 -411 716 838 -157 199 163
$$ packed form
2065A881j192j386J641n15p79J856J10j273Q49M11k122j63K320r98j890J776j40
2082C86k832Q21J765j251m5J480j345j461J469O44r38J548J152k833n0K652p45
2099D17j021K519l7j882N0J355j195L0J249k66j336M81q99j314J968K15j287J41
2117h12J038k188n65K562P06j885P63J227j815J32J933o6l22P57j00j121O65Q36
2135A745q29M23J388j406j561J250l7q69P38O28j469o03L73j58r7N06Q3p90O84
2154aqj340Q02J409p03m83J062n28j621J337J738q06j063Q54m46j139O94N40j00
2173A98l70j27o27r5N58q72j07J189n68j265P98L23o49L69J261n8j155L67P65
2192f5l50P69P72q53j29N26J72p59J152L21j392Q2Q92q82o67J127J22r95L56l6
$$ plain form
2212 163 -638 -711 -293 -366 -227 168 -636 -1204 74 384 -620 308 1194 74 -42 1127 993 267 904
2231 904 1648 469 242 875 428 269 677 181 -440 34 -433 -938 -600 -29 -1126 -1248 -417 -745 -1377
2250 -1377 -487 -242 -991 -201 88 -291 6 738 312 135 1027 975 -104 447 1567 774 353 1309 566
2269 566 -241 47 627 -54 -420 -328 -730 -695 -583 -787 -848 -500 -1155 -829 -386 -493 -1165 -375 -81 93 -91
2290 -91 643 669 114 906 975 731 765 1096 482 368 796 647 304 104 278 -385 -459 -291 -399 -872 -941 -929
2312 -929 -481 -957 -577 -332 -289 -598 -429 20 513 153 1 958 713 411 534 1080 1065 412 442 903 574
2333 574 356 316 -34 -116 -324 -323 -519 -762 -841 -816 -808 -946 -943 -1136 -1055 -1127 -662 -716 -361 -441 -274 -104 218 641 371
2358 371 310 715 824 872 706 1032 688 492 213 631 631 149 -204 -147 -120 -386 -403 -596 -695 -1042 -1135 -576 -382
$$ packed form
2212A63q01p3M18p3J39L95q04n68J278L10j004R28Q86j120j16J169j34p26O37
2231I04P44j179k27O33m47j59M08m96o21M74m67n05L38N71j097j22Q31l28o32
2250a377Q90K45p49P90K89l79K97P32m26j77Q92n2j079N51J120p93m21R56p43
2269E66q07K88N80o81l66R2m02L5J12k04o1L48o55L26M43j07o72P90K94J74j84
2290i1P34K6n55P92O9k44L4L31o14j14M28j49l43k00J74o63p4J68j08m73o9J2
2312i29M48m76L80K45M3l09J69M49M93l60j52R57k45l02J23N46j5o53L0M61l29
2333E74k18m0l50q2k08Jj96k43p9K5Qj38Lj93Q1p2M65n4L55q0J67J70L22M23k70
2358C71o1M05J09M8j66L26l44j96k79M18%m82l53N7K7k66j7j93r9l47r3N59J94
$$ plain form
2381 -382 -879 -678 -587 -172 -116 130 483 490 289 1032 892 666 967 970 952 740 1020 890 632 502 109 -107
2403 -107 -54 -51 -256 -601 -556 -694 -949 -687 -729 -656 -835 -778 -496 -263 -180 -214 -3 657 225 264 538 833 499
2426 499 304 839 876 225 676 587 -26 -99 60 -37 -292 -568 -723 -433 -578 -535 -1028 -325 -648 -1028 -652 331
2448 331 -281 -295 308 492 63 401 576 702 271 952 630 429 839 447 -201 720 637 82 -127 12 -561
2469 -561 -985 -73 -48 -1005 -732 -200 -994 -461 -539 -604 -489 176 -350 -533 583 528 -181 399 1211 164 -263
2490 -263 954 905 -95 495 765 106 2 211 -101 -352 189 -458 -987 -292 -498 -1276 -404 26 -514 -909
2510 -909 94 -421 -1007 45 775 -288 64 542 -240 71 926 806 454 878 668 -468 67 1176
2528 1176 -296 -227 833 94 -833 -215 -327 -667 -266 -54 -499 -864 -67 -652 -777 653 323 -661 221
$$ packed form
2381c82m97K01R1M15N6K46L53Pk01P43j40k26L01Lj8k12K80j30k58j30l93k16
2403a07N3Lk05l45M5j38k55K62m2P3j79N7K82K33Q3l4K11O60m32L9K74K95l34
2426D99j95N35L7o51M51q9o13p3J59r7k55k76j55K90j45M3m93P03l23l80L76R83
2448C31o12j4O03J84m29L38J75J26m31O81l22k01M10l92o48R21q3n55k09J39n73
2469e61m24R12K5r57K73N32p94N33p8o5J15O65n26j83J116n5p09N80Q12j047m27
2490b63J217m9j000N90K70o59j04K09l12k51N41o47n29O95k06p78Q72M30n40l95
2510i09J003n15n86J052P30j063L52M78p82L11Q55j20l52M24k10j136N35J109
2528A176j472O9J060p39r27O18j12l40M01K12m45l65P97n85j25J430l30r84Q82
$$ plain form
2547 221 580 -312 327 1257 786 39 869 1150 115 195 1267 649 407 329 -47 -490 78 186 -453 -225
2567 -225 -175 -1177 -1474 10 -203 -867 -58 -102 -933 -637 175 -30 -154 888 507 -190 451 598 -79 642
2587 642 1447 294 69 614 2 -470 73 655 -387 -673 -229 -786 -590 -81 -367 -952 -237 -670 -1237
2606 -1237 -507 234 -16 -327 603 -92 -958 178 1119 392 655 1277 9 -34 681 815 242 589 417
2625 417 -468 -123 315 -572 -825 261 -41 -1241 -524 -238 -1097 -567 507 -143 -898 -215 -345 -600 582
2644 582 883 -211 387 720 59 -8 1503 864 -359 719 1095 -621 -197 715 47 -107 343 88 -1054
2663 -1054 -603 -273 -808 -282 156 -1147 -1056 322 -516 -546 405 518 -720 -9 916 240 -83 1261 1024
2682 1024 -58 567 129 123 602 963 -151 -310 379 -292 -1028 179 401 -982 -900 -164 -769 -819 -237 -359
$$ packed form
2547B21L59q92O39R30m71p47Q30K81j035Q0J072o18k42p8l76m43N68J08o39K28
2567b25N0j002k97J484k13o64Q09m4q31K96Q12k05j24J042l81o97O41J47o77P21
2587F42Q05j153k25N45o12m72N43N82j042k86M44n57J96N09k86n85P15m33n67
2606a237P30P41k50l11R30o95q66J136R41p27K63O22j268m3P15J34n73L47j72
2625D17q85L45M38q87k53J086l02j200P17K86q59N30J074o50p55O83j30k55J182
2644E82L01j094N98L33o61o7J511o39j223J078L76j716M24R12o68j54M50k55j142
2663a054M51L30n35N26M38j303R1J378q38l0R51J13j238P11R25o76l23J344k37
2682A024j082O25m38oM79L61j114j59O89o71p36J207K22j383Q2P36o05n0N82j22
$$ plain form
2702 -359 -712 -144 -189 -494 179 81 -585 313 1451 232 -131 816 888 202 816 1186 318 -369 487 562 -97
2723 -97 356 278 -478 -340 -105 -655 -53 -55 -635 -417 129 -189 -739 40 603 107 115 690 433 330 614 697
2745 697 401 988 884 469 411 550 240 -156 654 -70 -528 -143 -112 -371 -759 -236 -639 -846 -840 -580 -566 -444
2767 -444 -757 -724 -213 -194 -544 109 220 -76 133 594 480 -45 218 742 390 19 402 332 -59 -106 14
2788 14 -230 -244 -164 -408 -565 -370 -324 -516 -183 -267 -528 -266 -127 -15 -11 -147 452 521 423 378 523 624 507
2811 507 815 687 907 408 390 392 512 204 -269 -47 19 -686 -247 -181 -230 -477 -621 -507 -829 -744 -474 -349
2833 -349 -362 37 -135 207 181 0 395 497 552 475 500 605 577 521 320 298 326 379 -18 -294 -37 -60 -403 -485
2857 -485 -506 -541 -777 -483 -341 -379 -544 -350 26 -33 71 276 449 205 315 655 557 586 786 691 825 505
$$ packed form
2702c59l53N68m5l05O73r8o66Q98J138j219l63R47P2o86O14L70q68o87Q56P5o59
2723i7M53p8p56J38K35n50O02kn80K18N46l18n50P79N63m96QN75k57j03K84Q3
2745F97k96N87j04m15n8J39l10l96Q10p24m58L85L1k59l88N23m03k07OK60J4J22
2767d44l13L3N11J9l50O53J11k96K09M61j14n25K63N24l52l71L83p0l91m7J20
2788A4k44j4Q0k44j57J95M6j92L33q4k61K62J39J12Mj36N99O9r8m5J45J01j17
2811E07L08j28K20m99j8KJ20l08m73K22O6p05M39O6m9k47j44J14l22Q5K70J25
2833c49j3L99j72L42k6j81L95J02N5p7K5J05k8n6k01k2K8N3l97k76K57k3l43q2
2857d85k1l5k36K94J42l8j65J94L76n9J04K05J73k44J10L40r8K9K00r5J34l20
$$ plain form
2879 505 410 745 251 0 137 -183 -142 -340 -275 -212 -642 -637 -789 -643 -610 -612 -881 -361 -453 -437 -105 27 129 207
2903 207 267 662 482 389 536 632 667 839 243 565 482 -29 -70 245 29 -797 -478 -101 -374 -763 -347 -407
2925 -407 -499 -545 -493 -424 -470 -618 -234 -290 163 134 -100 461 651 244 587 520 676 132 473 741 276 282 237 208
2949 208 -52 -133 -91 -212 -163 -738 -667 -112 -286 -969 -717 -26 -267 -390 -53 186 -257 21 248 297 351 432
2971 432 449 427 665 416 393 847 538 20 263 646 -5 -357 -27 -170 -472 -61 -357 -625 -668 -528 -443 -421
2993 -421 8 -476 -218 122 11 -396 107 530 269 28 568 606 98 476 783 270 454 401 116 -172 161
3014 161 -176 -373 200 -83 -856 -261 1 -701 -347 17 -140 -479 -197 109 -183 -61 375 101 -118 517
3034 517 121 523 652 456 173 411 555 -187 -160 687 344 -508 220 -8 -690 -472 32 -342 -451 -220
$$ packed form
2879E05r5L35m94k51J37l20M1j98O5O3m30Nj52J46L3kk69N20r2J6L32J32J02P8
2903B07O0L95j80r3J47R6L5J72n96L22q3n11m1L15k16q26L19L77k73l89M16o0
2925d07r2m6N2O9m6j48L84n6M53k9k34N61J90m07L43o7J56n44L41K68m65Om5k9
2949B08k60q1M2j21M9n75P1N55j74o83K52O91k41j23L37K39m43K78K27M9N4Q1
2971D32J7k2K38k49k3M54l09n18K43L83o51l52L30j43l02M11k96k68m3J40Q5K2
2993d21M29m84K58L40j11m07N03M23k61k41N40L8n08L78L07n13J84n3k85k88L33
3014A61l37j97N73k83p73N95K62p02L54L64j57l39K82L06k92J22M36k74k19O35
3034E17l96M02J29j96k83K38J44p42K7Q47l43q52P28k28o82K18N04l74j09K31
$$ plain form
3054 -220 -466 -788 -428 64 -505 -25 495 -412 -241 632 402 395 676 773 6 11 693 400 268 432 312 -364
3076 -364 12 31 -343 -76 218 -249 -376 -128 -324 -806 53 273 -157 -403 -183 -375 -307 362 275 -19 448
3097 448 149 -346 126 1417 269 77 676 297 -501 268 358 -357 100 236 -99 -854 -159 -606 -865 -281
3117 -281 24 -926 -605 -548 -822 -492 266 76 -506 21 276 -394 142 897 432 300 584 39 -165 653
3137 653 773 52 305 228 -446 -446 640 146 -591 91 145 -956 -341 240 -405 -297 143 -29 -429 19 11
3158 11 -332 537 1067 199 531 918 491 339 1084 1008 91 146 557 -303 -91 473 -368 -467 -274 -661 -836
3179 -836 -486 41 -866 -550 -152 -746 -1174 -48 -261 -805 217 97 -428 -16 368 241 409 334 548 -112
3199 -112 250 517 -62 386 736 -41 -121 41 -112 -568 -205 206 -410 -571 -160 -555 -642 -389 -54 -31 -78
$$ packed form
3054b20k46l22L60M92n69M80N20r07J71Q73k30pK81R7p67NO82k93j32J64j20o76
3076c64L76J9l74K67K94m67j27K48j96m82Q59K20m30k46K20j92O8O69q7k94M67
3097D48k99m95M72J291j148j92N99l79p98P69R0p15M57J36l35p55O95m47k59N84
3117b81L05r50L21N7k74L30P58j90n82N27K55o70N36P55m65j32K84n45k04Q18
3137F53J20p21K53p7o74%J086m94p37O82N4j101O15N81o45J08M40j72m00M48q
3158A1l43Q69N30q68L32L87m27j52P45p6r17N5M11q60K12N64q41r9J93l87j75
3179h36L50N27r07L16L98n94m28J126k13n44J022j20n25M12L84j27J68p5K14o60
3199a12L62K67n79M48L50p77q0J62j53m56L63M11o16j61M11l95q7K53L35K3m7
$$ plain form
3220 -78 -135 -335 288 269 143 68 568 533 87 316 692 156 468 475 240 95 -288 85 -190 150 -96 -697
3242 -697 -670 -253 -528 -497 -315 -408 -648 -484 -150 -343 -387 -26 -423 -139 160 167 0 316 92 437 462 308
3264 308 486 151 282 558 262 132 98 -28 -156 43 74 34 -275 -115 -360 -500 -220 -90 -242 -184 21
3285 21 -274 87 5 -27 60 300 251 213 65 594 438 205 342 453 187 185 206 131 -29 -332 -219 -269 -79 -688
3309 -688 -416 -206 -595 -463 -293 -295 -393 -296 -91 44 -68 -146 77 263 232 106 287 573 373 313 702 646 404
3332 404 243 175 -9 -235 168 -125 -364 -96 -304 -246 -208 -400 -695 -393 -220 -234 -223 -236 -58 184 -134 430
3354 430 168 270 179 261 263 246 294 202 270 327 128 109 163 215 -169 28 -295 -121 -132 -367 -376 -427 -166 -426 -33
3379 -33 -406 -283 -43 -60 -55 57 120 223 227 342 301 530 152 394 333 252 235 214 153 206 191 -48 -231 -272 -197 -51
$$ packed form
3220g8n7k00O23j9j26p5N00l5m46K29L76n36L12Pk35j45l83L73k75L40k46o01
3242f97K7M17k75L1J82r3k40J64L34j93m4L61l97K84K99Pj67L16k24L45K5j54
3264C08J78l35J31K76k96j30l4j26j28J99L1m0l09J60k45j40K80J30j52N8K05
3285B1k95L61q2l2Q7K40m9l8j48N29j56k33J37J11k66kK1p5j60l03J13n0J90o09
3309f88K72K10l89J32J70kr8R7K05J35j12p8K23J86l1j26J81K86k00o0L89n6k42
3332D04j61o8j84k26M03k93k39K68k08N8L8j92k95L02J73j4J1j3J78K42l18N64
3354D30k62J02r1Q2Kj7M8r2O8N7j99j9N4N2l84J97l23J74j1k35rn1K61k60L93
3379c3l73J23K40j7NJ12O3J03MJ15m1K29l78K42o1q1j7k1o1N3j5k39j83m1P5J46
$$ plain form
3405 -51 -410 -103 -155 -437 -201 7 -166 -375 -354 -195 -6 -231 138 -20 -41 394 420 268 419 416 95 356
3427 356 77 47 287 166 -2 43 116 -407 -275 -125 -123 -136 -532 -446 -407 -395 -195 -456 -270 -14 -271 -10 248
3450 248 -1 -50 156 567 316 72 329 453 46 111 496 -104 326 130 -198 -200 333 -166 -429 -115 -40 -544
3472 -544 -348 243 -66 -401 -304 -118 -78 -392 150 70 158 -49 163 381 360 157 369 526 288 52 -33 429
3494 429 242 -91 21 142 -456 -259 -69 -12 -151 -320 -234 -391 -294 -262 -352 12 -135 -479 58 -53 -208 -20
3516 -20 468 283 104 8 257 324 227 138 73 158 177 33 -362 110 -183 -435 -189 215 -574 -754 -143 -136 -651
3539 -651 -71 -170 -295 -448 7 -116 -141 187 59 -83 241 240 -21 347 512 -276 -131 512 327 -273 116
3560 116 368 -255 -128 379 -374 -544 147 -277 -471 136 -272 -526 -142 19 -185 -122 527 -129 -378 465
$$ packed form
3405e1l59L07n2k82K36K08j73k09K1J59J89k25L69j58k1M35K6j52J51ll21K61
3427C56k79l0K40j21j68M5P3n23J32J50Kj3l96Q6L9J2K00k61J86K56k57K61K58
3450B48k49m9K06M11k51k44K57J24m07O5L85o00M30j96l28kN33m99k63L14P5n04
3472e44J96N91l09l35R7J86M0l14N42q0Q8k07K12K18k1k03K12J57k38k36q5M62
3494D29j87l33J12J21n98J97J90N7j39j69Q6j57R7L2r0L64j47l44N37j11j55J88
3516b0M88j85j79r6K49O7r7q9o5Q5J9j44l95M72k93k52K46M04p89j80O11Pn15
3539f51N80r9j25j53M55j23k5L28j28j42L24jk61L68J65p88J45O43j85o00L89
3560A16K52o23J27N07p53j70O91m24j94O07m08k54L84J61k04O3O49o56k49Q43
$$ plain form
3580 465 177 96 260 667 40 -10 217 432 161 585 72 -539 -20 204 -290 -5 300 -284 -369 4 -38
3601 -38 -539 -48 53 -223 -395 -247 -328 -306 322 75 77 154 399 7 143 892 300 -324 430 324 -218 389
3623 389 166 99 -128 163 -111 -225 172 -60 -234 -42 -84 -762 -527 -10 -411 -160 215 -10 -101 -238 82
3644 82 -9 108 331 344 106 470 216 -80 240 309 78 145 55 -161 -532 202 61 -223 -48 -244 -684 -305
3666 -305 -48 -174 -181 -92 -183 -118 -299 65 -397 162 455 -57 -7 471 392 156 282 414 554 -8 22 -112 -8
3689 -8 155 128 -9 -18 -121 -189 -57 -138 -246 -249 -220 -30 -328 -350 -42 4 -28 -59 296 48 -84 86 179 544 199
3714 199 174 256 653 70 152 426 228 -104 -166 123 -14 -98 -88 -346 -381 -406 -323 -444 -90 -22 -319 -121 -195 21
3738 21 -238 98 477 -210 -17 381 25 105 312 311 -71 305 288 117 366 305 45 22 208 -212 -515 -28
$$ packed form
3580D65k88q1J64M07o27n0K27K15k71M24n13o11N19K24m94K85L05n84q5L73m2
3601c8n01M91J01k76j72J48q1K2O28k47KP7K45l92J36P49n92o24P54j06n42O07
3623C89k23o7k27K91k74j14L97k32j74J92m2o78K35N17m01K51L75k25r1j37L20
3644H2r1J17K23J3k38L64k54k96L20O9k31O7r0k16l71P34j41k84J75j96m40L79
3666c05K57j26pQ9r1O5j81L64m62N59K93n12N0M78p9k36J26J32J40n62L0j34J04
3689hJ63k7j37rj03o8J32q1j08lK9J90k98k2L08M6l2l1L55k48j32J70R3L65l45
3714A99k5Q2L97n83Q2K74j98l32o2K89j37q4J0k58l5k5Q3j21L54O8k97J98p4K16
3738B1k59L36L79o87J93L98l56Q0K07jl82L76j7j71K49o1k60k3J86m20l03M87
$$ plain form
3760 -28 -195 -375 -146 -307 -530 -342 30 80 -98 -74 51 143 24 232 -8 76 105 215 -28 498 480 7
3782 7 160 445 100 45 21 -25 -215 -251 217 -79 -208 -198 -410 -345 211 -100 -416 -16 -238 -289 118 -186 -69
3805 -69 215 87 256 -48 304 302 195 303 275 277 57 207 -63 -228 -42 -95 -341 -140 -6 -282 -454 -37
3827 -37 -25 -235 -163 -246 -234 -95 -116 -220 102 -150 -55 83 49 167 327 337 157 139 109 419 236 -25 -6 240
3851 240 72 -67 -198 -129 20 -161 30 -60 -152 -148 -397 -403 134 -240 -129 -22 75 -233 -7 -81 38 279 72
3874 72 209 200 172 129 209 245 15 108 221 118 12 47 28 -149 -293 -426 -335 -466 -164 -257 105 -124 -39 -117 -42
3899 -42 289 -313 48 69 131 202 86 213 204 168 217 409 128 -93 351 -166 208 -83 90 -44 -33 -158 -455
3922 -455 -285 -246 -269 -32 14 -136 -283 -20 54 -27 -39 -173 81 332 60 157 374 256 427 194 309 431
$$ packed form
3760b8j67j80K29j61k23J88L72N0j78K4J25R2j19K08k40Q4K9J10k43N26j8m73
3782GJ53K85l45n5k4m6j90l6M68k96j29J0k12O5N56l11l16M00k22n1M07l04J17
3805f9K84j28J69l04L52kj07J08k8Kk20J50k70j65J86n3k46K01J34k76j72M17
3827c7J2k10P2q3J2J39k1j04L22k52R5J38l4J18J60J0j80j8l0L10j83k61J9K46
3851B40j68j39j31O9J49j81J91r0r2Mk49oN37l74J11J07R7l08K26p4J19K41k07
3874G2J37rk8m3Q0L6k30R3J13j03j06L5j9j77j44j33R1j31L02r3L62k29Q5p8P5
3899d2L31o02L61K1O2P1j16J27rl6M9J92k81k21M44n17L74k91J73j34J1j25k97
3922d55J70L9k3K37M6j50j47K63P4q1j2j34K54K51k72R7K17j18J71k33J15J22
$$ plain form
3944 431 218 58 241 -57 40 -134 39 -92 -63 -139 -369 -38 -266 -242 -176 -146 -35 -269 -123 -33 -209 -9
3966 -9 355 88 75 268 -24 269 459 207 246 29 302 -5 93 63 163 -89 116 -136 -269 -208 -26 -263
3988 -263 -64 -170 -29 -168 -166 -6 -234 -110 -78 47 -33 105 -23 69 349 157 158 -7 245 151 -19 271 215
4011 215 104 113 -20 -171 54 -57 -308 -335 -135 -86 -163 -264 -56 -580 149 215 -290 34 71 93 -94 478 178
4034 178 113 181 100 213 194 376 0 -165 139 219 -57 123 87 -110 -207 38 -140 -266 -177 -97 -200 -352 -285
4057 -285 -156 -72 -71 -187 -56 159 65 -183 206 213 -58 119 -67 240 -137 79 110 129 46 54 -150 -117 90 -467
4081 -467 -222 -295 83 -425 -239 -54 -286 -400 37 -50 -414 -102 89 -134 341 156 -105 131 216 368 195
4102 195 477 253 -93 303 16 -85 51 302 -219 -179 40 -14 -385 -110 -173 124 -134 -247 -373 -324 159
$$ packed form
3944D31k13j60J83k98R7j74J73j31K9p6k30L31k28K4O6L0J11k34J46R0j76K00
3966iL64k67j3J93k92K93J90k52L9k17K73l07R8l0J00k52K05k52j33O1J82k37
3988b63J99j06J41j39KJ60k28J24L2J25q0J38j28R2K80j92Jj65K52r4j70K90n6
4011B15j11Rj33j51K25j11k51k7K00M9p7j01K08n24P29O6n05L24L7K2j87N72l00
4034A78o5O8q1J13j9J82l76j65L04Q0k76J80l6j97r7K45j78j26Q9Q0j03j52O7
4057b85J29Q4Jj16J31K15r4k48L89Pk71J77j86L07l77K16L1J9q3Qk04L3K07n57
4081d67K45p3L78n08J86J85k32j14M37q7l64L12J91k23M75j85k61K36Q5J52j73
4102A95K82k24l46L96k87j01J36K51n21M0K19n4l71K75o3K97k58j13j26M9M83
$$ plain form
4123 159 112 -111 -131 87 -408 146 376 -253 -8 202 161 6 -77 350 25 3 331 116 -29 252 -129 26
4145 26 62 -69 -109 -256 53 -198 -319 -96 -117 53 49 -73 -293 -60 114 119 16 279 205 31 222 131 -44
4168 -44 311 448 95 64 56 20 54 83 115 -318 20 10 -314 -257 -75 -54 -176 -16 -127 -172 -86 340 -221 116
4192 116 -68 39 227 427 404 108 188 -59 275 31 283 1 52 99 4 -162 -243 -22 -186 -108 20 5 -262
4215 -262 -197 5 -332 -403 -193 -437 155 -156 -144 -189 195 64 -123 171 200 201 -204 346 141 119 73 263 73
4238 73 -53 215 20 -67 -6 308 -78 73 28 -309 -144 -355 -364 50 158 -20 -125 -114 -15 182 -168 367 494
4261 494 32 163 -90 199 199 -97 187 235 32 -289 -42 296 147 -236 70 -81 -432 -340 -79 35 -197
4282 -197 -156 -376 -18 20 -364 -211 88 142 -265 146 216 23 12 33 -23 80 -92 275 73 -5 66 42 73 1
$$ packed form
4123A59m7k23k0K18m95N54K30o29K45K10m1j55q3M27l25k2L28k15j45K81l81J55
4145B6L6j31m0j47L09k51j21K23k1J70mj22k20K33J74Nj03K63p4j74J91r1j75
4168d4L55J37l53l1ql6L4K9L2m33L38j0l24N7J82K1j22J60j11m5Q6M26n61L37
4192A16j84J07J88K00k3k96Q0k47L34k44K52k82N1M7r5j66q1K21j64P8J28j5k67
4215b62O5K02l37p1K10k44N92l11J2m5L84j31j87K94K9Jm05N50k05k2m6J90j90
4238G3j26K68j95q7O1L14l86J51m5l37J65k11rM14J08j78j05J1R9J97l50N35J27
4261D94m62J31k53K89%k96K84M8k03l21K47L38j49l83L06j51l51R2K61J14k32
4282a97M1k20L58L8l84J53K99N4m07M11P0j93j1K1n6J03j72L67k02p8P1k4L1p2
$$ plain form
4306 1 -27 -293 -146 -101 -121 -61 67 62 -120 -231 -184 94 -145 -105 118 158 238 122 321 79 309 64 -75 173
4330 173 186 81 336 56 133 54 10 -27 -70 -88 -96 -121 -362 -144 -144 -94 -471 -262 -33 -231 -151 40 -27 -30 109 179
4356 179 286 -74 -152 360 43 31 77 119 104 -76 -104 202 3 225 -138 -144 -104 -114 7 2 -204 -236 -180 -83 -4
4381 -4 -108 -1 -206 310 236 134 45 158 49 164 -18 378 70 228 301 42 226 72 -169 74 -15 -221
4403 -221 -106 -193 -112 -257 -131 -43 -433 -121 -45 -241 -165 172 -286 -225 -174 216 56 66 -115 -32 71 13 -21 137
4427 137 14 208 108 -32 272 -169 105 219 46 159 1 -202 -65 143 -402 -87 41 -64 -115 -68 -33
4448 -33 122 -113 115 378 61 265 -26 101 99 -13 -101 7 -37 119 -84 89 -2 7 -119 9 8 -22 -98 -212
4472 -212 -55 -131 -27 89 -184 -81 92 -3 -153 -111 28 238 -257 82 173 31 99 353 84 34 -21 -156
$$ packed form
4306Ak8k66J47M5k0O0J28nj82j11M7K78k39M0K23M0Q0j16J99k42K30k45j39K48
4330A73J3j05K55k80P7p9m4l7m3j8qk5k41K18%N0l77K09K29j98Q0J91o7lJ39P0
4356A79J07l60p8N12l17j2M6M2j5j80k8L06j99K22l63oM0j0J21nk06l2N6R7P9
4381dj04J07k05N16p4j02q9J13j09J15j82L96l08J58P3k59J84j54k41K43q9k06
4403b21J15q7Q1j45J26Q8l90L12P6j96P6L37m58O1N1L90j60J0j81Q3J03n8l4J58
4427A37j23J94j00j40L04m41K74J14j73J13j58k03J37K08n45L15J28j05n1M7L5
4448c3J55k35K28K63l17K04k91J27kj12q8J08m4J56k03J73r1Rj26J28jl0p6j14
4472b12J57p6J04J16k73J03J73r5j50M2J39K10m95L39R1j42O8K54k69n0n5j35
$$ plain form
4494 -156 -126 105 218 -142 -93 -64 -302 -158 -91 -386 -51 -95 -217 -418 -206 -148 -32 -9 -150 -238 -174 239 81
4517 81 -132 144 327 126 23 340 215 123 212 49 -53 231 73 -15 -113 -55 -3 -65 -23 -120 -162 -25 -62 -322
4541 -322 -203 83 -181 4 191 6 -52 -106 61 66 232 65 124 238 200 271 85 104 42 162 293 61 70 -109
4565 -109 -244 21 -78 48 63 -196 -94 -11 -79 56 -243 133 135 -141 7 273 34 224 6 -9 -43 295 114
4588 114 57 121 102 -124 183 -109 45 122 28 -160 -112 -245 -175 -62 238 -64 -161 85 -306 -194 -129 -13 -44
4611 -44 159 150 84 285 67 -110 155 185 237 116 71 51 309 -142 151 133 -202 -133 1 -129 -116 84 95 -198
4635 -198 -89 -169 -288 267 125 -211 107 -12 -53 -206 89 360 120 157 22 162 42 -12 86 2 287 172
4657 172 -34 25 -109 -100 42 213 -111 -340 126 -242 -136 66 -231 -263 -168 4 -44 69 237 302 -138 232
$$ packed form
4494a56L0K31J13l60M9K9k38J44O7k95L35m4j22k01K12N8J16K3j41q8O4M13j58
4517H1k13K76J83k01j03L17j25r2Q9j63j02K84j58q8r8N8N2o2M2r7m2J37l7k60
4541c22J19K86k64J85J87j85n8n4J67NJ66j67N9J14l8P1j86J9o2J20J31k32Rj79
4565a09j35K65r9J26J5k59J02Q3o8J35k99L76Kk76J48K66k39J90k18j5l4L38j81
4588A14n7O4j9k26L07k92J54P7r4j88M8j33P0J13L00l02r7K46l91J12O5J16l1
4611d4K03ro6K01k18j77K65L0N2j21m5k0K58m51K93j8l35O9J34j30J3K00J1k93
4635a98J09q0j19N55j42l36L18j19m1j53K95K71k40L7j35J40j20n4R8q4K85j15
4657A72k06N9j34RJ42J71l24k29M66l68J06K02k97l2R5J72m8J13J68O5m40L70
$$ plain form
4679 232 -24 -206 15 162 13 13 265 -202 -31 115 38 33 46 23 45 -293 -85 164 -42 -69 -98 -335 22
4702 22 91 -205 21 -80 -165 -85 56 -41 -57 99 -127 5 71 190 26 134 396 -119 143 276 254 22 -173
4725 -173 13 40 -397 -19 -5 0 34 -140 -119 -449 107 -104 92 163 -190 74 146 65 -140 256 119 -148 3
4748 3 135 175 107 42 244 8 -260 89 16 -330 -55 -195 37 -58 -115 -1 -232 66 -69 -117 -142 -24 -9 -74
4772 -74 89 35 16 165 130 -76 -20 -108 -140 55 70 -254 28 -146 192 -195 45 -33 -31 357 -30 -22 161 -170
4796 -170 -197 -159 66 -215 66 172 165 244 130 181 3 53 350 184 -34 -36 243 37 -35 139 206 58 130 165
4820 165 -163 72 -101 -178 -154 -42 -155 -258 118 37 -253 8 192 202 -267 -97 -201 -172 -107 269 -212 -6
4842 -6 188 106 167 98 -190 -95 -99 17 32 -143 130 -162 -32 -333 -18 17 41 20 51 -201 -94 92 -119 -135 153
$$ packed form
4679B32k56j82K21J47j49%K52m67J71J46p7nJ3k3K2l38K08K49k06k7k9k37L57
4702B2O9k96K26j01q5Q0J41r7j6J56k26J32O6J19j64J08K62n15K62J33k2k32j95
4725a73J86K7m37L78J4NL4j74K1l30N56k11J96P1l53K64P2q1k05L96j37k67J51
4748CJ32M0o8o5K02k36k68L49p3l46K75j40K32r5n7J14k31K98j35m8k5J18J5o5
4772g4J63n4j9J49l5k06N6q8l2J95J5l24K82j74L38l87K40p8KL88l87QJ83l31
4796a70k7L8K25k81K81J06pP9j14N1j78N0K97j66k18kK79k06p2J74O7j48P2L5
4820A65l28K35j73p7K4J12j13j03L76q1k90K61J84J0m69J70j04K9O5L76m81K06
4842fJ94q2O1o9k88R5mJ16J5j75K73k92J30l01L15L5K4k1L1k52J07J86k11j6K88
$$ plain form
4867 153 -101 98 215 -84 55 193 47 -289 141 269 -115 63 40 -56 307 -33 40 -74 -12 -212 134
4888 134 110 43 163 -205 26 -179 -208 -111 4 124 -218 272 28 103 224 -274 -130 225 -123 60 -17 67
4910 67 143 101 34 161 17 58 -41 47 -343 -113 58 -28 50 -126 47 -19 -124 -190 -167 3 -166 -293 -44 93
4934 93 333 -141 119 -32 -112 217 -80 157 20 239 -82 113 -5 139 77 -45 -121 -144 73 6 -289 -62
4956 -62 36 -295 -312 34 -116 -154 -34 133 -115 72 -96 36 187 71 -122 -73 -67 180 -21 -184 -1 235
4978 235 34 -96 134 -31 -47 31 327 -350 -142 57 -147 -30 73 -25 -20 -315 -73 -158 -110 -36 -161 323 90
5001 90 -50 -164 71 160 -64 -143 -140 194 266 17 99 11 -74 -32 -128 43 12 10 -96 -212 -71 11 -73 44 -154
5026 -154 86 -152 -52 128 -125 32 -84 122 88 -58 174 127 104 60 195 45 -137 -192 108 209 -5 1
$$ packed form
4867A53k54J99J17k99J39J38j46l36M30J28l84J78k3r6L63l40P3j14O2k00L46
4888A34k4o7J20l68K31k05k9R7J15J20l42M90k44P5J21m98J44L55l48J83p7Q4
4910F7P6m2o7J27j44M1r9Q8l90K30J71q6P8j76J73o6j05o6K3J70j69j27K49J37
4934I3K40m74K60j51q0L29k97K37j37K19l21J95j18J44o2j22p6k3K17o7k95K27
4956f2R8l31j7L46j50l8J20J67k48J87j68J32J51j16j93M9OK47k01j63J83K36
4978B35k01j30K30j65j6P8K96o77K08J99k04J17J03r8Nk95K42q5M8P4j25M84k33
5001I0j40j14K35Q9k24p9LL34P2k49Q2q8q5M2r6J71l1kj06j16J41Q2q4J17j98
5026a54K40k38J00J80k53J57j16K06l4j46K32m7k3m4J35j50j82n5L00J01k14O
$$ plain form
5048 1 56 -198 2 -111 -71 -116 92 74 -206 104 -152 -277 16 34 185 -23 59 -249 -121 92 -53 -70 86
5071 86 72 263 -142 -54 216 93 150 -91 -64 -304 60 -106 -115 31 71 -161 -102 25 -121 197 74 38 163
5094 163 15 73 64 77 361 -28 -103 -117 18 141 84 158 -9 105 38 207 81 34 -93 -104 37 -114 -73 -62
5118 -62 -119 -15 -235 44 53 150 -101 202 -99 88 37 -53 -83 243 27 94 118 170 62 317 245 355 129 19
5142 19 89 83 63 44 120 -72 93 -276 -44 -270 -114 -50 201 99 -27 -109 111 -85 91 -16 74 273 82
5165 82 148 37 62 122 77 -75 80 -32 -190 170 -16 -172 134 -39 151 -246 -78 76 -165 103 146 -123
5187 -123 -130 33 -116 86 -73 -391 -131 -39 49 218 -136 182 -87 -36 51 205 205 148 -127 108 64 380 43
5210 43 -95 14 160 -371 -30 -14 -7 -159 -85 -66 -43 57 -52 43 160 233 222 133 102 310 -141 31 -115 -7
$$ packed form
5048AN5k54K00j13M0m5K08j8k80L10k56j25K93J8J51k08Q2l08J28K13j45j7J56
5071H6j4J91m05Q8K70j23N7k41K7k40L64j66rJ46M0k32N9J27j46L18j23l6J25
5094A63j48N8rJ3K84l89p5j4J35J23n7P4j67J14o7J69j26m7j27j1J41j51M1J1
5118f2n7J04k20K79RR7k51L03l01J87n1r0l0L26k16O7K4N2j08K55p2J10k26j10
5142A9P0ok0j9P6j92J65l69K32k26J56O4K51j02j26q2K20j96J76j07R0J99j91
5165H2O6j11K5O0m5j52J55j12j58L60j86j56L06j73J90l97J68J54k41K68M3k69
5187a23pJ63j49K02j59l18K60R2Q8J69l54L18k69N1Q7J54%n7k75K35m4L16l37
5210D3j38J09J46n31L41J6Pj52P4J9K3J00j09R5J17P3j1q9l1K08m51J72j46J08
$$ plain form
5234 -7 348 389 -185 -127 114 -66 6 16 28 -146 -75 40 -80 112 72 -150 122 30 -150 -223 109 18 -42 172
5258 172 -185 -61 -16 89 156 59 -224 -23 77 98 348 -222 -43 131 27 -8 -36 -146 -49 -281 87 -113
5280 -113 -322 206 -186 -8 92 40 148 -201 18 24 -78 -73 26 53 -112 46 120 164 153 -111 182 22 201
5303 201 20 157 37 -18 74 -128 -102 -185 -51 61 -141 -29 -110 -225 -101 104 48 -44 85 55 -179 204 7
5326 7 129 31 -252 11 110 79 -246 70 -78 19 31 204 -36 -385 -105 76 -55 -167 4 -31 37 -236 -174
5349 -174 -97 39 77 -126 86 57 -19 101 128 -24 -53 202 61 153 231 238 71 -39 98 -150 -82 239 -35 168
5373 168 -174 44 -47 19 119 -129 -136 113 129 125 53 -1 -77 184 -110 -93 9 113 35 24 -14 1 33 73 143 86
5399 86 86 40 -30 54 175 60 74 76 -114 118 -61 91 139 114 -117 -86 -348 -140 6 -164 -141 -118 -65 164 0
$$ packed form
5234gL55M1n74N8K41j80P2J0J2j74P1J15j20J92m0k22K72r2j80p3L32r1o0K14
5258A72l57J24M5J05O7r7k83K01J00K1K50n70J79J74j04l5k8j10R7k32L68k00
5280a13k09N28l92J78J00n2J08l49K19Oj02NR9K7j65J58P4M4j1k64K93j60J79
5303B01j81J37j20n5R2k02K6q3J34J12k02J12q1j15J24K05n6r2J29l0k34L83j97
5326GJ22r8k83K63R9l1l25L16j48R7J2J73k40l49K80J81j31j12J71l5O8k73O2
5349a74P7J36L8k03K12k9p6J20K7j52k9K55j41R2P8Pj67j10J37k48O8L21k74K03
5373A68l42K18r1O6J00k48pK49J6mp2n4p6K61k94J7J02J04p8j1l8J5L2M0P0n7
5399H6%m6p0Q4J21j15J4Kj90K32j79J52M8k5k31L1k62K08J46j70K3K3N3K29j64
$$ plain form
5424 0 21 -32 327 -177 -213 -61 -87 49 69 -54 -152 357 -25 150 396 -31 31 131 -77 -163 -153 80 -296 167
5448 167 411 -27 -266 -149 -47 19 47 47 62 269 -160 213 56 117 2 87 73 130 175 -140 98 -136 135
5471 135 -77 194 -186 21 -34 -69 211 -155 -15 118 67 -70 77 65 -118 -219 -71 374 152 -175 102
5492 102 244 -131 68 30 194 341 112 -48 -65 25 0 -37 -27 -153 -110 -23 -137 -175 132 -6 76 -85 -44 -65
5516 -65 52 91 101 -60 6 119 -116 -246 197 103 -81 127 53 -163 -45 -30 -168 137 -9 8 -159 60 -123
5539 -123 60 -37 9 -179 -443 -9 -120 -104 203 10 -19 69 -131 -142 -66 -77 -50 53 299 266 95 73 144 484
5563 484 166 43 98 20 178 -29 39 90 -132 -217 -36 -17 45 15 110 -393 -46 -37 30 -39 -44 137 -106 -119 42
5588 42 81 91 144 98 130 -244 149 120 102 -94 182 -87 -8 -8 18 -187 -104 85 96 -194 -212 -92 8 216 -130
$$ packed form
5424@K1n3L59n04l6J52k6J36K0j23r8N09l82J75K46m27O2J00k08q6J0K33l76M63
5448A67K44m38k39J17J02O6K8%J5K07m29L73j57O1j15Q5j4N7M5l15K38k34K71
5471A35k12K71l80K07n5l5K80l66J40J33n1j37J47j2j83j01J48M45k22l27K77
5492A02J42l75J99l8J64J47k29j60j7R0k5l7J0j26M3Q7j14l8L07j38Q2j61M1k1
5516f5J17L9J0j61O6J13k35j30M43r4j84K08p4k16J18J5j38L05j46J7j67K19j83
5539a23J83r7M6j88k64M34j11J6L07j93k9Q8k00j1P6j1K7J03K46l3j71k2P1L40
5563D84l18j23N5p8J58k07O8N1k22q5J81J9O2l0R5n03L47RO7o9nJ81k43j3J61
5588D2L9J0N3m6L2l74L93k9j8j96K76k69P9%K6k05Q3J89J1k90j8J20J00K08l46
$$ plain form
5613 -130 -86 -44 23 -89 -55 -92 63 169 78 175 14 106 351 -62 195 -139 -16 -130 15 137 71 -74 -61
5636 -61 16 -192 79 -257 144 43 -127 -183 27 -33 -189 206 150 1 241 -3 -86 7 21 182 35 137 -88
5659 -88 122 105 223 158 -106 70 100 -42 191 -98 -38 -8 20 170 -13 -364 -165 215 85 -114 -109 115 -69
5682 -69 -189 384 142 66 70 -94 72 -115 58 -118 -29 -126 327 -116 -31 -8 -169 15 154 15 39 -130 172
5705 172 -59 -189 -77 -43 -233 -75 232 -125 46 -37 -35 -57 195 -95 89 -208 5 -50 104 -74 -85 52
5727 52 239 40 -74 40 165 -97 -34 -53 73 -122 93 57 54 -273 105 -76 217 145 -72 -31 28 -189 -1
5750 -1 -30 -6 -101 136 128 70 105 -48 38 -331 44 -99 27 -155 49 -110 -238 -100 -133 -57 -72 -7 -16 -89 153 -18
5776 -18 18 -24 144 -42 10 40 -49 -277 -19 36 -93 -34 -106 194 -111 -74 172 114 48 -88 -5 -46 -33 -33 107 -11
$$ packed form
5613a30M4M2O7j12L4l7J55J06r1R7j61R2K45m13K57l34J23j14J45J22o6j45J3
5636f1P7k08K71l36M01j01j70n6K10o0j56L95n6j49K40k44q3R3J4J61j47J02k25
5659h8K10j7J18o5k64J76L0j42K33k89O0L0K8J50j83l51J99L80j30j99NK24j84
5682f9j20N73k42p6Mj64J66j87J73j76Q9r7M53m43Q5K3j61J84J39j39K4j69L02
5705A72k31j30J12L4j90J58L07l57J71q3Kk2K52k90J84k97K13n5J54j78j1J37
5727E2J87j99j14J14J25k62O3j9J26j95K15l6ll27L78j81K93p2k17M1N9k17J88
5750ak9K4r5K37qn8L5j53Q6l69L75j43J26j82K04j59j28J38l3P6j5O5rp3K42j71
5776a8L6m2J68j86N2L0q9k28K58N5j29N9p2L00l05L7K46n8o6j36Q3m1J3%J40j18
$$ plain form
5802 -11 138 -16 32 -106 -24 14 -6 -92 230 191 -50 -16 189 72 53 74 238 103 -58 127 209 216 15 -98
5826 -98 -51 -184 -195 -31 13 -13 -27 -67 -140 -98 -52 -75 -212 5 125 -14 344 32 53 84 -118 11 79 130 -48
5851 -48 -19 239 77 47 54 -71 -127 -7 -171 187 -123 -59 -213 -55 111 -223 -119 -121 -229 -19 41 -184 -38
5874 -38 125 131 -12 67 230 114 122 -107 -58 -134 45 6 40 202 202 217 -270 43 -137 209 216 25 -251 -204 -147 -140
5900 -140 -51 106 192 95 73 -135 204 -198 167 -28 -31 108 -58 -13 60 50 33 -75 78 18 -48 37 80 26 -9
5925 -9 226 -21 -35 30 57 -94 -43 -227 171 -92 -74 -87 -137 -13 -74 -106 99 251 -10 -175 148 47 175 -148
5949 -148 144 -154 3 -176 300 -58 54 120 -2 -113 -84 5 -131 36 -19 30 -42 30 115 111 29 -54 -232 132
5973 132 128 -100 -94 -132 -43 187 -202 -280 -13 -83 256 -107 -41 201 -83 55 124 61 19 -125 -78 38 -229 -1
$$ packed form
5802a1J49j54M8j38Q2L8k0q6L22l9k41L4K05j17j9K1J64j35j61J85Q2Pk01j13
5826i8M7j33j1J64M4k6j4m0p3M2M6k3j37K17J20j39L58l12K1L1k02J29O8N1j78
5851d8K9K58j62l0Pj25n6J20j64L58l10O4j54J58J66l34J04kj08K10O0k25J46
5874c8J63Oj43P9J63j16Qk29M9p6J79l9L4J62%J5m87L13j80L46Pj91k76M7N7P
5900a40Q9J57Q6r7k2k08L39m02L65j95lJ39j66M5P3j0j7j08J53o0o6Q5M3n4l5
5925iK35k47j4O5K7j51N1j84L98k63J8j3n0J24o1l2K05J52k61j65L23j01J28l23
5949a48K92k98J57j79M76l58J12O6j22j11K9Q9j36J67n5M9p2P2Q5mq2q3j78L64
5973A32mk28Ol8Q9K30l89p8K67p0L39l63O6K42k84J38O9o3m2j44M7J16k67K28
$$ plain form
5997 -1 -216 -103 -31 121 181 201 -12 -197 -81 -21 -25 309 -129 -32 -373 -280 296 11 113 127 -70 -121 28 30 163
6022 163 3 74 -134 -2 -224 -165 -134 -288 -312 -32 -256 -73 -47 -24 134 96 148 -30 -117 -122 105 13 6 -139 -3
6047 -3 222 186 88 10 -144 91 218 9 111 -56 -109 -253 -68 87 -154 -343 -287 -22 -20 -98 81 45 24 74
6071 74 189 34 -103 229 82 181 261 -85 27 213 -45 301 105 -54 88 -116 -136 243 17 128 -231
6092 -231 -28 60 -237 -125 -366 44 -28 -65 65 99 -144 0 -78 -67 126 65 -106 74 121 130 40 199 92 -101
6116 -101 -80 127 -32 -170 -101 -39 -98 -17 -103 -74 45 88 -168 -32 -99 -136 -255 -114 -65 192 -3 2 -9 127 42
6141 42 81 -114 187 55 -36 28 -48 65 -42 101 -241 -29 -97 7 -243 345 -55 -69 79 -58 179 47
6163 47 177 150 91 11 -111 160 -88 118 101 26 88 132 -63 110 107 120 -14 54 68 15 52 -68 -77 -78 1 -179 102
$$ packed form
5997ak15J13P2J52O0K0k13j85J16O0mL34m38R7l41R3N76k85J02J4j97n1J49KJ33
6022A63j60P1k08J32k22N9L1j54k4K80k24J83K6K3J58l8N2j78q7nK27r2pj45J36
6047cK25l6r8p8j54K35J27k09J02j67n3j44J85J55k41j89N6K65Kp8J79l6k1N0
6071G4J15j55j37L32j47R9Q0l46J12J86k58L46j96j59J42k04k0L79k26J11l59
6092b31K03Q8k97J12k41M10p2l7J30L4k43J44p8J1J93o1j71J80M7Rr0J59j07j93
6116a01K1K07j59j38O9O2n9Q1q6K9J19M3k56J36o7l7j19J41M9K57j95Nj1J36q5
6141D2L9j95L01j32r1O4p6J13j07J43l42K12o8J04k50N88m00j4J48j37K37j32
6163D7J30k7n9q0j22K71k48K06j7p5O2M4j95J73lJ3j34O8J4n3L7j20rjP9j80K81
$$ plain form
6190 102 -59 -60 -54 -282 -93 -56 -184 165 -42 -85 -279 126 62 -15 81 -3 171 -33 -16 68 -79 -34 58 67 -44
6215 -44 -137 -104 -191 -169 -80 -25 13 144 174 -74 71 -176 -36 -110 -31 -139 57 -268 -15 68 -100 121 253 -195
6239 -195 -9 176 -109 -49 193 65 55 93 201 -29 158 -79 -135 -146 -125 -172 -18 -22 128 -89 -30 -12 -38 68
6263 68 128 -153 -138 -131 233 129 2 -78 98 -74 118 -143 -162 -48 -374 -58 -63 203 12 -184 -27 -13 -132
6286 -132 -76 -10 -258 -140 5 57 144 37 -198 -183 -81 -136 161 15 102 62 314 194 13 -75 -39 -13 95 -15
6310 -15 -68 29 -103 -70 -314 1 102 -102 -91 -89 -21 -193 0 -227 -28 -205 92 -113 -34 49 -11 16 52 66 169
6335 169 92 -134 -99 166 -1 -164 -98 -275 13 164 -186 158 36 -57 -162 -12 202 -95 -95 -63 143 -153
6357 -153 77 85 54 236 -126 -74 186 132 66 92 15 153 114 -5 -139 87 152 -20 -216 4 187 -61 -40 119
$$ packed form
6190A02j61jOk28J89L7j28L49k07m3j94M05o4p7R6q4J74k04J7Q4j47M5R2Rj11
6215d4r3L3q7K2Q9N5L8J31L0k48J45k47J40p4P9j08J96l25K53Q3j68K21J32m48
6239a95J86J85k85O0K42j28j0L8J08k30J87k37n6j1K1m7J54mJ50k17N9J8k6J06
6263F8O0k81J5PL64j04j27q0J76j72J92k61j9J14l26L16nK66j91j96J57J4j19
6286a32N6O6k48J18J45N2Q7j07k35J5J02n5K97j46Q7m0K52j20j81q8L6K6J08j10
6310a5n3R7j32L3k44L15J01k04J1KO8j72J93k27J99j77K97k05P9Q3o0K7L6J4J03
6335A69p7k26L5K65j67j63O6j77K88J51l50L44j22r3j05J50K14k97%L2K06k96
6357a53K30Ql1J82l62N2K60n4o6K6p7J38l9j19j34K26O5j72j96K20J83k48K1J59
$$ plain form
6381 119 -76 -172 -192 4 -74 -518 -88 11 0 -57 -107 229 -37 114 171 171 -52 209 -164 67 222 -74 95
6404 95 141 -201 -47 65 80 156 -59 41 81 -200 115 -26 -117 78 -315 -68 119 -295 -121 295 140 -28
6426 -28 154 -59 228 89 147 184 311 -33 -16 73 13 54 -206 127 43 -129 32 105 -240 52 22 62 -145 -33
6450 -33 -158 44 -22 -73 23 -74 12 -87 -165 69 118 -22 167 194 169 -365 85 -118 82 50 181 -16 115 175
6474 175 -17 203 158 27 -41 -42 -24 -193 -121 -37 -29 241 -90 -137 -164 -362 68 154 163 258 324 136 -149 92 258
6499 258 76 14 -285 -83 -132 -31 -70 93 -27 -68 17 -122 58 -191 -100 50 -158 -129 -219 -177 40 -153 -117
6522 -117 133 39 -68 -133 50 8 6 147 133 -92 148 184 77 -15 276 195 8 61 177 -11 -236 -96 -89 -345
6546 -345 -36 56 -193 145 158 -73 -158 104 237 -225 -76 -46 72 -80 81 254 68 134 6 -43 -118 55
$$ packed form
6381A19j95r6k0J96p8m44M30R9j1n7n0L36k66J51N7%k23K61l73K31J55k96J69
6404I5M6l42J54J12J5P6k15J00M0k81L15j41r1J95l93K47J87m14J74M16j55j68
6426b8J82k13K87j39N8L7J27l44J7Q9o0M1k60L33q4j72J61P3l45K92l0M0k07J12
6450c3j25K02o6n1R6r7Q6r9p8K34M9j40J89K7k5n34M50k03K00l2J31j97J31O0
6474A75j92K20m5j31o8jJ8j69P2Q4QK70l31m7k7j98M30Q6RR5O6j88k85K41J66
6499B58j82o2k99K02m9J01l9J63j20m1Q5j39J80k49R1J50k08K9r0M2K17j93L6
6522a17K50r4j07o5J83m2kJ41j4k25K40L6j07r2K91q1j87N3J16j88k25J40Pk56
6546c45L09R2k49L38J3k31q5K62J33m62J49L0J18j52J61J73j86O6j28m9p5J73
$$ plain form
6568 55 -157 -105 -42 62 24 -108 10 64 -59 -73 -113 100 33 -138 19 -47 -144 -187 -142 -42 114 -223 38 37 -9
6593 -9 -254 110 44 58 78 99 208 140 -149 -2 -164 105 21 146 -73 -53 58 -206 -35 91 110 -125 -81 133
6617 133 -8 -54 -34 -71 166 -82 139 -48 -78 116 182 -98 -145 85 -112 -22 162 -43 81 -261 -135 116
6639 116 63 -14 -75 83 -107 -9 -18 -120 -161 -183 28 135 -8 -48 120 380 -44 112 158 85 -36 -50 21 147
6663 147 28 91 69 -45 -186 -139 10 36 9 -122 -78 -1 -12 -29 266 -73 -123 25 -258 92 133 227 -102 45
6687 45 -51 84 -2 161 153 -63 32 6 -93 193 -152 289 128 -98 -17 -52 -75 -52 10 -159 67 -141 -131 -140 27
6712 27 -24 89 49 -56 -226 31 108 5 -12 436 -45 31 80 -189 19 16 -110 20 122 34 -242 -32 37 -158
6736 -158 -89 -253 26 101 -19 -206 -23 -7 40 -79 61 83 -57 157 79 -61 197 113 212 113 236 170 -17
$$ packed form
6568E5k12N2O3J04l8j32J18N4j23j4m0K13o7j71J57o6r7m3M5J00J56l37K61jm6
6593ik45L64o6J4K0K1J09o8k89J47j62K69q4J25k19K0J11k64J71J26J9k35M4K14
6617A33j41m6K0l7K37k48K21j87l0J94O6k80m7K30j97R0J84k05J24l42J26K51
6639A16n3p7o1J58j90R8rj02m1k2K11J07j43m0J68K60m24J56M6p3j21j4P1J26
6663A47j19O3k2j14j41M7J49K6k7j31M4P7j1j7K95l39n0J48k83L50M1R4l29J47
6687D5r6J35q6J63qk16R5k6r9K86l45M41j61k26Q1l5k3K3O2j69K26k08J0rJ67
6712B7n1J13m0j05j70K57P7j03j7M48m81P6M9k69K08lj26J30J02q8k76K10O9j95
6736a58O9j64K79P5j20j87J83J6M7j19J40K2j40K14p8j40K58q4R9r9J23o6j87
$$ plain form
6759 -17 -109 156 261 190 26 201 -58 81 74 268 267 5 -300 -90 -24 124 -263 9 -55 28 35 -285 53 -116
6783 -116 52 -130 42 102 172 52 102 190 -176 -60 78 70 -40 -36 -46 -125 177 245 -45 -304 -159 93 -215 145
6807 145 61 -418 132 41 -192 -183 -56 4 -257 -3 279 112 296 23 -67 34 57 -8 214 -321 -93 -21 -2
6830 -2 -61 -33 62 118 38 -77 190 11 -177 -138 153 188 50 -68 55 104 205 206 -227 69 201 -222 244 80
6854 80 63 96 65 176 -134 30 -68 -242 -59 -16 82 -71 85 -171 64 -9 62 195 57 -6 -248 -90 60
6877 60 197 34 268 -10 -203 134 -16 312 105 -40 -176 103 -205 56 11 127 -80 -31 -229 79 -107
6898 -107 39 -99 -87 -128 144 -13 136 -72 -52 -43 -58 356 107 18 34 255 133 -269 -13 160 -178 -19 -23
6921 -23 -68 -70 -64 29 80 -52 146 144 168 -67 -233 -231 -70 -77 59 -56 15 86 -73 -70 251 121 123 171 91 69 -247 -75
$$ packed form
6759a7r2K65J05p1j64J75k59J39pJ94jk62l05K10O6J48l87K72o4Q3Pl20L38j69
6783a16J68j82J72O0P0j20N0Q8l66J16J38qj10Mj0p9L02O8k90k59J45K52l08L60
6807A45q4m79N50r1k33RJ27O0k61K54K82j67J84k73r0J01K3o5K22n35K28P2J9
6830bn9K8R5N6q0j15K67j79j88L9K91L5j38j18J23M9J01Jm33K96J32m23M66j64
6854H0j7L3l1J11l10J64r8j74J83M3R8j53J56k56K35p3P1J33j38o3k42J58J50
6877F0J37j63K34k78j93L37j50L28k07j45j36K79l08K61m5J16k07M9j98L08j86
6898a07J46j38J2m1K72j57J49k08K0Rj5M14k49q9J6K21j22m02K56J73l38J59m
6921b3m5kOR3N1j32J98kK4k35j66KJ61pJ36j15P1P1j59LL21j30KM8q0k2l16J72
$$ plain form
6949 -75 -10 -26 -57 -73 -62 -79 198 -65 47 -86 312 -132 -111 141 -52 -300 -157 56 -164 -209 -33 -162 -21
6972 -21 -14 9 113 76 122 -19 -116 -198 74 -84 37 116 189 52 -438 64 159 -101 -7 190 73 31 -34 -25 -314
6997 -314 0 -119 -15 -224 -335 -128 12 132 -163 192 41 21 -107 -162 -131 -27 113 53 119 -5 232 -1
7019 -1 -55 -127 -21 134 -116 23 24 26 -167 39 146 -138 -390 26 -54 -8 100 209 152 22 223 152 -104 -182
7043 -182 45 187 20 36 206 91 59 -21 31 69 -223 190 -22 -12 -203 -165 16 -249 -125 9 -252 -240 3
7066 3 56 71 -201 60 -89 170 56 261 -72 103 227 -169 149 251 179 -41 13 -27 7 6 202 296 -197 2
7090 2 29 -1 129 -116 -66 166 -150 68 -138 121 -125 84 51 -121 145 -177 16 131 -243 25 64 -142
7112 -142 -121 66 177 95 81 256 -3 80 36 50 -132 80 -186 -93 71 -59 102 89 119 30 -154 -18 -177
$$ packed form
6949g5O5j6l1j6J1j7K77k63J12j33L98m44K1K52j93k48J43K13k20m5J76j29J41
6972b1PK3J04l7M6j41r7q2K72j58J21P9P3j37m90N02R5k60R4J97j17m2o5Rk89
6997c14L14j19J04k09j11K07J40J20k95L55j51k0j28n5L1J04J40o0O6j24K37k33
7019an4p2J06J55k50J39JKj93K06J07k84k52M16q0M6J08J09n7j30K01p1k56p8
7043a82K27J42j67J6J70j15l2q0N2L8k92M13k12J0j91L8J81k65J24J34k61J2K43
7066CN3J5k72K61j49K59j14K05l33J75J24l96L18J02p2k20N4m0L4jJ96R4m93J99
7090BK7l0J30k45N0K32l16K18k06K59k46K09l3j72K66l22J93J15l74K68L9k06
7112a42K1J87J11q2j4J75k59Q3m4J4j82K12k66R3J64j30J61j3L0q9j84J36j59
$$ plain form
7135 -177 40 60 -168 -128 -63 190 -69 56 -55 25 35 138 -44 -85 29 41 36 -112 -32 -79 -222 -194 -62 -89
7159 -89 20 31 -70 35 -114 -89 29 -67 -177 -36 -231 87 1 -83 141 108 -12 142 -66 -105 78 -193 -3
7182 -3 -21 -142 92 -88 -148 62 8 84 -54 90 151 61 -186 -33 -42 -248 17 93 196 -191 -246 228 -25 -92
7206 -92 82 -61 178 -51 373 -1 -63 199 108 -60 -113 -147 -99 339 -198 -195 -95 48 -198 -102 92 -83 -176
7229 -176 -103 -21 109 13 152 130 162 -34 1 41 251 -3 -68 -52 -3 -22 257 313 126 -225 108 123 44 -38 27
7254 27 -94 -205 -94 19 -44 142 -81 128 100 -1 -22 -116 106 -85 -2 170 -94 -162 95 40 -118 -58 9
7277 9 173 -148 -52 17 -56 -52 3 -59 141 -8 32 -259 83 92 112 -177 -112 -125 -207 50 47 -131 49 -267 -121 169
7303 169 215 -23 -170 76 212 0 -294 -52 -270 -65 -32 -130 -94 -217 -68 8 3 -264 -74 -200 95 66 23
$$ packed form
7135a77K17K0k28M0O5K53k59J25j11Q0J0J03j82m1J14J2nj48Q0m7j43K8J32k7
7159h9J09J1j01J05j49K5J18r6j10J41j95L18q6q4K24l3j20J54k08l9J83k71J90
7182cj8j21K34j80o0K10n4P6j38J44O1r0k47J53rk06K65P6J03l87n5M74k53o7
7206i2J74j43K39k29M24l74o2K62r1j68n3l4M8M38n37LJ00J43k46R6J94j75r3
7229a76P3Q2J30r6J39k2L2j96L5M0K10k54o5J6M9j9K79N6j87l51L33J5p9q2O5
7254B7j21j11J11J13o3J86k23K09k8j01k1r4K22j91Q3J72k64o8K57n5j58O0O7
7277IJ64l21R6O9p3MN5o2K00j49M0k91L42RK0k89O5j3q2K57lj78J80l16J46K90
7303A69M6k38j47K46J36k12k94K42k18K05L3r8L6j23J49P6nk67J90j26K95k9m3
$$ plain form
7326 23 -227 241 -251 -79 -91 -101 -49 111 108 38 172 24 -211 93 -2 56 103 -160 19 -6 39 -160 -34 -98
7350 -98 -1 -31 106 -233 -136 5 189 175 -63 22 114 -198 76 -32 204 124 -33 178 53 65 279 -100 6
7373 6 286 45 -60 -1 125 -94 -212 51 126 76 -14 69 -186 170 -172 -24 -55 -12 -139 -141 58 -152 -18 112
7397 112 167 84 -200 295 33 136 -4 -61 280 -125 -32 -105 70 122 -148 39 -296 -101 53 -175 -139 -92 -53
7420 -53 162 10 -308 256 -217 117 -220 -149 23 165 4 -39 40 245 235 101 101 -113 127 -92 -101 76 -6
7443 -6 -239 -90 -255 -143 -78 61 -135 118 -26 -37 -82 -42 63 -62 -101 316 139 70 -62 -25 -60 -157 132 -95
7467 -95 -39 141 74 73 71 17 -93 -203 4 -59 -66 -391 -81 68 2 -100 28 -61 -24 56 -184 -112 81 -102 217
7492 217 93 45 -97 -119 63 100 107 95 42 15 -85 -12 45 -50 -135 104 158 -32 -6 -207 -177 -81 -222 -288 168 59
$$ packed form
7326B3k50M68m92J72j2j0N2J60lp0J34j48k35L04r5N8M7k63J79k5M5j99J26o4
7350i8R7l0J37l39R7J41J84j4k38Q5R2l12K74j08K36q0j57K11j25J2K14l79J06
7373FK80k41j05N9J26k19j18K63P5n0r0Q3k55L56l42J48l1M3j27kJ99k10J34J30
7397A12N5q3k84M95k62J03j40n7L41m05R3p3J75N2k70J87l35J95J54k28L6M7L9
7420e3K15j52l18N64m73L34l37P1J72J42j61m3P9K05j0j34%k14K40k19rJ77q2
7443fk33J49j65J12O5J39j96K53j44j1m5M0J05j25l9M17j77o9j32L7l5r7K89k27
7467i5N6J80o7jkn4j10j10K07o3pl25L10J49o6j02J28q9L7Q0k40P2J93j83L19
7492B17j24m8j42k2J82L7Pj2n3k7j00P3N7r5q5K39N4j90K6k01L0R6j41o6M56j09
$$ plain form
7518 59 -226 165 80 -15 -188 -70 -139 159 28 149 -3 23 275 83 234 -8 -83 -33 -187 -19 -203 -163 -122
7541 -122 31 -117 25 -294 20 -58 52 207 -180 -33 82 -34 -72 64 186 -69 -132 61 200 -30 -146
7562 -146 -70 -93 5 226 -73 -22 -31 -47 12 -70 18 -216 -140 -116 179 -273 -51 72 32 -111 -166 39 74 70 12 -69
7588 -69 -200 121 -138 -13 120 104 -90 -39 45 77 264 -166 -83 -289 147 -25 -107 222 -131 -108 136 162 235
7611 235 45 90 74 29 90 -1 -64 -164 72 -126 279 39 146 87 -129 241 -139 -72 181 67 96 134 -153
7634 -153 -55 -11 49 26 -268 57 38 -125 105 74 122 46 -66 -139 -57 -79 37 112 80 4 -218 -93 118 173 32
7659 32 -22 85 -57 -21 -43 -82 -71 -112 -156 -141 -43 -120 7 -315 115 149 -105 -163 -55 25 -64 -162 -310 183 -46
7684 -46 103 -86 123 6 21 6 132 457 -111 79 -175 -94 -51 92 212 136 52 -140 25 153 -177 -25
$$ packed form
7518E9k85L91q5r5j73J18o9K98j31J21j52K6K52j92J51k42p5N0j54J68j84M0M1
7541a22J53j48J42l19L14p8J10J55l87J47J15j16l8J36J22k55o3J93J39k30j16
7562a46P6k3R8K21k99N1rj6N9q2Q8k34P6K4K95m52K22J23m0j43n5K05L5mn8q1
7588f9j31L21k59J25J33j6j94N1Q4L2J87m30Q3k06M36j72q2L29l53K3K44K6P3
7611B35j90M5j6m5O1r1o3j00K36j98M05k40J07n9k16L70l80O7K53j14K9L8k87
7634a53R8M4O0k3k94L25j9j63K30l1M8p6j12p3Q2k2J16P5l2p6k22J25K11N5j41
7659C2n4J07j42L6k2l9J1m1m4J5R8p7J27l22M30L4k54n8J08Q0q9r8j48M93k29
7684d6J49j89K09j17J5j5J26L25n68J90k54Q1M3J43J20p6q4j92J65J28l30J52
$$ plain form
7706 -25 -162 65 -176 11 -126 -163 92 36 139 -68 -112 -186 33 -7 232 99 289 -111 85 88 -18 -77 -68 35
7730 35 -19 116 136 61 -202 -34 122 -17 25 50 -45 -170 56 -285 113 4 197 101 50 -21 139 66 -24 -48
7754 -48 -107 292 -144 257 -5 110 210 19 237 -51 47 -96 197 239 -28 34 79 -215 -51 55 127 141 80
7777 80 -59 -183 -237 54 93 -76 -34 -7 -10 -242 67 -6 96 61 10 -224 313 229 -111 37 -323 -249 -297 -208 -338
7802 -338 -97 -107 4 -16 -77 13 -130 71 -13 -215 -17 118 -204 191 91 195 -103 -218 -75 122 -48 62
7824 62 -70 48 59 40 21 215 -142 -64 180 -56 -70 209 -14 -136 10 -42 -68 70 -70 -49 -27 149 171 61
7848 61 -1 57 32 2 -65 -54 -88 -116 95 -48 180 -231 33 -55 52 -183 -44 -210 49 -192 -249 74 97 56
7872 56 -179 93 -263 -71 -41 -171 -347 -20 -58 54 -104 -128 -90 -88 -187 163 -120 -49 -40 -148 44 -47 133 59
$$ packed form
7706b5j37K27k41J87j37l7K55n6J03k07m4p4K19m0K39j33J90m00J96Lj06n9RJ03
7730C5n4J35K0p5k63J68J56j39M2K5r5j25K26l41L98j09J93r6n1p1J60p3r0k4
7754d8n9L99m36M01k62J15J00j91K18k88R8j43K93M2k67O2M5k94J64J06P2J4o1
7777H0j39j24n4K91L9j69M2K7lk32L09p3J02l5n1k34N37q4l40J48l60P4m8Q9j30
7802c38K41j0J11k0o1R0j43K01q4k02J98J35l22L95j00J04k98j15J43J97j70J10
7824F2j32J18J1j9j9J94l57P8K44k36j4K79k23j22J46n2k6J38j40K1K2J76K2j10
7848F1o2N8k5l0o7J1l4k8K11j43K28m11K64q8J07k35J39j66K59k41n7L23K3m1
7872E6k35K72l56J92L0j30j76L27l8J12j58k4L8Kr9L50k83P1Rj08J92r1J80p4
$$ plain form
7896 59 -116 -119 -54 -179 178 -106 139 -5 -99 -285 138 -183 -224 44 -40 132 130 190 117 73 -248 214 -157 1
7920 1 -65 -90 -66 381 -104 -175 90 64 35 151 -60 -10 -168 -114 -117 14 -117 141 68 195 -228 72 -45 43 118
7945 118 -182 98 48 25 17 184 55 -131 -119 90 -14 -194 182 44 -58 148 -219 27 9 172 83 -210
7967 -210 -90 -87 -39 22 -46 98 80 84 122 127 -32 206 135 115 -59 111 172 44 -30 4 -119 59 -15 92 62 -186
7993 -186 -37 58 40 4 194 -200 24 -201 -125 101 8 -14 -116 66 -23 62 36 -28 141 -139 215 -102 46
8016 46 -68 67 92 -52 271 -13 117 6 -248 -100 263 -106 -195 -183 -96 6 41 -79 75 -138 -76 -195
8038 -195 93 23 -97 -90 -26 140 83 62 -28 267 1 104 -88 195 -132 82 24 198 -180 -141 43 -47 95
8061 95 -279 -355 -60 -56 -200 12 -67 -270 81 -49 49 -60 4 -77 -39 132 47 -12 112 27 14 28 -192 3 -100
$$ packed form
7896E9j75lO5j25L57k84K45j44r4j86M23l21m1K68q4J72kO0p3m4l21M62l71J58
7920Ao6k5K4M47m85p1K65k6k9J16k11N0j58N4lJ31j31K58p3J27m23L00j17Q8P5
7945A18l00K80n0k3qJ67j29j86J2K09j04j80L76j38j02K06l67K46j8J63q9k93
7967b10J20LM8O1o8J44j8ML8Nj59K38p1k0j74J70O1j28p4L4j23J78p4J07l0k48
7993a86J49R5j8l6J90l94K24k25P6K26r3k2j02J82q9Q5k6o4J69k80L54l17J48
8016D6j14J35K5j44L23k84J30j11k54J48L63l69q9J2Q7J02L5j20J54k13O2j19
8038a95K88p0j20PO4J66n7k1r0K95k66J03j92K83l27K14n8J74l78L9J84r0J42
8061I5l74p6K95Mj44K12p9k03L51j30R8j09O4q1L8J71q5n9J24q5j3J4k20J95j03
$$ plain form
8086 -100 53 -21 68 56 20 -71 126 -194 -82 -63 -40 177 -134 119 -115 80 -31 -11 -14 -4 -16 149 -58 114
8110 114 250 159 25 -47 31 26 159 -149 -104 -63 90 -44 -132 74 61 108 -46 61 -242 -37 77 77 -126 -13
8134 -13 40 -14 -280 61 -8 55 -108 -119 92 -22 -68 78 -49 -147 -119 -98 30 115 -4 67 -159 -225 -14 -34 -155
8159 -155 -59 -50 -147 -223 60 21 -195 -109 -244 79 61 37 280 -73 118 93 -47 41 61 51 -268 163 -70 -80 -21
8184 -21 13 -154 -91 -27 2 112 -161
$$ packed form
8086a00J53p4Q9j2l6r1J97l20J12J9K3K17l11K53k34J95j11K0lJ0j2J65k07J72
8110A14J36r1j34p2P8nJ33l08M5M1J53j34q8K06j3M7j54J07l03K05J14%k03J13
8134a3N3n4k66L41o9O3j63j1K11j14m6J46j27r8K8K1J28Q5j19P1k26o6K11k0j21
8159a55R6Rr7p6K83l9k16Q6j35L23j8k4K43l53J91k5j40Q8K0j0l19M31k33j0N9
8184b1L4j67O3O4K9J10k73
8191a61
$$ Imaginary data points
##PAGE= N=2
##DATA TABLE= (X++(I..I)), XYDATA
$$ plain form
0 0 0 0 0 0 0 0 0 0 0 0 0 0 6 -8 8 -8 8 -16 16 -22 24 -30 32 -40 48 -56 64 -73 84 -95 109 -125 141 -158
34 -158 179 -200 224 -254 281 -312 349 -387 428 -473 521 -577 637 -701 773 -850 938 -1032
52 -1032 1140 -1257 1393 -1543 1718 -1921 2157 -2440 2784 -3214 3766 -4509 5553 -7139 9812
67 9812 -15146 29800 -152846 -449160 58239 324631 26387 -135717 98294 188021 69764
78 69764 22962 71680 104230 176750 187195 53572 -66960 2156 150247 143225 -29376 -69461
90 -69461 68132 74074 -97534 -121247 24843 59637 -13047 -14246 -39587 -90926 23854 137974
102 137974 10191 -82205 66757 141608 6291 -31712 80949 100268 47877 43106 8507
113 8507 -18461 62832 101743 -5971 -75681 -1757 50134 -31863 -102923 -34770 46782 -19830
$$ packed form
0@%%%%%%%%%%%%Oj4J6j6J6k4L2l8M6n4O2p2Q8j04J20j37J57j79K04k34K66k99
34a58L37l79M24m78N35n93O61p36Q15r01R94j098J214j338J474j623J788j970
52a032K172k397K650k936L261l639M078m597N224n998O980q275J0062j2692J6951
67I812k4958M4946j82646k96314N07399K66392k98244j62104K34011Q9727j18257
78F9764m6802M8718L2550P2520J0445j33623j20532O9116J48091p022j72601m0085
90f9461J37593N942j71608k3713J46090L4794p2684j199k5341n1339J14780J14120
102A37974j27783r2396J48962P4851j35317l8003J12661J9319n2391m771l4599
113H507k6968Q1293L8911j07714o9710P3924N1891q1997p1060O8153Q1552o6612
$$ plain form
125 -19830 -130325 -77052 33468 -26568 -102576 -1413 50159 -73630 -88667 62359 65860
136 65860 -78744 -56712 79625 54847 -39854 -8636 53541 33886 -3687 -7879 328 19595
148 19595 41926 17480 -37656 -38437 10071 20807 -29754 -52335 11516 46073 -39003 -91592
160 -91592 -11980 42896 -11870 -39213 4047 -2115 -39426 -5740 24826 -9987 -7402 32506
172 32506 2924 -42093 1060 54449 19891 -20559 3462 11219 -16784 -6111 25777 17395
184 17395 -8870 -7625 -2605 -25329 -26585 22617 39324 -15762 -48360 -4611 18967 -30451 -36883
197 -36883 36722 42330 -35948 -46214 14783 26902 -4316 2573 21209 7204 3340 12801 -2503
210 -2503 2424 41155 34657 -18125 -21608 29334 39352 -4359 -10833 21044 15132 -21360 -23637
$$ packed form
125a9830j10495N3273J10520o0036p6008J01163N1572j23789j5037J51026L501
136F5860j44604K2032J36337k4778r4701L1218O2177j9655l7573m192Q207J9267
148A9595K2331k4446n5136p81M8508J0736n0561k2581O3851L4557q5076n2589
160i1592P9612N4876n4766k7343M3260o162l7311L3686L0566l4813K585L9908
172C2506k9582m5017M3153N3389l4558m0450K4021P757k8003J0673L1888q382
184A7395k6265J245N020k2724j256M9202J6707n5086l2598M3749K3578m9418o432
197c6883P3605N608p8278j0266O0997J2119l1218O889J8636j4005l864R461j5304
210b503M927L8731o498n2782l483N0942J0018m3711o474L1877n912l6492k277
$$ plain form
223 -23637 10435 20707 -4499 -13740 -7477 -19056 -19009 11862 18717 -11487 -16589 12908 6564 -24691
237 -24691 -5654 29620 16300 -6564 -1701 4806 3074 11391 16678 -2362 -11336 9656 11736
250 11736 -14092 -16091 9419 11824 -19013 -32916 -4218 13063 -4860 -14706 -5899 -4209 -11732
263 -11732 -7938 4096 3607 3479 11806 1102 -12382 3000 21571 13941 1863 8417 12779 -1215
277 -1215 -3078 12400 8873 -5611 -2790 4745 -4902 -17322 -4503 11244 -7248 -25486 -10407
290 -10407 5121 -3343 -13211 -2260 6679 -5751 -11611 -1253 5550 9535 11394 5046 -1100 1299
304 1299 9544 10242 4221 10277 13920 1467 -8211 -1682 7393 3491 -5629 -2692 -1249 -9834 -7666
319 -7666 255 -2800 -9504 -7221 -2161 -6512 -8314 3373 5871 -4229 -4119 3044 4501 3631 7739
$$ packed form
223b3637L4072J0272k5206r241O263j1579M7L0871O855l0204n102K9497o344l1255
237b4691J9037L5274j3320k2864M863O507j732Q317N287j9040q974K0992K080
250A1736k5828j999K5510K405l0837j3903K8698J7281j7923r846Q807J690p523
263a1732L794J2034m89j28Q327j0704j3484J5382J8571p630j2078O554M362j3994
277a215j863J5478l527j4484K821P535r647j2420J2819J5747j8492j8238J5079
290a0407J5528q464r868J0951Q939j2430n860J0358O803L985J859o348o146K399
304A299Q245O98o021O056L643j2453r678O529R075l902r120K937J443q585K168
319g666P921l055o704K283N060m351j802J1687K498j0100J10P163J457q70M108
$$ plain form
334 7739 12742 6268 118 5207 7026 2389 3947 9990 8296 -3415 -7717 939 720 -6713 -4628
349 -4628 -1242 -6537 -12925 -10914 -5159 -6591 -7967 -5399 -6942 -7463 -2596 322 1551 1300 587 646
365 646 751 6578 11840 7653 3345 4181 5308 3893 2471 6572 7423 -974 -4254 -2357 -5138 -6384
381 -6384 -3906 -3235 -8524 -12425 -7751 -5332 -9956 -10055 -6078 -3020 -2543 -6421 -5292 1171 4305 3269
397 3269 433 48 4181 8203 8543 2901 1920 10543 7989 -5346 -4303 7859 10859 847 -8388
412 -8388 -7884 -2293 1665 -2785 -10047 -2445 6613 -3016 -11611 -4099 6411 9702 4977 -1710 635
427 635 13074 17947 5924 1528 15841 20779 12266 8234 7595 11649 18117 12784 -341 489 12589
442 12589 8521 -5574 -2892 4296 805 -981 -6749 -15477 -5731 8582 -1497 -17058 -9226 2696
$$ packed form
334G739N003o474o150N089J819m637J558O043j694j1711m302Q656k19p433K085
349d628L386n295o388K011N755j432j376K568j543n21M867K918J229k51p13N9
365F46J05N827N262m187m308Q36J127j415j422M101Q51q397l280J897k781j246
381f384K478O71n289l901M674K419m624r9L977L058M77l878J129O463L134j036
397C269k836l85M133M022L40n642r81Q623k554j3335J043J2162L000j0012r235
412h388N04N591L958m450p262P602R058r629q595P512J0510L291m725o687K345
427F35J2439M873j2023m396J4313M938q513m032o39M054O468n333j3125Q30J2100
442A2589m068j4095K682P188l491j786n768q728R746J4313j0079j5561P832J1922
$$ plain form
456 2696 -3943 -8505 -2277 -1470 269 3445 -5066 -7432 957 -747 -4252 2518 -79 -13506 -7940
471 -7940 5718 -9945 -24386 -4642 4491 -13541 -19712 -14034 -14199 -9697 -5540 -14054 -17965 -4404
485 -4404 -1177 -13808 -11848 -1522 1532 8505 3690 -16204 -5396 26368 18901 -11076 -1611 24138
499 24138 14592 -4118 731 9560 16118 16458 -2695 -11747 7121 14247 -1638 -4409 5151 3047
513 3047 1568 3435 -13891 -16393 20969 28591 -13072 -22683 11085 20820 159 -5001 9256 18728
527 18728 13504 -5101 -11329 13750 24628 535 -5190 10155 848 -10031 4762 5978 -12827
540 -12827 -4412 12404 -9640 -29448 -6810 9610 -2452 -9573 -8435 -7843 -3701 -2748 -6046 3092
554 3092 12099 -194 -7249 7297 6690 -6558 10970 27009 4078 -10708 5117 10891 65
$$ packed form
456B696o639m562O228Q07J739L176q511k366Q389j704l505O770k597j3427N566
471g940J3658j5663j4441J9744R133j8032o171N678j65M502M157q514l911J3561
485d404L227j2631J960J0326L054O973m815j9894J0808L1764p467k9977R465K5749
499B4138r546j8710M849Q829O558L40j9153r052J8868P126j5885k771R560k104
513C047j479J867j7326k502L7362P622m1663r611L3768R735k0661n160J4257R472
527A8728n224j8605o228K5079J0878k4093n725J5345r307j0879J4793J216j8805
540a2827Q415J6816k2044j9808K2638J6420j2062p121J138N92M142R53l298R138
554C092R007j2293p055J4546o07j3248J7528J6039k2931j4786J5825N774j0826
$$ plain form
567 65 2061 8152 2202 -1424 -3722 -14220 -8303 7413 -573 -11733 -6318 -8650 -14947 -1808 5002
582 5002 -12965 -12733 13468 8420 -20349 -11748 15852 16203 1214 -5176 991 10867 7965 -5638
596 -5638 -895 18053 11597 -13441 -10018 5700 -228 -3914 2003 -7301 -14524 -2959 -1436 -16971
610 -16971 -13473 5445 1950 -12005 -10205 -6162 -3314 4399 2563 -2947 5194 9575 -1886 -3018
624 -3018 12969 15002 4308 7063 9954 1301 3094 9763 4230 1049 6983 2452 -6177 -3598 -270
639 -270 -4750 -1107 1865 -8840 -10426 -1084 -5873 -9653 4168 6837 -8580 -9121 6377 5734 -2961
654 -2961 3006 9708 7584 5470 142 -1606 10387 14662 1409 -2792 6889 4817 -6934 -4032
668 -4032 3577 238 -1695 -3699 -12314 -9441 1525 -2446 -10406 -4729 -187 -6642 -6706 -340 -2814
$$ packed form
567F5J996O091n950l626k298j0498N917J5716p986j1160N415k332o297J3139O810
582E002j7967K32K6201n048k8769Q601K7600L51j4989o390O167R876k902j3603
596e638M743J8948o456k5038L423J5718n928l686N917r304p223J1565J523j5535
610a6971L498J8918l495j3955J800M043K848P713j836n510Q141M381j1461j132
624c018J5987K033j0694K755K891q653J793O669n533l181N934m531q629K579L328
639b70m480L643K972j0705j586R342m789l780J3821K669j5417n41J5498o43q695
654b961N967O702k124k114n328j748J1993M275j3253m201R681k072j1751K902
668d032P609l339j933k004q615K873J0966l971p960N677M542o455o4O366k474
$$ plain form
683 -2814 -1188 7551 2967 -4724 2217 7892 3682 4604 8245 4771 2101 4646 2187 -455 6495
698 6495 6669 -3369 -4056 -146 -2974 -2460 83 -4256 -7420 -2389 -1583 -8838 -5985 2233 -1339 -4262
714 -4262 -205 -1193 -1838 2477 2694 739 3734 5810 1415 776 6746 4434 534 5416 5032 -1522
730 -1522 -906 2713 1159 -2185 -2095 -1153 -2243 -2533 -4164 -4867 72 -647 -7276 -4879 1525 -395 -3596
747 -3596 -693 2163 422 -240 2379 3226 2895 3627 1479 2265 4985 3013 838 1765 1972 651 617
764 617 1466 -424 -3087 -949 -1144 -3742 -2203 -1310 -2598 -3248 -2989 -1001 -243 -1217 -1315 427 2018 1640
782 1640 259 2315 3860 1743 2494 4151 3874 2331 1033 2274 2563 440 -61 -279 -1915 -2917
798 -2917 -3357 -1980 -2055 -5576 -5534 -3656 -4177 -4784 -3867 -2397 -2947 -4836 -2603 490 380 -701 -213 2108
$$ packed form
683b814J626Q739m584p691O941N675m210R22L641l474k670K545k459k642O950
698F495J74j0038o87L910k828N14K543m339l164N031Q06p255K853Q218l572k923
714d262M057r88o45M315K17j955K995K076m395o39N970k312l900M882l84o554
730a522O16L619j554l344R0R42j090k90j631p03M939p19o629K397O404j920l201
747c596K903K856j741o62K619Q47l31P32k148P86K720j972k175R27K07j321l4
764F17Q49j890k663K138j95k598J539Q93j288o50K59J988P58r74r8J742J591l78
782A640j381K056J545k117P51J657k77j543j298J241K89k123n01k18j636j002
798b917m40J377p5l521M2J878n21o07R17J470n50j889K233L093j10j081M88K321
$$ plain form
816 2108 2640 408 1449 4108 2879 1115 422 2246 2794 78 -1236 -320 -388 -924 -2388 -2643 -1586
833 -1586 -2678 -3510 -2163 -1201 -1894 -1670 -524 1098 1006 2259 3729 3147 3147 4715 6212 6718 5184 5202
851 5202 6528 4627 4289 5621 5519 2612 -426 538 2272 -515 -2875 -2366 -2333 -3009 -4486 -4131 -2515
868 -2515 -3217 -4300 -3416 -2721 -1379 -150 -2 -106 -206 2080 3517 2045 1683 2793 2994 3366 1621
885 1621 399 1230 1827 427 -2202 -2231 257 -2333 -5989 -4296 -2729 -3577 -4937 -5437 -4703 -4006 -3536
902 -3536 -2336 -1963 -1930 -2067 -1045 1843 624 -599 3510 4315 571 980 4689 4470 1846 2754 3350
919 3350 374 1042 3377 -149 -2424 128 776 -1170 -3275 -3317 -2413 -1357 -2066 -4709 -3187 38 -2482
936 -2482 -4717 -992 128 -440 2091 355 -2855 1372 6641 2680 -1605 4031 6103 879 1247 3644
$$ packed form
816B108N32k232J041K659j229j764o93J824N48k716j314R16o8n36j464k55J057
833a586j092q32J347R62o93K24J146J622r2J253J470n82%J568J497N06j534J8
851E202J326j901l38J332j02k907l038R64J734k787k360N09L3o76j477L55J616
868b515p02j083Q84O95J342J229J48j04j00K286J437j472l62J110K01L72j745
885A621j222Q31N97j400k629k9K488k590l656J693J567q48j360n00P34O97M70
902c536J200L73L3j37J022K888j219j223M109Q05l744M09L709k19k624R08N96
919C350k976O68K335l526k275K552O48j946k105m2R04J056p09k643J522L225k520
936b482k235L725J120n68K531j736l210M227N269l961m285N636K072n224L68K397
$$ plain form
952 3644 1952 2968 3902 -640 -2277 1966 1501 -3703 -2921 281 -2212 -2965 -2175 -5915 -4156 1770
968 1770 -286 -4751 -2002 394 -1560 -97 3337 1077 1890 6057 1017 -1764 6947 7823 508 3004
984 3004 7319 1487 -2444 3753 4707 -2269 332 3802 -2779 -5013 -2112 -1650 -959 -873 -4550 -5121 -1918
1001 -1918 -2988 -4892 472 2785 -4378 -2594 4643 -1584 -5190 5890 8990 -965 -2221 4143 2804
1016 2804 -749 3079 3842 818 1836 -888 -5442 -511 3285 -1383 -3435 -1469 -3582 -5576 -1741
1031 -1741 -842 -5064 -1068 3145 -3138 -6239 -1274 1603 2472 3674 423 -1245 3527 3887 -1722 2539
1047 2539 10792 3858 -4814 1316 4857 -1475 -130 4901 711 -4798 -1343 588 -4690 -4273 503
1062 503 248 -2454 -5306 -5753 -1031 1175 -2000 -1144 3608 109 -6207 -280 6926 1207 -796 5714
$$ packed form
952C644j692J016R34m542j637M243m65n204P82L202k493p53P90l740J759N926
968A770k056m465K749K396j954J463L434k260Q13M167n040k781Q711Q76p315K496
984C004M315n832l931O197R54o976K601L470o581k234K901M62O91Q6l677n71L203
1001a918j070j904N364K313p163J784P237o227l606J1080L100r955j256O364j339
1016B804l553L828P63l024J018k724m554M931L796m668k052J966k113j994L835
1031a741Q99m222L996M213o283l101M965K877Q69J202l251j668M772L60n609M261
1047B539Q253o934q672O130L541o332J345N031m190n509L455J931n278M17M776
1062E03k55k702k852m47M722K206l175Q56M752l499o316N927P206n719k003O510
$$ plain form
1078 5714 3049 -3717 756 5343 1427 442 3507 465 -3537 -307 -196 -3163 1464 2642 -4397
1093 -4397 -4963 -847 -2347 -3000 1771 1470 -3804 -2416 1190 -1369 -150 3795 2215 1828 2902 -911
1109 -911 -1275 6055 5537 -1131 1741 6966 -2260 -6327 3921 4688 -2863 -359 1145 -5567 -5645 1488
1125 1488 -5 -5093 -1571 -562 -4509 -3509 -1389 -2161 1294 2747 -2437 -1408 3199 -167 -1839
1140 -1839 5352 6782 -472 556 4394 -971 -89 7669 2986 -3678 799 2099 -4479 -2712 3472
1155 3472 -906 -5209 -482 -1535 -6294 -1963 809 -2463 -1608 89 -2309 -2225 825 630 1084 4263
1171 4263 1682 -1948 2954 4828 -737 1967 7212 1570 -2195 2723 2902 -2037 389 4184 -1355
1186 -1355 -3332 633 -1779 -4173 435 1179 -3101 -2661 -642 -1586 -1051 1657 1076 -622 1324 944
$$ packed form
1078E714k665o766M473M587l916r85L065l042m002L230J11k967M627J178p039
1093d397n66M116j500o53M771l01n274J388L606k559J219L945j580l87J074l813
1109i11l64P330n18o668K872N225r226m067J0248P67p551K504J504o712p8P133
1125A488j493n088L522J009l947J000K120p72L455J453n184J029M607l366j672
1140a839P191J430p254J028L838n365Q82P758m683o664M477J300o578J767O184
1155C472m378m303M727j053m759M331K772l272Q55J697k398Q4L050j95M54L179
1171D263k581l630M902J874n565K704N245n642l765M918J79m939K426L795n539
1186a355j977L965k412k394M608P44m280M40K019r44N35K708n81j698J946l80
$$ plain form
1202 944 204 3263 2644 536 3644 4480 592 866 4192 1726 -1227 2701 3626 -2965 -2966 1340 -1561
1219 -1561 -3774 -942 -649 -4138 -5012 -2685 -1912 -2958 -2691 -2691 -2346 -1922 -2307 -1270 489 -162 -1052 820
1237 820 1095 -154 844 2351 1120 -325 1731 1812 -610 154 1076 -319 -594 508 -659 -2289 -1261
1254 -1261 9 -1787 -2368 17 -413 -2597 -1620 230 795 -743 -431 1347 1122 -132 1613 3122
1270 3122 2321 514 1732 3662 2094 876 2406 2568 698 9 1475 1183 -1035 -1122 203 -1001
1286 -1001 -2208 -733 -1106 -2239 -2552 -1212 -372 -1693 -1773 -727 -536 87 446 613 1014 1280 1280 1436 1683
1305 1683 2832 2631 1111 1334 2171 1872 866 206 760 292 -1053 -447 -46 -1097 -1811 -979 -530 -1388
1323 -1388 -1729 100 -161 -1298 -354 1074 941 6 503 2022 1331 996 1752 2234 1755 946 872 1540 985
$$ packed form
1202I44p40L059o19k108L108Q36l888K74L326k466k953L928R25o591jM306k901
1219a561k213K832K93l489q74K327P73j046K67%L45M24l85J037J759o51q90J872
1237H20K75j249R98J507j231j445K056Q1k422P64R22j395k75J102j167j630J028
1254a261J270j796n81K385m30k184R77J850N65j538L12J778k25j254J745J509
1270C122q01j807J218J930j568j218J530J62j870o89J466k92k218q7J325j204
1286a001j207J475l73j133l13J340Q40j321q0J046J91O23L59J67M01K66%J56K47
1305A683J149k01j520K23Q37k99j006o60N54m68j345O06M01j051p14Q32M49q58
1323a388l41J829k61j137R44J428j33r35M97J519o91l35P56M82m79q09p4O68n55
$$ plain form
1342 985 -129 361 -583 -742 -793 -1430 -1775 -2047 -2328 -1908 -2364 -2440 -1863 -2339 -2181 -1490 -1519 -1085 -906 -402 -68
1363 -68 -289 591 889 499 596 1118 1013 989 493 945 1055 -270 17 314 -113 -1097 -1650 -363 -940 -2221
1383 -2221 -1705 -517 -1222 -1542 -876 -196 199 -112 156 409 924 1814 1208 1712 2361 1580 1919 2927 2214
1402 2214 1598 2188 2275 1106 442 1037 556 -623 -516 -694 -993 -810 -1892 -2693 -1440 -1027 -2209 -2407
1420 -2407 -1319 -922 -2108 -794 556 -393 -30 1212 683 866 1772 1469 1354 2146 1816 770 1397 2113
1438 2113 371 177 1766 288 -1532 -729 -564 -1610 -1201 -689 -1636 -2608 -1782 -1654 -2069 -774 -657 -1358
1456 -1358 -23 85 -989 -28 2495 2253 230 1662 2695 936 1036 2777 1832 1418 1910 115 -414
1473 -414 630 724 -759 -696 181 -2327 -2903 -761 -1715 -3283 -809 -19 -2766 -2699 -964 -350 -243 1052
$$ packed form
1342I85j114M90r44j59n1o37l45k72k81M20m56p6N77m76J58O91k9M34J79N04L34
1363f8k21Q80K98l90R7N22j05k4m96M52J10j325K87K97m27r84n53J287n77j281
1383b221N16J188p05l20O66O80L95l11K68K53N15Q90o06N04O49p81L39J008p13
1402B214o16N90Q7j169o64N95m81j179J07j78k99J83j082q01J253M13j182j98
1420b407J088L97j186J314J350r49L63J242n29J83R06l03j15P92l30j046O27P16
1438B113j742j94J589j478j820Q03J65j046M09N12r47r72Q26J28m15J295J17p01
1456a358J335J08j074R61K523k42k023J432J033j759J00J741r45m14M92j795n29
1473d14J044R4j483O3Q77k508n76K142r54j568K474P90k747O7J735O14J07J295
$$ plain form
1491 1052 1065 -34 677 749 0 2897 3630 839 651 2654 1545 -517 2009 3246 -428 -1191 1246
1508 1246 -723 -2883 -503 164 -1175 -1117 -1531 -3181 -1884 -323 -1132 -1042 1004 -871 -3371 314 2274
1525 2274 -289 1108 3349 483 -1493 926 1908 407 1384 2217 -621 -444 539 -1999 -1112 2520
1541 2520 -206 -3713 -978 -219 -3681 -2052 2250 -585 -3306 -199 -370 -2629 -319 1737 350
1556 350 665 1017 -1378 -461 2538 1341 280 4032 2497 -3138 -479 3924 551 -429 2675 566
1572 566 -3490 -622 1493 -1076 -597 1158 -1814 -2463 95 -1664 -2556 1553 1603 -2315 -479 1392
1588 1392 -2022 -1720 3539 2342 -780 1515 1003 -2080 1181 3649 777 322 1806 -1312 -2517 1639
1604 1639 1511 -2288 314 2240 -3455 -3353 1546 69 -1772 1169 1595 -2140 -1290 1206 225 1098
$$ packed form
1491A052J3j099P11P2p49K897P33k791j88K003j109k062K526J237l674p63K437
1508A246j969k160K380O67j339N8m14j650J297J561q09R0K046j875k500L685J960
1525B274k563J397K241k866j976K419R82j501R77Q33k838J77R83k538Q87L632
1541B520k726l507K735P59l462J629M302k835k721L107j71k259K310K056j387
1556C50L15L52k395R17K999j197j061L752j535n635K659M403l373r80L104k109
1572E66m056K868K115k569M79J755k972o49K558j759q92M109N0l918J836J871
1588A392l414L02N259j197l122K295n12l083L261K468k872m55J484l118j205M156
1604A639j28l799K602J926n695J02M899j477j841K941M26l735Q50K496r81Q73
$$ plain form
1620 1098 2694 328 -432 1929 1025 -711 2730 3534 -413 -429 2421 -722 -2195 1871 1850 -1738 -573
1637 -573 156 -3095 -2279 1351 190 -1460 -37 -1256 -3287 -296 2184 -720 -601 1617 -598 -1337
1653 -1337 1024 1369 -237 1209 1255 -722 -504 635 -1226 -865 2174 56 -2578 -588 -255 -2574
1669 -2574 -758 1480 -703 -3036 -774 -290 -2205 -346 1644 -432 -1119 481 -288 -503 853 1207
1685 1207 696 842 813 -675 229 1958 594 94 1403 162 -1442 56 235 -685 -260 -26 -1203
1702 -1203 -2150 -544 -912 -2277 -498 210 -1846 -1590 -254 -663 -915 643 1030 -400 -378 977 819
1719 819 948 1942 1278 1035 965 901 975 1846 1582 459 571 1360 292 -817 789 436 -759 22 755
1738 755 -904 -882 385 478 -80 734 1205 114 616 1647 1459 1209 2202 1919 1484 1572 1998 1774 1560 1641
$$ packed form
1620A098J596k366p60K361r04j736L441Q04l947j6K850l143j473M066k1l588J165
1637e73P29l251Q16L630j161j650J423j219k031K991K480k904J19K218k215p39
1653a337K361L45j606J446M6j977K18J139j861L61L039k118k634J990L33k319
1669b574J816K238k183k333K262M84j915J859J990k076o87J600p69k15J356L54
1685A207n11J46k9j488R04J729j364n00J309j241j604J498J79r20M25K34j177
1702a203r47J606l68j365J779P08k056K56J336m09k52J558L87j430K2J355j58
1719H19J29R94o64k43p0o4P4Q71k64j123J12P89j068j109J606l53j195P81P33
1738G55j659K2J267R3n58Q14M71j091N02J031j88k50R93k83m35Q8M26k24k14Q1
$$ plain form
1758 1641 887 671 572 -43 -340 -111 -1059 -1665 -896 -1660 -2790 -2386 -1315 -2398 -3251 -1998 -1692 -2560 -1982
1777 -1982 -980 -1155 -1259 -1014 -203 -391 -345 234 175 31 316 89 265 379 -76 39 199 -619 -677 -457
1797 -457 -504 -1000 -1251 -839 -1285 -1286 -591 -1027 -967 -440 -190 -287 -97 648 911 180 1090 2007 1461 1421 1920 2263
1819 2263 1894 1615 2174 2181 1248 1202 1263 1054 527 -26 275 35 -1057 -710 -719 -1140 -1683 -1285 -1053 -1492 -1369
1840 -1369 -476 -580 -987 -66 156 72 84 336 1057 701 833 1394 1100 566 1172 1113 780 496 455 302 -398
1861 -398 -435 22 -648 -1499 -955 -726 -1205 -1590 -1425 -445 -1162 -1187 -285 -217 -301 -186 235 532 502 889 1493 871
1883 871 1099 1229 1138 928 849 717 780 268 443 326 -29 -257 -791 -692 -619 -1027 -1003 -1090 -1450 -806 -531 -862
1905 -862 -785 44 -296 -598 305 1184 833 145 1176 1459 790 1278 1399 1330 1071 839 1298 861 242 288 -23
$$ packed form
1758A641p54k16r9o15k97K29r48o06P69p64j130M04J071j083q53J253L06q68N78
1777a982J002j75j04K45Q11j88M6N79n9j44K85k27J76J14m55J15J60q18n8K20
1797d57m7m96k51M12m46jO95m36O0N27K50r7J90P45K63p31R10R17n46m0M99L43
1819B263l69k79N59Pr33m6O1k09n27n53L01k40j092L47rm21n43L98K32m39J23
1840a369Q93j04m07R21K22q4J2K52P21l56J32N61k94n34O06n9l33k84m1j53p00
1861c98l7M57o70q51N44K29m79l85J65R80p17k5R02O8q4J15M21K97l0L87O04o22
1883H71K28J30r1k10p9j32O3n12J75j17l55k28n34R9P3m08K4q7l60O44K75l31
1905h62P7Q29l40l02R03Q79l51o88J031K83o69M88J21o9k59k32M59m37o19M6l11
$$ plain form
1926 -23 -132 -423 -950 -680 -407 -1743 -1482 -411 -932 -1430 -986 -553 -1219 -819 126 15 -180 129 61 513
1946 513 1223 1517 369 835 1288 272 180 999 911 -466 112 299 -722 -791 -446 -831 -1025 -1063 -1228 -1351
1966 -1351 -974 -1106 -1622 -416 199 -1271 -985 915 -46 -155 1181 1818 669 259 1159 1605 993 1706
1984 1706 1250 436 1085 452 -200 605 1202 -486 -966 234 -875 -2239 -512 -115 -1703 -1415 -86
2001 -86 -1175 -1599 -198 -160 -400 392 584 -415 361 1071 259 1128 3030 985 -713 1105 1534 79
2019 79 494 2041 46 -1423 -58 92 -1174 -226 -427 -1728 -1005 -572 -2018 -1576 769 -303 -1594
2036 -1594 426 850 -1646 -370 2327 450 128 1777 967 -291 1367 1996 950 1387 1780 -580
2052 -580 -423 1736 -270 -1139 1597 227 -2377 -1171 188 -1511 -1548 505 -694 -2490 -1009 -594
$$ packed form
1926b3j09k91n27K70K73j336K61J071n21m98M44M33o66M00R45j11j95L09o8M52
1946E13P10K94j148M66M53j016r2Q19q8j377N78J87j021o9L45l85j94l8j65j23
1966a351L77j32n16J206O15j470K86J900r61j09J336O37j149m10R00M46o12P13
1984A706m56q14O49o33o52Q05N97j688m80J200j109j364J727L97j588K88J329
2001h6j089m24J401L8k40P92J92r99P76P10q12Q69J902k045j698J818M29j455
2019G9M15J547j995j469J365J50j266R48k01j301P23M33j446M42K345j072j291
2036a594K020M24k496J276K697j877l22J649q10j258J658O29j046M37L93k360
2052e80J57K159k006q69K736j370k604J206J359j699l7K053j199j796J481M15
$$ plain form
2068 -594 -1528 301 949 -730 -422 1254 -257 -53 2087 1814 201 1271 2030 -441 -182 2047 810
2085 810 24 890 -98 -1817 -552 193 -925 -513 446 -2016 -3049 -27 -260 -1816 -22 492 -1466
2102 -1466 -1226 478 31 -199 1230 1233 62 592 785 -405 1039 2086 142 -78 770 -1030 -1828 399
2120 399 1062 -1408 -1411 -183 -1644 -2352 -520 -481 -1603 -1029 -763 -1646 -814 -64 -383 133 1392 271 -1270
2139 -1270 824 1419 809 1133 1786 911 302 1025 1175 862 1321 1143 -39 122 418 -658 -79 787 273
2158 273 -544 155 299 -1329 -380 1686 780 -752 79 580 -131 642 1539 1127 647 666 320 683 1158
2177 1158 845 60 946 674 -701 -688 133 -515 -700 43 -490 -1722 -1557 -800 -1191 -1146 -266 -1122 -2023 -873
2197 -873 -673 -1137 -164 244 -387 -811 260 450 -556 409 1287 304 13 495 151 196 361 420 -50 255
$$ packed form
2068e94r34J829O48j679L08J676j511K04K140k73j613J070P59k471K59K229j237
2085H10p86Q66r88j719J265P45j118M12R59k462j033L022k33j556J794N14j958
2102a466K40J704m47k30J429Lj171N30J93j190J444J047j944k20Q48j800p98K227
2120C99O63k470lJ228j461p08J832L9j122N74K66q83Q32P50l19N16J259j121j541
2139a270K094N95o10L24O53q75o09P23J50l13M59j78j182J61K96j076N79Q66n14
2158B73q17O99J44j628R49K066r06j532Q31N01p11P73Q97m12m80J9l46L63M75
2177A158l13p85Q86k72j375J3Q21o48j85P43n33j232J65P57l91M5Q80q56r01J150
2197h73K00m64R73M08o31m24J071J90j006R65Q78r83k91M82l44M5J65N9m70L05
$$ plain form
2217 255 -393 -1239 118 104 -1023 -627 352 -836 -1454 32 -222 -926 -153 535 -192 -267 926 802 220
2236 220 1065 1052 475 907 1047 389 735 1137 548 -160 261 345 -470 -266 -9 -800 -770 -497 -1171 -812 -453
2257 -453 -820 -1031 -41 172 -1040 -471 763 133 -273 817 1030 169 826 1051 1028 458 843 876 712 720
2277 720 539 170 477 -117 -485 40 -144 -1110 -1037 -374 -416 -819 -763 -554 -1029 -745 -402 -493 -239 126 -90
2298 -90 240 686 930 628 528 922 739 590 1087 864 536 270 300 313 109 -102 -220 -222 -622 -843 -626 -190
2320 -190 -978 -1084 -317 -504 -639 -443 -5 -45 -84 290 853 460 473 895 847 1073 894 989 1146 923 803 505
2342 505 414 549 18 -375 -235 -330 -423 -351 -910 -1252 -793 -1299 -552 -770 -919 -730 -720 -534 -467 -333 471 215
2364 215 257 380 605 860 781 330 613 624 448 625 653 329 -16 -16 79 47 -527 -964 -620 -772 -907 -867 -703
$$ packed form
2217B55o48q46J357j4j127L96R79j188o18J486k54p04P73O88p27p5J193j24n82
2236B20Q45j3n77M32J40o58L46M02n89p08M21Q4q15K04K57p91L0K73o74L59L59
2257d53l67k11R90K13j212N69J234o30m06J090K13q61O57K25k3n70L85L3j64Q
2277G20j81l69L07n94l68N25j84r66P3O63m2m03N6K09m75K84L43r1K54L65k16
2298i0L30M46K44l02j00L94j83j49M97k23l28k66L0J3k04k11j18km00k21K17M36
2320a90p88j06P67j87j35J96M38m0l9L74N63l93J3M22m8K26j79R5J57k23j20k98
2342E05r1J35n31l93J40r5r3P2n59l42M59n06P47k18j49J89J0J86O7J34Q04k56
2364B15M2J23K25K55p9m51K83J1j76J77K8l24l45%R5l2n74m37L44j52j35M0J64
$$ plain form
2387 -703 -928 -1060 -697 -431 -409 -397 181 -50 102 364 631 601 671 787 603 968 1132 802 379 824 705
2408 705 164 200 235 44 -454 -494 -126 -423 -515 -778 -948 -429 -614 -781 -436 -185 -277 -367 314 583 88 286
2430 286 767 390 601 973 706 732 565 528 356 213 336 -46 -47 -132 -627 -552 -144 -810 -1092 -429 -92 -956
2452 -956 -919 -389 -534 -406 120 -118 130 320 238 -71 789 1089 132 292 947 722 186 627 1376 256
2472 256 58 413 -64 -172 132 -323 -596 -438 -533 -970 -59 -189 -895 -724 301 -437 -1098 402 649 -174
2492 -174 352 871 310 -39 847 642 276 1254 1008 28 376 525 -65 173 752 -342 -1035 46 -323
2511 -323 -1300 -669 153 -824 -1122 -203 -1067 -682 53 111 -316 181 227 -403 133 925 200 121 1084 605 -308
2532 -308 438 1035 218 229 414 -368 -760 -242 -149 -575 18 56 -1480 -909 -197 -984 -554 265 -286 -1099 -136
$$ packed form
2387g03k25j32L63K66K2J2N78k31J52K62K67l0P0J16j84L65J64l30m23M45j19
2408G05n41L6L5j91m98m0L68k97r2k63j70N19j85j67L45K51r2r0O81K69m95J98
2430B86M81l77K11L72k67K6j67l7j72j43J23l82jq5m95P5M08o66k82O63L37q64
2452i56L7N30j45J28N26k38K48J90q2l09Q60L00r57J60O55k25n36M41P49j120
2472B56j98L55m77j08L04m55k73J58r5m37R11j30p06J71J025p38o61J500K47q23
2492a74N26N19n61l49Q86k05l66R78k46r80L48J49n90K38N79j094o93J081l69
2511c23r77O31Q22r77k98R19q64L85P35N8m27M97M6o30N36P92p25p9R63m79r13
2532c08P46N97q17J1J85p82l92N18R3m26N93L8j536N71P12p87M30Q19n51q13R63
$$ plain form
2553 -136 493 -395 -81 954 502 -58 623 393 -6 833 979 537 582 997 -231 -180 955 562 -589
2572 -589 24 -15 -1051 -836 -184 -363 -435 -208 -476 -1318 -333 25 -549 95 889 -273 -436 456 668 288
2592 288 680 1506 388 -210 503 663 240 578 557 -514 238 9 -669 -238 225 -627 -987 -368 -456 -1557
2612 -1557 -570 653 -325 -644 -27 -288 -637 476 717 359 297 673 -122 272 1395 771 -193 995 696
2631 696 -316 53 566 -132 -243 730 -16 -1149 -627 -582 -797 -38 -154 -990 -946 -215 -739 -816 597 246
2651 246 -834 101 1133 92 -259 1120 955 147 793 735 -125 375 704 347 351 605 -435 -893 332
2670 332 -407 -807 158 -16 -1544 -956 82 -489 -820 555 -90 -504 -291 42 -238 277 1095 41 74
2689 74 877 634 -111 814 1351 -13 -122 578 -5 -249 307 42 -548 -305 -483 -1168 -679 -278 -758 -612
$$ packed form
2553a36O29q88L14J035m52n60O81k30l99Q39J46m42M5M15j228N1J135l93j151
2572e89O13l9j036K15O52j79p2K27k68q42R85L58n74O44P94j162j63Q92K12l80
2592B88L92Q26j118n98P13J60m23L38k1j071P52k29o78M31M63q52l60O19q8j101
2612a557R87J223r78l19O17k61l49J113K41l58o2L76p95L94J123o24r64J188k99
2631F96j012L69N13o98j11R73p46j133N22M5k15P59j16q36M4P31n24p7J413l51
2651B46j080R35J032j041l51J379j65q08O46n8q60N00L29l57MK54j040m58J225
2670C32p39m00R65j74j528N88J038n71l31J375o45m14K13L33k80N15Q18j054L3
2689G4Q03k43p45R25N37j364j09P00n83k44N56k65n90K43j78o85M89M01m80J46
$$ plain form
2709 -612 236 -627 -1567 -361 205 -555 -59 662 -345 -494 597 736 176 662 737 -27 291 519 97
2728 97 401 377 -209 -228 97 -82 -794 -508 -185 -546 -805 -282 -580 -896 -255 -33 -44 -161 67 -51 225
2749 225 627 445 167 1183 625 -6 568 753 701 479 759 620 169 130 211 239 -26 -188 -564 -410 -233
2770 -233 -826 -556 -391 -674 -907 -205 -194 -465 -701 231 136 -287 366 461 145 179 794 592 447 327 188
2791 188 130 232 214 -69 180 62 -603 -427 -488 -447 -370 -856 -711 -494 -316 -444 -469 -284 -66 11 30 741 41
2814 41 261 681 676 333 558 768 804 434 523 771 406 347 199 171 382 -313 -270 -264 -490 -700 -434 -348 -439 -707
2838 -707 -685 -252 -279 -183 -162 -68 -44 -5 78 473 617 710 546 566 571 925 344 525 411 99 100 86 240 -152 -517
2863 -517 -408 -525 -473 -540 -688 -557 -666 -712 -291 -247 -422 -271 -113 108 72 146 495 320 347 417 892 704 503
$$ packed form
2709f12Q48q63r40J206N66p60M96P21j007j49J091J39n60M86P5p64L18K28m22
2728I7L04k4n86j9L25j79p12K86L23l61k59N23k98l16O41K22j1j17K28j18K76
2749B25M02j82k78J016n58o31N74J85n2k22K80j39m51l9Q1K8k65j62l76J54J77
2770b33n93K70J65k83k33P02J1k71k36R32r5m23O53R5l16L4O15k02j45j20j39
2791A88n8J02j8k83K49j18o65J76o1M1P7m86J45K17J78j28k5J85K18P7J9P11p00
2814D1K20M20nl43K25K10L6l70Q9K48l65n9j48k8K11o95M3Ok26k10K66Q6r1k68
2838g07K2M33k7R6K1R4K4L9Q3L95J44R3j64K0NL54n81J81j14l12Jj4J54l92l65
2863e17J09j17N2o7j48J31j09m6M21M4j75J51J58K21l6P4L49j75K7P0M75j88k01
$$ [...]
8191G9
##END NTUPLES=NMR FID
##END=
