##TITLE=1H_Pr 4-EtOAm
 200.13MHz,CDCl3,
 8 sc
 
 25.6.2025
##JCAMPDX= 6.0         $$ Bruker NMR JCAMP-DX V2.0
##DATA TYPE= NMR FID
##DATA CLASS= NTUPLES
##ORIGIN= UXNMR, Bruker Analytische Messtechnik GmbH
##OWNER= pz
$$ XWIN-NMR		Version 3.5
$$ Wed Jun 25 14:12:26 2025 Russian Standard Time (UT+4h)  she@DPX200
##.OBSERVE FREQUENCY= 200.1313
##.OBSERVE NUCLEUS= ^1H
##.DELAY= (6, 6)
##.ACQUISITION MODE= SIMULTANEOUS
##.ACQUISITION SCHEME= undefined
##.AVERAGES= 8
##.DIGITISER RES= 18
##SPECTROMETER/DATA SYSTEM= spect
##.PULSE SEQUENCE= zg30
##.SOLVENT NAME= CDCl3
##.SHIFT REFERENCE= (INTERNAL, CDCl3, 0, 14.3821)
##AUDIT TRAIL= $$ (NUMBER, WHEN, WHO, WHERE, WHAT)
$$ ##TITLE= Audit trail, XWIN-NMR		Version 3.5
$$ ##JCAMPDX= 5.01
$$ ##ORIGIN= Bruker BioSpin GmbH
$$ ##OWNER= she
$$ F:/spectra/data/she/nmr/H-C/1/audita.txt
$$ ##AUDIT TRAIL=  $$ (NUMBER, WHEN, WHO, WHERE, WHAT)
(   1,<2025-06-25 14:11:12.50 +0400>,<she>,<DPX200>,
      <created by zg, POWCHK disabled, PULCHK disabled
       configuration hash MD5:
       00 E9 B6 7A A2 85 ED C7 34 08 36 98 17 FE 4E 26
       data hash MD5: 16K
       36 E6 FC 7B C9 F5 AC FD 08 B9 81 71 16 51 A6 F6>)
$$ ##END=
$$ 
$$ hash MD5
$$ 8C 83 A4 73 CC EA E4 8A 9E 8E C1 C0 45 46 49 45
##$RELAX= 
##$RELAX= 
##$RELAX= 
##$RELAX= 
##$RELAX= 
##$RELAX= 
$$ Bruker specific parameters
$$ --------------------------
##$DU= <F:/spectra>
##$EXPNO= 1
##$NAME= <H-C>
##$PROCNO= 1
##$TYPE= <nmr>
##$USER= <she>
##$AMP= (0..31)
100 100 100 100 100 100 100 100 100 100 100 100 100 100 100 100 100 100 
100 100 100 100 100 100 100 100 100 100 100 100 100 100 
##$AQSEQ= 0
##$AQ_mod= 1
##$AUNM= <au_zg>
##$AUTOPOS= <>
##$BF1= 200.13
##$BF2= 200.13
##$BF3= 200.13
##$BF4= 200.13
##$BF5= 200.13
##$BF6= 200.13
##$BF7= 200.13
##$BF8= 200.13
##$BYTORDA= 1
##$CFDGTYP= 0
##$CFRGTYP= 5
##$CHEMSTR= <none>
##$CNST= (0..31)
1 1 145 1 1 1 1 1 1 1 1 1 1 1 1 1 1 1 1 1 1 1 1 1 1 1 1 1 1 1 1 1 
##$CPDPRG= <>
##$CPDPRG1= <>
##$CPDPRG2= <>
##$CPDPRG3= <>
##$CPDPRG4= <mlev>
##$CPDPRG5= <mlev>
##$CPDPRG6= <mlev>
##$CPDPRG7= <mlev>
##$CPDPRG8= <mlev>
##$CPDPRGB= <>
##$CPDPRGT= <>
##$D= (0..31)
0 0.7 0 0 0 0 0 0 0 0 0 0.03 0 0 0 0 0 0 0 0 0 0 0 0 0 0 0 0 0 0 0 0 
##$DATE= 1750846271
##$DBL= (0..7)
120 120 120 120 120 120 120 120 
##$DBP= (0..7)
150 150 150 150 150 150 150 150 
##$DBP07= 0
##$DBPNAM0= <>
##$DBPNAM1= <>
##$DBPNAM2= <>
##$DBPNAM3= <>
##$DBPNAM4= <>
##$DBPNAM5= <>
##$DBPNAM6= <>
##$DBPNAM7= <>
##$DBPOAL= (0..7)
0.5 0.5 0.5 0.5 0.5 0.5 0.5 0.5 
##$DBPOFFS= (0..7)
0 0 0 0 0 0 0 0 
##$DE= 6
##$DECBNUC= <off>
##$DECIM= 32
##$DECNUC= <off>
##$DECSTAT= 4
##$DIGMOD= 1
##$DIGTYP= 9
##$DL= (0..7)
0 120 120 120 120 120 120 120 
##$DP= (0..7)
150 150 150 150 150 150 150 150 
##$DP07= 0
##$DPNAME0= <>
##$DPNAME1= <>
##$DPNAME2= <>
##$DPNAME3= <>
##$DPNAME4= <>
##$DPNAME5= <>
##$DPNAME6= <>
##$DPNAME7= <>
##$DPOAL= (0..7)
0.5 0.5 0.5 0.5 0.5 0.5 0.5 0.5 
##$DPOFFS= (0..7)
0 0 0 0 0 0 0 0 
##$DQDMODE= 0
##$DR= 18
##$DS= 0
##$DSLIST= <SSSSSSSSSSSSSSS>
$$ [...]
##$SUBNAM0= <"">
##$SUBNAM1= <"">
##$SUBNAM2= <"">
##$SUBNAM3= <"">
##$SUBNAM4= <"">
##$SUBNAM5= <"">
##$SUBNAM6= <"">
##$SUBNAM7= <"">
##$SUBNAM8= <"">
##$SUBNAM9= <"">
##$SW= 18.0517328524113
##$SWIBOX= (0..15)
0 0 2 0 0 0 0 0 0 0 0 0 0 0 0 0 
##$SW_h= 3612.71676300578
##$TD= 16384
##$TD0= 1
##$TE= 0
##$TE2= 300
##$TE3= 300
##$TEG= 300
##$TL= (0..7)
0 120 120 120 120 120 120 120 
##$TP= (0..7)
150 150 150 150 150 150 150 150 
##$TP07= 0
##$TPNAME0= <>
##$TPNAME1= <>
##$TPNAME2= <>
##$TPNAME3= <>
##$TPNAME4= <>
##$TPNAME5= <>
##$TPNAME6= <>
##$TPNAME7= <>
##$TPOAL= (0..7)
0.5 0.5 0.5 0.5 0.5 0.5 0.5 0.5 
##$TPOFFS= (0..7)
0 0 0 0 0 0 0 0 
##$TUNHIN= 0
##$TUNHOUT= 0
##$TUNXOUT= 0
##$USERA1= <user>
##$USERA2= <user>
##$USERA3= <user>
##$USERA4= <user>
##$USERA5= <user>
##$V9= 5
##$VALIST= <valist>
##$VCLIST= <CCCCCCCCCCCCCCC>
##$VD= 0
##$VDLIST= <DDDDDDDDDDDDDDD>
##$VPLIST= <PPPPPPPPPPPPPPP>
##$VTLIST= <TTTTTTTTTTTTTTT>
##$WBST= 1024
##$WBSW= 4
##$XGAIN= (0..3)
0 0 0 0 
##$XL= 0
##$YL= 0
##$YMAX_a= 495048
##$YMIN_a= -587829
##$ZGOPTNS= <>
##$ZL1= 120
##$ZL2= 120
##$ZL3= 120
##$ZL4= 120
##$ABSF1= 10
##$ABSF2= 0
##$ABSG= 5
##$ABSL= 3
##$ALPHA= 0
##$AQORDER= 0
##$ASSFAC= 0
##$ASSFACI= 0
##$ASSFACX= 0
##$ASSWID= 0
##$AUNMP= <proc_1d>
##$AZFE= 0.1
##$AZFW= 0.1
##$BCFW= 1
##$BC_mod= 2
##$BYTORDP= 1
##$COROFFS= 0
##$CY= -3
##$DATMOD= 1
##$DC= 2
##$DFILT= <>
##$DTYPP= 0
##$F1P= 0
##$F2P= 0
##$FCOR= 0.5
##$FTSIZE= 0
##$FT_mod= 4
##$GAMMA= 1
##$GB= 0.15
##$INTBC= 1
##$INTSCL= 1
##$ISEN= 128
##$LB= 0.25
##$LEV0= 0
##$LPBIN= 0
##$MAXI= 10000
##$MC2= 0
##$MEAN= 0
##$ME_mod= 0
##$MI= 1.114404
##$NCOEF= 0
##$NC_proc= 0
##$NLEV= 6
##$NOISF1= 3.799351
##$NOISF2= 2.8
##$NSP= 1
##$NTH_PI= 0
##$NZP= 0
##$OFFSET= 14.38212
##$PC= 1
##$PHC0= -1202.52
##$PHC1= 15.9922
##$PH_mod= 1
##$PKNL= yes
##$PPARMOD= 0
##$PSCAL= 0
##$PSIGN= 0
##$REVERSE= no
##$SF= 200.129724274929
##$SI= 16384
##$SIGF1= 3
##$SIGF2= 2
##$SINO= 400
##$SIOLD= 16384
##$SREGLST= <1H.CDCl3>
##$SSB= 0
##$STSI= 0
##$STSR= 0
##$SW_p= 3205.1282051282
##$SYMM= 0
##$S_DEV= 0
##$TDeff= 0
##$TDoff= 0
##$TI= <>
##$TILT= no
##$TM1= 0
##$TM2= 0
##$TOPLEV= 0
##$USERP1= <user>
##$USERP2= <user>
##$USERP3= <user>
##$USERP4= <user>
##$USERP5= <user>
##$WDW= 1
##$XDIM= 8192
##$YMAX_p= 0
##$YMIN_p= 0
$$ End of Bruker specific parameters
$$ ---------------------------------
##NTUPLES= NMR FID
##VAR_NAME=  TIME,          FID/REAL,        FID/IMAG
##SYMBOL=    X,             R,               I
##VAR_TYPE=  INDEPENDENT,   DEPENDENT,       DEPENDENT
##VAR_FORM=  AFFN,          ASDF,            ASDF
##VAR_DIM=   8192,          8192,            8192
##UNITS=     SECONDS,       ARBITRARY UNITS, ARBITRARY UNITS
##FACTOR=    0.0002768,     1,               1
##FIRST=     0,             0,               0
##LAST=      2.2672688,     0,               0
##MIN=       0,             -587829,         0
##MAX=       2.2672688,     495048,          0
$$ Real data points
##PAGE= N=1
##DATA TABLE= (X++(R..R)), XYDATA
$$ [...]
1748A481j658o30K091j160j187J272R84j336n56Q82m21k36R39P7j472N12R78q65
1766c05J57J143j022q66J402K70j015o5Q69o70n83R19M92j207l50J295m91m16
1784d43Q44Q1j105N08L55l29K63K64m46n40R81kn82L11K60n03l55R51k76o27N8
1805c32M65k27m21N23Q8m74J53K88j8J44r0k4J95k3j6l15R1K82n12k06O24k7o17
1828d49N12J07l02L9O5R6k10J48J93j59n9J85k15l2J91R7k78Qj94K60R6k87J00
1851h8l43L04J5J09lL33n65J41L50K1j45k63O4L18j41j97P4J31l61p7J74K29O6
1874A46m66N4K69R3L9k27K41r5m6R4K70k41J34l22l47O47r1k68R0o7j46l1K37
1897c3L24l45l04L77J99k35M21l09r5J00j56nM08l39j54k53M24L08j90m64L07
$$ plain form
1748 1481 -177 -807 1284 124 -1063 209 1193 -143 -699 183 -238 -474 465 542 -930 -418 560 -305
1766 -305 -148 995 -27 -893 509 779 -236 -301 568 -102 -685 234 726 -481 -831 464 -27 -443
1784 -443 401 482 -623 -115 240 -89 174 438 -8 -548 433 431 -151 160 420 -83 -438 513 237 -390 -332
1805 -332 133 -94 -515 8 96 -378 -225 63 45 189 99 75 270 247 231 -84 7 289 -223 -429 195 168 -449
1828 -449 63 170 -132 -93 -28 68 -142 6 199 40 -19 166 -49 -81 110 207 -71 -63 -257 3 99 -188 -88
1851 -88 -431 -127 -112 -3 -6 327 -238 -97 253 274 129 -134 -70 248 107 -90 -16 115 -246 -323 -149 80 146
1874 146 -320 -266 3 96 135 -92 149 54 8 102 372 131 265 -57 -404 243 152 -116 -26 -93 -239 -270 -33
1897 -33 291 -54 -358 19 218 -17 404 95 0 100 -56 -61 347 8 -146 -399 25 333 143 -321 -14
1918a4n9j64K42L41k71l79J17K05J70N4L0m90R0pJ4L26M6m21l18M56N9P2m83L16
1942f8J34m31N07J93m23L6K24l95K65L07J39j002K18P93n11k41O12l52n12L71
1962a36M62n05m2O09o68J57N29M4q02L03N31n34n54J073l49n40K74O87r43L6M71
1983A03J06o95P87L19j074K01R54p09l78J037l35r16O76O07p94j75M99j96n44
2002e27P51L36j257J28J104r01l26J528m63j233N94R01p34l14J238o78j257J271
2020A61P26r75j01Q10j141m60J429L07j454L00R84j022L0J276k07j980R88J385
2038A056j119L6R52r94j006J373P56j331kR05j498m89K280K2j894O22P08r81L08
2057b96J579j156j324Q29J171j197N04R52j532p51J738M54j513M89O75j670J54
$$ plain form
1918 -14 -73 -237 5 346 75 -304 -187 18 188 242 272 -218 -128 -135 -121 205 251 -170 -488 -32 27 99 -384 -68
1942 -68 66 -365 142 335 -88 -52 172 -223 42 349 488 -514 -296 497 -14 -255 357 5 -507 -136
1962 -136 326 -179 -221 388 -280 -123 406 450 -352 -49 482 -52 -606 467 118 -422 -148 539 -404 -368 103
1983 103 209 -486 301 620 -454 -253 701 -8 -386 651 316 -600 76 683 -111 -286 213 17 -527
2002 -527 224 560 -697 -569 535 -366 -692 836 373 -860 -266 635 -99 -413 825 147 -1110 161
2020 161 887 -88 -189 621 -520 -980 449 756 -698 -398 586 -436 -406 870 663 -1317 -329 1056
2038 1056 -63 -27 925 -69 -1075 298 1054 -277 -279 626 -872 -1361 919 941 -953 -331 377 -604 -296
2057 -296 1283 127 -1197 -368 803 -394 110 1062 -470 -1221 517 971 -542 -53 622 -1048 -894
2074h94K154l64j756O22P99j565R22J635j486j372J341N67r87Q73N76j572j011
2091a518J920O56j581P06L43j699M98K068r64j378J016J82j282J302J645k011
2107i7j298J446N42j049J074P06k319l91K218j05r69N58n8j480Q73J674r02j097
2125f74R12k17j157J731J160j970r98J556j4q52J164M73k256k09K149j55j098
2142d55J057n41j472R92J660r18q56Q80l80q14J491J078k151m14J468p76l82J629
2160A096j94k042j18J779j89q71J124k28j685J151J610j170p53R64p76n56J584
2177G26N51k052P7Q11k32l97J467l10k030P75J511j015L7J090j130r18J000J059
2195A020q22p10J167j025m80J398M17j791K61R78p37N2Q26n52j190P77P75n99
$$ plain form
2074 -894 1260 896 -860 -238 561 -1004 -82 1553 67 -1305 36 603 -384 489 1065 -507 -1518
2091 -1518 402 1058 -523 183 526 -1173 -675 1393 429 -949 67 249 -1033 269 1914 -97
2107 -97 -1395 51 593 -456 618 1324 -995 -1386 832 727 -242 316 258 -1222 -349 1325 423 -674
2125 -674 238 21 -1136 595 1755 -215 -1213 343 329 -523 641 1114 -1142 -1351 798 643 -455
2142 -455 602 61 -1411 -419 1241 323 -533 347 -33 -847 644 1722 -429 -843 625 -151 -533 1096
2160 1096 902 -1140 -1258 521 332 -539 585 357 -1328 -177 1433 263 -490 474 -302 -858 726
2177 726 1277 -775 -698 113 -119 -516 951 641 -1389 -614 897 -118 -81 1009 -121 -1039 -39 1020
2195 1020 198 -512 655 -370 -850 548 965 -826 -565 413 -324 -272 554 2 -1188 -411 364 -235
2213b35P7P46r10p09J485N63j307K89M31p07m92J376K59j611J44J004o13K5O32
2232D47l80p35M84O53l27l2L87p23l60J051J32r17M13L92j042j4J308m92r63M81
2252b37N03n95K27O93m23q40N40N41m39KL49o62k5P02J1o63K64J25m28J47O81
2273D73k35o50M17K34o09J44Q11o33m24N61K4mj01N31o57o0L05k04L2J00J16n26
2295c55N30Q6o13P9L07k0l03M90J35k27n08P03q8l89L51lr8l82M94K4l99J24r2
2318a54j2P5J73j08k6J52j78P8Q4Q7k21j46M04j07k36K54R7k92p3K89K8l86n3
2341b71L56j61K2O5L1k11n1J26l5J93j18L1K77k32m8Q9j63K70m06K81L2j13j75
2364b11K02j28j84L71l5R6l37L10J40j0j82J58j67j64Q1P1J18j63J33k78K94l39
$$ plain form
2213 -235 -158 588 -322 -1031 454 1017 -290 -1 430 -277 -769 607 866 -745 -601 403 -210 -185 447
2232 447 67 -668 -184 469 142 110 497 -226 -586 465 597 -320 93 485 -557 -571 737 245 -718 -237
2252 -237 266 -329 -102 591 168 -672 -132 409 -30 -28 321 -341 -366 336 347 -316 -52 73 -355 -208 473
2273 473 238 -412 5 239 -370 -226 585 -48 -472 89 113 109 8 539 -118 -178 127 -77 -45 55 171 -355
2295 -355 175 261 -352 -273 34 14 -289 201 336 109 -399 304 216 -173 178 175 77 -305 189 213 -186 -62 -154
2318 -154 -166 -91 82 -26 -52 100 -78 0 84 171 -50 -196 208 101 -135 119 216 -76 -149 140 168 -218 -271
2341 -271 85 -76 -54 11 42 -169 -220 -94 -129 64 -54 -23 254 22 -26 63 -100 170 -236 45 77 -36 -211
2364 -211 -9 -137 -321 50 15 111 -226 84 224 214 32 190 23 -141 -60 11 129 -34 99 -179 115 -224
2386b24O4M8K40j68j07J84K99l80j09K14M3O8j01r2K67k53j98M37J45m61P8K1
2408A5r1l2q7K38p5j57O5qJ20K34l33J58M4k12N5J99k1j35J6q2o7J26l4l9r5J32
2434f6N2M9j39J13k67K64k2k43K45J48j63j5J17j30m7K9L87n03P0J45k2j30L11
2457A83J51n40J92K48l66J47J64rk47J01N6k31k1L82m48KM94j66l36K13j28O2
2479i7n8J43J14k35K75K5j28R6L77n32j71L19L9j91j74M02k48o0K57l1m16K12
2501h2L54k74j25M90n01n3L21O7m44J32M78l65j37N60j56n90J46N26n27j24M69
2522A65k0n74N95K1n07L07N34l75o25P95K9n90L94L07l63l37N97k7o79M28l00
2543b25k57M03L60q3q63Q70J24p25M50N78q17j80O83J4n36K39J83m83j8Q24k90
$$ plain form
2386 -224 -160 -112 128 -40 -147 37 336 -44 -153 61 104 172 71 -21 246 -7 -205 232 377 -84 -6 15
2408 15 -76 -108 -195 43 -32 -189 -124 -132 -12 222 -111 47 91 -121 -66 133 112 -23 -7 -89 -156 -30 -64 -103 -198 -66
2434 -66 -14 35 -104 9 -258 6 -16 -259 -14 134 -29 -44 73 -57 -104 -75 312 -191 -121 24 2 -128 183
2457 183 334 -206 -14 234 -132 15 179 170 -77 24 80 -151 -172 210 -238 -236 258 92 -244 -31 -159 -97
2479 -97 -155 -12 102 -133 142 167 39 135 512 -20 -191 128 167 -24 -198 204 -44 -104 153 122 -294 -82
2501 -82 272 -2 -127 363 -138 -191 130 197 -247 -115 363 -2 -139 421 265 -325 -179 347 -180 -304 165
2522 165 145 -429 166 187 -320 -13 521 146 -479 316 345 -245 149 456 93 -244 353 326 -353 75 -225
2543 -225 -482 -79 281 198 -665 205 329 -396 54 632 -185 -365 318 332 -204 35 218 -265 -283 541 251
2564B51o14L25j35n8K82L98m51l41O23j35o84P62J17p82RQ30j80l29L99N7j136
2585g92N16J019l49p51M88k84n72Q18O00r92k84R09k61j84L28L3o30N3Q33m77
2605B1k57M82k32r13P18Q00o37l53N50l19n11P88N12o03l89L25N2j67O91j51p86
2626c79J76N73l79j24P49l56j068N97P61p37k70R63p36l64R92J94q42q0O58n48
2646b20P2O01P9j100L08O44l54k03O22o80m22M23P64o90J00J12k22m95J181J71
2666F91r58m3O45p31J69R35l48r31M45L17l05k4N36o15n16P72K01k00q8L56p31
2687d23K14O88M0r30J88L17m41J67Q67n87o60K64L81j94K31L37n50n31O20K25
2707B23j76R8L2o21J16Q70j12p10M82p3n92K34O55k32p48M05L25l95J01M88p15
$$ plain form
2564 251 -363 -38 -173 -231 51 449 -2 -343 280 145 -539 223 340 -442 -433 397 217 -112 287 344 -792
2585 -792 -276 743 394 -357 131 -153 -725 93 693 -299 -583 326 65 -119 209 242 -388 -335 498 21
2605 21 -236 246 14 -899 -181 619 -18 -371 179 -140 -651 137 649 46 -343 -18 34 -133 558 407 -379
2626 -379 -203 370 -9 -133 616 260 -808 -211 550 -187 -457 506 -230 -594 398 592 -250 -330 328 -220
2646 -220 -148 453 532 -568 -260 384 30 -173 449 -231 -653 -230 534 -156 -56 56 -166 -661 520 691
2666 691 -267 -310 335 -396 -227 708 360 -571 -126 191 -114 -138 398 -217 -733 39 240 40 -48 308 -423
2687 -423 -209 479 519 -411 -223 94 -347 -180 687 100 -560 -296 85 -109 122 459 -91 -622 -2 223
2707 223 47 145 177 -444 -328 542 430 -280 202 129 -463 -229 426 194 -554 -149 176 -219 -118 370 -345
2728c45L2N37J84n55L54j61n26M04L95J0n58K72j7m18M97M55q93l0N04j68m78
2749e05P55R7j98m55O13j58k83K17J06m48O5N61j89k74K10m2j38P5J65K5m99M62
2771A62k47j83N04p4m73J55M27j07k85M2K68l99N1K49p7j18L59J3n13J11K03k30
2793a62P2J75jj92K16L3n46N01P4l55K04N9k5j96J30K47k41l47L61K18l41J63
2815D7J42m19J23K77j93j07M49l27L6m3P2K2j05O6j48j87K56M4j82J76J95l64
2837a70K8M83m97%K78J45m84N1J03K06k39J93p6L5Oj34J53j45q3J41r2N5L3O0
2861E0l45J96J05r1L27k54R1j24L3j6K11j12j68K85j83p3n4q6L98l18m0K75qq1
2885A8K92j69j41N9j31J86k12mn4P5J52l08K57m1m0R8q8jK36k11J29j80K9n9Q4
$$ plain form
2728 -345 -313 224 408 -147 207 46 -480 -76 319 329 -229 43 26 -392 105 560 -333 -363 141 -27 -505
2749 -505 250 347 149 -306 307 149 -134 83 189 -259 -194 367 178 -96 114 72 -66 9 174 199 -300 162
2771 162 -85 -268 236 162 -311 -156 271 164 -121 -79 189 -210 -159 90 13 -105 254 267 -246 -135 68 -162
2793 -162 -90 85 84 -108 108 141 -405 96 170 -185 19 78 53 -143 -13 234 -7 -354 7 225 -116 47
2815 47 189 -230 -107 170 -23 -130 319 -8 28 -15 57 79 -26 40 -108 -295 -39 5 -177 -1 194 -170
2837 -170 -142 341 -156 -156 122 267 -217 -166 -63 143 -96 97 21 56 62 -72 81 -64 -147 -6 -98 -43 -10 50
2861 50 -295 -99 6 -85 242 -12 79 -45 -12 -28 183 71 -97 188 5 -68 -122 -208 190 -128 -168 107 99 18
2885 18 310 141 0 59 -72 114 -98 -102 -156 -81 71 -237 20 -21 -61 37 -51 -52 184 -27 102 -78 -49 -108 -24
2910b4r2J08J9J03j14Oj10Q2Q5j38N3J05qj37J29N9J5k77J17jO9J00j80p6J60
2935E3j07N4j58K20j72N4L2n3r5J39Q3k2k35L47j41O5k1m9R2M4Jj59o2n8M6L05
2961B03l76K65j34J12q0j63J20J25p7M8l5j2p0j19Rl9R8L64j67j15J89j44m5Q7
2985D4J38j31j78J47K38l62p3L01l84M8K62L6j46J14K07j78k71J71N3j68kp7P1
3008a40K28P9j10l29K54P8k50K03J31k53J59Pp5J56k45R9l20J39L13m3k12J63
3030C2M4l10L37k2K7j91K81m12J34N7K12n09K15M67j86l20L99j15m82K32J78j44
3052g6l02M64p4j96J09J90M0k31K38o4k53M12J42n92J70K54j16j75J31R9n77L91
3074a6K73k61m0K7J52l40K25J55k43j28M36l58q6O06k45k92j82N45j90j26K45
$$ plain form
2910 -24 -116 -8 11 114 0 6 -104 -22 63 -75 -22 83 75 -62 67 126 141 -136 -19 -20 49 149 -31 -107 53
2935 53 -54 0 -158 62 -110 -56 -24 -77 -172 -33 50 28 -207 140 -1 64 43 -6 86 130 131 -28 -90 -148 -102 203
2961 203 -173 92 -42 70 -10 -173 -53 72 -5 43 8 -4 -74 -193 -184 -223 -125 239 72 -43 146 2 -43 44
2985 44 182 51 -127 20 258 -104 -177 124 -260 -212 50 86 -60 54 261 83 -188 -17 36 -132 -134 -211 -140
3008 -140 88 167 57 -272 -18 60 -190 13 144 -109 50 57 -18 138 -107 -8 -328 -189 124 81 -131 32
3030 32 76 -234 103 81 108 -83 198 -214 -80 -23 189 -320 -105 362 176 -144 255 140 -342 -110 68 -76
3052 -76 -378 86 12 -184 -75 115 155 -76 162 98 -155 257 399 -193 -23 231 115 -60 71 170 -407 -16
3074 -16 257 -4 -44 -17 135 -205 20 175 -68 -196 240 -118 -204 402 157 -135 -317 228 38 -88 157
3095A57p9k61J55M23m81J64K03m31k97N58K38l09l39K13l2j61L61Q6l86J94K52
3116B28m60J87K47j96k66K35L05m42J17L15l86l41O61J00n29J19K55l32L1L17
3136A65J41m98k3M84j89L6J44j56m72M00J67k98L09J97n91l1L75J42n30J74L47
3157B93m42j12O52k80l07L80l02j37L75L04o19m55N92L61l09J35J10l10k44N79
3177B64rk27j01j89J64j22O80l41m20M85j02j31Q9L63o33j14K79J02k18K08J45
3198A72l52j52L90J79m69K48K71m91L47K29l85k31L99k02j39L52j50k34j57K78
3218i7O4J79J0k7l83K38K60k99p5K54K9l29J86J73l40Q8J53k47O3K17J43l87o2
3241a89M87l35J0J64m2k52Q1K34K2l17K33j61j88J49L53j97j61J0pj46K81Q6l55
$$ plain form
3095 157 78 -183 -28 395 -86 78 281 -150 -447 111 349 40 -299 -86 -118 -279 82 168 -218 -24 228
3116 228 -232 -45 202 6 -260 -25 280 -162 -45 270 -116 -457 204 304 -225 -106 149 -183 -152 165
3136 165 306 -192 -215 269 80 116 260 104 -368 32 199 -99 210 407 -184 -215 160 302 -228 -54 293
3157 293 -149 -261 391 111 -196 184 -118 -255 120 424 -195 -650 -58 303 -6 129 239 -71 -315 264
3177 264 255 28 -73 -262 -98 -220 460 119 -301 184 82 -49 40 403 -230 -344 -65 37 -181 27 172
3198 172 -180 -332 58 237 -232 16 287 -204 143 372 -13 -244 155 -47 -186 166 16 -218 -375 -97
3218 -97 -33 146 156 129 -254 -16 244 -55 -130 124 153 -176 10 183 -157 -69 84 -163 -100 117 260 -127 -189
3241 -189 298 -37 -27 137 95 -157 -76 158 180 -137 96 -65 -253 -104 249 52 -109 -99 -106 -252 29 115 -240
3264b40K84K16l44l8K79J94m81J71K83j68k27J50j20k43K55J03M1j39J71l67J21
3285i9M57k33O5k84K37j66J5J19mj51k8J71k00M44k48j47P3p2J51j76J28m6Q8
3308I4k41L36k54m5l7J88K7j60L64l91J29k7o1J53k77K12q0J12q4m5P3J07k4j88
3332a19qL5k5L9K25k6O6k46J20k51qK06J1p3J47m2J0l21K52R0j10L4J18j54RQ
3358a3J08P5q3o0Q0j64nP5q4R2O1n1j45K00k24K04j84N5Q3J34n7J30k15n5N0O6
3384G3n7l68M17N7k97J04J79m2l2k06j0K0J63l6Q7J54m70K43J52j91L31k59p1
3407e9J41N1k57j5J63L8j3J17k89j55K11P8k47J20J71N3o6nr1j22J25J61K4nq7
3432D2q2L26n63K05K9O7q1m5k8J6J2J35J8j44R2m8L08q9O4k53l8J55K6l84L70
$$ plain form
3264 -240 44 260 -84 -122 157 351 -130 41 324 156 -71 79 -41 -284 -29 74 115 -24 147 -220 -99
3285 -99 358 125 190 -94 143 -23 -8 111 107 -44 -72 99 -101 343 95 -52 21 -51 100 -76 52 6 94
3308 94 -147 189 -65 -110 -147 41 68 -92 272 -119 10 -17 -78 75 -202 10 -70 42 -42 -87 -14 93 69 -119
3332 -119 -127 -92 -117 -78 147 121 187 -59 61 -190 -198 8 19 -54 93 51 61 -260 -8 82 -28 6 124 -30 -21 -13
3358 -13 95 170 87 27 107 -57 -62 13 -71 21 82 31 -114 86 -138 66 -118 -63 20 154 97 227 12 -43 7 73
3384 73 16 -352 65 122 -175 -71 108 66 34 -172 -182 -162 1 -35 52 206 -264 -21 131 -60 271 12 -59
3407 -59 82 133 -124 -139 24 62 49 166 -123 -278 -67 11 -236 -116 55 108 42 37 -54 -176 -51 110 134 129 42
3432 42 -40 286 -277 -72 -43 24 -57 -102 -130 -114 -102 33 51 -93 -1 -49 259 170 234 -19 -57 98 124 -260 110
3457A10L2j78L2K09l02oR3q0M5Q7L7J7l8p5k3J25o5k6Q0N4n9j07J54R3k75J9m3
3484i0J32m1l6J3n9m6P5l6J24L0J66k78K12j37j63J1J64q6N6k8K1J15k44N8R4
3509B7J11j96J84j81m2K47k09J81k51M46k65j23K54l39L20q8j38J80m8k16l7J83
3531@l3K1o9J41J24k11O1k02J02jj6rj53K19L09k97p6K84j42j93L56j55k41P5
3555a06K8J30K3P0%k7j29K74n29L32J48l18k4K67M0m45K92R0j87M3J44K8j61j08
3579a25K76l38L26K48n79J32o9K66k13j99K10j81q9M50l5k84N6K24j73nM49l60
3601a3o7j07J91j13J20J84l70j10K69K35l63J96J1kn9m4J95l71K69o3k16J69J23
3624F4j78L2J77p9O8J61n6k74J8M8J61m9n1J70m30R8PL86k51rR9k70K65R0k43
$$ plain form
3457 110 142 -36 -4 205 -97 -103 -10 -90 -45 42 79 96 58 -17 -40 85 20 -6 74 128 69 -38 116 209 -66 -47 -90
3484 -90 42 1 -35 -22 -81 -127 -52 -88 36 66 232 -46 166 29 -134 -123 41 -45 11 -17 4 119 -125 -67 27
3509 27 138 -58 126 -55 -97 150 -59 122 -129 317 52 -71 183 -156 164 76 -62 118 70 -146 -183 0
3531 0 -33 -12 -81 60 184 -27 34 -168 -66 -67 -83 -92 -245 -26 283 -14 -90 194 52 -141 215 60 -181 -106
3555 -106 -78 52 75 145 145 118 -11 263 -266 66 214 -104 -128 139 179 -266 26 116 -71 -28 116 144 -17 -125
3579 -125 151 -187 139 387 -192 -60 -129 137 -76 -275 -65 -246 -335 115 80 -204 -148 76 -97 -102 347 -13
3601 -13 -80 -187 4 -109 11 195 -175 -285 -16 219 -144 52 63 61 2 -42 153 -218 51 -12 -228 -59 64
3624 64 -114 -82 95 16 84 245 189 -85 -67 -19 142 93 42 212 -218 -120 -113 273 22 13 112 -158 107 197 -46
3649d6o7O5K20k56K07Q2j46k09J14L3qK82k27j79L35j06j6l93L78M8j56l3K48
3672A70P3k91K06k21j59K19K25l50j52L94j31q3L47k64k38O6K98j96LM3j04l22
3694d67L85J97O2j10J4k57K66J64o3m24J59K16k52J49Q7j04j08P9K13j97l5K18
3716A92j26l85N76K2l52r8L50m8k76K97p2j13J21J0j48kJ30j45J1L46k35l01J93
3739e3P0k03k3L10k8k88R2N5o0j20L50M3k91J41J75k63J76j56J42k32J17J94k95
3762a47R0K51l16M8J65J02l34O2K59r5j66K1Qk11Q2J79j39K89q8j1q1J36P9m13
3786b30K69J22j48n4J64k04M8j37R5J27J0j69r0J76q4K45k39R5J86l53J52P5r9
3809d3K4m1R3l3K60k18j2o3K00J74k53j72J23J47l35J99q2m7R8K22k12kJ68j21
$$ plain form
3649 -46 -113 -48 172 -84 123 205 59 -150 -36 -3 -11 271 44 -135 200 94 78 -315 63 111 -45 -78 170
3672 170 243 -48 158 -63 -222 -3 222 -128 -280 114 -17 -100 247 -17 -255 -189 109 -87 -84 -41 -145 -467
3694 -467 -82 115 177 67 81 -176 90 254 191 -233 -74 142 -110 39 126 22 -86 -7 206 9 -26 192
3716 192 66 -319 257 279 -73 -171 179 131 -145 152 80 -33 88 98 -50 -52 78 -67 -56 290 55 -246 -53
3739 -53 17 -186 -209 101 73 -215 -123 -68 -128 -248 102 145 -146 -5 170 -93 83 -73 69 -163 -46 148 -147
3762 -147 -57 194 -122 -74 91 193 -141 -79 180 85 -81 -60 -52 -263 -181 -2 -141 148 60 49 -32 104 183 -230
3786 -230 39 161 13 -41 123 -81 -33 -170 -75 52 62 -107 -197 -21 -105 140 -99 -4 182 -171 -19 56 -43
3809 -43 -19 -60 33 0 260 42 30 -33 167 341 88 -84 39 186 -149 50 -32 -79 19 241 29 27 195 74
3833G4J3P2j88J1r1J52Q0q2Ll3jp0n1J62N2l8L36l73q6N0K64j54p4J34n5k3N4
3860A38k47J96j32J42J02l82K05N5j72P5Q5j61j95M72j85L02l3j13r8L1n3j11
3882g9J63r0j40jJ46R2j8K0L5k93J15O5l1p0J09k04O5Q0m4j4k7K0J30J57j95O2
3908E3k15O7J61k9jJ77j56M2k2M4k42J64j51J8J40jMR9j33j54J37O7M9k54K45
3933A09q8J64j6n3k47N7o4K80j58j01J31k15L46J8j70p2K1J16Q0p9k99K26r2L5
3957g1K04j34N4M8O2j01k30L66M5om31K07r4K29lk16L1L72m09l7J95J40m94J48
3981a25K06j53O8L7p0k9K82j93Rk47K90j18j0j5J87j68R7o1J34N2k70J37k56J86
4005c0o9O9m1K15k8Kl03K73L3j74J99k66J98j82M9K3m4p9RJ36L3J2rM4k22K38
$$ plain form
3833 74 87 159 -29 -18 -109 43 123 41 44 11 10 -60 -111 51 103 65 401 28 -58 -8 256 102 28 162 107 84 138
3860 138 -109 87 -45 97 199 -183 22 77 -95 -20 65 -96 -291 181 -4 298 265 152 54 85 32 -79
3882 -79 84 -6 -146 -147 -1 91 73 93 128 -165 -50 15 -16 -86 23 -181 -116 -36 -80 -94 -121 -101 29 186 -9 53
3908 53 -162 -95 66 37 36 213 57 99 77 121 -121 43 -108 -90 50 49 53 152 19 -135 2 69 118 -136 109
3933 109 21 185 169 116 -131 -74 -138 142 -16 -117 14 -201 145 163 -7 -79 -58 58 138 59 -240 -14 -106 -71
3957 -71 133 -1 53 101 163 62 -168 198 243 237 -194 13 -81 148 145 -71 -40 332 -77 -114 81 221 -273 -125
3981 -125 81 -72 -4 33 -37 -66 216 23 32 -215 75 -43 -53 -68 119 -49 48 -13 121 173 -97 40 -216 -30
4005 -30 -99 -30 -71 144 116 118 -185 88 121 -53 146 -120 78 -104 -55 -32 -76 -155 -146 -10 23 35 26 70 -152 86
4031H6m7J1lr3L9j18l0K35m3j1P9o7N4l3j71J93j16k7J17qm1J77j30j36K1k8R7
4058Gj87K94l56K14j4J35j08j52K65k5q0j5l1P3j24J19j11K6J29m6m9nj32M0J11
4083b2J69O7j87mKj22R9p4J09k13L82j81K10m25J69Q7k23L47k41k03Q1M58k62
4106B3j40K72j61J27j64LJ32k77L62j23k20K02J23k35J73j67mm8J73r5l4Q4j04
4129i8K4P9j22J36r2J56J09k57r2M07k91j36J85K21k69l9pj05J08L5k35J57J97
4152G1p6n6j58J05L5J15K72k37P8k84L7J11m1Q6K7j96K87K2l5j67o2Q1r9j2J93
4177I7k0J08k18K8j50K65j99LqK56j18r1K12j85O3k78L87j30K05l01l7J34j68
4200a45J92p4j55K25j42j03K94K38l73q2J03j00j0K70P7l33J15j55J17K8m4J43
$$ plain form
4031 86 39 50 47 -46 -7 -125 -155 80 37 26 105 38 92 59 -112 81 -35 -62 55 47 6 183 53 -83 -62 -90 7
4058 7 -180 114 -242 -28 -42 93 -15 -167 98 73 -7 -22 -53 20 -104 15 -96 -70 59 13 -36 -41 -173 -133 -22
4083 -22 147 214 27 23 25 -97 2 -72 37 -176 206 25 235 -190 -21 66 -157 190 -51 -254 -173 285 23
4106 23 -117 155 -6 121 -43 -40 92 -185 177 54 -166 36 159 -76 97 -70 -74 -122 51 -44 -78 6 -98
4129 -98 -74 5 -117 19 -73 83 192 -65 -157 250 -41 -177 8 229 -40 -79 -86 -191 -83 -48 -283 -126 71
4152 71 -5 -61 -219 -114 -79 36 308 71 149 -135 -98 13 -28 58 85 -111 176 198 163 -4 -66 15 -84 -96 97
4177 97 77 185 -33 -5 -155 110 -89 -86 -94 162 44 -47 165 -20 43 -235 152 22 227 -74 -111 23 -145
4200 -145 47 -27 -182 43 -99 -202 92 330 -43 -125 -22 -122 -132 138 215 -118 -3 -158 -41 -13 -57 86
4222H6k14J03J85j68J58j52j13J6J10j14K21k8K2j16q9J35n7j72J93q3K81j23
4244H1QJ04k35oK48j69J80Km21K77J73j40k54K48j85R9n3P1J92k94J19p9o0O3
4268c1l8Q8K6l5j2J31q1J23k89p3J82J06k62N6J56k54K42jj56RJ41r8J53Q7j57
4293A3j9J65j00j78K6O11m45L5K0nq4j4m6M5k27K75j16Qn0K64k57m3J2K87j53
4318B4N5j15m3O7J6o3N0M9OJ85k54J20j53%P9J61j19j85J51j95J67j99M31j76
4342E9M3j00k2p4J16mJ4j32l1L46j25j75K19r9l63M26j08K08k24nM3j06J79j69
4366h4j16K95j52m6J81q7J13p3j12J58m5l2N1K40k88o6J12r9J6Q3j30L7K38k82
4390h8P9lJ5n7j30K88r8j97K61nK01l86J96j55J14m4j0m7J10p4K77k89Q4l2j17
$$ plain form
4222 86 -128 -25 160 -8 150 -2 -115 -99 11 -103 118 90 112 -4 -93 42 -15 -187 6 -77 204 81
4244 81 89 193 -42 -48 200 31 211 213 -208 69 242 102 -152 96 -89 10 -43 28 220 -74 45 -34 -94 -31
4268 -31 -69 19 45 10 -2 129 48 171 -118 -191 -9 97 -165 -109 47 -207 35 34 -122 -113 28 -70 83 170 13
4293 13 -6 159 59 -119 -93 518 73 108 128 123 39 25 -21 24 -203 72 -44 -36 -86 178 -79 -122 -110 177 24
4318 24 79 -36 -79 -12 4 -59 -9 40 46 231 -23 97 -56 -56 23 184 65 -120 31 -164 3 -196 235 59
4342 59 102 2 -20 -94 22 18 32 -100 -131 215 90 -85 134 35 -328 98 -10 198 -26 -31 12 -94 85 -84
4366 -84 -200 95 -57 -103 78 -9 104 31 -81 77 32 0 51 291 3 -63 49 -50 -34 49 -81 -44 194 -88
4390 -88 -9 -12 3 -54 -184 104 6 -191 70 65 266 -120 76 -79 35 -9 -19 -66 44 -30 247 -42 42 10 -107
4415a07L1N4K68j56m25L82r7M9j69K67Pk15J43J3j18J94j44L2N2r1J33j26n2m9
4439a24n6R1R2j69J79K40l08K10k13j39K53n5O8p0o2m9J25p5Q7N3j91JJ27O7j09
4464b7L1j05J8k80K50K9N4K3o0J98l13K40j69M8J52M7p4j22P0M1m2O2l4j39O0
4489d2J27k65J4J53j17J98J21o2r2l3J16j2j24J11O9q1NQ9m16J19J17K0L9k27
4513a73J06J29j62N1q3j6J06Q6J55k00j30J22kO4j2k0p6m1J98M0j30j16J92j43
4537e5J66R4k10p5qR2m8o6J31J86j42J14j14J5q1j38J32J17j53q3J21J64Lj8j38
4562FM7j38K31j44O4Mjk37K41J06k14L0Jj13J07O0j7j49K07j16J30j91j52J75
4586f3J75j82L9rj20L31k96K04j83K34l4Q8n12L40j42P9p4J16J20j02j33l5K6
$$ plain form
4415 -107 -76 -22 246 90 -335 47 -50 -1 -170 97 104 -111 32 45 -73 121 -23 9 61 -30 103 -23 -75 -124
4439 -124 -180 -89 3 -166 13 253 -55 155 -58 -197 56 1 69 -1 -63 -112 13 -62 25 78 -113 -112 15 82 -27
4464 -27 4 -101 -83 -363 -113 -84 -30 -7 -67 131 -182 58 -111 -63 89 136 62 -60 10 51 9 71 37 -102 -42
4489 -42 85 -180 -166 -13 -130 68 189 127 35 2 118 106 -18 93 162 81 86 175 -241 -122 -5 15 54 -173
4513 -173 -67 62 -100 -49 -132 -148 -42 44 199 -1 -131 -9 -11 53 41 21 -55 -96 102 142 12 -104 88 -55
4537 -55 111 205 -5 -80 -88 4 -44 -110 21 207 65 179 65 80 -1 -139 -7 110 -43 -126 -5 159 162 144 6
4562 6 53 -85 146 2 66 70 69 -168 73 179 -35 -5 -4 -117 -10 50 33 -116 91 -25 105 -86 -238 -63
4586 -63 112 -70 -31 -40 -160 171 -125 79 -104 130 96 184 -328 12 -130 -51 -125 -9 111 9 -124 -159 -133
4609a33K94k49J22j16J00q4J05n7J6Q9j75M4J33j0j35QP6J1j29J18O0j71n1K95
4633A61K7k34k42K31JN2MM4j27J84j03q1R7P1k49J31J63j12mP0p8J25q3JM1k91
4659b01N18j83m41K74J18l91M56N4k74J14q5J31k67J23P7J97j5l86K24j8J9j21
4681g7j2J02p3K90l86K32L3k79J20%J7k4j66K47n1o5J67l34K98k24K4K08j69J57
4705C5j40K24j76J39j12P1j22KJ30j45K95k27k19L83J01m39L17j00P1J29J4q5
4727A46l0j65J19j88n8J87j37O5M8N7O0q9j59J54R6k09J96M3k14mp5M5J30j72
4751a54K9J14J37k05k0jJ96j66J16n4q4K63r7j20J43n2J17k17Q1N2p0J48O7k83
4775f0k1K97k06K60j44r2O3l74L72j42k9K00q2j71K19J19o1n8q8j42Q8k4L90j34
$$ plain form
4609 -133 161 -88 34 -82 18 -66 39 -18 -2 87 -88 -44 89 79 -56 -48 28 39 -90 28 88 -83 -134 161
4633 161 188 -46 -288 -57 -56 -4 0 44 -83 101 -2 -83 14 85 -164 -33 130 18 14 84 6 131 48 49 90 -201
4659 -201 317 134 -307 -33 85 -306 150 204 -70 44 -41 90 -177 -54 23 220 205 -181 43 25 44 -77
4681 -77 -89 13 -60 230 -156 76 109 -170 -50 -50 -33 -57 -223 24 -27 -92 75 -259 39 -185 -161 47 -122 35
4705 35 -105 119 -57 82 -30 41 -81 -79 51 -94 201 -26 -245 138 239 -200 117 17 88 217 231 146
4727 146 116 -49 70 -118 -176 11 -126 -61 -13 44 104 15 -144 10 106 -103 93 136 -78 -82 -157 -112 18 -154
4751 -154 -125 -11 126 -79 -99 -100 96 -70 46 -8 -92 171 74 -46 97 45 162 -55 26 78 8 156 223 -60
4775 -60 -81 216 10 270 126 34 97 -277 95 -47 -76 124 42 -129 90 209 148 90 2 -140 -52 -76 314 180
4799A80l15J10l7j55K20J5R6q5j35L9Q9n5J09j08L7N6J11j28Rj96Q7O3Pj53p3
4824b12K80l70Q1J11M9O0p7J68j4o7n8J05j74K14j19J77l38L61r1k19K04M7o5
4847E3J46j91j05L8q3J65K7m5m7J79k67J43j52J07R5j33R3J53j32J54l18K64k15
4870g1K21m23M32l89J49J7l9K39P2k33n1K3K00L9k38J07j45J21q7L5L9K3k61J95
4894b5P2N7j18j74K70j43NM5J3Q4%r3m1Q1R2k54K71j23pL2o9j50Q7r7J21K17k28
4921g5J40j74J37K8l4P9k88J94K40j84p0l5J02j11k8R9j69K43k20J2K56k95J49
4944dJ14J03k12K5j4r8J60j06J62l7j40j50J33k8J57j49j00K67k85K43j82K56
4966A15k25K87k82K02k37K11j05J7J2m5L6k29K34M7k54J96n6M6m3J65m0k01K42
$$ plain form
4799 180 -135 -25 -62 -217 3 18 114 29 -106 -67 22 -33 76 -32 5 61 172 44 53 -143 -56 7 14 -139 -212
4824 -212 68 -302 -221 -110 -61 -1 -78 90 76 9 -49 56 -118 96 -23 154 -184 177 86 -133 71 118 53
4847 53 199 8 -97 -59 -142 23 50 5 -42 137 -130 13 -139 -32 63 -70 23 176 44 198 -120 144 -71
4870 -71 150 -273 159 -230 -81 -64 -103 136 208 -25 -76 -53 147 186 -52 55 -90 31 -56 -21 18 41 -220 -25
4894 -25 47 104 -14 -188 82 -61 -56 -11 2 86 86 -7 -48 33 125 -129 142 19 12 44 -25 -175 -88 -185 -64 153 -75
4921 -75 65 -109 28 56 22 101 -187 7 247 63 -7 -42 60 -51 -79 20 -149 94 -126 -114 142 -153 -4
4944 -4 110 213 1 26 12 -86 74 -32 130 93 -47 -197 -64 -92 65 -84 -184 83 -202 41 -141 115
4966 115 -110 177 -105 97 -140 71 -34 -17 -5 -50 -14 -243 -9 38 -216 -20 -76 -30 -73 92 52 -149 93
4989I3j49J61j46J29j62R8j37O3n0L04m09J28J07j00L2J78k11K00k25j7J95j76
5011i4L20L2k43R6L8j64m9l6j6K06k77J36L63k28L6j64J09Kq1J0J65Q3k95n1k1
5036a23J87M4R8l35R3j8L6L7k26L23j82k7R2k3R7P0J1j33J1O0k91K32o0K5K5j24
5062a01J68j33k4J22q7J99n2j01P5n4L1k43K43r9L4J76k16K70k41O1N1m6R5j10
5086A8k37J78K27m26J49J58l5k74K91j00N3P0j61M4M0J67r1P3r3j53K77j00j70
5109i5N0n3O3j31M13k63p6J63Q6j41J22k88J26r1M5J96k16J34p2J11j86J24J4
5132C5L0p2o5J33K2r7N5j20j43J94R7j08K40k02K7j50L39k76M1J35j57M8k6r0
5156a10J58o4j44K4kL19j76j56J00J77j52o2R5lj5op4J48l19N30k69N8j12K8j19
$$ plain form
4989 93 -56 105 -41 88 -74 24 -113 -50 -100 204 -205 -77 30 -70 -38 140 -71 129 -96 -113 82 -94
5011 -94 226 258 15 111 149 -15 -64 -100 -116 90 -187 -51 312 84 120 -44 65 67 -14 -4 161 244 -51 -102 -123
5036 -123 64 108 206 -129 -36 -54 -18 19 -207 116 -66 -93 -1 -24 73 143 154 21 32 92 -199 33 -27 -2 23 -101
5062 -101 67 -66 -90 32 -55 144 92 -9 66 12 43 -200 43 -56 -22 154 -62 208 -33 28 79 33 128 18
5086 18 -219 -41 186 -240 -91 67 32 -242 49 -51 2 72 -89 -45 -5 162 71 144 51 -102 175 75 -95
5109 -95 -45 -98 -35 -166 247 -16 -92 71 157 16 138 -150 -24 -115 -70 126 -90 44 -28 83 -103 21 35
5132 35 65 -7 -72 61 83 -14 41 -79 -222 -28 69 -39 201 -1 26 -124 215 -61 -20 115 -42 6 -20 -110
5156 -110 48 -16 -160 -136 -138 181 5 -151 -51 126 -26 -88 7 4 -11 -17 -91 57 -262 268 -1 57 -55 -27 -146
5181a46j38Q7l1J95r9J85L8L2k3j76J64k02k43M53l5J6l2j44K47k1j80p6L3L7
5205e9J61j41o0Q5j0L5J1N9n2q7j7K61k65M4J25j28k48M14k82N5J17M3J65k3l55
5230a52jL54k92L27j61r3j30Q8J18j49jJ63J28l6l08J98Q6j82K11q0Kk0j13j64
5254b07J52j31J74L4j1k30L13O2qN3p0j56j13lR1R3J81ml56J03n5mQ2J17k02L4
5280f1K1j7oK5M8o2J18j20R3Qj18k1K37j23Rr1K46J3j85r7O8J87l53J45K11k64
5306h9j54K71m0J01k08mk3K03j3p2j66K57M0k50K44j30J24N0j5k36J25Q5k32J45
5330A3k8J3K2p8Mp7J85k88L01L2l25J24k3J58P0j24PJ23N0k57j08J79J36j32J07
5355H4j57K02l28J91o6N1N4r2r5O3J28L1k31K61m0O4p2m2j11O6m0K4J26j87K5
$$ plain form
5181 -146 -284 -197 -228 -33 -132 53 91 123 100 -76 88 -114 -357 96 61 77 45 -99 148 127 -53 -129 -96 -59
5205 -59 102 -39 -99 -14 -24 11 22 81 29 -58 -75 186 -79 -35 90 -38 -286 128 -154 -99 18 61 226 203 -152
5230 -152 -153 201 -91 236 75 -18 -148 -60 58 -91 -92 71 199 163 -145 53 139 -43 168 88 90 70 -43 -207
5254 -207 -55 -186 -12 22 11 -219 94 156 148 201 131 -25 -138 -141 -50 43 224 220 -136 -33 -88 -92 -10 107 -95 -61
5280 -61 -40 -57 -63 -38 10 -52 66 -54 39 47 -71 -92 145 22 31 -60 186 199 14 -83 -15 172 -181 -36 175 -89
5306 -89 -243 28 -12 89 -119 -123 -146 57 44 -28 -194 63 103 -147 97 -33 91 141 126 -110 15 100 -132 13
5330 13 -15 -2 20 -58 -54 -131 54 -234 67 99 -226 -102 -125 33 103 -21 -14 109 159 -98 -206 -27 109 -23 84
5355 84 -73 129 -199 -8 -74 -23 31 -61 -156 -93 35 66 -165 96 56 120 48 6 -105 -39 -79 -55 71 -116 -91
5380i1O1j11K5L4m8J78J13j04q1N2Qq3J26j08l1n0o1M36k5r6k28K97m5l56J24
5405f4R9p7O9n8m2J01O4k00J0J08j20K54k02J49r3j60K67Oj58pP5M8j58O0j08
5430a37qK15p2j42J64j80J84O1j05J38j17j68L07l49K27j38J92R3l44J56j75K06
5452Hj79O6m2K94j3j50J11j24K4j2J13l2q8K1qj25J40K8j81m9J77m0N7o7p1K9
5478a13J42L3R6j0j33j29K85k85K96r3l35J02J84j42L4J82j06m4J39k02J19k83
5500b63L72k9m0j03O0ok14L55rj05M2m4j95J62n5m5J85r9L1P9K9N8j76k23K94
5525F1q7j18J90j91N9J11J89k51J57M7j97O8l7j21J45M4j14J3n5R4j9j49J64Q0
5549H3R4r6j10j24K21l52J76K68L2k2k91P7J86k8o5K45k56J78j51k09J55j3O1
$$ plain form
5380 -91 -30 -141 -116 -82 -130 48 161 57 -24 28 36 -47 79 -29 -60 -110 -171 265 240 144 -84 213 168 -188 -64
5405 -64 35 -42 27 -31 -73 28 92 -108 -98 10 -110 144 -58 91 -2 -162 105 111 -47 -54 21 69 -89 -29 -137
5430 -137 -145 70 -2 -144 20 -160 24 85 -20 118 1 -167 140 -209 18 -120 72 165 -179 -23 -198 8
5452 8 -171 -105 -147 147 134 -16 95 -29 -5 -17 96 64 -24 -3 -11 -136 4 32 -149 -198 -21 -61 -4 -71 -142 -113
5478 -113 29 62 158 148 15 -114 171 -114 182 89 -246 -144 40 -102 -68 114 8 -36 103 -99 20 -263
5500 -263 109 80 40 -63 -3 -9 -223 132 123 18 60 16 -179 -17 -72 -117 68 -31 0 79 108 166 -10 -233 61
5525 61 -26 -144 46 -145 -86 25 214 -37 120 167 -30 38 1 -120 25 69 -45 -32 -87 7 -12 -161 3 83
5549 83 177 81 -29 -153 68 -284 -108 160 192 170 -121 -44 142 114 49 294 38 216 65 -144 11 -2 59
5572E9j9o1M0p4J74m4j03L7k7J29j75R7p3qq2Q2J47j6j35j99L70q7O1k14R2O5
5598C6r5rL3J26k50rK24J51j97L1j27J13Q7N2j37j35N6J72r7K43m9l37kJ46R1
5623A17pl5j77n7Q1Q8k33J57J33n1r9m9q8K33Jj57l5K95j45K5j3J32j02j8m0j8
5649f2J91q7j61K1K10M3r8o5N3k25J79Q5j14J81k56J61P0k30J57r9K33k14J21
5672I4j48M1J29l20K20m8Q9j93O4NQK1L2J74rk75j9J45qP0k13J75L5j77P5j11
5698a44N2q6K35K14l26J43j1k76K18K5j9o%J0k10K00j63J40n8J05M4r2l5N6J20
5723A36k02q9R1O1P1r1j2J25j26J33j18N4O9j93J28N7j39J65j33K30j92R3j32
5746a4J16k4j90l9K17r5M9J48k43L0J40l44L40r2Rj55K9N6M9j59J08m2J43j00
$$ plain form
5572 59 40 -21 19 -55 119 75 -28 9 -18 111 -64 33 -40 -48 -130 -48 99 83 -52 -251 119 32 93 -121 -29 36
5598 36 -59 -68 -35 91 -159 -168 56 207 10 41 -86 27 114 166 29 -106 -50 122 25 268 219 -118 -120 26 117
5623 117 110 75 -102 -159 -78 10 -223 -66 67 16 -83 -132 -220 13 14 -143 -178 117 -28 -3 -16 116 14 -4 -44 -62
5649 -62 129 42 -119 -98 112 155 57 -8 45 -180 -1 84 -30 151 -105 56 126 -104 53 -46 187 -27 94
5672 94 -54 -13 116 -204 16 -32 57 -136 -72 -67 -59 -38 -6 168 159 -116 -135 10 2 72 -141 34 69 -108 -33 -144
5698 -144 -92 -178 57 271 -55 88 77 -199 19 44 25 19 19 29 -181 19 -144 -4 -62 43 87 -5 -40 16 136
5723 136 -66 -155 -64 -3 68 -23 -35 90 -36 97 -21 33 102 -91 37 94 -45 120 -13 217 25 118 -14
5746 -14 102 78 -112 -151 66 -29 20 168 -75 -45 95 -249 91 -1 8 -147 -118 -62 -13 -172 -64 -106 37 -63
5770f3m4RJ0P6J45q2m4j10J78j19n6J05Qk15j4J71J52k43o8K98m4r8K7k4K71j27
5796I9j50P8J43k95K26j31j42k5K99M6j56o4J13M4j57K39j68k0N2q9K28j98N4
5819B6l6j51J90j10K17k54J34jo3k29K90on2N6j0l7j8M4L1J01q9O4m1J01j88L2
5845Ak05P8P0q1K14rK8j19J06k22L22j59j6P5j93N9P7m9p1K2J9P0N1j00R7j67
5871a02K46j63K69k96K15j43j03P0k25K80j53O5J24j10K21j75r7njK29j37k02
5893a93Q4J32j94L30l67O3J7N3J03j88J76n2Nn6J82j28J07q0r7J23J7j46L8l4
5917a05J13N0m5R9J7j34R3p2K3k7k5l1j66J07K10m2K4k19O3J42J20k84R3N3l1
5942B6j43Q9Om8M1j08q0J51L0r3J15J46q4k42J25J52r0J53k52j4JK52j39P9k7
$$ plain form
5770 -63 -107 -98 -88 -12 133 51 7 -103 75 -44 -100 5 13 -202 -216 -45 107 -136 -204 94 50 -48 -21 -45 226 99
5796 99 -51 27 170 -125 101 -30 -172 -197 102 148 -8 -72 41 85 -72 167 -1 -21 31 -58 170 -28 26
5819 26 -10 -161 29 -81 136 -118 16 15 -48 -277 13 7 -45 11 1 -36 -54 -10 21 122 33 97 56 157 -31 1
5845 1 -204 -126 -56 -137 77 68 96 -23 83 -139 183 24 8 83 -110 -51 26 -23 -94 -72 -53 17 68 -32 65 -102
5871 -102 144 -19 250 -46 169 26 -77 -7 -232 48 -105 -40 84 -26 195 20 -77 -82 -83 146 9 -193
5893 -193 -109 23 -171 159 -208 -145 -128 -75 28 -160 16 -36 -31 -87 95 -33 74 -6 -103 20 37 -109 -71 -105
5917 -105 8 58 13 112 129 -5 88 16 39 12 -13 -44 -210 -103 107 65 89 -130 -67 75 195 -89 4 57 26
5942 26 -117 -28 -22 -70 -29 -137 -217 -66 -36 -129 -14 132 48 -194 -69 83 -7 146 -106 -120 -119 133 -6 73 46
5967D6l7Q6l7j40K31j59k67L32j07p1J10k5j74K81m0j08J43j37J44j12l1J31j74
5990a15J55K0N4l5q4j4J5J65k85R3k1J14j9j40jK04j52J67k44R8J00l3l2q8J38
6015F0k12K03O3O1o8j6j03%J06Qm2j08J59J3l5J8j52j2J85k54L97k61J7N3m9m4
6041a3m3o0J22J11j86J84o9Lk07K76k6p6lJ1n7P5n1J18j70K2K3J46j96j07J16
6066e7J04l8Oj17J22P9j03oJ57k47P1N0J73L1l14O7L6k8m9R1K2j98K28j10J4r3
6092a09J56P6j54P6o1K07k24J10o5k10J44L0J03q3J22N8l48J40Mm7J20j62L46
6115B29n4nj02M7k76K15r9k33L54j40n5R6m1j25L34Rr0j37P3L18j79k00K35j69
6139EJ5J68k74M4k05K73j76J35n3Q6k9J9k5J22J20k42N1j31K56j89J12J7j03J29
$$ plain form
5967 46 9 95 58 -82 149 -10 -277 55 -52 -123 -13 -38 -212 69 29 -79 64 -73 71 -41 -72 59 -115
5990 -115 40 60 114 79 -5 -19 -4 161 -124 -31 -52 62 43 -97 -98 106 -46 121 -123 -25 75 42 10 -78 60
6015 60 -152 51 114 175 107 91 -12 -12 94 102 60 -48 111 124 89 107 -45 -57 128 -126 271 10 27 80 31 -13
6041 -13 -56 -116 6 117 -69 115 46 49 -158 118 92 16 13 24 -33 42 -9 109 -61 -39 -16 130 -66 -173 -57
6066 -57 47 9 15 -102 20 99 -4 -10 147 -100 -29 21 194 225 -89 -22 14 -14 -63 28 50 -148 80 -30 -16 -109
6092 -109 47 123 -31 45 -16 191 -33 77 12 -198 -54 -24 79 -4 118 176 -172 -32 -28 -75 45 -117 229
6115 229 175 170 68 115 -161 54 -45 -278 76 -64 -119 -23 -64 -189 145 154 64 -73 0 318 139 -61 174 5
6139 5 20 188 -86 -42 -247 26 -150 -15 -68 18 -11 8 -17 105 225 -17 34 -97 159 -30 82 99 -4 125
6163A25j38N6j87K46k28K62r7j49J7K60p7M1P6j65p6j37P5j08K55k04J40J66l59
6186b06K29M8j62P8j31K18o7k8l5J10K6L3j38K7l0J32l2o4L1p8J37K1k1m9j87
6211a38L65j39j50K30k72q0M15l04r6Q8N7J8j45Q4J13j05k3K01O6j01q0M2k07
6234a61K08L1Q9k30J44n7K8M9j40j12J74K8qo3k7L2K7Q7n8J1J00j36J2j48l0J83
6260C3o6q4O0L2j55K34mn8q2J62q9k6R6j69j67M10j24Q3J7p6O4K6j11p9J50j26
6286d9L38m12R6O8J63j84J9o3K4l7QM5Q9q7L9J33k71J33l5mn6J34j23L27n4l31
6312i0qQ7j13J31Nk42L38j93R8k42K64J0r9r4k05L02J00N4j34j19P4P4KM5l04
6337b59L92k49K81k31j83L27j22J09j80o3J30j56L66j52j01R5J88j19j43J84k10
$$ plain form
6163 125 -13 43 -144 102 -126 136 39 -110 -93 167 90 131 207 42 -34 -171 -96 -204 51 -153 -13 153 -206
6186 -206 23 71 -91 -13 -144 74 7 -21 -56 54 80 113 -25 2 -28 104 72 8 39 -39 98 119 98 49 -138
6211 -138 227 88 -62 168 -104 -184 231 -73 -169 -81 -24 -6 -151 -67 46 -59 -82 119 185 84 4 46 -161
6234 -161 47 78 167 -63 81 24 52 101 -39 -151 23 51 43 -20 -47 -15 12 99 41 52 152 16 28 -120 -150 33
6260 33 -33 -117 -57 -25 -180 54 50 -8 -90 72 -17 -43 53 -116 -283 127 3 86 103 27 91 117 6 -73 77 -49
6286 -49 289 -123 -27 41 204 20 39 -24 0 -37 -29 16 105 18 57 190 -81 52 17 13 -43 91 -32 295 241 -90
6312 -90 -98 -11 -124 7 12 -230 108 -85 13 -229 35 45 -54 -148 -353 -51 49 103 -31 -150 -76 -2 0 45 -259
6337 -259 133 -116 165 -66 -249 78 -44 65 -115 -178 -48 -204 162 10 -91 4 192 73 -70 114 -96
6358i6J78j67O9K44k40L9r9J11nn1R8j79J0j2K01kj21R1o0m6L3J72j23o7r4J43
6384B7j74J3J82j80J14Qm1n0K1R1J1%j6j58J26k9Mj1J67j2k18L02q8j02k76L77
6410H8M6l1Qj48K37j33J08k72J42l1L9k46J02lm8L26l31Q2J21M3j12J30k89N1
6434a21J1J62o0J32j36R8J14k82L32l42ll8K04j26m0l1Q5n2K42k57k0P1J61k87
6458a83J55P6k0Q2l9l0m4O2qkJ94j26j64J09O1J75l80N7NMk36K16j64J59k9Q4
6484A4l9m6J19O8k09N9K10k85j43NL35k52K53J52k44j52K01k4M2o5j3Rj17L05
6508A83o6k73J45K6j19M0K02j51J83r7j87K19j82o3J27J52k76p2K35O2j18jP9
6531D8J6jk09K52MM6j18l01L07j20N6O5j17N1K27j56O6Pk11o4K07L0k01M4L0N2
$$ plain form
6358 -96 82 -85 -16 228 -12 27 -72 39 34 -17 81 -98 -88 -100 101 99 -22 69 9 -37 -4 168 45 -22 -116 27
6384 27 -147 -134 48 -132 -18 -10 -51 -101 -80 11 22 22 6 -152 -26 -55 -51 -62 105 93 -125 177 89 -13 -289 88
6410 88 134 103 111 -37 200 67 175 -97 45 14 53 -193 -91 -94 -142 184 -147 -65 56 99 -13 117 -172 -121
6434 -121 -110 52 -8 124 -12 86 200 -82 250 -92 -95 -133 71 -55 -95 -126 -41 -93 149 -108 -128 -57 104 -183
6458 -183 -28 48 28 110 71 41 -3 59 51 49 243 117 -47 62 123 298 -82 -25 -20 -16 -252 -36 -200 -41 -70 14
6484 14 -25 -71 48 116 -93 -34 176 -109 -252 -247 88 -164 89 241 -3 -155 46 22 64 -1 -14 -5 -122 183
6508 183 117 -156 -11 15 -104 -64 138 -13 170 73 -114 105 -77 -140 -13 139 -137 -209 26 88 -30 -31 48
6531 48 64 63 -146 106 110 156 38 -263 44 -76 -20 45 -72 -21 206 50 116 123 -88 -152 55 85 -116 -72 -42 10
6557A0K6o8k4J12l36L75j49J69R5k93J15j48J80j85rl7K81j90J73j49j63J76J32
6580I3l17K89j72J43J57k14O8j16J89r7p8ML0o1J76j55M4J56j45P3j97J24J57
6603A51Pm16M69k92o7k7J71J01k1j71j18J21j1K71l10K94j57J97n26K61jM1r6
6626a29J9K5k1J35j55J18k3Q2r9J76j69K91k92J70O3k93Q1P4o6M2m3L8k03P2J27
6651B0m5l9J86k13L0J03q2o9J78P5k34Q5l02N12j34J19l11K06j65l2J79r1J26
6674A02j47j46J13p3K36n7j05j71L70j16j71K77j15R1k32J47o7J15p1R5PN6M1
6697A79k77K52j4l0p8J57r1p8j82K40j76J36Qq7M7k00K24l5j39L31j19j17q2K51
6721A20J25j01j94K15j49R1k08K12j89m2Q8k4J47j11j34J44j32O0J73j04Lk28
$$ plain form
6557 10 36 -32 -56 56 -280 95 -54 115 210 -83 32 -116 64 -121 -130 -167 114 -76 97 -52 -215 -39 93
6580 93 -224 65 -107 36 193 -21 47 -69 120 23 -55 -51 -21 -82 94 -61 -17 139 -6 67 -130 -6 151
6603 151 158 -258 211 -81 -148 -175 -4 97 76 -95 -213 -92 -103 168 -142 152 -5 192 -334 -73 -74 -33 -129
6626 -129 -110 -85 -106 29 -126 -8 -31 51 -48 128 -41 250 -42 128 191 -102 -21 53 -13 29 -14 24 -179 -107 20
6651 20 -25 -64 122 -91 -61 42 -40 -109 69 144 -90 -5 -307 205 71 190 -121 85 -80 -112 67 -24 102
6674 102 -45 -191 -78 -151 85 28 -77 -248 122 6 -165 112 -3 88 -144 3 -64 51 -20 75 82 138 179
6697 179 -98 154 140 110 32 189 98 20 -162 78 -98 38 46 -41 6 -194 30 -5 -144 187 68 -49 -131 120
6721 120 245 144 -50 165 16 107 -101 111 -78 -120 -32 -56 91 -20 -154 -10 -142 -82 91 -13 -10 -238
6743b38J78Q3r7K26j73nM2k33J03o1J69o3K9j9j52R8K98k60N6J44n6J1j22l01
6767c43M41j30k20P0p2L10P2j45P4J6L4k42J02p1J42K21l55J84j76M39n60L15
6789A06k28Q7O0j5L0j7M9lmJ12k40n3J81P1p5j01L6j91K21Mj6j75J42L8J86l28
6815a23M43m62K5O1K24m5j29N9J7q1J82j12Rr6l7P6j82R0K4L9O8J09k85K86k68
6840a08J5J26r3k8n0jK16j08j5J02k0P3p0k29M02o0r8j3j08J59j74J20l98N65
6864B05k17J01r8m1l6K4L72k36Oj13q1J52k07R9J55Lr6O0oj50j46M28j97O0o4
6889b3J3M4j23N4o5J57p8J36p5J11k73K77m00O23m21p1J2R9Mj17J17J15Kr3o3
6914c8n5J02l9o9L6l2K56N1l98Q6K31K2k36N0R8j04r9J50j82J52J25o6O3K60n16
$$ plain form
6743 -238 -60 23 -74 152 -21 -26 16 -217 -114 -175 -6 -69 -40 -59 -211 -113 185 -75 -19 125 69 80 -42 -343
6767 -343 98 -32 -252 -182 -254 56 128 -17 57 73 107 -135 -33 -104 38 259 -96 88 -88 351 -209 106
6789 106 -122 -35 25 10 40 23 72 69 65 177 -63 -116 65 136 61 -40 -4 -195 26 30 14 -161 -19 19 205 -123
6815 -123 320 -142 -117 -56 168 123 -6 53 70 -11 171 59 68 -28 -65 11 -171 -81 -57 -18 50 159 -126 160 -108
6840 -108 -93 33 -60 -88 -138 -139 77 -31 -46 56 36 109 39 -190 212 152 54 41 -67 92 -82 38 -360 205
6864 205 -12 89 -9 -50 -86 -62 310 74 80 -33 -114 38 -169 -70 85 88 -8 52 46 -104 -250 178 -19 41 -23
6889 -23 -10 34 -89 -35 -100 57 -21 115 40 151 -122 155 -245 378 -43 -114 -102 -3 1 -116 1 116 118 25 -38
6914 -38 -93 9 -30 -99 -63 -95 161 212 -186 -100 131 153 -83 -33 65 -39 -138 12 -170 -18 107 41 104 364 -152
6939a52K31j35j04K43q9j6j11J15R2j5p3K14j9j84r4J32N8O4n8r8j48J78q1l6
6963h6J36J2j29Q0J09j6j61P0M9m9j08M4J86k4j36j18R3q9J35n9p7N3J46M7J07
6988B15l07L3L48l69jO1R5j80K14j14J29j36j7j8j41J43J8j9P3m7l3J99J4m3k10
7013i3M6M9P2K7j02J06Pk67L36j26p3L8o3m4J73n4J33j7k06l7JJ89j43R3q1OR1
7040F1j8K8K6k27J69M2p3p0J88k11J23R8k07J90j18J48k37K29p8m2K04j71mk04
7064a54J06J18o8K6NJ73m34K02m5N7j90Q2J29j98L44r3j71J40J49j65J97j47k36
7087a73L44l52L43l23K05Qj3Q8nJl75K20m2o3J70j40K3J61M8Mr0k0K1k62J97J7
7113ho4N6r4J10J04j08L6M2j43J8R6J37o3k04R8J41k65K18k17K26q7O1j65J62
$$ plain form
6939 -152 79 -56 -160 83 -6 -22 -133 -18 74 59 -14 200 181 -3 -97 35 93 157 99 1 -147 31 -50 -86
6963 -86 50 62 -67 13 122 106 -55 15 64 15 -93 -49 137 113 -23 -141 -48 -137 -2 -61 -138 -85 61 108 215
6988 215 -92 -59 289 -80 -81 -20 75 -105 109 -5 124 -12 -29 -47 -188 -45 -27 -46 27 -20 -53 146 160 117 -93
7013 -93 -47 2 74 101 -1 105 112 -155 181 55 -18 20 -43 -87 86 32 165 148 -58 -95 -94 95 -48 45 -36 -30 61
7040 61 43 71 97 -130 39 81 8 -62 126 -85 38 136 -71 119 1 149 -88 141 63 21 225 54 50 -154
7064 -154 -48 70 2 28 33 206 -228 -26 -71 -14 -204 -122 7 -191 153 60 -111 29 178 13 210 63 -173
7087 -173 171 -181 162 -161 44 52 39 127 122 123 -252 -32 -74 -137 33 -107 -84 77 125 129 39 19 40 -222 -25 -8
7113 -8 -72 -16 -110 0 104 -4 32 74 -69 -51 45 182 119 -85 13 154 -111 107 -110 116 29 90 -75 87
7137H7Mj28Or6q7K92j23M3j04J59r8On5J02j19J23J97m48K27j3P5k40J26p4p5
7162b13J93l4K69m13m1L7K75P2k50J84j40J17j25j0r1K78q9k1k19J37N2K0j27
7185a39j20K06m7J03mm6JJ73R6k27o7p1J17n4O9MK9j44J13j60M6J3K09o1nrn4
7212b9k5L33l67J03j20R7J07r9q4Q4L9k01K02q6j09M08q2j29Q8j29P8j06R4j69
7236a02K67j29K2j93jJ36o8J38J4M6j19Q7j41N8J0k5J41l21MJ23N7p3J06k1j92
7261a76M0K0N6J93q7Rn3J06P5j00j21J0M0J60k88J64J00l11K19N6J19l5p0l99
7285b73J20M25k17r5k2Q6l6J11m2j88k5k65L97L9R7l0o7jj80K04R8j80m5K72k98
7310a15J40N1q1j51kJ63J9Q3j30QJ02j81J50p7K41j1k98J46k5l4j09J8j07J69
$$ plain form
7137 87 91 -37 -31 -127 -214 78 -45 -2 -106 53 -45 -39 -94 8 -111 12 209 -239 -12 -25 50 -190 -64 -138 -213
7162 -213 -20 -54 215 -198 -239 -202 73 145 -105 79 -61 56 -69 -79 -170 108 19 -2 -221 -84 -32 -12 -139
7185 -139 -259 -53 -100 3 -1 -47 -46 127 223 -4 -71 -142 -25 -79 -10 -6 23 -121 -8 -168 -122 -109 100 39 34 25 -29
7212 -29 -54 279 -88 15 -105 -8 99 0 -84 0 39 -162 40 -46 -155 253 171 42 130 1 79 -27 67 -102
7236 -102 165 36 58 -135 -136 0 -68 70 84 130 11 98 -43 15 25 0 141 -180 -176 -53 4 -69 37 16 -176
7261 -176 -136 -116 -60 133 46 55 2 108 183 83 -38 -28 12 172 -116 48 148 -163 56 112 231 196 126 -273
7285 -273 -153 272 55 -40 -62 24 -12 99 57 -131 -156 -421 -24 15 112 82 15 14 -166 38 136 -44 -89 183 -115
7310 -115 25 76 -5 -156 -158 5 24 107 -23 -15 87 -94 56 -21 220 209 -89 57 32 -2 -111 -93 -200 -31
7334c1j0k4n6l9K48j85J46j02q8J14J44l19J96P4Np3j13J36O1j04mj78J66r7K10
7359G7r0N9j05M1K40m5j68K8M2j70J27R7M7j62J32o3k05R4j32K84k10ML2R5j38
7384h9j0J70k76P5L00j83J29j24j35M9O1n5J71k07M9j67K42k4J35J61k10j74Q8
7407b4l0P6J28k25J34q2J18k7j80K96k21n8K35j95n9J65J71j22j17m3J68j66M1
7430a7m2Q0Q5j87l93L92O6Q0R6p0p8L4j34K65k39K25r3j67l3J25lk8l8J62K1n
7456A04l49P0%J61O5R9O9k66Q4m5P0j18l3J53m1L8O6k03K43n9lk9j07K64l64J81
7482E0j7j29rJ58k0j45K27j37N7o4J58k58M9K64l48N7J18n9K8J08k32%K63j88
7506f9J38j14m1J38j78j19M18j60j03r2L71N2j53Q3j30L1j08J90l66J99R1j3p3
$$ plain form
7334 -31 -41 -65 -121 -160 88 -97 49 -53 -141 -27 117 -202 -6 68 73 0 -113 23 84 -20 -24 -202 -36 -133 77
7359 77 -13 46 -59 -18 222 177 9 37 79 -91 36 133 180 18 150 87 -118 -24 -156 128 -82 -78 -46 49 -89
7384 -89 -99 71 -205 -130 170 -13 116 -8 -143 -94 -33 -88 83 -124 -75 -242 0 -24 111 272 62 -112 -24
7407 -24 -54 22 150 -75 59 -23 95 68 -112 184 -37 -95 140 -55 -114 51 222 100 -17 -60 108 -58 -17
7430 -17 -59 21 106 -81 -474 -82 -16 64 160 90 12 46 -88 177 -62 163 70 -97 -130 -5 -8 -36 -74 88 109 104
7456 104 -245 -175 -175 -14 51 150 219 -47 37 -8 62 -56 -89 64 23 61 127 -76 167 108 105 76 -31 233 -131 50
7482 50 33 -96 -105 53 33 -112 115 -22 35 -29 129 -129 -80 184 -164 -107 11 -48 -20 88 -144 -144 119 -69
7506 -69 69 -45 -86 52 -126 -245 173 13 -90 -182 189 241 88 171 41 72 -36 154 -212 -13 78 65 -8
7529hrJ47j22n1j16M1J46rJ00J18k82nj49j1L61j90K8N9j69r9J38P3J99k27J13
7554G6j84J22L0j82K7j05J61j4K12k55J79j73J06j34q5L39q1K5j53J22M4j95K19
7577A01r7M0K3o2L5l3r1P9O3L1j84L31k45J13r9n1l3N6Kl5O2J38l96J85mN4J96
7604A79m00j4O7L4M91l29kJ28j91J41M7j52O1J42k75L2L08l31m5J21KNl5k10J83
7629d3M1J75l17O3K78j96K09m02K81k47q1J74L2K75l80K51ol39L11p2O3j84K40
7652A26j24j96K60j70J86M3j48J60j01q5J74k70N0r4p2L41q5Q4j39M7N9j6p9J53
7676A04j79K21o8k14L09k50K15j37M5J5m5k23K42l5m0K3O8k17R2J72n9j8K95j97
7700A19O2l55Q0K92r2j5j21n0l3m3O7K85m51K85R7o7k41Q4M0K05l00j5K24k7m6
$$ plain form
7529 -8 -17 130 8 -43 -159 -118 28 19 119 237 -45 -50 -199 -210 151 -39 -11 48 -121 -220 -82 -9 190 -37 76
7554 76 -108 14 44 -138 -111 -216 -55 -69 143 -112 67 -106 0 -134 -219 120 39 64 -89 33 77 -118 101
7577 101 4 44 67 5 40 7 -84 -5 58 89 -95 236 -9 104 5 -46 -79 -23 -21 -56 6 144 -252 -67 -71 -17 179
7604 179 -221 -235 -168 -134 357 28 26 154 -37 104 151 -1 60 202 -73 -41 267 -64 -109 12 14 19 -16 -226 -43
7629 -43 -2 173 -144 -81 197 1 210 -192 89 -158 -239 -65 -33 242 -138 113 107 -232 79 7 70 -114 126
7652 126 2 -194 66 -104 82 125 -23 137 36 -49 125 -145 -95 -189 -261 80 -5 79 -60 -13 46 30 -49 104
7676 104 -75 146 78 -136 173 -77 138 1 46 61 16 -207 35 0 -40 -17 51 -166 -74 98 39 21 316 119
7700 119 181 -174 -94 198 106 91 -30 -80 -113 -156 -89 196 -255 30 127 60 -181 -97 -57 148 -152 -167 57 30 -16
7725a6j73L21k27J58j10l2K3J0K43j71O1j72qkq4O1J71k59J24j2J51j60K24j51
7749c0m3J80j25j00j49P2J62K12o5k74J13R0J01j64J26j39J11k7j05J1j77K70
7771E0j06p2J92P2k14K1J7J5J11j9O7j48r3O9Q5j2k31J51L1j1p4K10j65j17J59
7796a2j20j6J61l8R7k5j5o3K1q6J06n0M9r8J05r2J71l4j87P1RL8J38j71q0J78
7822E7j5M1j24k51K97l2J28m8j17K00k52J06N6o9K17p4l07J2L90m30J50Q6j05
7845h4J72oj52J23j96n2K24j40pJ44j77J01Q8M8j42mK2r8M9NK48j39Q7j00O1j52
7871g7J23K06k41P7j20n0J61j82j28J52J47j13N0Qm1KJ95l61J70k3J02on0n9M1
7896a7j1J10m09M26K4m6M9l1Mk28K72k61K21k38K19m5j00J16r3R0k03J5J30J09
$$ plain form
7725 -16 -189 132 -95 63 -47 -79 -56 -46 197 26 87 -85 -93 -95 -179 -118 53 -206 -82 -94 57 -103 121 -30
7749 -30 -73 107 -18 -118 -267 -195 -33 179 114 -160 -47 43 144 -20 106 -33 78 51 -54 -43 -220 50
7771 50 -56 -128 64 136 -78 -57 -40 -25 86 67 134 -14 -107 -38 47 35 -196 -45 -14 -25 -99 111 -54 -171 -12
7796 -12 -132 -148 13 -25 72 47 32 -31 -10 -96 10 -40 9 -89 16 -76 95 61 -126 -55 -46 -8 130 -41 -121 57
7822 57 42 83 -41 -292 5 -27 101 53 -64 136 -116 -10 46 -23 194 120 -187 -175 215 -215 -65 21 -84
7845 -84 88 82 -70 53 -143 -195 29 -111 -118 26 -151 -50 38 86 -56 -60 -38 -136 -87 -82 166 27 114 14 75 -77
7871 -77 46 252 11 88 -32 -82 79 -103 -231 -79 68 -45 5 13 -28 -26 169 -192 -22 -45 57 51 1 -58 -17
7896 -17 -28 82 -327 99 123 77 126 95 99 -129 143 -118 103 -135 84 39 -61 55 -38 52 -151 -136 -6 103
7920A03j27j08R1J28j68l9J87q8m3k50L09r7m2J41j84J23J19P7k15j87K97qj42
7943a23j48K91j0oM7q7K2o6P4R1oj29J09p0J15rj19O8M8qR2k63L19p5k41K43j79
7970b0l2P7j03l4J87J29k28j9n0J59J70m14K43j7O4k53K94j01o3J24j6j48m3P2
7994b2J03o1k25o6L71k9o6j44j1L42k71N0Q9j97J40J13k13R6L0j29L7k32K15J59
8018G9p1K7k3q9P8N1P9j77j5J36k96K52l1L0K52l65J2J66k9j09q2J85l3j01J00
8043B6j20r6K45j41l9j5M0K03j70R7j70J47q5K35j26j32M2j03J47j24J64J25j26
8066B4J82j85k8p9j43J76o2J42j17J40P6k03J09J98j72R8k20k15J40K8l6J02O8
8089B3r7oJ23j59J92r1m1R3j80J44k04J27m6R7P6j76P7J02K1k02J39j49K78l18
$$ plain form
7920 103 -24 -132 -41 87 -81 -120 67 -21 -64 -314 -5 -102 -144 -3 -187 -64 55 132 -83 -270 27 19 -123
7943 -123 -271 20 10 4 51 -36 -14 -80 -6 85 79 -50 59 -11 104 95 -24 44 92 84 176 -87 232 157 -84 159 -20
7970 -20 -52 25 -78 -112 75 204 -24 -43 -93 66 236 -178 65 48 112 -141 153 52 -11 113 97 -51 -94 -22
7994 -22 81 20 -205 -271 100 71 5 -139 -150 192 -79 -29 60 -137 3 116 -97 -1 29 -100 -63 -295 -80 79
8018 79 8 35 12 -77 1 52 131 -46 -61 75 -221 31 0 30 282 -83 -71 95 66 -43 -125 60 27 -74 26
8043 26 -94 -190 55 -86 -125 -140 -100 103 -67 30 -140 7 -78 157 31 -101 -59 -162 -15 -139 25 150 24
8066 24 206 21 -7 -86 -229 -53 -115 27 -90 50 126 -77 32 230 58 156 -64 -279 -139 -111 -147 -45 23
8089 23 -74 -80 43 -116 76 -15 -56 37 -143 1 -203 -76 -122 -25 51 -125 -48 54 75 -127 12 -137 141 -177
8113a77K89j94M1L1j51J84MR3j50j1Q8q1J08J9m14L87Kj40K68l35K14K3k81K18
8137C5J97j39j40o2K87j31m4r7p0L40j17pm9j82J87Q0j42mj99j05J73Q9P6J28
8161A04q5m6J32o2j31L3M5J30q6j86R0J20k6J3M2N4R2l8k29j1q2L5J61n9J27k53
8187a16R9l3j68J77
$$ plain form
8113 -177 112 -82 -41 -10 -161 23 27 120 -30 -41 47 -34 74 93 -321 66 68 -72 196 -139 75 98 -183 35
8137 35 232 93 -47 -109 178 47 3 -94 -164 176 59 52 3 -179 8 88 -54 -58 -257 -362 -189 -100 -24 104
8161 104 19 -27 105 43 -88 -55 -10 120 34 -152 -62 58 32 45 87 141 233 195 -34 -45 -127 -92 69 10 137 -116
8187 -116 -17 -50 -218 -41
8191d1
$$ Imaginary data points
##PAGE= N=2
##DATA TABLE= (X++(I..I)), XYDATA
0@%%%%%%%%%qJ6j6J6k4L2m0N6o5P4r6J19j37J62j94K30k70L14l64M20m82N53o32
32c36P19q17R24j042J173j315J470j642J831k039K263k507K776l069L388l736
48a959M118m540N004n512O074o697P392q175R063j0077J1245j2611J4238j6211
62h648J8659k1794K5977l1873M0857n6384R0589l01208K06978N31895m41197k90018
74b36167J21327J50602r7847M9393P0380m7221r0741N6499N0780N772n4022p501
86b8746M9591j9184j41733Q5252K77821l2284l65576p3886K67640J03059q8467
97C3487M8671k2203k24001J7051K99934J2652k53766k1608J70469O782p8276K3588
109A2780K1678n9453k9592K8385N9080O0224l8504j00677j2572J3455l745J17356
$$ plain form
0 0 0 0 0 0 0 0 0 0 0 -8 8 -8 8 -16 16 -24 32 -33 41 -55 64 -73 89 -105 125 -145 169 -195 225 -257 296 -336
32 -336 383 -434 490 -552 621 -694 776 -866 965 -1074 1189 -1318 1458 -1611 1777 -1959
48 -1959 2159 -2381 2623 -2889 3185 -3512 3880 -4295 4768 -5309 5936 -6675 7563 -8648
62 -8648 10011 -11783 14194 -17679 23178 -33206 57383 -243825 -36847 495048 53851 -236167
74 -236167 -114840 35762 -62085 -12692 57688 10467 -80274 -23775 27005 32777 -21245 -28746
86 -28746 20845 1661 -140072 -54820 223001 190717 -174859 -248745 18895 121954 33487
97 33487 82158 59955 -164046 -146995 152939 165591 -88175 -109783 60686 67468 -10808 12780
109 12780 34458 -24995 -54587 -26202 32878 93102 54598 -46079 -58651 -45196 -48941 68415
121F8415J05505j71179j90427J54649J91783j47185j34472J70384O3566j99784
131h8745q949K18992j402k18280m8451J53101R0451m4195o4678k1786J1458l002
143b5486j4835O0427O6396p7741q0711P1880L4146q1513K7279J02005p2260j16832
155a07245J02097J23020j06195j08180P1974M7530m1777K7622N5812m5897p6534
166e7773M732N5822L3075n157k8242j4614J8978m625k8540L0710L1440n3420j6324
179c3938O9024j657o7401K1711M5499o5269l5293J12974M9393j15158m9892P7297
191G290J8659m8613J0327M8903j220m8591k5074L1164L7974j8156m7165J4302
203b0200N6836j2213m8923J5532J6681l2658R107M8278j3348l8417K6677K4244
$$ plain form
121 68415 173920 2741 -187686 -33037 158746 11561 -122911 47473 111039 -88745
131 -88745 -97694 121298 119896 -98384 -146835 6266 96717 52522 -12156 -33942 -22484 -25486
143 -25486 -40321 20106 86502 8761 -71950 -70 34076 -47437 -20158 81847 9587 -107245
155 -107245 -5148 117872 11677 -96503 -24529 23001 -18776 8846 64658 18761 -57773
166 -57773 -53041 2781 35856 30699 2457 -12157 6821 2196 -26344 4366 35806 -17614 -33938
179 -33938 35086 33429 -33972 -12261 33238 -32031 -67324 45650 95043 -20115 -70007 7290
191 7290 25949 -22664 -12337 36566 35346 -13245 -38319 -7155 30819 12663 -34502 -20200
203 -20200 36636 24423 -24500 -8968 7713 -24945 -15838 32440 19092 -19325 7352 31596
215C1596n8450l0213P5609M3581n5780l7897K2528J8298p293j3078R76J4020N407
228I304p858k627M729j0244j5894K0965K4876k3508j1549L4341k794m5553k657
241b8469L6403R553j2223M936k276l0635j77L7925J358l1494j63K8093J0650k4395
255i14k4062J4426K5408n615j7789O437K1499n910k8313j790J4002K393J0073
268I845R087k0485j9421J3522J7369j0164j4015J5075J5888j3510j1451P613L176
281B529o390k832R843J1398q174j0943L764N5r336R08J5775J0264j4215j5235
295a2589P325N863m759L544M479k592MM021K32j1324o702J4739R903j0423n335
310c614P151L428j0960j2168J0193J6089l985p412J167j329l861L91O326L169
$$ plain form
215 31596 -26854 -57067 18542 62123 6343 -31554 -9026 9272 1979 -11099 -10123 3897 9304
228 9304 1446 -1181 3548 -6696 -22590 -1625 23251 -257 -11806 22535 19741 -25812 -28469
241 -28469 7934 17487 5264 10200 7924 -22711 -22888 15037 16395 -15099 -15262 12831 23481 -914
255 -914 -24976 -10550 14858 9243 -8546 -2109 19390 13480 -14833 -16623 -2621 -228 9845
268 9845 18932 -1553 -20974 -7452 9917 -247 -14262 813 16701 3191 -8260 -647 2529
281 2529 -3861 -6693 3150 14548 6374 -4569 -805 -750 -10086 -9178 6597 16861 2646 -12589
295 -12589 -5264 599 -4160 -616 3863 1271 1275 5296 5528 -5796 -12498 2241 12144 1721 -3614
310 -3614 3537 6965 -3995 -16163 -5970 10119 6134 -1278 -111 -1440 -5301 -4910 1416 4585
324D585n235K043P941o630j0067K390O314J851l059J298M920n796q666L523L881
339g07q57J621L855K123p333p499O847O424n205j142O584L787o422r286L528N843
355B161l723J201M983l121k831j05j335k064L75P367M155o896k909L067M31q09
371e3k753K9R452K205q960m698K378J120p59K154M488m372m431O317j615q171
387g669M906P018k380o99K266k235m420J758L847l453l47O944j642n043P74o183
403f558k412J3606N892j2137p065Q495N043o662o39L467n079N545J1096j0697
417A895j2058R236N664o367J037M225m002j060P242p544j4713J3817J8600j1908
431D064j2261M667K160L317O820q239j3557J0581J9099q839j6670N516L845o553
$$ plain form
324 4585 -650 1393 9334 2704 -7363 -4973 1341 3192 133 1431 6351 555 -8111 -4588 -707
339 -707 -1564 57 3912 6035 -1298 -8797 -1950 4474 -731 -1873 4711 8498 2076 -7210 -3682 2161
355 2161 -1562 -361 4622 1501 -1330 -1435 -2770 -4834 -4459 2908 7063 167 -2742 325 756 -53
371 -53 -2806 -2777 6675 8880 -80 -4778 -2400 -1280 -2039 115 4603 231 -4200 2117 502 -7669
387 -7669 -2763 4255 1875 1176 3442 1207 -3213 -1455 2392 -1061 -1408 5536 3894 -1149 -375 -6558
403 -6558 -8970 4636 10528 -1609 -8674 -179 4864 -1798 -2437 1030 -4049 1496 12592 1895
417 1895 -10163 -927 4737 -1630 -593 3632 -370 -1430 5812 -1732 -16445 -2628 15972 4064
431 4064 -8197 -3530 -1370 1947 8767 528 -13029 -2448 16651 7812 -8858 -3342 503 -6050
445f050J0518N817j8079m34J8481o402j9604Q829J8705n516j0621K856k881K216
459b165J6188r317k2500J4785K0172j4399r398J1655n897j4590J5482J7303j7543
472b24j1104J3889l364p612J5136M84j6902P374J2610j2293m154J6783o136k1241
486a6754J4698K1056j9342j0435J8810n699j7822J3638J2371r724m56K333j5871
499a3197J587L0998l067l5105N561K6095q562m726J2708j7377j8349K7211K0119
512B3896k3909j3588J5983r44r906J1452N80j1525J5660N231l3987J054M5331
525B5328p16m2231k166K5471J693q4P113k3073j8839L0041J8864k0691l594N917
539C033j8882L371L1569o769l0272J4520K0427k6048r132L5294K352l0824K34
$$ plain form
445 -6050 4468 10285 -7794 -8228 10253 3851 -15753 -6924 11781 6265 -4356 -1500 -4381 -2165
459 -2165 14023 4706 -17794 -3009 17163 2764 -6634 5021 -876 -15466 16 17319 -224
472 -224 -11328 2561 -803 -8415 6721 7205 -9697 -2323 10287 -2006 -6160 10623 4487 -16754
486 -16754 -2056 19000 -342 -10777 8033 2334 -15488 -1850 10521 797 341 2674 -13197
499 -13197 -11610 19388 16321 -18784 -13223 12872 4310 -416 12292 -5085 -23434 3777 23896
512 23896 -13 -13601 2382 1438 -8468 2984 3564 -7961 7699 12930 -21057 -20003 25328
525 25328 24612 -17619 -19785 5686 7379 7295 14408 -8665 -27504 2537 21401 710 -2884 3033
539 3033 -15849 -12478 19091 12322 -17950 -3430 16997 -9051 -18183 17111 19463 -11361 -11127
552a1127J0698j544J3767P569k9700j4940K6950J1359j4430P824M181l2397j001
565b2791M3527k79l3021O996J2111j7695N061K8596j0797k9472Q303J4409o276
578a328J0378P187k9585p487L0095j830j8645J9295J0217l3480r677L2673R801
591A7614j4337O54j0426j8692K8314L2475k9610l0981J7820J2138p479J2642O655
604A6787l0303j0862L1039P074j9748O958Q231j8209j248J5685l444J150J2714
617A5824j9357k5554K7158L3812k3018k6782J2330J745n631K6067O901l8970j1406
630b6881L0976Q989j3660L460J647j4704K581J4764m718j135J1263j6222j8774
643b2414K3955J9891j8707j1085Q695q034m887K5826P712l1455p052K0923k499
$$ plain form
552 -11127 -429 -1973 11794 19363 -10337 -25277 1673 13032 -1398 6426 10607 -21790 -22791
565 -22791 20736 20457 -12564 -5568 6543 -11152 -6091 22505 11708 -17764 -9461 4948 -1328
578 -1328 9050 16237 -13348 -20835 9260 7430 -11215 8080 18297 -15183 -24860 7813 17614
591 17614 3277 3931 -6495 -25187 3127 35602 5992 -24989 -7169 4969 -2510 10132 16787
604 16787 -13516 -24378 6661 13735 -6013 945 9176 -9033 -10281 5404 1960 3110 15824
617 15824 -3533 -29087 -1929 31883 8865 -17917 -5587 -3842 -9473 16594 23495 -15475 -26881
630 -26881 4095 13084 -576 2884 4531 -10173 -7592 7172 2454 1319 12582 -3640 -22414
643 -22414 1541 21432 2725 -8360 335 -7699 -12586 13240 20952 -10503 -17555 3368 869
656H69n160J8393l598k6552L375K1541o24p729L290n980r877J2366J0066r703
670F77r01K411j4034J588K4059j744k1875L380J2213j1065k536K2000j872k5004
684a2703L633J7009o046l817R658o042j2553O435J1294k648l946j582o497K934
698d871J3370m423j0581R718J541j5477N659J9090p234j6492O728R471r259j403
712d163J2724n493j2851P080P203m664j55K387m806j956N022K459q18J364l835
727e02p248P210J0176q936o564R860p45j0608N165J0312o165r067N531M427n516
742b670J530O148n087n366M700K507K18J482l374l389K053L177j163N5K485m629
758a323n625P363N482p558k098N740k080m426M510N531l858n718K160L440o27
$$ plain form
656 869 -4291 14102 10504 -16048 -12673 8868 8244 515 3805 -2175 -12052 314 10380 677
670 677 -224 2187 -11847 -10259 13800 12056 -9819 -6439 5774 -5291 -7827 14173 12301 -12703
684 -12703 -9070 7939 1893 -1924 7734 1692 -10861 -4426 6868 4220 274 -1308 -7805 -4871
698 -4871 8499 4076 -6505 3213 4754 -10723 -5064 14026 6792 -9700 -2972 6499 -2760 -4163
712 -4163 8561 3068 -9783 -2703 4500 -164 -319 2068 -2738 -4694 328 2787 1969 3333 -502
727 -502 -7750 -540 9636 700 -5864 3996 3251 -7357 -2192 8120 1955 -7112 -1581 2846 -2670
742 -2670 -1140 5008 -79 -5445 -745 1762 1980 3462 88 -3301 -1248 1929 766 821 3306 -1323
758 -1323 -6948 415 5897 -1661 -3759 1981 -99 -4525 -15 5516 1658 -4060 -1900 1540 913
773I13J799j38m398l60J735M61K272L76m267k161K115K763j24l40L01l504j439
790c996O306K277m724j164R66n61N47K115J499k653l880J263J956J895J016l021
806a59l272J305J749J591R61k303j662K48J909J827o00q93n55k179M60M103L45
823B875k396k402j070K064J880N99m38k874j440K457K048O73j203j836J24J249
839C10M59J103n83j643o22m4J358J577j147j426r57j029K265K565r99k224j403
856b440J202K609o1l05o52j163M19Q55P72M98j835k061J678J352m86k33o15j69
874f35o85k9K392q7j391L99m65q19K265J144j099j294j295J401K119k85j822k081
892b267Q29K564o62r90P04j653o77L549j55k499N15K528m33l281J164L355j797
$$ plain form
773 913 2712 2574 -1824 -2184 -449 12 2284 2660 -1607 -3768 -1653 1110 986 646 947 -2557 -3996
790 -3996 2310 4587 -137 -1301 -335 -896 -349 1766 3265 612 -3268 -2005 -49 1846 2862 -159
806 -159 -3431 -2126 -377 1214 2175 -128 -1790 -1542 367 2194 1594 701 146 -2033 -1573 2530 2875
823 2875 479 -1923 -2993 -929 951 1550 1112 -1762 -3202 -745 1303 1976 773 -1063 -939 310
839 310 769 1872 1289 -354 -976 -1020 338 1915 768 -658 -1615 -2644 -379 2186 1187 -1037 -2440
856 -2440 -1238 1371 1310 1005 353 -810 -391 464 1236 1734 -101 -2162 -484 868 382 149 -466 -635
874 -635 -1320 -1349 1043 956 -435 -36 -501 -1320 945 2089 990 -304 -1599 -198 1921 1636 -186 -2267
892 -2267 -1438 1126 464 -526 178 -1475 -2152 1397 1242 -1257 -742 1786 1353 -1928 -764 2591 794
909G94j317P20j072M33K371j768k194J007R01kJ63O73k058j333M629J134n314
926b233M41M309j942j195K073r86k466J859K993k839k298L219m92l276L517J523
942B207m617N61L884j931j898K183J136k010N13J111k772J213N497m663o400N818
958a68M568n016j065L476l411l189O458L967p720l036O332O91k145K536k529k767
974c018N258P45o279K298O452m581p170N338N364n664M30M311p013k746J0310
989D035J603q067n81L601k035J714N936m977q171O380O457p495l71O419m883n258
1005e693N803K428l336J674J128p051N28J0894k292r208N724L014r222L580J1706
1020I677o626j1397N853P315m672j052N096n821n210P144K899l699L017k039q678
$$ plain form
909 794 -523 197 -875 -442 1929 161 -2033 -1026 -125 -127 36 709 -1349 -2682 1947 3081 -2233
926 -2233 -1792 2517 575 -620 1453 467 -1999 -140 2853 14 -2284 935 443 -2833 684 2207
942 2207 -2410 -1849 2035 104 -1794 389 1525 -485 28 1139 -1633 -420 5077 414 -5986 -168
958 -168 4400 -616 -1681 1795 -1616 -4805 1653 5620 -2100 -5136 1196 1887 -258 2278 -251 -3018
974 -3018 2240 2985 -3294 -996 5456 875 -6295 -957 4407 -1257 -827 3484 -3529 -6275 4035
989 4035 5638 -2429 -3010 591 -1444 270 6206 1229 -6942 -562 5895 -1600 -1971 4448 -435 -5693
1005 -5693 110 2538 -798 876 2004 -5047 -4519 6375 4083 -5125 599 3613 -5609 -2029 9677
1020 9677 3051 -8346 -2493 4822 150 -902 4194 -1627 -6837 307 3206 -493 2524 485 -8193
1035h193N579J1743o458r313P430L717r868K896J1855p021j0165P195L514o002
1049c091N336L864j0138l928R692K349n234L479m00j0104M329J3717o296r023
1063e448N275J795n238N540N125q889m133Q410j323o754Q993M592j4245k587J3478
1078D591n27o894N386L78j0033L084J2345l297q972K862K11l024Q169K806j1805
1093d720r21R023m041m037J0559L94j4509Q93J3494k472p234P075p11j1175N950
1108b432J0921n543o246L628j864l164Q026M243j0371l117P436k512j830R195
1122F370k259j2476M030R615m055k449O145m493r173Q528R622r134m817P098l605
1137a053n290R259L953r456k100M985j349m16O653k074r332L346O567m130J179
$$ plain form
1035 -8193 -2614 9129 2671 -6642 788 4505 -5363 -2467 9388 2367 -7798 -603 2911 -3091
1049 -3091 2245 6109 -4029 -7957 1735 4084 -1150 2329 1929 -8175 -3846 9871 3575 -5448
1063 -5448 -173 1622 -3616 1924 7049 -1840 -5973 2437 1114 -5640 3353 7945 -6300 -8887 4591
1078 4591 4064 -2830 2556 2934 -7099 -4015 8330 5033 -3939 -1077 -866 -3890 4279 7085 -4720
1093 -4720 -5641 3382 -659 -4696 5863 6257 -8252 -7359 6135 3663 -3571 3504 2793 -8382 -2432
1108 -2432 8489 2946 -3300 328 -1536 -4700 3326 7569 -2802 -5919 1517 -995 -2825 6370
1122 6370 4111 -8365 -4335 5280 1225 -1224 4921 428 -8745 -217 9405 271 -4546 2552 -1053
1137 -1053 -6343 2916 6869 -2587 -4687 298 -1051 -1467 5186 3112 -6220 -2874 3693 -437 742
1152G42N235p891o597J0719N022q873j226O198m580n153R657L848j0554j230O190
1167A507l003K7O221k667o652K949L522k031J395L117o493m456R220K281p802
1182b865K291L771o952j336R508L63q545P66N271l593q23O760k083o864K947L448
1198B064k229J324J431m709j671N661P40m192K001J515n775K55P969k197n876
1213c689L767J627m495J676N729k529n675K684L157k829P64K581l681k222L585
1228D50O01j728J878r44l592K075L948j950k863L204M01m309K245M707l694k969
1244b540L465K29k986J476K610j910k780J948J138j265J101L76k667J049K065
1259A309j676J83J868j453j641J353J885j860j097K852r90l178J989K328k289
$$ plain form
1152 742 5977 -1914 -8511 2208 7230 -1643 -2869 3329 -1251 -6404 3253 7101 -3453 -4683 1507
1167 1507 -1496 -1469 4752 2085 -4567 -1618 1904 -127 1268 4385 -2108 -6564 2656 4937 -2865
1182 -2865 -574 3197 -3755 -5091 4417 4780 -3765 -2999 2272 -1321 -2144 4616 2533 -4331 -1384 2064
1198 2064 -165 1159 2590 -2119 -3790 1871 2611 -1581 420 1935 -3840 -3585 4384 2187 -3689
1213 -3689 78 1705 -2790 -1114 4615 2086 -3589 -905 2252 -577 187 2768 -913 -3135 450
1228 450 1051 -677 1201 257 -3335 -1260 2688 738 -2125 1079 1480 -2829 -584 4123 429 -2540
1244 -2540 925 1154 -1832 -356 2254 344 -2436 -488 650 -615 486 862 -1805 -756 1309
1259 1309 -367 -184 1684 231 -1410 -57 1828 -32 -1129 1723 733 -2445 -456 1872 -417
1274d17m78J236k52j345J087J322r45j100J113k42J84R25m71j134J005l27r34
1291g73J142R77j425j627J211J065j037P2J439j454j188J695J013r58L7j94k06
1308b11oM39R73q03r34q7L53R11K02j391n17J107n07K8R73L9r46p30R44J093n86
1329C44k42L45p39p5O83O72l14j032n79O96K18K57L7o96k46J71J4J445j03j390
1349e34K8K86P14L13l08l76m43l75R46N58o24r1r26j33J084N1J9j26n59n8O75
1370A21K22M39n26o92K40J4P17P66j136r14M65L94L21J44m25o68k83R5J190j79
1390C05n02j17m19L72J207l40j06l54k77J61J04Q74j06j591J33R39o77N87L73
1409E66j120l90N94N04J58k2j78o38k37J841Qj633L00R71r55J04P30m09n94k56
$$ plain form
1274 -417 -895 341 89 -1256 -169 1153 208 -892 221 -21 163 1088 617 -517 488 161 -773
1291 -773 369 1346 -79 -1706 -495 570 -467 -395 1044 -410 -1598 97 1110 152 189 -5 -211
1308 -211 -217 222 1195 392 -542 -629 -276 635 837 -554 -1071 36 -471 -443 530 569 -377 -1107 -163 930 344
1329 344 102 447 -292 -367 316 988 674 -358 -937 -241 -23 234 271 -425 -671 -500 -486 959 856 -534
1349 -534 -506 -220 494 807 499 123 -320 -695 251 809 185 94 -832 -965 119 170 189 63 -496 -554 121
1370 121 343 782 256 -436 -196 -182 535 1301 165 -749 -284 110 431 575 150 -518 -801 -706 484 305
1390 305 -197 -314 -733 -361 846 506 400 46 -231 -70 34 908 802 -789 -656 283 -394 193 566
1409 566 -554 -944 -350 154 312 290 112 -526 -763 1078 1086 -547 -247 724 -231 -127 603 194 -400 -656
1429f56N26l28K14J022r11j195J579L4q84J456N7j446l29J867M6j481K1J062r77
1448c23k41J709j285j112J872j97j475J038R41j413n82J763K41j959J019J261
1464A257j823j68K232j295j463K140m18j553J016J378j916j258K758M92k783J057
1480c47J690k223l08K982j236j626J526L08j501Q79J918k716j360L076M20l298
1496a816J712K041l562m23L433l30k368R63J040j857O21K683j877j823K448O3
1512I48k511K525J734m109j412M102L7k866J723J342l445j63M374j035k731K098
1528F11K9k734K436K723k985j913K660j45k584K730K404m880j347M269o63j945
1544a334K620l93l740J582L736j513k442K722p61l294L289L600m208k413L434
$$ plain form
1429 -656 -130 -458 -244 778 -133 -1328 251 285 -599 857 914 -532 -861 1006 1052 -429 -408 654 -323
1448 -323 -564 1145 -140 -1252 620 423 -1052 -14 927 -486 -1068 695 936 -1023 -4 1257
1464 1257 -566 -734 1498 203 -1260 880 462 -1091 -75 1303 -613 -1871 887 1379 -1404 -347
1480 -347 1343 -880 -1188 1794 558 -1068 458 766 -735 144 2062 -654 -2014 1062 1482 -1816
1496 -1816 -104 1937 -1625 -2048 1385 1055 -1313 -350 690 -1167 -546 2137 260 -1563 885 948
1512 948 -1563 962 2696 -1413 -2825 1277 1314 -1552 171 1513 -1932 -2095 2279 1244 -1487 611
1528 611 640 -2094 342 3065 80 -1833 827 682 -1902 828 3232 -1648 -2995 1274 611 -1334
1544 -1334 1286 893 -2847 -1265 2471 958 -1484 1238 477 -2817 472 4072 -136 -2549 885
1559H85p84j988L611R24m567n94L891j294j282L511j280m997L059M439l237j781
1575a484L345j844l361M073L316m547j758K964j059j678M228L71n737J051L520
1590A400j528m30K839j659m523L258L748l154q35K814k700k494M876J694m728
1605a422j15K516k504k91M575k24n470P32M175k190m82L675k735l817L608K334
1621B365k283j59J478k886j305M707R85m755P72K539l449J61N035j635m799K119
1637a110K875k500L9L221k271l230L381K273l147M66J550l137n61M362n82l278
1653a649J254J181k660N71M406k291m007L027J685k550J389K250l206k160L547
1668G87J376k760L87J780k962m38L817l35l242J369O27k481J855K786k585k269
$$ plain form
1559 885 101 -1887 1724 2648 -1919 -2513 1378 84 -1198 2313 1033 -3964 -905 3534 297 -1484
1575 -1484 1861 17 -3344 729 4045 -502 -2260 704 -355 -2033 2195 2566 -3171 -2120 1400
1590 1400 -128 -558 2281 622 -3901 -643 3105 -49 -884 1930 -770 -3264 1612 3306 -1422
1605 -1422 -1537 979 -1525 -1816 2759 2535 -2935 -2203 1972 -218 -700 2975 240 -3577 31 2365
1621 2365 82 -77 1401 -1485 -2790 1917 2902 -1853 -1081 1458 -1991 -1830 3205 1570 -3229 -1110
1637 -1110 1765 -735 -696 2525 254 -2976 405 2678 -469 -3 1547 -1590 -2151 2211 1629 -1649
1653 -1649 -395 786 -1874 -1303 3103 812 -3195 -168 1517 -1033 356 2606 -600 -2760 787
1668 787 2163 -597 -210 1570 -1392 -1830 1987 1652 -1590 -221 406 -2075 -220 2566 -19 -2288
1684b288K421Q57k260J675K353l983j640L993M95k731J463P22k518j76L219k55
1700A347k533R01O58j804J369K339k434j358K190j95j414K125O31k850o69K933
1716A236m75j696J337N76k858N88L085j270j678J391P8j611J434J365j385j414
1732a297J976j31j040J321L15k278M69J462p44q03J487m35j674Q61J859j037j392
1749a081J737p7j701J477Q69j392o56J293j31o03M66K80j287N20Q79p68m08J372
1767G89p97j177J113Q72j109j86J082m19p64O97R58j306k31J064n95l93P81k8
1785C51q45M28K42k66p1J85o2n91O35M90o93J77O77j102j41J278j76j016L12O40
1805D52k29q65O86J74n64K2L66k34P2K19m49M40K4j62J02O5L38j31m18N18m6p12
$$ plain form
1684 -2288 133 990 -1270 405 2758 -1225 -2865 1128 1623 -1108 355 1077 -1441 -1617 1602 1347
1700 1347 -1186 -285 373 -1431 -62 2277 -157 -1515 675 480 -934 1191 1822 -1028 -1697 1236
1716 1236 761 -935 402 978 -1880 -1292 1793 523 -1155 236 314 -1297 137 1502 117 -1297
1732 -1297 679 548 -492 829 1144 -1134 -665 797 53 -750 737 302 -1372 -511 1348 311 -1081
1749 -1081 656 579 -1122 355 1224 -168 -824 469 338 -265 201 481 -806 -286 593 -175 -583 789
1767 789 -8 -1185 -72 800 -309 -495 587 168 -596 101 1059 -247 -478 586 -9 -402 379 351
1785 351 -494 -66 176 -90 -161 24 -38 -629 6 496 -197 -20 657 -445 -586 692 516 -500 -188 452
1805 452 223 -642 44 218 -346 -324 42 -192 -120 99 -350 90 114 -48 54 119 457 326 -92 426 380 -332
1827c32L59J90k27L6k1j4j36k39L28J22m14M34J53k78N0J76m33L87o2L5K18n64
1849b32K48j12MJ58j51l59M05k24J42M45j46l9m76K57J26J54M7k6k76j79K04J02
1871G2J5Q4m33k31M47P8R5j95L7j27RL59R8m47j3K25j00M28j83q4j95j80L85k59
1895a15J39J32k05n20N49J04k92Q2M8Q6r9J90j45K57j80j02O5P2M30m58l34L74
1917G8J76l35J00K84n06r2p0N09j16M9J94n34J4P10k95l20M45k25k23J95N04o35
1939i3l6j3M01o95L63N07o70j82P23l01j92M91k30l31Q9O05L2p23L81L53j008
1960e29N45M44p83J1P25p31p0N47J60o31j7P29m74n11P80N05j124K36P81q13p1
1981b91N32j39l02K22N77j010J6Q04n03p01J023K69j326O56P57n07m84N89K24
$$ plain form
1827 -332 27 217 -10 26 5 -9 -145 -384 -56 66 -348 86 239 -39 11 187 -246 141 79 114 332 -232
1849 -232 16 -96 -92 66 -85 -444 -39 -263 -121 324 178 139 -337 -80 46 200 247 221 -55 -234 -30 72
1871 72 87 171 -262 -493 -46 32 127 -68 -31 -158 -149 210 308 -139 -152 73 -27 401 218 134 -61 -241 144 -115
1895 -115 24 156 -49 -569 -20 84 -208 -126 -78 8 -91 99 -46 211 31 -71 -6 66 496 38 -296 78
1917 78 254 -81 19 303 -203 -295 -365 144 28 77 271 -263 -249 461 166 -154 291 66 -157 38 542 -93
1939 -93 -129 -142 259 -436 -73 434 -236 -418 305 4 -188 303 73 -258 -169 436 468 -255 126 479 -529
1960 -529 16 460 -323 -312 413 -318 -388 159 319 -312 -329 400 -74 -585 195 700 -424 -188 593 -220 -291
1981 -291 241 102 -200 22 599 -411 -395 409 -94 -795 228 497 -829 -173 584 77 -407 182 406
2000D06m27J31N13o96n10J092l49o14R39Lj403O91J144j089k90O19q4q95P62J200
2020A143j215m34R50m27p02J336J76j329OP54k15o42J134q3j750Q70J281r55k79
2039c81R93p93q54J393P18j333m91J562r02o76J727J72k046K2J250l70l61J004
2057F34m10j466P67J246j081k54J134q79r30J781P84j775J65P99r87J7J486k37
2075G94j907J82J495o80k78J765j444j507J479J017j122j1Q80j290n80J922L03
2092A018j431J67P44j178J16K043q93j938P94J026j125N63J403j277j956K092
2108A68J151j421m3J251j776n04K043J82j352J96K65j054K70K188j200j684J019
2125c01N81j111J175J084k082q16J915N22j210N77O37j849k25K240j26j696O95
$$ plain form
2000 406 -21 110 623 -73 -583 509 160 -454 485 488 -915 -224 920 -169 -459 160 76 -819 -57 1143
2020 1143 -72 -506 444 17 -685 651 827 -502 -496 258 43 -599 535 452 -1298 -428 853 -102 -381
2039 -381 612 -181 -1035 358 1076 -257 -748 814 -88 -764 963 1135 -911 -889 361 -9 -370 634
2057 634 224 -1242 -475 771 -310 -564 570 -309 -1239 542 1326 -449 -284 515 -472 -455 1031 794
2075 794 -1113 -931 564 -116 -394 1371 -73 -1580 -101 916 -206 -217 663 -627 -1207 715 1018
2092 1018 -413 -246 498 -680 -564 1479 586 -1352 -558 468 -657 -94 1309 32 -1924 168
2108 168 1319 -102 -145 1106 -670 -1174 869 1051 -301 -105 160 -894 -624 1564 364 -1320 -301
2125 -301 280 -831 344 1428 -654 -1470 445 967 -243 334 971 -878 -1103 1137 1011 -685 10
2142A0K48j392Q25J777j097j548Q68K37o34J013J042k007p05J864K32j187J513
2159A059l22k089L95J839l54j138N31L97j586Q60J810j291j077J188r0p97J318
2176F53N07j651n59J453k4p04R38J06j987N63J883q80n74O15l27j128J161J138
2194A183j253p31Q87k12k69J013K66j603o3J471m35m41R07o20j091O57J025n02
2212A89l97N59o30q24J457O82j367q1P16n95k20J074L88j354j1Q29k43m76P55
2231D51k92j038N32O97n73J16K35k60l81Q24L71r75Q1N01m07k19J267n19j024
2250f13K47O55j04k96O48n62m48M15O01p84J56K78o60L9R75j39o13J28J33k04
2270a48Q6N95l38q95N85M34q37K54O87n15n93O63K40k88j97L99l10RK77L35n13
$$ plain form
2142 10 258 -1134 -309 1468 371 -1177 -309 -72 -706 307 1349 -658 -1363 501 733 -454 1059
2159 1059 737 -1352 -957 882 528 -610 -79 318 -1268 -408 1402 111 -966 222 132 -665 653
2176 653 1160 -491 -1050 403 379 -325 613 719 -1268 -705 1178 298 -276 339 12 -1116 45 1183
2194 1183 -70 -801 86 -126 -395 618 884 -719 -782 689 254 -187 720 100 -991 -334 691 189
2212 189 -208 351 -279 -1103 354 1036 -331 -412 304 -291 -511 563 951 -403 -414 415 172 -304 451
2231 451 159 -879 -347 350 -223 -107 128 -132 -513 311 682 -293 -212 289 -118 -337 930 411 -613
2250 -613 -366 289 185 -111 537 -25 -473 -58 543 -241 -85 193 -467 -428 547 408 -205 -77 56 -148
2270 -148 -62 533 195 -700 -115 319 -518 -264 423 -92 -685 -22 218 -70 -267 132 -178 -169 108 443 -70
2291g0J83j14j71J13N36n94j17N46l51O3k31N65k65m96K86M80n10K08P9l18L7
2312a41J70K52Nk67R0L6l09J57j80K00O0kp3j19J90l21K72r7J60j34j7K54j21
2335F5r2L51l70j66L37m2J03k21J04o1k77K55J21n5j65P1m2O1J67j84o1J24o9
2358d6j61k2L18ql23J27Q2K16j70q2j86J17j02J56J80k91K54k32k4K78J9j7K1
2381A04k30K10l5N8m0N0Q6k21j71Q1Q1j95j5J63R0J82j56q6J20N1j77J97n8j66
2405g7N2N6q9P4j3k71K02J10k29N04l91M4mj3J06J77l88O9K57k27K15j36O2l44
2429b54L08k49K48j70L3j91K71J8k91L72j52l0J8J61k66J97J68k52j19K90J80
2450B90m45p1L43p9k98L27O6l99N85j09k92j02K02p0o0K65Q3j10l01K46j80l4
$$ plain form
2291 -70 113 -1 -172 -59 477 -117 -234 312 -39 24 -207 358 93 -403 -117 363 -147 61 140 -178 -141
2312 -141 29 281 286 19 109 145 -164 -7 -187 13 73 71 -2 -121 69 -252 20 -77 83 -51 -68 186 65
2335 65 -27 324 -46 -212 125 83 186 -35 69 8 -269 -14 107 52 -113 -42 -84 -23 144 -40 -101 23 -46
2358 -46 -207 -229 89 81 -242 -115 -33 183 13 -69 -255 -138 -240 -84 96 -195 59 -173 -197 81 100 83 104
2381 104 -126 84 49 107 67 117 203 -18 -189 -108 -27 -222 -237 -74 16 198 42 -44 76 127 -50 147 89 -77
2405 -77 -25 31 -58 16 3 -268 -66 44 -185 319 -72 -28 -32 -45 61 238 -150 -81 176 -51 164 28 90 -254
2429 -254 54 -195 53 -117 -84 -275 -4 14 -277 95 -57 -87 -69 92 -174 23 191 -61 -180 110 290
2450 290 -155 -226 117 38 -260 67 133 -266 319 210 -82 -184 18 -52 -112 153 236 126 -175 71 -109 -143
2472a43L08J7k11j32K90k14j14J49J29k56q6M52k15l5J74m2k57K49K33n22J69
2493e7J75J05k94K24k9l47p2M46k32j62L03J51n27L72K09l48l5O0Q8j69K72Q6
2515B19k40p6K23k30k6K55j87j99J23K25k22M7J50ql77M50N6k10LJ94m18j55P00
2538B97J4n28J04J9j10R8O48n18n90L47M44k66r2M99m69k13O22J27n53LQ50r56
2560b23q4Q08j26p95K86J99o34O38K65l64l95O15R4o46L63K44n87l69R55N0n50
2581b56O38j73n16N7Q01l75o96P11K8n20K71M73m45p18O63J44j61K09L02q15m3
2602d21Q06j20n25M53j17o46M22J000q87o13N94L4k71K57Q25r80m79P20J17m84
2622c15N56P0q78K51R12m55l37N73l08o63N59O92o71l99O45k75m50Q65J64o50
$$ plain form
2472 -143 165 182 -29 -161 129 -85 -199 -50 79 -177 -263 189 -26 -61 113 71 -186 63 296 -226 -57
2493 -57 118 223 -71 153 124 -223 -295 151 -81 -243 60 211 -316 56 265 -83 -118 -58 30 -139 133 219
2515 219 -21 -97 126 -104 -130 125 -62 -261 -138 87 -135 -88 62 54 -323 127 183 -27 -24 170 -248 -403 297
2538 297 311 -217 -113 -94 -204 -106 542 24 -566 -219 225 -41 -133 366 -103 -316 306 433 -120 -117 733 -223
2560 -223 -307 501 375 -420 -134 65 -569 69 334 -30 -425 190 284 -362 1 245 -342 -711 244 294 -256
2581 -256 382 209 -307 -250 551 176 -520 191 219 -301 -30 443 -2 -720 -57 87 -74 135 437 -378 -421
2602 -421 385 265 -260 193 76 -570 -148 852 -35 -648 -54 -20 -291 -34 791 -189 -668 52 169 -315
2622 -315 241 311 -567 -316 596 141 -196 377 69 -594 -35 657 -14 -413 232 -43 -493 372 536 -114
2642a14k34M44r3j88K99L55j007K51P00k19k81O46p54p03R36M87o21j69N04m66
2662b27k22R80J35q18l46Q33m75J3P73k89q98K77O27l32j13L22k41o54O91N18
2682E54o73j61M86o56L1J034l12p60K86M86m33j81P62l02p67M85O10l50k81L47
2702B05n93j21M80L89m02K8L31l99l2N24M5p74L38nl26K92P23n49o41K41M59l48
2724a35P3N03p56j21O58J95m96K1K60m24P8M80Mo21J16O25o93K88M30m88n82P74
2746A89m8k58L2K61l86j41N79J36n13J17L50m94Q5K50K0m31K84K52l23M4K53n61
2768c03k6K30L42l53J93K5k89J63L69l27j91Q2J63k18QM75l27n6K41j58j34J79
2790H8J7j74j26J25M7l54M65Kl49N8N80l12j22J44O1k30J8K75k27q0J92P7k74
$$ plain form
2642 -114 -348 96 3 -185 114 469 -538 -287 413 194 -87 559 -195 -898 38 525 -96 -265 239 -227
2662 -227 -449 531 666 -152 -498 335 -140 -127 646 357 -541 -264 363 31 -82 240 -1 -655 36 554
2682 554 -119 -280 206 -450 -419 615 303 -457 -171 315 -118 -299 463 161 -606 -121 489 139 -142 205
2702 205 -388 -509 -29 360 -42 -14 317 -82 -114 410 455 -319 19 14 -312 -20 703 154 -487 -246 213 -135
2724 -135 -62 441 -315 -436 222 417 -79 -58 202 -222 -144 336 340 -281 -165 460 -233 55 485 -3 -585 189
2746 189 141 -117 -85 176 -210 -351 228 364 -149 -32 318 -176 -91 159 179 -252 32 284 -39 5 258 -303
2768 -303 -329 -99 243 -110 83 108 -181 -18 351 24 -167 -85 78 -140 -132 343 16 -40 201 43 -91 88
2790 88 105 -69 -195 -70 -23 -377 88 90 -259 -201 379 67 -55 89 150 -80 -62 213 -14 -94 98 175 -99
2813i9l6L38k86J10J09j61n6j50LJ49n3K87j18R7j17R9j27N5O4j40n6k6K74k18
2837e8o8K38Q1m45R9L19j3j67k6K60l24R5o2O9J96k14j46O6J48Qk46J5j10L24
2861C9R3J16m92O1J39J19mK17k1j71k11J86p2k8P0o1l4J04j42K4J77j24k0J63
2885A28n4j47oM05j44k91J68K2p4o5J22j60K63k19L50k94L6q6q8O8K00l91L16
2908E9k57J30r6l3Q9p5M3J09K10j3r9j42K07k65J17j60K52j63J5l7K62k68J15
2931@rpJ07j89J19q9m9K16j47Q0O8nO9j52l3LJ84k16k17L44l7m2M8k5k40K51J47
2958A79j18j45OJ58j45j6R7J87p4J68k95J09p1Qqj67K09j09j25L31K2l05M7J92
2982A35k59j43L74n7L8lLn3J9K0j01j70K76L3j74J37l2l82J20M72k8k85M7j9p5
$$ plain form
2813 -99 -135 203 -83 27 136 -25 -81 -231 -228 -79 -132 155 37 134 17 116 -11 44 108 -32 -88 -114 160 -58
2837 -58 -126 112 193 -252 -153 166 153 -14 -40 220 -104 -9 -71 -2 194 -20 -166 -100 48 56 -190 -175 -285 39
2861 39 132 248 -244 -183 -44 75 71 288 267 96 -115 71 -1 -29 41 -20 -54 50 -92 -68 109 -15 -35 128
2885 128 74 -73 -79 326 182 -109 59 81 7 -58 64 -96 167 -52 298 4 40 -46 -134 -66 134 -257 59
2908 59 -198 -68 -164 -197 -108 -183 -140 -31 179 166 67 -75 132 -133 -16 -176 76 -87 -72 -109 153 -115 0
2931 0 -9 -16 91 -98 21 -68 -117 99 -48 32 100 95 164 12 -21 -18 166 -50 -267 77 40 -2 46 21 -219 32 179
2958 179 61 -84 -78 80 -65 -81 16 203 129 297 2 111 40 48 40 -127 82 -27 -152 179 201 -104 -57 135
2982 135 -124 -267 107 50 88 85 88 35 54 74 -27 -197 79 112 -62 75 43 -339 -219 253 225 -60 -13 -32 -107
3007a07R2K80j76m19L60kLO5j9o5m89M14J8J9J57j00j50j72M80q9l02J86K00j64
3031B0J00K38m85r4K2L14k49m2K64k61Q6Q6L0k55J04J3kJ00L21k83j31J65r9l5
3055g3Q7L15l86l45O15j52j59J91r5k55o0L33%j18K32j46k33K41J57q5o6Qj62
3078a56rJ35K48k37k39N59l59j52L60k0k60PL03qj40L26l35l45L43L53l33k39
3100a98M06j02l87N03j4k50m8J37k93L57M70m10n65J16N63k57j81K57om73L47
3121b8K64k52k19L50r4k44M09J03m02k76N78k20n9M93j95m95K36K70r3k22K71
3142A75j91l51M92J60k62l05N34j6m98N46Q3m40j76J58j80K94L60k17o08K08L08
3163G4l29P9L11j07n22O14J90k44r4M4j02k52O16Jo19K75M9O9KJ12o5m23M23J82
$$ plain form
3007 -107 -15 265 89 -330 30 28 31 96 77 12 -477 -63 -45 -26 131 31 -119 -291 189 100 -202 -16 184 20
3031 20 120 358 -127 -221 -199 115 -134 -176 88 -173 -87 -1 29 -226 -122 -109 -111 -11 310 27 -104 61 -38 -73
3055 -73 14 329 -57 -402 213 61 -98 93 -2 -257 -317 16 16 -102 130 -16 -249 -8 149 64 -2 6 -156
3078 -156 -165 -30 218 -19 -258 301 -58 -210 150 130 -130 -123 180 172 32 358 23 -322 21 374 41 -198
3100 -198 208 106 -281 222 208 -42 -90 47 -246 111 581 171 -394 -278 285 28 -153 104 98 -375 -28
3121 -28 236 -16 -235 115 21 -223 186 289 -113 -389 189 -31 -90 403 208 -287 -51 219 126 -96 175
3142 175 -16 -367 125 285 23 -282 252 236 -262 284 367 -73 -249 -91 -271 23 383 166 -442 -234 74
3163 74 -255 -176 135 28 -494 120 310 66 -28 16 -86 -338 278 279 -340 -65 -16 53 55 167 102 -321 102 284
3187B84m40K09L82n77j48L94J66m64M11o1n88K21N38j78k63J08J08l47R5L29l98
3208b19kM21j65j24K99Q9l49k78N07j60j63L10J9n85M35K25k35k87K14R5j49R2
3230a0K76j03l73J58L78k48M3J81m15%L03j29j95K92R0l14j45L33k17j8J03J15
3252A05j64KL32m14k7J20J01l27K15J96l57R7J97j02q3M71j87l42K65K93k95o9
3274B7K28o7k45P7K79l14j62K94k0k63L09m3l81K44K71k17j08J14J54l62J02J71
3296H8k26l7K37K3j27M4l1j4j18jJ69l2P8Qk07O5J85j16o3J80k41N8J68j1k5k30
3322a76J81j7L5R2M8j96L1J4j8J33j28k1m7K75o1n4k11J03j39J64Mk7P9J43j82
3347B5k02J6J89N2L3k74J71k43K44PM8r3L2o7N1J87r9j13k8j9Q2L7l07K14L7K6
$$ plain form
3187 284 -156 53 435 -142 -290 104 270 -194 217 156 -432 -211 327 149 -114 -6 102 -245 -150 179 -219
3208 -219 -221 200 35 -89 210 299 -50 -328 179 19 -144 166 185 -400 35 260 25 -262 -48 47 -102 -10
3230 -10 266 163 -210 -52 326 78 121 302 -113 -113 190 61 -134 158 248 -66 -211 122 -95 -113 -10 105
3252 105 -59 -57 275 -139 -166 -46 55 -272 -57 139 -218 -121 76 -26 -109 362 175 -167 98 391 96 27
3274 27 255 188 -57 20 299 -15 -177 117 97 -166 143 100 -281 -37 234 17 -91 23 177 -185 -83 88
3296 88 -138 -175 62 85 -42 2 -29 -43 -161 -162 7 -25 53 61 -146 -81 104 -12 -75 105 -136 -78 90 79 54 -176
3322 -176 5 -12 23 115 163 -33 -2 12 -6 127 -1 -22 -69 206 145 91 -120 -17 -156 8 12 -15 64 207 25
3347 25 -177 -161 28 80 113 -161 10 -233 11 18 66 -27 5 -62 -11 176 77 -36 -64 -83 -1 36 -271 -57 -20 6
3373Fr4J57J0j22k83L70l00L69j05r5J51L0J43m7N2k60p0J78j09J11k09n4J13
3396e8J50K2k95K94j8o8j34R8q7J93j61K94j84O0p2j76K41j54N7J34j60M7k43
3419b20L74k82K59k37o0K81p8k06n9J87q2K0J65k01J62J97M9m77M24k08j05J75
3441G8P5p4j36j92L38j12j51K65j16J10k34L36r2j49J99k04J07j20J1J76j17O9
3463F7m9j21L4J85j51P0j59K29j77K3R5p7r5R1K8M6j10J44k53K68l9j26j31J38
3487g0j14R4J72n5j8m7R7j37N0o4J42p8n4J61p7%J4J69k45P8j8j23l2J81k43P3
3513a44K57r0m8k5J00j57J92K79m56j52L37j52J8J13q5j13L8K00j76J10L7n9J3
3536C7j2j37K14J34l26n3J35J6J37j24m2J42k00j13K21J04l89o1M09J51k99M6
$$ plain form
3373 6 -88 69 79 -43 -326 44 -256 113 8 -87 64 94 237 190 242 -18 -88 90 -19 92 -117 -171 -58
3396 -58 92 114 -181 113 95 27 -107 -9 -96 97 -64 230 46 106 34 -142 99 -55 2 136 -24 23 -220
3419 -220 154 -128 131 -106 -166 115 37 -169 -228 -41 -123 -103 62 -139 23 220 269 -208 216 8 -97 78
3441 78 153 79 -57 -249 89 -23 -174 91 -25 85 -149 187 95 -54 145 -59 48 -72 -61 115 -2 67
3463 67 18 -103 -69 116 -35 35 -124 105 -72 -49 46 -31 -126 -35 -7 39 -71 73 -180 88 49 -77 -208 -70
3487 -70 -184 -90 82 27 9 -38 59 -78 -28 -92 50 -28 -82 79 2 2 16 185 -60 18 0 -123 -155 26 -217 -144
3513 -144 113 23 -25 -50 50 -107 85 364 -92 -244 93 -59 -41 72 -13 -126 -88 112 -64 46 83 24 37
3536 37 25 -112 102 236 -90 -143 -8 8 145 21 -21 121 -79 -192 29 133 -256 -317 92 243 -56 -10
3558a0Q3k25j8J45K47m91M98j47j20R2K8j66PK92k29p7R5J47k36K06r9M9j07K76
3582B40k66j86K31K21p8k6J2j93n7J65J16k59N2R4l10L04K21j24k59J33k05J71
3604ck52L84k72o9M41k6j08l11L31j71q2J74P8k15J72J01l19R4M1m7j94J95LK3
3628c2K2J69j29l03M38P8j50k05M14m13J3L24k8l26J84l1k12o0M06l97O5J30J13
3651G0j15lJ49j03j72K71N7k53J63J97m80j40N14o5k7j72J19p9J37K53l30j96
3673b05K65o5j08l0M10l91O3LK18m6j10J00l68Q3L13k26l08O92k39j30J58J86
3695B65j34k53Q5J10j87J42K46l94j0L65j46k30K09q4o3J37J38k11L6j16J42k28
3717a81M2K81j3l38K87j1j89J83K35l98j57M39l28J23J63j83j04J48K54k53QL0
$$ plain form
3558 -10 73 -152 -170 -25 222 -269 229 82 -38 54 82 -84 -77 215 -14 -91 4 151 -85 121 22 71 -36 240
3582 240 -26 -212 19 240 162 136 148 -45 -102 63 179 -80 -28 66 -244 60 281 157 -102 31 -174 -3
3604 -3 -255 129 -143 -212 229 203 95 -216 115 -56 -138 36 114 -101 71 172 -147 -53 -12 -59 -253 -58 -55 -32
3628 -32 -10 159 30 -273 165 243 93 -112 302 -111 -98 226 198 -128 56 25 -187 -247 159 -238 -173 -43 70
3651 70 -45 -48 101 -2 -174 97 154 -99 64 261 -219 -359 155 90 63 -109 10 -69 68 321 -9 -205
3673 -205 60 -5 -113 -143 267 -124 -61 -58 160 114 4 104 -264 -181 132 -94 -402 290 51 -79 79 265
3695 265 131 -122 -37 73 -114 28 274 -120 -130 235 89 -141 68 -16 -79 58 196 -15 21 -95 47 -181
3717 -181 -139 142 129 -209 78 67 -122 61 296 -102 -259 180 -148 -25 138 -45 -149 -1 253 0 8 38
3739C8O3r8J59r7j06j12J59j04l5M4K15l98J93J33Q2j44kJ28k98K90j04j22J07
3762iJ24k97M9N77n78J66l8K18j87n0m2J66J33n59M35k39J00M5J85m47L07m4K39
3785B54o7K1K3j62K0o3q5J45J67l62J18RmlK9q1j10J93K0j16j49K58M4P5j74k26
3811b26J92p7rj10K35J24L9p6j41L2Np1Q8J03j68J21N0l25K30q2O5j56J39J05
3835H7k44J30j42L05n8k10N0K79l46J13M7J9P0j9l8j65P7K03k48K11k14l8J11
3858b0m4j07K77M9j07N3k89L92l00lP7K41k39j06L59J3j99M2p2rJ17k57K84rj38
3883Ep0J37k82O5J33k9jj26L6k6J49M9j00J95k28K97p7k45J77o0L7Qq4J9J00j53
3909g4J7j73L27j62P3r6L04l40J11j95K51l4j52K36q0j57J65j81J55n9J16nn1
$$ plain form
3739 38 101 3 162 65 -41 -153 6 -98 -133 -89 126 -272 -79 54 136 -8 -10 118 -180 110 6 -116 -9
3762 -9 115 -182 -133 444 -134 32 -6 212 25 -25 -67 99 232 -327 108 -131 -31 14 199 -248 59 15 254
3785 254 187 208 231 69 89 26 -59 86 253 -109 9 18 14 11 40 -41 -151 42 62 -54 -203 55 99 174 0 -226
3811 -226 -34 -111 -120 -230 5 129 168 92 -49 -17 -12 -83 5 108 -60 61 111 -214 16 -66 -1 -157 -18 87
3835 87 -157 -27 -169 136 78 -132 -82 197 -149 -36 11 30 100 81 43 -122 -45 158 -90 121 -93 -131 -20
3858 -20 -64 -171 106 155 48 101 -188 204 -96 -99 -22 219 -20 -126 233 246 47 89 17 8 125 -132 152 143 5
3883 5 -65 72 -210 -145 -12 -41 -42 -168 -132 -158 -9 40 -60 135 -93 204 127 -118 59 -1 36 44 -40 -21 79 -74
3909 -74 -57 -230 97 -65 8 -88 216 -124 -13 -208 43 9 -143 93 13 -144 21 -160 -5 -64 52 47 -4
3932dq7J03q3j7K28m4N8k23J49k4q6J63k32J48k37L16j07J8j74K90j49j96K04
3955A4o2J94j54J19o6j22L15l15l1Q6L1K51k77r9J89l52L79j25n0J41j02J36P6
3978A76k8k25J62j55N8J7P2j67O3K06j01J22j99N6k10M7m4K51k3j2P4p3R1p5p9
4003DL45k00j9j12K02k36j43J09L00l12N7R3L3l33J04J36m9m0R6l12K90J13l64
4026b38l5L28j37Q9j82R5P6K1J7j03L65k11Q5k87Q3j6qJ12Q4j22k5q6J1J25j31
4051i0o8K7J55j78L41j82O3r3K37Ok46PQ5L1j37J30j06q2J46J11j74L3pL6j90
4076a45K15j90K09j30J89l78K04J38j42K24k47J16M3l16K37j52R4J59j16j1jJ57
4098A57m4l7j51J78m7L7j16j46L36j93PQ4p3J7k33K45o3K1j71K39j74L72k49q5
$$ plain form
3932 -4 -91 12 -71 -88 140 96 154 -69 80 56 -30 133 -99 49 -188 128 21 39 -135 155 6 -190 14
3955 14 -48 146 -8 111 45 -77 238 -77 -108 -22 9 260 -17 -116 73 -279 100 -25 -75 66 -36 100 176
3978 176 148 -77 85 -70 -12 5 77 -90 -27 179 78 200 1 57 -153 -106 -150 101 78 66 140 67 158 83 4
4003 4 349 149 130 18 220 -16 -159 -50 250 -62 -5 88 121 -212 -108 28 -21 -61 35 -277 13 126 -238
4026 -238 -273 55 -82 7 -175 -80 -4 17 34 -69 296 85 170 -117 -34 -50 -58 54 138 16 -9 -95 -84 41 -90
4051 -90 -158 -131 24 -154 187 5 68 -25 212 218 -28 -21 64 95 -42 88 -18 -100 46 157 -17 16 9 45 -145
4076 -145 70 -120 89 -41 148 -230 -26 112 -30 194 -53 63 106 -210 27 -125 -31 128 12 1 0 157
4098 157 113 76 -75 103 56 93 -23 -169 167 -26 -19 65 -8 9 -224 21 -42 -21 -192 47 -127 245 -4 -89
4122h9J09k5N8j0P6q0j02r4J76o8l8q8K08q7r4K25j84j5K51Np0m0q1l8m7J55j18
4149a05k8K17J18k16P5J44o8j94K37j06j59N0N8j4j61K81n2j47RP3j63J30l4M8
4173gj13J50j30K65k32L0k4l4J00q3n5j9J94n7o7O2J10j30j41K75j33j1J48k9
4197F9k63L70p7o9j58L26j36J6jjj18k5K85k53Q3J5J45k27k20K98j29L39j01k31
4221f3N5R3j9k26J82Mm6k03M30k5l01l0K02k03K68o1j04L4r8J11j44K14Mk09N2
4246h3Q9j00K77j05n5j7Pn7J50k11K76k74L9K13k55q0K89m6K0j98j47K14r7P8
4270g3L0K09k55L02n3k49J09Mj6k17J91k24K49N7r1l18L02J67L8m2r9o9P3k9K0
4295A6M9k08J18J32j46J17l4N0o8m6K41l41J15m0n0k2L42j71j19K65l13j9J97
$$ plain form
4122 -89 20 -5 53 43 119 39 -63 -157 19 -49 -87 -175 33 -54 -148 77 -107 -122 129 134 64 24 -57 -95 -142 13 -105
4149 -105 -133 84 202 -14 61 205 137 -57 180 74 -85 -35 23 9 -152 129 77 -70 -61 12 -151 -21 -55 -7
4173 -7 -120 30 -100 165 -67 -37 -61 -95 5 -78 -133 -152 42 -15 -82 -20 90 -40 -181 94 -39 -50 98 69
4197 69 -194 176 99 30 -128 198 62 78 77 76 -42 -67 218 -35 48 63 208 -19 -239 59 -70 269 168 -63
4221 -63 -8 85 66 -160 22 26 -20 -223 207 182 -119 -149 53 -150 118 57 -47 -13 -111 0 -144 70 74 -135 -83
4246 -83 6 -94 183 78 23 6 13 -44 106 -105 171 -103 -64 149 -106 -186 103 57 77 -121 -268 -54 -151 -73
4270 -73 -43 166 -89 213 160 -89 20 24 8 -209 -18 -242 7 64 -27 -345 -43 124 162 120 21 -48 25 -4 16
4295 16 65 -143 -25 107 -39 78 44 94 26 -20 221 -120 -5 -45 -95 -117 225 54 -65 200 -113 -132 65
4318F5j8k00M0R3k20k9K33J92j07L0q2j9L7l5LJ9l9n1J03q1j32L66j67KJ8n3o7
4345i9MJ0J46j60O2Q0j15R3r4J3j18K12j94K42k20N0k3PO7J24q0N5J1k33P6lK26
4372A39K3k20m0R8oJ12Q9j98M4P1k36J36M6l17L17M3oJ02j58j63K16L9q9J02l00
4397a56J62nor1K17L3l76K13k0J1J51l14J94J21j20m8J08j57J47J18l22R4j0n9
4421a15R4L9R1k59J70J09r5j90R0J09M2p5j26M37l40J0p8J66J70l35k6J56j6J25
4445A53rj67J4p3R0k7m9J04L8l34J99J58k24J92J47j76j87N1J33p0J19j84K44
4468A42j03k52K26J03k29J51Kj69J85j32J71k86K04o8O6j39J28J79j51l6j69P0
4490a07K01p0O5k32J78J20p7j22J5l6L8J19n1jr8p5K02k42L80j09o2K0Kn7J52
$$ plain form
4318 65 47 -153 -113 -20 -240 -269 -36 156 49 79 -3 -22 15 -20 -17 2 -37 -88 15 -66 -198 168 1 3 21 -32 -99
4345 -99 -95 -85 61 -99 -37 43 -72 21 -73 -60 -178 34 -160 82 -138 -88 -111 -104 -37 87 7 62 73 -160 -84 -87 139
4372 139 162 -58 -98 0 -6 106 195 -3 41 112 -124 12 58 -259 58 101 95 197 39 -124 92 131 42 144 -156
4397 -156 6 1 -5 -96 121 154 -222 -9 -29 -18 133 -181 13 134 14 -34 74 -83 64 182 -140 -46 -56 -115
4421 -115 -21 18 109 -150 20 129 34 -156 -66 43 85 10 -116 321 -19 -9 -87 79 249 -86 -112 44 28 153
4445 153 144 -23 -9 -82 8 -19 -68 36 74 -260 -61 97 -127 65 212 36 -151 -100 33 -37 82 -102 142
4468 142 39 -213 13 116 -113 38 40 -129 56 -76 95 -191 13 -55 11 -128 0 179 28 -8 -177 -107
4490 -107 94 24 89 -143 35 155 78 -44 -29 -65 -27 92 41 40 -58 -133 69 -173 207 98 36 56 58 1 153
4515A53j31j7J5J66l36K63k39k5J5J86R4j09O0J9j4j43j02J11J56j37Q5k52M4
4538a38L41l40J16j29K8K38j1j13K44l5k17M6Q9o6p8OJ4j62r5J62L49k55p1K3
4562e4L4q5l4J58Q8k6m9MQj34n0O1K46nq9r3J01k90K50k13K74Mq0O3p2K8r2P6
4590B9l2r6J91k70K28R5j25K47j52j50J98k26j94K70j65K32l00J59J26j99M0M
4612i0K8j68K75N7j09J37J00p6qj10l9P7j38K6O2P4o9M1m2J71k64o0J02j10J48
4637A5J06j38o6J40P7j3j92n3J07K36k95K25k47o1J75R1L8k39J16l4P9K52l42
4660b3l1K4j21J83J01j56M8j06K22r4J27k45o9J21K0K37p8k0m4j17Q3N4k18P4
4684b8m9R0N5qk63L7m4J72q3L1J08k8j39O3J07q9r4K52k19K72l1r5N5j39R5m0
$$ plain form
4515 153 22 5 20 186 -150 113 -126 -151 -136 50 144 35 95 114 100 -43 -145 -34 122 -15 70 -182 -138
4538 -138 203 -137 -21 -150 -122 116 105 -8 236 201 -16 30 119 53 -25 -19 -5 -167 -262 -100 249 -6 -77 -54
4562 -54 -20 -105 -139 19 107 81 32 36 44 -90 -140 -79 167 162 73 -20 81 -209 41 -172 102 106 26 89 17 45 -47 29
4590 29 -3 -99 92 -178 50 145 20 267 115 -35 163 -63 -257 13 -152 80 -220 -61 65 -134 -94 -90
4612 -90 -62 -230 45 102 -7 130 230 154 146 36 -3 74 -64 -38 24 98 29 70 28 199 -65 -125 -23 -133 15
4637 15 121 -17 -83 57 134 121 -71 -124 -17 219 -76 149 -98 -159 16 107 145 -94 22 -12 67 319 -23
4660 -23 -54 -30 -151 32 133 -23 25 -81 141 47 174 -71 -140 -19 1 238 160 140 96 -21 62 116 -102 -28
4684 -28 -77 13 68 60 -203 -166 -210 -38 -121 -90 18 -10 -149 -86 21 -68 -162 90 -129 143 112 17 72 -67 28 -12
4710a2R9p4j37J54m4L5j26O7K6j5J6j7M2k9K09l78K14nJ07j61J31k3L3o4kk9p0
4737e3J44l9k66J87J14n1m07J86JK56j02m0j08j2K98q0p4j23K55k18J5K36l60
4760b41L06k78R8QM3L77l46n7K4K67j81Rj40m6Q0J55j06mm2O0K9j6M9r3m9j07
4786b01L00n5j80J20O3r2q2R5Q4kn0l02M46qj36q6L3Q2j50K27j18K1n9J02k57
4811b05K27km0j33L6rN5O7K6j01o8J22J88k41J05P9j08k1jqJ7q9K22Rl02K06J06
4838A37j72R0M1j13K82k06NQ4j00J59r3j49J80j55O0r3K5M2Q7MLj60J51j73l2
4863i6N9M9j38K14nj6R0j23j37j42K93p7m1Q7j2L0J10R1k68J50j69K3m6K0N1j40
4889a43J52q2j4J50l0P7N7n6n8l8J96j8k09m8J05J38k09j11R6r0m0J87K59m14
$$ plain form
4710 -12 87 13 -124 30 -14 21 -105 -38 -12 -27 -11 -28 14 -15 194 -184 30 25 132 -29 102 79 112 48 46 17 -53
4737 -53 91 52 -214 -27 87 36 -371 -185 -184 72 -30 -70 -178 -190 108 28 -46 -169 86 -132 -117 119 -241
4760 -241 65 -213 -115 -107 -64 313 -33 -90 -66 201 20 29 -111 -157 -77 78 -28 -32 -74 -14 15 -1 48 -45 -94 -201
4786 -201 99 44 -136 -16 47 -45 -127 -32 52 50 0 -302 144 136 0 -86 -53 29 -121 106 -12 9 -50 52 -205
4811 -205 22 20 -20 -153 -117 -126 -71 -4 22 -79 -147 -25 163 -78 27 106 -2 -23 -24 -32 -15 -104 118 127 -175 31 137
4838 137 -35 55 96 -17 265 59 64 148 48 207 114 -35 145 -10 50 -43 -18 24 111 115 118 -42 109 -64 -96
4863 -96 -37 12 -126 88 83 67 157 34 -103 -245 48 -29 -70 17 5 35 145 236 -32 118 -51 -28 -74 -54 -3 -143
4889 -143 9 -73 -87 63 33 110 167 111 53 15 211 193 -16 -64 41 179 -30 -141 -45 -135 -175 12 271 -143
4913a43K08J24J68k94L2j32J81l70K83o5kP1q5L25l01q6J99j61J16p5n9R4j36
4936a08K33j54J82k49K47j33k35K17J44k68J7pJ06K05j27k67J07J65j41k8J08
4957A4k37O1N4j2R4J27j23l4R6M7J40m10n3K14r9K67j82j4j13J78J35k31m4J36
4981A1J21j50Q4Jj17P9J59j83k07R1O3q8K0K12J41j76J01j81p7R6J09j65J23j40
5005g3j46K0k2L52q3o2M5O0k10l9K64j42J2j19J70k7J07n0J2j34nJ36k20J05j33
5030a82R3J84J6k37K70j10l1M3k3p0J57j37Pl0R0O2l05L71o7j20L7J9k53L07j92
5055a01P2J4p5QK33j06K5jl9J00p6J47k95R7q2J32K38m79K29k41J35lP0Rj2j00
5081a01M1q1L59j41j70J19m2o0Q6L9n6N2p8P2j09Q7L4j9j9j34J62P6j21N1Rq9
$$ plain form
4913 -143 65 189 357 63 95 -37 144 -226 57 -8 -10 61 -24 301 0 -86 113 -48 68 -7 -66 28 -108
4936 -108 125 -29 153 -96 151 18 -217 0 144 -124 -107 -114 -8 197 70 -197 -90 75 -66 -94 14
4957 14 -223 -162 -108 -120 -26 101 -22 -56 40 87 227 -183 -236 -22 -121 146 -36 -50 -163 15 150 -81 -125 11
4981 11 132 -18 66 67 -50 29 188 5 -202 -111 -48 -136 -116 96 237 61 162 -19 -96 0 109 -56 67 -73
5005 -73 -219 -199 -221 131 48 -14 31 91 -119 -158 106 -36 -24 -143 27 0 107 57 69 -65 -70 66 -154 -49 -182
5030 -182 -89 95 111 -126 144 34 3 46 23 -47 110 -27 -20 -50 40 102 -203 168 101 -19 18 37 -216 91 -101
5055 -101 -29 -15 -90 -82 151 45 70 69 30 130 54 201 -94 3 -79 53 291 -188 41 -200 -65 -68 2 11 -1 -101
5081 -101 -60 -141 218 77 -93 26 -16 -76 10 49 -7 45 -33 39 -70 17 51 32 13 -121 41 117 -4 47 56 -33
5107c3QJ77N0k27K7M2n7J91j75R0j07j52K23k87J95K08j81J68k69L1N5r7k7J32
5131a5J66j33o5q5J32P2r4m1KK87l43L7K13p6n8O5l9P2J12k38Q8J04K4n5j73J41
5157A00j26j6L8J17j74K4J73Q3k73P9M5r3J05j22K25j62r5J08j79l7J65n4J73
5180A04j25K33k94mk06K28p6J94l0j89K51j24K12k17N4P8n3L9n4J55Nk28j18J18
5204d7J63Pj28p5K60j09Q1l17L04j26j33j7K41r9k4R1j82rJ10J95k75R9J08j15
5228CP1Q7l25L89m38K05J20j09O1K1j94L5q9J84k54J93P1j24R8K8P8j31q1q8K40
5253E1j74K50J7j58J0l4O7r9j97K30L4N8o4MJ35k43J42n6r0J66k89L7N24j78O1
5278B04j5m29K54p6k9R1J56N9Ml08m5K53r7j48j44K08K57j00j55R4m7L3J46k56
$$ plain form
5107 -33 -25 152 202 -25 2 44 -13 178 3 93 -14 -166 57 -230 -35 173 -8 160 -109 -78 -23 -120 -147 -15
5131 -15 151 18 -47 -132 0 72 -22 -63 -61 226 -117 -80 133 57 -1 64 25 97 209 -29 59 163 187 132 -41 100
5157 100 -26 -42 -4 113 -61 -37 136 219 -54 25 70 -23 82 -40 185 23 -72 36 -143 -180 -15 -69 104
5180 104 -21 212 -82 -86 -292 -64 -140 54 24 -165 86 -38 174 -43 11 89 36 75 21 176 181 -47 -165 -47
5204 -47 116 123 -5 -80 180 71 152 -165 139 13 -120 -137 104 5 -19 72 -110 -119 -9 186 -89 10 118 3
5228 3 74 161 -164 225 -213 -8 112 3 64 85 -109 -74 -163 21 -233 -40 31 -93 5 33 111 -20 -101 -189 51
5253 51 -123 127 144 -14 -4 -38 29 -70 -267 -37 -3 55 -9 -5 130 -113 29 -27 -117 49 -240 -203 321 143 204
5278 204 189 -240 14 -62 -91 0 156 215 219 -89 -134 119 22 -126 -270 -62 195 95 -60 34 -13 20 166 -90
5302i0J07o5J63m1l67L92k59K52l4k64K84k6j34o4R0N2J75k41p1J88M0k31RK69
5326A34k62M73l75O8j01j0J25j85M19k89J24p2JJ78k42j47J77L0k8J33k5r9p8
5349e1N5R5n3rq7J63N6k84L14m02K81k25K69j1Jl2j8j74M8m9K57m2p9P5j37NN9
5376B5m7k0j54L54k62N0J67k69j1J54K0j85K67r6J51j80R5p6j2j56J34J50j51
5399e2m0J93j87K41M5m8j86l6J63j51J13o0N9k38%Q5m3K26p8m5J4k9R1l05K42
5424b6J02k02m4M4K19r3N1J80j14n9K1L1q8j0j0Lp4K41m39J53J10N1l0o6j11m1
5450b01L48p9k00J59M7%k10J74O4Lr0k05J30J67lN3j30m2n0K2J74j4j98nN6p9
5476a09K08j09rJ42j41J07r2J06j83K5j97J88kJ87j18N3j3L4j3Jk5k47rJ42J0
$$ plain form
5302 -90 17 -48 115 74 -293 99 -160 92 58 -206 78 52 -82 -146 -56 -4 171 -70 -141 47 87 -144 -135 134
5326 134 -128 345 -30 38 -63 -73 52 -133 286 -3 121 49 50 228 -14 -161 16 46 18 151 126 27 -51
5349 -51 4 99 46 37 -50 113 169 -115 199 -203 78 -147 122 111 112 80 62 -112 -64 -113 144 102 23 98 -39 -34 25
5376 25 -22 -42 -196 158 -104 -54 113 -156 -167 -13 7 -178 89 -7 144 -36 59 -17 -29 -185 -51 99 -52
5399 -52 -92 101 -86 155 200 152 -34 -70 93 -58 55 -5 54 -184 -184 -99 -142 84 6 -39 -25 -54 37 -268 -26
5424 -26 76 -126 -170 -126 93 0 51 231 117 58 79 110 22 12 2 5 -69 172 -267 -114 -4 47 17 -49 -160 -201
5450 -201 147 68 -132 27 74 74 -136 38 102 105 15 -190 -60 107 104 157 27 -15 -65 -43 131 117 -81 -86 -30 -109
5476 -109 99 -10 -19 123 -18 89 -3 103 -80 -55 -252 -64 -66 121 3 56 43 77 64 65 40 -207 -216 -74 -64
5501f4k9j3l6J25p7O4Kj6pJ02k3J85j37r1p2K04j49p6J30rK55m56K17r4J63q3
5527A5l9j00J51lk09J29K30j56O2M9j17J5J11k80K50r0j77J06l8M9j7pL3J6J15
5552I8j25J63m71L97j5j34J22k34K09n2J31j06KL8P9j55J27Rj08J17l56K96j04
5575g2mJ59K1j20O5R0j32j37J54M9n8j34J50J49l84J12lj22K40m8NMj53P7L41
5600B49j46j39K42o6p0P2M9k21N9n3J66k81J25q5J02J09k53K27j26K02j30n8N8
5623C2m5Q3l0q8k9J55k57J23k8LJ22j02j65M43k51J71j25j85M3J50k04J39K1j08
5647a32K30j73J49j51j65J10K48j55r0J31kO4j01O6o4M9k9KJ09J38k87J39j53
5670f7J10q5J57k06J64j15P6n0J23j28j9O7l0jl7j56J99j76J22P7P6j14k44J41
$$ plain form
5501 -64 -93 -106 -142 -17 -94 -30 -28 -44 -51 51 28 213 76 -15 -87 117 -32 -108 22 13 268 -188 29 -65 98 15
5527 15 -24 -124 27 24 -185 -56 174 18 80 129 12 27 138 -142 108 18 -159 -53 -91 -42 -59 -66 -33 -17 98
5552 98 -27 136 -335 62 47 -87 35 -199 10 -42 89 -17 -15 23 102 -53 74 83 -25 92 -264 32 -72
5575 -72 -76 83 104 -16 49 139 7 -130 24 73 15 -119 31 180 -204 -92 -95 -217 23 -25 -20 -16 -169 -92 249
5600 249 103 -36 206 140 70 142 191 -30 29 -24 142 -139 -14 -99 3 112 -141 86 -40 162 32 -26 32
5623 32 -13 70 40 -48 -77 78 -179 -56 -84 -81 41 -61 -226 217 -34 137 12 -173 -130 20 -184 -45 -24 -132
5647 -132 98 -75 74 -77 -242 -132 116 -39 -129 2 0 64 -37 29 -35 14 -15 -13 96 234 -53 86 -67
5670 -67 43 -42 115 -91 73 -42 34 -16 107 -21 -40 27 -3 -4 -41 -197 2 -174 -52 25 101 -13 -257 -116
5694a16J99J9J09j71m1j29Q2n9K00n7L5r9P3J19j7k95J31j3p7L13j04r8j39P0
5718f5K8j85L83j68j8K6j38J75L4J65k51k8j12K89q3k53L12K8k75J70m6l4J56
$$ plain form
5694 -116 83 102 211 40 -1 -130 -48 -107 93 36 71 -28 45 164 147 -148 -17 -30 -107 206 102 4 -135 -65
5718 -65 -37 -222 161 -7 -25 1 -137 38 72 237 -14 -42 -154 135 52 -201 111 139 -136 34 -12 -46 110
$$ [...]
8191d3
##END NTUPLES=NMR FID
##END=
