##TITLE=1H_Pr 4-ClO
 DMSO
 8 sc, 
 15.04.2022
##JCAMPDX= 6.0         $$ Bruker NMR JCAMP-DX V2.0
##DATA TYPE= NMR FID
##DATA CLASS= NTUPLES
##ORIGIN= UXNMR, Bruker Analytische Messtechnik GmbH
##OWNER= root
$$ XWIN-NMR		Version 3.5
$$ Fri Apr 15 11:06:34 2022 Russian Standard Time (UT+4h)  she@DPX200
##.OBSERVE FREQUENCY= 200.13135
##.OBSERVE NUCLEUS= ^1H
##.DELAY= (6, 6)
##.ACQUISITION MODE= SIMULTANEOUS
##.ACQUISITION SCHEME= undefined
##.AVERAGES= 8
##.DIGITISER RES= 18
##SPECTROMETER/DATA SYSTEM= spect
##.PULSE SEQUENCE= zg30
##.SOLVENT NAME= DMSO
##.SHIFT REFERENCE= (INTERNAL, DMSO, 0, 15.7039)
##AUDIT TRAIL= $$ (NUMBER, WHEN, WHO, WHERE, WHAT)
$$ ##TITLE= Audit trail, XWIN-NMR		Version 3.5
$$ ##JCAMPDX= 5.01
$$ ##ORIGIN= Bruker BioSpin GmbH
$$ ##OWNER= she
$$ F:/spectra/data/she/nmr/H-F/1/audita.txt
$$ ##AUDIT TRAIL=  $$ (NUMBER, WHEN, WHO, WHERE, WHAT)
(   1,<2022-04-15 11:05:15.67 +0400>,<she>,<DPX200>,
      <created by zg, POWCHK disabled, PULCHK disabled
       configuration hash MD5:
       00 E9 B6 7A A2 85 ED C7 34 08 36 98 17 FE 4E 26
       data hash MD5: 16K
       F9 34 95 BE 1A 6A 3B 99 B2 8A 30 34 AB CA 70 2E>)
$$ ##END=
$$ 
$$ hash MD5
$$ D1 83 E3 10 A9 DE 44 79 0B B2 C3 4C 97 E6 E2 D2
##$RELAX= 
##$RELAX= 
##$RELAX= 
##$RELAX= 
##$RELAX= 
##$RELAX= 
$$ Bruker specific parameters
$$ --------------------------
##$DU= <F:/spectra>
##$EXPNO= 1
##$NAME= <H-F>
##$PROCNO= 1
##$TYPE= <nmr>
##$USER= <she>
##$AMP= (0..31)
100 100 100 100 100 100 100 100 100 100 100 100 100 100 100 100 100 100 
100 100 100 100 100 100 100 100 100 100 100 100 100 100 
##$AQSEQ= 0
##$AQ_mod= 1
##$AUNM= <au_zg>
##$AUTOPOS= <>
##$BF1= 200.13
##$BF2= 200.13
##$BF3= 200.13
##$BF4= 200.13
##$BF5= 200.13
##$BF6= 200.13
##$BF7= 200.13
##$BF8= 200.13
##$BYTORDA= 1
##$CFDGTYP= 0
##$CFRGTYP= 5
##$CHEMSTR= <none>
##$CNST= (0..31)
1 1 145 1 1 1 1 1 1 1 1 1 1 1 1 1 1 1 1 1 1 1 1 1 1 1 1 1 1 1 1 1 
##$CPDPRG= <>
##$CPDPRG1= <>
##$CPDPRG2= <>
##$CPDPRG3= <>
##$CPDPRG4= <mlev>
##$CPDPRG5= <mlev>
##$CPDPRG6= <mlev>
##$CPDPRG7= <mlev>
##$CPDPRG8= <mlev>
##$CPDPRGB= <>
##$CPDPRGT= <>
##$D= (0..31)
0 1.2 0 0 0 0 0 0 0 0.06 0 0.03 0 0 0 0 0.0002 0 0 0 0 0 0 0 0 0 0 0 0 
0 0 0 
##$DATE= 1650006315
##$DBL= (0..7)
120 120 120 120 120 120 120 120 
##$DBP= (0..7)
150 150 150 150 150 150 150 150 
##$DBP07= 0
##$DBPNAM0= <>
##$DBPNAM1= <>
##$DBPNAM2= <>
##$DBPNAM3= <>
##$DBPNAM4= <>
##$DBPNAM5= <>
##$DBPNAM6= <>
##$DBPNAM7= <>
##$DBPOAL= (0..7)
0.5 0.5 0.5 0.5 0.5 0.5 0.5 0.5 
##$DBPOFFS= (0..7)
0 0 0 0 0 0 0 0 
##$DE= 6
##$DECBNUC= <off>
##$DECIM= 32
##$DECNUC= <off>
##$DECSTAT= 4
##$DIGMOD= 1
##$DIGTYP= 9
##$DL= (0..7)
0 120 120 120 120 120 120 120 
##$DP= (0..7)
150 150 150 150 150 150 150 150 
##$DP07= 0
##$DPNAME0= <>
##$DPNAME1= <>
##$DPNAME2= <>
##$DPNAME3= <>
##$DPNAME4= <>
##$DPNAME5= <>
##$DPNAME6= <>
##$DPNAME7= <>
##$DPOAL= (0..7)
0.5 0.5 0.5 0.5 0.5 0.5 0.5 0.5 
##$DPOFFS= (0..7)
0 0 0 0 0 0 0 0 
##$DQDMODE= 0
##$DR= 18
##$DS= 0
##$DSLIST= <SSSSSSSSSSSSSSS>
$$ [...]
##$SUBNAM2= <"">
##$SUBNAM3= <"">
##$SUBNAM4= <"">
##$SUBNAM5= <"">
##$SUBNAM6= <"">
##$SUBNAM7= <"">
##$SUBNAM8= <"">
##$SUBNAM9= <"">
##$SW= 18.05172834244
##$SWIBOX= (0..15)
0 0 2 0 0 0 0 0 0 0 0 0 0 0 0 0 
##$SW_h= 3612.71676300578
##$TD= 16384
##$TD0= 1
##$TE= 0
##$TE2= 300
##$TE3= 300
##$TEG= 300
##$TL= (0..7)
0 120 120 120 120 120 120 120 
##$TP= (0..7)
150 150 150 150 150 150 150 150 
##$TP07= 0
##$TPNAME0= <>
##$TPNAME1= <>
##$TPNAME2= <>
##$TPNAME3= <>
##$TPNAME4= <>
##$TPNAME5= <>
##$TPNAME6= <>
##$TPNAME7= <>
##$TPOAL= (0..7)
0.5 0.5 0.5 0.5 0.5 0.5 0.5 0.5 
##$TPOFFS= (0..7)
0 0 0 0 0 0 0 0 
##$TUNHIN= 0
##$TUNHOUT= 0
##$TUNXOUT= 0
##$USERA1= <user>
##$USERA2= <user>
##$USERA3= <user>
##$USERA4= <user>
##$USERA5= <user>
##$V9= 5
##$VALIST= <valist>
##$VCLIST= <CCCCCCCCCCCCCCC>
##$VD= 0
##$VDLIST= <DDDDDDDDDDDDDDD>
##$VPLIST= <PPPPPPPPPPPPPPP>
##$VTLIST= <TTTTTTTTTTTTTTT>
##$WBST= 1024
##$WBSW= 4
##$XGAIN= (0..3)
0 0 0 0 
##$XL= 0
##$YL= 0
##$YMAX_a= 33661
##$YMIN_a= -47594
##$ZGOPTNS= <>
##$ZL1= 120
##$ZL2= 120
##$ZL3= 120
##$ZL4= 120
##$ABSF1= 10
##$ABSF2= 0
##$ABSG= 5
##$ABSL= 3
##$ALPHA= 0
##$AQORDER= 0
##$ASSFAC= 0
##$ASSFACI= 0
##$ASSFACX= 0
##$ASSWID= 0
##$AUNMP= <proc_1d>
##$AZFE= 0.1
##$AZFW= 0.1
##$BCFW= 1
##$BC_mod= 2
##$BYTORDP= 1
##$COROFFS= 0
##$CY= 11.3945322036743
##$DATMOD= 1
##$DC= 2
##$DFILT= <>
##$DTYPP= 0
##$F1P= 2.36226072786647
##$F2P= -0.459571619588291
##$FCOR= 0.5
##$FTSIZE= 0
##$FT_mod= 4
##$GAMMA= 1
##$GB= 0.15
##$INTBC= 1
##$INTSCL= 1
##$ISEN= 128
##$LB= 0.24
##$LEV0= 0
##$LPBIN= 0
##$MAXI= 10000
##$MC2= 0
##$MEAN= 0
##$ME_mod= 0
##$MI= 1.114404
##$NCOEF= 0
##$NC_proc= 0
##$NLEV= 6
##$NOISF1= 3.799351
##$NOISF2= 2.8
##$NSP= 1
##$NTH_PI= 0
##$NZP= 0
##$OFFSET= 15.70392
##$PC= 1
##$PHC0= -18395.03
##$PHC1= 16.20074
##$PH_mod= 1
##$PKNL= yes
##$PPARMOD= 0
##$PSCAL= 0
##$PSIGN= 0
##$REVERSE= no
##$SF= 200.130013532006
##$SI= 16384
##$SIGF1= 3
##$SIGF2= 2
##$SINO= 400
##$SIOLD= 16384
##$SREGLST= <1H.CDCl3>
##$SSB= 0
##$STSI= 0
##$STSR= 0
##$SW_p= 3612.71676300578
##$SYMM= 0
##$S_DEV= 0
##$TDeff= 0
##$TDoff= 0
##$TI= <>
##$TILT= no
##$TM1= 0
##$TM2= 0
##$TOPLEV= 0
##$USERP1= <user>
##$USERP2= <user>
##$USERP3= <user>
##$USERP4= <user>
##$USERP5= <user>
##$WDW= 1
##$XDIM= 8192
##$YMAX_p= 0
##$YMIN_p= 0
$$ End of Bruker specific parameters
$$ ---------------------------------
##NTUPLES= NMR FID
##VAR_NAME=  TIME,          FID/REAL,        FID/IMAG
##SYMBOL=    X,             R,               I
##VAR_TYPE=  INDEPENDENT,   DEPENDENT,       DEPENDENT
##VAR_FORM=  AFFN,          ASDF,            ASDF
##VAR_DIM=   8192,          8192,            8192
##UNITS=     SECONDS,       ARBITRARY UNITS, ARBITRARY UNITS
##FACTOR=    0.0002768,     1,               1
##FIRST=     0,             0,               0
##LAST=      2.2672688,     0,               0
##MIN=       0,             -47594,          0
##MAX=       2.2672688,     33661,           0
$$ Real data points
##PAGE= N=1
##DATA TABLE= (X++(R..R)), XYDATA
$$ [...]
1912d98J074j027N2Q31r64Q20J2o77R70p78p0R65r75L19K34q93J278r08k07J340
1932H98j376O84K6j058J501p67l54J199j205O85K61j030Q07j62n81J276q44k41
1950b81P46r49R29m18o49R10m77j27O73r06L97L40p41J144o82l65J184j482P79
1969B5K45q48R74m53l46J130j100L20N13r20J019m35o20J072n84N0N08j064Q12
1988B98K0q18J032j032M69O99j039M62J08p17P08l77k80J007j019K54K12p19J190
2007D58m00l75P05r88O61P54j333Q80m44j00O95r19L06P49j207R39m08m98J213
2026F88o53j31M58r58Q57J62j112J221p31k32P58r49L41M36p39Q36m61N8Q30j087
2046d08J51Q92j292R68m71m64J008p67N54L17q48O43r2p46J323p84k34N33n70
$$ plain form
1912 -498 576 -451 -399 432 -532 288 300 -377 593 -185 -255 710 -265 54 288 -605 673 -235 -442 898
1932 898 -478 206 232 -826 675 -92 -446 753 -452 233 494 -536 271 109 -472 804 -40 -281
1950 -281 465 -484 445 27 -622 288 -189 -316 357 -549 -152 188 -553 591 -91 -456 728 -754 25
1969 25 270 -578 396 -57 -403 727 -373 -53 460 -460 559 124 -496 576 -8 42 550 -514 298
1988 298 318 -500 532 -500 -31 668 -371 91 199 -518 190 -187 -467 540 -479 -225 -13 -732 458
2007 458 58 -317 388 -600 61 815 -518 362 -82 -182 513 -406 -100 649 -558 381 -27 -525 688
2026 688 35 -96 362 -596 261 423 -689 532 -199 -431 327 -622 -281 155 -584 252 -209 -151 679 -408
2046 -408 -257 635 -657 311 -160 -624 384 -383 171 488 -360 283 191 -555 768 -16 -250 283 -287
2065b87O68k71o37J068o35j46N90j068N53L71q48Q77k30l06N15j007Q15K83j071
2084g66R98l33k19L46l87K28M71n94M45j39k03Q65p15R5N20q02M90J38o97Q08
2104E49m53k33P16j050O98p5p09R90n49k75Q58q71N31o0o44P85J71p85O77q97
2124f26M63O23p78P89o39j96Q76j043M51O82r49N34K12p76Q20p38N8O52n62L61
2144B14pm10O49l68l03P70r99P63Q7r50Q36m63m13J030j005L29K74o97J080n40
2164a23m45R86r94K89M85p78R33k9o56O07m88j49J001r45P46k91l48Q55l35n41
2184b20P53p24L18K82q68Q07m41L8J50m44K22N69j091Q85P8n64R00p00j74N29
2204C05q72R07l53o00Q67n56K78M42p12L80K29p45P97o21J3Q16j049P09K45p92
$$ plain form
2065 -287 381 110 -527 541 -94 -240 350 -718 -165 206 -642 235 5 -301 214 -793 22 305 -766
2084 -766 232 -101 -320 26 -361 -133 338 -256 189 50 -153 712 -3 92 612 -190 300 438 -259 549
2104 549 96 -137 579 -471 227 152 -557 433 -116 -391 467 -404 127 67 -577 208 379 -406 271 -626
2124 -626 -163 460 -318 471 -168 -364 512 -531 -80 602 -347 187 399 -377 443 -295 -237 415 -147 214
2144 214 207 -203 446 78 -225 545 -454 309 396 -554 282 -181 -594 436 -569 -240 34 -663 417 -123
2164 -123 -568 418 -576 -287 198 -580 353 324 -332 275 -213 -362 639 -306 440 149 -199 656 321 -220
2184 -220 533 -191 127 409 -459 348 -93 -55 95 -349 -127 442 -649 236 314 -250 650 -50 -224 305
2204 305 -567 340 -13 -613 254 -302 -24 418 -294 86 315 -430 367 -254 -241 575 -474 235 480 -312
2224c12P38n13l8O67p76M10P5p18R55l46n60O85n16N8M36p27O61l84j33P06n73
2245b05J75L53q20P25k38l71P66q11J59O24p13M74J39m02N54m48j1M42p12M68
2265A48j33m61O92m80Q8O49q64K22M66q31R32o42j71P45p04M57K65n79K29Pn22
2286d87J068n78j4N76r57O37j26o79Q79l54j25N18l85L62j01o80P05j38n52P63
2306C32o05J89J94n06N01lm79P34n61O3O77p41L71P6r36O89j81KM24p88Q14k99
2328c3l41J014o15k57M77n46L69J67o70R31o68L4N46q08L99L17q32R56k22m84
2348b66O97p27J24M75o86N91m2n25Q05p91K01L75m99L76J26n75P97o22K4K21l44
2369b65L52o9k67O60n70q5N72n13L08ok47L29l11k37Q31o25J29K86p74Q59l18
$$ plain form
2224 -312 426 -87 -125 542 -234 176 251 -467 488 142 -418 267 -249 -191 245 -482 179 -205 -338 368 -205
2245 -205 -30 323 -497 228 -10 -381 385 -426 -267 357 -356 118 257 -145 409 -39 -50 392 -320 148
2265 148 15 -446 246 -234 -146 503 -361 -139 327 -504 428 -214 -385 360 -344 113 378 -201 28 35 -487
2286 -487 581 3 -11 565 -392 245 119 -560 319 -35 -160 358 -27 335 234 -446 259 121 -431 332
2306 332 -273 -84 110 -396 105 102 -377 357 -204 -141 536 -205 166 242 -694 -5 -186 -184 240 -548 266 -33
2328 -33 -374 640 25 -232 245 -301 68 235 -435 496 -172 -138 408 -400 -1 316 -516 440 218 -266
2348 -266 431 -296 -172 303 -383 208 166 -359 446 -345 -144 231 -268 108 234 -341 456 -166 -142 79 -265
2369 -265 87 18 -249 411 -159 -244 328 -185 123 117 -130 199 -112 -349 482 -143 -14 272 -502 357 39
2390C9l88P73o55K63J05m80L28K49l87M17k06k83O66q30J40K60j82O39p52J84
2410a00L74m32L71L2o76P05m98n1O40o76M53K11o09M19j63m01P68q43J37O78q48
2431e09M72j3n21P41l32J3N60p30M57M11j271R31j61j0O13r78N41k08l09O74n67
2452a96k13O61l40K69k45l14M00r9k85M87l90K5O13o34N85k11l63N88m64j29Q00
2473E45q20M01J19m65M37m84J03N36m59J10K60o33N41l93J64K19m39K24L38p50
2493d46P71j86m53P85m79j01J94o07N05N4n07Q64n33O6K74m63L82k46r6M36m58
2514b44P3O54p00L45P5l37O12k55k30M04n32L38J8n13M98k67j33P04q59L40j6
2535b5m16M24j96o7M48k97K8J00m97O46r3l84N09j18j49L77n10M32J76p58P36
$$ plain form
2390 39 -349 424 -231 32 137 -343 -15 234 -153 264 58 -225 441 -389 -249 11 -171 468 -284 -100
2410 -100 274 -158 213 245 -431 274 -224 -275 365 -311 142 353 -256 163 0 -401 367 -476 -339 339 -509
2431 -509 -37 -50 -571 170 -162 -149 411 -319 138 549 -722 209 48 38 651 -327 214 6 -303 371 -196
2452 -196 -409 252 -88 181 -64 -378 22 -77 -362 125 -265 -240 373 -261 324 113 -250 338 -126 -255 545
2473 545 -275 126 245 -220 217 -267 -164 372 -87 23 283 -350 191 -202 -38 181 -258 -34 304 -446
2493 -446 325 139 -314 471 -8 -109 85 -522 -17 37 -470 394 -139 -73 201 -262 120 -126 -222 214 -244
2514 -244 -171 483 -217 128 203 -134 478 223 -7 397 -135 203 221 -292 206 -61 -194 510 -349 -9 -25
2535 -25 -441 -17 -213 -280 168 -129 -101 -1 -498 148 55 -329 180 62 -87 290 -220 212 388 -370 366
2556C66n02J08M69o60L06K4l52L16j26l61O68l64L8L97p03N37j45m33P04m81K06
2577A2p2k21M24l87l36N33j16J5M37m93K49l1k11N15l90k64P36n17K13J18l53
2598a39M78j03j86K89m79K51O1p32R14k99l05M54n08J57K85m10M05j9m63L10j48
2619a87j5M31o90M99L1k36O54n59M9L60n73L9M43n39N00j04k32K88n00N27J34
2640C20q38Q63l40k55O08m86O6K51l81M85j79j70L77m69M1K40l22M09k00l06N47
2661B61j84n6L79q17L20K71o11O53l21q9L03l57L92K19m72L49l92l11J020p99
2681b42L32R9m09L82j83l13O43l49p9K47m35M52k07o5L35m41k8O52o67M65j68
2702B1m13O94k17j51L35m80M14j04m25N38J0l73K79l76K85L98m80m2J43k70M62
$$ plain form
2556 366 -136 -28 441 -219 87 111 -241 75 -51 -412 256 -108 -70 327 -376 161 16 -417 287 -194 12
2577 12 -60 -281 143 -244 -580 -47 -163 -148 289 -204 45 14 -197 318 -72 -336 400 -117 96 214 -139
2598 -139 339 236 50 339 -140 111 172 -560 354 55 -250 204 -304 -147 138 -272 133 114 -349 -39 -187
2619 -187 -202 229 -461 38 69 -167 487 -72 -23 337 -236 -197 246 -293 207 103 -129 159 -341 186 320
2640 320 -518 345 5 -250 358 -128 -62 189 -192 293 114 -56 321 -148 -107 133 -189 220 20 -286 261
2661 261 77 21 400 -417 -97 174 -437 216 -105 -194 109 -248 144 363 -109 240 -152 -463 557 -242
2681 -242 90 189 -220 162 -21 -334 309 -40 -119 128 -307 145 -62 -127 208 -233 -261 391 -276 189 21
2702 21 -392 302 85 -66 269 -211 203 99 -326 212 222 -151 128 -248 37 435 -45 -87 56 -214 248
2723B48m21R3K73m99N85k15j31J95k74J00K44m35M65j00k50J67j24K3M07n54L22
2744A19J28n07N07n61L88J47n16M23qj96K67j58n7J79m2q7K25m81L09J9k94M07
2766B11k66J6L34o16K14J73m54P38k59r6J41n04L97K39l46M92l97p1K78l24J02
2787BP0l81K99l09J1O48m64J05P8m25L85j61j94O97m65j18N99n16K50R6l87L77
2809A97j52k22O92p83L75k9k16J25o7J1L13k44K27J33m14J57J30k91K31k83L9
2830g1L65o38M12p0k78N05k16l56N62l42J66J0l22N84n35K45O4l66L32K99o71
2851c21M50j03p9K89n11J16J42l37N23l3k60K04j11J03K55m64M12j12l64N07k07
2872I9k14L10n74L28N3m42N62k96N0J90m01L92j16j59O75n53l8M78p35M36R6m23
$$ plain form
2723 248 -173 -80 193 -306 279 64 -67 128 -146 -46 198 -237 228 128 -122 45 -79 -56 351 -203 119
2744 119 247 -260 247 -314 74 221 -295 128 120 -76 191 33 -24 155 113 26 251 -230 79 98 -196 211
2766 211 -55 -39 295 -321 -107 66 -388 350 91 -5 136 -368 29 268 -78 414 17 -54 224 -100 2
2787 2 72 -309 -10 -319 -308 340 -124 -19 59 -366 19 -142 -336 361 -104 -222 377 -139 111 207 -180 197
2809 197 45 -177 515 -268 107 78 -138 -13 -80 -69 244 0 227 360 -54 103 233 -58 173 -110 -71
2830 -71 294 -344 68 -2 -280 225 9 -347 215 -127 39 49 -273 311 -224 21 85 -281 51 350 -321
2851 -321 129 26 -53 236 -275 -159 -17 -354 169 136 -124 80 -31 72 327 -137 275 163 -201 306 99
2872 99 -115 195 -379 -51 2 -440 122 -174 -124 66 -335 57 -59 -218 457 -96 -134 344 -391 45 141 -282
2894b82M46l8k08L98m22J56J85l82P9K33l42O06p19N5L55j58K43k20n3L34n10
2915b44K03L50m16K38l12Q7M2O2K5J6l64L50K47m74L72l87R8K86k37j6K42m49
2937b81M46O9k44M81n61L28j11m16N35J5l30K57j74ML07o61K14K4K1Q8o8N2M01
2960C96p11M33j60l1J64j30J05K19o63K42K40j55J97l9k38M03m15J81K85m46r2
2981b15M06m87M56k92K17J36m12L01J27n55M99q2n9L14k80o8O7j82K85m26K31
3002a9J98n63L66Q2m33K96J66j68M62n76J65K00k35L21j64P7p7k31m1K79m48J55
3024a88L96l66M96l66K25n6m54K07K12k43K29k00k20N29m45K80j22k66M08j19
3044f3N3J66l76L25K2k26J89k1j25M73l35j91l0p5L62Nk73K87m65K45K08k92L61
$$ plain form
2894 -282 164 126 -82 316 -106 50 235 -147 -68 165 -177 429 -290 -235 120 -38 205 -15 -68 266 -244
2915 -244 -41 309 -107 131 -181 -94 -52 10 35 51 -313 37 284 -190 182 -205 -107 179 -58 -74 168 -281
2937 -281 165 234 -10 471 -90 238 127 -289 246 261 -69 188 14 18 325 -336 -122 -98 -77 11 -57 -5 396
2960 396 -315 118 -42 -73 91 -39 66 285 -378 -136 104 -51 146 107 -131 272 -143 38 323 -123 -215
2981 -215 191 -296 160 -132 85 221 -191 110 237 -318 181 99 40 354 74 6 73 -109 176 -250 -19
3002 -19 179 -384 -18 64 -369 -73 93 -75 387 -189 -24 176 -59 262 98 175 98 -133 -174 105 -343 -188
3024 -188 208 -158 338 -28 197 141 -313 -106 106 -137 92 -108 -328 201 -244 36 -86 -352 56 -63
3044 -63 -10 156 -220 105 127 -99 90 69 -56 417 82 -109 -139 -214 148 153 -120 167 -298 -53 155 -137 224
3067B24k69k04L96j0k05K18k41o6K02j89K27r5n2R3r6LO0O9L12n29K0J52j72P0
3091h2R7o7J11j3j62L50l67L42k10r9J21R9m32M57m7k44N64l17k39K93l42L97
3113B10j48l32K59r4K39N0m00J85J30j77K69k79R4J35l11L86j12m02L15j84K22
3134E5j33j99K48N9j54J78j22j75M29k77pK25k82J34K05k66J71j85N9K78m79L27
3156H9k65j40M06q9J37rk39J74j89j47N04k51j96K46k98P7R0j08M85k20P6Km19
3179b84M58m6o70O54k58J21K47m00qN42n69N6K65k8P1l77J51J20J8J36l02M4L90
3202C31m47J37K87m32J13j89M1L12k46N5K08n15L40J47k79J90j91K22m6k28K94
3223A04j72k99L52N7k35L29k34R3L76l96N63m20j03L13l13p1J45k32K90K31l82
$$ plain form
3067 224 -45 -249 147 137 -68 150 -91 -157 45 -144 83 -12 -64 29 -67 -64 -4 65 377 -152 -132 20 -152 -82
3091 -82 15 -52 59 46 -116 234 -133 209 -1 -100 21 120 -312 145 98 -146 418 101 -138 155 -187 210
3113 210 62 -270 -11 -105 134 184 -216 -31 99 -78 191 -88 6 141 -170 216 104 -298 17 -167 55
3134 55 -78 -277 -29 30 -124 54 -68 -243 186 -91 -98 127 -155 -21 184 -82 89 -96 -37 241 -238 89
3156 89 -176 -316 90 1 138 129 -110 64 -125 -272 232 -19 -215 31 -267 -190 -100 -208 277 57 133 135 -284
3179 -284 174 128 -542 112 -146 -25 222 -178 -186 356 -213 -157 108 80 151 -226 -75 45 63 199 -103 -59 331
3202 331 -116 21 308 -124 -11 -200 -159 153 -93 -38 170 -345 -5 142 -137 53 -138 84 38 -190 104
3223 104 -68 -367 -15 42 -193 136 -98 -5 371 -25 538 118 15 328 15 -56 89 -143 147 378 -4
3244dL0k25K34k8l12Q7J17R8J70k45j24L83m80K92l4j88M12k91J4K41m06K33J54
3267A28n28M81k10K17J62l61J87l9j69J5J92k88P03p40K50M33n59L33L6k37L81
3288C87m24k0L19m82K61J46m70K46j96P5J97j70O4n4K9N1N4k69L86k55M7K22m13
3311b69M17j61m39O34j90j57M10k37L8%j63K25j71j65L14k20J00K51l50K60j88
3332f1M7q3l7L08K5k79K17j06k39K33l18K25M14o39K32J68l75N60n12M56k77j36
3354a77K70j56j02M78m44pK38l54N19q5l26M56k97l9M58n89K6O4L0J95j33J13
3376A38j6k22q5j8J83J69l09K30J48n51K03J19j82K26k38rJ43m6J24J7j83P8K72
3399A91k36K07k29j68K37k51M53P6p27O98l81N8L25l97J94M7j67K62m5m35N22
$$ plain form
3244 -4 26 -199 35 7 -305 -218 -101 -3 167 -78 -202 181 -299 -7 -41 -229 183 -108 -94 147 -259 -26 128
3267 128 -400 81 -129 88 250 -111 76 37 -132 -117 75 -213 490 -250 0 433 -126 207 243 6 387
3288 387 -37 -57 262 -220 41 187 -283 -37 -233 -158 39 -131 -67 -121 -92 -41 13 -256 130 -125 -78 144 -269
3311 -269 148 -13 -452 182 -8 -165 245 8 46 46 -117 108 -63 -228 86 -134 -34 217 -133 127 -61
3332 -61 -14 -97 -134 174 199 -80 137 31 -208 25 -293 -68 346 -293 -61 107 -268 292 -220 236 -41 -177
3354 -177 93 -63 -165 313 -131 -138 100 -254 265 180 -146 310 13 -26 432 -157 -131 -67 -37 158 25 138
3376 138 122 -100 -185 -203 -20 149 -160 70 218 -333 -130 -11 -193 33 -205 -214 -71 -117 7 24 -159 -81 191
3399 191 -45 162 -67 -235 2 -249 204 280 -447 251 -130 -72 253 -144 50 97 -70 192 147 -288 234
3420B34l95j13L37q3M4j87K30n3K3J78J81m31K48k23k48M63j67q1M05m52Q0J53
3442A43j37J02q5k99M40j94J73r7l5L35m41j61K36M6j5J34l33K79p1p3L98l12
3464C3o4M73o11L25Nk39P9q4j10M58k20n1R1P5m6j46j18L71k58j5M37m95K10j90
3488i0j8J31j24j02L78l30K1J57j20J75m2j76K48q1J0q1j89O01l85j16J08j87
3510b12L55M8m9j26K22k74K43k59J33k55P3Q6j6n1K11J1j91L34o42O51m21j91
3532c20N59k48k89N87n69L86r8j81K71r5p3L50m86L04j27o3L81l16R1J00k74K58
3554A48j48k08K67%k11m0K06j90J98k54J94J19k55L32j94J55j0l37L10K1j08N1
3576D6o3k66L54k17L91j73l64J69J6J16K77n59J73K1k58N32P6k97L19m01n7L28
$$ plain form
3420 234 -161 -274 63 -20 24 -163 67 14 37 215 396 -35 213 -10 -258 205 38 -43 362 -90 -10 143
3442 143 6 108 23 -276 164 -30 143 46 11 346 -95 -256 -20 26 11 145 -188 91 20 -53 345 33
3464 33 -31 442 -169 156 161 -78 1 -83 -193 265 45 -6 85 160 114 -32 -150 221 -37 -52 385 -110 100 -90
3488 -90 -108 23 -101 -203 175 -155 -134 23 -97 78 36 -140 108 27 37 -44 -233 368 -17 -133 -25 -212
3510 -212 143 191 142 16 238 -36 207 -52 81 -174 -101 -15 -31 -82 129 140 -51 283 -359 292 -129 -320
3532 -320 239 -9 -298 289 -280 106 8 -173 98 3 -70 280 -206 98 -29 -92 289 -27 64 164 -110 148
3554 148 0 -208 59 59 -152 -192 14 -176 22 -232 -38 81 -174 158 -36 119 109 -228 82 103 -5 46
3576 46 -17 -283 71 -146 245 72 -292 -123 -107 9 286 -273 -100 -79 -337 195 271 -26 293 -108 -165 163
3598A63l33K28K5l58L69k13J7K77l26J10K37m19M26m12K07Q4j34M9J03k01K62
3619A61k90m8M76n38kK12j8J20j00m2j0q4p4L34m17M91k75r8J10j70L10o6o1J69
3643I0j12j88M89j88RJ30n38M49J60n10J82r9NO1p0J90j42j25L90m9l91M75k73
3666e5p5L03l54L87o9j13L25k59k31N81o83L98l25K61K46m89J13J85k21R6K44
3687B65n06J29J04j63R2M6N5J02l77J26P0j51L82p6p4P0l37M36N6l78L17l05o2
3710a79J61j89M25pm37K72m8j38L21r8j80Q1j35Q7L46m73K88j29J12J22l44L64
3732B22k85R5P3j94J62J50n52L27j09Q6K96l64q3L23k50N33m75r7K65j31j22M62
3754C32m46L42j41j97K09n1j48K66j87P3K1K3o9k63K05M92m19r5J46m42M28M0
$$ plain form
3598 163 -170 58 83 -275 94 -119 -102 175 -151 -41 196 -223 203 -209 -2 82 -52 -3 100 -101 161
3619 161 -129 -177 299 -239 -241 -29 -47 73 -27 -69 -79 -163 -237 97 -320 171 -104 -202 -92 -262 48 -18 -79 90
3643 90 -22 -210 279 91 100 230 -308 141 301 -209 -27 -126 -121 -60 -130 60 -82 -207 183 134 -257 218 -55
3666 -55 -130 173 -181 206 137 24 349 90 -141 440 -243 155 -170 91 337 -152 -39 146 -75 21 265
3687 265 -241 -112 -8 -171 -79 -33 22 124 -253 -127 -57 -208 174 98 24 94 -243 193 249 -129 188 -117 -179
3710 -179 -18 -207 218 211 -226 46 -2 -140 181 83 -97 -16 -151 -64 282 -191 97 -32 80 202 -142 222
3732 222 -63 32 105 -89 73 223 -329 -2 -111 -25 271 -93 -176 147 -103 430 -45 -142 123 -8 -130 332
3754 332 -114 228 87 -110 99 48 -100 166 -21 52 73 96 27 -236 -31 461 42 -53 93 -349 79 119
3776A19o0r8q4P5R2k46M45j79k41K24k72K83j12q5J07j03QM64l68j11K3j68M17
3799A30qj54R7m3L4J2r1K11J04k52k0N7J79k6k20n5k0M0q8Mj02L20k02O8K31k69
3825f3J74l94J48K7j08K04L43k54l3J58k69K15k76J16K58k62N0K63j91J1j23k35
3847b41M09l43J59K73n50K70J73k01K04k72K6P7J6n0J90l74M20n8j73J07L0j19
3869b7M5j80R4J22j55L1j80K73K61k80p2J85k42J84j29J04m9j54Q1K08j66K19
3891A73j84J04K8l86L26j20j07L69l31mL87j62M7r9k9K19j79l5J14j56Q9r0k8
3914e4J24n4J50k92N6J46K06p06L45P1k8L16l22L62k17k41L50k90k81M17J4r4
3936b2Q9j58L3K7l77N97l03r5N07l76J77J48n29J77J74J48l32N1j05K09j60O3
$$ plain form
3776 119 59 -39 -123 -48 44 -202 243 64 -177 47 -225 58 -54 -139 -32 -135 -127 337 -31 -142 -119 -287 130
3799 130 122 -32 65 22 56 68 -23 188 292 40 20 77 256 230 10 -45 -65 -25 -113 -109 -211 109 -93 -25 206 -63
3825 -63 111 -283 -135 -108 -216 -12 331 77 44 202 -67 148 -128 -12 246 -16 34 297 106 117 -6 -241
3847 -241 168 -175 -16 257 -293 -23 150 -51 153 -119 -93 -16 0 -50 140 -234 186 128 -45 62 92 -27
3869 -27 18 -162 -68 54 -101 -70 -250 23 284 4 -68 117 -125 59 -70 34 -15 -169 -88 120 -46 173
3891 173 -11 93 121 -265 61 -59 -166 203 -128 -132 255 93 140 41 12 231 52 17 131 -25 64 -26 -54
3914 -54 70 16 166 -126 -70 76 282 -424 -79 -8 -36 280 -42 320 103 -138 212 -78 -359 58 72 -22
3936 -22 67 -91 -58 -31 -408 189 -114 -209 298 -78 99 247 -282 -105 69 217 -115 -64 -169 40 -120 -57
3958e7P8k04K24q6K14r3j78L44k47N2jm2k74L06m5N4k51j8K24mk04M26l91P6K82
3983A85K9j37j30L5J31l21N04k99l9L9J5k23M65m00n8K20j80K02j0k57L40K69
4005C80n58K77l84K61mR8K13l64K30k94J47J74j5k32L68l95r6N50m91J70J11k85
4027a39K67j10j0J15j05p6K8l4J40j1j53K24k19QJ13j58R2R7J29j49j28L2K52
4050B05l40L3M06n99K36P2j03K74m07K24k44J80K01J58l04J89j88L4K73k05j5
4071H0n7r3K26j81O0J11k74J32J61k02K43l65J20K34l46L14l60k3N40j44j67q3
4093g4j89M73l3k4k07J0J19P6mk26K36j17j14J0k39J61J34j85K75%M9j99J5L2
4117b1k0j15L80k98J51L9l98L78q5k78M14j20r4L06m58M08j83pq2m8J01J95j71
$$ plain form
3958 -57 21 -183 41 -45 169 76 -102 242 -5 47 46 4 -270 36 -9 45 -206 -224 0 -4 -208 218 -173 -97 185
3983 185 214 77 -53 -18 113 -208 296 -3 -42 -3 12 -211 254 -146 -204 16 -164 38 28 -229 111 380
4005 380 -178 99 -285 -24 -28 70 283 -81 149 -145 2 176 161 -71 297 -98 -194 356 -135 35 146 -139
4027 -139 128 18 8 123 18 -58 -30 -64 76 65 -88 136 -83 -75 38 -120 -28 69 198 49 -79 -47 205
4050 205 -135 -102 304 -295 -59 13 -90 184 -223 1 -243 -63 138 296 -8 181 -7 27 300 95 80
4071 80 23 -70 156 -25 35 146 -128 4 165 -37 206 -159 -39 195 -151 163 -197 -220 320 176 9 -74
4093 -74 -263 210 177 153 -54 -44 75 151 147 -79 157 40 -74 -64 -303 -142 -8 -193 82 82 131 -68 -53 -21
4117 -21 -41 -156 224 -74 77 116 -282 96 11 -267 147 27 -67 239 -219 189 6 -1 -83 -131 -30 165 -6
4140fQ6Mr2l4j05K45J25m01O4J68j62P2k9kL40m30J15j42J58K90k36j02J42k43
4164a75J55J9k47M89j68m4J73k17j97L31r5k0J08j89m3K12l5K2P2o5k92K26j01
4187h1K11k08Kk03K14Q4M6m9j50j57L89k63P9q0K0K5J92j79P4k7m9L18k71N1J6
4212Dj46M19l82Q0Q3j41n3K45k62P1J6N5j25p8K35rk54L04J0j07J06k04J71j05
4236f7j15M01k03K4m5J1j10J27j91K38P9j18L03k17k19K29k32N3P8o3j53J10j77
4259b57L16l0j00K7k2R7N6j1j20J4J11n9j88J40J23j99L93m01R3J05p9J95k47
4282d3K49l02k04J71L33m60K46k3j48K86m06N03k8j71J09n8l02J40J2p8L46n1
4304A21j95J42k25J63K03r4Q4k56J68q0o5K59l92M6l8K10k61L74j41J04K2k02
$$ plain form
4140 -6 80 84 -8 -42 -147 98 223 -178 -114 54 -108 -36 -65 -67 273 -157 -42 -184 -26 264 28 -74 68 -175
4164 -175 -20 -1 -248 241 73 29 202 -15 -212 119 24 4 112 -77 -120 92 57 79 151 86 -206 20 -81
4187 -81 130 -78 -76 -279 -65 19 65 16 -134 -291 98 -165 -86 -166 -146 -121 71 -108 -34 -61 -110 208 -63 -12 4
4212 4 -142 277 -105 -25 58 -83 -136 109 -153 -82 -66 -11 -136 -214 21 12 -242 62 72 -35 71 -133 38 -67
4236 -67 -182 219 16 40 -5 6 -104 23 -168 70 149 31 334 117 -102 127 -105 -52 26 -37 -190 -80 -257
4259 -257 59 29 -71 -44 -66 31 87 76 -44 -30 81 22 -166 -26 97 -102 291 -110 -17 88 9 204 -43
4282 -43 206 -96 -300 -129 204 -256 -10 -33 -181 105 -301 202 174 3 112 54 -248 -108 -96 -174 172 121
4304 121 -74 68 -157 6 209 115 199 -57 111 31 -34 225 -167 -121 -159 51 -210 164 23 127 149 -53
4326e3K34j43j18K51k52J22m9j08j12K74o9Q4k16L82j93j31L26l13K06j89j41
4347b08L08p2k65K45n0j96J75j72K01k3j01K55j62j54K50j47k36N12r0j05J76
4368A41j35m7K19k10K39j11P9k37j55M42k02j98K29k19N2J02n8J86Q9k67L28l71
4390a04J36K1j10LJ05j01J01lr0K52m44J99L25n39L38k95K46j02k30N47k69J23
4412A09J47m16%J56l16J54Q8m7K05q8K5j45J96L6N1k23J15n0j53L96k3j78N5m0
4436E4qJ02J7j37j49P5K80k25l97M22k23R5J20m9J87k14j01J16j24R1J69m1J39
4459A99k01q6J59l61L15J8m5n4l3J40j67n4N6J14j87K92l02J65j23J24Q6m1k88
4482b74J54n9J13K98l75L93j1l69RJ05O4j29m5J1K44j04o0L2j6J15j89J75J10
$$ plain form
4326 -53 181 38 -80 171 -81 41 -8 -116 -228 46 -23 61 -155 227 34 -97 229 -84 122 -67 -208
4347 -208 100 28 -237 8 -42 -238 -63 -235 -34 -57 -158 97 -65 -219 31 -116 -352 160 70 -35 141
4368 141 6 -41 178 -32 207 96 175 -62 -217 225 23 -175 54 -165 -113 -11 -69 117 206 -61 267 -104
4390 -104 32 53 -57 -54 51 -50 51 48 -42 210 -234 -35 290 -249 89 -206 40 -62 -292 255 -14 109
4412 109 256 -160 -160 -4 -320 -166 -78 -125 80 -8 17 -128 68 104 155 -68 47 -3 -156 240 217 39 94 54
4436 54 46 148 165 28 -121 -46 234 9 -388 34 -189 -94 26 -23 164 -50 -151 -35 -159 -68 101 60 199
4459 199 -2 -88 71 -290 25 43 -2 -56 -89 51 -116 -170 -114 0 -187 105 -197 -32 -155 -31 55 14 -274
4482 -274 -120 -179 -66 232 -143 250 239 -130 -121 -16 48 -81 -126 -115 129 25 -35 -3 -19 96 -93 82 192
4505A92l62K85p8n7R3K9k16N0N0J34j41p3nJ07o7J44j9J60j15o8R3m62J98J08
4529b0m9j59K84l33L04J20j52q8j64L37j16k64M19j52k5n3J44j67K0p7K35R0j87
4552e3K15l40J26P8k32M77j72j52K71n8j6j89j01LJ99j90J98O7m22N37l99O8J79
4575I4k77M13k79k88N88k31o5J63j47l8K64l61M13m90K26R8jM5k83J34J81o9j86
4598i6N3k15J87n5K08J18l60L20J27k72j2K0m9K25k62p4K15j65J21K14l86L43
4620B05j4k66J38k20K41q5j53N5p8J13L38j91P0J9l00M3n2J52Q0K10k00r1j45
4643a31l4O4J72n7J26lj6o7j96K53l69L63k60K33j61k54M94K12m64kJ48m3r3j8
4667a03J68Ql41K15o3J08Q6l2n9j00J09k9n8K4K13K9m76K56k0J99j75L8J99k2
$$ plain form
4505 192 -170 115 37 -20 73 102 -114 -64 -14 120 -21 -94 -99 8 -59 85 66 226 111 43 136 -326 -128 -20
4529 -20 -69 -228 56 -277 27 147 -5 -93 -257 80 -36 -300 119 -33 -58 -111 33 -134 -114 -191 44 134 -53
4552 -53 162 -178 -52 26 -206 271 99 -53 218 160 144 -45 -146 -143 56 -134 64 131 -291 246 -153 -85 94
4575 94 -183 230 -49 -337 251 20 -45 118 -29 -67 197 -164 249 -241 -15 83 82 127 -156 -22 159 90 -96
4598 -96 -43 -258 -71 -126 82 200 -160 160 287 15 3 23 -26 199 -63 -137 78 -87 34 248 -138 205
4620 205 191 -75 63 -157 84 -1 -154 -99 -177 -64 274 83 153 172 -128 -85 -137 15 95 305 105 14 -131
4643 -131 -165 -101 71 14 140 137 121 54 -142 111 -258 105 -155 78 -83 -337 157 369 -95 -97 51 8 -85 -103
4667 -103 65 73 -268 -53 -116 -8 78 46 -13 -113 -4 -33 -91 -67 146 175 -301 -45 -65 134 -41 -3 196 174
4691A74k60J14K28j67K05n70N36j69j21J64k06J15J80k76J32J28l17M09m32J55
4711B2l0j34J00J10j66K03j76P3P0r2Q5j23K3J4K07j72j92L20n3p3l8J23N7k13
4735e5JJ63j98K79j08m02L32l45M54j91O9J31k63J57m4k44M12k68R7L3Q5j52L38
4758B81l51K58l37R7L6j83K31O9k56L97j02k72K17k30j14L09j36k6L19o16O44
4779B35j87L1l6l12L84j29l34M98l11m4K32n0r5J3j57L06j90o6M65k71M7L4l26
4802b63L20j3q0l1J70r1k9j09l3M56j83j13k9L28l45k93J87J76k93L27j99P5L51
4825B86j45k59L00m57N04j86k60K16J40k86Rq0K42k2O5J73m71K39ml66O04J15
4847C57m04K47k07j30R9J04r5M8p0R5N9o6K50j93l45O6L7J72kQ9J34k06k11J33
$$ plain form
4691 174 -86 28 256 89 294 -276 260 91 -30 134 -72 43 223 -53 79 207 -110 299 -133 22
4711 22 -8 -142 -42 68 -98 105 -71 2 72 -20 65 -58 -35 -21 186 14 -178 142 89 16 -22 101 158 -55
4735 -55 -54 109 -89 190 82 -320 12 -333 121 -70 -1 130 -133 24 -20 -264 148 -120 -23 10 95 -57 281
4758 281 -70 188 -149 -52 -16 -199 32 101 -155 242 140 -132 85 -145 -259 50 -86 -112 207 -409 235
4779 235 48 79 43 -269 115 -14 -348 150 -161 -205 27 -23 -118 -105 -262 44 -146 -212 253 -18 29 63 -263
4802 -263 57 44 -36 -67 103 12 -17 -126 -159 297 114 1 -28 300 -45 -338 -151 25 -268 59 -140 -65 286
4825 286 141 -118 182 -275 229 43 -217 -1 139 -147 -138 -218 24 2 67 240 -231 8 4 -362 242 357
4847 357 -47 200 -7 -137 -38 66 -29 19 -51 44 103 37 287 94 -251 -185 -148 24 22 111 245 39 -172 -39
4871c9r2J83n4J14o9l30K16K38k04jk01N1K20KN8R1j34j55L82k00j3j4MK22n27
4896b52K56R0k68L18j44p0M37k71k45j04J67m3J35k57M82m04K89n8k64K62M8Q
4918A12P8l61J42jp6J47J17l01K44j11O9m4j00J48k0mj18J94j95J41j84J05J61
4941A43j57O4j20j34K55j4j30L23l52J37N9o0l5N2k0K9N7O8r6k24K6K16j27K36
4965A96k40J33j05k14M84k0k89K96j98j06K26l11L63j21m77M34K62l53K7K11j61
4986C7n7l5R1p9J44k5n9j88K41n9J64n4L5n4j10J66k80O1L9j61J39L64j74j48
5010bM0l16J54R2l14M68k90K11qj99J74j39L06R3j95k16L26k68J20O4p9J6k09
5033a71M14L1l47J7L57l52K58j27k51m3m0J79O0P4j35J29k1J59k01O2K12l32K22
$$ plain form
4871 -39 -131 52 -2 112 43 -287 -71 167 -37 -38 -239 -188 32 34 92 183 49 -106 276 76 63 49 53 275 -252
4896 -252 4 94 -174 144 0 -70 367 96 -149 -253 -86 -129 6 -251 231 -173 116 58 -206 56 104 112
4918 112 190 -171 -29 -30 -106 41 158 -143 101 -10 59 15 -85 63 43 39 -79 115 -80 61 -123 -18 143
4941 143 -14 50 -70 -204 51 37 -93 230 -122 15 74 14 -21 31 11 40 97 165 69 -155 -129 87 -40 196
4965 196 -44 89 -16 -230 254 234 -55 241 43 -63 163 -148 215 94 -383 51 313 -40 -13 198 37
4986 37 -20 -55 36 -43 101 76 17 -171 70 11 175 121 156 102 -8 158 -122 -61 -22 -183 -44 320 146 -2
5010 -2 38 -278 -124 -32 -346 122 -168 43 35 -164 10 -129 177 270 75 -141 185 -83 37 101 22 38 -171
5033 -171 243 274 -73 -56 301 -51 207 80 -171 -214 -254 -75 -15 59 -76 53 32 191 -10 52 264 -68 154
5056A54j09k9K74k29k88L03J4k29K44j81K22P3l07J12j24JK45J85l06k41K25j
5078HK02j10j18O8J23k69l5K58n4r6J38k08P3J52m8j47o7j09K90q8k5J63k13J48
5102C6r2J01o5l19N50l15j00J98j20N0P9j14J05J77l70j58K08J29J02l1o6j5P8
5125D8J81m67J26L12J32k88J72l48K22j07j52L32k01j17K20k56K86l9j85M05l84
5146a08K3n1j03M61k86r9K25L4j79K50m65M33km27M96j43j12K18j87J8j79O7K83
5169A67j65rr1J00o5J65k30J81J48k16J14j30Q0J95j09m8k1k19L62km8p5l02K47
5193B9K8o3L9k9k84M29k79K11O6k73J83l01P3L9J81j40J11j24m7j33J39K42k59
5216a62J84K09k39k95N02j18k12P5N3m1j64J27pL0J19j2j78K87j90M2oP8m1l0
$$ plain form
5056 154 45 16 290 61 -227 76 90 -139 105 -76 146 219 -88 24 -100 -99 146 331 25 -216 9 8
5078 8 210 100 -18 50 173 -96 -131 127 73 -23 115 -93 -20 132 84 -63 -130 -239 51 -37 -62 101 -112 36
5102 36 -56 45 -20 -339 211 -104 -204 -6 -126 -76 3 -111 -6 171 -199 -357 -149 -20 82 51 -15 -30 48
5125 48 229 -238 -112 200 332 44 216 -132 90 -17 -169 163 -38 -155 65 -191 95 56 -129 276 -108
5146 -108 -85 -136 -239 222 -64 -163 62 96 -83 167 -298 135 133 -294 202 59 -53 165 -22 -4 -183 -116 167
5169 167 2 -7 -98 2 -63 102 -128 53 201 -15 99 -31 49 244 135 87 66 -153 209 207 159 84 -218 29
5193 29 57 -6 33 4 -280 149 -130 81 147 -126 57 -244 -171 -132 49 -91 20 -104 -151 -284 -145 97 -162
5216 -162 22 231 -8 -303 199 81 -131 -56 -3 -44 -208 -81 -88 -58 61 49 -129 158 -32 10 4 82 41 11
5240A1o7J56l73L20k08l8L12k90K45n9jp3J2J21n9j23n2L40k50J46P8l60L06J60
5264B54k28r6j82K11K21m09pK23p4P4P5j54K22k98N4L76k25N4L2k28J82j15j83
5287b21J11j52J32k08K85K06l7j10Qo8J61j4l52N83l16j3p8MJ8K40j96p7K7o1
5311a28L52k06r0K59j75l5L4K6k28N3J15J1Q1j10L62n24J65J90j51M4j99J38K19
5334B03m85L76j15r1L78j50Q8k41m1K63l40R1J66PK26k24k18J28j06R4k7K0m0
5357c8j05J80n7O1n0K64k31M0J63k25o4rJ23J72n09K18P2J4k53N28m45L3Q1L2
5381eO4p5l0J83k00J80M2j35J72M0n9k04N0j73L39k66M81m52N1K7r5J16Q2j59
5405b6J34k81J06J22P6mR1l45K9K48l36K02q2J10m7k54L75l5j35Q3J64J26k00
$$ plain form
5240 11 -56 100 -273 47 -161 -199 113 -177 68 9 8 -65 -53 68 9 -114 -166 174 -76 70 148 -212 94 254
5264 254 26 -70 -252 -41 180 -229 -236 -13 -87 -13 62 -92 130 -168 -114 262 37 91 123 -105 77 -38 -221
5287 -221 -110 -262 -130 -338 -53 153 116 6 14 -54 107 93 -259 324 8 -5 -83 -79 -61 179 -17 -94 -67 -128
5311 -128 224 18 -72 187 12 -23 11 37 -191 -138 -23 -12 69 -41 321 -203 -38 152 1 45 -154 -16 203
5334 203 -282 94 -21 -112 266 116 204 -37 -78 185 -155 -64 102 109 335 111 -107 21 -85 9 -18 2 -38
5357 -38 -143 37 -20 41 -9 255 24 64 227 2 -62 -71 52 224 -285 -67 5 19 -234 294 -151 -118 -37 -5
5381 -5 59 -16 -46 137 -63 117 159 24 196 236 177 -27 23 -150 189 -77 404 -48 3 30 -65 51 133 -26
5405 -26 108 -173 -67 55 131 127 218 -127 -98 150 -186 16 -66 44 -3 -257 118 83 -52 31 195 321 121
5428A21m74J57L63j30M1k94R0O5M1P6p0m4Q6j87r6L05Q6j0k51J17k0m21N18K42
5452C11m51J00K47l48K72l62L47k50mK54O7l70K22j91N0K57j94n4K97l29J30K00
5474B01q8R1rk68J48j2Lj76LL34k76j15M20j86P7J32j98j18L1k07K89j15q6J36
5498A1L0Q3m4m3P3j66J5N7r5K24J5k59P6Qn4P4O1K9j65m5N6k53L86J1k14J52J09
5525A32j43m5j9j61M66j3l73L77l02K0K69l68K63j62O0lN0M7j62O7M3j62k48L45
5549b2j38M4J08L0k21R2M03l24n7Q9j30j45L52l7Pk91J27Q8J96m72L50J62l30
5572a19K87m1l1N3k93J93J57j91n5j20K28K27m39K31j16O4j98J79m1j3PJ28K9
5595A26k04O0j4k38O1J25Q3K10j4n4j67l53L28j6n9J71k45L72o1k97K21l8R9k61
$$ plain form
5428 121 -353 -196 167 37 78 -216 -126 -61 -20 56 -14 -58 28 -159 -255 50 136 126 -125 -8 -28 -449 69 311
5452 311 -140 -40 207 -141 131 -231 116 -134 -138 116 183 -187 35 -156 -106 151 -43 -97 200 -129 1 201
5474 201 113 204 195 -73 75 63 66 -110 -107 227 -49 -164 256 70 147 279 81 -37 -6 -213 76 -39 -125 11
5498 11 41 124 80 37 110 -56 -41 16 -79 145 160 -99 -23 -15 -69 5 66 95 -70 -115 -59 -312 74 85 -129 23 132
5525 132 -11 -56 -75 -236 230 217 -156 221 -81 -61 208 -160 103 -59 1 -2 48 95 -67 0 43 -119 -367 -22
5549 -22 -160 -116 -8 22 -199 -107 296 -28 -85 4 -126 -271 81 44 51 -240 -113 -25 171 -301 49 211 -119
5572 -119 168 127 96 149 -144 49 206 15 -40 -160 68 295 -144 87 -29 35 -163 16 -25 -38 -31 97 126
5595 126 -78 -18 -32 -270 -209 -84 -1 209 195 141 -26 -379 -51 -67 -126 45 -200 172 111 -186 35 -3 96 -165
5619a65O1J63M5M2j41Oj73M35l34L7j9Q3J9o8j58J24J27Q6Q3n09L15kl1R2j77
5644e9mN8n5K8N9J3R6m15K05K42k27p4J85j50j0J59m5K00k57N3pj52M35l44J64
5669I8J7p8L9J70l48L96m59j08K41j20J4K21l0jo2P3M2j64J82M6l19j8J48l07
5693c27K67MO2p7P1J55Jjk57J82K2k77L56o3l28j34M35l01O9M31k29j12j63MM19
5718B09k43r3K02j50p6L32m02L15j26j5k22L52q2l3o1N6L22l10K31k13o8J78l62
5741b59J95J83l23K35O3o3L2j44Q0Q5k78L20j52J20j87J88q5j20Q0j08J98j8J29
5764A71k42J51k0j57J2J25m3J43n24L66P7k80L26J25k54Q3j87K6L30l46L85l59
5786i2J24R4k90N6J42n8p6J90k85K50k27o6K05k4j44P0K11j76K51o01M49q6O5
$$ plain form
5619 -165 -104 59 104 146 5 11 -162 273 -61 -24 -43 40 59 -9 -167 -43 84 170 253 -256 59 57 26 118 -59
5644 -59 -63 -5 -60 -32 27 40 136 -279 -74 168 -59 -133 52 -98 -108 51 6 206 -51 2 -5 -157 278 -66 98
5669 98 115 37 76 246 -102 294 -165 -273 -32 -152 -138 83 53 52 -10 63 105 -59 123 169 -150 -168 -20 -327
5693 -327 -60 -56 6 -71 0 155 156 155 -102 80 102 -175 181 118 -210 -344 91 -210 -141 290 61 -51 -214 -210 209
5718 209 -34 -127 75 -75 -151 181 -221 94 -32 -47 -269 83 1 -32 -93 -37 285 -25 206 -7 -75 103 -259
5741 -259 -64 119 -204 31 94 31 63 -81 -1 84 -194 126 -26 94 -93 95 10 -110 -30 -138 60 42 171
5764 171 -71 80 60 -97 -85 40 -3 140 -384 -18 59 -221 105 230 -24 59 -128 -102 228 -118 267 -92
5786 -92 32 126 -164 -108 34 -24 -100 90 -195 55 -172 -238 -33 -57 -201 -131 80 -96 155 -446 3 -83 -18
5809a8R7j47N3J4k40L04q8M8j54N0O7J06l80K07J09p9J55k47J41k90K86K21m15
5832b00L18J87l31k8J62k45J86%NJ93l35J01r5M8J37l11Q4K12pj4J12q8Jk64K00
5857B8k01J05kK83k86j08L66k84J09j03J30J35r6k5p1j60L38j60n6J39Q9j55O2
5880G7m29L71j41P5N3J00n6q1J66k51OJ36o2L3k24K88j75K74q8j0j74L0l1J5J51
5905E3j59J21k28L1K69k13K73l26R0R5J11l15N19l54L07l24j64J54J2j07J41l52
5927c66L64J79k21P5j18k9%kL07j88n1P3L3j60R9J45%J37l23N2j92J56J46pp4
5952C5K10l62K41k65K61k68M6L46j28j09K94l66L6N3j86J68j11n7K71k3j73K69
5974A82l38L87m08OL07k58O5K97l07J17Op8j38K31M5J28n48M18l1j10j12J51j91
$$ plain form
5809 -18 79 -68 -15 -1 -241 63 -25 23 -131 -81 -14 92 -288 -81 28 -51 104 -143 -2 -292 -6 215 -200
5832 -200 118 305 -26 -54 108 -137 49 49 54 247 -88 13 -82 -34 103 -208 -124 88 81 67 179 91 92 -172 28
5857 28 -173 -68 -70 213 -73 -181 185 -99 10 -93 37 172 76 51 -20 -180 158 -2 -58 81 170 15 77
5880 77 -352 19 -122 -47 6 106 50 -31 135 -116 -110 26 -36 -3 -227 61 -114 160 72 62 -112 -82 -113 -98 53
5905 53 -106 15 -213 -182 87 -126 147 -179 -89 6 117 -198 321 -33 274 -50 -214 -60 -48 -155 -14 -366
5927 -366 -2 177 -44 31 -87 -116 -116 -118 189 1 -50 23 56 -104 -5 140 140 277 -46 6 -186 -30 116 109 35
5952 35 245 -117 124 -141 120 -148 -102 244 116 7 301 -65 -29 24 -162 6 -105 -162 109 86 -87 182
5974 182 -156 231 -177 -171 136 -122 -57 240 -67 50 56 -22 -160 71 116 244 -304 114 83 -27 -139 12 -179
5997a79J89j22J72J12j29j60L33m05K09J3j57K09l40L9P8j2%J46n0k6q0J78J40
6020A58l18J62k4P1O5L0j16M2k17L54k80p5J11k0P7n9k46K54j78k1M17k37J3J40
6044A03j57k7Q9q0k4K09k22J03j9Q7j99J99j35N8J07J55m21K58J57m2M7m55Q9
6067a20M5R7k28J41R4j0J88m08J84o8j39L98r3K16j13j57J96j88l18L98k20J80
6089G5L2m7Q5j01o4O1j90K02l55J50K16K7k55L72M0l97J10k23J23J68j46L07k28
6112c8K8P9l47L62k94L20k34P3q1R1J10p6J09R2j55j38J47R8k11o9K63k77K03
6135E5k21m3L69j98j84K37j79M30l7k55P3k76J16K44j50J85k19j88J73R2k5jL3
6158C1p7mj4O9P9k54L78j99n3J55k90M43l12L14l45j45K72j74j29N21j86j73K27
$$ plain form
5997 -179 10 -112 60 172 43 -117 216 -189 20 33 -124 85 -255 -216 -138 -150 -150 -4 -54 -80 -160 18 158
6020 158 -160 2 -22 49 114 144 28 70 -147 207 -73 -148 -37 -57 20 -39 -285 -31 -209 -230 187 -50 -37 103
6044 103 -54 -81 8 -72 -96 113 -109 -6 -25 62 -137 62 -73 -15 92 247 -174 84 241 199 246 -209 -120
6067 -120 -75 22 -206 -65 29 19 207 -201 -17 -85 -224 174 81 297 184 27 223 35 -283 115 -105 75
6089 75 107 60 145 44 -20 41 -149 53 -302 -152 64 91 -164 208 248 -149 -39 -262 -139 29 -117 190 -38
6112 -38 -10 69 -278 84 -210 110 -124 -51 -132 -41 69 -7 102 194 39 -99 48 146 -65 -134 129 -148 55
6135 55 -166 -209 160 -38 -222 15 -164 266 229 -26 47 -229 -113 131 -19 166 -53 -241 -68 24 -1 -2 31
6158 31 -46 -50 -64 5 84 -170 208 9 -44 111 -179 264 -48 266 -79 -224 48 -126 -255 266 80 -93 134
6181A34l12K10l0q6Q9j00M1M1p7o2L18j82J25Oj96M31l01r1j9l47L93p2k8K76
6205A61m25J52L1P9o6K90k39r7J30j9j22p8p4M71l86J27L54l89J95j22o5J65j60
6228h7J20J32l77L09j30j1j07p3K75k08j5jJ48Q2P2l27J06J04j35J4J24J15r4
6251C6l66L07J42j54k8J77j22J37K75n46J25k4o1L2R3j68n9K72K03k55R1l1p0
6274FJ28k1j52J84L2l7j25j37K8J41j35K18k88K09R6Pk64J7n4J05K1M4l36K41
6298g2Q7m2j42J90K4j57K05p9q4J70k65L37k60r6L76j80R3k7j82R8o7k02M49k86
6322a12Q4n0K3Pkp2L52o30L15J16o4p3L98k78K58l29NK11m14L94q1l9j57j40M21
6347A43M9O3j89l2k60K47J2j95L49j51J10m3k18M07k21l59K96j1k9L64m11J31
$$ plain form
6181 134 -178 32 2 -84 5 -95 -54 -13 -90 -152 166 -16 109 115 -81 350 49 -42 -61 -408 -15 -87 -115 161
6205 161 -264 -112 -81 -2 -68 222 -17 -114 16 -3 -125 -203 -277 194 -192 -65 289 -100 95 -27 -92 73 -87
6228 -87 33 165 -212 97 -33 -44 -151 -224 51 -157 -172 -173 -25 57 129 -198 -92 12 -123 -109 15 130 36
6251 36 -330 -23 119 -35 -63 114 -8 129 404 -142 -17 -41 -102 -70 23 -145 -204 68 271 16 107 76 6
6274 6 134 113 -39 145 177 140 15 -122 -94 47 -88 130 -158 51 147 154 -110 -93 -147 -42 -21 23 -313 -72
6298 -72 15 -27 -169 21 45 -112 93 14 -70 100 -165 172 -88 -184 192 12 105 78 -104 -6 -73 -275 174 -112
6322 -112 -28 -78 -55 -48 -50 -122 230 -400 -85 31 -33 -106 292 14 272 -57 -52 159 -255 139 58 19 -138 -278 143
6347 143 192 255 66 34 -226 21 33 -162 187 36 146 103 -115 292 71 -288 8 -3 -32 332 -79 52
6369E2J47r6J64Q1l30K06r3k6r4l53K61J31n7j17J21m7Po4K74l68J14K35k02P7
6393B3K72l90K8K8j77M63n06K60J23j52J51M6l41L41l31l3J11NK65k28M4k9j26
6416a53K34r7l1j91J51M5J3K9J73j27j74J4J60L7k7J64k07J25m41K13K68j76m5
6439d3J57k11O3NO5k16K01J87m14J65Q7j6J2j9j61J7j25M54n2j74o7Qk7O7J17
6464H0o1Q9j4J4K15m15L34j29l56K28L4q2j79L10J6J07j72Q7k14K97N5l7n58M01
6488E0k12K36j1l11L51j23n4j67L8R5R1M6R9l1P5q1q9j5k04R2k37M99j73K44k71
6513f3o5N9M0Q7k45J10l2L3O1K27j82j23O5k43J82M4j7J55j21J07m0p3j48K37
6537E5k84L46n4k09J68r4K43m5p9j37Q4N0j0l64M36O4j22J5j42J88K0j37k15J90
$$ plain form
6369 52 199 103 267 348 18 224 131 105 11 -342 -81 50 -7 -124 -3 -50 -43 -107 167 -201 -87 148 -54 23
6393 23 295 -95 -67 -39 -216 247 -259 1 124 -28 123 169 -172 169 -162 -195 -84 -79 186 -42 2 -27 -153
6416 -153 81 -16 -47 -238 -87 -42 -29 0 173 46 -128 -114 46 83 56 220 13 138 -303 -90 178 2 -43
6439 -43 114 -97 -34 -29 36 -180 21 208 -206 -41 46 30 42 23 -138 -121 -246 208 156 -18 -85 -77 -104 -37 80
6464 80 19 108 94 108 323 -92 242 113 -243 -15 19 -63 -242 68 84 191 19 106 -108 189 244 207 -351 50
6488 50 -162 74 63 -248 103 -20 -74 -241 -203 -108 -17 29 128 97 172 91 2 -13 -217 -125 -362 137 -36 208 -63
6513 -63 -128 -69 -29 58 -187 -77 -109 -76 -15 212 30 -93 -28 -271 -89 -45 -62 93 -28 79 39 -34 -182 55
6537 55 -229 117 63 -146 22 -72 171 126 47 -90 -6 44 34 -330 106 170 48 63 -79 109 129 -8 -223 -33
6561c3N5j23K29o2M4J39p8J8k51J74j43r0J63j71J8L83m65L77k81O1P0q4R4k9
6585A5n1L0O4q9N7q7J55J54l53qo2L72L2m74J06L86j41l73K06L2J8j65m6M12m70
6610b80K37L5P5k5K6l90L49n6L51k33j35P5J02j91K66j11k21K68l77L51j18JJ18
6633A17l64N7J84R7q3o5K02k5o3j82K86q8l8l9m6K20j91j98L23k47p9K3j45L38
6657fO5l05K60K2k39Q8j11K88j01k45P1J22Q4N9m6J10KK4j45J98k32K48k48J29
6681I2J51k27p0J85k93O9K56o1m43K41J36j15J74j23J6j74L11j80L45r0k63R2
6703B9l37L08J70k58K92l75r4L68Jl28L29j23Qk50L29m5n3r5K33l11J70J68L2
6726A68r4q2j23qO6ML00l17M8P6o0O6j7O7ll82J63L75m12J84N4j44N4J1J25r1
$$ plain form
6561 -33 22 -101 128 66 110 249 171 189 -62 112 -31 -121 42 -129 -111 272 -193 184 -97 -36 34 -50 44 15
6585 15 -36 -6 58 -31 26 -61 94 248 -105 -113 -175 197 229 -245 -139 247 106 -267 -61 -29 -11 -176 -222 190 -280
6610 -280 -43 -8 67 42 68 -322 27 -29 322 89 -46 29 131 -60 206 95 -126 142 -235 116 -2 -1 117
6633 117 -247 -190 -6 91 8 -57 145 120 57 -125 161 73 35 -4 -50 170 -21 -219 104 -143 -222 -199 -344 -6
6657 -6 59 -246 14 36 -203 -115 -226 62 -39 -284 -213 -91 -7 52 6 116 118 142 -3 195 -37 211 -37 92
6681 92 243 16 -54 131 -162 -93 163 102 -341 -100 36 -79 95 -28 -12 -186 125 -55 290 200 -63 29
6703 29 -308 0 170 -88 204 -171 -265 103 104 -224 105 -18 -10 -260 69 24 -29 -124 109 -202 -32 136 168
6726 168 74 -8 -131 -139 -73 -69 231 -86 -38 38 -22 44 27 94 91 -291 -128 247 -165 19 73 -71 -17 -6 119 28
6752B8j75N15l56k33J96j24K23j47r3Q6J22p1K32j21j29J15m9L80l96j94L93m70
6774b68n9J99l9L34r2j60O9l1P1O5l26J91lJ5K11j75J78j63J10j97k9J19J0Nj97
6799a62L79m07K96j41m8K30l63M06k60R6J4K05k5j51N0k53K08J3R7k27n9P6o7
6822i3j0J19k20J36L0J4p6N2pK12o8j81O1j11N0K76j3m0j73P5q5r5N9K49j96J16
6848H1n4k01K18J4k80L19k59N9Q4M4K7l4Q8K5j95j50M60l49J6M6N2J17n2m6j43
6873a13K0K91j7j95q7K8OP6j33P2Q9k33J96P0k8j1O2n7O5k76K74k01k7J66l04
6898b67K63q0rj04J69N4M7Q9m06J49r8L26l28L16k6k35K46k17K8O7l0K43l83J30
6922e6K55k62M4k37K49k7q6L80m03K66j52q3M31k04q9J1n9j8P9J04k17j86L03
$$ plain form
6752 28 -147 368 12 -221 -25 -149 74 -73 -166 -80 42 -29 203 82 -47 68 19 399 3 -191 202 -268
6774 -268 -327 -128 -167 167 75 -85 -16 -47 24 89 -237 -46 -49 -34 177 2 180 17 127 -70 -99 20 30 35 -162
6799 -162 217 -190 106 -35 -83 147 -216 190 -70 26 40 245 220 69 119 -134 74 87 184 -43 -102 -26 -93
6822 -93 -103 16 -204 -68 -38 -24 -100 -48 -55 157 89 -92 -31 -142 -92 184 171 131 -42 33 -52 -147 -88 161 -35 81
6848 81 27 -174 44 58 -222 97 -162 -103 -19 25 52 18 106 131 -64 -214 246 -103 -87 -41 11 128 76 30 -113
6873 -113 -93 198 181 -14 -101 -73 -67 9 -124 -52 37 -196 0 70 42 31 93 36 101 -175 99 -102 -129 37 -267
6898 -267 -4 -84 -93 -197 -28 26 73 162 -244 -95 -193 133 -195 121 95 -140 106 -111 -83 -16 -46 197 -186 -56
6922 -56 199 -63 -19 -256 -7 -34 -120 260 -143 123 -29 -112 319 115 26 37 -22 -40 39 143 -74 -260 43
6945D3P6k21J79k37J70L07n26P6K71k35R8k6k35L14o4o9P7J45o4J00k28J43j53
6968e9k63L14J76k9l01L28j80J1K64k03j05K0J46j0m2k02kJ69j42L27k79J06m
6991D0l04J13J45j42J28m1J15J05j96j12K16n6o4L29l85K71r5k61J75O0j01J93
7013A33j20k06K04Kk2n3J3JJ73Jk28mK00k13K05m97N01j34M8L8j23K9N4K48l84
7038a34J58K11k59j2o1K10M7k11k0k8K19j31J9L8N4O1o3j39j90K23r4Q1J80k14
7062e5R0m8l34L59p9Q9p6L50l61J64k66J90j20M6J26l05K52m24K66L86l40J10
7084B0j28k39J74L5m8K01J5K05k31J04j49q4J15k4k0j76N1K30L8j68RJ13P5k47
7108a29J91J00k99L01j23j58J07k54M33J22n83L04o2K76m71L36L6l09J54nk6P9
$$ plain form
6945 43 119 -102 77 -160 10 317 -209 -133 138 -97 1 -25 -260 54 -10 -79 -2 143 79 179 -49 94 -59
6968 -59 -322 -8 168 139 -162 166 -14 -3 261 58 -47 -27 119 109 67 -135 -137 32 -110 217 -62 44 40
6991 40 -264 -151 -6 -148 -20 -61 54 159 -37 -149 67 11 -53 276 -109 162 67 -194 -19 41 -60 133
7013 133 13 -193 11 13 -9 -62 -49 -48 125 126 -102 -106 94 -119 86 -411 90 -44 4 42 -81 -52 2 250 -134
7038 -134 24 235 -24 -36 -97 113 160 -51 -71 -99 120 -11 8 46 100 161 98 -41 -231 -8 -102 -21 159 -55
7062 -55 35 -13 -347 12 -67 22 -54 296 -65 99 -167 23 -97 -51 75 -230 22 -402 -136 250 -90 20
7084 20 -108 -347 -173 -138 -186 15 30 235 4 108 -41 -125 -10 -34 -54 -230 -179 51 89 -79 -70 43 118 -129
7108 -129 62 162 -137 164 41 -117 -10 -264 169 291 -292 12 -50 226 -245 91 127 -182 -28 -33 -59 20
7130B0J86k73k12M82l13K81j5k13M9j89K16j7J8l1M4nJ8k1N9n4Q3o6j07J62P6
7155A78j06n4J3k27J31l9P7n5j16o8J48OQ1L01j57k22lK58k74K24K9n3l8o6j80
7180b12K34J97k98L01K56l85J49k41k86J92J65o7L39k36j50J39l62K80j65J78
7200B8k86K70M5K2O3P4k12K6M6k22K75J4M0k09n5P6R5j37P1p7k6J19j29l3l3N9
7226i6m5L95l03J50k30k40K53j27J37K64k52k37L11j45K53J5l17J66N9o3J77j95
7248g0J42p6R1j10P8k19M45k58J31o3l69J79k3P8o7J46K4r2l2M07k32j96K45k26
7272f7M2r8L25j7j17k60K95k1k58K58k91M30k49j3K26k60Q5Q2n9K64j72l15K61
7295G1k0l16J41K00J7l81K90q1NON4K54m80J02j35K83j53L7j29L04m4l0k90L36
$$ plain form
7130 20 206 -67 -279 203 -110 171 156 -57 -8 -197 19 2 20 -11 33 28 46 25 84 30 113 47 -60 102 178
7155 178 72 18 31 -196 -65 -104 -27 -82 -198 -266 -118 -112 -31 270 113 -109 -112 146 -128 96 125 72 34 -32 -212
7180 -212 22 219 -79 222 478 93 242 1 -285 -93 72 5 344 108 -42 97 -265 15 -150 28
7200 28 -258 12 57 79 142 216 4 30 76 -146 129 143 183 -26 -81 -5 90 -47 24 -53 -79 40 -89 -122 -155 -96
7226 -96 -141 254 -49 101 -129 -369 -116 -243 -106 158 -94 -331 -20 -165 88 103 -214 -48 11 -52 125 -70
7248 -70 72 -4 87 -23 55 -164 281 23 154 91 -278 -99 -122 -44 -111 35 59 -33 -65 342 110 -86 159 -67
7272 -67 -25 -123 202 185 68 -192 103 82 -176 82 -209 221 -28 -41 185 -75 10 92 33 297 125 -190 71
7295 71 51 -265 -124 76 93 -288 2 -79 -74 -68 -14 240 -240 -138 -273 10 -143 -106 -235 69 25 -5 -295 41
7319D1r0oO6j65k6J73q7L32j07k25J43k39j01L14j37l1J80k64K90r1m7J74j10
7342a3j00N4Q4L8P6Nk81pJ37j70J2J84j6K1J20l93J50K94k75J55M9q6P0O8k42
7367f6J05j66oK29p1k28K89O8j17k20O8J50k38J03J25j74K43j9l4Q2n3j89j42
7390b61J91J83o3O6N2l81J34n2O3Q1Ql01M33k38J83j62k19L19N2j67L3J13j93
7413a26j08j25M58k39K06r8o5R3K65n22K58j11O6M7j44J76pj21q5K55o2R3m6r0
7437c2O0l3J94k88j53M28l72J57J91k91K41l16MK82k91J57J39M4J43k62j50K50
7459A02j4k16k7K56k84J21M6M08l81o9L8J40n0j5j29J50j68J81j30r6k1J02r0
7482a46J44k7M6K5j87L83k31J25j24M0k68L28o7N5O6l13J81j99JJ14l6k2O6j05
$$ plain form
7319 41 -49 -55 11 -154 -180 -7 -94 238 131 -94 49 -190 -291 23 -114 -145 35 -229 61 -30 -77 97 -13
7342 -13 -113 -59 25 63 139 144 -137 -144 -7 -177 -165 19 3 24 144 -249 -99 195 -80 75 124 38 108 176 -66
7367 -66 39 -127 -133 96 25 -203 86 154 37 -183 -115 35 -203 -100 25 -149 94 75 41 123 70 -119 -261
7390 -261 -70 113 50 116 168 -213 -79 -131 -68 13 21 -280 153 -85 98 -64 -283 36 88 -79 -46 67 -126
7413 -126 -234 -359 99 -140 66 -32 -97 -4 261 -261 -3 -114 -48 -1 -145 31 24 -97 -182 73 11 104 58 -32
7437 -32 28 -5 189 -99 -252 176 -196 -39 152 -139 102 -214 -210 72 -219 -62 77 121 264 2 -148 102
7459 102 88 -128 -155 101 -183 -62 -16 392 11 -58 -20 120 70 55 -74 76 -92 89 -41 -137 -158 -56 -146
7482 -146 -2 -29 17 42 -145 238 7 132 8 48 -220 108 41 96 162 -151 30 -169 -168 -54 -90 -112 -46 -151
7506a51J03N4j04J49K56l86jk7Q7Q7K04l16K0R7J64j47k34k47L06Q9L01k56r5
7529d7L14p7j68Q3o0p6K14J54p2j55J56k88R6n5j23J49nJ70r4p9k19K55m9Q4P
7554A15j45J95j59J67k98M45j71k71j21N12j02q3k15k3J06J13k02M9J43o8R7J
7576H5j79K21Q6l59%P3P1l1p0J21j24J3R3j5k7j9J38p9m7N7J8kj98O8K00k49P4
7603h1J07k8l97N78k26N6l3k38J35j00k2L50j11j03J72j50O6K02l08j1K76j14
7625B0M3k6j0n0j7J36j62J17Q2j65k40J20J22k57L79j98J97o2o6j2Q6K6J05k28
7649f0J73j00o8K25n6j56J13j77M7N1J6J94j90K22j33l02J12P1l8J07j33L00M
7672B22q8L6j36j47K52q0L8j00J36l00K66J40k35J4O0L7j12k22K39j76L44j09
$$ plain form
7506 -151 -48 6 -98 51 307 -79 -80 -107 -20 67 271 -45 -25 72 236 89 -145 -392 -86 3 304 48 -47
7529 -47 267 190 22 105 45 -31 183 337 265 110 266 -22 74 19 -104 45 40 210 116 37 -182 73 24 108 115
7554 115 -30 165 6 173 -125 320 149 -122 -243 269 167 84 -131 -154 -48 65 -137 -88 55 -13 84 85
7576 85 -94 127 213 -146 -146 -73 -2 -33 -103 18 -106 -93 0 -15 -42 -61 77 -2 -49 8 26 24 -174 -106 94 -155 -81
7603 -81 26 -2 -399 179 -47 9 -24 -262 -127 -227 -249 101 -10 -113 59 -91 -25 177 -131 -142 134 20
7625 20 63 37 27 -23 -40 96 -66 51 133 -32 -272 -152 -30 -287 92 -106 91 29 -37 -49 37 63 168 -60
7649 -60 113 13 -55 170 114 -42 71 -106 -59 -8 8 202 12 234 101 -201 -89 -18 -56 51 -82 218 222
7672 222 134 170 34 -113 139 59 97 -3 133 -167 99 239 4 18 78 115 3 -219 20 -156 188 79
7694G9l54N60l02M2j31k83L25K9R7lj90Q8L9P4p0j98J45O3j52J99l3j89J54j95
7718b06N5J15j04Q3j46k78M83o5R4J32k54M4j6OK33m03K55L22l13k03J65j69J29
7741d1J63k93J3L26m43J34K20J40j71j07KP3J20j24K92n66L04k52K05J00n2J14
7763A57r1k00qK72Lk13J29r1o7q5K73k83L86k22k0j29J05l5J01q8q5K23j7j33
7787a18R2N5K58l27l1K2j64J16M2J0J29J6j14J55l8l14J06K4j25R4O8J09r7K6
7811fN5j41J44L24l34J42j76r2L66m82K11J8PM7j01O6n1N8J5j57r2L59p3j68M0
7836b1K99k79Q2k58J46K8R4k32M2K29O7j81L2J1l2k05J84n4L35m01J87j00J15
7859H8M40n48r4N14l01k01j5N4K55k85J08j73mK9K22J62j34l76L93p5j08r5j64
$$ plain form
7694 79 -275 285 -17 25 -106 -389 -64 -35 62 59 -131 -43 -4 70 0 -198 -53 10 -142 57 24 -165 -11 -206
7718 -206 -151 -36 -140 -57 -203 -481 2 -63 31 163 -91 -47 -63 -57 176 -227 28 350 37 -166 -1 -170 -41
7741 -41 122 -171 -158 168 -275 -141 79 219 48 -59 -57 16 136 12 304 -262 42 -210 -5 95 43 157
7763 157 66 -134 -142 130 133 -80 49 -42 -109 -194 79 -204 182 -40 -60 -189 -84 -119 -18 -106 -191 32 15 -118
7787 -118 -26 29 287 -40 -71 -49 -213 -97 -55 -45 84 100 -14 141 103 -211 -105 -81 -206 -112 -44 65 -32 -6
7811 -6 49 -92 52 376 42 184 8 -84 282 -200 11 29 36 83 -18 48 -3 55 70 -87 -179 180 107 -61 -21
7836 -21 278 -1 81 -177 -31 -3 91 -141 -99 130 197 16 48 59 27 -178 6 -48 287 -114 73 -27 88
7859 88 528 -20 -114 400 99 -102 -117 -63 192 -93 15 -158 -162 -133 89 251 117 -259 134 59 -49 -144 -308
7882c08J96J75j82k6K14j23n6rJ94l30J76K31j18k15lK74j46J26j62R6K38l58
7904a16J97N5j33L6o7k12J65Mj84L55L0j34L3l2P8k2k28K62L9k33J24J50j43j29
7928a05O3K22j94mJ37K28n21J96k15J41j01J99Q5j77L5r3j3N6K74j28j41K86l29
7951i9n1n9K60n1K3n3m2o9j11R8P8L8j87K06P1p1M6K1J01l5k16K10k2L1Jl46K97
7978F9o2L7k6J73k25o5rQ5P0j07J10j7n1K07k95RJ82k75L54k86M9K56n2k38J57
8003E0l0P5k10K39j16JJ91k77l0J5L6j06J33p6J68oo5j02K26l0j77L1R4P6k86
8028a76J70j38k3K69j66l4K09J7m08K57K6J30k76L6K78k97J71k31L11j03n6J24
8050I0j03j29%M20m06q4L53m06L05l7j70L07j30J91j27l94M15j44J21j42O5K55
$$ plain form
7882 -308 -112 63 -119 -145 69 -54 -110 -119 75 -255 -79 152 34 -181 -184 90 -56 70 -92 4 242 -116
7904 -116 81 136 3 39 -28 -240 -75 -71 -255 100 130 -4 29 -3 75 53 -175 87 126 -107 17 167 24 -105
7928 -105 -42 180 -14 -18 119 347 -174 22 -193 -52 -153 46 131 -46 -11 -104 -117 -61 213 85 -56 230 -99
7951 -99 -150 -209 51 0 23 -30 -72 -141 -252 -154 -76 -38 -225 -19 52 -19 27 48 149 114 -102 108 86 117 118 -228 69
7978 69 7 44 18 191 -34 -99 -108 -23 47 -60 50 33 -18 189 -106 -97 85 -190 164 -122 -73 183 131 -107 50
8003 50 20 95 -115 124 8 9 200 -77 -107 -92 -56 -162 -29 -105 63 57 -8 -110 116 86 -91 -60 34 110 -176
8028 -176 -6 -144 -167 102 -64 -98 111 128 -280 -23 3 133 -143 -107 171 -126 45 -186 125 22 -34 90
8050 90 -13 -142 -142 278 -128 -212 141 -265 40 3 -167 140 10 201 74 -320 95 -49 72 -70 -5 250
8072B50l62j47K36R0J05j26j51N3J10r5M00l73P8j10p2K80O2p1j90J75o9j46K05
8095A32k63k8J81j32J88K8o0r1k7L14l99K36m7j14K00j14j28J43K4k19J22M9o6
8118g1j26L72L1l95j17L14J5m5J31j06j72P5p2K47j28J08r9J06Kk2J8j54lk5J15
8143aJ82l60j08M39k69j12R0L82j78J58r2k25o4k8jL05k80J03J42m9l2j12J71
8166F1k16QJ55J15j85P7l8J61k08K82o1r3j63M25k46k12K04j86J76k08M07l46
8188i1R9l8m3
$$ plain form
8072 250 -112 -259 -23 67 172 46 -105 -52 58 -37 363 -10 68 -42 -114 166 228 157 -33 142 73 -73 132
8095 132 -131 -159 22 -110 78 106 46 -45 -72 242 -157 79 32 -82 118 4 -124 19 43 -176 -54 -5 -71
8118 -71 -197 175 206 -189 -306 8 23 -22 109 3 -169 -94 -166 81 -47 61 -38 68 70 48 66 -88 -91 -116 -1
8143 -1 181 -179 -287 152 -117 -229 -139 243 65 223 131 -94 -158 -186 -187 118 -162 -59 83 34 2 -110 61
8166 61 -155 -147 8 123 -62 15 -23 138 -70 212 151 58 -105 320 74 -138 66 -120 56 -152 255 -91
8188 -91 8 -30 -73
8191g3
$$ Imaginary data points
##PAGE= N=2
##DATA TABLE= (X++(I..I)), XYDATA
0@%%%%%%%%%%%%%%%%%%%%%qJ6j6J6j6J6j6K3l1L2l3M0m7M9n6O4p2Q0q8J00j10
42e7J21j36J51j66J83k01K22k43K67k96L25l59L98m40M87n44O12o88P80q97J044
63E63j233J495j879K489l622O370k4640k7137O1822J9433j9645k8706N336L6853
77B7499n057k0838j92p760K3967J2514l3214j4084J1029K2158O78m4504M609L9659
91A6464m045j6451j3248P949K3540j3296r690J596m790K3563K911k7333J411J0991
105d28J2828n734k7560J3241J8634o374r17j4928N55K3362o161j1556p524N173
119g389K8603j1404k5018J2748J2209O290j0685j7427J7776Q416n646k31j8251
132a0009N160K1093j1906j5876o041J4664J9107k6555j4971K1410N181j800r591
$$ plain form
0 0 0 0 0 0 0 0 0 0 0 0 0 0 0 0 0 0 0 0 0 0 0 -8 8 -8 8 -8 8 -8 15 -16 16 -17 23 -24 25 -31 33 -39 41 -47 53 -57
42 -57 64 -72 79 -87 96 -105 117 -126 141 -155 170 -189 209 -231 256 -288 324 -364 416 -481 563
63 563 -670 825 -1054 1435 -2187 4183 -20457 -47594 14228 33661 14016 -14690 -9354 27499
77 27499 22442 1604 1412 -6348 17619 30133 -3081 -17165 -6136 16022 16700 -27804 -23195 16464
91 16464 12419 -4032 -17280 -9331 14209 913 -8777 -7181 -11971 11592 14503 -12830 -11419 -428
105 -428 12400 6666 -20894 -7653 10981 4607 3690 -11238 -10683 12679 6518 -5038 -12562 -7389
119 -7389 21214 9810 -15208 -2460 9749 16039 5354 -12073 5703 14119 8473 8242 -10009
132 -10009 -4849 16244 4338 -11538 -17579 -2915 16192 -10363 -25334 -3924 1257 -543 -10134
145a0134n120J8725J944k659Q07j2794J3328J4134j5509o898J058J4107P732k5326
159f605j825J6976m002k615p632k000J3513l693l4j962j0541J4783M242j5653
173g048J060J808R274K504j6181N652O737n157M223q546k109J1531l092K225m132
188a251p815J5279j674j1681L194j190Q631K393j1402O059J606O5P106j3650j048
203e378J3108p92q26q501k41J5357q812r666K744j973R003k747j1565P273J678
218a338K173J101j3471N902J1014m941p32m948N491J1175j2386k425M811k709
232a283O960m024o580P082j201L345j250j1702R434M528n631J643n971M828P758
247G936r983K33k48j098R680o945o227O406m4N671n547r769J2854K499n587M45
$$ plain form
145 -10134 -15254 3471 5415 2756 3563 -9231 4097 18231 2722 -4176 -3118 10989 18721 -6605
159 -6605 -8430 8546 4544 1929 -5703 -7703 5810 2117 2083 121 -10420 4363 8605 -7048
173 -7048 -5988 -4180 5094 7598 -8583 -2931 3806 -1351 2872 -5674 -7783 3748 656 2881 -1251
188 -1251 -9066 6213 4539 -7142 -3948 -5138 3493 5886 -5516 543 2149 2214 9320 -4330 -5378
203 -5378 7730 6938 6112 -2389 -2630 12727 3915 -5751 -3007 -4980 4023 1276 -10289 -3016 -1338
218 -1338 835 1936 -11535 -5633 5381 440 -292 -5240 251 11426 -960 -3385 1426 -1283
232 -1283 5677 1653 -4927 2155 954 4299 3049 -8653 781 5309 -322 1321 -4650 178 7936
247 7936 -2047 -1814 -2062 -3160 6520 -425 -6652 -246 -290 5381 -166 -9935 2919 5418 -169 276
263B76n667Q370M397j0511R37j116L359P508j1999j685Q594m89K148q097l403
278g378J3122k129m197J08k911R357p24r689L140j339M031L779j1696K725P056
293C255j796J360q223J004J0042n366q25k21k598J0110k831q077L220j396N876
308C534k81j0776O634M668j437Q63q871M179P921p296J95j722K76R513o316n874
324d790L418r29N529m444q199R747J444j281M76o789O292N075o883J667k506K895
340G22Q165q422k062L397j028N052o710n539R192r08l56j385o413Q334J478o660
356c143J602l262N519N232j0139R75L485j90L563p713j161Q467k374Q89k630m025
372d905R781j740n003J776k540O145J400q881L226J408L6K904q462K250O525l408
$$ plain form
263 276 -5391 2979 7376 -3135 -2198 -3314 45 7553 -4446 -6131 2463 1974 4122 -3975 -7378
278 -7378 5744 3615 -582 -474 -3385 5972 5248 -4441 -1301 -2640 1391 5170 -6526 -3801 3255
293 3255 1459 2819 -5404 -4400 5642 276 -549 -770 -3368 6742 3911 -4166 -946 -2342 3534
308 3534 3253 -7523 -889 3779 2342 3205 -5666 -1487 6434 -862 -667 -2389 -2113 7400 1084 -4790
324 -4790 -1372 -2301 3228 -1216 -9415 332 1776 495 971 -5818 474 5549 -1334 333 -2173 722
340 722 8887 465 -1597 1800 772 5824 -886 -6425 2767 1859 1503 118 -6295 2039 3517 -3143
356 -3143 -1541 -4803 716 5948 -4191 -3216 269 79 3642 -4071 -5232 3235 861 1750 -880 -4905
372 -4905 4876 3136 -1867 -91 -2631 3514 4914 -3967 -741 667 703 3607 -4855 -2605 3920 512
388E12K251l931k142Q947l257l722J155k127O959j530p776L831o82J566J115r080
404g911M115M903k762J718m872J578Q141n213j618J398l37P813m105n396N732
419C184j085K020j073p610N958K165k730J357n334L112M974o903J24o83q5O735
435D126n630k812M604j696L191k645n836O996K39q52J548n608N613L643o048N42
451f25k001K302N642p374o09L955o96L684n350l969Q048j193q05l2l699P032Q06
468E116n422J438k576L251L326q122P84K616p65K972o986j717P317k690j46j762
484c366k087Q046j322l941K299k216M997J790p445K884K519L63K315p841J571
499a434O753l341k67l177j55P908m998l584K220j925N064j561o363M110N00J349
$$ plain form
388 512 2763 -1168 -3310 5637 2380 -1342 -187 -2314 4645 3115 -4661 -830 -1512 54 1169 -7911
404 -7911 -3796 1107 -1655 63 -4809 -3231 4910 -303 -1921 -523 -860 6953 2848 -2548 3184
419 3184 2099 4119 3046 -4564 1394 3559 829 2186 -3148 -36 4938 -1965 -1841 -2524 -2609 4126
435 4126 -1504 -4316 288 -1408 1783 -862 -6698 298 537 -315 1233 -4375 1238 4881 -1167 -625
451 -625 -2626 -324 5318 -2056 -2665 1290 594 4278 -1072 -5041 3007 1814 1009 977 -2722 4310 5116
468 5116 -306 1132 -1444 1807 5133 -2989 -2205 411 -354 2618 -4368 -6085 1232 -1458 -1604 -3366
484 -3366 -5453 2593 1271 -2670 -371 -2587 2410 4200 -3245 -361 2158 2521 4836 -3005 -1434
499 -1434 5319 1978 1711 -1466 -1621 6287 1289 -2295 -75 -2000 3064 1503 -4860 -750 -250 1099
515A099M74q019M600M883l815M09k807K086O202o015j613J916n57M750l967m075
531d449N652j017J672p44o544N846K905l308N27l400M489N212p246j98J303K72
547I72M267o506j763N581j947J335k472n009O733o38k803K58l148O336K514p509
563c799J544J397J545K286p306J602N984k234J230l501q49O499l356j852J077
578B67k352N859j33n914K789j01J823N70p395L632L208k522J085l720J409N057
594C562n007j77Q35j155N075k584l700L652j032K359o20o354M956J854j929N69
610C04l941L458M025n504Q85M9K43M661m514j279M062k229K550j888m694N673
626A861K84k007L72l771M592J485n727K313o21O68L631n601O95L277k242K416
$$ plain form
515 1099 1573 -6446 -1846 3037 -778 -369 -3176 -1090 5112 -903 -2516 -600 -1157 3593 -374 -4449
531 -4449 1203 186 1858 1114 -5430 416 3321 13 540 -2860 1629 6841 -405 -603 700 972
547 972 5239 -1267 -3030 2551 604 1939 -533 -5542 1191 553 -2250 -1992 -5140 1196 3710 -3799
563 -3799 -2255 -858 687 2973 -4333 -2731 3253 1019 2249 -1252 -2101 4398 1042 -810 267
578 267 -2085 3774 3641 -2273 516 415 2238 2808 -4587 -955 2253 -269 816 -2904 -1495 3562
594 3562 -1445 -1622 -787 -1942 3133 549 -3151 501 -531 1828 1208 -5146 -190 1664 -265 304
610 304 -3637 -179 3846 -1658 -773 -724 -481 4180 -334 -1613 2449 220 2770 882 -3812 1861
626 1861 2145 138 510 -3261 1331 2816 -2911 -598 -1219 -551 3080 -2521 -1826 1451 -791 1625
642A625l171j809N538k048n02O48l054N324m36m350K493j101J951J945n389K732
658C96J598k035K011m004K55M635l613O81K70k370M754j965k778K517k349L275
674A278P97m985L509N86j362J991m699K006L365l954J907j245o31M434l296j326
690a625K137k503M172j131l887M223m29j91R26m714L430J580l512J955j913M04
706a078M398m468l3J482j351L611k774k451M349j507N61k1l856M111N14k913K240
723H14k703J764K969m785J494P27r68L485m058n23L862k309J535q95l091M430
739A748j227j541J830l327L272J273m171K049l79L0K838m772J139L161k231J827
755A519k045j618M517k179p77R33k631M412l17m085K921r67J057J559m620K043
$$ plain form
642 1625 -1546 -3355 2183 135 -367 281 -2773 2551 2115 -2235 258 -843 1108 3053 -2336 396
658 396 1994 -41 1970 -2034 -1779 2856 -757 -76 194 -2176 2578 613 -2165 352 -1997 1278
674 1278 2075 -2910 599 1185 -177 1814 -2885 -879 2486 -1468 439 -806 -1437 2997 -299 -1625
690 -1625 512 -1991 2181 1050 -2837 1386 957 766 1692 -3022 408 1988 -1524 431 -1482 -1078
706 -1078 3320 -1148 -1181 301 -1050 2561 -213 -2664 1685 178 739 718 -3138 973 1487 -1426 814
723 814 -1889 -125 2844 -1941 -447 280 -688 2797 -1261 -1784 2078 -231 1304 409 -2682 1748
739 1748 521 -1020 810 -2517 755 2028 -2143 -94 -473 -443 2395 -2377 -1238 1923 -308 1519
755 1519 -526 -2144 2373 194 -583 350 -2281 2131 1814 -2271 650 -317 740 2299 -2321 -278
771b78K201k017J821l506K06M083l377J39o9j505M684k434k376L202j605J662
787H31K36m163L968M33j390J861l732J742L120m145J027R2p10L681l244q38K642
804A411k312K522j011l137L982q56p67J629l661K670J541l639J475j170P04L239
820B620m434N18K260k130K548k098k108M176j545N6O07k979L919j62l127K398
836E19j500J448K343m540K297Q61j405K471l231j75L417k592O08j52k396L915
852A888j434k369K173k193K148Q05l920K600N4n77K157l818J613K838k880J612
868F97j120r15M025k852o30J535k002K906n92l107L493j348O3J583m025K444J567
885A722k747K005j806J80L079l475K97R95j474L206k108j917L369j822P07M08
$$ plain form
771 -278 1923 -94 1727 -1779 -1573 2510 -867 -728 -797 -2302 2382 -52 -2428 774 -831 831
787 831 1067 -3096 872 1305 -85 1776 -1956 -214 2906 -1239 -212 -120 -830 2851 -393 -1231 1411
804 1411 -901 1621 610 -2527 1455 599 -168 1461 -2200 470 2011 -1628 -153 -1323 -619 2620
820 2620 -1814 -1296 964 -1166 1382 -716 -2824 1352 -193 -137 470 -2509 1410 1248 -1879 519
836 519 -981 467 2810 -1730 567 1428 23 2494 -737 -912 2505 -87 521 369 -2027 1888
852 1888 454 -1915 258 -1935 213 1018 -2902 -302 -248 -825 1332 -2486 -873 1965 -915 697
868 697 -423 -1338 2687 -165 -795 740 -1262 1644 1052 -2055 1438 90 153 1736 -2289 155 1722
885 1722 -1025 980 -826 -646 2433 -1042 -745 250 -1224 1982 -126 -2043 1326 -496 211 619
901F19l311L128K82j933J776k164J415K118l896J783P7j163L350k659n82K874
917A714k020J724n37k584L822j227j221K003l234K752Q30l748J953r92r0K368
933A513l395O70K185k391K295j827j268L805k141j26J191k175K921k45k466K410
949I56j721J087J623m015K024J338j913J971k244l9K776k479N25O12k294L906
965B113j932j657K759k232J599O08l042K402L11j199J790k970J251K045l222J460
981H4p91q20L148k412m25J701j886K274o02k368L092r64K39J180l193K266J453
998A976k866K082j572J73K659l553O98J058j727K401j752j576L023j599M67O95
1014E87k896L397l06k213K157j653R45J763l282J551M72j577K649k500n17L170
$$ plain form
901 619 -2692 436 718 -1215 561 -1603 -188 1930 -1966 -183 -106 -1269 2081 -578 -1160 1714
917 1714 -306 1418 881 -1703 2119 892 -329 1674 -1560 1192 2022 -1726 227 -765 -855 1513
933 1513 -1882 -1212 973 -1418 877 -950 -2218 1587 -554 -680 511 -1664 1257 1012 -1454 956
949 956 -765 322 1945 -2070 -46 1292 -621 1350 -894 -933 1843 -636 -111 501 -1793 2113
965 2113 181 -1476 1283 -949 650 1258 -1784 618 929 -270 1520 -1450 -199 1846 -1376 84
981 84 -707 -1527 1621 -791 -1216 485 -1401 873 271 -2097 995 31 270 1450 -1743 523 1976
998 1976 -890 1192 -380 -207 2452 -1101 -403 655 -1072 1329 -423 -1999 1024 -575 -108 587
1014 587 -2309 1088 782 -1431 726 -927 18 1781 -1501 50 522 -1055 1594 -906 -1423 1747
1030A747k069R09N1k437L355j360j217J596j840J791Q95l351K384j65p71J968
1046A486k915R69K028k322J588r28j156L284k351l47J463k162K324m06k747L053
1062H61r87k6J109l034K100J224k387K231j854M7K661k644M92Q10j545K575j425
1079B08j977K825j299O64J91k539K785q1k050K440k128Q05J786l019J512k97p89
1096i63K676k553j60K360k116J480n51j800K989r66r10J318j733J829L92k357
1112a065J747p33m23J945k698M79J484j782J440r09j087K908k145K54J304k194
1128a475K681m03k274K321j159Q3J637k850J708R82j875K151k187r5K370k320
1144g05Q91J23j715K838j514j306K268j671Q85O92k590K617n00r41J795k127Q65
$$ plain form
1030 1747 -322 587 638 -1799 1556 196 -1021 575 -1265 526 1421 -1930 454 289 -482 1486
1046 1486 -1429 -460 1568 -754 834 -94 -1250 2034 -317 -664 799 -1363 961 555 -2192 861
1062 861 -126 -152 957 -2077 23 1247 -1140 1091 -763 -716 1945 -699 -207 603 -942 1633 208
1079 208 -1769 1056 -243 421 612 -1927 858 777 -1273 1167 -961 -156 1630 -1389 123 -174 -963
1096 -963 1713 -840 -1000 1360 -756 724 173 -1627 1362 396 -514 804 -929 900 1292 -1065
1112 -1065 682 -51 -474 1471 -1227 -748 736 -1046 394 -515 -1602 1306 -839 -585 719 -1475
1128 -1475 1206 803 -1471 850 -309 -226 1411 -1439 269 1251 -624 1527 -660 -755 1615 -705
1144 -705 186 309 -1406 1432 -82 -1388 880 -791 94 786 -1804 813 313 -628 1167 -960 -95
1161i5J706k439J348m57r46K725k232k95J063j465J653l57k202K780j270j04J361
1178G74k524K155P27k178K158j355J88K213k838P48J061j727J980j531r65K356
1194A242j756J62P50k357K369k25j768K052j617O93J885l085J640M03j210K351
1210A529k128k0K239k134J508k20j822L017j588r69J412j803J532R3k244K049
1226D51p98m01K012k565O87J824k043J657p27q60K702j955j12J122k095K129n50
1243D78j869K242j267RJ056k618J826M55j438J954j889L08K128k448J033R02j714
1260h52K392j017r25J955j676J064R3k061J903k27j288J547k005Q89J083k535
1276a660J533j97p13J788j660m5J572j404J637n59j592K589j110j41J151k059
$$ plain form
1161 -95 1611 -828 520 63 -883 1842 -390 -685 378 -1087 566 209 -1993 787 -483 -587 774
1178 774 -1750 405 1132 -1046 1112 -243 -55 2158 -680 68 1129 -598 1382 -149 -1114 1242
1194 1242 -514 -352 398 -1959 410 185 -1583 469 -1148 -455 1430 -1655 -15 388 -822 1529
1210 1529 -599 -619 1620 -514 994 774 -1048 1969 381 -588 824 -979 553 646 -1598 451
1226 451 -347 -748 1264 -1301 -614 1210 -833 824 97 -763 1939 -16 -128 994 -1101 1028 478
1243 478 -1391 851 -416 -407 649 -1969 -143 312 -1126 828 -1061 -753 1375 -1073 -40 862 -852
1260 -852 1540 523 -402 1553 -123 941 1034 -1027 876 649 -639 908 -1097 -208 875 -1660
1276 -1660 -127 -324 -1037 751 -909 -954 618 -786 851 292 -1300 1289 179 38 1189 -870
1292h70J742K59k162J616q95k24J582k330J013Q84j978J979r23r32K352j440K06
1309a21Q06j869K484p54j042J692j584M99J280k578J606j05r62J400j554j19J684
1326G63k091J101j65j103K483j322l65J422j232J090M76k045J976l41n28J314
1342A433j978O80J168k194J464o00r43K267j923j48J169j675J622n22j186K087
1358G21j201P2J175k230J748N18j598J860j218j71J641j785L79O45j232J555j264
1375c85n71J770j502N10M79j624J953k96j237J615j321Q54J001k245J496J10j057
1392d50J875j771J07J355j702J236n24j378K100j191o30J290j526J597J97j893
1408a308J661l77k44J193j793Q94R10j367J493j110n59K102j762M12N79j809K067
$$ plain form
1292 -870 872 1131 -1031 585 -310 -534 1048 -1282 -269 615 -1363 616 -307 -1239 1113 -327 -121
1309 -121 685 -1184 1300 546 -496 1196 -388 111 1391 -1187 419 314 -648 752 -802 -921 763
1326 763 -1328 -227 -392 -1495 988 -334 -699 723 -509 581 1057 -988 988 647 119 1433
1342 1433 -545 135 1303 -891 573 -27 -970 1297 -626 -774 395 -1280 342 -180 -1366 721
1358 721 -480 -408 767 -1463 285 803 -795 1065 -153 -324 1317 -468 -89 556 -676 879 -385
1375 -385 -956 814 -688 -178 301 -1323 630 334 -903 712 -609 245 1246 -999 497 607 -450
1392 -450 1425 -346 -239 1116 -586 650 126 -1252 848 -343 -973 317 -1209 388 585 -1308
1408 -1308 353 -24 -268 925 -868 26 936 -431 1062 -48 -607 1495 -267 145 724 -1085 982
1425I82o82j467K001j205o0J200j959J553J51j405J669j145J8J499j708N02K84
1442B28j148J742j119l24J379j240N80K49j440J957o88o02J353j696O34R41j699
1459h93J146l44m03J734j909L42J043j451J312o10r77J879r56j37Q35j396J432
1476F47j15j221J397r16j22J532k022Q58M36j027J266j041j53J557j412K03M57
1493C24j474J910n83q27J198q28L52R29j811Q27O14j056J473j558J44J223j551
1510f94Q65J76j054J394q79l25J230j650J334K36j634J550o02k35J128j467O81
1527E4J149j827J412q16l36J649j664J14Q91j453J495q37o90J440j025J19O06
1544B81j408J338j49o12J126j077K52J255j486N34N52j026J430q65o74J421j296
$$ plain form
1425 982 300 -1167 834 -371 -431 769 -1190 363 514 -891 778 -367 -349 1150 -558 -56 228
1442 228 -920 822 -297 -621 758 -482 98 347 -1093 864 176 -426 927 -769 -135 806 -893
1459 -893 253 -91 -494 1240 -669 -327 716 -735 577 -33 -1010 869 -87 -224 611 -785 647
1476 647 532 -689 708 -208 -330 1202 -820 38 474 -553 713 -328 -481 1076 -336 -133 324
1493 324 -1150 760 177 -650 548 -280 72 1001 -810 17 631 -425 1048 -510 -366 857 -694
1510 -694 171 347 -707 687 -192 -517 713 -937 397 633 -1001 549 -53 -288 840 -627 54
1527 54 1203 -624 788 -28 -364 1285 -379 -265 626 -827 668 -169 -859 581 -444 -325 281
1544 281 -1127 211 62 -550 576 -501 -249 1006 -480 54 606 -420 1010 145 -529 892 -404
1561d04P31L55j832J315j70q91J236j041P59O83j915J402J55q09J340j199N7J222
1579I94j497J074j45q64J172o27m69P81j305Q93M24j611J258p28r7J384j536N45
1597c54P70j024J060m49n66J665j273O15J34r18J241n10q15J285j143O13L35j441
1615g75P70J66j014J492j228l1J313j574J097j75n61J381q90l16J063j184Q43
1632C77K87j525J398l18o58J177j847J272O15j668J063r1o80J138j107K97P83
1649E13j046P95m0q59J501p50N6O41j136R98rj331J283q18P5P36j400N31N51r66
1669f75J187q54n10J468r42N35K17j020J239n39o71J473j252N36O06j565J419
1686F52j97p65J351j476n7R41j170J037m38q09J264m37m68R91j121R36L8r45J073
$$ plain form
1561 -404 327 682 -1150 165 -5 -896 340 -701 58 741 -1174 228 383 -426 914 -285 -228 994
1579 994 -503 571 426 -438 734 107 -362 419 -886 7 431 -1180 78 -650 -747 637 -899 -354
1597 -354 416 -608 452 3 -563 1102 -171 444 578 -340 901 391 -424 861 -282 331 666 -775
1615 -775 -5 161 -853 639 -589 -620 693 -881 216 41 -520 861 -29 -345 718 -466 377
1632 377 664 -861 537 219 -439 738 -1109 163 778 -890 173 82 -598 540 -567 -270 513
1649 513 -533 262 222 -637 864 114 170 811 -325 673 664 -667 616 -202 -127 609 -791 -260 291 -675
1669 -675 512 -342 -852 616 -326 209 426 -594 645 106 -565 908 -344 192 798 -767 652
1686 652 455 -310 1041 -435 -492 449 -721 316 -122 -931 333 -104 -572 419 -702 234 272 -673 400
1705D00m95M7R92j664Q90L40j079J086q34k87R50q18K8M65o95J182l69j061J449
1724E27q23Q7Q43j565J615q3j044J257r49J93J110j626O78J15j014J274j042j20
1742e67J295j468M33L80j046R53j19o16J112o28P4O65j168J146k35n72J107j051
1760c05M01L28p32P92l65p23J385q72j16O33j209J004n0r64J132l75k21Q80j141
1779e18P28J73j043J155o87J15O70p77O1N39j184J101j96p69R63q92M40N84j173
1798g10P80J62r46J111o75j9R26j062O87j39l69J141p20l90J094j039O67j38p68
1817d07R93n19l04Q33j173L77O04j247J009m25j45J301j224K29O14j039Q03k52
1835B8n10J324r20m8O95j379J157Rj062J241p49k68J152j627J369j89o72R43o55
$$ plain form
1705 400 -95 -48 944 -720 170 510 -569 517 -317 -604 346 -472 -444 21 -674 508 139 -922 527
1724 527 -296 -209 634 -931 684 601 -443 814 -135 58 1168 -458 220 335 -679 595 -447 -567
1742 -567 728 -740 -307 73 -973 -20 -139 -755 357 -271 -197 468 -700 446 211 -361 746 -305
1760 -305 96 424 -308 484 119 -604 781 -91 -207 426 -783 221 171 -793 339 -36 -257 623 -518
1779 -518 210 383 -660 495 -192 -77 593 -184 -123 416 -768 333 137 -632 331 -561 -121 463 -710
1798 -710 70 232 -714 397 -278 -297 629 -433 254 115 -254 887 167 -223 871 -168 499 361 -407
1817 -407 586 67 -237 596 -577 -200 404 -843 166 -259 -404 897 -327 -98 516 -523 280 28
1835 28 -482 842 -78 -126 569 -810 347 356 -706 535 -214 -482 670 -957 412 223 -449 494 -161
1854a61k28Q21p08J78N26j085R12j17m66Q14q02L14L98j000Q03k48m38J049j030
1873d68L07P21j069P06j42n84J330j070q2P31r09R02J4r86J165p37m3P40j000
1892d74O33J94o53P90p29j80J027j092L91L39q47R00k91m00J037j258P54J87r86
1911f58R77J80r50J074r03K31O31r25N31l54k80J102p72k50O87p67R17l66p26
1930f21J271o08n99Q53q04N33K37p22P44l06k97Q13j237M85O86r80J081m46n12
1949d29R13r84L44O92j232Q79R6q18R35o42J9P39j055P58K6m80P70o39m19J105
1969E78q83K07J98o98R29k50m67J004j096K80Q39j170P71k32n07R12p99K93M78
1988C87q04N96N5p06J122r00J59P29j014O80q6p66J197m09n80J052j131L73M18
$$ plain form
1854 -161 -389 432 -276 -98 428 -657 255 138 -328 486 -316 -2 396 -604 199 -49 -487 562 -468
1873 -468 -161 560 -509 197 55 -529 801 -269 -351 380 -529 373 387 -599 566 -171 -214 526 -474
1892 -474 159 353 -300 490 -239 -419 608 -484 -93 246 -601 299 8 -392 645 -613 141 328 -658
1911 -658 319 499 -451 623 -280 -49 582 -343 188 -166 -446 656 -116 -366 321 -446 471 105 -621
1930 -621 650 42 -557 296 -508 25 262 -460 284 -22 -319 494 -743 -258 428 -552 529 83 -429
1949 -429 484 -500 -156 536 -696 183 279 -539 396 -246 -227 512 -543 215 241 -239 531 -108 -527 578
1969 578 -305 -98 100 -598 331 81 -386 618 -478 -198 641 -529 242 10 -497 415 -384 -91 387
1988 387 -417 179 234 -472 650 -250 -91 638 -376 304 218 -548 649 240 -340 712 -419 -46 372
2007C72p56P03l29n96J054p15K8O16r74Q57l20o76J201n22jM01r99J135k58o41
2027d20J028p49J72L58q78P92J93q02J066j042J2Q01j003O60J07p38O29l24n30
2046f68J129r06M89L83j072J154o65j73R27j046K74N84r84P96j84m72P08n29j54
2065d09Q21q20P70k17n21P56m56L4O96j064Q62k51o85Q19m85j50J052j094%Q45
2085E03j067J009m10n27Q18p03K52L17r95R52k18k75P81p96L21K83n85P16l0p10
2105c64R05o58k5N85p61O18jr27J084m20j7L90r25O63L18q71O40k37l50O49q55
2126e59L61M22p48Q45m34l09R96r97J04O01q88Q47j41o40P11l45J23P44j294O58
2146E7J75p40R21o20O4P87r35M57J96p46P72k11l51L56m50L03K61o40P72m93k96
$$ plain form
2007 372 -384 319 -10 -606 448 -267 -239 377 -597 260 -60 -736 465 -57 -58 343 -656 479 221 -420
2027 -420 608 -141 31 389 -489 303 496 -306 760 -282 -270 531 -472 188 295 -443 186 -138 -668
2046 -668 461 -445 44 427 -645 509 -156 -329 598 -448 -174 410 -574 222 38 -434 274 -255 -409
2065 -409 412 -408 362 145 -376 380 -76 -42 654 -410 452 201 -484 335 -150 -300 752 -342 -342 503
2085 503 -564 445 35 -492 326 -377 -125 192 -803 149 -69 -344 437 -359 -38 245 -340 376 346 -364
2105 -364 541 -117 -142 443 -318 300 299 -628 456 36 19 409 -516 147 465 -406 234 -3 -353 296 -559
2126 -559 -198 224 -524 321 -113 -422 574 -423 -319 282 -606 241 100 -540 171 -174 -51 693 -601 57
2146 57 232 -508 413 -207 -143 644 -291 166 362 -384 388 177 -174 182 -268 35 296 -344 428 -65 -361
2167c61Q62q51J42L05o97O94p8n92J217p26p3N97q99P68o6o74Q18l39l25P32p84
2188c30M56K11m51N93m70K4P46r93J88L18q56R29j00p60O05l11l8M81p50P57j70
2209G9o05J046q50K19Q63j112K79J82m03P73o99J96N05r28M75K17o48Q66n19l22
2229c86Q75q23J61K50m70P35l41K7N14j055P68n8n33O14k72k59N69n91P7L41p65
2250f22Q30O9q62R89o87J03N28r35Q53N2n11M45m37M6Q89j108N88l1n27P89n59
2271i8k69Q25p52M91J23p35O55n9p34R20o50K75M26q12O80p5m48N54l83j40Q48
2292F42j296R42j43p32J169k59n95P55r27K80M79o07N35k97j33M74m94O7P02q03
2312b41N10M7q43R95m60N7P2n01P35j93n89O66o40K25M58o97M11J32n39O05j35
$$ plain form
2167 -361 501 -350 -208 97 -600 94 16 -576 641 -85 -158 439 -460 308 242 -432 386 47 -278 454 -330
2188 -330 126 337 -114 479 9 33 779 -214 -26 292 -564 365 265 -495 110 -201 -239 242 -508 249 79
2209 79 -526 520 -330 -111 752 -360 -81 101 -302 471 -228 -32 473 -455 20 237 -411 455 -64 -386
2229 -386 489 -334 -173 77 -393 342 1 28 542 -513 255 197 -336 278 6 -253 316 -275 -198 143 -622
2250 -622 208 277 -585 404 -283 -180 348 -587 266 318 -193 252 -185 -139 750 -358 230 199 -328 461 -98
2271 -98 -367 458 -294 197 320 -415 240 181 -553 367 -283 -8 418 -394 286 211 -237 317 -66 -206 642
2292 642 -654 288 145 -587 582 323 -272 483 -444 -164 315 -292 243 -54 -187 287 -207 -140 562 -241
2312 -241 269 316 -527 468 8 65 137 -364 371 178 -411 255 -385 -160 298 -399 12 144 -395 210 75
2333G5l19N37q10N43L48p56P13k03m45Q99p92L50K80p32Q80l62n67R06p01J00
2353e6M26p55N64j52k81P73o57n7M32q12N10M58o27N75n05P6M32p39O02K60p54
2374b87N13k42k67O75o57L06M4k56J71m6j81N10p14N02J40n86O28n7l87M20o73
2395d44Q6O08p03O59k85k40P95m25k03M52n33J61L19n94O06l87m3M72q07M36L04
2416B34n69O10j18m34O24o89L08M45p95P01N3p43P87o31K11K33p74M94Q6n06O42
2437A69k60j29K25m78N58K4l80O16l87l9N84n99J57R2k81M81l36j52N99n24J79
2458A19Q7n00M18Ok89L61l46J89j1l44L95k36k50Q65o73J1J026j025M85j57n15
2479c84O58j68k56O11q54L26L63p13P18k98r1L67o62L60N4n77Q25j80l54O94n15
$$ plain form
2333 75 -244 293 -517 26 374 -382 331 128 -317 582 -210 140 420 -312 568 206 -361 545 -156 -56
2353 -56 370 -385 179 27 -254 519 -138 -195 237 -575 -65 393 -234 341 -164 -88 344 -395 207 467 -287
2374 -287 226 -16 -283 392 -265 41 85 -171 0 -46 -227 283 -431 71 211 -375 253 196 -191 229 -444
2395 -444 -358 250 -453 206 -79 -319 476 51 -152 300 -233 -72 247 -347 259 -128 -171 301 -506 -70 234
2416 234 -335 275 157 -277 347 -342 -34 411 -384 317 370 -373 414 -217 -6 227 -547 -53 33 -473 169
2437 169 -91 -220 5 -473 85 109 -271 345 -42 -81 503 -96 61 153 -128 353 17 -135 464 -60 119
2458 119 206 -294 124 130 -159 202 -144 45 34 -310 85 -151 -401 464 -209 -198 828 -197 288 131 -384
2479 -384 274 106 -150 461 -393 -67 296 -417 301 3 -88 279 -383 -23 31 -546 279 99 -255 439 -76
2500g6J87M00q33O10j27m51P04m79O8K86q68L93K87m94N13l99j13N60l63J89J35
2521A29l59O02l34j71L97m30L55J27o46P66m93k23N33m84L59L04p34N08k39k63
2541b96N37m48J81J44o02L78K88m89O26o83L36K45l69M41M8m45N64l55l56N60
2561C05n94M12L65q76P60l75k54M97m78K35K46n26N25J0m84N17k82o6K20n60O24
2582B21R1l72J39m35R0L54k23K59Q7m89L05j95J05M10m10j37L12m65O18l11j2
2603e8K05k41K43J38m76O31m07k76Q48o24r9L75o89O73J28o07O02o13K85P0l93
2624b85M83p9n32R33q70J35O85p04L89k81n11Q21j18l42M58k73l2J87l46M08l2
2645I4l70N08o20K51M32p82R12m17j47K36k78J01M32o82M84R0m60P11o76J00O15
$$ plain form
2500 -76 111 511 -322 288 161 -290 414 -65 3 289 -579 -186 101 -393 120 -279 -392 168 -195 -6 129
2521 129 -230 372 38 -133 264 -166 189 316 -330 436 -57 -280 253 -231 128 432 -302 206 -33 -296
2541 -296 241 -207 -26 118 -484 -106 182 -307 319 -364 -28 217 -152 289 337 -108 456 101 -255 305
2561 305 -289 123 488 -388 372 -3 -257 240 -238 -3 243 -283 242 252 -232 285 3 -63 157 -403 221
2582 221 312 -60 79 -356 -266 88 -135 124 211 -278 27 -168 -63 347 -63 -200 112 -353 265 -46 -58
2603 -58 147 -94 149 287 -189 442 35 -241 607 -17 -116 259 -430 243 371 -236 366 -247 38 108 -285
2624 -285 198 119 -413 520 -350 -215 470 -234 155 -126 -637 184 66 -276 182 -91 -123 64 -282 126 94
2645 94 -276 232 -388 -137 295 -487 425 8 -139 97 -181 -80 352 -330 154 244 -216 495 -181 -81 534
2666E34p91K91J66p19R37n59O5M25o20L03J25m83M45k39j66M12k92J06L63o63
2686c60N13j90l35N60l28R6J64m42M70j08l38P16n64m7O35n73J16P1k23L90q5
2707A38m28P00n58L1L21m91N52j48j30K00j54l43L38l65L86l1k53K86l15L07K79
2728C22n36L80j88j37L18m60K79J80m74L29j37j43N12j41k64L60l01j54L09l85
2748c31N25k20k59P60o64P6L67n88L76J64m94M72j78k0K72k62K79j80k48O48o24
2769a29J1N49o34N55k94k29M25k90j00J58j92L04n0l70M12j20r6J37m10N09J33
2790B79m63M17k02o0K89l01l5L32l32J95J22n56K30j75N3N81p94M22L4k85M97
2811B48j48k13N15o20L06R0rM4j54q4K72k61O1J00j61L51l88J54K7j79p7J03l43
$$ plain form
2666 534 -257 34 200 -519 418 -141 -76 349 -271 32 157 -326 119 -120 -286 126 -166 -60 303 -360
2686 -360 153 -37 -372 188 -140 -44 120 -322 148 40 -298 418 -146 -193 442 -131 -15 56 -167 223 138
2707 138 -290 410 -148 -117 204 -287 265 117 -13 187 33 -310 28 -337 49 18 -235 51 -264 43 322
2728 322 -214 166 -22 -159 159 -301 -22 158 -316 13 -124 -267 245 104 -160 200 -101 -255 54 -331
2748 -331 194 -26 -285 475 -189 -113 254 -334 42 206 -288 184 6 -14 258 -4 275 95 -153 495 -129
2769 -129 -118 431 -203 352 58 -171 254 -36 -136 22 -170 134 84 -286 126 6 -90 47 -363 146 279
2790 279 -184 233 31 -29 260 -41 -76 256 -76 119 241 -315 -85 -260 -207 374 -420 2 36 -249 248
2811 248 100 -113 402 -218 88 178 169 213 59 -25 247 -14 47 147 -14 337 -51 103 130 -49 -126 -23 -366
2834c66M23k5l17J63J02J59Mj62L13r9l45K27j70n3K58j54j56L81n45O51j03n54
2856c68M22k96K20L75o67M96m4j37L30m25P8L37m23L04o4l58N80l95l6R5k35J70
2878d1J49j73M32l94J47R4m32L49k8k59L51k92q4M66p82N13J0k14K50j59Q9J50
2900A42m44L66L31n74K39J21m09N32m48L0K13l53M75j17j38J79k56J05K97k21
2920G0j2J92l32oJ66r1K64l13J25k3o9K1K06n09N79l13j85L12k22K90p0k39M24
2943B65m24L58O1k94J93k88j47M53k72J87J35l86J61j43j49J81j7J43K65m56J11
2964f3J51l88P01o84J45L49l48L18k74m17P71k77k26N34l92k10L07l17N30k91
2984h1j44M89m26KM87m18K17k64j24M66j07l09M66m97K51J10j32K61m50l4L83
$$ plain form
2834 -366 57 32 -285 -122 -20 139 143 -19 294 195 -150 77 -93 -146 112 -42 -198 183 -362 289 186 -368
2856 -368 54 -242 -22 353 -314 182 138 1 331 -94 -16 321 -102 202 138 -220 360 -35 -71 24 -211 -41
2878 -41 108 -65 367 -27 120 214 -218 131 103 -156 195 -97 -181 285 -497 16 26 -188 62 -97 -8 142
2900 142 -302 64 395 -179 60 181 -228 304 -144 -114 99 -254 221 104 -34 145 -111 -6 291 70
2920 70 58 250 -82 -88 78 -13 251 -62 63 40 -29 -8 198 -311 268 -45 -230 82 -140 150 80 -159 265
2943 265 -159 199 260 -34 159 -129 -276 177 -95 92 227 -159 2 -141 -290 -109 -126 17 282 -174 -63
2964 -63 88 -300 401 -283 -138 211 -137 181 -93 -510 261 -16 -242 292 -100 -310 -3 -320 210 -81
2984 -81 -225 264 -162 -160 327 -91 126 -138 -262 204 97 -212 254 -243 8 118 -14 247 -203 -237 146
3005A46l72J42N4m39Q28m52R7M37n32K48J74m84L37k01j32M05m77M7K46l71K62
3026c7J14j67K57k61J27M24o69K49j20j47L33k56O1K08k60k44M85l51K81k42j19
3047c34M54k90M14j38j40j2j07Q9K29l04J75L83l68J58n2k18J56o8k6K85m55L01
3069A32P7l43L47k49j11L12j80L9K79o44J70K41j58J35l92N34j80j29M21l79J33
3090E5K98l84j44J42k4R6n4n5K02j20j17L67m27J47k8j21O41n74q9L24j73J50
3112A12J2m77N79l94P4L98n19L29j67j80M51L7l82L75j52K7Q6l16mJ50j99L08
3134A48k49j3K04P5K01k02k69M78m46k9M32n61K12J54l95M03k19K0K42l55K67
3155I8o4k52M33k61l6K66P5j49Q6l26K41j40m9j04J52PJ05l15M08k88L8K76j03
$$ plain form
3005 146 -226 -84 -30 -469 359 -93 4 441 -91 157 331 -153 184 -17 -149 256 -221 -174 72 -299 -37
3026 -37 77 -90 167 -94 33 457 -212 37 -83 -230 103 -153 -92 116 -144 -388 97 -254 27 -215 -334
3047 -334 120 -170 244 106 -34 -46 -153 -64 165 -139 36 419 51 209 157 -61 95 27 1 286 -169 132
3069 132 209 -134 213 -36 -147 165 -15 24 303 -341 -171 70 -88 47 -345 189 9 -120 301 -78 55
3090 55 353 -31 -175 -33 -57 39 -15 -70 132 12 -105 262 -165 -18 -46 -167 474 -100 -189 135 -38 112
3112 112 124 -353 226 -168 -94 304 -215 114 -53 -233 218 255 -127 248 96 123 209 -107 -111 39 -160 148
3134 148 -101 -114 90 165 366 164 -105 373 -73 -102 330 -231 -19 135 -260 143 -76 -56 186 -169 98
3155 98 34 -218 215 -46 -82 184 259 110 196 -130 111 -29 -78 -182 -30 -23 82 -233 175 -113 -75 201 98
3178I8j31J18l22L05n5l96L51k9p2K99j81MJ56m18O14l76k54M11k49L07j12l93
3200c25M36j11j0j14K03l17K39q4L34J0l08J6K20n40L07k15K19P0p0l4K4J00%
3223E0j26k4R0m12O38j38o7K76m64K22n6r3J69r2k67N15k21k55M23m47N45k05
3245F1j84M03k26j38J62k40J15R5j56N64m91r2L09m54J63J85m43O29m67J55L06
3266B56n49M54k00m48O70j31l98N10n0j86K1k08L03P6l66J10K33j61K07k83N02
3287C62l60K9P6L6l02L65l45M41l46m78O69k8l90N47m72L83l9j40o5R0o8K17l65
3310a83Q0K53k97L3M07l04L79l65r5L85m16K15rj67L28j67NN0j61l5L10n26L56
3333G6Ql87M44j31k74L20j33J86K8j61q9k39M06j69K00j34J78j47K57m71J49L5
$$ plain form
3178 98 -33 85 -237 68 13 -383 -32 -61 -133 166 -15 -11 145 -273 341 -35 -289 122 -127 180 68 -325
3200 -325 111 0 -10 -124 79 -238 1 -83 251 261 -47 -31 189 -351 -44 -259 -40 30 -40 -74 -50 50 50
3223 50 -76 -100 -10 -422 216 78 11 287 -177 45 -11 -104 65 -27 -294 221 0 -255 168 -279 266 61
3245 61 -123 280 54 -84 78 -162 -47 48 -108 456 -35 -127 182 -272 -109 76 -367 262 -205 -50 256
3266 256 -293 161 -39 -487 183 52 -346 164 114 -72 -51 -259 44 120 -246 -136 97 -64 143 -140 362
3287 362 2 31 107 143 -159 206 -139 302 -44 -522 147 119 -271 276 -196 187 148 8 -57 33 -35 182 -183
3310 -183 -103 150 -147 -114 293 -11 368 3 -92 293 -123 92 83 -84 244 77 82 132 -29 -64 246 -280 76
3333 76 84 -303 141 10 -264 56 -77 109 137 -24 -113 -352 54 -115 85 -49 129 -18 239 -232 -83 -48
3355d8K4J74k74J34K14m20N2L38l60Q1L19j72JJ0l49L8o4K56K50n09N13k44j96
3378b32L39k93K66k0l62M05k49o6J54J5pJ53l75L57K11n74L59j28p2R7k19K26
3400a5J47l29L18j21J88M6l07l3P5n9O5Q2q9J36r8m7k0j05K08j57O6J53j41K54
3424B17j09l36J80Lk06L86k36J43K21o13L01k8R6J76j04k98M71n08P1L88j61J62
3446B16o3k47K39j22K4R6o7q0n5O5J70%k39K68l63R6J46k87L30mJ1kk62J34K15
3471B19m07N68m28j68L46l41K66K09m85O14l39j17K58k67K30Q5n10L90j81j01
3491a59L49j26k82M89l14l61K70J45K9r7j00K84k75J85M4m5j22J81l1p5J47k7
3513A09N5j02K8m5j54K41k55p9L7o4L26k47O1L43l05l6K75l59M6J03j62K49k46
$$ plain form
3355 -48 -24 150 -124 10 224 -196 -144 194 -166 -85 234 62 63 73 -276 -238 -302 -46 204 -305 208 -36 -232
3378 -232 107 -186 80 60 -302 103 -146 -212 -58 -43 -50 103 -272 85 296 -278 81 -47 -119 -22 -241 -15
3400 -15 132 -197 121 0 188 234 -73 -106 -31 -90 -25 57 -32 104 6 -41 -61 -166 42 -115 -49 104 -37 217
3424 217 108 -228 -48 -45 -251 135 -101 42 263 -350 -49 -77 19 195 91 -207 264 -244 -173 215 54 216
3446 216 153 -94 145 23 47 143 76 -4 -59 6 176 176 -63 205 -158 -62 84 -203 127 123 134 132 -130 4 219
3471 219 -188 380 -48 -216 130 -211 55 264 -221 393 54 -63 195 -72 158 243 -267 123 -58 -159
3491 -159 190 64 -218 271 -43 -404 -134 11 40 -57 -157 127 -148 37 81 36 -86 95 64 -11 136 109
3513 109 164 62 90 45 -109 132 -123 -202 -165 -229 97 -150 -89 254 -51 -87 188 -171 -125 -22 -184 65 -181
3536a81J57J99m42L59O3j23J80l42M2K71m06J18J92l89K46K44m16M90j62j54K13
3557A59j79K3K9j23J32j95K51M6n20L86J08j11Q0l51L7J93j63J67K45m29K50J27
3579A62k12J81j63J39K52n61L07j37l87M83p7N4q0l03K72J15j41L28m63R5J24
3600a2P5JP9m10L21j84l5M62n04N00k34m10M88j42n5j35J3J55J53l37M63l08J80
3623A24K12m94J96P5l4K9j37j24K89j85K63q2J0O5j60l36L76l42O8J58k1L15l17
3646e2j41K02N3k04L1oK73k06k4J05m1lr2q9J83J75l03J91o7k15K32k0k23J67
3670g4j23M49k09k67M10l26r1L61l8O0j49NK21k90j30N02m13J29p4j17J51j57
3692a70J14J01j64J06L8k09L46k87o8N22l07R5j33N6J11j41l46L01J01j90L36
$$ plain form
3536 -181 -24 175 -267 92 155 32 212 -130 -88 183 -223 -105 87 -302 -56 188 -228 262 100 -54 159
3557 159 -20 3 32 -91 41 -154 97 143 -377 9 117 6 86 -265 -228 -35 -198 -31 214 -215 35 162
3579 162 -50 131 -32 107 359 -202 105 -32 -419 64 -13 41 -39 -342 -70 45 -96 232 -231 -136 -12
3600 -12 63 64 143 -267 54 -130 -165 297 -207 293 59 -351 137 -5 -60 -195 -182 -27 126 -211 252 -56 124
3623 124 336 -158 38 113 79 108 -29 -153 136 -49 214 132 142 207 47 -289 87 -255 -187 -29 -50 265 -52
3646 -52 -193 9 62 -142 -111 -117 156 -50 -74 31 -10 -13 -105 -194 -11 164 -139 52 -15 -230 2 -18 -241 -74
3670 -74 -197 252 43 -224 186 -140 -231 130 92 152 3 8 229 -61 -191 311 -102 27 -47 -164 -13 -170
3692 -170 -56 45 -119 -13 25 -184 162 -125 -193 329 22 117 -16 40 151 10 -336 -35 66 -124 212
3713B12l51K94K5j86j7p9q9M42j90p4q0L2Q1l02K97J90k82l3L38l00K40q6k02
3736a20K93k85K6K02j70p5O3L62Q5m63M4J19j03J71oj92L67k60j00j36j67L30
3758a5p0k34M20l28M1K78Pj94J99k20K16J20l03J02j82J68k15K6K01ok37K98j42
3781g0K1J84j25K32n7m17L89j62K48r1l22oJ00L2j32P3j43J05K2K0Q2k52L98j6
3805A13l75K32k27J97M3M6pl0l13M95k14P3J51k12J7J47l44L61l2N5k6k81K65
3828A34j39k22K41n6Q3Q2l17M3J19k66K23Lj00J88k0k24K11J00j94L79m80K09
3850cj78K98q9o0j36J45j26m9L09l14L23l64J48R8l3o7K1K01k70oL65k8l74L19
3874A30m2K0J61m91Q7M22m69L83l51mL66k55j9O0r8Q7J09k15M36n98N0L05k29
$$ plain form
3713 212 -139 155 180 -6 -23 -102 -191 251 61 -13 -93 -61 20 -282 15 205 -77 -110 228 -72 168 82 -120
3736 -120 173 -112 -86 116 -54 -129 -66 296 381 -82 -38 81 -22 149 143 -49 318 58 -42 -178 -345 -15
3758 -15 -85 -319 101 -227 -186 92 99 -95 104 -116 100 220 -83 19 -163 5 -210 -184 17 11 -226 72 -70
3781 -70 -49 135 10 242 185 -232 157 -5 243 152 -170 -176 -76 -44 -176 -103 -246 -141 -119 -99 -17 -269 129 113
3805 113 -262 -30 -257 -60 -17 29 22 -8 -321 174 -40 33 184 -28 -11 136 -208 153 121 176 150 -131 134
3828 134 -5 -227 14 -42 41 123 -194 -151 -32 -298 -75 -72 -172 16 -4 -228 -17 83 -111 268 -212 -3
3850 -3 -181 117 28 -32 -168 -23 -149 -198 111 -203 120 -244 -96 2 -31 -98 -77 124 -146 -152 213 185 -189 130
3874 130 88 108 269 -222 -135 287 -182 201 -150 -154 212 -43 -62 -2 -100 -13 96 -119 317 -281 -231 74 -155
3897a55N32l16l74N21k08m3O1k07K5J36k67N09J18o72P10m88R8J49m02N30m8m75
3919b66L50j39m6J99r0m8J63m99N70j33p1Q6k54K84j76P7j7J35l9Q8k22NJ61l59
3943b41K85p1q1L25k38n2K6k30L93m6n3J62O5l33qj43L90j71R8J40m01J87J39
3966A42k00K06j56l58K99J47j09J07k54K34R9j26o0K00k84R4k3m0k1q1N6Q0j12
3989a60K83k27N5J92j17l8K57m07L82m75K92K87m24R1n7j66N10n4k99J79j52N9
4011A1j88O0j8J05J05J72m57J70J64k41J63k29J35J70p1k13L34l21J69K49n85
4032c16K74P6P2j17j26K51k16M8P0q0J35o2j53K35p8l25N03k76p2M69k82j1P2
4055I1j85L71l38K07n9k39J56o6o9K27n9k92L80q4k7r5j64J97J29j81J95j73J13
$$ plain form
3897 -155 377 61 -313 208 0 -43 18 -189 -164 -28 -295 214 332 -340 370 -118 -20 129 -273 257 209 -266
3919 -266 84 -55 -101 98 8 -40 123 -376 194 61 -10 76 -178 106 -70 7 -10 125 86 174 -48 -43 118 -241
3943 -241 44 -27 -108 217 -21 -73 -47 -277 116 70 17 179 244 -89 -97 -240 150 -21 77 217 -184 3 142
3966 142 -58 148 -8 -366 -67 80 -29 78 -176 58 157 31 -29 171 -113 -19 -42 -82 -103 -184 -128 -48 -160
3989 -160 123 -104 -49 143 26 -12 245 -162 220 -255 37 324 -100 -9 -66 -232 278 224 -75 104 -48 11
4011 11 -177 -117 -135 -30 75 247 -210 -40 124 -117 46 -183 -48 122 51 -162 172 -149 20 269 -316
4032 -316 -42 34 106 -11 -137 114 -102 -54 16 -64 71 9 -144 91 13 -312 191 -85 -157 312 30 19 91
4055 91 -94 277 -61 146 87 -152 4 -62 -131 96 37 -255 125 41 14 -81 -245 -48 81 -100 95 -78 35
4078C5j35j0K42k6k29K15j15r9K29j75L36j72l15J23m4j09K57o9k6J87n5j32K24
4101A37k50L16j24n3J40k96Q7M8j56R7k18L12K23l93N03n51R6J65k1j50J96k49
4123a41L21j46j87J15J16o3q2k05K91J23k59J42k03J12N9j5l6R9j82O4M6r8M22
4146B93l02j28K74l27L00j8m7j5k28L11m0k54L12o4k28J82K6j51J91j5o8J24m58
4169c30P34n50J19R8k46K53k2o6j02j0K33%l31K9J59n3J08k88j42O05j37l9J04
4192A26j99J57Q9l19J02m9N6J90q2j40K12j55J15k18Q8R1k35L69r5j53NM6J07
4215A08R4k07M4j62l52N59r8Q3J06k58j9L65n38J15K90j77o7K48j37P9P3qL0m68
4239b97J69j16M2O05m68j19L32k21J69o6k44M06j13j93O7l3J89pj80K39j07k8
$$ plain form
4078 35 -100 -110 132 106 -123 92 -23 -122 107 -68 268 96 -219 -96 -140 -249 8 -61 -87 100 45 -87 137
4101 137 -113 203 79 26 166 -130 -43 5 -151 -54 -272 40 263 -130 373 -178 -82 83 62 -88 108 -141
4123 -141 180 34 -153 -38 78 15 -67 -272 19 142 -117 25 -178 -66 -7 -22 -58 41 -141 -77 -31 -129 293
4146 293 -9 -137 137 -190 110 92 45 30 -198 113 73 -181 131 67 -161 21 47 -104 87 72 4 128 -330
4169 -330 404 -146 -27 71 -175 78 56 -10 -112 -122 111 111 -220 -191 -32 -85 23 -265 -407 198 61 22 126
4192 126 -73 84 173 -146 -44 -93 -37 153 71 -69 143 -12 103 -115 -27 64 -171 198 103 -50 -45 1 108
4215 108 202 -5 39 -123 -475 84 -14 69 175 -83 -102 263 -275 -160 130 -47 -114 134 -3 76 149 141 171 -297
4239 -297 -128 -244 -202 403 -65 -184 148 -73 96 30 -214 192 79 -114 -47 -80 109 102 -78 161 54 26
4261B6n5r9R8J3j13L29k35r0L33l94Q9O6k4M%MK02K3k92K43m2k27K09j69K27k69
4287a43J88K4j59J84J45l03J90l05M15p7k3j44P8j52K27k73rL17m66K22K87l22
4309i9j3K99l88M45m11L10Q2m74L23k36j4K25j66J18J89k77l9J77n9J79K9j25
4331G5j03p4J89j06Q6j8k5n8N1j96J04K16l44K25q3l2K92k35k7J5N8L7j70k21
4355c44N65l33n8J40j4R4k76K0J51J38l23L90k63J6J46j70K37l9K4q3k77N78p6
4378B43k98J55p2k04L77j47j52L50l34J08j65j79J34K03J44o5m04K36K37l28L61
4399B00k18j81K38m5J60J53n08L94j78l96M17j49P7J50j05k94K09j84L45r7j36
4420a48L05k18N8r0k8J48k38K17M8L3q1j59l5K17p0J96Q9k46J26j51k0J28k65
$$ plain form
4261 26 -29 -128 -30 -17 -130 199 -36 -126 207 -187 -98 -32 -56 -52 -52 -48 154 177 -115 128 86 -141 68 -101 126 -143
4287 -143 45 69 -90 94 239 -64 126 -179 236 159 136 -8 70 -82 145 -128 -137 180 -286 -64 223 -99
4309 -99 -112 187 -201 244 -167 143 225 -249 74 -162 -176 49 -117 1 190 -87 -126 51 -8 171 200 75
4331 75 -28 -102 87 -19 67 49 24 -34 17 -179 -75 141 -203 22 -61 -93 199 -36 -63 -48 10 47 -123 -344
4355 -344 221 -112 -170 -30 -44 50 -226 -206 -55 83 -240 150 -113 -97 49 -121 116 77 101 18 -259 319 243
4378 243 -55 100 28 -176 201 54 -98 252 -82 26 -139 -318 -184 19 163 98 -306 -70 167 -161 200
4399 200 -18 -199 39 -6 154 307 -201 193 15 -381 36 -113 -36 114 9 -285 -76 -260 85 -12 -148
4420 -148 157 -61 -3 -93 -121 27 -211 6 54 87 6 -153 -188 29 -41 155 244 -2 124 -27 -47 81 -184
4443a84n8L77j25P1o7j15J8J54k28M00j42j09N5k34M98k60j74J01j76K45jl73
4465c27O79j20l33J50k12J86K49k82q2k65J23L36l13J70Q8R8l7k71J55j51J05
4486e4JK33k94J9L19j23k4r6J37J25l04j80L58j34J95j30J96l38Q0J31o1j51R3
4509bj04k2K18k61L40j26J5L9j96m8J22j51L22j92J39j66N8j78K97j22M4J03k04
4532g5M9k9J17l6j52J17O6k49K59pj6K14p6j6j86m6j15K72j58L39k17N1J11m47
4556b30P5L55j17m1L7r2L5J05k27K33Qk56K99l03K15l8RK4j66K14j29k44L52m3
4580G5m8K84j93k01J12K18o7o6m1j68L02j28R7l11K42j39q3K96o5k36L21k24K8
4603EP4j87K57l64R4o3K02K44j08k36O2j23n3L92j18k15K61k49K25q5l3K09J5
$$ plain form
4443 -184 -242 135 10 81 14 -101 -83 71 -157 243 101 -8 47 -187 311 51 -123 -22 -198 47 46 -327
4465 -327 352 232 -101 49 -163 23 272 -10 -92 -357 -234 102 -211 -41 47 145 108 -163 -8 -159 -54
4486 -54 -53 180 -114 -95 224 101 77 -19 118 243 -61 -241 117 -17 178 48 244 -94 -14 117 56 -95 -2
4509 -2 -106 -128 90 -171 169 43 58 97 -99 -147 -25 -176 146 -46 93 -73 -15 -193 104 -18 26 129 -75
4532 -75 -26 -55 62 26 -126 -9 57 -192 67 60 44 258 182 166 -20 -66 -181 91 -67 272 55 106 217 -230
4556 -230 -155 200 83 42 79 -13 22 127 -100 133 141 -115 184 -119 96 58 67 91 -75 139 10 -234 118 75
4580 75 27 311 118 -83 29 247 180 114 73 -95 207 79 176 -135 107 -32 -115 181 116 -120 201 -23 5
4603 5 79 -108 149 -215 -121 -184 18 262 154 -82 -20 -143 -196 196 78 -137 124 -125 100 15 -18 191 206
4626B06m19L15r7J93k5j43K11l49L9L71n97M96lm51M96n7k56J53k28O3M2Jk1L6
4650b4J62Q8j67k68L20j28n2%L1k9K31m05L08j49J18J55l75J87j21J83j19J2J72
4673A30R5l83N7j02l8L59j70R8k79M5M56k50k19K81k18J05J95l66P6j6K8L69m18
4696a65j8L16m4J57j30k61l5M8K35Q8q8P5j55j46K26m02L42O6m12K27J72k46L29
4719A79j50L5k8k32J61J03o6J7K33k00n7K68j52j0k79K34r2k66K50J55jKM6r0
4743F0l5m8L22l61j13O8j19J99K43k80L01k34R2K17n84N48j66j85L1L04m16J95
4765C9Pl5o9j6K10J3l79J98L65l80J20m7J77j31l05J39QM7J41k25J28q2j42K94
4789G5j58J42J9J11q7j3m2j74L0M6K03k03K06k23J20r4j6J09P6l03n0L10j55J45
$$ plain form
4626 206 -213 102 5 198 173 30 241 -108 -69 302 -295 201 198 -253 243 186 -70 83 -145 -82 -40 -39 -60 -24
4650 -24 138 226 59 -209 111 -17 -69 -69 -38 -67 164 -241 67 -82 36 191 -184 3 -118 65 -54 -42 130
4673 130 225 -158 -101 -203 -241 118 -52 46 -233 -188 268 18 -201 80 -138 -33 162 -204 -128 -144 -116 253 -165
4696 -165 -183 133 89 246 116 -145 -180 -132 103 191 103 178 23 -123 103 -299 43 109 -303 -76 96 -150 179
4719 179 29 64 36 -196 -35 68 2 19 252 52 -5 263 111 101 -178 56 -36 -302 -52 103 102 104 150 60
4743 60 25 -23 299 -62 -175 -107 -226 -27 216 -64 237 3 95 312 -272 276 110 -75 -44 260 -156 39
4765 39 46 11 -58 -74 136 149 -230 -32 333 -47 73 26 203 72 -233 -94 -86 -39 102 -123 5 -77 -219 75
4789 75 -83 59 78 189 102 89 47 -127 -97 -51 152 -51 155 -68 52 -42 -58 51 127 -176 -226 84 -71 74
4813G4J26m82L46j25J35K6j72m9J27K5J29k22K45M0l33J11Q6n2J09k42nK02k42
4836a43K33j65P9K36j98j54K42j20MJ50l35J64P2j06K31J10l19K55l07j63N44
4857C10n55K74j19J9L65m48L25k03l17M27l5j3J73p1pj2k08K17j76j83K80J31
4879A74l12K89j93K58m9k41J55p0J4O9k30q3J25Q4r4J63o6K44k18o0P1j34J64
4902F0j99J44J58k22k9K98l99J44O7m4J42k14j68j22K81j6L69l66K39O4k52L60
4924B95l61K8R7k30O01m12Q6r4m3Q6Q6m32M44l37P9K73l43K00J93l88J86m4q1
4947a11K1j43J42oM7k13J08j18K98k87L28k3j08K24j91j73K70q5n4j28K68j14
4969d8L72m41K66l02M9L8N3K09J4k72j38K27K8R5l89K24n3M1J96k25k37N75l58
$$ plain form
4813 74 200 -282 64 -61 74 100 -72 -121 6 31 160 -62 183 223 -110 1 87 35 144 -98 -103 99 -143
4836 -143 90 -75 4 240 42 -112 130 10 14 164 -171 -7 65 -41 190 300 -19 236 -71 -234 310
4857 310 -245 29 -90 -71 294 -154 171 -32 -349 78 43 30 203 132 125 113 -95 122 -54 -237 43 174
4879 174 -138 151 -42 216 167 -74 81 11 25 94 -136 -219 -94 -10 -104 59 -7 237 19 -41 30 -104 60
4902 60 -139 5 163 -59 -88 210 -189 -45 22 -22 120 -94 -262 -384 -103 -119 250 -116 123 187 -65 295
4924 295 -66 -38 59 -171 430 18 104 10 -33 53 139 -293 151 -186 -107 166 -177 23 216 -172 14 -30 -111
4947 -111 -90 -233 -91 -97 -50 -263 -155 -273 25 -262 66 43 -65 159 -32 -205 65 -20 -74 -202 66 -48
4969 -48 324 -117 149 -153 -104 -66 -13 196 210 -62 -200 27 55 150 -239 -15 -68 -27 169 -56 -293 282 -76
4992g6r9J74J82p4p9j65P0N8RO7j70J47p4M3J73j64o0Q3rL7N0ok40M3j01K06p8
5019e3N5J26j19l9K50k54n4oK28o2l75N27k79m9J80K0k09L21m00K21o3j08pJ1
5043a38L8N3J60j86J64l36K41K6m0J71p0j19J22k65K34N7l39L25j2j34J2j8Pn5
5067a02p6M02j36j40Nj39PM36l99K67l6j30j4K1L4K38l01J19j91J71K46n01L71
5090A52Mj19o1M9q0J37j37j27K02r0O0J28k34L65k61j68K80k69N4j44K25P0m56
5113d20L81M75o39J90Q3j99J77j42n8Q3L8j2J9r2K02J04J9j49k2q2N3q4q4J97
5137C8l60K96J35l86L91R2k63L25l10J03k33K51K1O3L2o6m78M77L3k05n4p8j44
5160c20K49j4J54l39K28R3k06J51K34l90K70J46k54K79o4J09n70K23r5M3K9N9
$$ plain form
4992 -76 -175 -1 181 107 28 -137 -67 -9 0 67 -103 44 -30 13 186 22 -38 45 36 73 123 117 -123 -80 -181 25 -53
5019 -53 2 128 9 -30 220 -34 -88 -94 134 72 -303 224 -55 -104 76 96 -113 208 -192 29 -34 -142 -149 -138
5043 -138 -100 -47 113 -73 91 -245 -4 22 -18 153 83 -36 86 -179 55 112 -227 98 86 -48 -36 -54 -47 -102
5067 -102 -178 224 88 -52 -47 -186 -179 257 -142 125 89 -41 -55 -34 0 238 -63 56 -135 36 282 -219 152
5090 152 156 37 -24 25 -55 82 -55 -182 20 -70 -10 118 -116 249 -12 -180 100 -169 -115 -259 -34 36 -420
5113 -420 -39 436 -203 -13 70 -129 48 -94 -152 -69 -31 -43 -24 -116 86 190 209 60 38 -44 9 -75 -159 38
5137 38 -322 -26 109 -277 114 206 -57 268 -42 61 -172 79 100 163 195 129 -349 128 161 -44 -98 -176 -320
5160 -320 -71 -85 69 -270 -42 51 -155 -4 230 -160 110 256 2 281 217 326 -244 -21 -116 -73 -44 15
5182A5q7M7K1N2J04q3k04K21M7o1p5M9k23R2M5r9J63j19J28j37o4M00m55L81r9
5207E9k08MJ8L9K48q0j1m1k60M39l12M4o9J97j9J2k09K26M2l27M75l17J60j21
5231a1rR6J63j69l36L55j39J81j04j65K29k93K97q6k00J83n2J66l32O2p5L10p
5254F4M4k47Q5J80j05j4j84K80l7k30j9K73l77J67j0o3J37J13j07J11j8J71k23
5277iL6J31k8q1K37k69O5J08k39O3N4j28J06j75J27K72m29J20K3j32R3O2n1J72
5301A28l27J04lJ57M4k09K52n9j15J14l8j8l8K28l02P3J80j57Qj1K98l73J15j4
5325C7l4q9J19k85N74k31p4l0k19L55p9j24K67m17M30j46j09J17K9j69N8J35J00
5348B15o2j56k8p9o6Q7J94n9N7j76N0P7n1rj22j8L2j61L68M5k02O7Q0k92L98k58
$$ plain form
5182 15 -72 -25 -4 48 152 69 -135 86 133 72 -3 46 -177 -85 -40 -139 24 -95 33 -104 -168 232 -223 158 59
5207 59 -149 -145 -127 -88 160 80 69 28 -232 207 -105 -61 -130 67 48 60 -149 77 119 -208 267 -50 110 -11
5231 -11 -20 76 239 70 -266 89 -50 131 27 -138 91 -202 95 9 -191 -8 -60 106 -226 -164 -239 71 64
5254 64 108 -139 -54 126 21 7 -177 103 66 -164 -183 90 -287 -120 -130 -193 -56 57 -50 61 43 214 -9
5277 -9 27 158 130 49 286 17 82 190 -49 14 68 -60 46 -129 -2 270 -159 -39 -16 -148 -55 7 -44 128
5301 128 -199 -95 -98 59 103 -106 146 87 -28 86 48 30 -8 220 -82 -9 171 14 22 11 309 -64 51 37
5325 37 3 -86 33 -252 322 91 17 -13 -232 123 44 -80 187 -230 200 54 -55 62 91 -78 -20 115 215
5348 215 153 -3 -31 -110 -176 -89 105 46 103 -73 -23 54 3 -6 -128 -146 -114 -275 93 138 -64 3 83 -209 189 -69
5374f9p8L35m21L98j63K3O5j22k14K48j06J4K56j63J73j9j54j0j10J11J25p6q9
5397d6J1J86p9k19J44k7L6N1j9j07Q1Q6l9N4j23Moj24j09M31l80K69m4o2Qk89
5423c12L24J03r5N13n30l02K81M4j24J43o2j07J88j25k4P7J98k80p6M03l32j17
5445b12L81m37L22P8j53j1J21q7k68L14Lk2k00K8O7K8J90J25j15j58k39M36l04
5468a13K8L54l25M0K65j76k67L14k79L45k20l31M53k5K1R6k53K58q6k34K42j56
5490d9K33r7r9M9l07J04K31j26J83j83j4J17R4j78J94k01J24Q7j48l3k3J50j56
5513d8n3j7K4q5J45l9j2j3K16k67J15LK07Q1l21J43j70j35O0P1K77Lk22o4K39
5538A38l05K46l75L70j40L57l91Q7k10M89l85K19P0l52L87j66l65N29l92O9J54
$$ plain form
5374 -69 -147 188 -233 165 2 25 90 -32 -246 2 -104 -90 166 3 176 157 3 -7 -117 -6 119 43 -46
5397 -46 -35 151 72 -147 -3 -30 6 57 38 -69 12 98 59 113 -10 -6 -12 -136 -245 186 -194 75 31 -31 -23 -312
5423 -312 12 115 20 533 3 -299 -18 26 -98 45 -17 -124 64 -61 -85 -8 190 -90 -166 237 -95 -212
5445 -212 169 -268 54 132 -21 -32 89 2 -266 48 51 29 -171 -143 -76 -48 142 267 152 -6 -245 191 -113
5468 -113 -85 269 -56 -16 249 73 -194 120 -159 186 -34 -365 88 63 84 180 -73 185 99 -135 107 -49
5490 -49 184 87 -12 37 -270 -166 65 -61 122 -61 -75 42 136 -42 152 -49 75 162 14 -19 -42 108 -48
5513 -48 -101 -118 -94 -179 -34 -73 -85 -98 118 -149 -34 -31 176 257 -64 79 -91 -226 -166 -95 182 185 -37 -101 138
5538 138 -167 79 -296 74 -66 291 -100 -13 -223 266 -119 100 170 -182 205 39 -326 203 -189 -120 34
5559C4j4j36M19m43K98j97J12rj44K16k5k22j6K57o7J64k38K9q1j04J69p1j90
5582b59L19Q3q5L2k14J56J95k53L26m95K05K25j66J26j46m2q1r6m2K88o4r3R6
5605A5k91K95m8k0J20l4j02K56k39R4j4j45Q8m7j5Rj30M86l86R3j40nK18p7j19
5630a38K47J03j89K50j83m09L87r2K83j44k16L24j43j63K5Q0L6N0M6OQ8m84M29
5653A93j54K9J80o2k85P3Q0k4j55J71J62m17L02k60j30L30J39l41L30j39k0j10
5675a08L2K70k03j9J82j38J1L16n31J67LrP1mOK9j24J97j16j82P8j96K99j88P0
5700h7r0q3M9O18k35J1l09P7j96K85k6Q6o9l09O25j48l24J19K3q7J73J69j12k97
5724a37J76K50n33M8J6J35q0J6k29M95j58K50l08K12j25r8R0N7n6n9Qm0K54j80
$$ plain form
5559 34 20 -116 303 -140 158 -39 73 64 -80 136 111 -111 -127 130 63 227 -11 18 -63 -167 2 -69 -259
5582 -259 60 143 58 90 -124 32 227 -26 300 -195 10 235 69 195 49 7 -74 -170 -212 76 12 -81 15
5605 15 -276 19 -29 -49 71 37 -65 191 -48 46 32 -113 -25 -72 -87 -78 -208 278 -108 -15 -155 -160 58 -19 -138
5630 -138 109 212 23 273 90 -319 68 -24 259 115 -101 223 80 -83 -58 22 58 108 154 160 248 -236 193
5653 193 39 68 248 186 -99 -26 54 30 -125 46 208 -209 93 -167 -297 33 172 -169 161 22 2 -108
5675 -108 -76 194 -9 -28 154 16 27 343 -188 -21 -18 -27 44 40 46 75 -49 148 32 -150 -72 -268 31 -157 -87
5700 -87 -177 -260 -211 407 172 183 -126 -49 -245 40 14 100 31 -278 347 199 -125 -6 17 -70 103 272 160 -137
5724 -137 39 289 -244 -196 -180 -45 -125 -109 -338 157 -1 249 -59 153 28 -70 20 77 21 -38 -30 -70 184 4
5748Dk35L51k17k76K41k49P23l40lJ11l87J96N4k07L25n8q6J33m08K20J82k82
5770b08J37J60O8j42j7r9K70l30M26p9k42K79k14j58J81k54J00L08k27J7J50k67
$$ plain form
5748 4 -231 120 -97 -373 -132 -381 342 2 -1 110 -277 -81 -27 -234 91 33 -53 80 -328 -108 74 -208
5770 -208 -71 89 157 15 -2 -101 169 -161 265 186 -56 223 9 -149 32 -222 -122 186 -41 -24 126 -141
$$ [...]
8191g9
##END NTUPLES=NMR FID
##END=
