##TITLE=1H_Pr 4-Cl
 CDCl3
 8 sc, 
 31.05.2022
##JCAMPDX= 6.0         $$ Bruker NMR JCAMP-DX V2.0
##DATA TYPE= NMR FID
##DATA CLASS= NTUPLES
##ORIGIN= UXNMR, Bruker Analytische Messtechnik GmbH
##OWNER= root
$$ XWIN-NMR		Version 3.5
$$ Tue May 31 13:52:24 2022 Russian Standard Time (UT+4h)  she@DPX200
##.OBSERVE FREQUENCY= 200.1313499996
##.OBSERVE NUCLEUS= ^1H
##.DELAY= (6, 6)
##.ACQUISITION MODE= SIMULTANEOUS
##.ACQUISITION SCHEME= undefined
##.AVERAGES= 8
##.DIGITISER RES= 18
##SPECTROMETER/DATA SYSTEM= spect
##.PULSE SEQUENCE= zg30
##.SOLVENT NAME= CDCl3
##.SHIFT REFERENCE= (INTERNAL, CDCl3, 0, 15.7039)
##AUDIT TRAIL= $$ (NUMBER, WHEN, WHO, WHERE, WHAT)
$$ ##TITLE= Audit trail, XWIN-NMR		Version 3.5
$$ ##JCAMPDX= 5.01
$$ ##ORIGIN= Bruker BioSpin GmbH
$$ ##OWNER= she
$$ F:/spectra/data/she/nmr/H-F/1/audita.txt
$$ ##AUDIT TRAIL=  $$ (NUMBER, WHEN, WHO, WHERE, WHAT)
(   1,<2022-05-31 13:51:09.59 +0400>,<she>,<DPX200>,
      <created by zg, POWCHK disabled, PULCHK disabled
       configuration hash MD5:
       00 E9 B6 7A A2 85 ED C7 34 08 36 98 17 FE 4E 26
       data hash MD5: 16K
       94 D4 4B 21 AB D5 52 E7 8F 42 A4 55 12 28 48 44>)
$$ ##END=
$$ 
$$ hash MD5
$$ E0 09 78 C7 96 67 95 9A 46 7E 70 D6 55 FC F9 2B
##$RELAX= 
##$RELAX= 
##$RELAX= 
##$RELAX= 
##$RELAX= 
##$RELAX= 
$$ Bruker specific parameters
$$ --------------------------
##$DU= <F:/spectra>
##$EXPNO= 1
##$NAME= <H-F>
##$PROCNO= 1
##$TYPE= <nmr>
##$USER= <she>
##$AMP= (0..31)
100 100 100 100 100 100 100 100 100 100 100 100 100 100 100 100 100 100 
100 100 100 100 100 100 100 100 100 100 100 100 100 100 
##$AQSEQ= 0
##$AQ_mod= 1
##$AUNM= <au_zg>
##$AUTOPOS= <>
##$BF1= 200.13
##$BF2= 200.13
##$BF3= 200.13
##$BF4= 200.13
##$BF5= 200.13
##$BF6= 200.13
##$BF7= 200.13
##$BF8= 200.13
##$BYTORDA= 1
##$CFDGTYP= 0
##$CFRGTYP= 5
##$CHEMSTR= <none>
##$CNST= (0..31)
1 1 145 1 1 1 1 1 1 1 1 1 1 1 1 1 1 1 1 1 1 1 1 1 1 1 1 1 1 1 1 1 
##$CPDPRG= <>
##$CPDPRG1= <>
##$CPDPRG2= <>
##$CPDPRG3= <>
##$CPDPRG4= <mlev>
##$CPDPRG5= <mlev>
##$CPDPRG6= <mlev>
##$CPDPRG7= <mlev>
##$CPDPRG8= <mlev>
##$CPDPRGB= <>
##$CPDPRGT= <>
##$D= (0..31)
0 1.2 0 0 0 0 0 0 0 0.06 0 0.03 0 0 0 0 0.0002 0 0 0 0 0 0 0 0 0 0 0 0 
0 0 0 
##$DATE= 1653990669
##$DBL= (0..7)
120 120 120 120 120 120 120 120 
##$DBP= (0..7)
150 150 150 150 150 150 150 150 
##$DBP07= 0
##$DBPNAM0= <>
##$DBPNAM1= <>
##$DBPNAM2= <>
##$DBPNAM3= <>
##$DBPNAM4= <>
##$DBPNAM5= <>
##$DBPNAM6= <>
##$DBPNAM7= <>
##$DBPOAL= (0..7)
0.5 0.5 0.5 0.5 0.5 0.5 0.5 0.5 
##$DBPOFFS= (0..7)
0 0 0 0 0 0 0 0 
##$DE= 6
##$DECBNUC= <off>
##$DECIM= 32
##$DECNUC= <off>
##$DECSTAT= 4
##$DIGMOD= 1
##$DIGTYP= 9
##$DL= (0..7)
0 120 120 120 120 120 120 120 
##$DP= (0..7)
150 150 150 150 150 150 150 150 
##$DP07= 0
##$DPNAME0= <>
##$DPNAME1= <>
##$DPNAME2= <>
##$DPNAME3= <>
##$DPNAME4= <>
##$DPNAME5= <>
##$DPNAME6= <>
##$DPNAME7= <>
##$DPOAL= (0..7)
0.5 0.5 0.5 0.5 0.5 0.5 0.5 0.5 
##$DPOFFS= (0..7)
0 0 0 0 0 0 0 0 
##$DQDMODE= 0
##$DR= 18
##$DS= 0
##$DSLIST= <SSSSSSSSSSSSSSS>
$$ [...]
##$SUBNAM2= <"">
##$SUBNAM3= <"">
##$SUBNAM4= <"">
##$SUBNAM5= <"">
##$SUBNAM6= <"">
##$SUBNAM7= <"">
##$SUBNAM8= <"">
##$SUBNAM9= <"">
##$SW= 18.0517283424761
##$SWIBOX= (0..15)
0 0 2 0 0 0 0 0 0 0 0 0 0 0 0 0 
##$SW_h= 3612.71676300578
##$TD= 16384
##$TD0= 1
##$TE= 0
##$TE2= 300
##$TE3= 300
##$TEG= 300
##$TL= (0..7)
0 120 120 120 120 120 120 120 
##$TP= (0..7)
150 150 150 150 150 150 150 150 
##$TP07= 0
##$TPNAME0= <>
##$TPNAME1= <>
##$TPNAME2= <>
##$TPNAME3= <>
##$TPNAME4= <>
##$TPNAME5= <>
##$TPNAME6= <>
##$TPNAME7= <>
##$TPOAL= (0..7)
0.5 0.5 0.5 0.5 0.5 0.5 0.5 0.5 
##$TPOFFS= (0..7)
0 0 0 0 0 0 0 0 
##$TUNHIN= 0
##$TUNHOUT= 0
##$TUNXOUT= 0
##$USERA1= <user>
##$USERA2= <user>
##$USERA3= <user>
##$USERA4= <user>
##$USERA5= <user>
##$V9= 5
##$VALIST= <valist>
##$VCLIST= <CCCCCCCCCCCCCCC>
##$VD= 0
##$VDLIST= <DDDDDDDDDDDDDDD>
##$VPLIST= <PPPPPPPPPPPPPPP>
##$VTLIST= <TTTTTTTTTTTTTTT>
##$WBST= 1024
##$WBSW= 4
##$XGAIN= (0..3)
0 0 0 0 
##$XL= 0
##$YL= 0
##$YMAX_a= 86742
##$YMIN_a= -55720
##$ZGOPTNS= <>
##$ZL1= 120
##$ZL2= 120
##$ZL3= 120
##$ZL4= 120
##$ABSF1= 10
##$ABSF2= 0
##$ABSG= 5
##$ABSL= 3
##$ALPHA= 0
##$AQORDER= 0
##$ASSFAC= 0
##$ASSFACI= 0
##$ASSFACX= 0
##$ASSWID= 0
##$AUNMP= <proc_1d>
##$AZFE= 0.1
##$AZFW= 0.1
##$BCFW= 1
##$BC_mod= 2
##$BYTORDP= 1
##$COROFFS= 0
##$CY= 11.3945322036743
##$DATMOD= 1
##$DC= 2
##$DFILT= <>
##$DTYPP= 0
##$F1P= 2.36226072786647
##$F2P= -0.459571619588291
##$FCOR= 0.5
##$FTSIZE= 0
##$FT_mod= 4
##$GAMMA= 1
##$GB= 0.15
##$INTBC= 1
##$INTSCL= 1
##$ISEN= 128
##$LB= 0.24
##$LEV0= 0
##$LPBIN= 0
##$MAXI= 10000
##$MC2= 0
##$MEAN= 0
##$ME_mod= 0
##$MI= 1.114404
##$NCOEF= 0
##$NC_proc= 0
##$NLEV= 6
##$NOISF1= 3.799351
##$NOISF2= 2.8
##$NSP= 1
##$NTH_PI= 0
##$NZP= 0
##$OFFSET= 15.70392
##$PC= 1
##$PHC0= -18034.64
##$PHC1= 9.00074
##$PH_mod= 1
##$PKNL= yes
##$PPARMOD= 0
##$PSCAL= 0
##$PSIGN= 0
##$REVERSE= no
##$SF= 200.130013532006
##$SI= 16384
##$SIGF1= 3
##$SIGF2= 2
##$SINO= 400
##$SIOLD= 16384
##$SREGLST= <1H.CDCl3>
##$SSB= 0
##$STSI= 0
##$STSR= 0
##$SW_p= 3612.71676300578
##$SYMM= 0
##$S_DEV= 0
##$TDeff= 0
##$TDoff= 0
##$TI= <>
##$TILT= no
##$TM1= 0
##$TM2= 0
##$TOPLEV= 0
##$USERP1= <user>
##$USERP2= <user>
##$USERP3= <user>
##$USERP4= <user>
##$USERP5= <user>
##$WDW= 1
##$XDIM= 8192
##$YMAX_p= 0
##$YMIN_p= 0
$$ End of Bruker specific parameters
$$ ---------------------------------
##NTUPLES= NMR FID
##VAR_NAME=  TIME,          FID/REAL,        FID/IMAG
##SYMBOL=    X,             R,               I
##VAR_TYPE=  INDEPENDENT,   DEPENDENT,       DEPENDENT
##VAR_FORM=  AFFN,          ASDF,            ASDF
##VAR_DIM=   8192,          8192,            8192
##UNITS=     SECONDS,       ARBITRARY UNITS, ARBITRARY UNITS
##FACTOR=    0.0002768,     1,               1
##FIRST=     0,             0,               0
##LAST=      2.2672688,     0,               0
##MIN=       0,             -55720,          0
##MAX=       2.2672688,     86742,           0
$$ Real data points
##PAGE= N=1
##DATA TABLE= (X++(R..R)), XYDATA
0 0 0 0 0 0 0 0 0 0 0 0 0 0 0 0 0 0 -6 8 -8 8 -8 8 -16 16 -16 24 -24 28 -32 39 -41 49 -56 63 -70 80 -89 100
38 100 -111 125 -139 154 -170 189 -208 231 -254 281 -309 340 -376 413 -456 502 -556 616 -683 762
58 762 -851 959 -1088 1246 -1444 1706 -2063 2589 -3443 5047 -9211 49562 86742 61701 67715
73 67715 36969 8019 -15004 -21774 -42572 -53640 -46176 -31966 -31353 -16917 3481 16676 15978
86 15978 18730 22864 14822 -589 237 1107 -5249 -5413 5938 12768 9633 8261 13213 4169 -12930
101 -12930 -18385 -21961 -33533 -37792 -26795 -12580 -6187 9282 34757 44987 43815 47565 44997
114 44997 25421 2320 -12000 -26305 -46917 -55720 -46512 -40048 -33945 -15407 7357 19740 24108
127 24108 33636 39366 26732 15973 14144 4813 -8265 -11359 -6380 -5716 -9072 -1737 6542 1261
141 1261 -2619 130 -3080 -12553 -15576 -9821 -7675 -8757 2781 16268 18783 20560 26540 25350 12767
156 12767 43 -5525 -17194 -34125 -36164 -30382 -29701 -24063 -7252 9885 17077 24001 36783 37466
170 37466 25854 20367 15556 1820 -12234 -16385 -15811 -21126 -22260 -11588 -5497 -6159 -953 5474
184 5474 5074 -601 -629 2538 -2258 -5488 1490 5677 4030 7283 13377 13642 6274 4670 4688 -5215 -14031
201 -14031 -12518 -12536 -16038 -13313 -2673 4613 5484 13184 22103 19152 13640 13018 8535 -2570 -11629
216 -11629 -12188 -14969 -21680 -18965 -10380 -7851 -5713 2189 9749 9000 6826 11248 10821 3462 1517 4209
232 4209 1225 -2847 -913 3422 1358 -1674 2600 3160 -3048 -4489 -1913 -4035 -8064 -6549 -1320
247 -1320 -2273 -3321 2986 6301 3087 2834 5492 4233 -2266 -3971 -800 -4674 -9120 -4241 -593 -2664
263 -2664 -1600 4799 7800 4295 5428 9819 6378 908 1955 2527 -2135 -6086 -3190 -2090 -6528
278 -6528 -5921 -666 -985 -3649 -658 2560 723 -1799 1191 2945 -1761 -2656 1137 -507 -3798 -1723
294 -1723 1660 680 -1249 3091 6364 2500 2937 6488 5077 962 -142 2099 -1226 -6097 -3448 -1963
310 -1963 -5541 -5653 -1491 -279 -2685 -2345 2063 914 -3124 -67 2233 -579 -1668 2043 4517 1662
326 1662 1668 6293 4604 -119 597 1272 -2980 -6067 -4460 -2270 -4674 -3454 2823 4707 3911 6968 9685
343 9685 6999 2408 1684 -248 -7359 -11411 -9397 -10730 -12615 -8811 -2499 466 1607 7323 12124
358 12124 9306 7777 9759 6977 1347 -761 191 -1720 -5333 -2771 804 -1761 -2442 622 335 -3546
374 -3546 -5444 -3286 -4086 -7172 -3880 920 1222 3112 7742 10566 8466 5894 6312 2127 -5816 -8217
390 -8217 -8824 -12222 -13524 -9475 -3586 -1173 3416 11610 15033 13394 14526 13748 8115 823 -2611 -5304
406 -5304 -11094 -13812 -10490 -8807 -9150 -5152 633 1893 487 2566 4717 1140 -1086 1389 2185 447
422 447 2175 6566 7822 5593 6342 7743 1857 -3378 -4827 -7704 -12119 -13634 -9728 -6360 -4984 1511
438 1511 9529 11743 12667 15054 13943 7718 1292 -2059 -7314 -14668 -15986 -13868 -13275 -11224 -4374 2680
454 2680 5214 7118 12203 12449 8047 6536 5841 2160 -1835 -1448 404 -1140 -2041 1704 1978 -1536
470 -1536 -2857 -2497 -5439 -9774 -10178 -7048 -7061 -5998 735 6221 8290 10986 14438 14219 8651 4958
486 4958 2112 -5357 -11905 -13249 -13497 -14117 -11363 -4370 1482 4684 9842 15106 14022 11114 9603 6532
502 6532 451 -4899 -6062 -7088 -10406 -9011 -4922 -3745 -3674 -814 1657 341 -2087 -391 166 -2506
518 -2506 -1551 2761 4436 4913 7685 11213 9796 6427 5959 3024 -4393 -8802 -9984 -12058 -14043 -11636
534 -11636 -5669 -2135 782 7474 11909 11462 10678 10120 7301 740 -3709 -5230 -8834 -11842 -9500 -6427
550 -6427 -5573 -2705 2038 5270 4499 4862 6897 4781 890 1768 2181 590 -355 2086 3608 1743 1211
567 1211 2800 22 -4303 -5677 -6244 -8656 -10508 -7851 -4326 -3409 -223 6036 8860 8887 10136 10839
583 10839 7685 2595 331 -1758 -7275 -9143 -7672 -6611 -6020 -2991 1947 3784 3940 6823 7576 4460
599 4460 2176 1745 45 -3246 -4596 -2407 -2647 -4097 -1697 382 -914 -1757 -349 -65 -2592 -3370
615 -3370 -898 -632 -1652 1310 5110 5207 5338 7183 7854 4026 1686 1368 -1779 -5873 -6762 -6218 -6621
632 -6621 -6991 -3615 -257 426 1793 5134 5267 3563 2952 3096 874 -2808 -2626 -1781 -3620 -3929 -966
649 -966 -8 -353 498 3083 2793 741 1528 2704 224 -727 1080 1465 140 0 2271 1710 -561 -352
667 -352 543 -2084 -3759 -3258 -2623 -4063 -4513 -1241 -65 -725 1870 3969 3417 2754 3288 3554 1376 -588
685 -588 703 -43 -2164 -1915 -497 -459 -1134 341 1949 755 -187 1426 1191 -800 -1113 -431 -1037 -2683
703 -2683 -1949 -110 -1624 -2147 -46 613 -576 -346 1489 1278 -281 578 2601 1003 -96 1484 1935
720 1935 308 -393 973 1330 -681 -317 1085 -54 -1266 -204 216 -1091 -1851 -608 -166 -1800 -1399
737 -1399 96 -334 -1243 -366 868 -25 -1171 677 1092 -754 -438 1177 802 364 1532 2965 2183
754 2183 1186 2209 2226 -364 -932 -520 -1594 -3706 -3529 -1881 -2575 -3281 -544 1048 437 1206 2686 2871
772 2871 1026 547 1581 -405 -2300 -1729 -1102 -1629 -1763 277 1536 720 1241 3187 1991 788 1095
789 1095 1532 -12 -1011 -283 582 -1085 -633 1114 122 -1017 -798 -1133 -2371 -3919 -3058 -2072 -2883 -1612
807 -1612 812 2026 2332 4187 5885 5109 3254 3535 2507 -1060 -2484 -2629 -3463 -4793 -4057 -1889 -907
824 -907 -906 1672 3491 2444 1974 2411 1737 -518 -1530 -872 -1761 -2927 -1410 -559 -888 -744 513 1156
842 1156 -152 -827 154 -600 -1692 -239 1284 1464 2001 3785 5035 3667 2956 3103 964 -2116 -3400
859 -3400 -4310 -5842 -7170 -5417 -3407 -2755 -1290 2262 3920 3949 4728 5278 3798 1009 467 -200 -2607
876 -2607 -3637 -2464 -1796 -2096 -864 1118 1489 793 1710 1990 439 -715 -64 232 -578 -633 1513 1792
894 1792 492 1400 1768 243 -1571 -2349 -2852 -4861 -5565 -4122 -2829 -2539 579 3556 4620 5545 6750
911 6750 7050 4879 2450 1645 -708 -3741 -4479 -4275 -4846 -4702 -2679 -278 -18 659 2665 2931 1545
928 1545 1118 962 247 -1402 -1283 -214 -471 -626 537 1228 442 186 577 -423 -2133 -2216 -1192 -1819
946 -1819 -1277 642 2104 2635 3565 5164 4638 2601 1726 929 -1883 -4428 -4789 -5161 -5995 -5581 -2836 -1255
964 -1255 -375 1544 3929 3873 3473 3526 3704 1721 -670 15 -730 -1839 -1600 -762 -216 -637 280 1233 294
983 294 -699 -235 -262 -1732 -1493 -254 486 77 877 2438 1784 1020 1281 576 -1279 -2625 -2481 -3305 -4027
1002 -4027 -3312 -1201 -585 71 2688 4021 4313 4106 4374 3826 1183 477 -358 -1852 -3421 -2809 -2108 -2319
1020 -2319 -2466 -451 602 -283 3 814 349 -621 -452 278 -103 -725 253 1095 631 897 1568 949 52
1039 52 -278 117 -981 -1700 -595 -528 -963 -90 1091 1866 1511 1533 2160 1232 -324 -72 -621 -2123 -2795
1058 -2795 -2312 -1685 -2231 -1773 94 337 82 1573 2046 1284 855 1319 1333 92 -210 582 25 -483 72
1077 72 414 392 -57 388 902 -643 -629 314 -188 -862 -864 -269 -275 -1186 -440 468 -673 -552 380 414 -516 -262
1099 -262 626 188 -382 553 1161 461 311 1405 1197 248 460 865 549 -638 -22 241 -1036 -1120 -617
1118 -617 -564 -862 -1323 45 38 -726 -73 951 365 -370 64 108 -993 -1377 -153 -682 -1209 -353 644 652 1050
1139 1050 1790 2580 1748 1300 1615 1016 -285 -778 -757 -1559 -2627 -1973 -1042 -1388 -1184 333 507 -59 319
1158 319 1013 833 -410 174 677 -316 -384 655 1076 297 618 972 714 -439 -351 -245 -1172 -1699 -947 -6
1178 -6 -128 380 1894 2443 1753 2046 1863 567 -752 -1537 -2223 -3306 -4040 -2901 -2418 -2267 -467 1165
1196 1165 2094 2757 3125 3762 2783 1544 1526 784 -934 -1345 -970 -1120 -1518 -801 205 -227 -634 -92 -121
1215 -121 -1611 -1580 -957 -970 -812 -191 1381 1500 1792 2214 2439 1167 166 -496 -1252 -3152 -3347 -2837 -2921
1234 -2921 -2243 -70 1570 2790 3422 4691 5002 3597 2385 1484 -496 -2294 -3065 -3652 -4102 -4272 -2468
1251 -2468 -1378 -952 415 1328 1229 836 784 1350 317 -294 465 832 562 1137 2061 1982 867 746 658 -1132
1271 -1132 -2314 -2606 -2868 -3269 -2623 -955 219 1280 2697 4252 4001 3102 2904 1508 -650 -2347 -3587
1288 -3587 -4218 -5306 -4510 -2687 -1803 -653 1513 2896 3558 3477 3625 3128 1397 852 325 -629 -1207 -965
1306 -965 -375 -468 -755 -230 75 -1281 -1572 -1314 -2205 -2684 -2069 -1028 -651 345 2108 3265 3284 2985 3355
1325 3355 2013 414 -993 -1959 -3267 -4298 -3548 -2663 -1967 -751 1405 2941 3582 3939 4549 3243 1605
1342 1605 840 -363 -2040 -2981 -3037 -2564 -3069 -1967 -655 -303 -147 254 861 108 -387 -255 149 -68 311
1361 311 1871 1876 1786 2440 2574 1872 385 -260 -666 -2455 -3276 -2951 -2716 -2375 -1365 455 1337 1941 2684
1380 2684 3364 2357 1530 934 -294 -1787 -2686 -2794 -2637 -2751 -1641 -559 65 846 2061 2206 1865 1694
1398 1694 1844 1233 217 260 125 -333 -538 200 353 -360 -529 -57 -815 -1808 -1688 -1631 -1837 -1656 -745 73
1418 73 511 790 2272 2316 1891 1816 1403 551 -564 -968 -1294 -2011 -1737 -967 -368 -200 751 1420 1468 1319 1306
1439 1306 1110 171 -401 -397 -873 -1635 -1673 -1211 -795 -1276 -772 314 -224 -17 720 323 52 91 469 505 119
1460 119 333 1021 729 540 762 727 414 -562 269 -36 -890 -988 -362 -747 -1106 -544 57 127 -226 278 335
1481 335 -148 -122 83 -225 -505 -436 36 -136 -101 455 752 491 820 1187 1095 672 612 1078 119 -653 -362 -704
1503 -704 -1332 -1213 -745 -803 -1008 -311 601 143 555 846 889 266 -248 -59 -320 -808 -1066 -427 -777 -489 128
1524 128 789 842 810 1234 1450 783 562 535 153 -347 -614 -342 -414 -620 -211 -109 -766 -524 -744 -897 -1319
1545 -1319 -1227 -1028 -888 -656 237 1087 942 1752 2637 1996 1470 941 530 -579 -1761 -1770 -1961 -2429 -1779 -715
1565 -715 -86 721 1394 2111 2270 1678 1691 807 -193 -1161 -1495 -1769 -2177 -2240 -1241 -1080 -463 42 802 490
1585 490 253 451 558 232 168 868 669 1087 1560 1958 1831 1378 849 466 -919 -2160 -2591 -3207 -3387 -2790
1605 -2790 -2030 -730 392 1819 2883 2922 3398 3063 1991 647 -653 -1364 -2349 -3409 -3058 -2000 -1727
1622 -1727 -879 674 1571 2124 2151 2191 2018 889 424 116 -534 -657 -352 -111 -222 -29 245 -110 -994 -1545
1642 -1545 -2100 -2502 -2637 -2406 -940 -614 401 2105 3202 3555 3963 3936 3191 1645 -249 -1156 -2958 -3695
1660 -3695 -3649 -3477 -3010 -1564 157 1086 2112 2772 3362 2542 1666 953 168 -1220 -1709 -1595 -1869 -1709 -1095
1679 -1095 -167 -237 70 294 205 -259 -674 -263 -121 -298 541 1635 1890 2560 3018 2747 2062 923 -283
1698 -283 -1488 -3170 -3865 -4242 -4195 -3484 -2147 -567 728 1923 3324 3976 3346 2907 2298 819 -706
1715 -706 -1631 -2029 -2687 -2658 -1690 -847 -241 373 1206 1783 1079 895 860 135 -425 66 19 3 529 921 1096
1736 1096 353 226 44 -1029 -2064 -2402 -2780 -2841 -2473 -1245 -111 930 2473 3482 3644 3509 3438 2492
1754 2492 1046 -586 -1331 -2351 -3496 -3092 -2559 -2015 -1346 -126 919 1540 1437 1805 1696 781 67 -10
1772 -10 -485 -614 -933 -236 -377 -102 97 499 22 -340 -498 -1074 -924 -1121 -552 -3 407 1406 1979 2003 2523
1793 2523 2292 1638 344 -668 -1120 -2509 -3293 -3040 -2804 -2368 -1456 -346 697 1191 2315 2335 1948 1495
1811 1495 1087 704 -93 -579 -828 -786 -1023 -603 -75 126 37 279 629 253 -47 -46 -144 -368 -363 92 130 416
1833 416 525 699 400 -41 -369 -539 -1318 -1660 -1319 -1377 -1181 -644 429 951 1340 1913 1952 1719 1599 1202
1853 1202 486 -592 -888 -866 -1433 -1631 -1016 -881 -719 -198 346 447 322 311 362 173 -444 -394 26 -277 236
1874 236 281 160 137 195 409 123 57 115 20 43 -388 37 195 -53 632 497 282 72 424 200 -109 -457
1896 -457 -550 -480 -1201 -1029 -578 -438 -346 -251 213 350 441 509 600 520 337 189 669 -114 -73 131 -141 -321 -27
1919 -27 254 -206 -50 162 325 -42 163 172 -130 -642 -297 -461 -766 -636 -739 -675 -668 -84 476 538 403 633
1941 633 828 340 293 315 499 -10 -33 -64 104 -90 -13 76 74 36 17 226 -143 -643 -98 -118 -398 -185 -42 122
1965 122 -80 23 333 290 -240 -284 -312 -661 -859 -598 -468 -272 269 903 1088 1235 1504 1342 982 622 118
1986 118 -107 -1138 -1044 -1250 -1524 -1427 -601 -486 -50 76 357 808 428 472 453 -100 -153 -68 98 151 -175 357
2008 357 132 479 280 143 -274 -144 -439 -496 -862 -500 -59 489 661 791 1170 1068 894 445 215 -618
2028 -618 -1097 -1633 -1878 -2036 -1890 -1092 -470 177 603 1681 1786 1761 1751 1242 819 80 -313 -367 -1004 -950 -433
2049 -433 -625 -150 -138 -23 243 -229 -26 -339 -575 -393 -444 -8 7 308 918 944 870 733 374 -80 -569 -1019
2071 -1019 -1437 -1581 -1641 -1096 -387 204 1269 1869 1885 2048 2304 1874 803 62 -650 -1236 -2137 -2228 -2153 -1459
2091 -1459 -1028 -444 -94 250 719 659 719 267 389 362 -59 -31 226 632 395 393 991 556 141 -293 -854 -1004
2113 -1004 -1616 -1330 -1023 -889 -237 401 1324 1469 1722 1849 1467 893 272 -623 -1354 -2111 -2098 -2151 -1762 -1311
2133 -1311 -141 276 1048 1720 1780 1935 1462 1341 813 187 -298 -454 -706 -592 -97 -193 -141 -108 -285 -236 -602
2154 -602 -966 -998 -1020 -901 -389 59 593 1148 1531 1653 1400 796 620 63 -1049 -1249 -1683 -1912 -1720 -1181
2174 -1181 -475 221 1054 1873 2138 1789 1544 1355 541 -198 -551 -1067 -1618 -1867 -1335 -1045 -523 -264 -253 357
2194 357 142 305 590 74 183 4 219 400 435 1185 1022 1095 803 735 315 -257 -706 -1221 -1628 -1655 -1092
2215 -1092 -864 -419 281 1052 1420 1573 1396 1267 851 140 -439 -1112 -1188 -1510 -1539 -1065 -611 16 389 863
2235 863 1087 1388 1166 609 718 429 315 -70 -147 133 -147 -217 238 13 -362 -384 -645 -666 -1078 -977 -928 -793
2257 -793 -474 138 627 1055 1044 1240 1348 830 319 158 -817 -951 -831 -1010 -899 -761 -206 67 710 1024
2277 1024 1023 975 723 397 229 -407 -780 -702 -950 -721 -597 -376 -181 -15 -213 39 -175 -54 -111 6 108
2298 108 176 377 231 456 769 1170 609 584 626 78 -186 -607 -678 -883 -1116 -1140 -453 -520 132 551 539 476 149
2321 149 358 -43 102 -237 -214 -414 -617 -310 -219 6 78 242 653 354 421 548 207 376 -37 -65 1 -202
2343 -202 -10 202 -186 -195 -201 6 -90 -379 -464 -233 -504 -394 -26 -248 -27 488 301 456 428 336 283 75 254
2366 254 45 49 -18 -270 157 -143 80 311 74 -72 6 14 -246 -27 -209 -361 -214 -316 -281 -582 -456 -198
2388 -198 -291 -50 -8 321 248 221 381 439 405 289 237 39 8 -180 -102 4 -291 158 -49 -208 202 181 306
2411 306 -84 -208 76 -294 -227 -597 -345 -357 -423 -255 -44 26 17 190 154 -92 80 119 329 67 301 269 392
2434 392 450 362 373 246 243 -69 -145 -487 -720 -458 -908 -831 -399 -42 13 180 286 652 333 375 266 -83 -409
2457 -409 -414 -574 -533 -409 -188 -5 1 367 591 739 523 655 291 -47 -133 -109 -443 -223 -286 -261 103 102 -129 -56
2481 -56 -108 -557 -496 -497 -831 -611 -269 197 88 703 666 1006 942 700 512 151 -321 -459 -782 -898 -1203 -658
2503 -658 -441 -393 257 344 554 567 528 821 197 -117 -180 -526 -752 -649 -426 -279 -485 -278 288 158 248 90
2525 90 5 95 103 309 440 432 568 715 726 543 673 478 -53 -288 -676 -789 -1321 -1288 -1096 -1034 -383 64 218
2548 218 565 890 1416 1008 671 601 144 -347 -654 -868 -753 -747 -341 -287 108 326 511 629 210 438 98
2569 98 88 26 -208 -188 55 33 111 -50 81 -113 -530 -395 -656 -1184 -903 -802 -634 -139 23 558 723 925
2591 925 1665 1121 1024 667 -105 -226 -583 -750 -1046 -932 -914 -252 -299 193 300 633 355 351 139 265 -141 -389
2613 -389 -322 -235 -349 -527 -102 -59 48 152 257 306 74 -82 -77 -79 46 285 419 484 511 685 294 537 408
2636 408 -390 -652 -640 -1039 -960 -1052 -884 -690 -465 72 268 847 581 844 577 728 222 147 128 -271 30 -404
2658 -404 86 157 203 310 570 164 16 47 -162 -239 21 -105 -192 -199 19 -37 -96 -17 154 -14 -132 -354 -128
2681 -128 -503 -529 -8 -128 -66 188 474 502 424 744 619 192 591 76 -71 -49 -373 -510 -453 -515 -123 -184 -477
2704 -477 -78 110 -204 -38 -224 10 -46 164 -38 132 -44 -194 -79 246 209 249 292 70 -31 259 296 39
2726 39 279 -3 105 87 -260 40 -238 -40 -44 -298 100 -47 -131 -132 -183 -246 -73 67 -222 116 96 89 381 34
2750 34 195 140 -30 42 136 -111 -91 78 -36 14 94 184 109 196 47 10 5 44 -50 -142 -467 -608 -579 -483 -353 -150
2776 -150 -184 49 91 292 650 463 670 507 42 223 -13 -132 -18 -239 -181 -35 -26 -43 160 242 160 118 -136
2799 -136 18 -301 -1 -114 -144 -207 -159 72 183 -212 136 -43 -459 43 -312 -219 -456 -159 203 144 234 607
2821 607 873 1104 702 194 331 -175 -359 -726 -811 -762 -762 -882 -364 -223 149 208 349 256 451 194 107 88 -29
2844 -29 -164 -149 -50 146 228 181 140 192 5 123 202 -111 -182 -272 -149 -149 228 300 341 532 414 119 77 65 -168
2869 -168 -659 -1012 -1110 -775 -532 -648 -217 312 585 441 1044 1024 509 633 355 154 -131 -361 -271 -396 -349
2890 -349 -221 -327 113 -8 19 -7 149 4 -328 -329 -270 1 -97 164 119 392 315 262 88 47 -685 -518 -628
2913 -628 -551 -664 -306 -34 403 660 857 846 880 723 477 154 -176 -473 -489 -742 -962 -841 -720 -418 -81
2934 -81 9 267 471 375 195 146 12 2 -256 11 89 101 168 229 213 203 168 -32 -117 -404 -641 -412 -362 -169 49
2959 49 265 333 558 458 391 401 63 -268 -445 -528 -883 -885 -1002 -417 -98 -62 268 714 619 708 941 584 637 301
2983 301 138 -284 -237 -108 -278 -42 -77 -110 -157 75 -38 89 -333 -466 -225 -440 -462 -141 139 -153 182 292
3005 292 289 203 258 45 -264 -301 -356 -42 -91 53 57 279 112 84 279 594 358 189 -84 -84 -500 -518 -419 -722 -535
3030 -535 -411 -224 -156 75 270 96 338 27 215 163 262 41 -148 -59 286 136 124 21 10 166 92 61 -103
3053 -103 -222 -116 -36 -141 -152 -407 -315 -81 88 35 21 -40 -18 -330 -72 -79 57 -127 157 28 80 295 291 247
3077 247 364 482 199 196 246 10 169 99 -115 -196 -12 -292 -231 -59 -252 -199 49 -203 79 -116 -276 -108
3099 -108 -262 -159 -391 -271 -112 -283 142 64 181 501 480 576 384 438 208 -73 -120 -83 -273 -251 -150 -183 -176
3122 -176 -323 -246 -123 -305 -181 -118 -25 -134 -266 -215 5 346 128 609 270 320 461 50 114 -347 -286 -240 -338
3145 -338 -87 -75 14 327 486 708 619 714 454 390 67 -109 -553 -791 -400 -806 -703 -515 163 -12 222 310
3167 310 250 103 418 263 79 -244 -146 -168 310 146 154 326 115 97 -170 -269 -314 -442 -533 -554 -546 -110 13 355
3191 355 166 517 529 361 189 234 13 -547 -637 -438 -847 -529 -375 -261 234 466 1052 792 569 875 698
3212 698 50 -104 -295 -325 -84 -220 -272 -205 -245 261 -460 63 -189 -274 -70 0 7 -224 451 191 204 608 793
3235 793 703 939 323 41 -293 -423 -631 -716 -705 -564 -261 -51 236 783 633 456 715 573 471 129 -274
3256 -274 -590 -910 -881 -763 -622 -407 -74 242 425 468 224 230 146 252 340 404 -10 282 95 434 47 187
3278 187 459 63 -164 -277 -739 -766 -669 -654 -240 -430 222 473 835 652 956 666 375 60 -122 -481 -523
3299 -523 -575 -875 -381 -348 -136 330 512 785 780 987 491 326 -85 -222 -390 -124 -174 -91 -393 -33 -121 -59 -258
3322 -258 -384 -141 -605 -150 -352 -329 -230 84 440 587 809 762 604 665 155 263 -155 -288 -575 -682 -1028
3343 -1028 -433 -431 -112 178 352 512 580 593 381 67 -95 -242 -485 -606 -534 -484 -201 -114 -56 336 353 138 130
3366 130 -27 40 -36 144 178 69 274 206 341 470 315 210 25 -471 -700 -701 -601 -816 -614 -148 -348 56
3388 56 79 476 722 521 330 362 326 -26 -362 -248 -179 -743 -424 -209 8 179 535 127 273 340 322 65
3410 65 100 -26 -144 -63 -240 20 -198 83 -224 -19 -25 -160 -408 -144 -449 -311 23 91 78 161 231 188 175 416
3434 416 234 163 106 -198 -65 -150 -279 -347 -239 -23 7 19 27 387 95 -44 198 -65 26 -308 -180 -272 -9
3457 -9 -213 106 96 -48 52 -106 -31 321 159 286 182 -18 325 -60 -79 -101 -252 53 -8 -83 15 -171 -119
3480 -119 -144 -233 -248 -93 -441 34 8 44 169 -112 -112 156 10 26 -37 57 139 17 -138 -8 122 125 189 -18 227
3505 227 90 114 310 -104 -126 -46 -104 -323 -143 -96 -204 -324 -233 -169 -15 26 229 98 -69 188 410 -33 187
3528 187 91 -113 6 -154 72 215 4 187 -76 131 225 203 -23 -97 44 -234 31 -48 60 47 -111 -273
3550 -273 -149 19 192 -323 -329 95 -168 -174 -117 36 347 227 113 567 281 414 345 -227 -37 -317 -242 -213 -497
3573 -497 -165 -147 -205 62 -1 168 208 -22 184 149 -30 -119 -8 6 -347 -248 -163 152 206 18 383 -140 310
3596 310 -5 -50 -109 127 -42 103 129 289 292 254 234 130 -144 -432 -369 -208 -474 -562 -506 -412 -376 213 -58 518
3620 518 402 524 514 452 277 170 -137 -109 -177 -153 -419 -311 -542 -205 90 221 186 81 -110 -108 160 148 -216
3643 -216 -383 -258 3 103 189 17 -109 -160 -173 -83 -222 -428 -355 -122 -33 95 39 346 426 679 455 837 287
3666 287 49 -271 -468 -706 -730 -913 -722 -338 110 -54 209 185 292 335 436 368 -179 9 -198 -156 -268 -79
3688 -79 -19 65 -150 143 35 -22 -47 -25 76 74 65 130 -24 254 250 319 314 121 493 -99 -344 -583 -315 -920 -693
3713 -693 -666 -446 -76 -121 616 498 582 556 624 384 607 20 -177 -343 -296 -538 -652 -11 -392 16 245 161
3735 161 128 305 -110 -124 -236 -141 -124 -2 -253 -135 283 265 426 130 -84 -53 -316 -529 -137 -238 -389 -13
3757 -13 427 264 468 687 431 833 619 158 122 -270 -217 -647 -516 -835 -284 -435 -292 44 49 290 396 146
3779 146 40 41 179 83 -12 129 100 46 158 293 259 385 -25 103 -182 -99 -158 -249 -428 -505 -170 116 411 229
3803 229 529 639 363 -258 -228 -183 -358 -478 -637 -780 4 -44 77 468 619 627 573 320 242 284 57 94 -242
3826 -242 -302 -170 60 -6 -187 2 -133 -110 -318 -142 -131 -386 -53 -290 29 -43 242 270 487 80 323 117
3848 117 -45 -143 -237 -113 -185 -156 -72 -81 116 440 536 557 555 289 237 131 107 -133 -518 -143 -282 -399 -148 -238 -217
3873 -217 -304 128 -63 86 304 203 -106 168 -64 -74 247 265 441 130 322 -20 39 -241 -283 -61 -244 -53
3895 -53 -231 -119 -44 91 41 280 -32 144 240 83 71 39 63 -414 -7 -217 -388 114 35 176 85 341 251
3918 251 102 219 68 241 195 -17 -11 -89 -44 13 -14 -55 -195 -138 -387 -177 -181 -259 -47 -156 -269 -187 86 -93
3942 -93 222 -251 262 190 107 51 364 78 4 188 -28 191 211 215 109 -289 -152 93 -36 -55 -327 -30 -167
3965 -167 -254 -108 -326 -390 -182 -32 -133 -79 237 -67 270 21 126 136 0 170 88 71 -36 277 135 85
3987 85 -109 66 -211 -202 174 157 61 129 -118 -215 -12 -128 -273 -128 -169 -145 -265 70 151 135 -77 218 35 73
4011 73 485 -156 -246 9 -10 41 37 -10 136 -171 -50 -153 -26 -128 -263 -93 -296 -166 -133 36 115 122 21 50
4035 50 -75 32 -106 -14 69 -189 -439 -112 -255 -22 -74 384 177 426 200 239 299 41 181 38 -397 -258
4057 -258 113 -266 -486 -85 -40 -87 48 137 -539 27 -186 -286 -134 -3 292 233 224 194 188 224 141 -102 115 -203
4081 -203 -324 -79 -130 -177 273 111 -13 -101 319 457 320 128 210 58 17 -276 -349 -555 -313 -364 -268 -130 -62
4104 -62 139 348 422 464 69 287 -90 -121 24 106 122 374 205 -26 78 -21 -127 -161 -100 -343 -95 -290 -277
4127 -277 -366 -7 -203 110 413 227 248 331 72 230 -153 -171 -303 -425 -443 -294 -224 237 75 172 370 324 483
4150 483 340 69 66 -94 -52 -351 -125 -238 -251 -33 -72 -189 -235 32 -156 -87 5 -67 -71 -143 -5 -77 337 162
4174 162 553 451 210 46 194 3 -253 -270 -105 -432 -16 -20 31 101 340 449 218 125 197 21 115 -259 -173
4197 -173 -353 -380 -379 -430 156 176 -118 -110 352 217 255 -110 189 -164 -42 -30 187 163 283 89 -133 -60 -85 -193
4221 -193 -539 -164 95 -279 -363 -240 107 122 328 152 318 41 339 38 -179 -7 -144 -109 -151 -235 10 -51
4243 -51 -138 182 45 347 179 264 46 109 34 -117 77 -399 -99 -67 -31 -92 -195 7 -201 -223 123 -239 -23
4266 -23 214 26 -55 178 131 277 116 8 182 25 361 244 3 -96 -30 -42 -33 -183 132 -195 52 -96 58
4289 58 -94 -169 -164 -299 -8 -423 140 -156 31 14 -277 -121 -14 -78 30 221 85 298 123 194 37 7 -36
4312 -36 -22 222 -26 138 -282 67 220 99 38 -65 112 -159 173 120 87 187 -53 -200 -170 -211 135 -82
4334 -82 74 -65 64 243 210 180 75 152 409 -10 241 160 -60 49 150 162 -198 -168 -383 -158 12 -20 -410
4357 -410 -82 38 -112 -9 -13 313 286 220 50 179 282 53 -65 -71 -245 -335 44 51 43 -7 193 88 322 79
4381 79 60 145 -57 -239 -132 63 -119 12 5 -220 -138 -36 133 -158 128 18 27 219 -139 75 0 293 285 279
4405 279 415 134 264 70 -27 -102 -223 -267 -218 -147 -177 -146 -81 13 113 132 218 231 4 -162 -387 104 -226 111
4429 111 -42 -216 -243 83 284 -6 247 87 -80 66 65 119 -261 20 122 175 -61 -129 64 -132 -172 84
4451 84 -355 -400 -314 -524 -366 -250 -133 -81 106 354 311 539 233 209 35 47 13 -152 1 -244 -169 219 -90
4474 -90 70 -78 39 186 111 315 218 -103 -52 -73 24 42 193 -221 -64 -36 -268 -84 -137 190 79 -106 -284
4497 -284 -167 113 343 436 153 231 141 224 297 105 127 -228 -514 -22 -288 -462 -155 -354 -64 4 68 187 217
4520 217 110 230 64 -55 -161 -29 48 -60 -226 174 -242 -95 3 -24 -24 146 211 266 20 -57 72 76 -27
4543 -27 122 222 -49 -75 -249 125 -73 -234 -98 -421 -469 -133 -128 -90 133 320 171 223 21 256 88 58 -9
4566 -9 -138 -24 -66 -60 11 -209 70 44 -82 -68 153 -10 -251 39 -252 -23 -17 -237 -70 27 -246 40 -10 -17 -122
4591 -122 -78 -189 -90 143 -45 -181 219 -310 19 54 -138 50 188 124 -90 6 24 59 -190 -268 -332 -317 -192
4614 -192 -199 9 -33 157 -19 90 196 94 143 -144 -152 -64 -162 142 141 165 -23 102 303 24 289 261 264 -42 36
4639 36 98 -159 -55 -110 -119 31 -174 -77 -207 121 -336 -54 -93 20 13 -60 -13 -139 95 -16 172 -71 -203 27
4663 27 120 163 168 232 183 -88 -12 -127 -299 81 -36 109 -53 -217 -21 149 -270 -180 34 1 -358 -225 -155 -226
4687 -226 -47 244 3 272 48 155 8 -36 73 90 -37 59 -83 -491 -410 92 15 -149 -17 -39 120 -30
4709 -30 294 252 -83 -258 -61 69 38 59 182 -215 -93 -33 54 -51 117 -91 -67 225 -121 -103 102 105 249
4732 249 433 148 276 365 279 35 -36 -77 -387 -504 -534 -193 -341 -144 -190 -76 -21 116 283 136 197 35 70
4755 70 274 40 -232 -33 176 -48 106 9 242 207 89 -105 -17 -162 -146 -174 51 369 259 -45 -117 -119 51
4778 51 -21 -136 -16 -478 -243 -531 -116 12 -36 -39 173 139 543 497 446 187 441 470 62 -149 -142 -239 -344 -200
4802 -200 -303 -268 -170 116 80 -78 92 88 80 -93 12 41 35 40 68 22 60 315 149 22 141 -282 -397 -113 -66
4827 -66 -77 136 186 145 206 476 502 260 365 -81 -364 -317 -375 -505 -502 -421 -301 -203 -127 -62 192 72 526 362 88
4852 88 199 22 -28 -202 41 80 93 173 34 -9 -134 -107 -32 -158 -9 -99 -146 -107 -106 -126 270 318 302 28 125 116
4878 116 -106 -308 -292 -395 -561 -131 -121 -117 53 222 81 591 592 474 388 316 -48 -137 -96 -243 -247 -267 -236 -184 -61
4903 -61 -54 140 -194 -159 -83 -117 -130 -162 -28 -106 7 259 253 236 338 406 165 55 -180 -33 -222 -436 -174 168
4927 168 -127 309 100 451 258 229 42 -75 -214 33 -155 -306 -363 -175 -213 -479 -20 -102 -13 264 169 224
4949 224 283 180 142 39 -237 -185 14 63 1 -135 204 94 256 -330 22 -174 -144 -308 20 -246 -223 95
4971 95 51 1 -158 297 172 66 -33 74 -222 -140 -342 -246 -52 157 72 429 163 107 424 312 176 69 -4
4994 -4 -38 11 -284 -202 -224 -211 -308 -257 167 86 -30 -120 -33 178 -40 -99 -276 94 149 -18 -21 74 165 81 40 143 8
5021 8 -254 -136 -143 -105 86 -170 -58 408 23 135 77 -43 -137 6 -19 -26 -126 -174 -86 109 -17 4 569 89
5045 89 86 326 -84 75 79 22 -44 95 -77 -6 204 -54 78 91 130 -274 51 6 -230 20 -145 -49 -42 -128 -90
5070 -90 -171 6 -117 253 -105 139 31 38 44 401 69 143 -52 212 287 -154 77 2 24 45 -10 62 47 36 -271
5095 -271 149 -228 -164 98 -57 -114 -7 35 -324 193 133 211 -76 104 140 315 -40 89 118 -296 19 -130
5117 -130 -97 278 222 73 323 -127 233 154 -314 -129 -153 60 -316 -286 -88 -150 67 212 98 -305 -256 159
5139 159 24 11 44 -95 159 -41 267 97 111 254 -106 60 -103 -186 -230 33 -78 -117 -367 7 158 171
5161 171 -140 110 92 261 160 -123 -159 -129 -300 -111 -143 -72 -194 -209 -225 254 130 326 267 -24 107 19 -68
5184 -68 54 -216 -117 -38 -59 106 -351 -35 -158 53 -28 -200 -178 -64 -248 75 -23 239 -19 124 295 342 330
5207 330 305 130 -227 -155 -224 -197 -171 -388 -97 90 79 282 679 343 400 195 -263 -163 43 -106 -268 -296 48
5230 48 -47 -162 157 -159 -42 -141 -166 -37 63 125 -6 395 82 275 332 357 243 216 306 -81 22 57 -266
5253 -266 -163 -490 -295 -59 37 133 121 268 378 446 170 188 137 -269 -95 -406 -136 -302 -234 -113 -144 92 295
5276 295 122 71 209 221 -102 53 -34 219 -65 88 263 -69 185 26 -68 -249 39 -341 -434 -646 -273 -205
5298 -205 37 -136 45 283 398 476 485 258 161 -1 -11 -162 -182 -124 -147 90 -299 53 167 158 208 149 198 -61
5322 -61 54 -107 28 65 -112 5 144 -37 116 121 -256 -243 -173 -40 -284 59 13 -7 132 179 164 277 412
5345 412 248 366 313 96 -120 -388 -525 -380 -418 -261 -286 -104 18 130 114 81 273 251 15 -117 -190 111
5367 111 -44 182 -152 -73 38 -97 165 -92 170 -46 30 262 126 -90 -94 494 252 137 376 116 145 17
5389 17 -154 -126 -240 -115 -169 -366 -177 -127 180 142 70 438 386 339 135 178 91 -52 -94 -117 -213 -149 -119 -232 -215
5414 -215 -100 174 -132 -99 -130 62 -25 -60 -278 21 45 85 -170 -81 -123 152 267 260 34 -180 4 55 -29 -273
5438 -273 25 115 191 60 408 173 185 138 136 27 70 -164 -8 -313 -114 -75 -294 -176 -332 93 -14 -14 82 71
5462 71 170 41 -74 93 -47 255 63 181 -26 -13 141 -232 103 -61 -150 48 -112 21 117 -155 44 -30
5484 -30 -103 -146 204 -62 196 -30 -117 -110 -24 -162 135 -110 -122 -135 224 -38 32 116 78 50 -83 28 -75 -45 106
5509 106 80 -102 305 -205 21 56 -104 -61 138 86 -238 -62 63 -93 -197 -67 -182 32 -41 215 -105 -47
5531 -47 -157 126 -30 19 130 -39 116 2 -103 -30 189 -125 -26 -235 -59 -43 29 -205 -4 -85 -17 236 -230
5554 -230 -5 305 266 40 -112 90 -327 -30 -104 -212 54 -158 -17 -26 133 144 -4 90 33 -118 -123 162 52
5577 52 -37 -142 -145 -158 -247 -63 1 9 -151 35 49 263 -94 175 116 511 85 -60 -129 111 -40 165 202 -218
5601 -218 69 -259 -103 -112 0 98 81 -197 -28 -231 29 -204 56 111 101 281 449 214 87 65 -287 -231 -160
5624 -160 -243 -166 -33 -95 78 147 214 294 170 256 230 130 164 -145 -65 -345 -320 -12 -539 15 -91 252 -69 51
5648 51 242 -30 5 -14 144 -204 1 46 159 55 17 293 392 172 -271 16 -15 79 -24 61 -4 76 116 51
5672 51 187 173 451 37 208 233 314 -255 -283 -307 -439 -316 -224 -303 -74 222 17 166 161 99 231 45 42 141 -201
5697 -201 -294 -41 142 -50 11 87 -16 -93 129 -3 -149 -74 -173 -212 163 34 25 195 23 429 238 90 -396
5720 -396 -201 -163 -354 -305 -547 30 -146 -33 30 185 152 378 511 302 313 186 -116 -146 -283 -308 -57 -70 -227
5743 -227 141 165 82 99 -77 64 174 297 -38 -71 94 162 5 155 36 121 176 207 18 118 -140 -333 -199
5766 -199 57 -407 -121 -18 284 185 112 160 293 36 -133 -93 -258 -420 31 -204 -65 -302 -121 64 -73
5787 -73 206 108 240 42 -28 -106 -46 171 -96 -91 -49 -67 -5 108 84 142 -21 -71 -146 -93 27 -163 -152 -124 85 -7
5813 -7 131 507 -137 271 155 -14 17 1 -254 -277 -105 14 -47 0 378 -43 78 229 186 193 -5 29 7 -230
5837 -230 -17 -250 -337 132 -50 78 -137 -196 32 37 23 134 -90 -113 -79 -200 198 72 66 206 188 160 262 -13
5861 -13 -76 114 -133 -335 -123 -144 80 -296 -183 -29 11 232 -51 69 -137 -117 95 -289 -21 -380 -309 9
5883 9 22 85 62 118 -105 -31 197 33 -79 11 -58 123 214 63 -101 -222 134 129 322 47 5 -110 101 42 301
5908 301 -62 -44 34 15 72 32 83 -17 222 -20 -76 14 160 -198 138 -60 10 -99 158 -1 -48 108 -102
5931 -102 -158 -48 74 20 -53 -204 -31 -153 81 206 -46 -310 -78 -16 -195 151 24 200 159 26 -5 -307
5953 -307 56 -51 -256 -254 -112 181 172 59 119 50 138 -91 -17 -32 -136 -10 -242 -278 -220 -119 -56 -22 -58 -5 -37
5978 -37 -69 208 84 -35 84 -86 -191 157 64 254 -117 89 54 -20 140 50 -464 35 -86 15 -126 143
6000 143 -230 105 82 309 204 -51 -159 -86 -53 79 -299 -191 -186 26 -128 -289 -140 190 227 318 461 122
6022 122 -171 -17 -76 -199 -95 231 -139 -72 27 160 -2 -148 33 121 -90 -175 -401 62 -277 148 -17 274
6044 274 52 152 389 144 8 -217 -226 -263 -316 -315 -76 -234 -85 -120 79 378 445 196 418 -42 13 70 -24 -224
6068 -224 -103 -308 -98 -359 -117 181 123 -277 -246 -18 256 177 -281 156 30 88 276 -88 -23 428 128 250
6090 250 136 -130 -355 -196 -135 -219 76 -294 140 142 -13 293 82 247 220 69 -38 -126 -234 -423 -73 -148
6112 -148 -271 140 57 -145 87 310 48 412 -42 211 41 392 243 -137 -70 4 -142 25 118 -134 -65 -22
6134 -22 -296 -277 -384 -176 -332 -248 -129 13 207 115 52 226 55 -35 238 38 -399 -189 6 -344 97 111
6156 111 -141 138 -57 373 262 1 -64 34 -279 -110 -219 -119 83 -76 -235 179 75 -170 9 40 76
6177 76 -237 42 77 -214 125 220 134 232 283 21 68 238 90 15 -101 228 -81 -171 -171 60 -128 109 -59 -142
6201 -142 -132 2 125 216 98 -205 225 -22 152 -72 145 84 -17 24 236 425 71 175 383 -4 140
6222 140 233 -184 -93 -187 39 158 275 221 -434 61 224 -80 -163 15 -241 146 -205 -34 24 -133 244 5
6244 5 10 -18 -248 -253 -83 -125 -54 306 -20 242 56 -44 101 129 28 91 23 -281 -272 -31 -37 -90 -2 -209 -97 -79
6270 -79 163 -156 168 67 100 135 -1 199 -139 388 -200 185 188 -250 73 -92 79 -151 121 93 -91 13
6292 13 246 -145 39 -80 -221 42 138 -100 -273 -175 45 -65 -129 2 57 62 -65 -48 4 51 45 68 -194 207
6316 207 -15 66 68 -176 112 -423 -26 -316 -318 -182 82 -148 80 -76 -49 106 208 86 237 77 170 -96
6338 -96 -137 -168 123 -197 -142 43 -358 -94 81 221 420 269 78 176 60 10 -205 -83 71 -142 -50 22 -97
6361 -97 10 22 -88 -137 51 -40 2 28 19 8 44 -46 473 238 152 130 -83 -70 15 99 -384 -333 -192 -267 -324 32
6387 32 -75 157 359 263 185 52 100 106 105 -196 -176 -142 -2 -234 -54 -210 87 -1 44 230 45 106 168 -67 -6
6412 -6 81 188 85 62 174 56 105 -108 -108 -298 -250 -228 -283 -350 -240 -4 -20 186 199 156 352 272 160 210 187 90
6438 90 -13 -376 -109 -284 -44 -110 -53 -21 -48 -230 123 69 -60 7 155 -49 142 -64 -353 214 -1 107
6460 107 111 -43 56 -218 -459 -257 -347 -24 -140 -171 256 167 64 437 1 485 353 -156 -232 -54 -346 -130
6482 -130 -61 -333 -212 86 244 52 13 225 -110 -19 -71 124 -95 136 151 -27 -160 114 123 -46 28 -189 -32
6505 -32 -271 -81 -145 60 206 183 -23 -67 -7 192 -12 212 13 -206 -87 -124 -334 -364 -221 -186 161 38 42
6528 42 36 52 55 151 276 57 62 -119 -281 -193 -182 -74 -87 -19 44 22 -80 7 -209 -171 -26 56 73 -134 117 -125
6554 -125 61 -130 36 -5 -160 314 -295 -98 -307 -150 -280 -177 -107 126 25 264 546 -20 63 301 152
6575 152 10 35 -53 -270 83 -96 -191 -25 -454 -144 42 -147 -185 5 37 180 -194 -125 132 92 -3 194 -14
6598 -14 -36 174 215 134 178 -398 -240 -6 61 -238 -114 151 -78 26 40 69 240 133 35 2 -24 68 -336 -64
6622 -64 -180 50 -182 -217 -106 74 55 44 141 70 -88 11 -33 -12 322 -53 185 -108 90 -7 245 -247 129
6645 129 101 -140 -4 102 117 -9 -35 -123 185 157 -12 49 2 -142 -4 -26 63 -210 -262 -356 140 -345 -183 201
6669 201 -15 -59 -152 189 -219 17 -103 -221 60 -1 -139 -37 -59 -151 61 -322 -98 -278 -239 78 -215 -47
6691 -47 155 -113 -44 230 202 205 -92 8 113 -80 356 -30 -54 97 208 22 100 -125 -39 -191 -210 -245 52
6714 52 77 -158 135 105 72 24 -373 123 -56 179 -193 -53 88 -18 -41 11 -153 279 -81 119 -23 9 170
6737 170 4 -113 55 91 -19 66 189 269 189 225 76 -1 66 -96 -259 7 -157 43 -176 142 35 146
6759 146 216 170 13 88 110 85 -90 104 -363 326 82 -183 203 4 -176 92 340 -291 -169 82 -188 -271
6781 -271 -172 -127 83 -247 -37 34 -157 123 16 -86 -66 -203 -338 -17 -225 -99 -204 -111 212 39 112 16
6803 16 173 -128 23 -42 -34 -304 -132 -333 -191 -269 -7 -92 -43 176 -33 100 138 -163 -48 -32 49 -99 240
6826 240 203 184 60 180 -30 29 -137 213 -199 -211 -109 33 -133 165 22 -117 87 -13 156 185 24 -27
6848 -27 -48 -238 1 -169 -251 -162 -133 -150 -21 276 -15 129 279 193 288 71 -257 60 -83 -79 239 -22 -82 -168
6872 -168 -307 -39 93 -74 -146 -82 68 -143 9 -350 117 118 50 244 195 158 63 124 29 -201 -475 -84 -246
6895 -246 -112 -344 -36 38 78 233 141 213 -101 219 146 35 -35 -50 -264 -250 -181 -245 251 47 -35 195 55 16
6919 16 8 99 63 -56 -105 156 82 499 -34 36 77 371 150 -98 14 -201 -364 -92 -164 -243 -119 175 88 59
6943 59 181 88 234 -100 105 -162 -368 -347 -261 -262 -8 -75 -255 246 210 172 189 147 198 11 55 -190 -267 188 158
6968 158 -153 22 56 -3 245 18 -224 -289 -304 -251 74 -30 42 173 -87 46 223 -21 325 33 37 -18 130
6991 130 -185 -511 -227 -137 51 282 78 270 181 112 105 8 20 248 21 -243 -159 -142 -8 -96 134 -51 -23 8
7015 8 -58 -68 -176 -52 162 161 31 -57 -20 197 169 190 387 292 -93 148 -18 -36 -70 -169 -42 -63 -113 92 228
7040 228 98 45 212 228 -26 -17 -136 -18 11 -178 67 180 61 -355 25 69 -207 80 179 136 44 83 51 -226
7064 -226 129 268 -86 183 84 -33 24 88 -242 -217 -255 -187 -174 -59 -225 54 -129 92 -33 -4 130 52 -187
7087 -187 44 -135 81 -67 -149 147 50 -82 -16 170 -12 35 -171 91 -135 -170 -21 -79 203 -33 -33 136 -102
7110 -102 -1 -17 169 189 23 156 63 364 76 213 133 20 -134 3 18 -108 -107 -156 27 21 -38 -11 91 67
7134 67 -16 -126 -97 -142 -95 197 82 4 -109 -10 74 6 206 -27 22 121 39 138 96 81 86 131 121 152 -4 86 63
7161 63 -28 -95 -245 38 -149 -160 -319 -73 101 -23 8 79 -220 133 336 -21 -76 24 -45 -131 57 53 -137 45
7185 45 167 68 -118 142 53 -25 38 61 61 -338 72 -240 -80 -149 107 -134 150 -65 -8 71 75 -190 -163 -4 -51
7210 -51 130 -93 231 30 208 31 271 231 2 -32 51 -120 -276 -242 -274 -43 -30 359 41 316 104 74 134
7233 134 -61 60 -114 -61 94 -223 -63 10 -164 -56 9 -207 202 3 26 38 -103 -198 213 158 130 247 55
7256 55 41 -34 135 -241 -174 -188 -80 -276 -290 -10 -78 -211 13 -67 17 166 404 50 5 99 62 61 -272 -279 -75
7281 -75 -199 150 -216 131 -46 50 116 120 66 190 164 -121 68 -150 -181 29 12 -173 59 -94 36 -70 121
7304 121 -433 -336 -62 -213 79 -6 159 63 -92 379 81 208 107 149 -231 -379 -124 -350 -343 -114 12 -134
7326 -134 7 94 -76 -50 455 87 45 -89 179 92 -30 -138 293 -15 -123 54 -66 43 -97 117 -20
7347 -20 -72 -290 91 13 26 -10 222 300 318 178 129 170 -90 -348 -160 -131 -230 -264 -86 65 18 106 360 257 115
7372 115 76 165 -78 39 -64 75 173 -21 23 -88 290 -78 -197 341 136 -74 87 -71 -133 -153 -96 -102 -1
7395 -1 -65 41 -38 -12 74 -4 -25 -42 -188 -243 -278 -156 -56 181 -92 244 193 48 166 343 -161 62 18 -104
7419 -104 -248 -231 71 -213 150 9 -13 146 -323 156 -162 38 -206 -24 -67 16 49 -24 26 -315 105 -113
7441 -113 -24 6 -101 -206 347 111 117 -240 -41 74 236 111 183 81 -94 -7 -127 129 -196 -290 -82 -230
7463 -230 -62 -210 99 -141 52 -33 91 184 176 206 12 -40 -20 -69 314 164 -20 -228 55 4 348 -114 -175
7486 -175 -37 -177 -2 -6 -64 107 88 -2 156 -115 160 129 182 86 112 25 -51 264 -11 107 104 -1 112 241
7510 241 -154 135 94 -225 91 94 41 109 -111 -10 132 105 -84 -74 -163 121 -117 -54 14 -255 125 77 -192 196
7534 196 -37 127 -89 -197 85 17 214 162 5 60 115 107 462 42 -8 -50 -274 16 -77 -16 82 -111 -137 155
7558 155 246 -62 -111 -4 -25 -60 -78 11 31 2 -92 -83 -137 126 -8 -15 72 132 33 14 -186 140 -53 39 -32 13 34
7585 34 64 52 -283 -75 -31 -99 -183 26 15 -294 -46 -216 -252 84 52 216 18 6 27 -40 -106 85 -246 136
7609 136 -3 -99 123 -153 -133 42 -21 68 29 -235 36 112 97 184 14 -123 -114 4 43 238 -188 -166 209 107
7633 107 -77 51 -272 181 -45 17 33 297 165 275 313 276 325 142 -52 -264 -410 -347 -8 -184 -260 36
7655 36 4 195 151 -73 310 170 14 104 46 28 -228 -153 -31 10 44 85 -176 255 42 17 178 -2 -266 -176
7679 -176 125 9 -145 311 -95 90 109 -42 -116 -38 -84 97 -289 -230 -218 7 120 -30 129 280 -199 94
7701 94 53 94 -79 -67 -18 -27 -145 -18 -156 -9 -78 35 -222 -95 -12 -74 142 16 87 -200 -70 111 -188 -9
7725 -9 -183 128 2 -40 104 -119 -13 -9 -158 0 -49 43 46 -29 164 82 212 106 24 -107 -145 -97 245 -160 -185
7750 -185 60 -346 -217 152 -161 138 -73 2 -42 62 223 3 116 10 142 63 44 -137 -78 -89 -136 89
7772 89 29 31 37 -8 13 17 74 -57 -292 46 29 51 -62 -38 170 -198 99 -166 230 -177 -74 182 -27 148 36
7797 36 113 115 153 69 -124 49 7 70 -104 16 -107 -116 -42 -15 118 -161 -163 -155 -73 98 -126 97 144 -65 -241 14
7823 14 -33 11 13 199 170 -27 332 141 74 -120 203 -101 30 405 -29 -99 -21 29 -12 -1 240 48 -228 -125
7847 -125 91 -176 -162 -193 -215 -81 65 -68 170 79 149 -24 -18 -193 163 -197 128 59 89 -175 -119 -143 -29 -82
7871 -82 -126 153 -4 -129 -173 138 59 200 -41 -140 -89 -50 -57 283 -164 -258 -32 6 -92 -163 -178 197 174 355 150
7896 150 143 -126 -147 286 186 -256 72 -71 155 -147 -82 -14 -238 -213 -337 -116 -144 -284 -123 8 35 -18 -247
7919 -247 -90 8 123 -208 -44 385 155 202 53 -20 55 -90 50 -108 -110 -181 15 97 -151 -89 -56 -166 -88 130
7943 130 -290 13 304 -220 -99 -145 -191 166 -174 145 -77 -15 9 129 84 295 -67 61 -56 -62 -45 48 -2
7966 -2 -30 78 92 42 16 66 -81 -94 -50 -29 -97 -134 223 -35 -42 -204 -436 -229 -3 -236 -79 36 -138 98 -5
7991 -5 -101 44 -106 197 176 97 16 -73 -117 63 -42 56 241 -216 173 -122 -161 -1 -53 37 -34 180 -5 -148
8015 -148 380 175 -18 56 -84 40 -23 -229 54 -63 -4 306 -29 150 -92 -150 147 148 14 -34 84 -94
8037 -94 -51 -227 -166 -141 -78 14 8 43 -90 -112 -165 -49 -99 -232 186 122 -62 -54 71 208 34 314 69 -48 60
8062 60 -141 56 -171 -90 -3 136 27 191 94 -81 41 -40 55 57 -180 -162 133 -95 -15 -4 158 -9 -45 155
8086 155 25 -4 -194 38 24 -44 155 37 311 -13 339 288 348 -109 236 -32 158 -52 245 -96 -71 -266
8108 -266 -195 6 162 34 -192 167 -61 297 -100 247 -55 -146 119 65 12 -116 69 -118 -60 129 220 127
8130 127 223 -227 0 -35 7 252 -8 48 48 198 73 -85 -93 -42 -299 70 86 -255 -13 -26 -186 34 300 115
8154 115 146 108 -16 83 -60 227 -362 -97 -50 2 -207 40 -36 -408 238 117 -115 231 -24 211 116 -366
8176 -366 -33 -137 -130 1 20 106 -19 -198 -41 -257 -81 -93 105 102 257
8191B57
$$ Imaginary data points
##PAGE= N=2
##DATA TABLE= (X++(I..I)), XYDATA
0 0 0 0 0 0 0 0 0 0 0 0 0 0 0 0 0 0 0 0 0 -1 8 -8 8 -8 8 -8 14 -16 16 -17 22 -24 30 -32 36 -40 46 -50 57 -63 71
41 71 -79 87 -95 105 -119 129 -143 157 -175 191 -212 232 -257 285 -316 349 -390 436 -490 556 -636
62 -636 740 -872 1055 -1324 1750 -2559 4606 -22094 -23412 31161 50602 56127 61071 67303 50396
77 50396 27684 15357 5161 -20765 -34051 -30987 -28845 -29592 -19678 -2753 5933 3326 10369 14552
91 14552 3364 -5282 -2257 -1162 -4897 -1824 12729 19494 16581 21582 25893 13072 -2682 -10335
105 -10335 -20220 -38120 -47012 -37952 -31417 -27044 -5699 19690 32332 41472 52828 56438 41744
118 41744 23801 13842 -5017 -30074 -40784 -40808 -42748 -42395 -28556 -9132 -1317 5533 20642 25090
132 25090 17223 14154 14080 7189 -3607 -3849 2030 -1230 -2257 7047 10285 4894 1265 1928 -3584 -16791
148 -16791 -19167 -14445 -17677 -16239 -2470 9878 15272 21808 32751 34355 22567 14873 9899 -7843
162 -7843 -25024 -30215 -32208 -37150 -35498 -19862 -6449 -1292 11812 26933 29011 25162 25096 22527
176 22527 11281 -775 -2135 -5056 -13634 -13312 -6356 -5027 -6427 -2851 2850 -483 -6623 -3954 -3394
191 -3394 -9462 -9284 -2551 1160 1157 6471 15712 14733 9160 11550 8584 -2399 -9536 -10689 -13557 -20052
207 -20052 -17301 -7313 -4234 -1133 10107 18452 18190 16918 19068 16409 4962 -1893 -2597 -9998 -17532
222 -17532 -15517 -11497 -11342 -11250 -3214 2912 106 1523 7358 5666 818 1363 4008 1722 -1927 2643
238 2643 6552 2064 1977 6170 5008 -176 -1578 330 -3428 -8624 -4984 -1935 -5103 -3714 2448 4928
254 4928 2443 3120 7426 4513 -1966 -535 -255 -6359 -8828 -5346 -3771 -6160 -5114 2243 3531 987
270 987 5390 9166 5973 3246 5356 5934 273 -2171 963 -861 -5040 -3343 -119 -1261 -3723 -584
286 -584 2820 -1041 -2123 2334 1273 -2643 -2389 -331 -1956 -5654 -3346 59 -3199 -3124 2124 3175
302 3175 1369 3530 7215 5908 2135 3740 5360 182 -2258 195 -181 -3592 -4058 -176 -201 -4085
318 -4085 -1823 1250 -1846 -4359 -1475 -220 -3278 -3658 1319 2295 -229 2951 6615 4362 1634 2406
334 2406 2319 -2706 -6118 -3569 -4327 -7558 -4356 1016 2280 3621 7940 11938 9582 6672 7691 3989
350 3989 -3655 -6772 -7549 -10645 -13902 -11477 -6392 -6247 -4582 2952 6021 4390 5873 8462 6633 1884
366 1884 1562 3636 -150 -1977 1968 3051 1428 866 2926 1912 -3354 -4537 -3277 -7287 -9831 -6373
382 -6373 -2660 -2116 460 7175 10570 8785 9476 10492 5113 -1592 -4917 -7653 -13156 -16074 -12429 -9603
398 -9603 -8506 -1895 6241 9778 11291 14685 16323 11670 6400 5214 1288 -5727 -7495 -6148 -6845
413 -6845 -8538 -5302 -482 -1542 -3599 -37 -64 -3855 -4671 -2139 -1406 -2404 871 6716 7323 7532 10909
430 10909 10818 6285 1634 -971 -5115 -11622 -14123 -11715 -11574 -9840 -2574 4523 8326 11080 15851 17041
446 17041 11820 7947 5484 -2191 -9326 -11787 -12533 -14312 -14112 -8293 -2895 -2134 1622 6904 6805 4566
462 4566 5134 5613 2569 -560 1797 3819 1819 2931 6174 5904 2946 1137 604 -4101 -10262 -10512
478 -10512 -10476 -12510 -10783 -4576 943 3754 8588 14730 14900 11502 10457 7158 -766 -7073 -10136 -12295
494 -12295 -15887 -14600 -8426 -4577 -1561 5326 10930 11490 10935 11594 9992 3817 490 242 -3046 -6489
510 -6489 -4775 -2332 -2862 -3553 -1218 381 -3396 -5166 -3624 -5345 -7145 -5504 -1618 444 2229 7623
526 7623 12117 11166 10650 11434 7828 1350 -3325 -5876 -10179 -14423 -12691 -8754 -7567 -3441 3213 7911
542 7911 9202 10299 12163 9514 3566 1352 -1034 -6545 -9338 -8161 -6828 -7212 -5396 -482 1019
557 1019 38 2234 4010 1661 -59 739 1933 614 768 5005 6053 4473 5920 6803 3704 -379
573 -379 -2135 -3824 -8878 -11541 -9564 -8403 -8309 -4168 1234 4785 5801 8999 11206 8405 5117 4065
589 4065 330 -4400 -6714 -6128 -6385 -7472 -4034 10 831 2347 5471 6374 4328 3131 3533 2114
605 2114 -1539 -1476 103 -1528 -2134 208 954 -666 -1875 -610 -1644 -5265 -4851 -3601 -4414 -4310 -1372
622 -1372 2146 2905 4361 8003 8555 6080 5286 4856 1769 -2241 -3874 -4157 -6183 -7064 -4229 -2194 -1908
639 -1908 194 3375 4125 3020 3168 3636 863 -1485 -1133 -1515 -3892 -3377 -1436 -870 -1760 -276 2041
656 2041 597 -121 1416 1631 -64 -410 1387 1823 187 1706 3746 2600 1304 2152 1833 -575 -2588
673 -2588 -2084 -2510 -4969 -4913 -2486 -2751 -2532 -265 1856 1447 1140 3294 3425 830 407 1394 155 -1491
691 -1491 -957 108 -750 -1161 898 2024 361 843 1900 1527 26 -365 1128 -504 -2305 -548 -413
708 -413 -2433 -2138 -490 -421 -1625 -1268 809 -82 -1061 405 1463 -142 -167 1185 1816 182 278 2138
726 2138 978 -78 1050 1756 472 -300 574 930 -755 -1092 496 -274 -1550 -1060 53 -675 -1792
743 -1792 -336 507 -1454 -1485 94 -688 -1762 -1291 94 -298 -871 1420 2757 1866 2299 3673 3453 1718
761 1718 967 1263 -463 -2974 -2469 -1767 -3361 -3255 -995 79 -681 239 2803 2100 651 1277 1577 -534
779 -534 -1825 -1337 -1167 -2462 -2283 -105 -19 -341 795 2294 1438 847 1370 1711 167 -297 1368 1194
797 1194 267 1405 2392 1298 237 345 131 -2481 -3978 -2988 -3975 -5369 -4085 -1711 -664 45 2781
814 2781 5080 4421 4248 5254 3594 904 -399 -1065 -2458 -4383 -3448 -1790 -1955 -1146 951 2313 1934
831 1934 1703 2912 2207 -261 -372 295 -1259 -2022 -998 -306 -855 -980 288 311 -1572 -1513 -1240 -2106 -3196
850 -3196 -1886 -401 -294 1033 4103 5161 4635 5373 5827 3759 997 -308 -1558 -4669 -6331 -5273
866 -5273 -5125 -5088 -2964 94 1700 1940 3458 4660 3145 1676 1822 518 -1565 -2251 -1590 -1444 -2207
883 -2207 -1077 1078 579 174 1265 1191 -429 -910 -309 13 -893 259 2379 1986 2276 3560 3618 1946
901 1946 -143 -520 -2400 -5400 -5874 -5403 -5399 -5152 -2608 496 1975 3275 5986 6902 5060 4647 3961 1710
919 1710 -1157 -2645 -2314 -3669 -4174 -2513 -971 -898 124 1977 1999 758 654 910 -424 -1191 -615 -44
937 -44 -397 -33 1493 1552 466 328 867 -685 -2706 -2630 -2642 -3413 -2847 -700 507 1522 3386 5771 5683
956 5683 4737 4723 3475 976 -1781 -2442 -3368 -5507 -5369 -3823 -3282 -2388 -523 1473 2082 1681 2837 3049
974 3049 917 294 678 -88 -1114 -580 282 379 -343 735 1472 -93 -336 -262 -870 -1824 -1693 -383 -194
993 -194 -498 1597 2980 2112 2233 2647 1736 -298 -1753 -1764 -3454 -4983 -4129 -2961 -2972 -1857 577 2484
1011 2484 2255 2950 4346 3393 2354 2095 1779 -272 -1498 -1095 -686 -1971 -1448 -13 -234 -618 -249 559
1029 559 -281 -1281 -669 -482 -1183 -1212 202 561 126 692 1611 1202 170 358 414 -1035 -1418 -879 -1210
1048 -1210 -1324 -445 872 1528 1007 2475 2944 1705 1229 1139 667 -1102 -2075 -1357 -1735 -2943 -2034 -820
1066 -820 -1268 -1155 270 1048 399 259 1216 917 -121 334 731 -123 -387 198 1121 366 56 1092 841
1085 841 15 430 726 280 -719 -231 34 -666 -806 -1 -227 -1032 -580 -175 -623 -1092 -615 423 -861
1104 -861 -858 253 362 -111 85 891 1241 345 883 1688 590 265 753 785 -271 -725 21 -162 -1695 -711
1124 -711 437 -144 -425 493 1193 250 -275 555 59 -1186 -1155 -1020 -1537 -1921 -1347 -255 -350 16 1526
1143 1526 2329 1597 2194 2419 2219 842 521 536 -1027 -1617 -779 -1126 -1512 -1187 -65 3 -733 -263 547
1162 547 -218 -902 -293 41 -578 -245 625 1075 411 697 1521 582 49 -73 -478 -1452 -2012 -1184 -566 -910
1182 -910 60 1791 2229 2348 3142 3132 1998 382 -19 -1036 -3262 -3489 -3413 -3757 -3383 -2105 -484 332
1200 332 483 2457 2834 2006 1995 1829 1208 -186 -208 393 -305 -426 759 911 50 133 228 -291 -1353 -1790
1220 -1790 -1500 -1749 -2216 -562 718 903 1909 2836 3042 2129 1217 737 -1428 -2913 -3343 -3477 -4200 -3655
1238 -3655 -2289 -203 791 2291 4354 4576 4236 3898 3311 1386 -214 -1104 -1522 -3146 -2911 -2206 -1930
1255 -1930 -1647 -894 384 136 -627 150 38 -918 -757 -71 401 477 1347 2775 2511 2064 2236 1803 -295
1274 -295 -1487 -1962 -2931 -3610 -3739 -2021 -1050 -338 2171 3772 4024 4011 4210 3324 1434 -848 -1356 -3137
1292 -3137 -4789 -4615 -3872 -3382 -2191 -432 935 1502 1885 2877 2494 1381 1286 1140 256 -127 679 1140
1310 1140 460 505 1479 749 -307 -680 -1259 -2594 -3271 -3069 -2202 -2226 -1231 1242 2219 3133 3628 4020 3412
1329 3412 1474 676 -788 -2658 -3682 -3969 -3617 -3501 -2401 112 1543 2041 3416 4232 3331 2661 2198
1346 2198 1116 -47 -1216 -1242 -1522 -2412 -1474 -646 -756 -754 -193 -255 -978 -1646 -1013 -1053 -1553 -293 905 1405
1366 1405 1837 2927 3066 2515 1917 1329 320 -1580 -2311 -2589 -2761 -2971 -2276 -394 100 1411 2577 3238
1384 3238 2694 2453 2081 881 -841 -1775 -1878 -2810 -2915 -2100 -1538 -1151 -523 852 931 891 1088 1598 764
1403 764 195 473 573 687 664 1114 1410 578 465 663 -559 -1046 -1524 -1627 -2177 -2551 -1541 -968 -818 408
1423 408 1252 1568 1856 1843 1878 698 -115 -206 -659 -1845 -1721 -1104 -951 -773 105 1283 1441 1387 1633 1619 817
1444 817 568 296 -202 -1202 -813 -210 -1169 -1256 -499 -345 -511 -806 -136 -8 -613 -821 -1 -47 -174 324
1464 324 926 564 427 1174 1252 466 462 883 26 -378 -415 -120 -489 -678 -144 108 -324 -554 215 216 -166 -282
1486 -282 12 -390 -969 -590 -831 -975 -1019 -60 -35 -181 379 852 1147 1001 1414 1399 592 372 603 -52 -955
1507 -955 -831 -416 -742 -1052 -361 358 135 434 686 945 422 229 432 -469 -1045 -1130 -759 -926 -1348 -212
1527 -212 255 -108 453 938 1066 782 996 916 409 424 385 569 333 455 687 456 38 -81 -258 -1082 -1654
1548 -1654 -1448 -1605 -2233 -1713 -699 -134 525 1251 2139 2367 1910 1927 1417 180 -785 -1212 -1673 -2232 -2327 -1118
1568 -1118 -682 -280 1230 1932 1903 2006 2192 1695 650 -335 -475 -1171 -1530 -1520 -1306 -764 -1014 -345 -112 -531
1588 -531 -471 -90 -642 -1137 -838 -54 325 695 1780 2667 2683 2493 2741 1485 480 -703 -1821 -2983 -3722
1607 -3722 -3578 -2871 -2329 -1216 863 1783 2146 3125 3325 2698 1628 580 -223 -1770 -2585 -2501 -2127 -2141 -1721
1626 -1721 -414 331 692 1438 1847 1361 794 900 377 190 147 765 912 818 1214 1427 869 -184 -1046 -1736
1646 -1736 -2723 -3402 -3256 -3102 -2716 -1023 340 1542 3061 3838 4268 3687 2816 1883 592 -1491 -2361 -2969
1664 -2969 -3373 -3236 -2602 -936 -73 835 2029 2614 2528 2122 1422 1005 -294 -903 -830 -1107 -1250 -397 12
1683 12 -367 -214 -152 -542 -1296 -1622 -1438 -1590 -1129 -427 759 1530 2550 3211 4049 3321 2918 2074 301 -1642
1703 -1642 -2711 -3552 -4262 -4491 -3395 -2023 -1114 547 2145 2921 2898 3284 2788 1644 148 -451 -1117 -1850
1721 -1850 -2109 -1421 -1115 -719 -212 429 519 421 571 121 -46 -105 -252 198 371 876 1639 1610 1424 1412 800
1742 800 -127 -1306 -2145 -3125 -3879 -3765 -2694 -2206 -1048 595 2275 2785 3493 3811 3465 2297 1312 176
1760 176 -800 -2170 -2308 -2471 -1969 -1758 -666 185 386 1083 1551 1040 655 113 198 -180 -335 -265 147 80
1780 80 -25 699 550 -13 -412 -587 -1461 -1822 -1497 -1465 -1026 -554 608 1315 2105 2711 2823 2660 1824 1172
1800 1172 41 -1319 -1941 -2622 -2867 -2807 -2131 -1367 -525 -208 1083 1280 1652 1253 1163 650 56 -335 -214
1819 -214 -256 -777 -47 5 433 224 310 448 -56 -261 -170 -488 -498 -207 237 382 411 977 1154 1007 700 219
1841 219 -359 -1197 -1280 -1709 -1745 -1897 -1399 -793 -284 400 1286 1542 1673 1475 1530 1191 526 80 -94 -795 -1121
1862 -1121 -673 -602 -401 -425 -104 43 -274 -35 319 -161 -216 -202 -119 -586 -598 -91 106 78 212 181 99 -50 -175
1885 -175 -66 -69 -377 149 -18 232 429 664 655 595 558 630 223 105 31 -406 -919 -959 -881 -831 -711 -479 -174 -160
1909 -160 -12 437 128 105 224 327 388 -120 -14 326 13 -128 -73 211 225 219 323 397 525 301 375 -36 -35
1932 -35 -240 -387 -613 -830 -428 -510 -647 -482 -174 -8 -38 389 515 248 351 514 252 -45 270 223 255 -96
1954 -96 102 488 223 222 196 -117 -67 -373 54 -283 -322 -183 -64 -21 17 383 407 52 -123 -87 -283 -912 -1213
1977 -1213 -901 -1121 -839 -297 -102 665 1181 1544 1692 1448 1218 1102 511 93 -412 -584 -930 -1082 -905 -333
1997 -333 -469 -123 161 209 279 141 55 -47 -313 -173 245 -82 142 218 502 183 324 507 212 -305 -508
2018 -508 -637 -1022 -746 -398 198 553 742 1287 1595 1580 1329 1041 304 -547 -1214 -1543 -2134 -2221 -1940 -1719 -814
2039 -814 -59 670 851 1131 1601 1475 1072 664 440 -110 -405 -91 -211 -257 -84 236 281 -92 -335 -72 -490
2060 -490 -935 -891 -562 -272 -221 221 596 1177 1374 1298 926 547 -254 -726 -1499 -2035 -2026 -1520 -1614 -932 243 975
2082 975 1725 2113 2333 2381 1704 1094 340 -475 -1021 -1508 -1318 -1398 -1262 -801 -545 -296 474 376 53 -188 35
2103 35 -272 -550 -142 289 355 599 1125 1371 1034 652 442 -66 -828 -1592 -1319 -1511 -1437 -993 -243 719 1209
2124 1209 1786 2153 2134 1495 1148 327 -538 -1528 -1990 -2315 -2212 -1978 -1300 -831 177 789 1075 1391 1312 1025
2144 1025 896 325 20 463 -76 275 259 306 203 461 178 -153 -527 -792 -1027 -1401 -1302 -1112 -545 168 640
2165 640 1279 1560 1824 1533 1179 401 -582 -928 -1151 -1869 -2077 -1460 -1162 -459 300 1165 1728 1917 1895 1821 1303
2186 1303 511 334 -386 -974 -1214 -804 -697 -766 -567 -270 -328 -396 -177 -360 -766 -715 -521 -206 -48 504 866
2207 866 1100 1448 1435 1133 902 226 -109 -886 -1252 -1703 -1333 -1364 -928 -296 448 1018 1238 1503 1760 1126 579
2228 579 159 -581 -947 -1339 -1257 -1458 -1122 -582 -238 13 313 661 766 817 478 162 267 185 455 591 301
2249 301 873 525 385 215 -60 -181 -873 -1009 -1068 -1360 -1055 -860 -301 233 319 682 925 1331 792 892 376
2270 376 -266 -719 -819 -903 -1089 -528 -307 -161 279 615 964 1080 591 728 616 418 -52 -147 -399 -500 -367
2291 -367 -16 -328 -392 -304 -181 -472 -489 -461 -542 -555 -247 314 62 171 745 999 884 877 680 447 1 -360 -421
2314 -421 -472 -733 -807 -438 -361 -53 21 569 378 749 598 171 -375 -259 -123 -709 -730 -505 -375 -530 -196 239
2336 239 402 316 573 328 324 103 307 183 74 44 241 188 380 113 13 186 -305 15 -380 -699 -406 -242
2358 -242 -231 -542 -378 72 34 -30 228 272 299 35 204 57 161 -118 60 198 181 79 347 156 205 385
2380 385 259 155 107 24 -170 -212 -173 -295 -448 -448 -470 -508 -225 -116 -305 225 97 87 152 213 257 159 85 108 -49
2405 -49 -4 -215 -2 95 143 225 264 545 499 106 222 286 30 -35 -234 -283 -238 -300 -312 -188 -98 -351 -351 -154 44
2430 44 -351 -355 -165 -216 72 325 354 304 472 843 675 221 495 102 -23 -542 -450 -635 -577 -413 -179 -146 90
2453 90 471 439 621 711 405 139 -36 -477 -287 -269 -788 -443 -445 -188 296 270 385 692 567 458 181 82 423
2476 423 158 -64 162 169 179 -27 62 -37 -315 -479 -549 -854 -929 -831 -784 -465 -284 -26 706 891 754 1100 933
2499 933 480 106 42 -340 -946 -582 -427 -725 -469 48 216 616 581 744 841 314 120 96 -152 -457 -633
2520 -633 -283 -310 -434 -154 -153 -293 23 -213 -135 -477 -372 -287 -14 -232 455 782 834 1386 1233 1141 708 370
2542 370 53 -598 -749 -1108 -1318 -1233 -707 -302 67 196 495 1056 811 574 572 290 -79 -483 -385 -673 -693 -435
2564 -435 -177 95 23 171 518 415 200 289 447 -426 29 176 106 304 408 511 313 125 -171 -253 -575
2585 -575 -858 -1126 -1174 -1123 -888 -652 60 256 829 1222 1178 1101 947 686 114 -123 -350 -561 -828 -712 -509
2606 -509 -71 -91 92 229 289 287 265 -54 -44 -438 -240 -348 -351 -250 -42 -21 136 477 117 23 -172 12 -427
2629 -427 -378 -292 56 175 355 753 749 936 1138 767 321 80 -393 -440 -821 -974 -926 -886 -527 -630 -78 172
2651 172 45 523 620 303 -53 217 97 -178 -180 -118 -214 79 -141 134 -116 60 223 79 -79 161 273 -47
2673 -47 383 59 187 353 616 250 242 151 -111 74 -274 -427 -618 -743 -621 -206 -343 317 106 279 711
2694 711 514 629 441 245 229 130 -323 122 -114 -336 -126 77 94 0 -186 279 59 -173 13 -140 34
2715 34 134 -12 -215 -169 -66 23 -297 -212 37 -4 69 155 329 169 128 287 91 20 126 -88 127 116 -25
2738 -25 166 -162 38 -210 -234 -147 -254 -342 -410 -216 -311 -89 -214 -35 -24 -69 82 49 139 27 51 -102 123 238
2762 238 107 30 307 35 176 244 642 292 141 364 -39 -409 -457 -600 -531 -352 -453 -375 -11 15 -190 47
2784 47 129 285 376 161 70 179 -121 -215 -94 70 -111 109 92 199 106 78 253 84 -67 301 -139 -124 -92
2807 -92 132 220 333 217 110 132 -217 -96 -620 -337 -405 -340 -432 -229 53 415 410 616 1037 836 1018 459 281
2830 281 26 -160 -346 -605 -612 -581 -690 -223 -103 4 203 219 -6 -112 109 -200 -189 -177 -92 60 -157 73
2852 73 287 57 406 10 128 -30 -302 -433 -463 -290 62 221 440 480 644 782 827 693 170 15 -585
2873 -585 -658 -1009 -1245 -873 -950 -383 -425 -257 355 557 754 933 665 345 356 99 -145 -376 -111 9 -32 -105
2895 -105 131 314 330 12 31 -50 -397 -271 7 -193 -37 82 439 477 348 617 588 55 -180 -218 -593 -780
2917 -780 -632 -747 -413 -265 242 632 673 856 1282 811 786 147 -18 -23 -553 -518 -632 -417 -556 -478 -306 89
2939 89 133 -139 229 137 -119 -249 -32 -141 -29 292 151 87 299 410 372 -55 0 -182 -482 -636 -190 -397
2961 -397 -334 -111 244 471 688 533 674 518 303 14 -484 -739 -684 -1025 -734 -825 -393 35 75 -9 652 586
2983 586 523 713 323 49 118 157 -215 -306 88 -66 -52 115 70 -82 -238 -240 -231 -289 -420 -301 -316 -141 -34 -81
3007 -81 264 453 291 332 46 -182 -625 -271 -553 -454 -186 -197 -147 66 385 609 375 530 423 188 149 29
3029 29 -190 -160 -324 -143 -305 -485 -147 -110 0 42 -160 27 81 -84 -63 -274 12 -57 99 85 79 204 480
3052 480 163 245 193 -7 36 139 -75 1 5 26 1 63 -388 -165 -16 -32 -140 -290 -220 -227 -145 -83 -406 -96 -154
3077 -154 -167 139 127 288 382 351 261 171 51 223 -90 137 -353 -131 36 -261 209 -99 168 -94 334 55
3099 55 23 131 -175 -315 -493 -275 -650 -351 -409 -455 -196 -218 236 173 270 378 342 277 113 68 266 2 73 -95
3123 -95 -70 7 -79 25 -333 -281 -192 -225 -238 -135 -212 81 -50 -37 158 20 415 444 82 11 133 -145 -220 -353
3147 -353 -382 -260 -152 -188 164 283 395 514 661 782 617 354 364 -235 -392 -359 -736 -583 -465 -429 -138 -153
3169 -153 -46 57 277 33 -137 6 9 39 35 124 345 389 599 198 237 57 -29 -213 -392 -409 -632 -634 -456 60
3193 60 138 313 575 767 746 552 438 -62 -324 -440 -543 -685 -892 -676 -583 -705 -58 355 704 858 584
3214 584 531 675 515 296 47 -73 -317 -216 42 -28 0 -110 150 -252 -153 -621 -718 -460 -478 -330 48 85
3236 85 677 569 529 764 766 463 348 -41 -723 -665 -816 -950 -593 -225 -240 291 686 797 856 950 704 325 36
3259 36 -209 -606 -577 -595 -614 -474 -345 -51 -232 295 12 -16 377 124 -210 91 -20 142 402 466 835 792
3281 792 725 285 44 -103 -294 -901 -1080 -816 -525 -562 -235 156 345 522 862 619 557 402 190 -277 -693
3302 -693 -388 -912 -736 -793 -598 82 75 503 462 1105 524 495 474 8 45 287 240 -20 -47 169 -243 -77 -82 -9
3326 -9 -373 -372 -578 -923 -687 -673 -242 55 283 641 753 831 798 686 569 -61 -276 -433 -729 -744 -541 -277 34
3349 34 11 239 301 574 383 502 478 161 -115 33 -473 -387 -479 -337 -541 -195 -227 65 -79 168 -66 -244
3371 -244 11 -217 195 179 204 296 618 442 504 307 51 252 -276 -335 -477 -670 -484 -527 -377 -211 130 20
3393 20 702 550 539 212 354 172 -406 -135 -490 -340 -490 -351 142 201 134 258 486 70 63 126 55 -49 -76
3416 -76 -222 79 -50 -130 -92 81 137 111 -134 -254 -534 -361 -464 -595 -314 -189 99 79 355 280 501 406 685
3439 685 292 242 -248 29 -350 -204 -160 0 307 111 -167 175 -199 332 87 -42 88 -133 -80 -540 -257
3460 -257 -312 -45 27 206 -3 34 49 -13 274 146 92 -17 99 3 175 -102 -94 165 77 33 -304 87 112 -185
3484 -185 -423 -185 -329 -165 -364 -194 -59 -105 -101 -92 14 52 -123 -15 4 -63 134 -94 16 47 -127 -19 60
3507 60 297 92 257 359 215 208 116 -1 47 -257 -201 -119 -223 -195 -237 5 -118 101 118 92 94 87 68 -39 -301
3532 -301 66 154 120 44 239 -44 508 234 116 292 98 94 -52 136 -292 -210 153 -79 -266 -14 -231 4
3554 4 -332 -148 -90 -262 -182 -357 -246 -361 -145 -11 347 193 428 559 245 253 370 236 9 25 -222 -342
3576 -342 -368 -185 -386 -22 28 26 123 203 94 168 81 26 -88 -91 -197 -314 -94 -192 -11 61 -124 17 122 -34
3600 -34 221 -24 224 20 59 2 310 323 493 188 352 249 46 50 -97 -283 -620 -661 -689 -397 -132 10 -6
3623 -6 156 440 447 471 430 230 -4 27 89 -144 -207 -174 -135 -125 -98 207 239 345 377 129 73 -371 297 169 -53
3648 -53 1 -16 232 -13 -53 -56 -136 -401 -244 -487 -507 -430 -337 -193 89 169 250 505 974 779 438 434 220 -26 -273
3673 -273 -453 -545 -605 -400 -320 -211 7 -79 209 235 125 40 151 45 -26 17 12 -44 -168 29 103 9 -203 43
3697 43 52 -90 -42 -189 -441 26 55 362 448 649 742 428 498 126 263 -85 -351 -619 -735 -842 -726 -504 -123
3720 -123 -84 351 336 615 365 378 389 278 356 -59 -67 -51 -115 -229 -284 -133 89 75 66 -55 -6 -251 -334 -170 -111
3745 -111 186 -76 135 272 304 304 112 238 -171 -222 -248 -731 -586 -643 -408 -81 43 443 478 771 765 600 177
3768 177 63 9 36 -401 -470 -578 -352 -402 -376 -35 21 38 227 -38 38 125 -139 77 -67 -166 166 -242 334
3791 334 -36 262 153 224 -1 -56 -355 -191 -262 -354 -356 76 2 183 547 549 455 409 262 20 -229 -442 -480 -681
3815 -681 -486 -527 -379 -143 75 25 465 203 222 213 222 98 -6 -100 143 -6 -8 -205 11 144 -84 256 -5
3838 -5 -187 -78 -131 -141 -108 -133 -57 170 318 85 466 111 233 -96 -315 -81 -396 -222 -610 -318 -168 164
3860 164 299 166 362 388 439 477 224 191 -115 -59 11 -164 -304 -47 -42 -262 -375 -61 -252 -102 -196 50 23
3883 23 14 -95 -132 132 341 44 -21 102 78 154 -178 81 -141 -142 -114 140 -17 40 162 -42 -125 290 14 -1
3907 -1 51 -224 97 -192 -340 -162 -435 -273 -105 47 -19 56 -211 181 149 267 207 201 287 150 -45 245 246 173
3931 173 -34 -72 73 -30 -59 -190 -104 -14 -38 -194 -318 8 8 13 124 -80 -105 52 -35 -5 114 4 38 42 -47
3956 -47 124 113 153 -351 53 410 147 466 -59 1 -19 -54 -173 -20 -153 -108 -287 -292 44 -128 -243 -15 -142
3979 -142 -9 32 -4 16 34 28 19 -85 -175 -116 -135 63 72 143 389 188 168 179 157 -42 27 -63 -184 -74 -192 -59
4005 -59 -375 -89 -138 -281 -244 137 428 -243 247 -2 -47 92 15 -150 99 312 149 290 408 328 258 322 28
4028 28 -98 -29 -112 -111 -288 -210 122 151 -12 300 -6 297 -14 90 -329 -266 -280 -110 -162 -197 -255 46 102 74 401
4053 401 202 16 456 112 281 50 -109 18 -21 139 77 20 -57 -48 39 78 -43 -341 -8 -122 -315 -415 56
4076 56 66 352 32 247 422 423 390 259 42 -145 -414 -259 -346 -162 -161 273 225 224 328 143 490 428 -111 113
4100 113 -115 -381 -426 -174 -493 -277 -95 -77 -151 -132 146 22 -11 -233 130 -230 -23 156 99 85 404 314 504
4123 504 56 158 189 -369 -268 -270 -488 -299 0 -54 238 283 124 0 342 261 21 -87 -175 -27 -222 -352
4145 -352 -328 -229 -106 -202 154 123 299 335 33 323 298 386 165 -322 -20 -191 -1 18 39 -106 -146 -241 -124 -440
4169 -440 -462 -254 -350 -347 -344 173 90 -105 286 258 354 148 244 -227 -56 -58 -66 -236 -339 109 39 315 223 247 50 25
4195 25 -77 -26 137 -22 -101 -52 -200 -203 -226 -111 -313 -67 -37 -242 -176 98 23 115 7 31 320 118 165 369
4219 369 451 185 233 -35 -9 -322 -154 -410 -660 -207 -329 -370 -102 -14 297 93 39 221 224 -190 -67 -102 -400
4242 -400 -114 3 -8 -96 56 332 211 129 147 190 273 235 273 41 125 105 -11 8 -115 -1 -236 -15 130 -116
4266 -116 -172 -233 -189 -414 -180 -42 -40 -160 -100 9 79 151 138 -250 301 94 32 -142 -351 -258 -211 62 18 24 185
4291 185 104 -77 52 -103 149 -155 232 -182 116 -48 -300 25 15 111 67 -12 -189 170 119 -88 106 16
4313 16 480 -121 -61 58 1 44 79 97 29 48 -7 194 -200 -97 -42 -232 -13 -162 -195 -13 -19 -91 -67 -115 -49 -172
4339 -172 -104 -105 -187 34 -33 -102 64 239 -75 46 51 146 71 382 -141 -81 -176 22 -150 -308 -91 -129 -186 70 247
4364 247 -6 47 71 67 19 101 310 -7 183 42 -184 77 -203 -83 31 183 253 52 -2 181 178 405 76
4387 76 -111 26 2 -8 105 -58 -269 -250 198 -223 -51 -79 -289 -217 -205 -110 -225 44 117 265 217 202 470 362
4411 362 41 424 -32 -421 -207 -138 -65 -129 -560 -257 -29 153 49 92 276 136 57 243 -61 -312 -120 -260
4433 -260 -26 -121 -144 16 -349 120 -108 145 -36 -60 260 -76 -38 78 98 227 218 252 311 161 66 178 -131
4456 -131 -248 -212 -346 -361 -352 -282 51 80 189 214 297 201 175 67 171 -207 -93 -8 -94 -383 -68 -70 -109 -91 238
4481 238 253 161 190 135 21 262 1 234 -137 -195 -37 -207 -66 130 -88 -245 -135 -274 -411 -161 -139 -367
4503 -367 -15 496 353 440 245 452 108 78 -13 -96 -326 -241 47 -348 -263 -106 93 -51 137 -31 367 292
4525 292 223 -3 125 -138 -206 -329 -282 -226 -23 115 65 105 32 173 123 -6 -304 -37 32 85 -39 347 116
4548 116 174 -131 89 150 168 -195 -236 -253 -207 -246 -260 -405 -185 13 -112 79 298 230 283 223 -27 -123 97 -79
4572 -79 33 70 25 71 -24 210 100 214 -19 -120 -104 -26 -196 -144 -19 -47 179 -153 21 -8 19 -133 -90 50
4596 50 -72 -177 65 160 59 161 319 8 334 103 34 503 450 -179 294 118 -51 191 239 -172 -203 -110
4618 -110 22 124 -17 20 -167 -184 -151 -43 -206 -122 102 147 -308 -73 82 320 -250 58 165 115 95 53 38
4641 38 80 235 -159 -11 159 -180 164 -61 -115 51 -202 -151 -201 183 -79 65 -132 136 89 64 -22 -102 364
4664 364 53 14 201 174 67 78 -2 312 -126 -157 11 41 185 -26 -219 311 322 1 39 -9 -101 -289 -132
4687 -132 -145 -209 -183 -52 -177 -124 44 -37 345 226 237 327 30 268 179 -130 17 -12 -75 -165 -163 -247 -119 -51 226
4712 226 272 -31 97 -34 -228 -98 -67 54 -198 -49 105 91 0 -85 137 29 -12 -278 -180 67 -222 119
4734 119 117 178 150 455 494 334 351 79 81 -142 -71 -122 -286 -570 -339 -319 -201 276 124 149 255 36 76 95 -70
4759 -70 -65 180 -65 -481 159 188 126 28 -82 84 51 -57 -13 124 -8 -132 41 220 128 304 272 82 195
4782 195 135 69 -194 -307 -505 -221 -690 -557 -263 -388 -18 54 254 353 186 145 154 251 33 -17 -224 -160 -140 -251
4806 -251 -230 42 -190 -129 1 190 -182 -146 164 -94 -168 -20 -52 43 167 207 -12 161 72 -109 -207 -211 -472 -656
4830 -656 -252 -139 -55 199 147 424 268 473 301 72 118 6 -120 -287 -448 -170 -369 -163 -390 -232 -69
4851 -69 146 166 95 227 319 -145 27 -1 76 54 4 160 221 100 74 -14 -362 11 -349 -213 -70 -165 116 117 243
4876 243 45 315 293 489 253 311 -223 -369 -443 -540 -308 -329 -269 -270 138 47 197 395 406 306 361 386 191 114
4900 114 94 -176 -242 -126 -233 -27 78 6 -57 -107 124 -288 -112 86 -46 -29 -59 120 242 212 31 171 96
4923 96 236 -12 -163 -209 -233 -122 -100 -9 -128 -9 14 296 367 372 321 318 140 207 -18 -81 -442 -448 -142 -176 -149 -26
4949 -26 -78 -93 -96 -115 154 -40 -50 89 3 -33 -107 260 120 176 323 300 86 -252 -238 -390 -133 -98 7 -21 40
4974 40 152 -97 183 262 -61 219 -4 -83 -77 -75 -159 -136 -76 -32 6 220 -11 218 197 328 300 147 -80 30 -103
4999 -103 96 17 -27 -174 -191 146 -73 -87 9 -228 -213 -262 -103 -122 -38 -17 -93 32 -208 -155 148 32 114 202 -92
5024 -92 -99 -145 211 235 -248 -40 43 9 212 -112 199 491 28 154 -93 -66 51 48 -50 42 -49 63 -85 -199
5048 -199 107 -72 56 -277 157 6 -48 122 25 -72 24 274 18 -19 -49 63 -7 -76 -144 113 25 -241 61
5071 61 -145 94 -248 -160 -170 -291 -85 -219 170 -212 166 19 60 -83 80 107 -63 -189 -102 -56 -17 -42 148
5094 148 143 -120 2 170 -54 -341 -118 -185 -252 -25 -212 -105 69 0 34 -34 27 -1 -20 -24 64 -106 -151 49 -278
5119 -278 -275 -6 -76 195 122 94 -66 190 319 39 -38 -203 -101 -47 -139 -98 -116 13 -61 -362 40 -18 -256 -41
5143 -41 -67 82 156 -47 49 149 92 203 204 -61 139 28 -32 -59 -207 -142 -359 82 -26 273 -138 3 7 252
5167 252 397 93 1 152 -99 -99 -148 -279 -284 -24 -252 -338 -259 348 33 172 117 -37 301 -97 176 204 133 116
5191 116 -100 48 229 121 7 10 -207 -371 -224 -421 -247 -79 -215 -21 -117 149 354 286 186 -6 14 105
5213 105 -312 -76 -103 -212 -315 -16 -129 129 236 199 369 140 -94 190 13 431 96 -248 -80 -99 -216
5234 -216 18 -124 181 76 -79 -215 -336 -398 -91 183 -189 118 -50 281 225 380 371 286 128 40 109 -104
5256 -104 -507 -271 -242 -249 -89 130 21 223 311 369 284 57 -148 5 -46 -77 -375 -312 45 -186 -135 -24 -100 102
5280 102 44 67 4 -58 193 165 48 -12 281 269 98 391 134 229 30 -38 -187 -458 -414 -452 -353 -443 -98 49
5304 49 -98 177 327 453 455 256 194 72 -118 -333 -526 -215 24 13 8 279 150 257 351 40 43 40 30 -75
5328 -75 -269 170 -77 77 -247 108 179 41 -264 -262 -205 -135 -230 -388 133 10 -89 88 246 295 312 442 287
5351 287 -87 140 84 -294 -352 -392 -299 -185 -172 -125 69 91 -41 75 18 108 242 6 -314 -36 -208 76 36
5374 36 -74 164 -185 249 150 120 -388 77 -90 -86 192 99 -89 145 27 301 158 148 143 -37 19 -374 -181
5397 -181 -229 -397 -282 -220 -91 -226 269 191 68 567 374 48 81 27 -55 27 -311 70 -272 -130 -132 -363 242
5420 242 -111 -74 118 -255 237 -69 -239 -160 6 223 -117 143 207 30 12 -83 -390 -201 -170 -415 -71 -32
5442 -32 -105 6 -173 425 269 159 417 176 32 -34 13 -305 -174 21 -206 83 -78 1 192 -92 60 -63
5464 -63 77 10 -266 -207 -233 -43 -83 51 55 178 189 -47 -59 231 -107 97 -22 -51 -80 90 95 -100 145 44
5488 44 205 41 221 -70 -98 -261 -1 -186 -210 5 -175 54 -246 12 -107 19 59 -105 138 141 265 117
5510 117 -62 -40 -51 104 234 -3 -68 -75 139 216 -90 -182 62 -87 207 -81 -192 -14 -193 90 -66 85
5532 85 -244 -98 179 -7 -155 112 -111 -64 28 183 74 92 -7 8 -253 110 -22 -15 140 98 93 -127 -187 -195 26
5557 26 -286 -328 225 -20 -91 -132 -139 -166 -139 -86 -67 -160 -110 -3 -26 -108 -120 133 -36 166 44 -63 303 137 120
5582 120 206 -60 -43 -277 -130 -86 -143 199 -230 1 206 81 160 31 10 67 -40 -51 -125 -126 134 -105 146 -41
5606 -41 -149 6 35 8 201 -126 -202 -17 46 24 -272 151 -17 44 68 176 -90 -61 137 -146 -145 -145 -409 -288
5630 -288 -204 -123 79 -143 268 481 232 300 147 44 -60 -125 -155 -64 -123 -8 -70 -444 -56 -215 25 -12 107
5653 107 265 -220 23 -146 -61 22 6 -150 -199 130 21 -33 120 -56 -190 -95 -311 -338 -73 94 151 104 115
5676 115 219 305 297 127 72 49 -62 34 -305 -334 -404 -480 -359 106 -137 126 204 19 -22 -25 174 12 104 -18 -248
5701 -248 -136 -9 -129 82 -17 -11 156 214 -32 -306 -137 156 -4 132 56 -6 30 -38 266 -163 20 104 8
5724 8 58 -427 -471 -150 -142 -221 -174 153 6 418 126 206 337 18 349 170 -91 -183 40 -382 -340 42 9 -30
5748 -30 300 59 -207 118 -93 17 -251 -125 -24 -107 92 83 137 -26 290 -40 25 -56 -231 -305 -101 -285 -154
5771 -154 -113 -40 216 279 138 267 239 105 260 -3 200 -30 -97 -381 -324 -181 -108 -251 -64 -67 14 29 58 -18
5795 -18 -176 235 -218 51 -39 304 44 -16 35 -69 -105 104 119 79 -32 -333 88 -115 -237 -119 -98 281 274
5818 274 225 84 -69 29 -40 -326 47 -358 -163 -256 -99 -212 296 48 254 142 110 259 110 -69 129 121
5840 121 -92 291 87 -141 -179 -104 -88 -33 -80 -191 -262 -126 -190 -224 -190 -25 -222 -7 -9 93 -82 -163 120 4
5864 4 53 73 85 -223 0 89 -28 -42 70 -119 66 178 111 -93 367 96 -135 -89 -153 27 1 195 -18 52
5888 52 -76 96 138 8 93 162 -6 45 164 98 -25 -135 79 13 -96 251 301 270 -115 -25 -17 68 -168 -158 -155
5913 -155 50 20 -7 -15 32 -266 -58 -143 -211 -131 116 -161 243 -121 -40 24 69 37 75 151 190 -131 152 64 68 -55
5939 -55 -78 67 -203 -67 5 -106 -296 -218 85 231 189 -37 149 74 -6 55 -90 71 -175 -131 -250 -88 85
5962 85 -44 -48 129 168 62 61 42 124 -21 -293 -157 -60 -207 -99 -305 6 239 -97 -273 -40 -303 33 34 -11
5986 -11 45 30 25 33 -118 200 65 209 317 -144 -125 -144 -126 -287 -54 -242 -38 61 -177 0 -16 230 65 289
6010 289 169 24 -273 -355 -18 -431 -290 -217 -4 191 13 -18 219 65 140 -22 35 72 -32 -41 -168 27 -138
6033 -138 110 109 -79 -93 -65 -209 20 -372 -446 -133 23 -176 -83 105 314 284 90 70 -19 -96 71 -445 -194
6056 -194 -94 -191 -190 -36 -59 185 265 -19 6 278 64 248 36 -63 1 58 24 -132 -52 137 52 31 -137 -17
6080 -17 3 -218 22 -76 121 123 192 -8 211 149 243 6 -213 133 87 -3 48 5 -144 -16 -147 51 71 68 397
6105 397 -60 51 76 198 189 -155 -234 -51 -341 -221 -157 -176 15 -100 113 -78 20 33 142 138 -49 163 183 67
6129 67 199 196 27 70 -43 11 -72 -161 -246 58 -191 -177 -137 -207 -277 30 192 -5 259 240 280 -79 48 124 -63
6154 -63 27 -293 -384 -218 -18 89 66 346 169 232 278 157 75 81 78 -410 16 -114 -370 -41 68 -378 -69 -101
6178 -101 -62 -39 -108 -11 122 115 -112 6 195 159 87 330 11 -166 128 -181 195 -95 97 44 -211 -129 -137 -6
6202 -6 22 50 -83 275 35 281 82 -54 -339 83 -183 104 145 93 -105 -87 -22 -137 -26 -42 -119 -156 114 383
6226 383 171 111 -50 228 -190 -9 -97 50 22 74 -169 -271 71 69 -44 40 -57 -117 4 -65 -113 -51 24 -44 -34
6251 -34 2 60 71 -186 -91 216 -8 155 142 243 303 21 103 60 -21 -11 -152 25 -107 -64 -1 -179 -376 20
6275 20 -28 -50 14 -77 60 102 151 -84 -201 5 139 -267 -120 -175 -36 65 46 -56 215 318 64 165 17
6298 17 -369 73 156 -4 -165 -399 -138 34 -193 -10 -108 134 227 -110 -117 45 22 -102 111 -48 152 360
6320 360 127 7 139 214 56 84 -41 -193 -202 -79 -112 -63 59 -47 -65 201 329 350 66 116 59 -17 -204 -165
6344 -165 -41 -30 -112 -124 -177 70 -61 -167 -181 101 209 128 -6 109 -32 -143 247 -8 58 -16 110 -26 -168
6367 -168 -387 -185 -116 -331 20 -65 -11 -129 88 225 204 345 376 221 137 57 -44 -298 -134 -168 -116 -114 -175 -49
6391 -49 177 337 -69 135 267 214 383 -44 -57 14 -185 -218 27 26 -330 -9 -48 -89 -331 -173 -169 -269 -237 -215
6415 -215 -98 283 297 -114 261 150 213 -15 10 93 -181 -437 -292 -494 -131 -78 -135 -266 5 185 -129 230
6437 230 193 -25 -203 261 16 -106 18 -133 -70 -88 66 -105 325 181 -145 -42 171 29 -209 -21 -233
6458 -233 47 -183 102 148 147 43 -35 -177 -400 -232 -247 -139 14 -263 -278 -68 282 112 247 196 362 139
6480 139 265 -29 213 -181 106 -202 -153 -36 32 -241 -45 14 63 243 -32 -140 -47 127 -118 -127 -58 167 98
6503 98 53 -13 -34 -64 -196 -11 31 -131 -51 -121 -38 78 54 400 423 295 192 297 -319 13 -29 -266 -76 -238
6527 -238 -372 -186 72 70 12 54 88 232 17 -54 45 -228 24 72 -14 119 -121 -11 -67 -51 40 24 199 96
6551 96 -181 -8 198 -241 35 106 110 108 364 141 166 114 -24 -294 7 4 -392 -269 -117 120 -160 80 -126
6574 -126 192 -82 231 124 234 181 185 -26 -23 -172 -67 279 -75 -140 -155 52 -175 12 -103 108 -104 102
6596 102 359 -145 118 -135 -18 316 -25 263 103 -78 103 -298 -44 -204 -61 160 -208 173 88 25 208
6617 208 151 -13 -167 106 -180 -104 25 -77 -367 -342 -286 -147 -153 -251 -31 133 -98 25 45 -35 -22 -129 241
6640 241 177 120 68 -84 -51 135 -30 42 -114 -200 137 -14 106 133 41 18 -82 168 113 -73 306 110 35 -107
6664 -107 -36 92 168 87 1 225 -41 -183 -30 -294 3 -90 240 -104 -89 -25 -45 -141 -139 -105 42 149 65 23 319
6689 319 33 73 -181 -17 -67 -149 64 -135 37 82 -78 -196 72 11 -270 -237 233 72 246 321 -201 171
6711 171 158 277 -57 -138 -46 -41 -184 -43 38 92 76 -33 -89 -72 27 -186 -146 -102 -18 130 -134 -333 -71 -108 38
6736 38 158 131 -230 156 -11 71 -158 -27 323 64 157 169 125 71 138 151 -56 -24 -172 -225 -350 -129 -285 -338
6760 -338 -27 54 -195 77 237 347 54 -15 211 -19 -103 -201 -1 112 38 -43 194 -5 -20 -146 -97 22 -13
6783 -13 -70 -149 -55 15 -69 -58 157 226 63 360 13 -176 -41 -70 -193 -150 -302 4 46 -147 58 -76 230 339
6807 339 242 141 150 5 80 -5 -107 -328 83 -58 -89 158 -24 -26 -37 -51 -118 61 -41 115 -15 -139 -27 90
6831 90 12 194 106 -60 -1 -99 -96 19 -301 -123 -109 -97 62 59 13 342 58 242 74 103 386 -61 -17 -284 -318
6856 -318 -139 -205 -174 -84 -132 -50 183 319 283 22 404 61 323 128 -42 252 40 -46 70 207 -10 -38 -41
6879 -41 77 -93 -90 -111 -101 123 68 165 27 318 -21 -51 228 -3 176 53 -197 -32 -124 -352 -132 -343 -209
6902 -209 -17 155 301 349 357 55 290 116 -137 42 -109 -3 -36 -16 48 -27 71 -67 31 -87 -300 -45 19
6925 19 -118 -113 81 -52 205 246 179 294 295 -60 -201 -74 -101 -421 -165 -122 -69 -143 -158 102 301 239 179 389 116
6950 116 -44 -130 -307 -220 -267 -258 -215 -227 -210 -147 65 143 342 -137 -160 259 -47 166 -88 74 -18 170 163 290 27
6975 27 -48 169 -30 -60 -336 -614 -26 -234 -229 -105 5 30 96 101 154 198 -83 -49 -260 139 187 -139 -199 47 -266
7000 -266 295 194 161 255 2 96 90 136 215 -32 -248 114 30 -107 -76 62 150 -87 40 60 -376 -270 -93 31
7024 31 23 -125 -53 376 109 415 158 125 206 72 76 67 -278 -2 87 28 -113 -39 -43 -119 213 -240 43 0 131 62
7050 62 35 -92 5 56 258 60 150 -114 178 188 218 122 -91 137 -62 3 80 -81 -118 39 -49 130 3 253
7074 253 -59 157 3 66 1 -161 -162 -123 108 -27 -42 -316 -75 182 153 89 -43 -70 -225 -307 300 -55 119
7097 119 -101 217 66 29 244 45 -32 -89 -32 -18 -117 -247 -185 54 -99 -197 25 103 14 -268 -110 306 -330
7120 -330 -129 -119 32 169 221 100 208 46 286 57 249 19 67 -31 28 179 86 -102 342 102 78 129 83
7143 83 -231 -155 -308 -3 109 -223 -83 -4 -83 -165 66 -20 -154 -34 186 -197 21 13 -25 348 -30 86 7
7166 7 148 31 18 -7 -21 -162 -71 19 -152 5 -47 226 -142 368 -189 -209 -110 -45 -24 -263 -136 -215 -56 -35 239
7191 239 -60 204 127 30 -27 -84 205 -31 265 -61 -45 -179 -29 159 -3 -21 -29 -59 -139 -339 237 -271 178
7214 178 -6 -173 6 -20 250 60 77 245 377 111 -63 -89 -78 -145 -200 -101 -87 -23 -19 119 127 120 249 2 238
7239 238 121 18 -263 75 -39 2 -167 -190 59 10 -342 -10 -64 24 41 42 246 115 -57 15 226 25 382
7262 382 94 100 107 -14 -147 -87 -251 -235 -331 -90 -127 86 98 23 245 245 31 -45 148 99 8 -208 71 -21 68 148
7288 148 -84 36 -25 -114 -63 83 -8 -327 -340 94 9 50 9 237 195 32 127 -210 -18 -100 -131 -174 -111 -262 -30
7313 -30 36 27 108 145 216 279 294 217 -195 32 23 -23 -475 -48 -10 177 -15 128 60 -174 -38 123 -132 123 110
7338 110 -222 -60 98 19 -64 94 92 -4 -11 -34 2 -148 -121 242 94 205 262 48 151 47 309 208 115 112 -68
7363 -68 65 85 -75 -409 -31 -29 -157 -18 -140 154 55 -107 -7 87 -49 290 54 1 -54 -56 -36 -168 -86 103
7387 103 193 74 2 -49 0 24 -5 -107 -190 -106 73 61 183 265 -17 203 242 100 -76 -395 -168 -196 -213 -149 -111
7412 -111 75 -94 127 251 -56 309 177 64 80 -12 -64 -132 -318 -48 90 31 29 160 114 -54 -117 -133 99
7435 99 -39 -366 215 -79 -120 99 156 26 343 34 -251 -81 76 48 -72 -13 -94 -32 134 57 129 16 -27
7458 -27 103 248 233 -27 -320 32 -39 -238 -349 -7 -111 -225 89 234 32 129 104 -13 -42 -29 -228 32
7480 32 53 -122 22 58 184 13 -27 -124 107 12 166 189 8 -204 -127 -102 50 -66 -51 134 168 68 -69 28
7504 28 -51 219 -48 -227 -62 -260 96 -15 -167 -147 208 293 -109 141 265 -65 -146 162 -27 -31 -155 -101 -111
7527 -111 -56 -142 -85 -20 -183 -263 176 225 30 -228 -176 -86 -118 122 -89 -29 98 25 -130 -142 190 317 73 58
7551 58 74 64 205 237 -210 53 -97 -32 -131 179 -185 82 134 15 -144 51 -69 109 -103 -178 75 -223 -118
7574 -118 88 -35 154 -33 119 -48 -18 166 -197 81 225 -117 34 -78 53 239 -29 175 93 123 -170
7595 -170 12 -160 84 -232 2 183 -71 61 256 72 128 37 -119 324 70 171 269 96 -9 -99 128
7616 128 -319 -32 -124 83 -12 239 105 47 -136 -67 -51 -125 -181 195 -26 -46 -99 -139 -47 -58 86 -221 -2 -108
7640 -108 -2 -343 139 -58 163 126 207 184 92 -83 164 -108 -22 -56 120 -9 -270 115 106 -33 32 39 -167 178
7664 178 145 144 -15 27 -51 156 101 97 84 315 15 224 -42 -7 108 -105 -154 -102 33 50 3 0 -27 -19 264 125
7690 125 415 47 244 -190 -356 -89 -163 -163 -144 -77 -332 -167 -30 18 248 231 -71 23 14 141 -108 -45 -259 -42
7714 -42 95 -106 -61 -4 -70 -156 152 -7 -131 -167 -201 -62 -113 85 200 53 -66 -167 241 261 64 -124 -65
7737 -65 -27 -2 -80 -9 5 105 -160 19 218 151 182 163 -72 -30 166 5 89 32 -324 8 -54 -411 -179 -186 136
7762 136 -172 -8 -35 -305 105 -35 64 -77 163 213 298 171 159 143 -14 31 -99 -159 -19 163 -220 -117 174
7785 174 352 -168 61 112 142 3 341 -187 -100 -95 -179 -138 -204 -182 -69 9 -23 246 173 24 -118 102 209 40
7809 40 216 194 -62 -61 10 -140 69 9 -44 -24 -36 -136 -104 -195 43 -164 107 -200 45 25 33 -150 181 -9 4
7834 4 -142 149 -88 -15 79 -97 -47 47 88 -129 -92 -8 95 -87 302 158 -182 -156 -141 71 -310 41 -50 70
7858 70 156 -142 -125 202 -39 -237 -99 328 87 163 11 76 213 23 107 -39 -57 45 -71 -53 -169 -71 297
7881 297 42 83 -49 -375 105 65 -221 -251 -213 -94 -131 -29 188 103 -85 -151 -91 88 -75 -131 153 -105 36
7904 36 54 44 -235 34 -12 -62 86 11 137 -119 -208 108 149 -59 -12 -196 124 13 70 -36 -77 -362 -195 55
7928 55 -223 35 -223 -53 -80 -333 -532 105 141 56 37 156 170 -51 -46 149 112 56 135 59 97 -185 -67 146
7952 146 59 18 38 221 -50 -121 -154 -30 169 9 126 -234 74 -111 128 -160 1 195 -73 -23 -72 -151 331
7975 331 314 259 15 -40 -23 42 -13 -163 177 -167 -15 47 218 -97 -20 -189 14 -10 331 54 -362 -86 121
7998 121 -39 121 77 -80 179 -154 -76 170 21 -169 -89 -183 -27 -190 147 -271 -17 144 -22 193 249 70
8020 70 -131 34 -138 -30 12 6 -377 -11 241 -84 8 41 107 4 21 162 -73 248 -5 123 -114 -95 34
8043 34 -56 139 90 147 -39 128 85 -75 1 -11 -146 -6 81 205 221 307 18 144 356 -81 1 255 86 94
8067 94 -187 -76 24 -27 -102 101 213 111 222 -148 268 -84 -177 74 -12 -227 -43 59 -131 -14 27 237
8089 237 -76 -109 41 -77 -141 109 -160 13 175 209 76 60 67 36 -155 106 -84 -83 55 -221 -240 -62 -59 -202
8113 -202 -133 42 304 -88 -9 22 -4 33 -30 78 7 -86 13 87 -70 -17 148 54 92 -54 -159 -52 -214 134
8137 134 -146 -83 -43 -30 -75 -271 -178 7 20 25 -315 -236 -44 43 -19 -47 79 39 201 129 157 89 194 43 -86
8162 -86 -80 38 25 186 -74 -96 26 -115 -65 -12 149 -106 36 -125 286 -155 47 76 10 89 82 86 -172 -197 6
8187 6 -100 24 -40 42
8191D2
##END NTUPLES=NMR FID
##END=
