##TITLE=1H_Pr 4-Cl-OAm
 CDCl3
 8 sc, 
 8.04.2022
##JCAMPDX= 6.0         $$ Bruker NMR JCAMP-DX V2.0
##DATA TYPE= NMR FID
##DATA CLASS= NTUPLES
##ORIGIN= UXNMR, Bruker Analytische Messtechnik GmbH
##OWNER= root
$$ XWIN-NMR		Version 3.5
$$ Fri Apr  8 16:40:49 2022 Russian Standard Time (UT+4h)  she@DPX200
##.OBSERVE FREQUENCY= 200.13135
##.OBSERVE NUCLEUS= ^1H
##.DELAY= (6, 6)
##.ACQUISITION MODE= SIMULTANEOUS
##.ACQUISITION SCHEME= undefined
##.AVERAGES= 8
##.DIGITISER RES= 18
##SPECTROMETER/DATA SYSTEM= spect
##.PULSE SEQUENCE= zg30
##.SOLVENT NAME= CDCl3
##.SHIFT REFERENCE= (INTERNAL, CDCl3, 0, 15.7039)
##AUDIT TRAIL= $$ (NUMBER, WHEN, WHO, WHERE, WHAT)
$$ ##TITLE= Audit trail, XWIN-NMR		Version 3.5
$$ ##JCAMPDX= 5.01
$$ ##ORIGIN= Bruker BioSpin GmbH
$$ ##OWNER= she
$$ F:/spectra/data/she/nmr/H-F/1/audita.txt
$$ ##AUDIT TRAIL=  $$ (NUMBER, WHEN, WHO, WHERE, WHAT)
(   1,<2022-04-08 16:39:43.98 +0400>,<she>,<DPX200>,
      <created by zg, POWCHK disabled, PULCHK disabled
       configuration hash MD5:
       00 E9 B6 7A A2 85 ED C7 34 08 36 98 17 FE 4E 26
       data hash MD5: 16K
       91 D4 57 1B DC 36 11 2A B2 47 F6 88 1F E1 32 6D>)
$$ ##END=
$$ 
$$ hash MD5
$$ D5 C4 73 32 60 3C D1 F1 3F 13 6C 58 42 D5 74 22
##$RELAX= 
##$RELAX= 
##$RELAX= 
##$RELAX= 
##$RELAX= 
##$RELAX= 
$$ Bruker specific parameters
$$ --------------------------
##$DU= <F:/spectra>
##$EXPNO= 1
##$NAME= <H-F>
##$PROCNO= 1
##$TYPE= <nmr>
##$USER= <she>
##$AMP= (0..31)
100 100 100 100 100 100 100 100 100 100 100 100 100 100 100 100 100 100 
100 100 100 100 100 100 100 100 100 100 100 100 100 100 
##$AQSEQ= 0
##$AQ_mod= 1
##$AUNM= <au_zg>
##$AUTOPOS= <>
##$BF1= 200.13
##$BF2= 200.13
##$BF3= 200.13
##$BF4= 200.13
##$BF5= 200.13
##$BF6= 200.13
##$BF7= 200.13
##$BF8= 200.13
##$BYTORDA= 1
##$CFDGTYP= 0
##$CFRGTYP= 5
##$CHEMSTR= <none>
##$CNST= (0..31)
1 1 145 1 1 1 1 1 1 1 1 1 1 1 1 1 1 1 1 1 1 1 1 1 1 1 1 1 1 1 1 1 
##$CPDPRG= <>
##$CPDPRG1= <>
##$CPDPRG2= <>
##$CPDPRG3= <>
##$CPDPRG4= <mlev>
##$CPDPRG5= <mlev>
##$CPDPRG6= <mlev>
##$CPDPRG7= <mlev>
##$CPDPRG8= <mlev>
##$CPDPRGB= <>
##$CPDPRGT= <>
##$D= (0..31)
0 1.2 0 0 0 0 0 0 0 0.06 0 0.03 0 0 0 0 0.0002 0 0 0 0 0 0 0 0 0 0 0 0 
0 0 0 
##$DATE= 1649421583
##$DBL= (0..7)
120 120 120 120 120 120 120 120 
##$DBP= (0..7)
150 150 150 150 150 150 150 150 
##$DBP07= 0
##$DBPNAM0= <>
##$DBPNAM1= <>
##$DBPNAM2= <>
##$DBPNAM3= <>
##$DBPNAM4= <>
##$DBPNAM5= <>
##$DBPNAM6= <>
##$DBPNAM7= <>
##$DBPOAL= (0..7)
0.5 0.5 0.5 0.5 0.5 0.5 0.5 0.5 
##$DBPOFFS= (0..7)
0 0 0 0 0 0 0 0 
##$DE= 6
##$DECBNUC= <off>
##$DECIM= 32
##$DECNUC= <off>
##$DECSTAT= 4
##$DIGMOD= 1
##$DIGTYP= 9
##$DL= (0..7)
0 120 120 120 120 120 120 120 
##$DP= (0..7)
150 150 150 150 150 150 150 150 
##$DP07= 0
##$DPNAME0= <>
##$DPNAME1= <>
##$DPNAME2= <>
##$DPNAME3= <>
##$DPNAME4= <>
##$DPNAME5= <>
##$DPNAME6= <>
##$DPNAME7= <>
##$DPOAL= (0..7)
0.5 0.5 0.5 0.5 0.5 0.5 0.5 0.5 
##$DPOFFS= (0..7)
0 0 0 0 0 0 0 0 
##$DQDMODE= 0
##$DR= 18
##$DS= 0
##$DSLIST= <SSSSSSSSSSSSSSS>
$$ [...]
##$SUBNAM2= <"">
##$SUBNAM3= <"">
##$SUBNAM4= <"">
##$SUBNAM5= <"">
##$SUBNAM6= <"">
##$SUBNAM7= <"">
##$SUBNAM8= <"">
##$SUBNAM9= <"">
##$SW= 18.05172834244
##$SWIBOX= (0..15)
0 0 2 0 0 0 0 0 0 0 0 0 0 0 0 0 
##$SW_h= 3612.71676300578
##$TD= 16384
##$TD0= 1
##$TE= 0
##$TE2= 300
##$TE3= 300
##$TEG= 300
##$TL= (0..7)
0 120 120 120 120 120 120 120 
##$TP= (0..7)
150 150 150 150 150 150 150 150 
##$TP07= 0
##$TPNAME0= <>
##$TPNAME1= <>
##$TPNAME2= <>
##$TPNAME3= <>
##$TPNAME4= <>
##$TPNAME5= <>
##$TPNAME6= <>
##$TPNAME7= <>
##$TPOAL= (0..7)
0.5 0.5 0.5 0.5 0.5 0.5 0.5 0.5 
##$TPOFFS= (0..7)
0 0 0 0 0 0 0 0 
##$TUNHIN= 0
##$TUNHOUT= 0
##$TUNXOUT= 0
##$USERA1= <user>
##$USERA2= <user>
##$USERA3= <user>
##$USERA4= <user>
##$USERA5= <user>
##$V9= 5
##$VALIST= <valist>
##$VCLIST= <CCCCCCCCCCCCCCC>
##$VD= 0
##$VDLIST= <DDDDDDDDDDDDDDD>
##$VPLIST= <PPPPPPPPPPPPPPP>
##$VTLIST= <TTTTTTTTTTTTTTT>
##$WBST= 1024
##$WBSW= 4
##$XGAIN= (0..3)
0 0 0 0 
##$XL= 0
##$YL= 0
##$YMAX_a= 852542
##$YMIN_a= -511172
##$ZGOPTNS= <>
##$ZL1= 120
##$ZL2= 120
##$ZL3= 120
##$ZL4= 120
##$ABSF1= 10
##$ABSF2= 0
##$ABSG= 5
##$ABSL= 3
##$ALPHA= 0
##$AQORDER= 0
##$ASSFAC= 0
##$ASSFACI= 0
##$ASSFACX= 0
##$ASSWID= 0
##$AUNMP= <proc_1d>
##$AZFE= 0.1
##$AZFW= 0.1
##$BCFW= 1
##$BC_mod= 2
##$BYTORDP= 1
##$COROFFS= 0
##$CY= 11.3945322036743
##$DATMOD= 1
##$DC= 2
##$DFILT= <>
##$DTYPP= 0
##$F1P= 2.36226072786647
##$F2P= -0.459571619588291
##$FCOR= 0.5
##$FTSIZE= 0
##$FT_mod= 4
##$GAMMA= 1
##$GB= 0.15
##$INTBC= 1
##$INTSCL= 1
##$ISEN= 128
##$LB= 0.24
##$LEV0= 0
##$LPBIN= 0
##$MAXI= 10000
##$MC2= 0
##$MEAN= 0
##$ME_mod= 0
##$MI= 1.114404
##$NCOEF= 0
##$NC_proc= 0
##$NLEV= 6
##$NOISF1= 3.799351
##$NOISF2= 2.8
##$NSP= 1
##$NTH_PI= 0
##$NZP= 0
##$OFFSET= 15.70392
##$PC= 1
##$PHC0= -18389.05
##$PHC1= 10.60078
##$PH_mod= 1
##$PKNL= yes
##$PPARMOD= 0
##$PSCAL= 0
##$PSIGN= 0
##$REVERSE= no
##$SF= 200.130013532006
##$SI= 16384
##$SIGF1= 3
##$SIGF2= 2
##$SINO= 400
##$SIOLD= 16384
##$SREGLST= <1H.CDCl3>
##$SSB= 0
##$STSI= 0
##$STSR= 0
##$SW_p= 3612.71676300578
##$SYMM= 0
##$S_DEV= 0
##$TDeff= 0
##$TDoff= 0
##$TI= <>
##$TILT= no
##$TM1= 0
##$TM2= 0
##$TOPLEV= 0
##$USERP1= <user>
##$USERP2= <user>
##$USERP3= <user>
##$USERP4= <user>
##$USERP5= <user>
##$WDW= 1
##$XDIM= 8192
##$YMAX_p= 0
##$YMIN_p= 0
$$ End of Bruker specific parameters
$$ ---------------------------------
##NTUPLES= NMR FID
##VAR_NAME=  TIME,          FID/REAL,        FID/IMAG
##SYMBOL=    X,             R,               I
##VAR_TYPE=  INDEPENDENT,   DEPENDENT,       DEPENDENT
##VAR_FORM=  AFFN,          ASDF,            ASDF
##VAR_DIM=   8192,          8192,            8192
##UNITS=     SECONDS,       ARBITRARY UNITS, ARBITRARY UNITS
##FACTOR=    0.0002768,     1,               1
##FIRST=     0,             0,               0
##LAST=      2.2672688,     0,               0
##MIN=       0,             -511172,         0
##MAX=       2.2672688,     852542,          0
$$ Real data points
##PAGE= N=1
##DATA TABLE= (X++(R..R)), XYDATA
$$ [...]
2068C78M26N21N74K71K08K45N41k03p6Kn37J2j053q03n22j124q13r24r28j125
2088d930o27r15p79m19m31N1J57O4L52M79R78R37J203J002J439J153J360J312
2106B386J205J003J215N67O05N19N3R1j95j93q98o18j084p22p63j081q75q60r11
2125e56l53l73k31l26N2K86J35M79M53N73N05N54N17K18M93J39J7J82o06m21m74
2146A263q22r08r10r43j641o24r90j019p46m99o51n25J39L1O53M99P32J257R64
2165d740J292J673J526J327J581J472J185Q58J262P32N04J11M06Q2q15o42l16
2182G498j465j029j054r90r47j043j096o66q85o37p2m11l0J83K60M76J67M86P90
2201d65K41K83O74M61K05J59m06Q4k34q71l37o01q66o10q16q40n91p14m83n15
$$ y = [378, 804, 1325, 1899, 2170, 2378, 2623, 3164, 2961, 2885, 2887, 2350, 2362, 1309, 506, -16, -1140, -1953, -2877, -3805, -4930, -5557, -6472, -7251, -7670, -8101, -8050, -7893, -7829, -7477, -6998, -6020, -5083, -3880, -2878, -1439, -286, 1074, 2386, 3591, 4594, 5809, 6376, 6981, 7500, 7553, 7644, 7449, 7256, 6358, 5740, 4656, 3934, 3171, 2090, 1215, 355, -556, -909, -1282, -1513, -1839, -1787, -1501, -1366, -887, -434, 139, 644, 1198, 1715, 1933, 2426, 2565, 2582, 2764, 2158, 1737, 1263, 441, -467, -1377, -2320, -3961, -4585, -5575, -6594, -7340, -7839, -8490, -9015, -8876, -8845, -8192, -7693, -6961, -5704, -4740, -3448, -1775, -249, 1078, 2659, 4131, 5316, 6174, 7436, 8168, 8672, 8783, 9189, 9271, 8456, 7814, 7498, 6033, 5004, 3950, 2960, 2013, 970, -126, -792, -1677, -2314, -2386, -2797, -2827, -2644, -2384, -1908, -1741, -1255, -465, -224, 59, 733, 1194, 1399, 1558, 1152, 1236, 1002, 131, -206, -807, -1673, -2283, -3099, -3939, -4530, -5244, -5727, -6242]
2221f242m51J61j45K94M40Q46M45P68J134R02J055J175J405J252J021R51O58R08
2239F577M08K93J95j00n7j46p38n71r04p90r75p77q40o15r30q30p11m31n18j42
2259b602j05M3j53J90J96J34M16M99K54J31M75K98K88j25o5J28j00k57j38k47
2279g40l42p92o1l25l51k50j50j49lJ34K44R7J39L39N35M62R81M33M17O58M92
2300A768P80M61K29L96N58j95K37j36j05j21j05n35k12n56k91r70n86k69n15l20
2320d87n79l13j02l06l93J2j70M4J40Q9Q0K09J68J89J01L40J05P0L86J84nL38
2342A00k8J9J60r6r4m1K13O4k43J20k89j05J88R5j62j78K80K17l23J17N5L86n09
2365e4K50L00o3mK26j33K62j46j12J65N9k33L3j21P4j21j69Q1m86J78l3j89j18
$$ y = [-6242, -6693, -6532, -6677, -6383, -5943, -5097, -4652, -3884, -2750, -1848, -793, 382, 1787, 3039, 4060, 5011, 5669, 6577, 6985, 7278, 7473, 7373, 7316, 7170, 6432, 5861, 4957, 4167, 3192, 2415, 1575, 960, 30, -800, -1511, -1942, -2460, -2602, -2707, -2664, -2817, -2627, -2431, -2297, -1881, -1382, -1128, -997, -522, -224, 64, -61, -126, 2, -98, -355, -493, -740, -1082, -1874, -1935, -2260, -2611, -2861, -3011, -3160, -3163, -3029, -2785, -2688, -2549, -2210, -1675, -1213, -232, 201, 618, 1276, 1768, 2548, 3009, 3238, 3634, 4192, 3997, 4234, 4098, 3993, 3872, 3767, 3232, 3020, 2464, 2173, 1203, 617, 348, -167, -487, -1066, -1379, -1481, -1787, -2180, -2168, -2338, -2294, -2154, -2065, -1985, -1776, -1608, -1419, -1318, -978, -873, -803, -417, -233, -238, 100, 72, 91, 251, 155, 61, 20, 233, 297, 54, 174, -115, -220, -32, 63, -99, -277, 3, 220, -103, 14, 69, 455, -54, 196, 496, 433, 429, 655, 522, 784, 638, 526, 691, 750, 517, 550, 429, 503, 382, 213, 294, -192, -14, -47, -236, -354]
2388c54J1J5J04m00N3k28k86K05K90p4j28K82j39K97l1K38m2K35K84P7K7Q8N76
2411A100O6M34k78J07J93J9j39Q7J40m15k57K22n31k60m64j59m20m97k15l80J1
2432a636n49k30J44j69k63J73L31m8M5L96K55M01O08J54M92L18K62M15J69J12
2452A380J07J05J48lj01J71p20N6l6l39k87k25k67K9l09j00J18J47L2j05K74M8
2474A23M94K7M74J68KM01K08n0K45l87J52l03k43m03k40m43o24m82m57k89l75
2495b002m59q94o4k94j97q9k81N24L51k8O04K19L96P18O86K12P88O88M21L24M78
2516B101L50L53N7L19O6m99K3Jm03l05k56k52m03o12J66n98k77k02K26k07N8m
2538b98p8J00K13J16M47J10J86L58k15L14j57rj93n2r3m61k54k89l92o36m63l22
$$ y = [-354, -343, -328, -224, -624, -571, -799, -1085, -880, -590, -664, -792, -510, -649, -352, -383, -145, -187, 48, 332, 409, 436, 524, 1100, 1166, 1600, 1322, 1429, 1622, 1641, 1502, 1589, 1729, 1314, 1057, 1279, 748, 488, 24, -135, -555, -1052, -1267, -1647, -1636, -2185, -2415, -2271, -2440, -2703, -2530, -2199, -2247, -2202, -1806, -1551, -1150, -542, -388, 104, 422, 684, 1099, 1268, 1380, 1487, 1592, 1740, 1737, 1636, 1807, 1087, 1143, 1107, 768, 481, 256, -11, 18, -291, -391, -273, -126, -94, -199, 75, 123, 617, 644, 1118, 1286, 1288, 1689, 1897, 1847, 2092, 1705, 1857, 1554, 1311, 908, 668, 225, -399, -881, -1338, -1627, -2002, -2461, -3355, -3419, -3713, -3910, -3999, -4280, -3756, -3405, -3433, -2829, -2610, -2214, -1496, -810, -598, 190, 878, 1299, 1623, 2101, 2451, 2804, 2861, 3180, 3246, 2747, 2770, 2771, 2368, 2063, 1807, 1555, 1152, 540, 706, 108, -169, -371, -145, -352, -294, -298, -376, -276, -63, 53, 500, 610, 796, 1154, 939, 1253, 1096, 1087, 894, 842, 749, 288, 34, -255, -647, -1283, -1746, -2068]
2560b068l88j46k04k09l52J58k81L29N7J69M85M83J69M87N61O79M30L97L12P30
2580A798J50M79L73l2K31p6M58l53j49M9l97m15k92n24k5l56m96m91Q5l47k59
2601e89p0l50J23j51L10L0J14pM6L28j23M9J49J36o0K56k65j6j14j36P6l15k0
2624e99k96M0l37O6j81k20Jk00K46r7O7K03K06M69j65L34L17J87M31J74J67L66
2646A179J22K70J19L79j66O2l9J24k53K4k36l77j76l78Mk69n47p6l72p3m1l28
2668a048K6k52j0k2q9K48j82K17M36k62J25M38j19L41K34N1l44K96M97k71O2J4
2690C86q8K6K88j25n9j18k34R7l70K98p9j39k5K45j08k49J10k92K51K24k08J69
2712@K59j09K05jk00Q5L34O9j70r9J42k49k18L9n3l54R5j86J95n88M24l92L5N
$$ y = [-2068, -2456, -2602, -2806, -3015, -3367, -3209, -3490, -3161, -3104, -2935, -2450, -1967, -1798, -1311, -750, -71, 359, 756, 1068, 1798, 1948, 2427, 2800, 2768, 2999, 2923, 3381, 3028, 2879, 2928, 2531, 2116, 1824, 1300, 1275, 919, 423, -68, 17, -330, -589, -659, -1009, -886, -1037, -727, -697, -583, -590, -544, -216, -339, -290, -141, -5, -65, 191, -74, -90, -204, -340, -264, -579, -599, -895, -855, -1192, -1126, -1307, -1527, -1526, -1726, -1480, -1577, -1510, -1307, -1101, -632, -797, -463, -146, 41, 472, 646, 813, 1179, 1301, 1571, 1690, 2069, 1903, 1965, 1926, 2050, 1797, 1821, 1585, 1208, 1032, 654, 658, 389, -158, -234, -606, -679, -720, -1048, -1022, -1274, -1284, -1306, -1395, -1147, -1329, -1112, -676, -938, -813, -375, -494, -153, 81, 132, -212, 84, 581, 310, 372, 386, 298, 324, 612, 487, 428, 310, 76, 173, -197, 101, 22, -117, -142, 103, -5, -254, -144, -436, -185, 39, -169, 0, 259, 150, 355, 354, 154, 239, 573, 642, 472, 373, 515, 266, 48, 87, 34, -320, -225, -411, -216, -804, -380, -772, -737, -732]
2736g32m31M91j64J23P9m02N11J48j89K30J5L45j23P49k32Q5L09J55K70L1p8J69
2758A359q1J59r6j23l1l25K6L5m17J23j34j66m57k13j07k38k43j81L44m36r5j72
2780a469k23K54L27j1K92j2p4k0L20K31R8J62R0J06L11j2k8J55l97M49l07K6j40
2803A28k7k76K22k72J06k05K74k55J38RM86KM8K48J52M46j56L01n2K03O3K13k9
2826A767q9k53M6j31j76q8n06k62k70j16m82n26k50o3k99l06j57Rj84J28nr3L02
2849b004J72J16M44J14L43J84M75L48K9L24K03J43j15J59N4O2K8K8n12N04l03
2870G96k94k5O5k64k35J37j52k6n2K14L31JK9R1L2K77M2K4R8L17k43N3J16j72
2894A160k15l7j79l62k13j07o40j94l69Jk26m45l05l9l3m6K3M0k64O63j4K97J65
$$ y = [-732, -1163, -672, -836, -713, -634, -1036, -525, -377, -566, -336, -321, 24, -99, 650, 418, 503, 812, 967, 1237, 1268, 1190, 1359, 1278, 1437, 1341, 1218, 1187, 862, 888, 923, 506, 629, 495, 329, -128, -341, -448, -686, -929, -1110, -766, -1202, -1297, -1469, -1692, -1438, -1111, -1122, -830, -842, -916, -936, -616, -385, -287, -125, -35, 71, 382, 370, 342, 497, 100, 549, 242, 268, 128, 101, -175, 47, -225, -119, -324, -50, -305, -167, -158, 328, 330, 378, 626, 778, 1224, 1068, 1369, 1317, 1520, 1583, 1796, 1767, 1678, 1425, 1471, 1340, 1164, 1076, 570, 308, 38, -78, -560, -1086, -1336, -1399, -1698, -2004, -2161, -2152, -2336, -2208, -2213, -2306, -2004, -1832, -1716, -1272, -1158, -815, -631, -156, 192, 221, 545, 748, 891, 776, 935, 989, 1051, 1079, 1107, 595, 1099, 796, 502, 477, 542, 278, 43, 180, 28, 2, -50, 164, 495, 496, 525, 616, 648, 925, 967, 991, 1089, 1406, 1163, 1216, 1332, 1160, 945, 908, 729, 367, 154, 47, -593, -787, -1156, -1155, -1381, -1826, -2131, -2170, -2203, -2249, -2226, -2186, -2450, -1787, -1801, -1504, -1339]
2917a339K61K95K98L95n5O65K37Q5J42K56J96m6rJ01J41Jm51J42O2m76J47l51
2939F97k63N0l77m2M2j25n0k17M91j86K5K36j13M00j64j34K35J8j71K60j07j15
2961C90j13O0k05m7m33m6k92m2k12l21jr5j98j1k12K3N9j3J81L29J87J31J70K08
2985e03L76L00J35L47J94J18P1K10K70n5o5J63j31K07n02J49m38L5l50k01J62
3006D92n65P6k51L8k66J48j27L0p7J01m1P3P3j07K88L85m00M75j94M2N4q9k55
3029i7K88L0j27k47k02o8q0j93J13m59K24j55J09R0o2j49K20R1K18K50N0J76L55
3052C75k06J70J92L44O2k4K25m9m6P5l9k11J2l02P0j52l10j14k14P2j38Q0l71
3075d99K97m36K12k57J40m1o7J38K63j3j08J96L2K31K4k54r7L11K9Q0K6K15l08
$$ y = [-1339, -1078, -783, -485, -90, -145, 520, 757, 842, 984, 1240, 1436, 1390, 1381, 1482, 1623, 1624, 1173, 1315, 1377, 901, 1048, 697, 434, 484, 107, 65, 107, -18, -68, -285, 206, 20, 45, 281, 168, 568, 404, 270, 505, 523, 352, 612, 505, 390, 277, 337, 132, 85, -348, -394, -686, -728, -940, -1261, -1262, -1357, -1555, -1566, -1778, -1755, -1696, -1709, -1528, -1199, -1012, -881, -711, -503, -127, 173, 308, 655, 849, 967, 1038, 1248, 1518, 1463, 1398, 1561, 1430, 1637, 1135, 1284, 846, 881, 531, 330, 492, -73, 3, -248, -210, -476, -328, -455, -425, -502, -401, -442, -369, -296, -403, -115, 270, -130, 345, 151, 193, 247, 158, -97, 191, 221, 94, -153, -355, -423, -503, -696, -583, -1042, -818, -973, -864, -774, -836, -985, -765, -674, -456, -206, -156, 20, 375, 169, 339, 531, 875, 937, 913, 1138, 1089, 1043, 1118, 1079, 868, 880, 578, 648, 496, 186, 72, -142, -70, -208, -128, -499, -202, -638, -426, -683, -543, -584, -651, -513, -250, -263, -371, -175, -143, 88, 112, -142, -239, 72, 101, 181, 207, 422, 114]
3098A14J14j64j8J33k54J02l1J09k2Qj35Lj5M4n4L3J74k16R3J81Q9k31R1J12k3
3123B37k11J01j69M84l31N7j5n3J4p5M8J07J09m89n5M04m26k97K90k2J37k50N5
3146c50J01j08J54q4N0k25K78k99L69j4J86j1m6J66P6M8J01j00K83R6q0K30k22
3169E99J98J06o4l03N9l8j04j41mj29j80n8k02r3j88P7K30o01J41K33j53p6J47
3192e44j56J02J46K64k11k4L61J54J71j43Ol2O8j85K40J3j70J7l05J81J98l18
3214a67l27K74q2pO9M3L67k58R2K6K18j27M13J9K90j25P1K21q3K06l4L90m92j84
3238H13q5P9j36l28p7r3k23j47l7m73l23J95l24L7l7l58K78j38N8O6M47k8j46
3261i80M13Q7K93O7J87R2N1r3Q3J22L78k62j7l7j47J26q9l35K17k70K27M9n39
$$ y = [114, 228, 64, 46, 179, -75, 27, -4, 105, 83, 91, -44, -41, -56, -12, -66, -33, 141, -75, 18, 199, 288, 57, 148, 260, 237, 26, 127, -42, 442, 111, 168, 153, 100, 114, 39, 87, 194, 303, -186, -241, 163, -263, -560, -270, -292, -155, -405, -350, -249, -357, -203, -287, -237, -462, -184, -483, -114, -128, 58, 47, 1, 167, 243, 291, 392, 292, 575, 671, 591, 821, 599, 797, 903, 839, 536, 595, 557, 453, 312, 308, 179, -1, -59, -261, -354, -542, -465, -235, -836, -695, -462, -615, -691, -544, -700, -598, -452, -188, -399, -423, -62, 92, 263, 120, 126, 94, 162, -23, 217, 230, 60, 77, -228, -47, 151, -167, -494, -220, -302, -309, -240, -197, 170, -88, 4, 30, 248, 121, 534, 553, 843, 718, 789, 1010, 927, 1133, 1099, 1489, 997, 813, 728, 807, 671, 343, 266, 173, -50, -197, -234, -707, -1030, -835, -1159, -1122, -1159, -1517, -1239, -1377, -1319, -1253, -806, -834, -980, -567, -480, -187, -120, 67, 159, 210, 117, 200, 322, 700, 438, 421, 384, 237, 363, 274, -61, 156, -114, 113, 162, -377]
3284c77L09K6J06k32L51J55l11M42j37K85R6J83Nj95K08P6O4O3p9j73j95k74J54
3307E50k97j75k12k89j16m03k30j5l5m29rm8J99O0j35R0N34l84L31K62K08J66
3329c77K70Q8L31J95L7R2lJ66J1j64j26K96qm32J6R8k94r9j3j31j70K86j44P0
3353eJ9K00j50J04K24j11J98O14k10R8l13K74L53o11K2J52m43J61l99q9j89k25
3375c26l22j60P0n80K36m79L36j80k60N2M75m11K16J41K37J40K79K1qL94J60K51
3397B82M46k14J47K32K4j1J60o4m46K44n9M8j87ql65Pj00J28k13O5m6k3K4O0L5
3422A66n8M46j44p4K62j00l9J97l9K21j40n23K64j09m29R3l40r7k11Q5j96k19
3444i84Lj49L5k69L82l17j07J66J39K68P5J76J13J47K58j0M68J14J1L8J33N8L6
$$ y = [-377, -68, -42, 64, -168, 183, 338, 27, 469, 332, 617, 713, 896, 901, 706, 914, 990, 1054, 1117, 1038, 865, 670, 396, 550, 253, 78, -134, -423, -539, -942, -1172, -1187, -1222, -1651, -1660, -1708, -1509, -1449, -1584, -1494, -960, -1344, -1013, -751, -543, -377, -107, -19, 312, 507, 544, 636, 633, 799, 810, 646, 520, 816, 808, 376, 392, 490, 196, 97, 84, -47, -217, 69, -75, -5, 14, 214, 64, 168, 392, 281, 479, 1093, 883, 981, 668, 942, 1295, 684, 706, 858, 415, 576, 177, 88, -101, -326, -648, -808, -738, -1318, -1082, -1561, -1225, -1405, -1665, -1613, -1138, -1549, -1333, -1192, -955, -815, -536, -515, -523, -129, 31, 282, 728, 514, 661, 893, 917, 906, 1066, 1002, 556, 800, 741, 789, 602, 594, 229, 236, 136, 264, 51, 116, 70, 47, 71, 131, 166, 108, 554, 410, 336, 598, 498, 459, 656, 617, 838, 698, 175, 439, 330, -99, -6, -346, -443, -654, -569, -765, -984, -981, -1130, -1095, -1364, -982, -1299, -1406, -1240, -1101, -833, -758, -582, -469, -322, -64, -74, 394, 508, 519, 557, 690, 748, 784]
3467G84j40N6J49l5l13K26Ql97K32m00O8r3j84j4O1J11l53L13k25N8j68J2K98
3490E4L0j68K30j23K42j17J04j00n0Qj98O1n7O0l20K39j14k2j07k10M3J34k51
3513f32j58M36j92j62K40O5M8K24k32L93k72M32J6j47J90j15K30J07K6j2o8J01
3535E18q5J8J45mj13k60J83j23j54m1K06k62k8O8j79LJj91%r2K67l2j16k2J19
3560a74L99m26j72M41k12j02J67QJ0j10J18L70l61P7l5k7j80L00j2j54j04L97
3582B18j62j05J89k73K90n4r8k32J35J65o6Pj20K03k43J35L2k74J95J03J18j35
3604B8J43j15K50k68Q8MRr5j76J05n7M3l67J51K86j16L1j38J10k27Q3J2Ol6L32
3629H6k74K82j76p0Q6J95PJ90o2M1O4J6R1j01j1r0O0k64L20j62nj8j59Q3p2m5
$$ y = [784, 644, 700, 849, 814, 501, 727, 735, 338, 570, 170, 238, 145, -39, -53, 8, 119, -234, 79, -146, -88, -256, -244, 54, 84, -84, 146, 23, 265, 148, 252, 152, 102, 110, -88, -27, -84, -24, -344, -105, -219, -241, -348, -558, -515, -381, -632, -790, -354, -546, -708, -468, -403, -355, -131, -363, 30, -242, 190, 206, 59, 249, 134, 364, 471, 497, 485, 417, 518, 433, 451, 596, 592, 479, 219, 402, 279, 125, 84, 290, 28, 0, 68, -111, -108, -107, -298, -298, -390, -123, -155, -271, -293, -174, 225, -201, -373, 68, -144, -246, -79, -71, -61, -171, -53, 317, -44, 33, -2, -29, -209, 91, 79, -75, -179, 218, 56, -49, 140, -133, 157, 103, 5, -227, -92, 73, 7, 14, -106, 97, -146, -11, 21, -253, -58, 45, 163, 28, 171, 56, 306, 38, 126, 130, 139, 44, -132, -27, -84, -41, -408, -257, 29, -87, -56, -194, -84, -311, -228, -216, -210, -246, 86, -188, 94, -82, -152, -66, 129, 136, 326, 264, 305, 369, 385, 476, 375, 364, 274, 334, 70, 390, 228, 223, 205, 46, 129, 57, 12]
3655A2j16j16k07j69M73j20k13o0J28J26j4P4j17J76o8j0n8J9K85M8j8J87q4o9
3679H9J90j93N1R8j34l23N0P7J04q7m6j14p2J44nO8R3m4K31k23J93k7j07L04J63
3704D80q7J93K8p6J29n0m6l65kK12q3J12m90K05l13j37j2L1L0k28k41P4qJ1M9
3729e84k11M41o7K8K7q9K42r8O8K87k1l1L97k78M0K94j53Jj74j03J69K03k47j67
3753b6N4P0l91L56j15J47j01J52r2P6j13K96j42Q8nK7r7J85j00J2K20J01k68J71
3777E05j26j28j54m8q3j12J98o27L73j55j01j44N3J27q3O2k62J36j38R6K19M5
3799c47k8J35k18L32L15p8K7N4O3Om4J00L26j68k14Oj82OK54j66k38K11K1r0J21
3824B04j13o6p8k93P1J34J32q8K28j86R0K86q3q4K3P4j5l1J54k97k7p1R0j86J77
$$ y = [12, -104, -220, -427, -596, -123, -243, -456, -516, -388, -262, -276, -202, -319, -143, -211, -221, -279, -260, 25, 73, 55, 242, 158, 89, 279, 86, 137, 235, 101, -222, -172, -95, 9, -78, -124, -238, -310, -166, -171, -103, -10, -54, 177, -46, 147, 120, 13, 317, 480, 393, 586, 614, 538, 667, 617, 571, 206, 204, 416, 333, 445, -45, 160, -153, -290, -302, -271, -241, -469, -710, -636, -644, -633, -584, -795, -354, -421, -393, -366, -455, -213, -311, -243, 44, 23, -8, 389, 111, 151, 445, 292, 293, 119, 16, 185, 388, 141, -26, 28, 98, -293, 63, -52, 95, -6, 146, 54, 130, 17, 313, 171, 259, 254, 281, 184, 369, 269, 281, 501, 602, 334, 505, 379, 251, 97, 49, -34, -146, 52, -575, -202, -357, -458, -602, -549, -422, -505, -443, -705, -569, -707, -611, -392, -347, -375, -240, -458, -126, 189, 111, 138, 192, 255, 261, 217, 317, 643, 475, 261, 267, 85, 91, 345, 179, -59, 152, 173, 83, 204, 91, 25, -53, -346, -275, -141, -9, -97, 131, -55, 35, 321, 238, 154, 177, 251, 236, 205, 359, 62, 35, -36, 54, -132, 45]
3849D5m23J20K6Q4j3k03j62n3L04l4N9j1j18j19J87K7K29o5K7rQ6R5J03L4K0R1
3875C27Q8l78K49J34j19L1OnKk09o3J49j0j72M5M9k0J14j98p3J50q2K9m7j43K24
3901G8l9M1j03L8K60J5j44r3k5Q2j36j48K08R2m95Q6J44J30j09j2j58K0O5J79
3925b4j62j52L06J04j84L1M8O1k16K72K1j75J84r1%p9J19J18K50n04K19n4K18
3948C10k29j98J26m6P8J9j23L06l22L7J39j45j59K29Pk71K62Q9l2q4l36K90J0
3971d3K2pk62L38Q6j40j37j20M94l36J47rl9J31J7j57O9R4P6p8m4P0n64M43O5
3996A16M3j90j01J67k8m6j94L1K21R9k67P7O0K23k82L20l47J00N8q5o6J82j0m4
4020C7k06J98k9pRj3m2J33o9j36J14J44m18M5N9j23K40j24L05j16j08K21K7o6
$$ y = [45, -378, -258, -232, -148, -161, -364, -526, -579, -275, -309, -250, -261, -379, -498, -311, -284, -55, -120, -93, -102, -16, 79, 182, 216, 236, 327, 415, 37, 286, 420, 301, 332, 338, 333, 335, 126, 63, 212, 202, 30, 75, 124, 104, 218, 20, -53, 97, 15, 44, -3, -146, 78, 39, 80, -23, 15, 275, 290, 146, 53, 28, 110, -26, -174, 34, 126, -369, -283, -139, -9, -118, -130, -288, -268, -203, -24, -186, -338, -32, 72, -112, -81, -33, 28, -188, 84, 105, -70, 114, 23, 23, -56, 63, 181, 431, -73, 146, 92, 310, 81, -117, 9, -37, 41, 60, -63, 243, -79, -42, 97, -48, -207, 22, 29, -242, 20, 109, 77, -7, -343, -53, -43, -21, -28, -290, 48, 134, -6, -143, -263, 231, -105, 42, 33, -6, 125, 142, -15, 54, 148, 224, 146, 102, 172, -392, 51, 116, 159, -31, -132, 35, 7, -39, -233, -202, 19, 118, -149, -72, -12, 211, -71, 249, -98, 2, 60, -25, -91, 91, 81, 37, -169, 29, 0, -7, 2, -11, -53, 80, 11, -125, -11, 133, -285, -240, -181, -304, -64, -188, 117, 1, -107, 114, 141, 75]
4044G5J2J83l05M3K40L7j56j05J24J63j44m8Q8p7k8K17n44N72m53J09J11m15M75
4067A74k96o7K25n5q9QJ12Mk50K01k12J06J73rl5k11N45k69l46L62J22j76p2l0
4091h5K5J66k32j4J17l27L22j3M3k23L36j57P8L8j82P1R9m6P3J34N1k03J11l29
4115a47N2K97J64m91K97j0J20j28l5k0J79l01J49M0J2m45Q8J54m56N38k38M5p1
4138b07P9K31l01K67l07Q9J66j23j9J21q9P4L5N4P0j18l3k50N80l24j41K10j63
4161i9L93l91K86r6m5o2K07k22N4k8M0q9J29j9l14M65r0q2qJ0n1Mm1J29j67O5
4187b2O2n5j88K98j28J17l0l5J48j92R2R2j18j66P3J30j14J09Pk19K04l67K48
4210e4K15K07n25L22j48L2M0p6N1OOo9J22o5P7l05J98KJ8P3j75O8P7k03Q1M03
$$ y = [75, 87, 270, -35, 8, 248, 285, 129, 24, 148, 311, 167, 119, 207, 130, 102, 319, -225, 347, -106, 3, 114, -301, 174, -122, -189, 36, -19, -108, -100, 12, 16, -234, -33, -245, -139, 34, 25, -10, -221, 324, 55, -291, 71, 193, 17, -55, -85, -60, 106, -126, -140, -23, -350, -28, -41, 2, -221, 115, -42, 36, 74, -108, -37, 62, 16, 89, 223, 274, 71, 182, -147, -95, 202, 366, -125, 172, 162, 282, 154, 119, 99, 278, -23, 126, 166, 178, -267, -179, -25, -481, 57, -181, -136, -207, -128, 103, -198, 69, -238, -149, 17, -106, -125, -4, -93, -19, 16, 70, 140, 22, -11, -261, 319, -5, -146, 64, -99, 294, -97, 189, 93, 48, -14, 193, -29, 25, -3, 37, -52, 77, 58, -256, 209, 119, 37, 29, 39, -12, -8, -49, 80, -87, -22, 40, -15, -203, 95, -33, 84, 54, 19, 167, -25, 67, 159, 41, -125, -52, 78, -36, 73, 80, -139, 65, -302, -54, 161, 368, -157, 165, 17, 49, 89, 13, 64, 70, 76, 7, 129, 64, 141, -164, 34, 36, 54, 127, -48, 20, 97, -106, -25, 378]
4236C78o33J74L43k22p8k5m5J37k96j10K59M1J04l3R9k68K7k0K44k0o4m7P5JK5
4261D6o5O3j41R8R0k08J97j22K89l72J79l44K18J02k58K44j18K76j63Q6j37K33
4283A93j45j32K56j1j57l7O6J18k36L20j81J09r6Q0j56j80J67j54J03J80N0j47
4305A0r2J83O9l02r0j46L24J22n9r9Rj27J89j09L01m21K99Mq3J44j55N2J10K2
4329A55K21k92K7K04l45j22M7L22n8j10p3L4j00J32j0j08J05j4K41l57J08O1q9
4352b1j34r2J84N0J50j67J75j46mj05K35j61N0J13k63K52q2J8j85n3N6J24J2j07
4376a01R2l4K1j43n8K15k2J70j92M0j25K81Lq4k04L34j4n3K40n05J39J8J13J68
4400B99k59J1J05k64L06l92K37m3l56K40L20l53j39L16j48Q3J17k40J46k7p9j5
$$ y = [378, -255, -81, 262, 40, -38, -63, -108, 29, -267, -377, -118, -77, 27, -6, 93, -175, -148, -168, 76, 56, -8, -55, 20, 21, 46, -19, 44, -97, 1, 91, -117, 80, -42, 247, -125, 54, -290, -72, 30, -228, 16, -102, 174, 11, 97, -40, 193, 48, -84, 172, 161, 4, -33, 33, 151, -85, 235, 54, 163, 67, 147, -9, -189, -22, -176, -73, 107, 157, 10, -82, 101, 170, -132, -222, -368, -44, 78, 19, -80, -71, -198, -9, -118, 183, -238, 61, 65, -18, 126, -29, 23, 133, 155, 376, 84, 111, 315, -30, -152, -105, 217, 159, 49, -24, 10, -90, 42, 32, -76, 29, 15, 256, -101, 7, 68, -21, -155, -247, -63, -13, 137, -30, 145, -1, -5, -110, 125, -36, 14, 127, -136, 116, 34, 52, -133, -186, -130, -6, 6, -101, -9, -43, -22, -165, -223, -8, -30, 140, -52, -12, -137, 144, 147, 63, -141, 193, 179, 126, 366, -139, 0, 18, 131, 299, 40, 51, 156, -108, 198, -194, 43, 0, -356, -116, 204, -149, -288, 28, -120, -37, 80, -160, -14, -41, -120, -135]
4422a35k57M08J24j76J38L5n6j24K00m38J93J64o3N1o0L4q5R1l5k7J31k62K61
4445A12l37m8K96j51KMJ00rQ5j16q4K62O0j93l4K80q1L7J97j47p2K2j63Pk0K19
4471B28j35ml76J26Q5J78j65k51Q9J49j32K2j8m4L83l48J42J77l77J44j43L15
4493D5n2K1J16k89L1n9K79J7k09J18j22J35k22P5P2nJ42k60R4j44J87l3N0om2
4518f1P2j64K50N3J2k42K20j35K11j07j37K45j91L21m8k76nL17k26n1j4o6j5o2
4542i9J54k35J33l52M39j48K98l02Q3P9j65J59j84K12O0Pj58J36n9j05O2J96k23
4565a2j99L36k9j50J28k11K3J95l11Q0K82l33J4Q5j07K01J21k30J2J0Q1j64L94
4588B16j49J94l59L29k19K68l21K06J37l33K72m04L39nj39R4Q9k51r3M8R3j80
$$ y = [-135, -392, 16, 140, -36, 102, 137, 81, -43, 157, -281, -88, 76, 13, 64, 4, 38, -47, 44, 9, -18, 113, -149, 112, -225, -273, 23, -128, -126, -122, -22, -31, 54, -62, -146, 116, 176, -17, -51, 229, 148, 185, 382, 235, 163, 185, 22, 29, 9, 228, 93, 89, -287, -161, -76, 102, -63, -314, -225, -76, -208, -186, -204, -248, 135, -213, -71, 106, -271, -127, -270, 45, -7, 14, 130, -159, -128, -187, 92, 109, -100, 18, -104, 31, -191, -116, -44, -49, 93, -167, -73, -217, -30, -63, -13, -19, -61, 11, -153, 97, 150, 162, -80, 140, 5, 216, 109, -28, 217, 26, 347, 299, 23, 18, 335, 109, 58, 44, -22, -37, -99, 55, -180, -47, -399, 40, -108, 190, -112, -29, 50, -115, 44, -140, 72, 132, 139, -19, 117, 58, -47, 15, 211, -12, -211, 125, 96, -54, 74, -137, -114, 81, -230, -150, 132, -201, -187, -102, -209, -8, 113, -117, -105, -95, -14, -178, 216, 67, 261, -98, 231, 12, 280, -41, 165, 302, -31, 241, -163, 176, 171, 32, 126, 215, -36, -129, -81, 12, -168]
4610a68O4j75L52l16J96J43j23o1R8J2Nj68L42pm7k98j03K45Mp4K44j36j66K85
4634A48l5j98K42q8k82K50J20l21J47K2J68m6j47L9n1Jj47J73Q4j67j91K38k63
4657c04L68M8Q3on9l5j02M1j21R2K8m2J46j75K06l8j94O0m5k98K46L42k90N4j4
4682il43r4L97p1j25K27l1Q4L2j66l9K61m6N8pK5k52K16r6L9k24k4O0R3Q5k6p6
4709e2J07P1K3k92J95j61K6K14k58J79L2K1j31J0j32M42l17n4R2k81N27k79Q5
4732F7J30k3m88L99J96j21K14k76P1k18Q6q8j03N6J53o2Q6l9j74J66j5j9k45J44
4756a03J83j48J56p9j22R2L09j61j71j3j54O34m01L3k3j87J12N5K0K64n67M57
4778A86j04q4P8k10p3K41L8k35K19j38k26J98R4K22l26l6L18j91k7m9M98n16n0
$$ y = [-168, -104, -279, 73, -243, -47, 96, -27, -88, 10, 22, 27, -141, 201, 194, 147, -151, -254, -9, -5, -79, 165, 29, -137, 148, 113, -85, 157, 69, -213, 37, 157, -164, -17, 5, 173, 127, -20, 19, -32, -31, -178, -5, 79, -88, -279, -41, -304, 64, 112, 195, 189, 130, 95, -7, 34, -87, 5, 33, -9, 137, -38, 168, 130, -64, -4, -49, -347, -101, 241, -49, 5, -9, -352, -446, -49, -120, -245, -18, -49, 35, 67, -99, -138, 123, 77, 135, 128, 153, -99, 117, 21, 60, -164, -188, -128, -35, 50, 24, -52, 55, 126, 149, -143, 52, -109, -83, 131, -127, 52, 84, 105, -26, -16, -148, 294, -23, -77, 15, -266, 261, -18, 67, 197, 174, -314, 85, 281, 160, 374, 98, 169, -49, 37, -51, -154, -98, 55, -7, 79, 40, -134, 32, 17, -2, -247, -103, 80, -68, 88, 9, -113, -21, 288, 127, -44, -57, -211, 423, 22, 55, 32, -155, -43, 12, 32, 296, -271, 186, 82, -2, 76, -134, -207, 34, 72, -163, 56, -82, -308, -110, -16, 206, -120, -156, 162, -29, -56, -105, 393, -123, -173]
4801a73K42O0j69K21j33K84m0k21lk5K26j13j01J86r0K3k11J81j50J07o4L5j08
4824c6R8J1l04L89k6j03K8k14J78J65k40J79r9M2n4m7J98j39J35j29j47J02j99
4847b12K98l43K70j08Q3o5p1Q4k08q0K13K9J41N9k89P2K38j31p9J68J80k73L67
4870C43r4l15L78n4q9J62p6Q3q0k17K4K14l50J47J87j84J8r4q8mJ13k6j30m7J9
4895a60O7Q6r9j13J94j69J22j28L51k74O2o3K14p5M7p6j32K73j03j01N0J57k87
4918a57J43l8j45q4R2K45N8j93L11l31K81j87J5J09o3K00J16J0L1k94K48m00J28
4941I5N8p2L16l06J92j06k05r1J67m0M2l78M29K9k11j66J93q8R4j17K1R6N9j23
4965a12no8M00k37O6Q4p0J69J29j48k27K23k07J56r2j71J65J7k48J2J07j53J85
$$ y = [-173, 69, 129, -40, 181, 48, 332, 292, 71, 68, 43, 269, 156, 55, 241, 151, 174, -37, 144, -6, 101, 37, 72, -36, 62, 73, -231, 158, 132, 29, 57, -157, 21, 186, -54, 125, 26, 68, 14, -33, 165, 26, 161, 32, -115, -13, -212, 86, -257, 13, -95, -12, -77, -148, -64, -272, -352, -139, -110, 31, 90, -199, -127, 111, -20, -99, 69, 249, -24, 343, 249, -66, 312, 258, 169, 331, 255, 338, 258, 41, 65, 279, -71, 76, 263, 79, 97, 3, -85, -89, 24, -2, -132, -179, -160, -93, -7, -106, -219, -25, -194, -72, -200, 151, -123, -61, -124, 90, 15, 62, -14, -146, 127, 24, -77, -27, 130, -157, -14, -52, -197, -281, -189, 56, 114, -79, 232, -99, 182, -5, 10, 119, 56, 256, 372, 382, 413, 119, 367, -33, 95, 153, 81, 397, 91, 283, 177, -28, -119, 48, 8, 50, -328, 101, 130, -81, -247, -54, -142, -48, -165, -144, -48, 11, -112, -117, -185, 215, -22, 44, 128, 58, 227, 356, 208, -19, 204, -3, 153, 61, -110, 55, 72, -176, -164, -57, -210, -25]
4988b5l32M53r3k4R1J03N3j43k11K43O8m0m0J51j92K1J06ok10L3L0nJ11k2P6P1
5014B67j90n7r1K10p6k37p4R6P6j86M7P7J49K3k29K63k44M1J80J96k74j84K66
5037D9O2j74J67j95K04no2j28j07M57m29Q4J04P9k16R6j8k40K25n8J47j26O8J46
5061A30K3K3k34n2J04J68j7n6K27k73R2J24j90j56K17j23J99j13j53L3q6O6L9
5084hM1p7Q1j54J02N6p8K1K4L2j03L7J72l83J70R7K37j68j39k4Q5j48k0L34j71
5109A6K3k85L68r3M4L7r9l28K77K48j95j12j06q4K94J34m24J85K64Pl00J61j01
5132f9q4L82n18L67k52l4J43K93j29j82K21J71p0j22m9R8j39j97K66J20k34J06
5154H8j59O5j77L21O2j57r5P5j81q2K68k64M31j89K10j76K25j4k12q4J04j11%
$$ y = [-25, -357, 96, 3, -21, 70, 173, 226, 83, -128, 115, 183, 143, 103, 254, 62, 83, 189, 183, -27, 6, 36, 31, 142, 120, 196, 267, 77, 20, -71, 139, 63, -174, -248, -152, -76, -262, -215, -138, 11, 34, -195, 68, -176, -135, 45, 241, -33, -217, 49, 111, -63, 104, -91, 113, 108, 46, -82, -189, 268, -161, -77, 27, 106, -110, -14, -32, -272, -47, -105, 42, -84, -16, 130, 153, 176, -58, -110, -6, 162, 145, 89, 316, 43, 135, 259, 69, -87, 130, 7, 206, 93, -60, -27, -113, -47, -8, 33, -44, 37, -117, -15, 41, -37, -16, 8, 40, -63, -26, 146, -237, -67, 30, 267, 99, -40, -64, 21, -127, -147, 187, 16, 39, -246, 122, 29, 73, 110, 11, -317, -40, 208, 13, -99, -205, -289, 5, 139, -285, -100, 164, 171, -129, 32, -69, -153, 229, -289, 78, -174, -208, -65, 228, 99, -83, 138, 309, 239, 117, 68, 166, 27, -170, 96, 216, -18, 88, -71, -6, -183, 138, 200, 43, -52, 23, -158, -240, 28, -236, 195, 6, 216, 40, 265, 251, 39, -45, 59, -52, -52]
5177e2%o3J15jL7R4J01m5j21j15J21k28K17j38K43j22M4J21l06QOK3N3K86l70
5202i2J38k63J70j0j06j63K45M6j0J06r2K56j90J63k01J75j71K76j92j08Q5j10
5224d8n7J70j11j17M71j60L8l52K15nj15r9j63K79o2K00r3L2No8j60J49o0J31
5248B0J75j48Q1p7r5K29k12j60p0J99J28j27p8j08O2M5J21q4N5K34j09l2j02p6
5272a29J67P9nk35J39j31l7J45L16k92j2O2J51k54Q3J07j5l03J76J86K3k44J95
5295A72k91j83J25K30r3rr2K05j62K90r7l96M82j33j50N9k18M28l67J62J30j26
5317c4q2n3j24L22o0J45j41n9O0k21K17j11K84l56J14O0P2k18J85k57K30N9l1
5340AJ21J12j52l0P1r2n3L38j17j92j3K17j33J90j50q0l4j81L23J3j70O7j19n7
$$ y = [-52, -52, -115, 0, -1, 36, 130, 231, 186, 65, -50, 71, -157, 60, -78, 165, 43, 87, 208, -98, -90, -84, -61, -8, 278, -92, 46, -217, -47, -57, -163, -326, -81, -35, -45, 61, -31, 225, 35, 198, -3, 172, 1, 277, 85, -23, 62, -48, -105, 65, -46, -163, 308, 148, 186, -166, 49, 44, -71, -170, -333, -54, -116, 84, -9, 23, 28, -40, -200, -51, -111, 20, 195, 47, 128, 51, -44, 185, -27, -187, -257, -58, 70, -57, -135, -243, -181, -136, -15, -99, -44, 190, 81, 49, -53, -129, 38, 117, 112, -123, 16, -115, -152, -7, 309, 17, 5, 67, 218, -36, 47, 154, 139, -164, 12, 198, 221, -23, 172, -119, -302, -177, 53, -40, -49, -141, 64, -98, 192, 95, -301, 181, 48, -102, -43, -261, 167, -200, -38, 92, -34, -116, -169, -293, 29, -31, 114, -27, -86, -26, -247, -30, -141, 143, -213, -99, -39, 33, -185, 0, -257, -27, 32, 1, 122, 234, 82, 52, 123, 31, -22, 316, 199, 7, -6, 211, 78, 268, 118, 38, 4, -177, 146, 159, -11, 56, -63, -120]
5364a20L4L8M1r1J47k24J08j03r0K08o0N4M4J06n4j79K44o2P8k39J02R1o0n9l7
5389h3J97O7k52m6J08Q7k55P8R2j58J89N2k16j06L59J05j66j29K62j38r1J91l47
5412b00K07j4J13j68L8J45r7J57l37R9J12P8m2j25R1j42J78k95K13L0j09jJ19
5435E0j32n9J30K52l38J69J69k69J23j56j51J51j4J37n7k0P5j01J30j18q5L5J12
5458C3M8j82MK00p6N2p5k35j14L04O7m7L6q2Q4k12L70l90K02J52m4j21r0J03M8
5483C5J00k02N0j4J83j02k10J30P3l2Q9j30j61K20j59J79N3l23L75k33j6K85k00
5506a0N2j87K12O5nk83Q4M9K9M0J84j93o6K11j43J01q4j25L30k07j10M3J36j29
5530fn3Q0R5l20P3K28l47L83p7j36J25n3j03k5Q4Q0j53J48j01J89l29M17j55N1
$$ y = [-120, -86, -48, -7, -98, 49, -175, -67, -170, -260, -52, -112, -58, -14, 92, 38, -141, 103, 41, 119, -120, -18, 73, 13, -46, -83, 114, 181, -71, -117, -9, 78, -177, -99, -7, -165, 24, 76, -140, -246, 113, 218, 52, -77, 185, 47, -44, 147, -200, 7, -7, 106, -62, -24, 121, 24, 181, -156, -57, 55, 133, 91, -34, 57, -85, 93, -202, 11, 41, -68, -69, 50, -82, -141, -11, 241, -97, 72, 241, -28, 95, -61, -212, -61, -75, 62, 5, -15, 60, -41, 89, -29, -114, -79, 33, 81, -101, -97, 103, 27, 79, 4, -231, -345, -41, 26, -21, 15, -67, 17, -195, 175, -215, -13, 139, 95, -26, -116, -13, 35, 135, -67, -17, -31, 152, 50, -160, -30, 43, 11, 100, -30, -191, 29, -130, 49, 102, -221, 154, -79, -95, 190, -10, 42, -145, 67, 132, 127, -156, -72, -23, 6, 46, 230, 37, -29, 182, 39, 140, 56, -69, 261, 54, -56, -13, 123, -6, -59, 21, 116, -204, -131, 97, -250, 133, 56, -80, 45, -8, -111, -136, -52, 28, -125, 23, -78, 111, -218, 199, 44, 95]
5554I5k7M3M6o1l4R2j2J0K00J05l96o0K92l50Q9j7J60k90K52k0k51J44M2p4j89
5579b11k5l3J25J7J07Q3j23JNJ11J26j69J31j96N1R4j63n1J96j18K3k47L36p5
5603eJ4k59J32K93j27j77O9O3j19J45L3k10Q5R8q8N4P1k04M55j76l06M14m51L42
5627A46k72J21Q7J76k16j11K3K30l20J49n5Q1j93N2J86r7K3k98K93k03J90j00
5649a08P6o6m4l4J73k12K15K97j96n1n8K76k78qq5MJ91j3j42K43j32j27P4j78
5673a83L62K5k93rJ51J6p3J72r5J0j64K84m91M04k7j39Q9J9J86k07K2o3N8J55
5697B09k17J32K17l83J90k77J05R5K00j32l85K51M4J51k32Q8Q3j54k61J67N8J27
5719G6J61m57K86l2o6P6k2L0q3l05K59k0o9J98j46K3O1J63J33l67j4J07P7k57
$$ y = [95, 68, 111, 157, 96, 62, 154, 142, 152, 352, 457, 61, 1, 293, -57, 32, 15, 175, -115, 137, 117, -134, 10, 52, -22, -211, -236, -269, -144, -127, -20, 63, -60, -59, -54, 57, 183, 14, 145, -51, 0, 94, -69, -120, 76, -42, -19, -266, 70, -5, 9, -250, -118, 175, 48, -129, -60, 3, -116, 29, 62, -148, -63, 35, -53, 1, 72, -132, 323, 147, -159, 255, -196, 146, -126, -5, 82, 258, 42, -69, -46, 184, -136, 13, -42, 39, -154, -102, 84, -13, 10, -288, 5, -198, -8, -108, -32, -98, -142, -176, -3, -215, 0, 297, 101, 50, -8, 268, -10, -18, -103, -99, 92, 79, -63, 180, 48, -79, -5, -183, 179, 204, -89, -98, 53, 69, -4, 168, 73, 83, -81, 203, -288, 116, 89, -50, 39, 58, 244, 37, 59, -4, 54, 209, -8, 124, 341, -42, 148, -129, -24, 71, 271, 139, -246, 5, 49, 200, -32, 56, 139, -15, -276, -109, -51, 76, 237, -220, 66, 34, -32, 44, 22, 52, -31, -336, -77, -97, -166, 32, -114, -91, -30, 133, 266, -101, -115, -8, 69, -188]
5743a88J61j61K72M3R1j35l2J9J78l01j4L29j42k99K70l1q0R7k01l2j07L74m5
5766F6j36R1J67k51K23o1JL7K3j97L8j44P0q3J26j70J28N3n1P1l24K49j53J25
5790a02O3L0K6j76J51Q7j85J38j92Q6j29J61K2K5o3j6O5M1j1L5L7k62Q8J62j84
5815a03mm4K21m5l9J57k05K37j5j03j61J09p2j94K34Q9j00Q1o8p5N2mP8j28M7
5840e5J86m7j20j25K44j94J39R7j19j11pM0J19j58J8K60o7k36J8K11j56J36j3
5863F0L4N7k7j98MR7n9p5K28j45k6Q9n6L8Jj82l8j3o4PN26j76q7R5l05L78k98
5890a35J80L2k84L07J78j52m50M69ll62J21J62m4K38k48K69k02M0k25k39M18n0
5912B0J37l02L49j74m1j56J91N7q9q4L5L07kj70j12L27k90J21L9k34N4K17l06
$$ y = [-188, -27, -188, 84, 127, 218, 83, 51, 70, 248, -53, -67, 262, 120, -179, 91, 60, -20, 77, -124, -156, -263, 111, 66, -70, 21, 188, -63, 160, 99, 100, 137, 160, -37, 1, -143, -73, -156, -30, -200, -72, -19, -70, 1, -323, -74, -227, -102, -39, -9, 17, -159, -8, 79, -106, 32, -160, -74, -203, -42, -20, 5, -58, -74, -9, 32, 21, 56, 93, -169, -81, 81, -103, -107, -151, 70, 25, -14, 143, -62, 175, 160, 57, -104, 5, -67, -261, -27, 62, -38, 43, -25, -100, -48, -52, 26, -102, -55, 131, 84, -36, -161, 83, -111, 28, 125, 6, -105, -112, -72, 47, -111, -93, 167, 100, -136, -118, 93, -63, 73, 60, 94, 151, 124, -74, -70, 27, -32, -107, 121, -24, -50, 39, -17, 21, 22, -160, -198, -211, -275, -268, 258, 82, -5, 90, -215, 163, -135, 45, 77, -207, 100, 278, 126, -324, 145, 142, -220, -99, 63, 19, 257, 9, 278, 76, 116, -109, -348, 70, 20, 157, -145, 204, 30, -11, -167, 24, 81, -8, -92, -57, 250, 248, 78, -34, 293, 3, 124, 163, -71, -17, 200, -106]
5935a06Q4L5l07J95RJ40k9m8k1K9j64K17j4R3k20m6r5K05J93k46O6J12J6k25J90
5960F3O3p7N3j54q0K66j59J79j5j75J43j81q8K79k4j09M45m55J3L6j68O9J27o4
5984a3J91j16j67mJ41r9l4K8P3j97L71R5j95r1JJ90qk48R3j9L1j48J69n0l05n7
6010c68J71K28M6K1j84R7j29o5K49j82k78L34J4M7J17k6j8m2P2r9k45L25O3K06
6034C54l10P1M5L7k7k9J3k03j25L55m82K11J66j72o1J64MJ9o8M0j19L27k61K49
6058A98n23L16J16qk12J17K21j96r8K00m1j34l6P8M4l31J69J55o1j73K53L2j19
6081c3o3j00M26l92N9j06J54km1j0J76j50K63j84J13l6M5J05j12r3L27l05K4J42
6105B07j20Pk32K18L4j02M9K3j00o3K29l8n0j25j7l3K22K21m16n5J20J18O1k26
$$ y = [-106, -22, 13, -294, -99, -90, 50, 21, -27, -48, -19, -183, 34, 20, 113, -107, -153, -248, -43, 150, -96, -30, 82, 98, -127, 63, 126, 49, 102, -52, -132, 134, -25, 154, 139, -36, 107, -74, -162, 117, 93, -16, 429, -26, -13, 23, -145, -76, 51, -13, 178, 62, -105, -109, 32, -67, -101, -73, 0, -197, 174, 269, 74, -17, -16, 174, 166, -82, 11, -8, 23, -125, 44, -6, -311, -368, -197, 31, 77, 98, -86, 11, -118, -183, 66, -116, -394, -60, -46, 1, 118, 92, 74, 32, 104, 5, -240, 85, 148, 354, 44, 115, 160, 197, 170, 141, 154, -49, -174, 181, -301, -90, 76, -96, -157, 7, 11, 30, -38, 2, -117, 210, -51, 198, -325, -9, 107, 99, -113, 4, 225, 29, -69, 131, 90, -44, -80, -2, 42, -289, -120, 35, -26, -199, 54, 86, -33, -96, -196, 230, -162, -103, -209, -55, -57, -98, -108, 68, -82, 181, -3, 110, 74, 119, 224, 112, 19, 346, 41, 65, 207, 87, 94, -138, 80, 114, 12, 61, 84, -16, -79, 150, 112, 62, -63, -80, -113, 109, 330, -86, -141, -21, 97, 158, -68]
6129f8o8M98l21k10J94p5j41J46j70L20J23l56R3k4J12r1P9j66Q9J2L7j79J86
6152B0k33K74p3l6nJ19N4N5l7n2m9J26q8OJ21j92K82j54J8N2k26k3K0j0N7k7j32
6179a33R2J0m5K98j71M8j41J12l29K19N4o2l7J62j73K49P8k93J20j48P0l8MJ31
6203G7j15Ll9M6qp6K54q9J54k32j21R6M6q6O8O5r6lj47K83j21K93k40K3j51J07
6229iJ8J08Q8j94RmK01k17r9J23j38M5J76o0P6j42m1j81M04j71M6j45L7J09j59
6254a20R1O6J77l48L79o8p1K0k95K56j16P2K5k9J16k87R3J27n1L0R1k03Nl0j20
6279a90K66j05l9j36J86L2j13J49j76J00r6j40K38O1k53K20o6K1K04l48P3q2K08
6302A4l79J63J95j39K67O1j81K70j94J76k95J56m1K41j68k82j25L04j24K7L0j42
$$ y = [-68, -136, 362, 41, -169, 25, -50, -191, -45, -215, 105, 228, -128, -35, -59, 53, -38, 41, -125, -36, -24, 13, -166, 20, -213, 61, -12, -48, -53, 66, 120, 175, 138, 86, 37, 163, 75, 81, 202, 10, 292, 138, 156, 208, -18, -41, -21, -31, 26, -1, -133, -41, -31, -76, 222, 51, 99, -42, 70, -259, -40, 14, -48, -85, 77, -96, 153, 231, -62, 58, -90, -20, -58, -54, 77, -38, -35, -74, -28, -36, -112, 142, 53, 207, -25, -146, -50, -4, -90, -22, 43, -53, -56, -203, 80, -41, 252, 12, 35, -116, -9, 9, 117, 205, 11, 20, 16, 217, 0, -99, 24, -114, -69, 107, 47, 123, -19, -60, -241, 163, -8, 38, -107, -70, 39, -120, -29, 37, 214, -134, 245, 177, 106, 126, -169, 87, -29, 43, 68, 39, 155, -132, -39, 88, 37, 67, 158, -45, -40, -70, -190, 76, -29, -68, -204, -18, 14, -99, 50, -126, -26, -122, -262, -24, 37, -216, 4, -62, -41, 163, -185, -112, -194, 14, -365, -202, -7, -146, 121, 182, 1, 271, 77, 253, -42, 114, 73, 314, 146, -136, -261, 43, -81, -54, -24, -166]
6324a66LL14j51R4Ll4P3rj65J01L1m27L43j3p5K53J3l02R6J76K9j46j66K22J1
6349A08j53L4K89j77m67M32N0k85L78m35K54m2k74J79P8J39j97k01K04J16k87
6370b57M14qJj8k1j55j8J62L6k22L8K86l63K32j56J05N2j46J45r8N3j72J02J09
6394A01j1J3q8L4p7J9k2J24j35K16q6j87l4K3P3j10K38j06NM7l3J59m28J55J9
6419i1j9N9L6k38K46J11p1m04L36N8k16O8J61l6l01M12j56oJ33N2j67k07M16j98
6443b2Q6J04k75N5M00m03J27l8k37K83N1l38K31J33l47j01L17K3J7j39J44N5l3
6466I3p7l8J05j54J26o0K33j20j00q0L1j78J72J47o3k68J80j0j07K21k78O8k4
6489a81m8P8J01p5p0QK5J57j4j65L53L3K19m91J12J44n2q5O9M6k59K99k87kK89
$$ y = [-166, -163, 151, 0, 94, 97, 63, 136, 127, -38, 63, 94, -333, 10, -3, -78, 175, 188, -114, -18, 158, 187, 41, -125, 97, 108, -45, -11, 278, 101, -366, 66, 116, -169, 209, -226, 28, -14, -288, -109, -31, 108, -89, -290, -86, 30, -257, 157, 149, 150, 132, 111, -44, -62, 100, 136, -86, -48, 238, -125, 107, -49, 56, 108, -38, 107, 9, 62, -110, -8, 101, 90, 103, 15, 49, -28, -9, -31, 93, -42, 174, 88, -99, -133, -110, -37, -147, 91, -15, -10, 37, 4, 163, -265, -110, -91, -110, -51, -15, -253, -7, 104, 33, -371, -35, 23, -193, -125, 36, 0, -301, 111, -45, -51, 82, 134, -33, -240, 176, -22, 64, 168, -107, -52, 348, -55, 72, 34, -203, 80, 131, -207, 24, 157, -190, -291, 26, 49, 66, -73, 71, 126, 93, 16, -22, 83, -71, 55, -5, 228, 108, 8, -72, -41, -219, -47, 100, 37, -231, -51, -61, -168, 53, -225, -157, -181, -229, -151, -50, -125, -195, -187, -162, -5, -19, -184, 169, 202, 421, -70, 42, 186, 134, 49, 118, 164, -95, 204, -83, -85, 204]
6514B04l59p4L21k27K62k44P5Q3j06pp1O8L24n10M17n36O85j97j98N7R3j94j7
6537a51j02J98P3K77m26k4J88l3K12n5k57j23K29R5k13j2Q1q7n5N6L45L1l56J89
6561H0J18l09R6K3%L7J0j00J03O5J3J63n38J84j8j13K75j36K04L9Q9l76J82J19
6585B10k63k51K94K35k25q1K2j81M55k09n9K7k02L61j73R0J3j20O9J99l9k37j34
6608a99K71n9j34J37K01k52j84K1L49k17J48k14J71q0m1J53j20Q5J77j8j63N2
6630H4K08k54k91J72K64l04J18O5m7K77j87l32L62j67n6M11k45k9J1O7k74J74
6652B7k00K43R2m96M84Jj9j73j23R9OJ3L42j63l02R3J20k0j9m8m7J20k6j6M4j43
6678a11J36k0Q5j52mk6J27j76J98N4l6k8Mj05N5k14R0J37l90M22j52K07O3k46
$$ y = [204, -155, -229, 92, -135, 127, -117, -42, 41, -65, -72, -143, -75, 249, -261, 156, -380, 305, 108, -90, -33, 60, -134, -151, -253, -55, 18, 295, -131, -155, 33, 0, 212, 157, -100, -223, 6, 101, -112, -124, -43, -130, -185, -129, 216, 247, -109, 80, 198, -111, -15, 8, 8, 45, 55, -45, 58, 123, 136, 299, -239, -55, -73, -186, 89, -47, 157, 196, 285, -91, 91, 210, -53, -304, -10, 225, 0, -81, -59, -240, 215, 6, -53, -26, -228, 133, -40, 50, 63, -57, 12, 211, 172, -65, -199, 72, 13, -121, 16, 217, -35, -219, -198, 151, -66, 82, -132, 39, -41, -82, 71, -49, 36, 213, 195, 32, 84, 292, 38, -253, -81, 183, -121, -3, 62, 15, 292, 105, -227, 135, -32, -88, 323, 78, 49, 60, 127, -147, 27, -173, 70, 162, -334, 150, 151, 132, -41, -164, -65, -59, -46, 296, 133, -169, -76, 44, 24, 5, -43, -90, 30, 4, -12, 32, -111, 25, 5, 90, -62, -66, -92, 35, -141, 57, 111, 75, 47, 51, -54, 1, -213, -123, 14, -376, 46, -106, 101, 164, -82]
6702h2J49k27j6L02j40n1k43N3K06J6J22p0MJ93l37K00J17j68j5K61j59j68j3
6725f6K51l00j3rJ32Nm1J0j89J53J52j0j0q2J48n02L38m2P9j32L26k26j20J49
6749AK6K7J12j29P1L3j99j54L05J2J51k48j80J88l5jn5O4K2q1J03q6L9p9K95j11
6775I1J1O3j21r6j4Q2J09k6J0J14k71J70q3M5Nj85K25j08p4KP3j42j25L49r5j33
6801a24J62K1k6J49J4l71J27L0J04M7l27J00K37q4j3m2j88m5K47rj04K89m40L61
6825A15k59K09j57J55k71K01k70K14j70L24j66O7%J34j36qj07J85k0j23j69K91
6847C9K0K3l61K24%r4N0K42O1j40r0J2K3n0k22L44n4K7oJ29j83K3j42Q7P7k2M2
6874E9k07K52l23J98k0j4J47pJ70l31P0J1j62K36j14o2l0lj42K30p0R7m3J00Q9
$$ y = [-82, 67, -160, -176, 126, -14, -65, -308, -255, -49, -33, 89, 19, 23, 216, -121, 79, 196, 28, 13, 274, 115, -53, -66, 185, -115, -128, -137, -5, 0, -41, -31, -220, -67, 85, 75, 65, -17, 131, -371, -33, -75, 4, -128, 198, -28, -148, 1, 27, 54, 166, 37, 108, 141, -58, -212, 93, 105, 256, 8, -172, 16, -19, -20, -75, -11, 11, -70, 33, -53, -14, -93, 202, 91, 102, 165, 44, -52, -66, 16, 125, 99, 109, 223, -48, 122, 39, 84, 89, -96, 129, 21, -53, -51, 22, -120, -245, 104, 9, -124, 38, 59, 33, 182, 196, -175, -48, -18, 86, 133, -194, -94, 143, 59, 46, 4, -184, -229, 18, 9, -95, 194, -246, 115, -144, 65, -92, 63, -208, -7, -277, -63, -233, 91, -75, -8, -8, 126, -10, -18, -125, 60, 40, -83, -252, 39, 59, 82, -279, -55, -55, -149, -99, 143, 204, 64, -26, -14, 9, -41, -263, 81, 27, 54, 48, 177, -6, 17, -125, -38, 39, 17, 59, -148, 104, -219, -21, -41, -55, 92, 85, 255, -76, -6, 5, -157, 79, -35, -97, -127, -130, -272, -42, -112, -15, -58, 42, 131]
6899A31O6ml13P6n8J13q3K17j85M9N4m0N0p5J6j47J92nj23J17n8R8mK9j89p9J54
6926an3NJ98l37J06K22n1k29OL15q5k13M7k1K8J26j72J74J45k86Q7O5m3j55L2
6951i0Kk2J51k7O8k10L1J31j39L05n71K72j98M97k38k15J37K29k15j87K14J36
6973F1p1J04j70k8J40J56J05j79l07J91r3J87Q1%j34r0L4K17k80J40J78k90j50
6996a98L66J0r0J44n00K86k37J28J46On9r1m2K86m0j20k44M56J3j93J33p0L0l6
7020H4r3l76N73j59j85J84J2k06J14J43j24J54j54p4J79L8qk52J63k80L10p4o3
7043i4K54Q6l45N0j35K38j30K36l25K00K0n5qP0P2j14K0J0k58K14J10j66j3l00
7067c63M00L2j65N9j65K18K21k51l6j09K2K05j11N1p1L7J43o7rk11K16q9K9Q7
$$ y = [131, 197, 193, -120, -44, -102, 11, -72, 145, -40, 9, 63, 23, 73, -2, 14, -133, 59, 54, -69, 48, -10, 88, 84, 113, -76, -155, -1, -54, -49, 149, -188, -82, 140, 89, -140, -134, 181, 96, -117, -70, -91, -63, 63, -109, 65, 210, -76, 11, 76, 33, -122, -90, -88, -110, 41, 14, 82, -128, -97, 34, -105, 200, -371, -99, -297, 200, -38, -253, -116, 113, -102, -289, -75, 61, -10, 94, -76, -104, 36, 192, 297, 118, -189, 2, -91, 96, 177, 177, 43, -47, -13, 204, -76, 64, 242, -48, -198, 168, 178, 88, 232, -268, 18, -219, -91, 55, 61, 2, -89, -131, 155, 115, -5, -249, 207, 220, 27, 160, 90, 120, 84, -9, -385, 188, 29, -156, 28, 40, -166, -52, 91, -33, 121, -33, -107, 72, 110, 102, -150, 13, -267, 43, -31, -94, 160, 246, -99, -49, -184, 54, -76, 160, -165, 35, 55, 0, -8, 62, 134, 20, 40, 50, -208, 6, 116, -50, -63, -363, 37, 69, -96, -37, -202, 16, 237, -14, -50, -159, -137, 68, -43, 8, -63, -26, 117, 50, 41, -170, 46, -43, -14, 73]
7091G3no9o6R2l5j7K3j26J47j3j45J98l3O9l91M97p2j25L3j47L2o7J54j51J05
7116c9J30j32K07r3L8l03K42L18m81O6j24L35j70L1l7p4J53j19Q3j02k5J38K08
7139B50k95O6k1p1J14j20J35j20NP4LO5J53j02k6J11l20K85k25j4k34J13j6K78
7163H8j66K28k9l6j93M7J37M5r1j08N0M3J3j94J91J11k69R2M1j15J23j6j59%J74
7188Gj40J86J29l23J76k20L03m0l14L12J11l07k2J66j16K03k39o9J35J25O1m8
7210G6%P1k98P9j32J75nJ62o5P4p3j09J01j42Q5O2o0j4PJL7roj60J10M31l74o8
7238d4L35n99N72k09k29M47k57k28N04l00J27n8k70L74k20L55q0j76o1K28n9k03
7260e1m7L97j63j16K0j58J59j49J40r7JO7j22K31j53p1J00J75r5j57J49J46l82
$$ y = [73, 68, -1, -67, 25, -10, -27, -4, -130, 17, 4, -141, 57, 24, 93, -298, 199, 127, 2, 35, -112, -80, -147, 7, -144, -39, 91, -41, 166, 73, 111, -192, 50, 368, -113, -47, -171, 164, -6, 25, -12, -86, 67, -52, 31, -71, -96, 42, 250, -45, 21, 0, -71, 43, -77, 58, -62, -57, 17, 20, 85, 238, 136, 110, 221, -99, 186, -39, -53, -287, -174, -190, 88, -78, 150, 121, 85, -108, -61, 76, 121, 30, -78, -28, 15, 28, -166, 25, 136, -133, -41, 0, -115, 8, -8, -167, -167, 7, -133, 53, 182, -141, 35, -185, 118, 78, -236, 76, 187, -120, -142, 24, -92, 111, -128, -197, -62, 63, 124, 76, 76, 147, -151, -72, -204, -29, -34, 128, 63, 137, 64, -45, 56, -86, -1, 61, 1, -13, -6, -5, 32, 23, 17, -143, -33, 398, 24, -44, 291, -308, 264, 55, -174, 273, 16, -212, 292, -8, 119, 61, -209, 165, -55, 300, 220, 44, -17, 211, 152, -51, -98, 299, 136, 20, 40, -118, 41, -108, 32, -65, -64, 3, -119, 112, -41, -112, -12, 163, 68, -89, 60, 206, -176]
7283a76K95l52L56M7k01K09j81K9J3k8K0J37k1l40L07k8j1j69J55j58j67L5K05
7306b4M5qn0P3R2m8l8P0j10K8j24O6J58o9R2j65p0n5N0l2M27l73L9J03l07L07
7332G7q2R7J69k77J11L5lj05l7n1l8Q6l81N17k22r9K48Q8m9j68K03k42J17n8m7
7357a11J20J7k8j47L2K45k43R5n7L26l25K69j54j28K64r3Qm1P2k30j56J09L15
7380A59l09k35L72K20l48K03k32j14L52N4p4j00j31K92k10J76j12p1p4J66k19
7401b35N8J81O4k8qN0J51n8m12J61O1O4k60J76Q0J52L1l19N4J03J7k48M2K07j15
7426c1J78k63P6J09l45J02L81L9k34J22M9j18O8k94K42j50o1J73m2K26k97M5L6
7449A1k90J88L1j85L15l6m1ql3P8O5J3K62r8j56j17j79K69j04O6q0M3l08K27Q1
$$ y = [-176, 119, -233, 123, 170, -31, 178, -3, 26, 39, 11, 31, 168, 147, -193, 114, 86, 75, -94, 61, -97, -264, -229, -24, 21, 13, -37, 36, 128, 80, 42, 112, 2, 30, -94, -28, 130, 61, 153, -12, -82, -137, -87, -119, 308, -65, -26, 77, -230, 77, -5, 92, 261, -16, 95, 130, 127, 22, -15, -66, -104, -18, -399, 118, -104, -203, 45, 133, 84, -84, 119, -123, -6, -64, -111, 9, 26, -2, -149, -117, 128, -115, -20, -77, 249, -76, 193, 39, -89, 175, 82, 90, 49, 121, -109, -265, -156, 159, -150, -385, -13, 207, -141, 62, -170, -284, 68, 122, 48, -52, -183, 109, -101, 75, -37, -108, -182, -16, -235, -177, 4, 68, 40, 32, 82, 233, 175, -237, -76, -15, 49, -211, -35, 45, 197, 228, -91, -37, 66, 83, -165, -123, 84, -31, 147, -116, -40, 69, -276, -174, 207, 246, 12, 134, 183, 65, 133, -161, 81, -69, -130, 43, 1, 227, -70, -25, 11, -279, -91, -60, -245, 70, 34, -7, -15, -48, 30, 95, 108, 370, 272, 116, -1, -180, 89, -15, 51, -29, 14, -294, -67, 14]
7474A4n1Q7O3q6j64J22q4J25O5n4k50K19Lk17K20K2L4K40l11j94K98rK9k14M51
7499C58l09n3Q1J38K6k69O4R1r7j00N5N4k01J85j78k5P3m4L25m7Qp3j10J39K4
7524A15j13j42l6R6P9J56k08J35K63k35p9J5J02j07k22K33Q3N6q5j25L07n07K20
7547Ak07K13k1j9K02l95J62q7K30K5j02j00K49k52r3O8J42J29j17J6P0j78M7j7
7571c4R9K2O6k17o8M8P4K06j79l9J88j0k37J80l8P1p7J30l14J47k80M50q3l87
7595b82M57j37J7p0L1k0jk09R2P4O5J44j69P3K53m37o7J00O7J33n2p7RJ40l59
7620b25K71k40K47J1j72K32q3P2k44M80l07J56q7k69J21j0J34K3l34J72J70j02
7642A6K1k6j35K71j05J98q4o4j04J41J71k54j46J3J2J55m09L58J8PK42k66r8N4
$$ y = [14, -37, 50, 113, 27, -137, -15, -99, 26, 91, 37, -213, 6, 9, -208, 12, 34, 68, 308, -3, -197, 101, 92, 121, -93, 358, 49, -4, 77, 215, 241, -28, 36, 127, 30, -70, -15, 39, -162, 23, -155, -180, -107, -151, 174, 127, 135, 62, -48, 91, 115, 2, -140, -176, -80, -1, 155, -53, 82, 345, 110, 31, 46, 148, 41, -181, 52, 135, 191, 106, -19, 288, -219, 1, -206, 7, -14, -33, 169, -226, -64, -151, 79, 104, 2, -98, 151, -101, -194, -126, 16, 145, 28, 44, 114, -64, -17, -34, 65, 87, 153, -64, -132, -84, -10, 196, 17, -22, 166, 156, -81, 99, 61, 132, 55, 185, -129, 18, -262, 188, 105, -282, 175, 38, 55, -15, 16, -4, -5, -214, -122, -48, 17, 161, -8, 65, 318, -119, -186, -86, -19, 114, 62, -15, -6, 134, -225, 46, -194, 53, 64, -108, 124, 41, 113, -131, 349, 42, 198, 111, -158, -37, -47, 87, 110, -224, -52, 118, 16, 37, 11, -124, 147, 42, 240, 156, 92, -12, 129, 300, 46, -100, -87, -75, 80, -329, 29, 47, 54, 296, 30, -68, -14]
7666a4j07J68Qm6p4K5M5j02Rk3N2L41m35m8K81k26K76m2O5l65K68J44k28j75M5
7691a58kM33J4k87M8o3qJ0J01j31J99k80J68J95m2Q9j94j65J37k28K50q3K08k74
7715f3j68J97j46J44Mj1l7m9K17j35j60K57r6J50j51J04M9q8j04J04m1k4m5K14
7739A22p0p3j13o0R0M33P1m17l4J39k84K60J40O0l82J91j50p1J33J44j46L9j87
7762a65O9P0K73j4j27k7j0R1k12j24j15L95J2J17l91K26j19j85J72J93l52L14
7784I1j24K02m11L59j1p2q1R2Q1j13k30O7J63l24M50j31n8O2L35k43r6J32k19
7807g9J37k58K55N2J9j37N6O2k3l62L55j56R4J39k27K17J2r4P3r0N8j22J19j7
7831H3j07p9J21J71l66K62j69L92l49J30j9J31j93M1J15m96L57j06Q9O1N1j59
$$ y = [-14, -121, 47, 55, 9, -65, -40, 5, -97, -88, -111, -59, 282, -153, -201, 80, -146, 130, 88, 153, -212, 56, 200, -28, -203, -158, -160, 273, 287, 0, 48, -15, -23, -13, 88, -43, 156, -124, 44, 239, 197, 286, 92, -73, 64, -164, 86, 3, 211, -63, -231, -34, -180, -36, -32, -43, -80, -129, 88, -47, -207, 50, -46, 104, -47, 57, 106, 18, -86, 18, -23, -47, -92, 122, 52, -21, -134, -194, -104, 329, 400, -17, -51, 88, -196, 64, 204, 264, -118, 73, -77, -148, -15, 129, -17, 22, -165, -96, -26, 247, 233, 106, 79, 69, 160, -52, -176, -291, 104, 116, 233, -158, 68, -51, -236, -64, 129, -223, 91, -33, 169, -242, 117, 106, 34, -47, 45, 126, 13, -217, -150, 13, -311, 139, 8, -50, 12, 347, 104, 8, 140, -79, 58, -200, 55, 107, 126, -11, 45, 107, 84, -278, 77, -79, 15, 154, -73, 144, 156, 62, 135, 45, 103, -19, 100, 83, -24, -103, 18, 189, -177, 85, -84, 308, -41, 89, 70, 201, 8, 49, 164, -332, 25, -81, 8, 69, 120, -39]
7853c9O5M1j13P9o1j03pM3m2K94M1m9j50Q4J08j01l13L62N6l01J4K50N0j80QP0
7879A06j68j50K19N6R3j26o1J1J74r1O1m05K86r1K39o3p5j60K8o0N8O1K71j63
7903E0j25q8K84l09K70nq3j44K00Lq5R4O8j15J9NJ5j51K01o2j24J03K58l29p4
7928a24K05l79L41J33k10l6o8R3J58m8j63J30k00J16rk8P0j26J85j28r0K14k48
7951b12M64l28J6Q7M4q8r4l4K29kl39J36K79p4o1R0j94K1N1K31k19Q3j11J8o6
7976g3J0J99j01k17J43J56J0k07K32l22K96j68q4L0K64k6k36K19k32J71L2j05
7998iJ56l95L36J20k36n4K58Q9j33q8P1k03P0QO4R5k86J93l9j90M90o21K01j94
8022b97L07J7n2m3l3R2o8J56K1j24p2L48j24k41j3N8j96K45O0l8k18L17q5k86
$$ y = [-39, 26, 67, -46, 33, -28, -131, -138, -95, -137, 157, 198, 149, -1, 83, 191, 90, -223, 139, 195, -106, -92, 158, 208, 28, 36, 106, -62, -212, 7, 63, 156, 30, -31, -20, 154, 63, 124, -281, 5, -86, 153, 90, 15, -145, -117, -177, -119, -58, 213, 50, -75, -163, 121, -188, 82, 77, -6, -150, 50, 53, -32, 62, 130, 15, 34, 39, 54, -97, 104, 42, -82, 21, 279, -50, -124, 81, -298, 43, 176, -34, -70, -138, -45, 113, 65, -98, 32, -168, -52, -61, -89, -19, -145, 40, -88, -178, 36, -212, 252, -76, -60, 27, 71, -17, -111, -145, 84, 82, -257, -121, 158, 84, 23, 113, -81, -60, -9, 222, 3, 86, -25, -7, -73, -63, 136, 35, -182, -39, 117, 127, -80, 152, -170, 126, -42, -126, -96, 168, 142, -94, 125, -107, 64, 96, -9, 147, -248, 88, 208, -28, -82, 176, 265, 132, 44, 115, -88, -18, -10, 54, 149, -137, 56, 17, -173, 317, -304, -103, -297, 10, 27, -25, -68, -101, -9, -77, 79, 100, -24, -96, 252, 128, -113, -126, -68, -264, -19, 41, 3, -215, 102, 17, -269]
8046b69J33J48r1mj70L23P9P3q6k50Q0j5J83j66J4j60J10K96j98j1l7J35Q9k92
8070h6P9j66J6%P9K26j62J7o4j0J39k82O6J48O7l0j54J06J36q6j03J67k42j32
8094b71J56j67M24j72j80K69k61K51m8j87nK02l1K68k63K07j53J22M7q8n7N9o0
8117F2m4j15l6J91j8l18L05m9J82l1N9j65n3rJ42k38m0M05l79K48k12K40k41L2
8141h2O0k0J40j79LK05Mn7j98J08M4n8J34k80j3J84kJ15k35M2J57j48J51J26l7
8166A64k30PK53j45Q3m7J2K54l57J63k83j13K67L05k73k29K40j1O1n6Q3n0Kl10
8190b10K88
$$ y = [-269, -136, 12, -79, -83, -253, 70, 149, 222, 136, -114, -34, -49, 134, -32, -18, -178, -68, 228, 30, 19, -18, 117, 206, -86, -7, -173, -157, -157, -78, 148, -14, 3, -61, -71, 68, -214, -148, 0, 67, 37, -117, -11, 125, 39, -64, 103, -139, -271, -115, -282, 142, -30, -210, 59, -202, 49, 1, -186, -191, 11, -20, 248, -15, 192, 39, 161, 208, 120, 63, 122, 62, 18, -97, -133, 58, 40, -278, 27, -22, 160, 129, 188, 23, -30, -39, 103, -135, -175, 230, -149, 99, -113, 127, -114, -82, -22, -42, 98, -81, -78, 127, 131, 74, -124, -16, 28, -30, 104, -176, -189, -5, -7, 108, -127, -85, 72, -76, 75, 201, 164, -66, -59, 194, 49, 132, 85, 97, 351, -6, 157, -126, -239, 28, 333, 60, -169, 71, 60, 121, 65, 148, 98, 100, -210, 78]
8191G8
$$ Imaginary data points
##PAGE= N=2
##DATA TABLE= (X++(I..I)), XYDATA
0@%%%%%%%%%%Mj2J6j6J6k4L2m0M8n6P0q5J01j18J37j59J87k18K51k86L27l74M26
33B27m82N44o12O87p70Q60r61J071j189J317j460J615j784J970k172K393k638
50a384K907l203L532l897M306m765N286n885O583p404Q390r598J1113j3086J5779
65H674j9678K5860l7195O4646k51727l01752N52429L51399j57113j81312K52634
76C06865K33796l433l5624N1526l1939O713Q2174o9966k64499o4356J73000n853
88C78404k90256j51089Q4172J2661j32746n8723J6121j9058m851N5391j3370n2020
100a75364Q2905J41579r497o2798O9360J03191o282o412N9906j7721r0184K2507
112A11190O7609q6118j38334J2991L9870j23755j37841K2677K7444r5133o5337
$$ y = [0, 0, 0, 0, 0, 0, 0, 0, 0, 0, 0, 4, -8, 8, -8, 8, -16, 16, -24, 24, -32, 38, -47, 54, -64, 73, -86, 101, -117, 134, -152, 175, -199, 227, -255, 289, -323, 364, -406, 454, -507, 564, -625, 692, -768, 847, -937, 1033, -1139, 1254, -1384, 1523, -1680, 1852, -2045, 2261, -2504, 2782, -3103, 3480, -3924, 4466, -5132, 5981, -7105, 8674, -11004, 14856, -22339, 42307, -209420, -511172, 41257, 392656, 235543, 54231, 306865, 540661, 537228, 501604, 553130, 521191, 527904, 610078, 540112, 275613, 211257, 384257, 378404, 88148, -62941, 21231, 33892, -98854, -157577, -141456, -160514, -165365, -109974, -123344, -175364, -92459, 49120, 39623, -23175, 46185, 149376, 143094, 136682, 196588, 178867, 88683, 111190, 178799, 92681, -45653, -32662, 7208, -116547, -254388, -231711, -204267, -299400, -364737]
123c64737K7676k2977o2950N3088R5672l7894m8292J18342J20605l9693j1191
134a72351J59138J23133n1063j9967J34870R8395l4905j3646O9044L4920l4715
145B92853k0744O412r772j0813j2147o2701p0221N324K3482n9052q5158j790K8298
158B3971m3597n8844J0617K5540j5531j5167O846m042o66L8179K3562l2866j1970
171e3968M9222K4331l4150r400M0861O013m8132j3878L1604j211l8720j7147M091
184f0484j4213k8443j0366M38l711n65j0129k4842M335M2503K0493k2640J227
197a06397N4480L5000j2538J0234N5260L8435j588K157K8558K7999J1890O083
209A49573j621m245M946J46j6703j3259J712j0003m0219l0181N948r72l4858k8679
$$ y = [-364737, -337061, -360038, -422988, -369900, -274228, -312122, -360414, -242072, -121467, -161160, -172351, -13213, 109920, 58857, 38890, 173760, 272155, 237250, 223604, 292648, 327568, 292853, 272109, 278521, 268749, 257936, 245789, 183088, 112867, 118191, 141673, 82621, -2537, -4327, 23971, -19626, -78470, -67853, -42313, -57844, -73011, -66165, -70207, -70873, -32694, -9132, -41998, -53968, -4746, 19585, -14565, -23965, 16896, 22909, -25223, -39101, -7497, -8708, -47428, -64575, -60484, -74697, -103140, -113506, -113068, -116779, -117344, -127473, -152315, -147980, -105477, -84984, -107624, -106397, -51917, -16917, -29455, -19221, 36039, 74474, 72886, 75043, 103601, 131600, 143490, 149573, 147952, 143707, 148653, 148799, 132096, 118837, 120549, 110546, 70327, 40146, 46094, 45122, 10264, -18415]
223a8415p15m911k6418j8249P239N314n267l930o558m145J5782K4543J791j5322
237d9261P481K8449Q331j2895J582J9493J1816r945j4068J455J2319R521q614
250E664k1456o552J3655N826j4841j0366J1001R013j3165r646J1958J2473R90
263e446p13L839K241K070R701J0268Jj706L081L747K394J132m59j783k783j049
279B4535l926p180N56M009n848j3379o371M677K017o895m087l46m020m197l11
294b0766J506O9o87N42l201k948M466N261J415l05J168K661L714N057O882L112
310G946J763M397M183N176O586O022L385n76J3L436J423N47K125j948q237r412
326B6829m194j036o521j0431q941r816r516r108q242n393l772n552p691o002K282
$$ y = [-18415, -19130, -24041, -50459, -68708, -61469, -56155, -61422, -65352, -71910, -76055, -60273, -35730, -33939, -49261, -41780, -13331, -5000, -17895, -16313, 3180, 14996, 5051, -9017, -7562, 4757, 14278, 5664, -15792, -22344, -8689, -2863, -17704, -28070, -17069, -8056, -21221, -30867, -18909, -6436, -5446, -6159, -2320, -79, 1991, 11692, 21960, 21961, 20255, 23336, 27083, 29477, 30609, 30150, 28367, 25584, 24535, 20609, 13429, 13985, 17994, 12146, -1233, -7604, -2927, -910, -7805, -11892, -12238, -16258, -20455, -20766, -19260, -19191, -19878, -19336, -22537, -25485, -21019, -15758, -14343, -14648, -13480, -10819, -7105, -2048, 4834, 7946, 9709, 14106, 18289, 23465, 30051, 36073, 39458, 38882, 38895, 42331, 43754, 44301, 46426, 44478, 36241, 26829, 22635, 21599, 15078, 4647, -4294, -14110, -23626, -32734, -40976, -46369, -50141, -55693, -63384, -69386, -67104]
341f7104N639J564O81M401O489P275P641J0554J0974P104O274O801P897Q779O568
356C1537M468J789j473o61n97k574j494k445p075r127o612k284k329l687l038
371e602k818n07L746L094L424O439Q978Q702M891N416J1154J1769N766P92k90
386F4954L271J566l863o518r526j0616j2103j5268j5841j4957j4836j5387j7596
399f6720j5806j2210j0459o397k987l747k218L057R283J2783J1196J1309J5300
412e7616J8027J9113J7315J4551J6325J5893J2559P274L885N719P421Q96p923
425G3439j0825n467l148r059j1829j0551p765o880p565o637j664j43J798K822
439c474K282L737O791J0614J0972M785L376P059P349M914J639k178m101n337m856
$$ y = [-67104, -61465, -59901, -59220, -54819, -48330, -41055, -33414, -22860, -11886, -4782, 1492, 8293, 16190, 24969, 31537, 36005, 37794, 36321, 35660, 35063, 32489, 30995, 28550, 21475, 12348, 5736, 3452, 1123, -2564, -5602, -8420, -8927, -5181, -2087, 1337, 7776, 16754, 25456, 30347, 35763, 46917, 58686, 64452, 65244, 64954, 68225, 69791, 65928, 59410, 49884, 39268, 27165, 11897, -3944, -18901, -33737, -49124, -66720, -82526, -94736, -105195, -111592, -114579, -118326, -120544, -117487, -108204, -95421, -84225, -72916, -57616, -39589, -20476, -3161, 11390, 27715, 43608, 56167, 63441, 67326, 73045, 80466, 81362, 73439, 62614, 57147, 53999, 44940, 33111, 22560, 14795, 7915, 350, -6287, -7951, -8094, -6296, -3474, -1192, 2545, 9336, 19950, 30922, 35707, 39083, 46142, 53491, 58405, 60044, 57866, 53765, 48428, 43572]
454D3572o831j3734j4982j0272q796j6381k2655j5238j569n148j7142j5651j124
467a05951N970j257m549N107J1468Q921O722J0229J4123J2484J2678J6584J2231
480D760O181R301J6331J2987J585K25Q538O399j945r8K258l744q412j198L800
495E6968q250j5844o99R536o208k1187p063J3725M940j5366j0800N743P533k367
509A0661n805j357J003L168M255k898r542J08J0262K689j4548j2776O793R015
523A028j0547j8152m005N296n223j4941o688J286m158q432l596J382k625k818
537g2193O833R214n63j329J2417J8640Q302J181J2554J9762J0046N011J1456J3922
551E5253O460L001P824M858l891j176N074j876j4069j0440J366l282j7161j3059
$$ y = [43572, 36741, 23007, 8025, -2247, -11043, -27424, -50079, -65317, -66886, -72034, -89176, -104827, -105951, -99981, -101238, -105787, -100680, -89212, -80291, -73569, -63340, -49217, -36733, -24055, -7471, 4760, 10941, 20242, 36573, 49560, 51145, 51370, 59908, 66307, 64362, 64264, 66522, 62778, 54366, 53168, 56968, 48718, 32874, 32175, 41711, 35503, 14316, 7253, 20978, 25918, 10552, -248, 5495, 13028, 10661, 4856, 3499, 4502, 7670, 11925, 9027, -515, -407, 9855, 12544, -2004, -14780, -7987, 1028, -9519, -27671, -31676, -26380, -31603, -46544, -53232, -51946, -56104, -64536, -68132, -66750, -69375, -72193, -65360, -56146, -56709, -58038, -45621, -26981, -18679, -17498, -4944, 14818, 24864, 29875, 41331, 55253, 61713, 64714, 72538, 77396, 73505, 72329, 77403, 75527, 61458, 51018, 52384, 49102, 31941, 18882]
565A8882k84m246j5742j2264J568K133r062q594K661N230J21k403K097P536N724
580f643J720k52J321O644O559j871p502k716O009J351j1240j1824n66K352p285
595b3943j4199o887L390Q58o757q352R05Q302N026o9K304Q407J1229Q608O634
610d544P973R895J0594R630O037L699N538O650M664j381l999l34o51l777n807
625D4187p175p756o884m740n210r304r736k806p50n677q129k791M336K787l048
640b2696l448K576P255N070j356o74N360O901J922l170L96N578J387l858l275
655b032P57M0k571l059k249l481k707p1j053k035p28Q29L42Q0K781M107J336K504
673g210M922M619J819J609N343O699J419j060K508L276J832j004j878r95n06m43
$$ y = [18882, 18598, 14352, -1390, -13654, -12086, -9953, -19015, -27609, -24948, -19718, -19597, -22000, -19903, -12367, -6643, -4923, -5175, -3854, 2790, 9349, 7478, -24, -2740, 3269, 4620, -6620, -18444, -19010, -16658, -23943, -38142, -45029, -41639, -40781, -47538, -55890, -54985, -46683, -41657, -41726, -39422, -31015, -19786, -11178, -4544, 3429, 13324, 23918, 33548, 39585, 43284, 48822, 55472, 60136, 58755, 54756, 54422, 53771, 49994, 44187, 37012, 29256, 22372, 17632, 12422, 3118, -6618, -9424, -10174, -15851, -23980, -26771, -22435, -19648, -22696, -26144, -23568, -16313, -11243, -12599, -13273, -7913, -1012, 910, -2260, -1864, 3714, 5101, 1243, -2032, -1275, -1235, -3806, -6865, -9114, -12595, -15302, -15373, -16426, -18461, -19189, -18360, -18018, -17938, -15157, -11050, -9714, -7210, -2288, 2331, 4150, 5759, 11102, 17801, 19220, 18160, 20668, 23944, 25776, 24772, 22894, 21899, 21393, 20950]
689B0950l774n391k072L70l120o059m665K2J7l492m144j186J93Q6j429r25J785
706a2834J225Q19K85r7K533K685J048Q72J017K008J146Q48J973J039j065J357
722D859J855K59j000N15J459m13j353m67K59k4p04j500q77r27p62m23j246k189
740b679m31Q4j362k012r83J030j20j258j115m6J223J311j93p15J291K402J171
757b402n60M35K678J440l66o82R78K187r2j467m90Q4J17q14j263j03j05p18p05
776a848n09Q66R40L80K26J632J072J780J463K058K023J500J771J547J269J424
792A7594P61k72m68q05q86j519k676k592k480l761l971m022k813k728m267l827
808a8732k542k488j324j882j282L30J034N48N97J419L976K853J675K816M021M146
$$ y = [20950, 17176, 11785, 9713, 10083, 6963, 904, -3761, -3739, -3722, -7214, -11358, -12544, -12351, -12265, -13694, -14619, -12834, -11609, -10790, -10505, -10602, -8069, -5384, -4336, -3464, -2447, -439, 707, 1555, 3528, 4567, 3502, 4859, 6714, 6973, 5973, 6488, 7947, 7534, 6181, 5714, 5973, 5949, 5245, 3745, 2868, 1941, 1179, 756, -490, -2679, -3110, -3026, -4388, -6400, -7383, -6353, -6473, -7731, -8846, -8892, -7669, -6358, -6551, -7266, -5975, -3573, -2402, -2962, -2527, 151, 1591, 1225, 543, 1521, 3708, 3616, 2149, 1659, 1743, 1860, 1046, -217, -320, -425, -1143, -1848, -2357, -1491, -551, -171, 55, 1687, 2759, 4539, 6002, 8060, 10083, 11583, 13354, 14901, 16170, 17594, 18355, 18083, 17615, 16810, 15924, 14405, 11729, 9137, 6657, 2896, -1075, -5097, -7910, -10638, -14905, -18732, -21274, -23762, -25086, -26968, -28250, -27920, -26886, -26338, -25741, -24322, -20346, -17493, -15818, -13002, -8981, -4835]
824d835L236K426L000L604K681K208R61J422K087P55k79j026p00L83j248k149
840A2526j623j102j495j637j453p83o12l43J94l28K0J398J320J398J006J233J842
857A1561J306O81J068j43j07n97j134j759k530k825l513l953m386m330m314m487
873a9462m318m139l828l362k004q91j166L83P97J643K971M211M858M601M515O755
889h436P148N340M725N996O189N008K049K306K672K006m04j665k341k176k380
904B6037l371n138n450k606l223m224m694k744l38n6j302q86P98L049L096J066
920A4J759L947L902K227Q27J528J715k98n47j646l307l797k867l068o189p134
936a2934m496k660n652o180l219j404k021k244K26J865J554L448N242M509M300
$$ y = [-4835, -1599, 827, 3827, 7431, 10112, 12320, 13281, 14703, 16790, 17545, 17266, 16240, 15540, 15923, 14675, 12526, 10903, 9801, 8306, 6669, 5216, 4433, 3821, 3478, 3672, 3344, 3364, 4762, 6082, 7480, 8486, 9719, 11561, 12867, 13548, 14616, 14473, 14366, 13769, 12635, 10876, 8346, 5521, 2008, -1945, -6331, -10661, -14975, -19462, -23780, -27919, -31747, -35109, -37113, -38004, -39170, -38787, -37990, -36347, -33376, -29165, -24307, -19706, -15191, -8436, -1288, 4052, 8777, 14773, 20962, 25970, 28019, 30325, 32997, 35003, 34599, 32934, 30593, 28417, 26037, 22666, 17528, 12078, 9472, 6249, 2025, -2669, -5413, -5751, -5807, -7109, -7995, -7197, -4148, -1052, 14, 1773, 5720, 9622, 11849, 12676, 14204, 15919, 15621, 15074, 13428, 10121, 6324, 3457, 389, -5800, -12934, -17430, -20090, -25742, -31922, -35141, -36545, -38566, -40810, -40584, -38719, -37165, -33717, -28475, -23966, -19666]
951a9666O419P917O419M373O247P453N089K661K936L621K470j011j449l19j555
966C1605l407m121m178k813m542n040l901k959k778l196k890p88n47k12J284Q83
982g600L51J733M066K179r8R01M808K086j856p54J783J213l251l484l17j933m105
999d278l099j766l869m130j572j99l178l389J534K046m05o88K668M317K629K328
1015a1051M118L668L380M238M044K751K209K612L368J384o79L46R67J70j700k771
1031A7054k088n82j483l696l925j295q14k924l082r45o83j304r27m7j65r40J412
1048f434J296m70k29J851J749n54k56J463J212j048n01J252L53j488m35Q51j35
1065a523j734K11P76o01l03O36J74n47O35J739k43j097J333J847j07o47Q61J311
$$ y = [-19666, -13247, -5330, 1089, 5462, 11709, 19162, 24251, 26912, 29848, 33469, 35939, 34928, 33479, 33160, 31605, 28198, 24077, 19899, 17086, 12544, 7504, 3603, 644, -2134, -5330, -8220, -9008, -9555, -9767, -8483, -7600, -7249, -5516, -1450, 729, 631, 1532, 6340, 8426, 6570, 5816, 7599, 8812, 5561, 2077, 1760, -173, -4278, -7377, -9143, -13012, -17142, -18714, -18913, -22091, -25480, -23946, -21900, -22305, -22993, -20325, -16008, -13379, -11051, -6933, -3265, 115, 4353, 8397, 11148, 13357, 15969, 19337, 20721, 20042, 20388, 21355, 21525, 19825, 17054, 14966, 14384, 12901, 9205, 5280, 3985, 3171, 247, -2835, -3780, -4463, -5767, -6694, -6741, -6906, -7846, -6434, -5138, -5608, -5837, -3986, -2237, -2791, -3047, -1584, -372, -1420, -1921, -669, -316, -1804, -2239, -1388, -1523, -3257, -3046, -2270, -2871, -3174, -2538, -2364, -2911, -2276, -537, -780, -1877, -544, 1303, 1196, 549, 1410, 2721]
1083B721j75q08P35O27o49N8J85o02q53L90O04p90j323J041K79j084nQ34l80j051
1103b46N67Q46o33j050M22r5q60q75o11k93p20m90n52j108j13J90K0n47O3J769
1123d316O21J98J246K345J073J183K400J887J125J547K243J336k28J190J193o69
1139A4374q44k11o27k095k890j343j686l713k498j813k843k930j932j515j963
1154a4529j817k57J82j180O44J418J310Q13J776K854J580J677K560K613J155J231
1170B030K043J281M07N27O53l05r82l69o92j430j493q72o41j710j131K76m09n63
1188c380P80J029P27J251K291K325J448K399L318J843J493K657K043M72K66P71
1204B1733m77j588j932j619l159l824l550l856m731m845l582m050m752l851j828
$$ y = [2721, 2546, 1738, 2473, 3100, 2451, 2509, 2694, 2092, 1239, 1629, 2233, 1443, 120, 1161, 1440, 356, 351, 1185, 805, -246, 321, 1167, 534, -516, -94, -189, -1049, -1924, -2535, -2828, -3548, -4038, -4590, -5698, -5811, -5621, -5601, -6148, -6085, -4316, -3695, -3497, -2251, 94, 1167, 2350, 4750, 6637, 7762, 9309, 11552, 12888, 12660, 13850, 15043, 14374, 13530, 13319, 12692, 10597, 7707, 6364, 4678, 965, -1533, -3346, -6189, -9119, -11051, -12566, -14529, -16346, -16603, -16421, -17601, -16957, -15539, -14229, -13416, -11640, -8786, -7206, -5529, -2969, -356, 799, 2030, 4073, 5354, 5761, 6288, 6941, 6636, 5654, 5285, 4593, 3163, 1670, 798, 157, -1553, -2684, -2408, -2817, -3380, -2600, -1571, -844, 407, 2698, 5023, 6471, 8870, 12188, 14031, 15524, 18181, 20224, 20696, 20962, 21733, 21256, 19668, 17736, 16117, 12958, 9134, 5584, 1728, -3003, -7848, -11430, -15480, -20232, -24083, -25911]
1219b5911k594k404j031M52N54O06K319L786K587L506M712M194M159M394M415
1234C744L911K484L235K691J223L99N40O3j682j555j370k321l111k204k164k706
1250A177k380r21r05j207l64J550J306Q59K617K830K585K638L053L478J886J518
1266A9720K411J191p79n28o94k527l591l325l595n522n194m981m920n679n182
1281b3195l542l616l453k317l76m69j39K165K623L333L377M839M937M789N137
1296e907N544M863M104M398L582K728J444J733Q12o64p20j129j938k437k864k184
1312A1365k930k867k199j845k153j218m09o73L03N42J936J381J185K443K200J706
1328H767J679J940J155Q27L1op46j739j816k601k999l132l670l328m034m152k873
$$ y = [-25911, -28505, -30909, -31940, -31488, -30934, -30328, -28009, -24223, -21636, -18130, -13418, -9224, -5065, -671, 3744, 7655, 10139, 13374, 16065, 17288, 17687, 18227, 18290, 16608, 15053, 13683, 11362, 8251, 6047, 3883, 1177, -1203, -2124, -3029, -4236, -4600, -3050, -1744, -885, 1732, 4562, 7147, 9785, 12838, 16316, 18202, 19720, 22131, 23322, 22543, 22015, 21321, 18794, 15203, 11878, 8283, 2761, -2433, -7414, -12334, -18013, -23195, -26737, -30353, -33806, -36123, -36499, -36968, -37107, -34942, -32319, -28986, -25609, -20770, -15833, -11044, -5907, -363, 4500, 8604, 13002, 16584, 19312, 20756, 22489, 23301, 22637, 21917, 20788, 18850, 16413, 13549, 11365, 8435, 5568, 3369, 1524, -629, -1847, -2256, -2929, -2626, -2084, -148, 1233, 2418, 4861, 7061, 8767, 10446, 12386, 13541, 14368, 14399, 14393, 13647, 11908, 10092, 7491, 4492, 1360, -2310, -5638, -9672, -13824, -16697]
1345a6697k898l159j866j999o89l39L08J026J760J957L056K371L616L528L886
1360f139L612L512L694L469K783K238K145J685R28P68K50j67q19r49j348j905
1376A3757j767j985j795j684j946j575j200j772o85r68k34q1K89k6M87M72O96
1393a7J049M23M09P73m3J79k2n09k92p72q88j303j406q76j204j818j641j131j173
1412a0262j117q20k90j32n0J93P30R11J107J105J522K179J227J994K075J807J950
1429D129J527J661J443O53J211P11N12j7l04m85j51r22j452o16j302j081j673
1446C844j369j262j402j231p53j094j079m55k37k18m13j82P97J80J63M87O60O57
1464b907P6O30O22Q15M19M32M69J76J16L36M04j24O8M0l29j5j33j57l29j73l59
$$ y = [-16697, -19595, -22754, -24620, -26619, -27308, -27647, -27339, -26313, -24553, -22596, -19540, -17169, -13553, -10025, -6139, -2527, 985, 4679, 8148, 10931, 13169, 15314, 16999, 17927, 18695, 18945, 18778, 17959, 17010, 15662, 13757, 11990, 10005, 8210, 6526, 4580, 3005, 1805, 33, -652, -1620, -1854, -1935, -1646, -1672, -1185, -713, -17, 1032, 1455, 1864, 2637, 2594, 2773, 2751, 2242, 1950, 1178, 290, -1013, -2419, -3295, -4499, -6317, -7958, -9089, -10262, -11379, -12199, -12489, -12621, -12671, -12478, -11748, -10837, -9730, -8625, -7103, -4924, -3697, -1703, 372, 2179, 4129, 5656, 7317, 8760, 9413, 10624, 11335, 11847, 11830, 11526, 11041, 10890, 9968, 8516, 7900, 6598, 5517, 3844, 2475, 1213, -189, -1420, -2173, -3267, -4346, -4801, -5038, -5256, -5669, -5851, -5054, -4874, -4711, -4224, -3564, -2907, -2831, -2201, -1579, -764, -345, 87, 556, 732, 848, 1184, 1588, 1464, 1532, 1572, 1243, 1228, 1095, 938, 609, 436, 77]
1485G7k66l3j48J03n03l3K9j02J43p6J15L41N8R2N01r4P46J46K6N12l21L40j11
1508A542k06J48n77m26k53m17k92p93p77k05r58p40l97k56l42m36J09J25n4N96
1528d609N80N22R07J065J028J179R79J474J281J297Q95J537P06P39K95M96K64
1545A0635k32m02m77o14j072j246j588j237j556j863j736j553j602j353j289j348
1561h533q85j169lJ5l37M57M17R83N34J173J578J222J311J168J383O31J148P03
1579A796Q92J43L8K1k45n49q68l79r89p42r57m81m38Kl33N89K28O95R33J044J496
1600A896J520J766J631J716J715J662J196J012R46J89J62o24m01j583j693j630
1616I480k463k431k579k755k947k982k191k711k263j545j451j196n71k93M29Q24
$$ y = [77, -189, -222, -370, -267, -770, -803, -774, -876, -733, -809, -694, -353, -295, -203, 298, 204, 950, 1096, 1122, 1634, 1313, 1653, 1542, 1336, 1484, 907, 481, 228, -189, -481, -1274, -2051, -2256, -3214, -3954, -4351, -4607, -4949, -5385, -5276, -5151, -5205, -4609, -4029, -3507, -2600, -1535, -507, 672, 1651, 3125, 4406, 5703, 6598, 8135, 8841, 9580, 9875, 10371, 10635, 10403, 10001, 9524, 8910, 7838, 6592, 5004, 3767, 2211, 348, -1388, -2941, -4543, -5896, -7185, -8533, -9418, -10587, -10590, -10575, -10912, -10455, -10038, -9055, -8521, -7348, -5770, -4548, -3237, -2069, -686, -55, 1093, 1796, 2688, 2831, 2869, 2890, 2645, 2096, 1228, 849, -140, -882, -1839, -2320, -2758, -2756, -3089, -2500, -2272, -1577, -644, 400, 1896, 3416, 5182, 6813, 8529, 10244, 11906, 13102, 14114, 15060, 15249, 15411, 14787, 14386, 12803, 11110, 9480, 7017, 4586, 2007, -748, -3695, -6677, -8868, -11579, -13842, -15387, -16838, -18034, -18605, -18898, -18469, -17645]
1632a7645J147J313J836K201J791K248K669K227J954J815K031J131J070J124K10
1647G122K56k44k09m82r26o60j188q56p06j057l64p00p1K12L69N34R39P82R13
1666C664J568J028J404J443Q94J461L41N86J81j14j53r59j171j603j733k095j810
1683B932k229k782k451k624k179k562j931j580j691j342k31l78j0N76R99J541
1699a5942J319K021K271K308K283K459K374K403J712K030K317J006Q60Q56M63
1714A0740K41n60k23o82q16r84r77j154p74j044q78o28n30m95k24J22L29O05L11
1733B379P08P29R69O64N14O69N01M17k3k33p73p33p80j435j712j617j574k298
1751c628k277j733j968k079j804r91r46j134o00q6O61N41J308J244K047J937K122
$$ y = [-17645, -16498, -15185, -13349, -11148, -9357, -7109, -4440, -2213, -259, 1556, 3587, 4718, 5788, 6912, 7122, 7378, 7134, 6925, 6443, 5517, 4857, 3669, 2813, 2107, 1050, 686, -14, -85, 127, 496, 1030, 1969, 2751, 3664, 5232, 6260, 7664, 9107, 10001, 11462, 11803, 12389, 12570, 12456, 12303, 11344, 10173, 8570, 6837, 4742, 2932, 703, -2079, -4530, -7154, -9333, -11895, -13826, -15406, -17097, -18439, -18670, -19048, -19058, -18482, -17483, -15942, -14623, -12602, -10331, -8023, -5740, -3281, -907, 1496, 3208, 5238, 7555, 8561, 9421, 10277, 10740, 10981, 10421, 10198, 9516, 8700, 7716, 6739, 5585, 4811, 3767, 2889, 2261, 1731, 1236, 1012, 1134, 1463, 2068, 2379, 3087, 3816, 4785, 5449, 5963, 6632, 7133, 7550, 7527, 7294, 6521, 5788, 5008, 3573, 1861, 244, -1330, -3628, -5905, -7638, -9606, -11685, -13489, -14480, -15426, -16560, -17160, -17246, -16585, -16044, -14736, -13492, -11445, -9508, -7386]
1768g386K263K580K312K377K336K127J668J761J292R12M64K95j46o86o00q14j389
1785I366j295j678j396j409j222j376j215p08m48n21j61R9M44M17P11J018O53
1802A279N74Q14R46L97L70q6K27m34m17r46j064r80j166j884j675j429j581j466
1820h521j118j049r58n85k81J06R0O10J210J044J564J477K133J921J691J923J950
1837C207J687J638J502J097P61L48L46K51l09n40p27j066r79j399r20j163j620
1854B114j137j176q23r01k46n85o3k46M42K1P15L47O33M29M96P67N7M28P16l46
1874A642k75Q4k18m35m08p98n91q70r39o43o25o84p30l19j08m3j59L60L46N17
1894d896Q85Q25P73N96J215R89R00P84J022O63O21O60J99L67K98k76n00J41p11
$$ y = [-7386, -5123, -2543, -231, 2146, 4482, 6609, 8277, 10038, 11330, 12242, 12706, 13001, 12855, 12169, 11569, 10755, 9366, 8071, 6393, 4997, 3588, 2366, 990, -225, -933, -1381, -1902, -2063, -1964, -1520, -1103, -392, 626, 1279, 1853, 2667, 3613, 4010, 4380, 4294, 4521, 4087, 3670, 2724, 1660, 680, -486, -2370, -4045, -5474, -7055, -8521, -9639, -10688, -11646, -12231, -12512, -12406, -12316, -11706, -10496, -9452, -7888, -6411, -4278, -2357, -666, 1257, 3207, 4894, 6532, 8034, 9131, 9892, 10240, 10586, 10837, 10528, 9988, 9261, 8195, 7216, 5817, 4897, 3734, 2114, 977, -199, -1022, -1923, -2169, -2754, -2817, -3063, -2621, -2600, -1885, -1538, -905, -476, 20, 787, 844, 1272, 1988, 1642, 1367, 1451, 1233, 798, 390, -408, -999, -1869, -2808, -3451, -4076, -4760, -5490, -5809, -5917, -5960, -6119, -5759, -5413, -4896, -4011, -3186, -2413, -1817, -602, 387, 1287, 2071, 3093, 3756, 4377, 5037, 5236, 5603, 5901, 5625, 5125, 5266, 4555]
1913D555m56n15q65o17l57q75o05n44p28k61m26k65p6j82jK9K57J89J32Q2K09
1934a320L56K11L94p6N4L68K13k5M7O8K55m54K80n6k21K04n59L33n3J2J99j12
1956A18J59j91Q6j28J88r8O7m8J51k52J45P9k19j67lJ90k34j03O1l42K92j02J36
1979b15j28K8J76j1j06J27k20J27j23K8q2q2q9K0j77l14K65o1k58L1k66J3K34
2002a083J0k2M75J70N61m7P33M05M91N63L01O00J95L33j87N41J10J1m40J44l4
2023C830p14n23k89j152n70l98j068l42r31o22q06k46q29r0k75Kl11K56J59L37
2043d582O94J75P75P21O04O30N82N10P57P61j11O32l3J98l60j43j38j08k69m79
2063H16k39n11k11j95k94J9R6K24J23L13P89K74M97P59N90N58M53Q27P06J1J0
$$ y = [4555, 4099, 3584, 2719, 2102, 1745, 870, 265, -279, -1007, -1268, -1694, -1959, -2035, -2217, -2218, -2189, -1932, -1743, -1611, -1529, -1320, -964, -753, -359, -435, -381, -13, 200, 175, 222, 290, 545, 91, 371, 315, 94, 298, -261, 72, 19, 31, 230, 118, 277, 86, 172, 44, 232, 134, 201, 153, 304, 52, 197, 276, 57, -110, -113, 77, -157, -260, -199, -541, -249, -351, -215, -343, -315, -139, -150, -256, -129, -349, -222, -345, -317, -399, -481, -570, -550, -727, -1041, -776, -837, -1095, -1064, -1330, -1317, -1083, -1073, -1095, -620, -450, 111, 64, 797, 1202, 1693, 2256, 2557, 3157, 3352, 3685, 3498, 4039, 4149, 4160, 3720, 3864, 3830, 3116, 2593, 2304, 1152, 582, 184, -884, -1226, -2157, -2779, -3585, -3831, -4660, -4750, -5025, -5023, -5334, -5078, -4919, -4582, -3888, -3713, -2938, -2217, -1613, -983, -401, 109, 866, 1627, 1516, 2148, 2115, 2313, 1953, 1810, 1672, 1564, 1295, 816, 577, 66, -145, -340, -634, -615, -519, -295, -172, 141, 930, 1204, 1701, 2460, 3050, 3608, 4061, 4888, 5594, 5605, 5615]
2084E615L06j48k82m15m18r95j032r58r50j268j419j294j070r69j124r14n38n58
2102h431n01J47J43L26N22P16P90Q59J137J614L32J804J027J013Q49P66Q04K06
2120D123N66L2L9l77l62k15n14r17m62p14n61o28l57M7n04J95J66K22N12N79P19
2141A589Q68K22J046O30O55M76K93M40k24j76k65o30r19p85j001j061j280j502
2159a624j379j084j470j215r96r15m07q05k93K40L59M90O63J027Q50J662J048
2176c849J642J340J288J166J113J212J007M30N13L36O6k89J7o86n73p21m29j052
2194B531p35o42n67k96p33o6rj11J53M11J86R13N7M99R84J14O24M35P8K70l5l31
2216C730l05n73n92m43r34q47j232j023j004r34r75r07o75l63l22l50j53K73L71
$$ y = [5615, 5921, 5773, 5491, 5076, 4658, 3663, 2631, 1673, 723, -545, -1964, -3258, -4328, -5297, -6421, -7335, -7873, -8431, -8932, -8785, -8642, -8316, -7794, -7078, -6288, -5429, -4292, -2678, -2346, -542, 485, 1498, 2347, 3113, 3917, 4123, 4689, 4721, 4760, 4383, 4021, 3806, 3292, 2375, 1913, 1199, 638, 10, -347, -300, -804, -609, -443, -221, 291, 870, 1589, 2457, 2679, 3725, 4355, 5010, 5486, 5779, 6219, 5995, 5819, 5554, 4924, 4005, 3220, 2219, 1158, -122, -1624, -3003, -4087, -5557, -6772, -7768, -8683, -9090, -9895, -10188, -9948, -9589, -9099, -8436, -7409, -6559, -4897, -3849, -2207, -867, 421, 1587, 2700, 3912, 4919, 5349, 5862, 6198, 6264, 5975, 5992, 5306, 4733, 4012, 3583, 2531, 1796, 1154, 587, 291, -442, -508, -517, -628, -475, -64, 122, 1035, 1092, 1591, 2575, 2689, 3313, 3748, 3826, 4096, 4061, 3730, 3425, 2852, 2260, 1817, 883, 36, -1196, -2219, -3223, -4157, -5132, -6039, -6714, -7077, -7399, -7749, -7902, -7629, -7258]
2235g258L01Q45M54J286R76J021J223J091J002O71J048R65J015J40M85K42k1q7
2253E399l74j23m01n51n66m28m98p98n83l67l79n99N4k05o6j71J45L05P2L16L07
2274D89L11lL78j21O8PK27m03M2k85l74n08m40k48o84k97o18m91l60l85k14m8
2296c957q4J00l9K89J70L27L80O91K79O64P14N64P65L07R59N5K73M93m1M61J20
2317C490K1J4j04p51J82l00m80m18j56n07n30j94k83j10m53n3j63j82j5M6Rk07
2339a144M9K83r0M58j84K02J10N3K28ml49J63J25j93K60k36R2j50%N3m5l14J09
2362e24J26m29J35L20j49P1m2K30n8k1K63J29k22M2L09K25J53k12Q4K32l9r6J53
2385F80j76N9J8J81k94q6N5l70R8k91J73l62k06j17K24l11J86m08kj39J67n1l0
$$ y = [-7258, -6957, -6112, -5658, -4372, -3396, -2375, -1152, -61, 941, 1612, 2660, 3625, 4640, 4780, 5265, 5507, 5486, 5399, 5025, 4902, 4501, 3950, 3384, 2956, 2458, 1660, 1077, 710, 331, -268, -214, -419, -485, -656, -511, -206, -134, 182, 489, 800, 797, 1175, 1054, 1122, 1129, 1356, 953, 995, 710, 336, -172, -612, -860, -1544, -1841, -2459, -2950, -3310, -3695, -3909, -3957, -4041, -3941, -3980, -3691, -3521, -3194, -2814, -2123, -1844, -1180, -466, 98, 863, 1170, 2129, 2184, 2457, 2950, 2909, 3370, 3490, 3511, 3525, 3421, 2670, 2852, 2552, 2072, 1654, 1498, 991, 461, 267, -16, -126, -579, -632, -795, -977, -992, -946, -937, -1144, -1095, -812, -902, -444, -628, -426, -316, -263, -35, -39, -388, -225, -100, -293, -33, -269, -177, -327, -327, -274, -319, -633, -524, -398, -827, -692, -372, -521, -450, -492, -262, -320, -341, -78, 51, -171, -129, 180, 405, 558, 346, 430, 662, 623, 527, 680, 504, 563, 581, 762, 468, 382, 437, 67, 165, -126, 47, -315, -521, -638, -414, -725, -539, -947, -949, -1088, -921, -972, -1002]
2408a002j30O3M01J65j0M8J63J44K92M54J68K45J98L13L14Q1M2Q4J60m3l35R8
2430A913l31j6k77m36m66j31m48l77l49k99j98m90m4l41j21n5J47o2K05K97O1
2451a818J40L85L37N17Q1M04l4N17K34j97R8K98j47l6k55k67o6j52j31j43j22
2472c57l18P3K6k3k02N40k45M16K90K31M75L10N54J10K62L88L32L62p9L74l60
2493C159j58J3n67l34l70o05n87m80n06o92m00n00p57m81j13k24k97j40o3K03
2513c899J97O48J9N56K99L70N74O75N08M28L07K67N4L47L30K44p3l37J05k94j83
2534A142k12j91j72k43l31o5l0j08J54j22L72k3K95K4K71M93K49K0O21m55O52
2555B341Q2K03k31r3j42k80l83l15n16l31o02l26l62q26m17n08N4l95l08j05j35
$$ y = [-1002, -1132, -1069, -668, -503, -513, -465, -302, -158, 134, 588, 756, 1001, 1199, 1512, 1826, 1907, 1949, 2033, 2193, 2150, 1815, 1913, 1582, 1566, 1289, 853, 387, 256, -192, -569, -918, -1217, -1415, -1905, -1949, -2290, -2411, -2466, -2319, -2381, -2176, -1879, -1818, -1678, -1293, -956, -439, -358, 46, 12, 529, 763, 566, 664, 962, 815, 779, 524, 257, 191, 39, -92, -235, -357, -675, -602, -576, -599, -801, -261, -506, -90, 200, 431, 906, 1216, 1770, 1880, 2142, 2530, 2862, 3224, 3145, 3519, 3159, 3001, 3014, 2447, 2113, 1743, 1138, 551, 71, -435, -1127, -1527, -2027, -2784, -3265, -3378, -3602, -3899, -4039, -4102, -3899, -3702, -3054, -3035, -2479, -2180, -1810, -1236, -561, -53, 375, 682, 949, 1003, 1350, 1680, 1924, 1851, 1514, 1619, 1325, 1142, 930, 739, 567, 324, -7, -72, -102, -210, -56, -178, 194, 171, 466, 490, 761, 1254, 1503, 1523, 2144, 1689, 2341, 2423, 2626, 2395, 2302, 2160, 1880, 1497, 1182, 666, 335, -267, -593, -955, -1781, -2198, -2706, -2652, -3047, -3355, -3460, -3595]
2576c595r8m8M27K25K55N07J78O27K27Q10J87N03L08M81K19N71J14j10K82J33
2596B203k68L11n42j02J17l55j87k72k07k72j97o0j03j86j0L9L3L00j14J46j0
2617B64K12k40K78K98M8j62N3j90N1K5j10m0n51nl97J4l71j58m06n0l02k43J09
2640a873Q9k02l1k40K86N85l0L09N2M13K46L40K24J76L51J92M35j13N26j0oM4
2662A763J1Oj32p3n25K38k69n55P6j39j13n16L7j93j41p8Q2k27M1j84M5J43K35
2685d68k65J64M0j7L15J02J03Q9oj13J29J17j2pM9L1o0l42J86j30L25n76R5K7
2709b24m4L8L8j87J45j28L10KkJ33j13L37k7J4K90k00K03nr6J66n5O0k06j55J10
2734D04m11K47k91q8j36o9l70J05l2l57J57j47j70M3J3J52o2M4O1K29r0R2L72
$$ y = [-3595, -3693, -3741, -3314, -3089, -2834, -2327, -2149, -1522, -1295, -485, -298, 205, 513, 994, 1213, 1784, 1898, 1788, 2070, 2203, 1935, 2246, 1704, 1602, 1719, 1364, 1177, 905, 698, 426, 229, 169, 66, -120, -130, -91, -58, 242, 128, 274, 264, 476, 236, 514, 812, 860, 698, 751, 561, 612, 637, 527, 487, -64, -69, -466, -452, -823, -981, -1387, -1437, -1739, -1982, -1873, -1784, -1986, -2017, -2257, -1971, -1386, -1416, -1107, -1055, -642, -396, -56, 168, 344, 695, 887, 1322, 1209, 1735, 1725, 1719, 1763, 1774, 1780, 1648, 1575, 1050, 1288, 1019, 464, 540, 401, 288, -228, -191, -384, -525, -603, -521, -748, -707, -891, -846, -703, -468, -733, -569, -529, -546, -231, -129, -26, 63, 57, -56, 73, 190, 178, 171, 220, 251, 191, -151, 35, -95, 230, -346, -251, -224, -268, -230, -192, -379, -234, -362, -52, -50, -52, 81, -32, 305, 278, 292, 582, 382, 585, 580, 484, 650, 595, 655, 449, 294, 404, -7, 240, -51, -139, -275, -344, -714, -609, -641, -998, -841, -988, -1158, -1115, -1102, -950, -1012, -968, -907, -678, -768, -676, -304]
2757c04R0K33K25J0M26P9J98J12J45J97J49J9q4j65J27M1k22k10J32n00Q1l84
2779C95l46J03k77j49j57j36j78j41l96M60L8q7j15L71k58J05K43j7K81o4m6J74
2801a97J24o7p0J2MJ70k08O6k70k88J06Jm47J48p3J80n4j07K05K5M11K07J76K68
2825C22J48L33L7M41L51k9M45K61j09Q5k41K04j48j75Q0l51m27p3j20q28l82l68
2847e44k80M2m55j78k11r8J20l30J5K17k98P2M68J83J08K81K86lK08J21l19N20
2869g5J39K30l9r7J10k08P2k75r0n3m0J24j19L2R0l1j53M10j66L81r9L92K46j14
2893F67M36OK85K92J8J88l8K8N0J19k15m35J49j0o27m79k08l12m41j55l65j05
2915a152l91k39j32l02j07R1R3K41L7M69m9L3K87K75J45M25J67L08m0J63J58j
$$ y = [-304, -214, 19, 244, 254, 680, 759, 957, 1069, 1214, 1411, 1560, 1579, 1495, 1330, 1457, 1498, 1276, 1066, 1198, 698, 779, 395, 49, 152, -125, -274, -431, -567, -745, -886, -1282, -822, -784, -871, -986, -615, -873, -768, -525, -542, -261, -325, -371, -197, -73, -140, -210, -198, -194, -24, -232, -166, -436, -724, -618, -617, -1064, -916, -989, -809, -863, -970, -765, -740, -329, -122, 54, 322, 470, 803, 840, 1281, 1632, 1603, 2048, 2309, 2200, 2285, 2044, 2248, 2100, 1925, 2005, 1654, 1227, 1154, 1034, 206, -176, -544, -824, -782, -1237, -1415, -1626, -1724, -1604, -1934, -1919, -1702, -2000, -1928, -1460, -1277, -1169, -888, -602, -605, -397, -276, -595, -75, 64, 294, 255, 158, 268, 60, 132, -143, -233, -286, -326, -202, -321, -289, -199, -230, -383, 27, -139, 242, 143, 535, 781, 667, 1103, 1109, 1394, 1686, 1704, 1892, 1854, 1882, 1932, 2051, 1836, 1401, 1550, 1540, 913, 434, 226, -86, -527, -682, -1047, -1152, -1543, -1782, -1914, -2216, -2323, -2232, -2139, -1898, -1861, -1392, -1441, -1408, -1121, -846, -701, -276, -109, 199, 159, 322, 480, 479]
2937D79J11L11j87j36K97l08mr8j83J49l25K32k74P0p6jJ55j02J13K87k1r6N07
2960I00J0J75O3P9O7j46J21k52J81p2k81L3l81Q0o99K7k11l14k16p0j98l50j87
2983a641m27L89j80l9J99Q7p3L88J14K60K09M0J93O64k8L03L04Q5n9ML30q8Q8
3006A122j06k62P2q0J52l85j3k63k47j08J53j48J5j25n9J73M6K90p3j12J92L19
3028E53k39J89K74m15J53J7J44k15jj47O7r7m83k33QK2k03j32k03o7k77K3M15
3051h47j96J94j06l0K13K64L06P0j22J76K89N1J62O5K17j10L92j12J90l59l5j13
3073E59j36J77l02J64k2l75J67p1q0p1k96J57m7N3l13J79k4O7p5J57K91l98K84
3096D5q8J46m6j96K91j96p7L19l17M69n42M18l86K73k70L7J65j85J85n3j00k9
$$ y = [479, 590, 901, 714, 578, 875, 567, 563, 465, 282, 431, 106, 338, 64, 134, 58, 57, 212, 110, 223, 510, 489, 393, 900, 910, 1085, 1148, 1227, 1294, 1148, 1269, 1017, 1198, 1126, 845, 878, 497, 577, -122, -95, -306, -620, -836, -906, -1104, -1454, -1641, -2068, -1679, -1859, -1898, -1699, -1612, -1685, -1297, -1183, -923, -714, -674, -481, 183, 155, 458, 762, 847, 788, 792, 1122, 1034, 1122, 1016, 754, 826, 746, 898, 513, 500, 237, -10, -118, 35, -113, -98, -223, -282, -109, -63, 227, 154, 42, 234, 553, 314, 503, 777, 362, 515, 532, 676, 461, 460, 313, 380, 283, -200, -433, -425, -403, -606, -738, -941, -1008, -1285, -1262, -847, -1043, -849, -955, -985, -772, -508, -202, -132, -254, -78, 211, 262, 424, 489, 706, 596, 988, 876, 1066, 707, 672, 559, 423, 600, 298, 462, 440, 65, 232, 161, 81, 10, -286, -129, -176, -123, -436, -257, -281, -214, -289, -132, 159, -239, 45, -43, 103, 57, -139, 152, -44, -121, 198, -119, 350, -192, 226, -160, 113, -157, -120, 45, -140, 45, -8, -108, -137]
3118a37n2L49m1R0j18j90OJ75R8M9k10Q4K93l25L12l2L8j41J2j02j20J66M1k46
3142aO3N0M4m6j05j29j19J91k26l4M5j01j64J56p9q3O5k72K76k06J22O8J87L9
3166b59Q3L00l17K64P3J91j29K43O3K43O0M8j91L41j01l73J71l44K71k51J0j29
3188B67L5l12m5K9k00J41l75J72j27R7O2o3j71J50J38L5k66N08j93J65r8j1O65
3211F03n49L0p2j78k4k8M5r6l37M06l51j04R3k75J52n9J73J6j14L15J12K55Q8
3234A01M49k68N9L37K77N6k32N50j5j4l8j5j94OJ23k96j7k27k06N6m95q5r9l95
3258e82j99j71J54j23Rj07J62k90K55K2M8J73q0K65K12k82M54J41k0lJ7K95m30
3281h0k2O3p7j60K69j93o8j16l02j37K89J46j76K39J56j04K21J2L19K85QJ80K76
$$ y = [-137, -189, 160, 119, 209, 91, -99, -93, 82, 180, 229, 19, 103, 396, 71, 383, 351, 389, 248, 260, 158, 38, 204, 245, -1, 62, 112, 156, 110, 5, -124, -243, -52, -278, -312, -267, -368, -532, -376, -455, -538, -473, -745, -469, -675, -553, -485, -298, -259, -176, 124, -193, 71, 144, 335, 206, 449, 512, 755, 815, 863, 672, 1013, 912, 539, 710, 366, 637, 386, 396, 267, 302, -10, -55, -26, -226, -85, -460, -288, -415, -318, -256, -319, -490, -340, -202, -167, -433, 75, -118, 47, -51, -62, 603, 54, 84, 12, -166, -190, -218, -173, -269, -606, -200, -551, -655, -562, -837, -685, -744, -571, -555, -669, -354, -242, 13, 101, 550, 282, 341, 678, 955, 1011, 779, 1329, 1314, 1300, 1262, 1247, 1053, 1059, 1182, 886, 869, 642, 436, 492, -3, -88, -187, -582, -781, -952, -798, -921, -912, -1019, -857, -1147, -892, -870, -822, -649, -729, -464, -252, -534, -80, 61, 41, 38, 55, 350, -80, -102, -39, -116, -276, -7, -200, -268, -384, -686, -823, -534, -388, -564, -325, -169, -273, -52, -40, 279, 564, 572, 752, 1028]
3304A028K63J05j92K86oj29K85l69Q0k0l25N4j87l25L3o46l49J43l30l71J19l68
3326a221j0J6J24m6oJ85R6n0J60Rk5J70J67K41K30L14j56J46q4k94K21L3l94M24
3350B50k50j79j22j10L10j46j92R7J45PJ01J08J26j24L98l4N02j60N41j96O5K53
3372A390p6P9R0k09m4L0k73k94k1l23j13j07p4n03j11k02j91p2J19m24M6k50k
3395a535J38K7k03L68L21M8L40J39J09N20k45J98k2Q4M0J78m3o4j14Q1n0k25R8
3418A88R4l81K13r2j7j68K5Q0q0K54j23L53K10J03j44Q4L18L2J08j93r7K12q5
3441H94j4k37o0J36k98r9r2l96j00M2j60m23j43J05m2j30l9j88L56k6k80J17K69
3464h08N1K53J0K38k0K64l8K12J67L19l32j06K97k72K05j42k5J54k26m6M1R2k82
$$ y = [1028, 1291, 1396, 1204, 1490, 1484, 1355, 1640, 1271, 1351, 1331, 1006, 1060, 873, 548, 581, -65, -414, -271, -601, -972, -853, -1221, -1231, -1215, -1091, -1137, -1143, -958, -862, -912, -752, -743, -768, -598, -431, -190, 40, 354, 198, 344, 260, -34, 187, 220, -174, 250, 0, -179, -301, -411, -101, -247, -439, -342, -197, -190, -89, 19, 145, 21, 419, 385, 887, 727, 1268, 1072, 1137, 1390, 1314, 1393, 1483, 1274, 1230, 1260, 987, 693, 672, 349, 236, 129, 55, -448, -559, -761, -952, -1024, -905, -1329, -1283, -1533, -1535, -1397, -1370, -1573, -1205, -884, -836, -496, -357, -248, 272, 27, 225, 203, 287, 327, 505, 462, 398, 284, 365, 315, 90, 188, 282, -99, 114, 22, 5, -163, -138, -58, -138, 116, -7, 346, 556, 659, 515, 599, 917, 949, 1057, 864, 767, 979, 894, 880, 643, 583, 719, 421, 322, 230, -166, -266, -224, -384, -807, -950, -845, -887, -1017, -1056, -1244, -888, -914, -1194, -1077, -808, -757, -504, -494, -256, -276, -12, -50, 162, 329, 648, 316, 210, 507, 235, 440, 298, 273, 427, 201, 155, 196, 288, 6]
3487Fm4J61j53O9j68K58j6N4K32m6p1K12l00K03nM9J39J5l31%M16k70n9j4n0n26
3513b39J55P4m70K6J52j42k38Q4K53k96J3o1J09jN7k9R4n7L51P5j38qK05J34K97
3538D00q5j07q9J16j08M11l24K2K49r3j8p7j06j27Q3J64q2k53Q5j79Q3j45L15
3561A35j65P9o8rk34J54j74K34j31M7J96l70L87nk1P1k3P3j16k09J19Q2J46o7
3585A31k29J07l7j03RK87r8P9k32R5j0j58J13J58l2j60k68N77l05j2Q9K04j43
3608F2K5M1mp1r8P5J46l3P7M8k72J33q8j3N4j2k26n6M4J12o3k40K6o5J05lk09
3635e05o9J83P5J34N7j09K98O1j45R5J52J17J28k85J89q4K14K1M1k60J20J55q5
3658D98j13j4n6j90r1K25l01q5j43j41K28J08l04J69M4l58M64k8j21K33j33M31
$$ y = [6, -38, 123, -30, 39, -129, 129, 113, 167, 399, 353, 282, 494, 194, 397, 392, 441, 580, 595, 264, 264, 680, 410, 351, 337, 287, -239, -84, -10, -480, -454, -302, -444, -682, -598, -345, -641, -628, -689, -580, -581, -524, -553, -459, -516, -165, -90, -228, -236, -31, 103, 400, 315, 208, 119, 235, 127, 538, 214, 236, 485, 392, 374, 297, 191, 64, 147, 311, 229, -24, 61, -118, -35, -180, 135, -30, 49, -19, -28, -262, -108, -282, -48, -179, -132, 64, -306, 81, 76, 55, 126, 103, 176, 60, -149, -30, 52, 198, 131, -98, 9, -28, -131, -122, 165, 67, 146, -86, 9, -1, -159, -46, 112, 80, -80, -348, 229, -76, -88, 1, 205, 62, 87, 128, 124, 53, -45, 30, 176, 143, 220, 268, -4, 129, 41, 28, 82, 70, -156, -212, -168, -56, -119, -359, -333, -398, -293, -296, -505, -574, -391, -316, -182, -125, -234, 64, 125, -20, 75, 227, 344, 472, 187, 376, 292, 506, 527, 568, 308, 428, 583, 498, 385, 371, 315, 125, 34, 259, -42, -127, -270, -411, -183, -75, -379, -210, -166, -524, -60, -88, -209, 24, -109, 322]
3680C22m39P9j02L81L9k11k47J67P4K9l96M8J70p5j31k30K78p3j55J35jr9M4K37
3704a56j66J77Q1O5rJ40K79Q5k39K94q2K37q1J18J38l36j4M6k48J41j79Q8k88
3727I1j44j5j10K3l31J91k97m4j09K97j70J89P9k66K60n1R9M1L0J15N0Q7j5j60
3751a60L08R6k49j20k8J67k00j1K87j66n5m5j23J74k20J45k70K38OJ79k58L71
3773F6L03k75J16N4L37L4J33n37K06K35r1K06k91K2k15K66n9j43k32k31K00l84
3795b80J68j43j9o0K1k66L3J30p6O7j50J42J64j86N9L36k9j07J53nJ58j1j83L19
3819B35r9p7m8K12j28q7j16J59K01n14K78Qj81L01j07j23m6Q0J25r8J87R0o6K57
3843D43l35M53k20k14j0L07Q6k40j36J44j65K23k56J25j9j76r5k87K09l4j80P5
$$ y = [322, -117, -38, -140, 241, 280, 69, -178, -11, 63, 92, -304, -256, -86, -161, -292, -522, -244, -317, -472, -337, -338, -437, -393, -156, -322, -145, -64, 1, -8, 132, 411, 496, 257, 551, 469, 706, 625, 743, 881, 545, 531, 577, 329, 470, 291, 379, 91, -53, -68, -178, -155, -486, -295, -592, -636, -745, -448, -618, -429, -350, -616, -356, -407, -308, -267, -237, -122, -72, 15, 0, -160, 148, 244, -5, -125, -153, 14, -186, -197, 90, -76, -131, -176, -299, -125, -345, -200, -470, -232, -226, -47, -305, 66, 369, 94, 210, 264, 601, 635, 768, 231, 437, 672, 581, 787, 496, 518, 303, 569, 510, 367, 135, -96, 104, -280, -112, -255, -274, -334, -313, -579, -546, -416, -492, -425, -575, -433, -269, -455, -396, -60, -89, -196, -43, -48, 110, 99, -84, 235, 136, 59, 11, 223, 95, 8, -108, 51, 252, -262, 16, 24, -157, 144, 37, -86, -132, -52, 73, -25, 162, 252, 186, 443, 108, 561, 341, 127, 117, 424, 510, 270, 134, 278, 113, 336, 80, 205, 186, 10, -85, -372, -163, -197, -377, -302]
3865c02J75n5k07m4M5M7J09J25n7j21P7N3K23j32N4M19k78pQ1j29J30j69K36k96
3889b3p7L49k71K6K70k59j59J68L6k11j18K39j04K85j6k20N3o6L20R3j18q0l4
3912H3lk22L6J20J14NK0k67K25k75J32j12k7J23qn5K49j68j70K19j52K7k49K22
3936a33m5R5pj5q9J5K22l2j69J66q5L4N4L4q2J03j16K85j81l1L91r6l22p6L35
3961B55k59J19k44J13k07K80k20K08j51Q1m6L38l59p2J59j06J06J48j37P5j75
3982i4l0L95m65J12N3%r7K53k4j93K68m3L0m2k37J44K52j90l72N64m92K76j25
4005e7J90r2j78K90j15pq2J30M7m04K75qO5k07J58J67l68J59J37L9j68j01L30
4028B00l5j69j38J08O3j61L37m86J74K06l28r5L41j01j95K28j32o3K56j71J95
$$ y = [-302, -127, -182, -389, -433, -388, -341, -232, -107, -164, -285, -208, -155, 68, -64, -10, 409, 131, 124, 205, 76, 206, 37, 273, -23, -100, 249, -22, 4, 274, 15, -144, 24, 60, -151, -269, -30, -134, 151, 135, -85, -32, -98, 222, 315, 197, 117, 83, 80, -142, -106, 14, 128, 133, 153, -114, 111, -164, -32, -144, -171, -48, -56, -111, 138, -30, -200, 19, -133, -106, -355, -133, -178, -83, -90, -105, -194, -179, 43, 11, -158, 8, -77, -43, 11, 45, -37, 66, -50, 235, 54, 23, 414, 318, -4, -80, 255, -4, 115, -129, -16, -223, 57, -163, 45, -106, -25, -71, 267, -92, -164, -5, -111, -5, 143, 6, 81, -94, -124, 271, -194, -82, -29, -29, -126, 127, 103, -90, 178, 135, 165, 123, -114, 30, 282, 92, -280, 284, -208, 68, -57, 133, 41, -137, 153, 38, 31, -51, 79, 126, -278, -3, -11, 54, -153, 5, 172, -196, -37, 100, 139, -29, -130, 200, 165, -4, -142, -34, 29, -132, 205, -281, -107, 99, -229, -324, 17, -84, -279, -51, -183, -246, 10, -161, 34]
4049C4j46K95j96k52K20M2QJ91MPk79K13J40k27J9J23K0p3j88J33p6N2O4l72K52
4074Hj23P6K20k64o7p6K77R7J75o03K64q6K88j50j66J04k58P7j73L26p1J45K55
4097B75l02k00K44j41k13J44m7l2K08J74q0j6j19L7k46J82N1J36k8l7k0J85J99
4120C54n77J89j43M28j96l9K85j91n8M9J11q8R1Kj96K21k66k41J33K59p1j36j7
4143i7j00J84k06N2J21j11J87k83K86k44K46J38j50q2J25k48M26l83L78m73rK17
4165b6J77k25J66q1k2N9j82k3j40L75k52K56j84P1J25k99J88J76l40L11lK5J55
4188C07j98k8j71J75l8j36J77k05K48l7J0j47N9K46k25k0kJ15j59j49P5L6M8j89
4212b08Q9K4K65j43j46J93j64O3K11l91N3M33k22nQ3J35k62O9J80k36K3j73J92
$$ y = [34, -112, 183, -13, -265, -45, -3, 5, 196, 200, 207, -72, 141, 281, 54, 73, 196, 216, 143, -45, 88, 12, 64, 128, -244, 8, -115, -39, 181, -83, -150, -226, 51, 148, 323, -280, -16, -102, 186, 36, -130, -26, -284, -207, -380, -54, -125, 20, 275, -27, -227, 17, -124, -337, -193, -240, -272, -64, 110, 30, 14, -105, -68, -314, -132, -81, 55, 27, -10, -30, 155, 354, -223, -34, -177, 251, 55, 16, 301, 110, 52, 101, 212, 124, 215, 217, 21, 242, -24, -265, -132, 127, 56, -80, -97, -197, -13, -219, -167, -46, -157, 30, -253, 33, -211, 35, 173, 23, -59, 66, -182, 244, -139, 239, -234, -243, -26, 151, -74, 92, 11, -11, 48, -134, -157, -297, 78, -174, 82, -102, -31, 94, -205, -17, 159, -181, 130, 127, 152, 307, 109, 81, -90, 85, 47, -89, 88, -117, 131, 94, 104, -43, 16, 262, 37, 17, 15, 130, -29, -178, -103, -67, -19, -208, -119, -95, 170, 27, -119, 74, -90, -27, 184, -207, -154, 279, 57, 52, 135, 270, 8, 77, 257, 21, 44, -129, 63]
4235F3R5J73l81J27L9j99J94m2n9L2L9j31J16j84J29k5J24j48J13j64J91q5r8
4258h1J4J71j3r4j67J07L17l64j5N5mM2Q1j01K26l1k89K53r7J60j40K3k21J28
4282d0J56l4K55l36q3J01q9J89p0J2l10L14J00j53J28j53m1k3J37k9J69r2Pj96
4306h1J33J26j11%l67K71J06k91M2J2j17N1P5J40k15lJ01j00L11L8n4j62M5k3
4330g3K49k74Lj87J39K45o9L34l15K00k30O9J55k01pK10Q3j75q8qk6J79l36Q4
4354c9j32O4Q9N2j85O8J54j43L98j95k64M1L22j43J5Pn7k2n4m0O7j23k0J36p0
4379g4K4J82k36o5K38j05j73K90m3l26K10N7q6k3J62k04M4m6nL38l17O6K77j37
4403D8j00J53k58J18OK76l1J75k55j72M78o93L26J1J75j89oP6m13M70k90N1K0
$$ y = [63, 158, 331, -50, 77, 116, -83, 111, 69, 10, 42, 81, -50, 66, -118, 11, -14, 110, -38, 75, -89, 102, 17, -81, -67, 104, 91, -3, -170, -63, 254, -110, -125, -70, -74, -32, 49, -52, 174, 143, -146, 107, 10, 170, 30, 53, -168, -40, 116, 82, 337, 1, -82, 19, -70, 119, 49, 61, -249, 65, 165, 12, 140, -13, -54, -77, 60, 31, 200, 108, 115, -81, 52, 178, 67, 67, -300, -29, 77, -214, -172, -160, -277, -226, -151, -11, -226, -229, -128, -228, 83, 121, 67, -95, -50, -73, 176, -98, -95, -282, -143, 102, 33, 367, 52, 252, 22, 91, 246, 45, 38, 248, 331, 156, 68, 60, 34, 213, -123, -39, -171, -107, -18, 34, -151, -83, 71, -72, 326, 131, -133, -92, 230, 87, 102, 109, 52, 30, -24, -64, 3, -120, -140, -4, -74, -50, 132, -104, -169, 69, -36, -209, 81, 38, -288, -78, -21, -107, -130, 32, -172, -128, -174, -179, 159, -158, -92, 185, 48, -52, 101, -157, -39, -33, 243, 212, 387, 132, -40, 438, -255, 71, 82, 257, 68, 62, 138, -275, 195, -95, -44, -24]
4426b4rk52M67k80R9k7K52k26l8k1K20l15R5J52j59J47m7J42m11L02k93K39j72
4449a59J0l5J16J20O1l33m3M23k24J11j64l3J17k1j27K21l7j82K87K4L80n19K32
4472B25j4J84j25k0j98o5n6J82P3k66J92m52M8M06l2k12J73J16l49J46J2l5J07
4495D0j77j10K51Q6r2j82P2N6j59J82K1K39k03N2k8q1J28p7k59O2J4L0K8K3r2
4520a76r9K55k35n5L26k99J99R1N4J00j80r3J08J14jj05J08K30j53N2k88J97J45
4543B95k76Q1j68J22k26K65J73j41j20Oj71J25m9o3J19j40n3J76L2J29j96K1j05
4566a64j53L93j30%j90M41l50O4J97j77K08k69L52k45R4j7l26K28n0MJ15l1k95
4589c01L09j91j8J82K69j91L0p9J5K74m00L75j76kK4j51K9J74J73j90k18k3L04
$$ y = [-24, -33, -285, 182, -98, 1, -26, 226, 0, -38, -59, 161, -154, -59, 93, -66, 81, 34, 176, -235, 67, -226, 13, -159, -149, -184, -68, 52, 113, -220, -263, 160, -64, 47, -117, -150, -33, -54, -181, 40, 3, -179, 108, 132, 512, -7, 225, 211, 395, 270, 250, 52, -13, -69, 113, 186, -80, 112, -340, -292, 114, 82, -130, 43, 159, -190, -44, -32, -67, 40, -137, -247, 4, 90, -2, -184, -112, -56, -215, -33, -12, 227, 24, 76, 48, -33, 95, 18, -241, -179, -165, -135, -107, -84, -176, -275, -20, -255, -310, 16, -283, -84, 7, 61, 161, -19, -112, -4, 110, 109, 4, 112, 342, 189, 241, -47, 150, 295, 19, 100, -68, 54, -172, 93, 266, 125, 5, 11, -160, -35, -84, -147, -28, -168, -221, -45, -13, 116, -80, -59, -164, -317, 76, -54, -54, -244, 197, -153, -89, 108, -69, 139, -130, 222, -23, 71, 54, -272, -44, -94, -90, 25, -6, -301, 8, -183, -201, -19, 250, 59, 89, 10, 25, 299, -101, 274, 98, 96, 120, -31, -2, 172, 345, 155, -63, -86, 218]
4612B18m45L05j77R3o6j38J03J60k24J73p8n9K31Pj36R5k29J66K42l59L2K58N
4635A77j47qk12K21J4j42L4K22k70J57j01o7L39J06m29J31L6k72K3L34K0r0nl71
4659c00M41k19J41N7L2j6r1p7M9K02j59k11L9J66J29j13j23n7J03J87k00K34m09
4682a95J52M35o2k70%N5j99Kk88L84k90L97j72j50Q0r8J39j93L43k14k0J25lL1
4706a1L10o10J68L09J1O2j58Rk68%L17p4k48Q5q8J21K12k17J58K8m0j79J06k11
4730b08K36j39j28J94P6n6n8oJ93j15j33K19J59k72l4K5PJ70j78L0k0O6k05K59
4754H2o0j19K07j3O2m2k25L5o8K49j21Q4P2K7m68J61QJ0J02K05k39j49J29J33
4778F2M2k01K87KL0k19J00M4k11K1K93l44QJ14j36J25l00L67l45K77l99Q5O5l3
$$ y = [218, -227, 78, -99, -6, -72, -210, -107, 53, -171, 2, -76, -135, 96, 103, -33, 62, -167, -1, 241, -118, -86, 172, 177, 30, 22, -190, 31, 45, -97, -63, 159, -111, 46, -55, -122, 217, 323, -106, 25, 61, -211, -188, 146, 166, 76, 71, -300, 141, -78, 63, 120, 152, 136, 45, -32, 17, 219, 60, -151, -112, 54, 183, 70, -53, -110, -7, 180, -20, 214, -195, -43, 392, 330, 60, 60, 115, -84, -82, -370, 14, -276, 121, -51, -201, -121, -219, -80, -273, 70, -144, -164, -39, -42, -11, 299, -311, -143, 166, 177, 239, 81, 90, -178, -178, 139, 65, -183, -98, -186, -65, 147, -70, 88, 116, 76, -103, 3, -208, 28, -111, -239, -45, 31, -25, -83, -89, 104, -11, -144, 75, 234, -38, -72, -47, -40, 130, -48, -18, -38, 28, -177, 82, 22, -97, 110, 97, 159, 117, -108, -73, -141, 108, -13, 71, 143, 170, -298, -137, -129, -119, -17, 188, -51, -200, -71, 62, 104, -97, 190, 192, 222, 3, 103, 147, -64, -43, 250, -94, -86, 28, -108, 17, -283, 84, -261, 16, -383, -298, -233, -266]
4802b66N8q8J49j16L04J04p5r2jj51K36M1P9k2k54L10q9J48Oj74J84j00j08Lo5
4827B1JN3K2j0j28m7R5K04k70J4J37j49L4J30J16M2j76l7r0Q0O5J9j93m2%J32
4853B3R6M3k07NN9P9m94M22n10K54oJ9J19j39p4J04K57j70rJ6K48j31q0P3J23
4878A20J9p8o0J48J06r6K8p7L1N3q2M3k98J33OQ9k31R0J71k56J05m5J8K3M5j11
4904a06J85j03q9K06k08J51j0J0J42j74q8Q6Q7R8k18J47O4n03J93R7k24J18j82
4927c21L19j63r1J36l38L72l53J48L88j94N2k17K72J20J01k75J44J13k49K08K12
4948C84k16m2k32K50j92J40L27l24q4N8r3j2K29k13k4K23l28j01K51N2j12J48
4970H9j06q7J46mj20K47l19O4K86k07j11J02j94J49K6j82J05J98l90L19p3R0l85
$$ y = [-266, -208, -296, -147, -263, 41, 145, 70, -22, -23, -174, 62, 103, 182, 160, -94, 216, 127, 275, 281, 107, 291, 191, 83, 86, 21, 22, 75, 97, 87, -41, -88, 7, 211, -59, -45, 92, -57, -23, 107, 223, 265, 89, 52, -38, 42, 107, 126, -67, -109, -109, 23, 119, 162, -45, -40, 19, 98, -396, 26, -484, -230, -236, -217, -98, -237, -311, -207, 50, -120, -129, -113, 135, 4, -76, -3, 120, 139, 61, 1, 149, 255, 159, 187, 110, 141, 194, 112, 155, -143, -10, -4, 85, -146, -56, 115, -141, -36, -81, -63, -40, 5, -106, 79, -24, -113, 93, -115, 36, 26, 36, 178, 4, -84, 2, 89, 187, -31, 116, 180, -323, -130, -33, -257, -139, -321, -2, -165, -256, -120, -458, -86, -439, -291, 97, -97, -45, -262, 10, 130, 231, -44, 100, 213, -36, 172, 384, 168, 126, -106, 144, -48, 92, 419, 95, 11, 69, -24, -36, 193, -20, -44, 179, -149, -250, 1, 53, -59, 89, -17, -104, 42, 38, -82, 165, -154, -90, 196, -11, -122, -20, -214, -65, -39, -221, -116, 82, -308, 11, -62, 28, -357]
4993c57K92J53j41k82L28mj64p2K16Q3q0m8J50k21M79j62o1p8P6K73k85k40L99
5016B54j01j70J25l10L17o1K97k89R0l78N8K16Pk04n5J64J01j99N5J85r1p2M8
5039a3K1j73J03o6O0Q8j84K39j36L04j94j76j20L69J11k86J46k08J83P9q3oj84
5062a26q5K74p6Q2k74K68M2J60Jl50L1J80k41J62k38M97j85k15M0J78o0j86J11
5085a0K23K3k35m0O9J0k75M74l55nj19j3K29N4p9J45k4k44O4R1k8K58r6l9j35
5110e7M7J43r3Pj24J14r5N4j7l1J27Pl19J92nP3J25q6j46p8K22j83J14n2K44m6
5136A37k90NJ68R0kL0k40L23j23j99K9n1N7J94o0j6J07j84K8q7qJ30J50k19k09
5161b40Q7L45l74J49M9n2J21J15j32J84j50r7J08j7j1l24L72p4rJ23m26J35P4
$$ y = [-357, -65, 88, -53, -335, -7, -11, -175, -247, -31, 52, -28, -76, 74, -147, 332, 170, 109, 31, 107, 380, 95, -145, 254, 153, -17, 108, -202, 115, 54, 351, 62, 152, -226, -168, 48, 55, -149, -204, -40, 61, -138, -83, 102, 11, -61, -13, 8, -165, -62, -128, -68, 20, -164, 75, -61, 243, 49, -127, -247, 122, 233, -53, 93, -115, 68, 147, 64, 58, -126, -211, 63, -13, 69, -205, 63, 105, 265, 266, -84, -53, 127, -114, 48, -190, 307, 122, -93, -53, 125, 65, -121, -10, 213, 236, 1, -39, 30, 40, -235, 239, -116, -121, -240, -253, -24, 30, -49, 96, 72, -172, -108, -17, -45, 213, 117, 78, -57, -10, 133, 40, 47, -77, 37, -58, -4, -21, -52, 75, 82, -237, -45, -50, 23, 148, 62, -84, -162, 60, -123, -9, -61, 183, 137, -153, -148, 20, 110, 108, 138, -102, 221, 98, -101, -72, -123, -66, 128, 68, 52, 159, -25, 3, -84, -92, 38, 188, -31, -240, -153, 192, -182, -33, 16, -36, 85, 200, 68, 252, 102, 5, 113, 96, 85, -239, 133, 59, 50, 173, -253, -118, -44]
5184d4j48J75Q4l62M81P1L2j5j13j39n9k8J89j26J10n5j56J61j55j19J87j37N3
5207a13k26L15m3J3p5o7J26n0n3k5K89%n2k45N1M7L34j50m0P5k80K35q1M06k04
5232A87l50K39J9K1p7j39J54J78q7j40j47K7J69J05l71M29j12p8J14k33k0M33
5254C21j77N9j8k64J91p1lO7m17L77j73M94l79m1p4j44P8N0k4J08l8M1k62K93
5278fo4J06k13K05M1k14K7J29K30k26k8m2J99o7J53j04O0j02O6k66K12N2J30j14
5302A64k14O9r9l0K95j34MK6r2Oo5M6K6J60l10M5L69j62k74Q2K42k72J37K36l33
5327g8K32k01j48J78Q1j24J50l92L22J8j91J2p0J64q9J87p3N6J0q8rj29L66n0
5351A34j26P1j06p9K65K25l16r3K96j74k04J85P9J41j51M7m65J05J59J56j46J86
$$ y = [-44, -192, -17, 67, -295, 186, 257, 289, 274, 161, 22, -37, -65, 124, -2, 108, 53, -103, 58, -97, -216, -29, -166, -113, -339, -24, -67, -54, -129, -196, -70, -120, -173, -198, 91, 91, 39, -206, -155, -108, 226, 76, 36, 111, -169, 66, -15, 391, 187, -163, 76, 95, 116, 39, -100, 54, 232, 145, 5, -142, -115, 54, 159, -212, 217, 105, 27, 141, -92, -112, 321, 144, 203, 185, -79, 112, 41, 38, 105, -312, 65, -108, 386, 7, -34, -108, -252, -174, -124, -148, -40, -78, -37, -299, -6, -70, 36, -177, 28, 69, -145, -118, 11, 241, 15, -13, -55, 144, 77, 230, 126, 186, 84, 150, -116, 96, 148, 278, 164, -50, 19, -80, -110, 185, 51, 55, 81, -11, -5, -70, -24, 2, 162, -148, -103, 266, 104, -170, -88, 154, -118, 19, 255, -78, 154, -47, -195, -17, 64, -60, 90, -302, 20, 38, -153, -141, -211, -47, -136, 51, -22, 34, 44, -44, -53, -182, 184, 134, 8, 79, -27, -106, 159, 384, 68, -25, 271, 97, -107, 78, 157, 298, 147, 194, -271, -166, -7, 149, 3, 189]
5373A89k19J05oj00NOm3R5j82L69l21J34l8j49J93M5n5m2kj55j8K42l18K53j64
5398a76J28K89k76p8J94k07K36o2k17J83K5j41K02r4J81k4j43n2J70k17M0J10
5420G1O6j37j26Q7K14j17j21K01j9k56l9J88L4o0J53l03J70O3r2J7K35j20m44
5443c35N76k18J98j33r5J01O6k04J2P2P4nJ38l73K54k74J04J09J00k00J93j11
5465D9K13L0l64O7L8n0R5j00J35k68J80k44J47m4J58q7k19L57O4J35m65J01P5
5488Cj22L13n7j54J13k69K52j39J21j64L29j54O0j68J44P2k10%n7K10j00m3K89
5511B69l64N19p54O11n14N11k22o0J06l30K35J2O7p6o9j12nQ6L9K44j27k43L95
$$ y = [189, -30, 75, 69, -31, -26, -20, -63, 32, -150, 219, -102, 32, -6, -155, 38, 83, 28, -14, -16, -171, -189, 53, -265, -12, -176, -48, 241, -35, -113, 81, -126, 110, 48, -169, 14, 39, -102, 100, 6, 187, 163, 20, -32, 138, -79, -39, 71, 137, 0, -126, -39, 175, 58, -63, 138, 119, -137, -176, 12, 46, -14, 139, -164, 6, 69, -23, -6, 229, 109, -335, 241, 23, 221, 88, -7, 94, 160, -44, -32, 40, 114, 109, 247, -126, 128, -146, -42, 67, 167, -33, 160, 49, 262, 292, -72, -5, 33, -17, 78, -22, 113, -155, 25, -219, -72, -116, 42, -45, -264, 93, 157, 292, -173, -72, 3, -119, 194, 137, -17, 96, -173, 79, -60, 61, -103, 226, 72, 132, -36, 108, 180, -30, -30, -87, 123, 23, -20, 269, -95, 424, -330, 281, -233, 278, 56, -4, 102, -228, 7, 19, 86, 10, -59, -171, -176, -90, -51, 193, 66, -177, 218]
$$ [...]
8191b8
##END NTUPLES=NMR FID
##END=
