##TITLE=1H_Pr 4-Cl-0
 CDCl3
 8 sc, 
 8.04.2022
##JCAMPDX= 6.0         $$ Bruker NMR JCAMP-DX V2.0
##DATA TYPE= NMR FID
##DATA CLASS= NTUPLES
##ORIGIN= UXNMR, Bruker Analytische Messtechnik GmbH
##OWNER= root
$$ XWIN-NMR		Version 3.5
$$ Fri Apr  8 13:55:36 2022 Russian Standard Time (UT+4h)  she@DPX200
##.OBSERVE FREQUENCY= 200.13135
##.OBSERVE NUCLEUS= ^1H
##.DELAY= (6, 6)
##.ACQUISITION MODE= SIMULTANEOUS
##.ACQUISITION SCHEME= undefined
##.AVERAGES= 8
##.DIGITISER RES= 18
##SPECTROMETER/DATA SYSTEM= spect
##.PULSE SEQUENCE= zg30
##.SOLVENT NAME= CDCl3
##.SHIFT REFERENCE= (INTERNAL, CDCl3, 0, 15.7039)
##AUDIT TRAIL= $$ (NUMBER, WHEN, WHO, WHERE, WHAT)
$$ ##TITLE= Audit trail, XWIN-NMR		Version 3.5
$$ ##JCAMPDX= 5.01
$$ ##ORIGIN= Bruker BioSpin GmbH
$$ ##OWNER= she
$$ F:/spectra/data/she/nmr/H-F/1/audita.txt
$$ ##AUDIT TRAIL=  $$ (NUMBER, WHEN, WHO, WHERE, WHAT)
(   1,<2022-04-08 13:54:34.09 +0400>,<she>,<DPX200>,
      <created by zg, POWCHK disabled, PULCHK disabled
       configuration hash MD5:
       00 E9 B6 7A A2 85 ED C7 34 08 36 98 17 FE 4E 26
       data hash MD5: 16K
       2D CE 53 C5 10 0D 67 1F 51 AE D8 17 01 3E 16 2B>)
$$ ##END=
$$ 
$$ hash MD5
$$ FC 56 D8 F4 57 27 52 2B 3B AE DB A0 1D 6B E2 E7
##$RELAX= 
##$RELAX= 
##$RELAX= 
##$RELAX= 
##$RELAX= 
##$RELAX= 
$$ Bruker specific parameters
$$ --------------------------
##$DU= <F:/spectra>
##$EXPNO= 1
##$NAME= <H-F>
##$PROCNO= 1
##$TYPE= <nmr>
##$USER= <she>
##$AMP= (0..31)
100 100 100 100 100 100 100 100 100 100 100 100 100 100 100 100 100 100 
100 100 100 100 100 100 100 100 100 100 100 100 100 100 
##$AQSEQ= 0
##$AQ_mod= 1
##$AUNM= <au_zg>
##$AUTOPOS= <>
##$BF1= 200.13
##$BF2= 200.13
##$BF3= 200.13
##$BF4= 200.13
##$BF5= 200.13
##$BF6= 200.13
##$BF7= 200.13
##$BF8= 200.13
##$BYTORDA= 1
##$CFDGTYP= 0
##$CFRGTYP= 5
##$CHEMSTR= <none>
##$CNST= (0..31)
1 1 145 1 1 1 1 1 1 1 1 1 1 1 1 1 1 1 1 1 1 1 1 1 1 1 1 1 1 1 1 1 
##$CPDPRG= <>
##$CPDPRG1= <>
##$CPDPRG2= <>
##$CPDPRG3= <>
##$CPDPRG4= <mlev>
##$CPDPRG5= <mlev>
##$CPDPRG6= <mlev>
##$CPDPRG7= <mlev>
##$CPDPRG8= <mlev>
##$CPDPRGB= <>
##$CPDPRGT= <>
##$D= (0..31)
0 1.2 0 0 0 0 0 0 0 0.06 0 0.03 0 0 0 0 0.0002 0 0 0 0 0 0 0 0 0 0 0 0 
0 0 0 
##$DATE= 1649411673
##$DBL= (0..7)
120 120 120 120 120 120 120 120 
##$DBP= (0..7)
150 150 150 150 150 150 150 150 
##$DBP07= 0
##$DBPNAM0= <>
##$DBPNAM1= <>
##$DBPNAM2= <>
##$DBPNAM3= <>
##$DBPNAM4= <>
##$DBPNAM5= <>
##$DBPNAM6= <>
##$DBPNAM7= <>
##$DBPOAL= (0..7)
0.5 0.5 0.5 0.5 0.5 0.5 0.5 0.5 
##$DBPOFFS= (0..7)
0 0 0 0 0 0 0 0 
##$DE= 6
##$DECBNUC= <off>
##$DECIM= 32
##$DECNUC= <off>
##$DECSTAT= 4
##$DIGMOD= 1
##$DIGTYP= 9
##$DL= (0..7)
0 120 120 120 120 120 120 120 
##$DP= (0..7)
150 150 150 150 150 150 150 150 
##$DP07= 0
##$DPNAME0= <>
##$DPNAME1= <>
##$DPNAME2= <>
##$DPNAME3= <>
##$DPNAME4= <>
##$DPNAME5= <>
##$DPNAME6= <>
##$DPNAME7= <>
##$DPOAL= (0..7)
0.5 0.5 0.5 0.5 0.5 0.5 0.5 0.5 
##$DPOFFS= (0..7)
0 0 0 0 0 0 0 0 
##$DQDMODE= 0
##$DR= 18
##$DS= 0
##$DSLIST= <SSSSSSSSSSSSSSS>
$$ [...]
##$SUBNAM2= <"">
##$SUBNAM3= <"">
##$SUBNAM4= <"">
##$SUBNAM5= <"">
##$SUBNAM6= <"">
##$SUBNAM7= <"">
##$SUBNAM8= <"">
##$SUBNAM9= <"">
##$SW= 18.05172834244
##$SWIBOX= (0..15)
0 0 2 0 0 0 0 0 0 0 0 0 0 0 0 0 
##$SW_h= 3612.71676300578
##$TD= 16384
##$TD0= 1
##$TE= 0
##$TE2= 300
##$TE3= 300
##$TEG= 300
##$TL= (0..7)
0 120 120 120 120 120 120 120 
##$TP= (0..7)
150 150 150 150 150 150 150 150 
##$TP07= 0
##$TPNAME0= <>
##$TPNAME1= <>
##$TPNAME2= <>
##$TPNAME3= <>
##$TPNAME4= <>
##$TPNAME5= <>
##$TPNAME6= <>
##$TPNAME7= <>
##$TPOAL= (0..7)
0.5 0.5 0.5 0.5 0.5 0.5 0.5 0.5 
##$TPOFFS= (0..7)
0 0 0 0 0 0 0 0 
##$TUNHIN= 0
##$TUNHOUT= 0
##$TUNXOUT= 0
##$USERA1= <user>
##$USERA2= <user>
##$USERA3= <user>
##$USERA4= <user>
##$USERA5= <user>
##$V9= 5
##$VALIST= <valist>
##$VCLIST= <CCCCCCCCCCCCCCC>
##$VD= 0
##$VDLIST= <DDDDDDDDDDDDDDD>
##$VPLIST= <PPPPPPPPPPPPPPP>
##$VTLIST= <TTTTTTTTTTTTTTT>
##$WBST= 1024
##$WBSW= 4
##$XGAIN= (0..3)
0 0 0 0 
##$XL= 0
##$YL= 0
##$YMAX_a= 733184
##$YMIN_a= -389517
##$ZGOPTNS= <>
##$ZL1= 120
##$ZL2= 120
##$ZL3= 120
##$ZL4= 120
##$ABSF1= 10
##$ABSF2= 0
##$ABSG= 5
##$ABSL= 3
##$ALPHA= 0
##$AQORDER= 0
##$ASSFAC= 0
##$ASSFACI= 0
##$ASSFACX= 0
##$ASSWID= 0
##$AUNMP= <proc_1d>
##$AZFE= 0.1
##$AZFW= 0.1
##$BCFW= 1
##$BC_mod= 2
##$BYTORDP= 1
##$COROFFS= 0
##$CY= 11.3945322036743
##$DATMOD= 1
##$DC= 2
##$DFILT= <>
##$DTYPP= 0
##$F1P= 2.36226072786647
##$F2P= -0.459571619588291
##$FCOR= 0.5
##$FTSIZE= 0
##$FT_mod= 4
##$GAMMA= 1
##$GB= 0.15
##$INTBC= 1
##$INTSCL= 1
##$ISEN= 128
##$LB= 0.24
##$LEV0= 0
##$LPBIN= 0
##$MAXI= 10000
##$MC2= 0
##$MEAN= 0
##$ME_mod= 0
##$MI= 1.114404
##$NCOEF= 0
##$NC_proc= 0
##$NLEV= 6
##$NOISF1= 3.799351
##$NOISF2= 2.8
##$NSP= 1
##$NTH_PI= 0
##$NZP= 0
##$OFFSET= 15.70392
##$PC= 1
##$PHC0= -18386.81
##$PHC1= 7.800781
##$PH_mod= 1
##$PKNL= yes
##$PPARMOD= 0
##$PSCAL= 0
##$PSIGN= 0
##$REVERSE= no
##$SF= 200.130013532006
##$SI= 16384
##$SIGF1= 3
##$SIGF2= 2
##$SINO= 400
##$SIOLD= 16384
##$SREGLST= <1H.CDCl3>
##$SSB= 0
##$STSI= 0
##$STSR= 0
##$SW_p= 3612.71676300578
##$SYMM= 0
##$S_DEV= 0
##$TDeff= 0
##$TDoff= 0
##$TI= <>
##$TILT= no
##$TM1= 0
##$TM2= 0
##$TOPLEV= 0
##$USERP1= <user>
##$USERP2= <user>
##$USERP3= <user>
##$USERP4= <user>
##$USERP5= <user>
##$WDW= 1
##$XDIM= 8192
##$YMAX_p= 0
##$YMIN_p= 0
$$ End of Bruker specific parameters
$$ ---------------------------------
##NTUPLES= NMR FID
##VAR_NAME=  TIME,          FID/REAL,        FID/IMAG
##SYMBOL=    X,             R,               I
##VAR_TYPE=  INDEPENDENT,   DEPENDENT,       DEPENDENT
##VAR_FORM=  AFFN,          ASDF,            ASDF
##VAR_DIM=   8192,          8192,            8192
##UNITS=     SECONDS,       ARBITRARY UNITS, ARBITRARY UNITS
##FACTOR=    0.0002768,     1,               1
##FIRST=     0,             0,               0
##LAST=      2.2672688,     0,               0
##MIN=       0,             -389517,         0
##MAX=       2.2672688,     733184,          0
$$ Real data points
##PAGE= N=1
##DATA TABLE= (X++(R..R)), XYDATA
0@%%%%%%%%qQqJ6j8K1k7L6m5N7p2Q8j05J24j48J78k07K41k79L23l75M32m95N64
$$ 0 0 0 0 0 0 0 0 0 -8 0 -8 8 -10 11 -16 20 -25 32 -40 48 -57 67 -81 97 -110 131 -148 175 -200 232 -263 301
32C01o43P29q23R28j043J168j307J460j629J811k009K228k464K721l004L315l655
$$ 301 -342 387 -436 492 -551 617 -690 770 -859 952 -1057 1171 -1293 1428 -1576 1739 -1916
49a916M029m439M892n391N944o564P261q054Q963j0014J1244j2712J4499j6736
$$ -1916 2113 -2326 2566 -2825 3119 -3445 3816 -4238 4725 -5289 5955 -6757 7742 -8994
63h994J9624k3519K9094l7804N3489r0784L54997M37081q3282N1768o5718j6764
$$ -8994 10630 -12889 16205 -21599 31890 -58894 296103 733184 649902 701670 635952 619188
75F19188p8128m7361j00069p5535r8412q1238j06123p4214q3614o6128o4580l7033
$$ 619188 541060 493699 393630 318095 219683 138445 32322 -41892 -125506 -191634 -256214 -293247
87b93247l8398j8448j1252J3001R818K5887L4427L9967L4259M6132L9749L7419
$$ -293247 -331645 -350093 -361345 -348344 -338526 -312639 -278212 -238245 -203986 -157854 -118105 -80686
99h0686K9094K9061J9759P383R00j068j7408k1957k2735k8327l3814l0652k6723
$$ -80686 -51592 -22531 -2772 4611 5511 4443 -12965 -34922 -57657 -85984 -119798 -150450 -177173
112a77173k4762k3498r826j154J536J5172K8604L2117M0452N1542N7498N7733
$$ -177173 -201935 -225433 -235259 -236413 -234877 -219705 -191101 -158984 -118532 -66990 -9492 48241
124D8241O0417O6075O0373N1880N3388M4564K9654K3575J4529K15j3352k2000
$$ 48241 108658 174733 235106 286986 340374 384938 414592 438167 452696 452911 439559 417559
136D17559l0041m6108n3283n3888o3941o9446o5254o4830o5247o0082n0816m3840
$$ 417559 387518 341410 288127 234239 170298 100852 35598 -29232 -94479 -154561 -205377 -249217
148b49217l9403k6546j3261j0384J328J4471J8766K4639L2323L7178L8118L6687
$$ -249217 -288620 -315166 -328427 -338811 -337483 -323012 -304246 -279607 -247284 -210106 -171988 -135301
160a35301M0460L8002K9456K9439K6242J6363J0791Q211K262n497q819q493j3949
$$ -135301 -94841 -56839 -27383 2056 28298 44661 55452 63663 65925 60428 51609 43116 29167
173B9167j7999j1937j2461j5351q995l708k362N25P570J3868J2781J7710K5435
$$ 29167 11168 -769 -13230 -28581 -37576 -41284 -43646 -43121 -35551 -21683 -8902 8808 34243
186C4243K2838K2516K7393K5335K0632J8837J7450J1851K541J184k757j4208j7264
$$ 34243 57081 79597 106990 132325 152957 171794 189244 201095 203636 204820 202063 187855 170591
199A70591j9124k7353l1863l2262l3254l5711l6655l1163k9616l0798k2084j6699
$$ 170591 151467 124114 92251 59989 26735 -8976 -45631 -76794 -106410 -137208 -159292 -175991
211a75991j5419q651j469L202N886J1701J8455J8623J9242K6210K5681K2108K5284
$$ -175991 -191410 -200061 -201530 -198328 -192442 -180741 -162286 -143663 -124421 -98211 -72530 -50422 -25138
224b5138K4640K0674J6986J7313J4600P661N677O187o93m976k841o202r719r540
$$ -25138 -498 20176 37162 54475 69075 76736 82413 88600 87907 82931 80090 73888 64169 54629
238E4629q326r523j1660p302n342q597n115m82k741j410K135L465K177J787O253
$$ 54629 46303 36780 25120 17818 12476 3879 -1236 -1718 -4459 -5869 -3734 -269 1908 3695 9948
253I948M515M09M680L913q85K87J065j708m126l384k514n877p024l284n362p967
$$ 9948 14463 14872 19552 23465 22580 22867 23932 22224 18098 14714 12200 6323 -701 -3985 -9347 -17314
269a7314m093l592m786l840j757l36k224K56L802J132J198N889M427L410M905
$$ -17314 -21407 -24999 -29785 -33625 -35382 -35718 -37942 -37686 -33884 -32752 -31554 -25665 -21238 -17828 -12923
284a2923O460N357K975O101O653J886L697O033J971J070K813J834n58j083P68
$$ -12923 -6463 -1106 1869 7970 14623 16509 20206 26239 28210 29280 32093 33927 33369 32286 33054
299C3054j416n614j550k581p329n456m504o677q518o714n614q164q372l595n824
$$ 33054 31638 26024 24474 21893 14564 9108 4604 -2073 -10591 -17305 -22919 -31083 -39455 -43050 -48874
314d8874o862k506r38k297Q3L333M640L807P309J0905Q476J0157J4222J2307J1557
$$ -48874 -55736 -58242 -59180 -61477 -61394 -58061 -53421 -49614 -42305 -31400 -22924 -12767 1455 13762 25319
329B5319J2759J2884J1143Q434R424P466K474J980J688m270n576o405q520j1667
$$ 25319 38078 50962 62105 70539 79963 87429 89903 91883 93571 89301 83725 77320 68800 57133
343E7133j3205j1036j3667j5987j1946j1686j3451j0019o889p125n292k304J447
$$ 57133 43928 32892 19225 3238 -8708 -20394 -33845 -43864 -50753 -57878 -63170 -65474 -64027
356f4027L13K658P403N882N270R100Q769O207O279O972M806J261J351J306m451
$$ -64027 -63714 -61056 -53653 -47771 -42501 -33401 -24632 -18425 -12146 -5174 -368 893 2244 3550 -901
371i01m550l226o907q518o939o335p060o711l219n69k255K928O790O336R952J3658
$$ -901 -5451 -8677 -15584 -24102 -31041 -37376 -44436 -51147 -54366 -54935 -57190 -54262 -47472 -41136 -31184 -17526
387a7526J4548J5177J7260J9785J7814J5882J7975J5380J0477R976P482K144k078
$$ -17526 -2978 12199 29459 49244 67058 82940 100915 116295 126772 136748 144230 146374 144296
400A44296m292p495j3385j6577j6668k1547k4865k2540k4041k5754k3983k0523
$$ 144296 140004 132509 119124 102547 85879 64332 39467 16927 -7114 -32868 -56851 -77374
412g7374j9207j8203j2888p575p659k364M188N302P882J2650J5306J5711J5811
$$ -77374 -96581 -114784 -127672 -135247 -142906 -145270 -141082 -135780 -127898 -115248 -99942 -84231 -68420
425f8420J9272J7656J4317J5912J4354R179P831O715K837j034k640l098o355q907
$$ -68420 -49148 -31492 -17175 -1263 13091 22270 30101 36816 39653 38619 35979 32881 26526 17619
439A7619o009p612r009n635m085l837j310K387M979N816Q742J3168J2585J3320
$$ 17619 11610 3998 -5011 -10646 -14731 -18568 -19878 -17491 -12512 -6696 2046 15214 27799 41119
453D1119J6710J5710J3667J3763J2963R458N328L445P00o274q888j0870j6729
$$ 41119 57829 73539 87206 100969 113932 123390 128718 132163 132863 126589 117701 106831 90102
466I0102k0212k1176k3651k6329k6583k4786k4265k5466j9458j6424j5593r875
$$ 90102 69890 48714 25063 -1266 -27849 -52635 -76900 -102366 -121824 -138248 -153841 -163716
478a63716m296j617K252P569J2391J4130J6251K1817K1867K1095K3523K3180J9777
$$ -163716 -168012 -169629 -167377 -159808 -147417 -133287 -117036 -95219 -73352 -52257 -28734 -5554 14223
491A4223J8924J7494J4362R662P371O001k54k855l123o852r775r545r893j0399
$$ 14223 33147 50641 65003 74665 82036 88037 87783 84928 81805 74953 65178 55633 45740 35341
505C5341j1216p883o426p185l043O83M55K759O381P883Q100Q501J0923R293O762
$$ 35341 24125 16242 9816 2631 -412 271 726 3485 9866 17749 25849 34350 45273 54566 61328
520F1328Q398O183J406M49j286n735r305j0849j2698j6986j8575j7318k0166k1937
$$ 61328 69726 75909 77315 77764 76478 70743 61438 50589 37891 20905 2330 -14988 -35154 -57091
534e7091j8065j7423j7343j4223j0225o899n678o4M972O038J0206J5413J6549
$$ -57091 -75156 -92579 -109922 -124145 -134370 -141269 -146947 -147011 -142039 -136001 -125795 -110382 -93833
547i3833J7874K1065K2503K1345K0783K0774J9838J5230J4266J2938P195L946
$$ -93833 -75959 -54894 -32391 -11046 9737 30511 50349 65579 79845 92783 99978 103924
559A03924L075j015n150p022p460j0388j3147j0945j1820j3074j0844r217q317
$$ 103924 106999 105984 100834 93812 86352 75964 62817 51872 40052 26978 16134 6917 -1400
572a400p360m304j407j633K39M353L590L500O356O333M517M393M766K775o0o62
$$ -1400 -8760 -13064 -14471 -16104 -15865 -11512 -7922 -4422 1934 8267 12784 17177 21943 24718 24658 23996
588B3996j118n630o706o253r600j1084j0624j0187j1653j1258q452p604p586m121
$$ 23996 22878 17248 10542 4289 -5311 -16395 -27019 -37206 -48859 -60117 -68569 -76173 -83759 -87880
602h7880p43m50K329O101P985Q708J1288J4100J3814J3282J6290J5238J2733J3381
$$ -87880 -88623 -89073 -86744 -80643 -72658 -63950 -52662 -38562 -24748 -11466 4824 20062 32795 46176
616D6176J2582R128P278O394L947R3j570j665n609q275p209r153j1239j0500r930
$$ 46176 58758 67886 75164 81558 85505 85598 84028 82363 76754 68479 61270 52117 40878 30378 20448
631B0448j0163j0535q358o351p498n011j783k447j115J436K437K258K859M931
$$ 20448 10285 -250 -8608 -14959 -22457 -27468 -29251 -31698 -32813 -31377 -28940 -26682 -23823 -18892
645a8892M286K659M313M507J171J640K114k02j557j542j250l380m516k045l713
$$ -18892 -14606 -11947 -7634 -3127 -1956 -316 1798 1596 39 -1503 -2753 -6133 -10649 -12694 -16407
660a6407m540k195k255k362j611J33J623N13K211M966L787L847O774N944N087
$$ -16407 -20947 -23142 -25397 -27759 -29370 -29237 -27614 -27101 -24890 -19924 -16137 -12290 -5516 428 5515
675E515N959O150N493L692M346M427R18J155J623j582k431j810k995m447n348
$$ 5515 11474 17624 23117 26809 31155 35582 36500 37655 39278 37696 35265 33455 30460 26013 20665
690B0665l662m929o418m609l806n707m283k143k974l163j282n0r20j79K041J265
$$ 20665 17003 12074 5656 1047 -2759 -8466 -12749 -14892 -17866 -21029 -22311 -22361 -23281 -23460 -21419 -20154
706b0154O53K717L203J719K562L374K836J667K475L481J209R34L071J160J58J014
$$ -20154 -19501 -16784 -13581 -11862 -9300 -5926 -3090 -1423 1052 4533 5742 6676 9747 10907 11065 12079
722A2079J072j8j026O2J16k340p11l48k403k158q69j602k947k098q83j947l185
$$ 12079 13151 13133 12107 12169 12285 9945 9234 8886 6483 4325 3456 1854 -1093 -3191 -4074 -6021 -9206
739i206p54r16k181q89Q5o27k95N57J501N27J118K713J784Q17K887K805J393J744
$$ -9206 -9960 -10876 -13057 -13946 -13861 -14488 -14783 -14226 -12725 -12198 -11080 -8367 -6583 -5766 -2879 -74 1319 3063
757C063K358J899K9J159J642n24r55P75j200j937q17n93j843j711p9j28j477q0
$$ 3063 5421 7320 7349 8508 10150 9626 8671 9446 8246 6309 5492 4899 3056 1345 1266 1138 -339 -419
775d19J465l4P75K460K064J826K032L230K205J338K935J778j28L12L77j900k662
$$ -419 1046 1012 1787 4247 6311 8137 10169 13399 15604 16942 19877 21655 21527 21839 22216 20316 17654
792A7654k694l213n307n868m695n864p868n391n680o271n338l584l012k996p09
$$ 17654 14960 11747 6440 572 -4123 -9987 -17855 -23246 -28926 -35197 -40535 -44119 -47131 -50127 -50836
807e0836J679P77K680N694M961N733P935Q387P540Q086R119Q260N843O857O632
$$ -50836 -49157 -48380 -45700 -40006 -35045 -29312 -21377 -12990 -5450 2636 11755 20015 25858 32715 39347
822C9347L185K573K583M20j680k187k433m438n906m249n469p272n166m575m952
$$ 39347 42532 45105 47688 48108 46428 44241 41808 37370 31464 27215 21746 14474 9308 4733 -219
837b19m152k863j912j946k14J764J167J187L736L061K395L091L081J809O63L11
$$ -219 -4371 -7234 -9146 -11092 -11306 -9542 -8375 -7188 -3452 -391 2004 5095 8176 9985 10648 10959
853A0959L14k514l112k620n288o278n435o271p160p012n757n479n839l361j191
$$ 10959 11273 8759 5647 3027 -2261 -8539 -13974 -20245 -27405 -34417 -40174 -45653 -51492 -54853 -56044
868e6044j968O16L389M103M792P599Q883R312R855J1770J1218R766J1113J0037
$$ -56044 -58012 -57396 -54007 -49904 -45112 -37513 -28630 -19318 -9463 2307 13525 23291 34404 44441
882D4441Q181O753O361L967J434k41m99m087n759n607p722r179q919q796r901
$$ 44441 52622 59375 65736 69703 71137 70896 70397 66310 60551 54944 47222 38043 29124 20328 10427
897A0427r471q358o551p593n459k920l134j511O82J499K084K940M514M270L211
$$ 10427 956 -7402 -13953 -21546 -27005 -29925 -33059 -34570 -33888 -32389 -30305 -27365 -22851 -18581 -15370
912a5370M692M645K191K580K087K6p69j495j719l662m931l626m200o031l879l268
$$ -15370 -10678 -6033 -3842 -1262 825 851 82 -1413 -3132 -6794 -11725 -15351 -19551 -25582 -29461 -32729
928c2729l975k223p36O88R01L005N696M876O453Q915Q581Q908R696R838Q993P856
$$ -32729 -36704 -38927 -39663 -38975 -38074 -35069 -29373 -24497 -18044 -9129 -548 8360 18056 27894 36887 44743
944D4743P938O989L611L368K520q08k468l053n032p395q228q261r765j1080r342
$$ 44743 52681 59670 63281 66649 69169 68361 65893 62840 57808 50413 42185 33924 24159 13079 3737
959C737r429j0002q150o881o935m985l362r01j003M5L204L187L306N708N510M902
$$ 3737 -5692 -15694 -23844 -30725 -37660 -42645 -46007 -46908 -47911 -47866 -44662 -41475 -38169 -32461 -26951 -22049
975b2049N782N116N215L611L465L387J081N25R25r09k451j324k165k883l283j728
$$ -22049 -16267 -11151 -5936 -2325 1140 4527 5608 6133 7058 6149 3698 2374 209 -2674 -5957 -7685
991g685k084k392q09Q67l19J179L008K977L425M323N753M663M548N781N164L439
$$ -7685 -9769 -12161 -12970 -12103 -12422 -11243 -8235 -5258 -1833 2490 8243 12906 17454 23235 28399 31838
1007C1838L693L581J229M04J28j229l076l971l718n342o983n511o598p301o399
$$ 31838 35531 39112 40341 40745 40873 39644 36568 32597 28879 23537 16554 11043 4445 -2856 -9255
1022i255n729n869n844m063k538l400j617N69L44P19L142L087L877L894N085N121
$$ -9255 -14984 -20853 -26697 -30760 -33298 -36698 -38315 -37746 -37402 -36683 -33541 -30454 -26577 -22683 -17598 -12477
1038a2477L836M573N327L027L127L615K224J153P25J120m37j337l87r72k801j253
$$ -12477 -8641 -4068 1259 4286 7413 11028 13252 14405 15130 16250 15813 14476 14089 13117 10316 9063
1054I063j032k331j993r28j345j249j200N94n09n28Q48M62r5J172J000N74K85
$$ 9063 8031 5700 3707 2779 1434 185 -1015 -421 -930 -1458 -610 -148 -243 929 1929 2503 2788
1071B788O42J039m03k00Q51o84r94l62n89j077j304l33j311j532o90Nj486p62
$$ 2788 3430 4469 4066 3866 4717 4033 3039 2677 2088 1011 -293 -626 -1937 -3469 -4159 -4154 -5640 -6402
1089f402K29l40k13Q6R52j18o5J741N75J50J334J400M97R92J439J262O17Q01J895
$$ -6402 -6173 -6513 -6726 -6640 -5688 -5806 -5871 -4130 -3555 -3405 -2071 -671 -174 818 2257 3519 4136 4937 6832
1108F832N18L41J320N02l00N34qm94q07q23p77k128k159p49k792k857k084k286
$$ 6832 7350 7691 9011 9513 9213 9747 9739 9245 8438 7615 6838 4710 2551 1802 -990 -3847 -5931 -8217
1126h217k933k677j824k240j984j015m64j345L88J472Q43J895K976L411L454L272
$$ -8217 -11150 -13827 -15651 -17891 -19875 -20890 -21354 -22699 -22311 -20839 -19996 -18101 -15125 -11714 -8260 -4988
1142d988M971M760L498M862M666L277L242L445J985J088M40O05j419k081j971
$$ -4988 -17 4743 8241 13103 17769 21046 24288 27733 29718 30806 31246 31851 30432 28351 26380
1157B6380l186m281l496m128m889m389l892l754m144k790j685k584j185P2J3L70
$$ 26380 23194 18913 15417 11289 6400 2011 -1881 -5635 -9779 -12569 -14254 -16838 -18023 -17951 -17938 -17568
1173a7568J760K328J680J537K789K715J254J356J862J03K9m08j263j915k697k028
$$ -17568 -15808 -13480 -11800 -10263 -7474 -4759 -3505 -2149 -287 -184 -155 -563 -1826 -3741 -6438 -8466
1189h466l037l767k685k469l252j584r66j63M5J625L414K838M338O019O032O163
$$ -8466 -11503 -15270 -17955 -20424 -23676 -25260 -26226 -26389 -26344 -24719 -21305 -18467 -14129 -8110 -2078 4085
1205D085P366P847O710O785O655O031L926L671L018J97r99j397l104n436o048
$$ 4085 11451 19298 26008 32793 39448 45479 49405 53076 56094 56291 55292 53895 50791 45355 39307
1220C9307o856q100r116q420q771r475p935p103p601n758m106k874j838m45J863
$$ 39307 32451 24351 15235 6815 -1956 -11431 -19366 -26469 -34070 -39828 -43934 -46808 -48646 -49091 -47228
1235d7228K061K967N149N272M815N892O294N319M501M669M077K218J816J269p84
$$ -47228 -45167 -42200 -37051 -31779 -26964 -21072 -14778 -9459 -4958 -289 3788 6006 7822 9091 8307
1250H307j048j396k345k964l206k497k913k772j601l91p20O89K613K872L734N079
$$ 8307 7259 5863 3518 554 -2652 -5149 -8062 -10834 -12435 -12826 -13546 -12857 -10244 -7372 -3638 1441
1266A441O364N968O332P443O856N754N727N281K799K334J075o82k703m143n104
$$ 1441 7805 13773 20105 27548 34404 40158 45885 51166 53965 56299 57374 56692 53989 49846 44742
1281D4742p089q635q493r736j0884j0309r915r699r191p727o426n541l784j204
$$ 44742 37653 29018 20525 10789 -95 -10404 -20319 -30018 -39209 -46936 -53362 -58903 -62687 -63891
1295f3891q08J274L484M726N396O638P925Q037P718Q590Q460O629O563O183M057
$$ -63891 -64699 -63425 -59941 -55215 -49819 -43181 -35256 -27219 -19501 -10911 -2451 4178 10741 16924 20981
1310B0981L047K462J160n14j556j626k688l970l151l208m116l091j861j885j262
$$ 20981 24028 26490 27650 27136 25580 23954 21266 17296 14145 10937 6821 3730 1869 -16 -1278
1325a278O6J627R40K067L580M001L535M607M679L570L078K846K753Nk78n38l315
$$ -1278 -1212 415 1355 3422 7002 11003 14538 19145 23824 27394 30472 33318 36071 36076 35798 35260 31945
1342C1945m019m444n926p344p492p656q200q851p164o947p138n404l809k906j694
$$ 31945 27926 23482 17556 10212 2720 -4936 -13136 -21987 -29151 -36098 -43236 -48640 -52449 -55355 -57049
1357e7049L90J322K764L752O024O424O517Q156Q319P569P518Q234O690N667N031
$$ -57049 -56659 -55337 -52573 -48821 -42797 -36373 -29856 -21700 -13381 -5812 1706 9940 16630 22297 27328
1372B7328M357K837J259J273p79j800k188k967l729m114m022l975m467l685k638
$$ 27328 31685 34522 35781 37054 36275 34475 32287 29320 25591 21477 17455 13480 9013 5328 2690
1387B690l135k168r02k66n68N82J866J012J645K170K538R40K038J513O56j74k33
$$ 2690 -445 -2613 -3515 -3781 -4349 -3767 -1901 -889 756 2926 5464 6404 8442 9955 10611 10437 10204
1404A0204p52j798k268k416l642m105l095l918m275l280k997l070k562j205l66
$$ 10204 9452 7654 5386 2970 -672 -4777 -7872 -11790 -16065 -19345 -22342 -25412 -27974 -29179 -29545
1419b9545m31Q11K105K228K257M394M200M229M651M998M784M115M523M091K949
$$ -29545 -29976 -29165 -27060 -24832 -22575 -18181 -13981 -9752 -5101 -103 4681 8796 13319 17410 20359
1434B0359K174K360R24L33j77n20j408k531k038k807l645k953k723l564k983k664
$$ 20359 22533 24893 25817 26150 25973 25453 24045 21514 19476 16669 13024 10071 7348 3784 801 -1863
1450a863k391k454j794q75j113j062M00J24k42J098J214J058P91J409J707O52
$$ -1863 -4254 -6708 -8502 -9377 -10490 -11552 -11152 -11028 -11270 -10172 -8958 -7900 -7109 -5700 -3993 -3341
1466c341R38J635N67J69J375J63K37J90K15J18n24O9J63o97J44M4m65k33pj21
$$ -3341 -2403 -768 -201 -32 1343 1506 1743 1933 2148 2266 1742 1811 1974 1277 1421 1465 1000 767 760 639
1486F39l72l20M75k6n32O5L26p35J58L35J08k99J03M10k48j9O48o3q1j61J54m
$$ 639 267 -53 422 396 -136 -71 255 -480 -322 13 121 -178 -75 335 87 68 716 653 572 411 565 561
1508E61m63P9n19n90o55P7r88r98n50n67j329n68k59m02q08p6J028m33Q96J517
$$ 561 98 177 -342 -932 -1587 -1510 -2498 -3496 -4046 -4613 -5942 -6510 -6769 -7171 -7979 -8055 -7027 -7460 -6564 -5047
1528e047J182J460J921K392K408J795L141K470K048K369K207J113J015P77K10
$$ -5047 -3865 -2405 -484 1908 4316 6111 9252 11722 13770 16139 18346 19459 20474 21251 21461
1543B1461q16p38j436k512l254k399l703m514l322l957m222m183l033l277l213
$$ 21461 20645 19907 18471 15959 12705 10306 6603 2089 -1233 -5190 -9412 -13595 -16628 -19905 -23118
1558b3118k174r40r84m36J144J103J723K343L493L528L075L877M055L345L371
$$ -23118 -25292 -26232 -27216 -27652 -26508 -25405 -23682 -21339 -17846 -14318 -11243 -7366 -3311 34 3405
1573C405L277K625K002J627J036n7l1o72j194j613j380j733k644j751j246j111
$$ 3405 6682 9307 11309 12936 13972 13915 13884 13212 12018 10405 9025 7292 4648 2897 1651 540
1589E40j228l11P16J22J027J945K102J665L029K882K502K357K509J633R99N87
$$ 540 -688 -999 -283 -161 866 2811 4913 6578 9607 12489 14991 17348 19857 21490 22489 23076
1605B3076J19j314k324k171l491m452n104n063n934n995n494n694n564m559l481
$$ 23076 23195 21881 19557 17386 13895 9443 4339 -724 -6658 -12653 -18147 -23841 -29405 -33964 -37445
1620c7445l484k361n50M36P97K654L710M350M886O116O629O419O731O696O196
$$ -37445 -40929 -43290 -43840 -43404 -42607 -39953 -36243 -31893 -27007 -20891 -14262 -7843 -1112 5584 11780
1635A1780N396N166M617L105K429J580K16j157j397k247l283l426l666m155m531
$$ 11780 17176 22342 26959 30064 32493 34073 34289 33132 31735 29488 26205 22779 19113 14958 10427
1650A0427l504l145l404k451j126j475l53N91R96J638J598K795K498J675K430
$$ 10427 6923 3778 374 -2077 -3203 -4678 -5031 -4440 -3444 -1806 -208 2587 5085 6760 9190
1665I190K327Q35P22J12r74k005k146l158m356m694m403n183n760n315m734m758
$$ 9190 11517 12352 13074 13186 12212 10207 8061 4903 547 -4147 -8550 -13733 -19493 -24808 -29542 -34300
1681c4300l771k608j738j102M1K262K404L557N536N630O264P284P710P717P022
$$ -34300 -38071 -40679 -42417 -43519 -43478 -41216 -38812 -35255 -29719 -24089 -17825 -10541 -2831 4886 11908
1696A1908P516O615N835M711M445K702J002Q23r18k132l207l833m304n645n767
$$ 11908 19424 26039 31874 36585 41030 43732 44734 45557 44639 42507 39300 35467 31163 25518 19751
1711A9751n141o147n559m425m815l749k830j930j093j048J116Q77J291K790K370
$$ 19751 14610 8463 2904 -1521 -6336 -10085 -12915 -14845 -15938 -16986 -15870 -14993 -13702 -10912 -8542
1726h542K390K219K415K283J190P07O11o25j390j393k828k795l229l593l736l729
$$ -8542 -6152 -3933 -1518 765 1955 2662 3273 2648 1258 -135 -2963 -5758 -8987 -12580 -16316 -20045
1742b0045l171k682k570j830j86q5Q22K195L555L722M540N916N757O012O834O344
$$ -20045 -23216 -25898 -28468 -30298 -30484 -30569 -29747 -27552 -23997 -20275 -15735 -9819 -4062 1950 8784 15128
1758A5128N635N847N448M341K933K453J445k42j036j676l260m338m527n065n649
$$ 15128 20763 26610 32058 36399 39332 41785 43230 42988 41952 40276 37016 32678 28151 23086 17437
1773A7437o082n809n834n412n145l884l805k949j582j349o00Q06J257J850K360
$$ 17437 11355 5546 -288 -5700 -10845 -14729 -18534 -21483 -23065 -24414 -25014 -24208 -22951 -21101 -18741
1788a8741K554L187K311K848L091J947J494J574J028J3p31j63j418j749j500j918
$$ -18741 -16187 -13000 -10689 -7841 -4750 -2803 -1309 265 1293 1306 575 412 -1006 -2755 -4255 -6173
1804f173k453j686j587j254p81m41O27N69J587K542K392K751L957M104L604M285
$$ -6173 -8626 -10312 -11899 -13153 -13934 -14375 -13748 -13179 -11592 -9050 -6658 -3907 50 4154 7758 12043
1820A2043L823M041K682L142K498J118N93L98r28j707k430k659l619m351m182
$$ 12043 15866 19907 22589 25731 28229 29347 29940 30338 29410 27703 25273 22614 18995 14644 10462
1835A0462m656m639m509l856m350l673k766k458k027p93j1j88P59J533K262J960
$$ 10462 5806 1167 -3342 -7198 -11548 -15221 -17987 -20445 -22472 -23265 -23276 -23464 -22705 -21172 -18910 -16950
1851a6950K576L021K527K671K766K453J962J298J674R06K84J95n8r93p63o30j031
$$ -16950 -14374 -11353 -8826 -6155 -3389 -936 1026 2324 3998 4904 5188 5383 5325 4332 3569 2939 1908
1868A908j110p20j126q29q36L17k13k3J118J253R12J383J601J745J428J872J752
$$ 1908 798 78 -1048 -1877 -2713 -2396 -2609 -2632 -1514 -261 651 2034 3635 5380 6808 8680 10432
1885A0432J024R60M70N36j97l09n79j214j743j313j882k538k372j913k393k251
$$ 10432 11456 12416 12886 13422 13225 12916 12337 11123 9380 8067 6185 3647 1275 -638 -3031 -5282
1901e282k353j630j784j431o21p33j85O92L64P04J156J734J139J448J943J943
$$ -5282 -7635 -9265 -11049 -12480 -13101 -13834 -14019 -13327 -12963 -12259 -11103 -9369 -8230 -6782 -4839 -2896
1917b896J303J728J627J017J238Q36P89O17j9K92k59n09m19j75p40r51l19p94
$$ -2896 -1593 135 1762 2779 4017 4853 5642 6259 6240 6532 6273 5764 5345 5170 4430 3479 3160 2366
1935B366p82o37k02p28o85J81m38m81Q7L77m80J14K77K43k24J68N57l95j94N92
$$ 2366 1584 947 745 17 -668 -487 -925 -1406 -1319 -942 -1422 -1308 -1031 -788 -1012 -844 -287 -682 -876 -284
1955b84J84k16J76K27o3l28N06L28k41k79O45j64o8K55K89k73M5N98m40m99J50
$$ -284 -100 -316 -140 87 24 -304 202 530 289 10 655 491 423 678 967 694 739 1337 897 398 548
1976E48M6k62j11K96k64l93p0P92n54m4O90j69j37L72L30J29k1J91O8j30K09K6
$$ 548 594 332 221 517 253 -140 -210 582 28 -16 674 505 368 740 1070 1199 1178 1369 1437 1307 1516 1542
1998A542q32o35R0p17r96q13n91r80j192n21q34r26m39Q8j28k39N68N06N86J344
$$ 1542 710 75 165 -552 -1548 -2361 -2952 -3932 -5124 -5645 -6479 -7405 -7844 -7756 -7884 -8123 -7555 -7049 -6463 -5119
2018e119J311J785J081K170J956J336J903K021J618J385J014J081K43j63J98o12
$$ -5119 -3808 -2023 -942 1228 3184 4520 6423 8444 10062 11447 12461 13542 13785 13622 13820 13208
2034A3208j448n57j719j931j686k174k079k119j930j938j707j530q20j020p01
$$ 13208 11760 11203 9484 7553 5867 3693 1614 -505 -2435 -4373 -6080 -7610 -8430 -9450 -10151
2049a0151k16L05K79N50J110J072J051J321J310J092O93J382P8K94J80j3n50o94
$$ -10151 -10367 -10062 -9783 -9233 -8123 -7051 -6000 -4679 -3369 -2277 -1584 -202 -124 170 350 337 -213 -907
2067i07n26q67j433q27o76j187o00j49j30k92N60J009J277J382J995K242K233
$$ -907 -1433 -2300 -3733 -4560 -5236 -6423 -7023 -7172 -7302 -7594 -7034 -6025 -4748 -3366 -1371 871 3104
2084C104K424K829K497K269K489J831J395R61J190l18n23q76j495k377k591k507
$$ 3104 5528 8357 10854 13123 15612 17443 18838 19799 20989 20671 20148 19272 17777 15400 12809 10302
2100A0302l285l644l274l252l521l258k730k616k081j704n96o57k2R70J108J397
$$ 10302 7017 3373 99 -3153 -6674 -9932 -12662 -15278 -17359 -19063 -19659 -20316 -20338 -19368 -18260 -16863
2116a6863K135K225J831K741K620K272K166J970J799J045Q70P72J13l74o77n39
$$ -16863 -14728 -12503 -10672 -7931 -5311 -3039 -873 1097 2896 3941 4811 5583 5696 5322 4645 4106
2132D106j152j371r68r26j297o96k41n48J18Q74R48J048J347K288K161J809K768
$$ 4106 2954 1583 615 -311 -1608 -2304 -2545 -3093 -2975 -2101 -1153 -105 1242 3530 5691 7500 10268
2149A0268K402J532J952J651Q47M66K34k67j121k058j735l172l084l086l618l754
$$ 10268 12670 14202 16154 17805 18652 19118 19352 19085 17964 15906 14171 10999 7915 4829 1211 -2543
2165b543l942l564l681l156k940j883j586j580KK18Q36J614J950K487K626L275
$$ -2543 -6485 -10049 -13730 -16886 -19826 -21709 -23295 -24875 -24873 -24655 -23819 -22205 -20255 -17768 -15142 -11867
2181a1867L118L189L283L303K870K306K507J730R21O85N63n8j214o81j097j563
$$ -11867 -8749 -5560 -2277 1026 3896 6202 8709 10439 11360 12045 12608 12550 11336 10655 9558 7995
2197G995j464j302j554j320r44p26p48k59L39L24N46J298J412J026J705J232J356
$$ 7995 6531 5229 3675 2355 1411 685 -63 -322 17 341 887 2185 3597 4623 6328 7560 8916
2214H916J176P89J015l10p4o19r90j571j825k147k667k671l123k424l424k608
$$ 8916 10092 10881 11896 11586 11512 10893 9903 8332 6507 4360 1693 -978 -4101 -6525 -9949 -12557
2230a2557k376k311j854j164p27p89P21R79J620J169K700K575K574L145L370K883
$$ -12557 -14933 -17244 -19098 -20262 -20989 -21778 -21057 -20078 -18458 -17289 -14589 -12014 -9440 -6295 -2925 -42
2246d2K881K894K626K129J837J318R76L50J84l72j029j164j073j768k024j433
$$ -42 2839 5733 8359 10488 12325 13643 14619 14969 15153 14781 13752 12588 11515 9747 7723 6290
2262F290j600j818j655p53j441n91m08j54Q7j23Q58N23O82P03J212K25M71P91
$$ 6290 4690 2872 1217 464 -977 -1568 -1976 -2130 -2043 -2166 -1308 -785 -103 600 1812 2037 2508 3299
2280C299K38j78j55k33q72j168p68j286j745j375j254j647j314j023p77j026m09
$$ 3299 3537 3359 3204 2971 2099 931 163 -1123 -2868 -4243 -5497 -7144 -8458 -9481 -10258 -11284 -11693
2297a1693J24J53K69Q65J119J260J699J869J650J703K247K273J301J398J947J018
$$ -11693 -11569 -11416 -11147 -10282 -9163 -7903 -6204 -4335 -2685 -982 1265 3538 4839 6237 8184 9202
2313I202M29Q19N35J51m64n88p43r67j204j397j290j202j150j285j081j351o85
$$ 9202 9631 10450 10985 11136 10672 10084 9341 8374 7170 5773 4483 3281 2131 846 -235 -1586 -2271
2330b271p59m97l47j84l82L99J42J27M78N76O09K89K16P27K31L03N22L26o10J82
$$ -2271 -3030 -3527 -3874 -4058 -4440 -4041 -3899 -3772 -3294 -2718 -2109 -1820 -1604 -877 -646 -343 179 505 -105 77
2350G7j14q5l36j77k7l05k43j21j75j80K32J68J7M0M48K06Q0K92O48j4L82M56
$$ 77 -37 -122 -458 -635 -662 -967 -1210 -1331 -1506 -1686 -1454 -1286 -1269 -1229 -781 -575 -495 -203 445 431 813 1269
2372A269J06K6L32K64Q2j07P9Q5l92l34k8j32k06n4l39p29j5p6m58l95K3j75l17
$$ 1269 1375 1401 1733 1997 2079 1972 2051 2136 1744 1410 1382 1250 1044 990 651 -78 -93 -169 -627 -1022 -999 -1174 -1491
2395a491k50J28k38k79%M86l82O0K88J8M75L53K37K59L40O73M22M13P45N67J83
$$ -1491 -1741 -1613 -1851 -2130 -2130 -1644 -2026 -1966 -1678 -1660 -1185 -832 -595 -336 4 677 1099 1512 2257 2824 3007
2416C007O25O62p6Q5N60o5k35p62N8n89r73l72q78j148q84r44q72r25r88l06q23
$$ 3007 3632 4294 4218 4303 4863 4798 4563 3801 3859 3270 2297 1925 1047 -101 -985 -1929 -2801 -3726 -4714 -5020 -5843
2437e843o84j71j49j68O32J95N02L83R49J241N67R06J331P08R90J012P76K91O30
$$ -5843 -6527 -6698 -6847 -7015 -6383 -6188 -5686 -5303 -4354 -3113 -2546 -1640 -309 399 1389 2401 3177 3468 4098
2456D098K78Kp8M7k96l39m47o49m23n66o86k92k39l71r6j41M54n3O74N26M38M94
$$ 4098 4376 4378 4300 4347 4051 3712 3265 2616 2193 1627 941 649 410 39 -57 -198 256 203 877 1403 1841 2335
2478B335P41K96M54O30j59L06l6j11p17l32q20j270j058j021j288j838j034j318
$$ 2335 3076 3372 3826 4456 4297 4603 4567 4456 3739 3407 2587 1317 259 -762 -2050 -3888 -4922 -6240
2496f240j620p60r33q36m91J2O3N24N46Q15J482J221J420J716J733J443K039J715
$$ -6240 -7860 -8620 -9553 -10389 -10880 -10868 -10805 -10281 -9735 -8920 -7438 -6217 -4797 -3081 -1348 95 2134 3849
2514C849J646J101J409Q13N68M62J35l46l02o22p51j173j216p98j446j050q68
$$ 3849 5495 6596 8005 8818 9386 9848 9983 9637 9335 8713 7962 6789 5573 4775 3329 2279 1411
2531A411j235j070m34n91l55m5j2j37N42L42P09P9Q12O26K73N1L75K60k67l74
$$ 1411 176 -894 -1328 -1919 -2274 -2319 -2331 -2468 -1926 -1584 -875 -796 16 642 915 966 1341 1601 1334 960
2551I60m17p16j151q19r93j028q82r55q31q90n90j06l63J13M58M43R50R55J366
$$ 960 543 -173 -1324 -2143 -3136 -4164 -5046 -6001 -6832 -7722 -8312 -8418 -8781 -8668 -8210 -7767 -6817 -5862 -4496
2570d496J348J361J733J599J775J626J395J160J324R65N02M08J50l82l03j031
$$ -4496 -3148 -1787 -54 1545 3320 4946 6341 7501 8825 9790 10292 10700 10850 10468 10165 9134
2586I134l79j407j181j442j015j591j593j193j383r19q31n15p55m53nJ17R8M38
$$ 9134 8755 7348 6167 4725 3710 2119 526 -667 -2050 -2969 -3800 -4315 -5070 -5523 -5528 -5411 -5313 -4875
2604d875K34R46K82O67O85K22O61M42M47o9L82o0o2l11k51l72p02l33R3p80k53
$$ -4875 -4641 -3695 -3413 -2746 -2061 -1839 -1178 -736 -289 -358 24 -36 -98 -409 -660 -1032 -1734 -2067 -1974 -2754 -3007
2625c007J02r2j35K54J00N80O69N30Q38O96R95Q87N06J051P79Q39L71J18L27j22
$$ -3007 -2905 -2997 -3132 -2878 -2778 -2198 -1529 -999 -161 535 1530 2417 2923 3974 4753 5592 5963 6081 6408 6286
2645F286j45k84j38p30o47n02j220q46j061p84j333p96p35m57q77l22m42j31j09
$$ 6286 6141 5857 5719 4989 4342 3840 2620 1774 713 -71 -1404 -2200 -2935 -3392 -4269 -4591 -5033 -5164 -5273
2664e273L9L97J23M80L59P73M67Q76K18P26O20N75M87M14L81M90j98M35J68l34
$$ -5273 -5234 -4837 -4714 -4234 -3875 -3102 -2635 -1759 -1541 -815 -195 380 867 1281 1662 2152 1954 2389 2557 2223
2684B223K20j38J61l59n40J20l61o28J12l71k50j18l33l29k24K32Q5l32LK50j00
$$ 2223 2443 2305 2466 2107 1567 1687 1326 698 810 439 189 71 -262 -591 -815 -583 -498 -830 -827 -577 -677
2705f77K3J88P9O8N1L57k52N2K44P2k63k1J81l09j81j78J04n7k13R8l95q9p9K01
$$ -677 -654 -466 -387 -319 -268 89 -163 -111 133 205 -58 -79 102 -207 -388 -566 -462 -519 -732 -634 -1029 -1118 -1197 -996
2729i96k66N4J79L3J65P9K10N28J99R28J46k3O49M46N68K9L91K7L54l16K15n84
$$ -996 -1262 -1208 -1029 -996 -831 -752 -542 -14 185 1113 1259 1236 1885 2331 2899 2928 3319 3346 3700 3384 3599 3015
2751C015q9n15o02m56o77l29j118p66p33m84j223l57m28l52m10j85J75l8R2N50
$$ 3015 2926 2411 1809 1353 676 347 -771 -1537 -2270 -2754 -3977 -4334 -4762 -5114 -5524 -5709 -5534 -5572 -5480 -4930
2771d930N61O08P98R02Q69J032Q54P62P61J042M52N96L86K13M71n30K19m91o53
$$ -4930 -4369 -3761 -2963 -2061 -1192 -160 694 1456 2217 3259 3711 4307 4693 4906 5377 4847 5066 4575 3922
2790C922m05m19m93n74q21j86q78k68j75m36l86K0K77lK22P5M82L41M13N14O0
$$ 3922 3517 3098 2605 2031 1210 1024 146 -122 -297 -733 -1119 -1099 -822 -825 -603 -528 -46 295 708 1222 1282
2811A282K2K85O5k94k80k60m87j024k41r42q15q94n93p18r97k63l99l97l9M18
$$ 1282 1304 1589 1654 1360 1080 820 333 -691 -932 -1874 -2689 -3583 -4176 -4894 -5891 -6154 -6553 -6950 -6989 -6571
2831f571L37J18R24R72R61J027J548J140J450J182J254J118J204Q92L82N40M04
$$ -6571 -6234 -6116 -5192 -4220 -3259 -2232 -684 456 1906 3088 4342 5460 6664 7556 7938 8478 8882
2848H882K00l42q19l44p87j031j047j336j016j352r26j275j074j082o11K2n85
$$ 8882 9082 8740 7921 7577 6790 5759 4712 3376 2360 1008 82 -1193 -2267 -3349 -3960 -3938 -4523
2865d523J4R8k98L45P16M56L52P37O19N20K68N44RJ49J16k78l21k19q8o32r60
$$ -4523 -4509 -4411 -4709 -4364 -3648 -3192 -2840 -2103 -1484 -964 -696 -152 -143 6 122 -156 -477 -696 -784 -1416 -2376
2886b376m66k60p18o64pq6j60L11L49M48M96J064J115P43J430J218J141J302J100
$$ -2376 -2842 -3102 -3820 -4484 -4491 -4577 -4737 -4426 -4077 -3629 -3133 -2069 -954 -211 1219 2437 3578 4880 5980
2905E980R16P68N97O07K45k11J75q78o45r95j066j246j441r53j630j361j351r98
$$ 5980 6896 7664 8261 8868 9113 8902 9077 8199 7554 6559 5493 4247 2806 1853 223 -1138 -2489 -3487
2923c487q27j265n33l32o90R7J02K37M18N77R54M32P71J064N71Q15N34Q35M48
$$ -3487 -4314 -5579 -6112 -6444 -7134 -7037 -6935 -6698 -6280 -5703 -4749 -4317 -3546 -2482 -1911 -1096 -562 273 721
2942G21K02N76k17j35m7k48m63r8l98m41n52j27k17PJ11K38K66n2J047R4P41P33
$$ 721 923 1499 1282 1147 1100 852 389 291 -107 -548 -1100 -1227 -1444 -1437 -1326 -1088 -822 -874 173 267 1008 1741
2964A741P28Q20N33P83Q03q0K73K71j6m1l55n58n09n51j187p04j096j164q20j241
$$ 1741 2469 3289 3822 4605 5408 5328 5601 5872 5856 5815 5460 4902 4393 3842 2655 1951 855 -309 -1129 -2370
2984b370j014p49m60p92p30j02j50l88O73N01M49J89Q52J015O29P70R29O00N52
$$ -2370 -3384 -4133 -4593 -5385 -6115 -6217 -6367 -6755 -6082 -5581 -5132 -4943 -4091 -3076 -2447 -1677 -748 -148 404
3003D04J000P02J13L42M40M8k45J16k51k33k35m07m83j00n17k63k74k67K24j62
$$ 404 1404 2106 2219 2561 3001 3049 2804 2920 2669 2436 2201 1794 1311 1211 694 431 157 -110 114 -48
3023d8j16K59J40K02K73K83K1M65L1M62L9l10L90k07Om88K3p76Q9p58n07m82m94
$$ -48 -164 95 235 437 710 993 1014 1479 1510 1972 2011 1701 2091 1884 1890 1402 1425 649 738 -20 -527 -1009 -1503
3046a503o14m76k36k26k74m73J25J16N7J91M08J78K47M65P43L23P81N93K24O26
$$ -1503 -2117 -2593 -2829 -3055 -3329 -3802 -3677 -3561 -3504 -3313 -2905 -2727 -2480 -2015 -1272 -949 -168 425 649 1275
3066A275M44L95J74J25K60Q5K1o8L7k26j94j10l33l41n15n62m08j23l14N6o31
$$ 1275 1719 2114 2288 2413 2673 2758 2779 2711 2748 2522 2328 2218 1885 1544 1029 467 59 -64 -378 -322 -953
3087i53j16q1k2q4k91K47o6M3R0L46j43M12J67j08M34o9M53j35N7J74mp8J31N1
$$ -953 -1069 -1150 -1172 -1256 -1547 -1300 -1366 -1323 -1233 -887 -1030 -618 -451 -559 -125 -194 259 124 181 355 351 273 404 455
3111D55j32j19K04k97j85L07j39q8j31j25J11k31L50j24K1j86K38N6J68L14J28
$$ 455 323 204 408 111 -74 233 94 6 -125 -250 -139 -370 -20 -144 -123 -309 -71 -15 153 467 595
3132E95Q3J35J53P4R4l14l2J85j47q9j79k90j34j85l99j45k80m77ml32k47l1N1
$$ 595 678 813 966 1040 1134 820 788 973 826 737 558 268 134 -51 -450 -595 -875 -1352 -1356 -1688 -1935 -1966 -1915
3155a915k08k83J40r5K24L45L55L61K77K39Q51O65J77L29O69K32N42J24J59K85
$$ -1915 -2123 -2406 -2266 -2361 -2137 -1792 -1437 -1076 -799 -560 291 956 1133 1462 2131 2363 2905 3029 3188 3473
3175C473m5J00l57l48j47l02p35j40o72n92m91m75k84m16n48p9l81j73j47K02
$$ 3473 3428 3528 3171 2823 2676 2374 1639 1499 827 235 -256 -731 -1015 -1431 -1979 -2058 -2439 -2612 -2759 -2557
3195b557J75K9L24J41J39O30L09J47K73K20N12m34N00p4q2k58J60l39k35k92j31
$$ -2557 -2382 -2353 -2029 -1888 -1749 -1119 -810 -663 -390 -170 342 -92 408 334 252 -6 154 -185 -420 -712 -843
3216h43l30l73n2J32k07K42L9R0M32N40M93N38O65K56Q34J77N82P12L04J44N08
$$ -843 -1173 -1546 -1598 -1466 -1673 -1431 -1392 -1302 -870 -330 163 701 1366 1622 2456 2633 3215 3927 4231 4375 4883
3237D883o1No0n51m50p19l55n32r69q05j158j078n25p14q58k97n38k54m96k13
$$ 4883 4822 4827 4767 4216 3766 3047 2692 2160 1191 386 -772 -1850 -2375 -3089 -3947 -4244 -4782 -5036 -5532 -5745
3257e745O14R4K67N68N63M80Q20Q02Q84M24N14N38N72M26R7L59l4j93M8k55m56
$$ -5745 -5131 -5037 -4770 -4202 -3639 -3159 -2339 -1537 -653 -229 285 823 1395 1821 1918 2277 2243 2050 2098 1843 1387
3278A387r0k80n04k72on74j23N8K61P9r3O79L46K51J084N8O54L53N55K90M67j47
$$ 1387 1297 1017 513 241 235 -339 -462 -404 -143 -64 -157 522 868 1119 2203 2261 2915 3268 3823 4113 4580 4433
3300D433J69j5o49k94p28p30p41j000o91r25j269j129o58r12r45k85o76J26j95
$$ 4433 4602 4587 3938 3644 2916 2186 1445 445 -246 -1171 -2440 -3569 -4227 -5139 -6084 -6369 -7045 -6919 -7114
3319g114K24K8P72N42O31J070J076Q83R84P01Q98R47J034O53N59K91L57M25p39
$$ -7114 -6890 -6862 -6090 -5548 -4917 -3847 -2771 -1888 -904 -203 695 1642 2676 3329 3888 4179 4536 4961 4222
3338D222J25n33k56n59l63m32o58m12k81n07m37K7k25M5J32P4L14M17M77K44L38
$$ 4222 4347 3814 3558 2999 2636 2204 1546 1134 853 346 -91 -64 -289 -244 -112 -38 276 693 1170 1414 1752
3359A752L74M63M44l18J22l40j81m25m40o77o79o90r91r48q27o30r14n36n48m52
$$ 1752 2126 2589 3033 2715 2837 2497 2316 1891 1451 774 95 -595 -1586 -2534 -3361 -3991 -4905 -5441 -5989 -6441
3379f441k85L3J88P3N03P46P57R97Q45J188J049J049J157J049P62L80J197L05
$$ -6441 -6726 -6693 -6505 -6432 -5929 -5183 -4426 -3429 -2584 -1396 -347 702 1859 2908 3670 4050 5247 5552
3397E552J54N5P1q9l55l94l37q27n84p80q63m69n36o34p10l16k07n2k88oL80j17
$$ 5552 5706 5761 5832 5743 5388 4994 4657 3830 3246 2466 1603 1134 598 -36 -746 -1062 -1269 -1321 -1609 -1615 -1235 -1352
3419a352P07P9J1O22N8M90L8j2K05k91P3m78k60n69n27m61p20m21l56n25n12l71
$$ -1352 -645 -566 -555 67 125 615 653 641 846 555 628 150 -110 -679 -1206 -1667 -2387 -2808 -3164 -3689 -4201 -4572
3441d572L0p1o1L94L87L43M55Q15Q84Q60O02R97O87R24Q53O55L27N17M76j70m2
$$ -4572 -4542 -4613 -4674 -4280 -3893 -3550 -3095 -2280 -1396 -536 66 1063 1750 2674 3527 4182 4509 5026 5502 5332 5290
3462E290q1j51m90l91p47m83p40m84j105n37o11m30q65ol54l46j74J45R8O1J50
$$ 5290 5209 5058 4568 4177 3430 2947 2207 1723 618 81 -530 -960 -1825 -1831 -2185 -2531 -2705 -2560 -2462 -2401 -2251
3483b251L32K50K29L28O10J38J02J59L14j64j03M5l35J99l43j66k28l21l35K5
$$ -2251 -1919 -1669 -1440 -1112 -502 -364 -262 -103 211 47 -56 -11 -346 -147 -490 -656 -884 -1205 -1540 -1515
3503a515j80Q0l37N6M63m9L02J90K40Q50j40P95M98L16M23M21K55K29j93M57j28
$$ -1515 -1695 -1615 -1952 -1896 -1433 -1482 -1180 -990 -750 100 -40 755 1253 1569 1992 2413 2668 2897 2704 3161 3033
3524C033N7k7l55l15n18l84l08o43l15m86l53l81k00k68j63m79j47j38L09J19
$$ 3033 3090 3063 2708 2393 1875 1491 1183 540 225 -261 -614 -995 -1195 -1463 -1626 -2105 -2252 -2390 -2081 -1962
3544a962J20j29K37J75K32M14O2O17j21L19M8N65j18L7K09L3j53J69k03J16o5
$$ -1962 -1842 -1971 -1734 -1559 -1327 -913 -851 -234 -355 -36 12 577 459 496 705 738 585 754 551 667 602
3565F02K37o09L90k81l2R2m20m7L4k7Pj28J32q8J61K4P4l2J2n3K7j38j5M39k84
$$ 602 839 230 620 339 307 399 -21 -68 -34 -61 -54 -182 -50 -138 23 47 121 89 101 48 75 -63 -78 361 77
3590G7K26l11K97k29j03O9L9J06j76l18L28L6m52K35n8k93L3J89k8j32K62l73
$$ 77 303 -8 289 60 -43 26 65 171 -5 -323 5 41 -411 -176 -234 -527 -494 -305 -333 -465 -203 -576
3612e76L39j0n2M39o9OL17L07n1J80qK64r5K92J19m04L2P5j52o9k78p9n8o56j85
$$ -576 -237 -247 -299 140 71 77 394 701 650 830 822 1086 991 1283 1402 998 1030 1105 953 884 606 527 469 -187 -372
3637c72j36k95m73l66N2l40j99l64K63oJ82r5K88K90j3L34L08O10J86N74O3N27
$$ -372 -508 -803 -1276 -1642 -1590 -1930 -2129 -2493 -2230 -2236 -2054 -2149 -1861 -1571 -1584 -1250 -942 -332 -146 428 491 1018
3659A018K48N89J12nJ81J76k56qo9k91o3r2k51l46l32m34l43j02k31o0k50M55
$$ 1018 1266 1855 1967 1962 2143 2319 2063 2055 1986 1695 1632 1540 1289 943 611 177 -166 -268 -499 -559 -809 -354
3681c54j59J41k12J05L27P6K77q4R0L85N9J51Q7k23l38Nk44m16K7o97j48k92l08
$$ -354 -513 -372 -584 -479 -152 -76 201 117 207 592 651 802 889 666 328 333 89 -327 -300 -997 -1145 -1437 -1745
3704a745n45k08j62j57P8k3j29L86K54J34L05P08M67P04N93M30L56P08M93P14
$$ -1745 -2290 -2498 -2660 -2817 -2739 -2762 -2891 -2505 -2251 -2117 -1812 -1104 -637 67 660 1090 1446 2154 2647 3361
3724C361K38K1L15k88l2k88J00j22q14m59m27n52n60l67p22j43n56j92m03j31
$$ 3361 3599 3620 3935 3647 3615 3327 3427 3305 2491 2032 1605 1053 493 126 -596 -739 -1295 -1487 -1890 -2021
3744b021m0J76j27n7K97K67K24K79K52J78L05K41Pk7K30k95K4n5k87J3k06n75
$$ -2021 -2061 -1885 -2012 -2069 -1772 -1505 -1281 -1002 -750 -572 -267 -26 -19 -46 184 -111 -87 -142 -429 -416 -622 -1197
3766a197J38m60l96K97o7k82J04k1L50J32K12O01K36M96M80J98Q79N20L74J79
$$ -1197 -1059 -1519 -1915 -1618 -1685 -1967 -1863 -1884 -1534 -1402 -1190 -589 -353 143 623 821 1700 2220 2594 2773
3786B773M43M21J24l03K58k78l19r6l81n55n14l90q32m30m91m49m63n58j35l22
$$ 2773 3216 3637 3761 3458 3716 3438 3119 3023 2642 2087 1573 1183 351 -79 -570 -1019 -1482 -2040 -2175 -2497
3806b497j76j55J63R9J17j45M14N06K07L46L07K99L00L14MJ79L23M0J37l30l5
$$ -2497 -2673 -2828 -2665 -2566 -2449 -2594 -2180 -1674 -1467 -1121 -814 -515 -215 99 103 282 605 645 782 452 417
3827D17j05j75j55j26j94Om6m48M5K41J10j30K12K46K01J59M73L97J70K9O57j81
$$ 417 312 137 -18 -144 -338 -332 -378 -826 -781 -540 -430 -560 -348 -102 99 258 731 1128 1298 1327 1984 1803
3849A803K62r2K75j1j88R9l72m49k40r2m24m52l66m11m67J0m50l82O0j98j4j21
$$ 1803 2065 1973 2248 2237 2049 2148 1776 1327 1087 995 571 119 -247 -658 -1125 -1115 -1565 -1947 -1887 -2085 -2099 -2220
3871b220o7L86r5K67J85L22J98Q3J71O38K62J8M59o5L13pj68O43k87l0j73j18
$$ -2220 -2287 -1901 -1996 -1729 -1544 -1222 -1024 -941 -770 -132 130 148 607 542 855 848 680 1323 1036 1006 833 715
3893G15J39k21k93K40l59Mj19k30k00L08m2O5j4j50N03k07K17L9l46N58o1q6J87
$$ 715 854 633 340 580 221 225 106 -124 -324 -16 -58 7 -7 -157 346 139 356 395 49 607 546 460 647
3916F47k76N6K9j71n5J54l08k29J52k24j29j90J85m09j58R5n3m3J62J69K7J5K2
$$ 647 371 427 456 285 230 384 76 -153 -1 -225 -354 -544 -359 -768 -926 -831 -884 -927 -765 -596 -569 -554 -532
3939e32J53j10J84j4L14j05J26K57K60R9j74K25J29j66m6J94p3k07L7J83m39j41
$$ -532 -379 -489 -305 -319 -5 -110 16 273 533 632 458 683 812 646 600 794 721 514 551 734 295 154
3961A54M5j9k67J09l75O0J72j68k29J66j72lJ6M0k07K59Jj08rL41j97M19j29K09
$$ 154 199 180 -87 22 -353 -293 -121 -289 -518 -352 -524 -527 -511 -471 -678 -419 -418 -526 -535 -194 -391 28 -101 108
3985A08R7J45K96j65K66k12j29l4Q9J82P0k06M9r5l99jm3m9M35m13k79L43k53
$$ 108 205 350 646 481 747 535 406 372 461 643 713 507 556 461 62 61 18 -31 404 -9 -288 55 -198
4008a98o4N6j09j62J21N4q2K17J91J17j20j03LJ38PL7j58J66j92J61K3l57K5j18
$$ -198 -262 -206 -315 -477 -356 -302 -384 -167 24 141 21 -82 -79 59 66 103 -55 111 -81 80 103 -254 -229 -347
4032c47j26J8k59J90N2p0j49k4J19L31N4m3J87M00P4r4j30M02Q9J18M42j49r6
$$ -347 -473 -455 -714 -524 -472 -542 -691 -715 -596 -265 -211 -254 -67 333 407 313 183 585 674 792 1234 1085 989
4055I89K59l0j30o9k38J01j73j29j14k42l55kP4n55O3j36p0l74L5J96k46J91P8
$$ 989 1248 1218 1088 1019 781 882 709 580 466 224 -131 -133 -59 -614 -551 -687 -757 -1131 -1096 -900 -1146 -955 -877
4078h77K04l2J04J70K51M7J42j6j52M40o3j09J04J23l29R4k0j85j07KJ2o6n1K12
$$ -877 -673 -705 -601 -431 -180 -133 9 -7 -159 281 218 109 213 336 7 101 81 -104 -211 -209 -197 -263 -314 -102
4102a02k79J97m2J81j62K31j04K60Q1j86O04l4J30R3J5K7k5o0k8J11J9m24j63
$$ -102 -381 -184 -226 -45 -207 24 -80 180 261 75 679 645 775 868 883 910 885 825 797 908 927 503 340
4125C40n6j89r0m62K66l60P0l26q9P6j17r0j32J82j77M00k2N8J58J70K34J32N9
$$ 340 284 95 5 -457 -191 -551 -481 -807 -896 -820 -937 -1027 -1159 -977 -1154 -754 -776 -718 -560 -390 -156 -24 35
4148C5L18k30L50n7j94J84K98j03j27j24j28L28k73k21J93k26j40J72p6J69j97
$$ 35 353 123 473 416 222 406 704 601 474 350 222 550 277 56 249 23 -117 55 -21 148 -49
4169d9P9j09K89ol74P5K37k2M2J48j02K48j24J44j66n6k3K5j79k12K46k29M4k40
$$ -49 30 -79 210 204 -170 -95 142 120 162 310 208 456 332 476 310 254 231 256 77 -135 111 -118 -74 -314
4193c14K08l3l27j08L96m40Q8L07M8k75J70O0j10J09L32l66M19q9J45j4p4J14
$$ -314 -106 -139 -466 -574 -178 -618 -530 -223 -175 -450 -280 -220 -330 -221 111 -255 164 75 220 206 132 246
4215B46O2J3M4K1j57J19k2j38K25j13J7k15P3m4j45j71j50J87J4j41L16m90L22
$$ 246 308 321 365 386 229 348 326 188 413 300 317 102 175 131 -14 -185 -335 -148 -134 -275 41 -449 -127
4238a27j98l3J70r7P9j85O6J68n9K75j48M6J83Nj3J32j25K77J55k70K32l19K34
$$ -127 -325 -358 -188 -285 -206 -391 -325 -157 -216 59 -89 -43 140 145 132 264 139 416 571 301 533 214 448
4261D48J05p4l26K09l5j58M1j81j77Q1j07P6j70J8j06L75j85O7j17l5k85L62M1
$$ 448 553 479 153 362 327 169 210 29 -148 -67 -174 -98 -268 -250 -356 19 -166 -99 -216 -251 -536 -174 -133
4284a33J44k5J39j41J62kpj66J3J22m9j07%rk27J14l81J59J9Q8j19j99K13J25
$$ -133 11 -14 125 -16 146 144 137 -29 -16 106 57 -50 -50 -59 -286 -172 -553 -394 -375 -287 -406 -605 -392 -267
4308b67OK0J09NK96k89N39N0j5J02L16j6J78j50Q4NJr5J39l37k32l24ol4k24o7
$$ -267 -261 -241 -132 -127 169 -120 419 469 454 556 872 856 1034 884 968 973 974 879 1018 681 449 125 119 85 -139 -206
4334b06l62q4k40q0O3o8j66M86l10K12J70k77J11K82K31j24K73K62J64l6O0J18
$$ -206 -568 -652 -892 -972 -909 -977 -1143 -657 -967 -755 -585 -862 -751 -469 -238 -362 -89 173 337 301 361 479
4356D79l4r3k5OQ2k96k60L7J3j2j73M5L7J95k28j49L24l3J97Q5L16L5m8L78K9
$$ 479 445 352 327 333 415 119 -141 -104 -91 -103 -276 -231 -194 1 -227 -376 -52 -85 112 197 513 548 500 878 907
4381I07P0P5J02j43L15n69K54N0k29O0n36l7l05j66k42k92k20j88k63p4N4k1k52
$$ 907 977 1052 1154 1011 1326 757 1011 1061 832 892 356 319 14 -152 -394 -686 -906 -1094 -1357 -1431 -1377 -1398 -1650
4404a650L29j58J52R7K16J40J66M63L3K92J19J89K14lj34P6O3K52o3q5R0k56j33
$$ -1650 -1321 -1479 -1327 -1230 -1014 -874 -708 -245 -212 80 199 388 602 599 465 541 604 856 793 708 798 542 409
4427D09j69rj06k67Pj91K14n4J90n0K12j44M4L68J7J86L82k91J76j53K10J26l80
$$ 409 240 231 125 -142 -135 -326 -112 -166 24 -26 186 42 86 454 471 657 1039 748 924 771 981 1107 727
4450G27M9j60q8m5n02R4n36mj92l31j23j49l26J72j29J46M8l02J90J33L49K01
$$ 727 776 616 528 483 -19 75 -461 -465 -657 -988 -1111 -1260 -1586 -1414 -1543 -1397 -1349 -1651 -1461 -1328 -979 -778
4472g78K2J1N07L02K42J34L54Q2K21j15Q2J13j99K88jm97j23P7O8m66j67m6J7
$$ -778 -756 -745 -238 64 306 440 794 876 1097 982 1064 1177 978 1266 1265 768 645 722 790 324 157 111 128
4495A28k31m5j15pJ23K69j22j31J28J62j24M36j24J8m0rK42j33M6l90Q5J5j08
$$ 128 -103 -148 -263 -270 -147 122 0 -131 -3 159 35 471 347 365 325 316 558 425 471 81 166 181 73
4518G3m05k14r0o6l09j07p2m6l32J61j06L83R8J39J5J62K25K60P5K28J01M25J01
$$ 73 -332 -546 -636 -702 -1011 -1118 -1190 -1236 -1568 -1407 -1513 -1130 -1032 -893 -878 -716 -491 -231 -156 72 173 598 699
4541F99J13Q3nL38l45L40j78J01k27O9m39p1p2q1j58o3R8l15j04O4l72J93N5L5
$$ 699 812 895 890 1228 883 1223 1045 1146 919 988 549 478 406 325 167 104 202 -113 -217 -153 -525 -332 -277 -242
4565b42L35q3M8k07M6RM05j12j53J19m1k38J39l22K54j35p0k15J87j99l81K76
$$ -242 93 10 58 -149 -103 -94 311 199 46 165 124 -114 25 -297 -43 -178 -248 -463 -276 -475 -856 -580
4587e80k79j17j2N6J56J17J11o9m8N49K29n1K28k40M83J06O6J08J5k0L59l92j3
$$ -580 -859 -976 -988 -932 -776 -659 -548 -617 -665 -116 113 62 290 50 533 639 705 813 828 808 1167 775 762
4610G62l06K77o1j47q9j46j73k5k42J19K07n49K1K40k81M7j7q5m7R1K20k00K32
$$ 762 456 733 672 525 436 290 117 92 -150 -31 176 -373 -352 -112 -393 -346 -363 -448 -495 -404 -184 -384 -152
4633a52n3%J35j13K56j85J13R2k46r1K47L5l55K93m8M6Rr2L2j70J22J3P8l0o3
$$ -152 -205 -205 -70 -183 73 -112 1 93 -153 -244 3 38 -317 -24 -72 -26 -17 -109 -77 -247 -125 -112 -34 -64 -127
4658a27J83k4p4J88j38M0J81j83J03m2R7l5o3J03j11K0k00K75k02l9K43k89L14
$$ -127 56 32 -42 146 8 48 229 46 149 107 204 169 106 209 98 118 -82 193 -9 -48 195 -94 220
4681B20j89j31n8J89j47J21J09l43M7N4J94j65J43k08J29K19l10k05L46K04k94
$$ 220 31 -100 -158 31 -116 5 114 -229 -182 -128 66 -99 44 -164 -35 184 -126 -331 15 219 -75
4702g5M8O5n4M6J2L5J02P1k24K43l6Q0k11n7J53j46L5Q2j70j83o4K7r5j9J97n38
$$ -75 -27 38 -16 30 42 77 179 250 26 269 233 313 102 45 198 52 87 169 -1 -184 -248 -221 -316 -335 -138 -676
4728f76J54j14J05k68L25p3j47j58L33L67k80L51R9k39L24m8J24j2J05K61r6j25
$$ -676 -522 -636 -531 -799 -474 -547 -694 -852 -519 -152 -432 -81 18 -221 103 55 179 167 272 533 437 312
4750C12J41J8O2N6j29J13m11K39Q0n30J17k18K99j65l55L54J7j92rJ02JJ75m9
$$ 312 453 471 533 589 460 573 162 401 481 -49 68 -150 149 -16 -371 -17 0 -192 -201 -99 -98 77 28
4773B8K95O2J06Rk72R5l36K36L8m5l56m4j71J66k77k56l40J37j06o6l5j29J89
$$ 28 323 385 491 500 228 323 -13 223 261 216 -140 -184 -355 -189 -466 -722 -1062 -925 -1031 -1097 -1132 -1261 -1072
4796a072j54K40j21L07R2J58L87J57J94K65J42K05K81J27jJ49J01j40l1K5K02
$$ -1072 -1226 -986 -1107 -800 -708 -550 -163 -6 188 453 595 800 1081 1208 1207 1356 1457 1317 1286 1311 1513
4817A513l83p7k26M7k12k97l17k79J17o5n00J75J93k84R3K41k33J71Jj8K12J59
$$ 1513 1130 1053 827 874 662 365 48 -231 -114 -179 -679 -504 -311 -595 -502 -261 -494 -323 -322 -340 -128 31
4839C1j36K21K99l91J00k65j3r1J8k08m0r6k59k07N4j26l19J4K12L2O3j27L36
$$ 31 -105 116 415 24 124 -141 -154 -245 -227 -435 -475 -571 -830 -1037 -983 -1109 -1428 -1414 -1202 -1170 -1107 -1234 -898
4862h98K80RN22K27L01J09M17K86K89k1K90P9J48n5q1J49l28j49r9l59j22n38
$$ -898 -618 -609 -87 140 441 550 967 1253 1542 1521 1811 1890 2038 1983 1902 2051 1723 1574 1475 1116 994 456
4884D56no52k12j4l03j59J48k30k79K32l23K4K19L49p4K42M01l39J10K76J99o3
$$ 456 451 -201 -413 -427 -730 -889 -741 -971 -1250 -1018 -1341 -1317 -1098 -749 -823 -581 -180 -519 -409 -133 66 3
4906CN4J89k56K4J99o62nM9r2j92k03Ql81K84oj6J86K41J99j27L11K38N67J61
$$ 3 57 246 -10 14 213 -449 -454 -405 -497 -689 -892 -884 -1265 -981 -987 -1003 -817 -576 -377 -504 -193 45 612 773
4930G73K5M51P6N11r2J55K71J14k76k0j61k97l6n16k03k57r8o76j04l12j77k40
$$ 773 798 1249 1325 1836 1744 1899 2170 2284 2008 1988 1827 1530 1494 978 775 518 420 -256 -360 -672 -849 -1089
4952a089n9j13k52q9K18r4O2K65j16M20K10P5K2M69l8J58M6M9O2J48l08L53n01
$$ -1089 -1148 -1261 -1513 -1602 -1384 -1478 -1416 -1151 -1267 -847 -637 -562 -540 -71 -109 49 95 144 206 354 46 399 -102
4975a02M5K38k28j68j24J20q8m9Oq5J15J42k41N27m7K56M36k30M31J42R9M9OK25
$$ -102 -57 181 -47 -215 -339 -219 -307 -356 -350 -435 -320 -178 -419 108 61 317 753 523 954 1096 1195 1244 1250 1475
4999A475j20J43L5k85j23j39l36j01k95l10j64k05k46j64k00k47r1K72l45J65
$$ 1475 1355 1498 1533 1248 1125 986 650 549 254 -56 -220 -425 -671 -835 -1035 -1282 -1373 -1101 -1446 -1281
5019a281Nj37l0M62J56Q2j98M58L36J69qK49J10o4j1N4K19k70N9k09J00j89L8
$$ -1281 -1276 -1413 -1443 -981 -825 -743 -941 -483 -147 22 14 263 373 309 298 352 571 301 360 151 251 62 100
5042A00J58l34k3J21j74R0J52m5J0k7R0K12k92J86J24J97q4K13o8P2P7j33pl10
$$ 100 258 -76 -99 22 -152 -62 90 45 55 28 118 330 38 224 348 545 461 674 606 678 755 622 615 305
5066C05J56m8l86J12k86J7q6m7j60p0qj81j4MO8K31j58j2K50J35m9R7j56K18o0
$$ 305 461 413 27 139 -147 -130 -216 -263 -423 -493 -501 -682 -696 -692 -624 -393 -551 -563 -313 -178 -227 -130 -286 -68 -128
5091a28K40m1j4N7j93J42J79N0o4j90l8N46m68n5M2p9k17jK76j06J26n5nL3j00
$$ -128 112 71 57 114 -79 63 242 292 228 38 0 546 78 23 65 -14 -231 -232 44 -62 64 9 4 37 -63
5116f3N8k01K47p9k4l7Q3P6j37J10j96J29J11k67J18m0N5J58J43j71J66j72m3
$$ -63 -5 -206 41 -38 -62 -99 -16 60 -77 33 -163 -34 77 -190 -72 -112 -57 101 244 73 239 67 24
5139B4J51K14l77L60oo2j66K12j52l17L81p6k67k2j61O9k1M7k93n3O1J01j33K9
$$ 24 175 389 12 372 366 304 138 350 198 -119 262 186 -81 -103 -264 -195 -216 -169 -462 -515 -454 -353 -486 -457
5163d57l1K08l15K65J4J95j8K1J68R1J62k80J72J60l67K65o6j32j39QM2q7L4k03
$$ -457 -488 -280 -595 -330 -316 -121 -139 -118 50 141 303 23 195 355 -12 253 187 55 -84 -76 -34 -121 -87 -290
5187b90N9J33l53J15R7J57J74p2j20L74p0J76K33MM7L62Q1l27K66l17J59k70L78
$$ -290 -231 -98 -451 -336 -239 -82 92 20 -100 274 204 380 613 617 664 1026 1107 780 1046 729 888 618 996
5210I96n67M9j77k98q8m26J07o1l58M7k68J37KMl23J62j5J51L00Q7Q6L72k83L58
$$ 996 429 478 301 3 -85 -511 -404 -465 -823 -776 -1044 -907 -905 -901 -1224 -1062 -1077 -926 -626 -539 -453 -81 -364 -6
5234fJ06JK96M9l11L32J90j19k9l41m6k40J08k31k5K82k60P7M0J42J7K07J6k23
$$ -6 100 101 397 446 135 467 657 538 509 168 122 -118 -10 -241 -266 16 -244 -167 -127 15 32 239 255 32
5258C2L67q2K04R9K54J6J39J25k82M7M65l36l47j02l1n5k11k76j66l08j39j92
$$ 32 399 317 521 620 874 890 1029 1154 872 919 1384 1048 701 599 568 513 302 26 -140 -448 -587 -779
5280g79k03j48Rm15K43L4m2p9M4L33j21K69K01M85j15K93O0L71k19N96k68J21
$$ -779 -982 -1130 -1121 -1536 -1293 -1259 -1301 -1380 -1336 -1003 -1124 -855 -654 -169 -284 9 69 440 221 817 549 670
5302F70J14j85J06k02K20k65k7l23K25q0L4q6K9k5k34J28K1L4j02K9K18k7K4L90
$$ 670 784 599 705 503 723 458 431 108 333 253 287 201 230 205 -29 99 120 154 52 81 299 272 296 686
5326F86lj19PJ42k7r9K43m39Nl09l0j37j68j83L4j15l15q0j59J34l11l4K83K8
$$ 686 683 564 571 713 686 587 830 391 396 87 57 -80 -248 -431 -397 -512 -827 -907 -1066 -932 -1243 -1277 -994 -966
5350i66j51M78j83J78L60j34L18J02K66K00J51n4R3jL53J9k11j43K1r4j46j66
$$ -966 -1117 -639 -822 -644 -284 -418 -100 2 268 468 619 565 658 657 1010 1029 818 675 696 602 456 290
5372B90Q1k16k40J16R0k38L5J4J38k1l5Q0kj56K50k55M95p0j70N2k01J49M0P9
$$ 290 371 155 -85 31 121 -117 -82 -68 70 49 14 94 92 -64 186 -69 426 356 186 238 37 186 226 305
5396C05j04R4l59N4j65j05j67l4P8k67J17n7L7q0M23m06O0J08J99k6N7q2J02J87
$$ 305 201 295 -64 -10 -175 -280 -447 -481 -403 -670 -553 -610 -573 -653 -230 -636 -576 -468 -269 -295 -238 -320 -218 -31
5420c1j06J80R6Q9L4Q5P2j48o5J87M7j46k7q3m6K10l14J02L3l09N5P9k61K94M0
$$ -31 -137 43 139 228 262 347 419 271 206 393 440 294 267 184 138 348 34 136 169 -140 -85 -6 -267 27 67
5445F7J5J97l79M42o3k08l66N48k37J02j66K7k48L93j53j9rM8j89J57o6j03K17
$$ 67 82 279 -100 342 279 71 -295 253 16 118 -48 -21 -269 124 -29 -48 -57 -9 -198 -41 -107 -210 7
5468Gq0j63K50k07J64J67l8o9q3P3r6O9J33k70L82k56k6j18J14J09l87j24J07
$$ 7 -73 -236 14 -193 -29 138 100 31 -52 21 -75 -6 127 -143 239 -17 -43 -161 -47 62 -325 -449 -342
5491c42rL76k65K03m48K04R9K04K09k12K55k80K37j64J27P3J96k87Q6K23j16L7
$$ -342 -351 25 -240 -37 -485 -281 -182 22 231 19 274 -6 231 67 194 267 463 176 262 485 369 406
5513D06j2o2j9m74J85j35P6j26J69j79J9O7K00j95N5o7L34k24J18K33k15o4j8
$$ 406 394 332 313 -161 24 -111 -35 -161 8 -171 -152 -85 115 -80 -25 -92 242 18 136 369 154 90 72
5536G2K89j69J36q4j32l2j74n0j23J12q9k87J44Jj90J62l10o1m1R7M04k27K30
$$ 72 361 192 328 244 112 80 -94 -144 -267 -155 -244 -531 -387 -386 -576 -414 -724 -785 -826 -729 -325 -552 -322
5559c22j25J32M65k07M30rl8K84p6K09l4O8o1Or9k20M12m10k6M3l31P5p8m2j8
$$ -322 -447 -315 150 -57 373 364 326 610 534 743 709 777 716 722 623 403 815 405 379 422 91 166 88 46 28
5584B8p3p9n7J74K3l57J94k03K34J10J30L4j61K79k62j3J21L2j65j14j1J89m68
$$ 28 -45 -124 -181 -7 16 -341 -147 -350 -116 -6 124 158 -3 276 14 1 122 154 -11 -125 -136 53 -415
5607d15K35j60J29j79k01l43J13K60l92J50k6L4K49Q3J93R2J72K06n3L34J1J10
$$ -415 -180 -340 -211 -390 -591 -934 -821 -561 -953 -803 -829 -795 -546 -463 -270 -178 -6 200 147 481 492 602
5629F02P1J70P6J23j97O4j90oL5j71o0r5l53L6Q9m48J80m18J18j72N0J18r7J48
$$ 602 673 843 919 1042 845 909 719 713 748 577 517 422 69 105 194 -254 -74 -492 -374 -546 -496 -378 -475 -327
5653c27q2M9K38Pj09J30Qj8j61L47k3k18K85M7m63q6J32K0j41n2j00k03J71J22
$$ -327 -409 -360 -122 -115 -224 -94 -86 -104 -265 82 59 -159 126 173 -290 -376 -244 -224 -365 -417 -517 -720 -549 -427
5677d27m05L21M9K43k45M20j53J22N8K0J78kK81J04K6m1K54k96J82K86K5n44K16
$$ -427 -832 -511 -462 -219 -464 -44 -197 -75 -17 3 181 179 460 564 590 549 803 507 689 975 1000 456 672
5700F72l36K34m06j2r1J41j67m05K11l16J22k2n6R9j35K1m1j41K54q1K59J83R3
$$ 672 336 570 164 152 61 202 35 -370 -159 -475 -353 -375 -431 -332 -467 -446 -487 -628 -374 -455 -196 -13 80
5723H0j51j4N9M31l29j59J57O0l38Q3m7m8J20j41L32m42J60q0L5n9O2Q5J64m5
$$ 80 -71 -85 -26 405 76 -83 74 134 -204 -121 -168 -216 -96 -237 95 -347 -187 -267 -232 -291 -229 -144 20 -25
5747b5J28k05J67J52L42k41M8j72Q4L20j14j24J32j91Pn6K55n24K9Q3L3j14l69
$$ -25 103 -102 65 217 559 318 366 194 278 598 484 360 492 301 308 252 507 -17 12 95 128 14 -355
5770c55K39j31j1N0l4J61m05K72j42R1o4J67N2K4P5L5J12J6n8j37mP2m5n7J07
$$ -355 -116 -247 -258 -208 -242 -81 -486 -214 -356 -265 -329 -162 -110 -86 -11 24 136 152 94 -43 -47 25 -20 -77 30
5795C0K1J81j72Pk13L67l80J69j33J00j45K86k98K80k81L31m37mM19k90k2J80
$$ 30 51 232 60 67 -146 221 -159 10 -123 -23 -168 118 -180 100 -181 150 -287 -291 128 -162 -184 -4
5817dm1P9J8P4k36J11m5r0O4K29l33J57K97j81J44j86k9J19kL8J19q4O1k93K56
$$ -4 -45 34 52 126 -110 1 -44 -134 -70 159 -174 -17 280 99 243 57 28 147 145 183 302 218 279 -14 242
5842B42k03L5j00J02Q6l36O8J09r3n8K55l2l29N1J42J57j73J29k8j24J55K31M1
$$ 242 39 74 -26 76 162 -174 -106 3 -90 -148 107 75 -254 -203 -61 96 -77 52 24 -100 55 286 327
5865C27l55J60J16k79l0Pq3Q2l1j67j21N9k2qJ5m1k18L75n7k24L41M6L6J94j19
$$ 327 -28 132 248 -31 -61 -54 -137 -55 -86 -253 -374 -315 -337 -345 -330 -371 -589 -214 -271 -495 -154 -108 -72 122 3
5890CK12J5K09j01J97K6K46q8M6K17l57Q6j36j79K91l87k9l14J00j10k9j25j91
$$ 3 215 230 439 338 535 561 807 719 765 982 625 711 575 396 687 300 271 -43 57 -53 -82 -207 -398
5913c98q3K54k03N5k07k7J85j71L74NR4J13l24L39K1j59J85J47L3k46r5J42j48
$$ -398 -481 -227 -430 -375 -582 -609 -424 -595 -221 -216 -122 -9 -333 6 27 -132 53 200 233 -13 -108 34 -114
5936a14j99m8m0k8j92J07j4J5M4p0K32P1j15K48K35K32p9K01L20j51K75K03L2
$$ -114 -313 -361 -401 -429 -621 -514 -528 -513 -469 -539 -307 -236 -351 -103 132 364 285 486 806 655 930 1133 1165
5959A165j24J47J85k11j36J6N0j95k08k40j79k73k62j72j35Jn4j16j18k82KK44
$$ 1165 1041 1188 1373 1162 1026 1042 1092 897 689 449 270 -3 -265 -437 -572 -571 -625 -741 -859 -1141 -1139 -895
5981h95j5J15Q7l9K67RQL48J09L0J2J21l6K3p9K45j83j04q4J42l46k50M3K93k84
$$ -895 -910 -795 -708 -747 -480 -471 -463 -115 -6 24 36 157 121 144 65 310 127 23 -61 81 -265 -515 -472 -179 -463
6006d63k14L11L4Nq0M29k20M41K14K20O7J10L70J82J97J22k15O9k9j97J7m23M9
$$ -463 -677 -366 -332 -327 -407 22 -198 243 457 677 744 854 1224 1406 1603 1725 1510 1579 1550 1353 1370 947 996
6029I96l24m52l52P2j72m36k44o2k48j90O4K26l95k11L98K3J71K90l3K06K69l9
$$ 996 672 220 -132 -60 -232 -668 -912 -974 -1222 -1412 -1348 -1122 -1517 -1728 -1330 -1307 -1136 -846 -879 -673 -404 -443
6051d43J90M22k83M72p8K53j14m3n1l05MJ87k05Nj45k24OK2N6j08K40k4n6L33
$$ -443 -253 169 -114 358 280 533 419 376 325 20 24 211 6 11 -134 -358 -352 -330 -274 -382 -142 -166 -222 111
6075A11J14L09M6J50K51K63K36j46P8J28j82K6j91K40l64k25l64Q0m44l26k67
$$ 111 225 534 580 730 981 1244 1480 1334 1412 1540 1358 1384 1193 1433 1069 844 480 560 116 -210 -477
6096d77k88l4l70k22j34P0j02k90N45k10Q3n4M14Q0J91K65P5L98N3K79L0L38l9
$$ -477 -765 -799 -1169 -1391 -1525 -1455 -1557 -1847 -1302 -1512 -1429 -1483 -1069 -989 -798 -533 -458 -60 -7 272 302 640 601
6119F01N3J12j1j0j82q0M9j23j48j80n5j05K3p6M1n3Q2J50K2J7M74N2P1k17N10
$$ 601 654 766 755 745 563 483 532 409 261 81 26 -79 -56 -132 -91 -144 -62 88 110 127 601 653 724 507 1017
6144A017n7J37j92J1j47l2J45j35l24O1k49j20k71m0l31l82l59N1r7j13J58j29
$$ 1017 960 1097 905 916 769 737 882 747 423 484 235 115 -156 -196 -527 -909 -1268 -1217 -1314 -1427 -1269 -1398
6166a398Pq5M37j01L78j47L64m2L04M07JJ19J57L15j41o8L10j34J18j67r0J1j5
$$ -1398 -1391 -1476 -1039 -1140 -762 -909 -545 -587 -283 124 125 244 401 716 575 507 817 683 801 634 544 555 540
6189E40j60j11j96J31j39r5M6r0N7J31j01J59j99m4M40k3rk8M1q8J49q5J25k24
$$ 540 380 269 73 204 65 -30 16 -74 -17 114 13 172 -27 -71 369 346 337 309 350 262 411 326 451 227
6213B27J80l93O7K36m51N2k65N5l14J37q8j41J99l70L29j6l2r5J14K07j27M05
$$ 227 407 14 81 317 -134 -82 -347 -292 -606 -469 -557 -698 -499 -869 -540 -556 -588 -683 -569 -362 -489 -84
6235h4mK49k89J52J66J47k68N50j74o6k22K47k56K15j03l01L3L69j54o1j23m0
$$ -84 -88 161 -128 24 190 337 69 619 445 379 157 404 148 363 260 -41 -8 361 207 146 23 -17
6257a7J31j31O7qo9O9j11J07K23j99j39k91M96j51RP6m1M5N0r5j16J69j21K83
$$ -17 114 -17 50 42 -27 42 -69 38 261 62 -77 -368 128 -23 -14 62 21 66 116 21 -95 74 -47 236
6281B36j82j48J02J39J08J43p4j0q1k09J91o8k52L27l77M38k27q2oj48j17k4j33
$$ 236 54 -94 8 147 255 398 324 314 233 24 215 147 -105 222 -155 283 56 -26 -32 -180 -297 -321 -454
6304d54n0J5m2K43J2j40O1j66L00n1l7J10J38m0K95k9j04P3Q2J03J77q6L0j2j97
$$ -454 -504 -489 -531 -288 -276 -416 -355 -521 -221 -272 -309 -199 -61 -101 194 165 61 134 216 319 496 410 440 428 231
6329B31lj43Q8J57m86K5J21j50L09J45k14J39l2j81K20M4J50j9J49J65J9J88j39
$$ 231 228 85 173 330 -156 -131 -10 -160 149 294 80 219 187 6 226 270 420 401 550 715 734 922 783
6352G83j32N5j31j97O4j66k2l64k0k87m08r8j94j3k15nj8L2Q2j12J68J13p2L38
$$ 783 651 706 575 378 442 276 254 -110 -130 -417 -825 -923 -1117 -1130 -1345 -1350 -1368 -1336 -1254 -1366 -1198 -1085 -1157 -819
6376h19J78K3P31K5R8K29J45l0K83J28j71mL23j10q6m37M4m0J6o4n12J30k78l2
$$ -819 -641 -618 113 138 236 465 610 580 863 991 820 816 1139 1029 943 506 550 510 526 462 -50 80 -198 -230
6400b30j07M00K6l96M59r0J68J82K13p6K27J33m4K8M0n7k52m1j61K4o48Q7j70
$$ -230 -337 63 89 -307 152 62 230 412 625 549 776 909 865 893 933 876 624 583 422 446 -202 -115 -285
6423b85o00j50m75K1j8j65j71r4j20L9J29J25L44j11N27L23L30J51L87L05K86
$$ -285 -885 -1035 -1510 -1489 -1507 -1672 -1843 -1937 -2057 -2018 -1889 -1764 -1420 -1531 -1004 -681 -351 -200 187 492 778
6444G78L13M00m2JK41M4l96J44q1o0m7l95j80o0m13J29l11k46j39j57J76J99k06
$$ 778 1091 1491 1449 1450 1691 1735 1339 1483 1402 1342 1295 900 720 660 247 376 65 -181 -320 -477 -301 -102 -308
6467c08J15n7P5R8M84o8J09M8j21K70o3o3O9m75O6m90R8J31n65j70l21m24j03
$$ -308 -193 -250 -175 -77 407 339 448 496 375 645 582 519 588 113 179 -311 -213 -82 -647 -817 -1138 -1562 -1665
6490a665j8j7l5j77K30q6P5M23L87J10L56k6M59N41J04N13K91K58Q3J53J9j58
$$ -1665 -1683 -1700 -1735 -1912 -1682 -1768 -1693 -1270 -883 -773 -417 -443 16 557 661 1174 1465 1723 1806 1959 1978 1820
6512A820J56k86J44m42k0j41k69j11o78k79J79j48k43k13p5j8k28J47J38q9J58
$$ 1820 1976 1690 1834 1392 1372 1231 962 851 173 -106 73 -75 -318 -531 -606 -624 -852 -705 -567 -656 -498
6533d98K13l2L41M8K1j03K47Q4j82M4Pj76j98j95l43N3Q0k81K9l36J29k75j13
$$ -498 -285 -317 24 72 93 -10 237 321 139 183 190 14 -184 -379 -722 -669 -589 -870 -841 -1177 -1048 -1323 -1436
6556a436K74J18pn2K79K48L59K15K31M46j19N91j54L72M8j00J51L1o1O3j34L1
$$ -1436 -1162 -1044 -1051 -1103 -824 -576 -217 -2 229 675 556 1147 993 1365 1413 1313 1464 1495 1434 1497 1363 1394
6578A394k46r7m41l49N4k55k55mk02m46J80k57m5J94oj32M7M46k27Q9K71Q2J65
$$ 1394 1148 1051 610 261 315 60 -195 -199 -401 -847 -667 -924 -969 -775 -781 -913 -866 -420 -647 -558 -287 -205 -40
6601d0R1m2J20J52l29n4K37m00L20k23j66q9J7J73m38R2j9J21n3j8J10L1K80J18
$$ -40 51 9 129 281 -48 -102 135 -265 55 -168 -334 -423 -406 -233 -671 -579 -598 -477 -530 -548 -438 -407 -127 -9
6625iP9K23q2J23L27r0R5l1M5K20l1J1p7q7p8K6k39l0j24k07j43J00k11Kq7P0
$$ -9 70 293 211 334 661 571 666 635 680 900 869 880 803 716 638 664 425 395 271 64 -79 21 -190 -188 -275 -205
6651b05J25k24l41J89J92l4j45N06j19j7k2l92M39J77kj06j67L61k34P0j74J57
$$ -205 -80 -304 -645 -456 -264 -298 -443 63 -56 -73 -95 -487 -48 129 127 21 -146 215 -19 51 -123 34
6673C4R4n5k27k02M06r9o9j5K14k09L8J60P4j57L1J01j44J27M3j51J75q0Q8k93
$$ 34 128 73 -154 -356 50 -49 -118 -133 81 -128 -90 70 144 -13 18 119 -25 102 145 -6 169 89 177 -116
6697a16k9J0L25l15M59r6k12J13q7K5j16L16j55o3J77o6l9K34R1k76p7P9j36L30
$$ -116 -145 -135 190 -125 334 238 26 139 52 77 -39 277 122 59 236 170 131 365 456 180 103 182 46 376
6721C76m39J97J46k26K32j58k92l8k00K05q3J4j02Mm2K21R4J0k90K33O5K4Q7k6
$$ 376 -63 134 280 54 286 128 -164 -202 -402 -197 -280 -266 -368 -364 -406 -185 -91 -81 -371 -138 -73 -49 38 12
6745A2J9j84L65k86J61j59j83J0r6Q1j07K84j63q6k7p1q0K07N0l9Q4QJ16L85P4
$$ 12 31 -153 212 -74 87 -72 -255 -245 -341 -260 -367 -83 -246 -332 -359 -430 -510 -303 -253 -292 -208 -200 -84 301 375
6770C75l7J54j51L96J30j8j26L6K9K18j60kk28j03K29n03j16M6j37k86n05L55
$$ 375 338 492 341 737 867 849 723 759 788 1006 846 844 616 513 742 239 123 169 32 -254 -759 -404
6792d04j48l69L8L5j74L46O1l9K6K05M2N1M8K32P9j03J08J81L1l05J71n0r6j75
$$ -404 -552 -921 -883 -848 -1022 -676 -615 -654 -628 -423 -381 -330 -282 -50 29 -74 34 215 246 -59 112 62 -34 -209
6816b09L4l6j17R7j65q3m3j11L38N4Q8J21J05mK90M7K06J75K1p0M26J74l0K6j55
$$ -209 -175 -211 -328 -231 -396 -479 -522 -633 -295 -241 -153 -32 73 69 359 406 612 787 808 738 1164 1338 1308 1334 1179
6841A179j66J39l5r4m74j46J51n25j43k90n5j63j74k37k28K1J8j4J21J05l0K40
$$ 1179 1013 1152 1117 1023 549 403 554 29 -114 -404 -459 -622 -796 -1033 -1261 -1240 -1222 -1236 -1115 -1010 -1040 -800
6863h00J26J43K64j65K1M34J31N6J01r5K49j94K9n2oq3L15n03Ok4ll3k06n6L66
$$ -800 -674 -531 -267 -432 -411 23 154 210 311 216 465 271 300 248 242 159 474 -29 -23 -47 -50 -83 -289 -345 21
6888B1r2J57NqJ03J8K44KJ55K49j23J38K85j00j24j61K32J28k97k98j08L7n68
$$ 21 -71 86 91 83 186 204 448 450 605 854 731 869 1154 1054 930 769 1001 1129 832 534 426 463 -105
6911a05k48P2l00l76O7l90J90l00K03m8J54k16L22O5j1L43J82J14J65K19J42j11
$$ -105 -353 -281 -581 -957 -890 -1280 -1090 -1390 -1187 -1235 -1081 -1297 -975 -910 -921 -578 -396 -282 -117 102 244 133
6933A33K46K12M0n8r9K06k49P3m7P4l51N8l61K22p0J9k15J54j40J28p5K50J24
$$ 133 379 591 631 573 474 680 431 504 457 531 180 238 -123 99 29 48 -167 -13 -153 -25 -100 150 274
6956B74j16J27J28R8%Q1J4R5q4L14k02j32k74O1p3k22k84K8j56j48l35K51k24
$$ 274 158 285 413 511 511 592 606 701 617 931 729 597 323 384 311 89 -195 -167 -323 -471 -806 -555 -779
6979g79k44j3Ll5J17k48N87J9o7K96J8J78J65J82R3MJ93j02K71p3j16N2o7K62
$$ -779 -1023 -1036 -1033 -1068 -951 -1199 -612 -593 -660 -364 -346 -168 -3 179 272 276 469 367 638 565 449 501 434 696
7003F96j79j29k13Nl4j39n3j38O6M0K8M2P7n1q2K7K45j93p6J66K81j9q6P5R7k35
$$ 696 517 388 175 180 146 7 -46 -184 -118 -78 -50 -8 69 18 -64 -37 208 15 -61 105 386 367 281 356 453 218
7029B18J08j49j8M8k2j86k18j77Q4j32J06L1l56J72o6M5R0j14K49K5l03J39L15
$$ 218 326 177 159 207 185 -1 -219 -396 -312 -444 -338 -307 -663 -491 -557 -512 -422 -536 -287 -262 -565 -426 -111
7052a11j16L41r5J97q0J90j95K50m02M12n5k54K06j54k53K0K37q4J14k25J57j42
$$ -111 -227 114 19 216 136 326 131 381 -21 391 336 82 288 134 -119 -99 138 54 168 -57 100 -42
7074d2O8J64o7J11J4l6n08K24P57l97k06j45oM58n70J12J17K0n4nO2j01m1J28
$$ -42 26 190 123 234 248 212 -296 -72 685 288 82 -63 -69 389 -181 -69 48 68 14 9 71 -30 -71 57
7098E7p9J27k01O0j31R5J56o1l95O55j16Q3k82J21r9kl6j21K84k22q1M1k6k26
$$ 57 -22 105 -96 -36 -167 -72 84 23 -372 283 167 250 -32 89 -10 -12 -48 -169 115 -107 -188 -147 -173 -399
7122c99L63k20J65j34L7M7j39J83j88J95K2J6R5K1L9J26r9l6q3K04r5J44n9l7
$$ -399 -36 -256 -91 -225 -188 -141 -280 -97 -285 -90 -68 -52 43 64 103 229 130 94 11 215 120 264 205 168
7146A68J64m7j98o8J02K24l28j43K89j97J7l2k3j23K92o6K11N8k46L50k84Q1K95
$$ 168 332 285 87 19 121 345 17 -126 163 -34 -17 -49 -72 -195 97 31 242 300 54 404 120 201 496
7169D96o1j6k64J90k86K61k96Kk95j51L22l54o9p4k9K0J9k19K29j06k0O1L28j86
$$ 496 435 419 155 345 59 320 24 26 -269 -420 -98 -452 -521 -595 -624 -604 -585 -804 -575 -681 -701 -640 -312 -498
7193d98J99q0L41p3K06RM84j58J22J5K6J63j62n2J10n07J61J34l36K41j56j77
$$ -498 -299 -379 -38 -111 95 104 588 430 552 567 593 756 594 542 652 145 306 440 104 345 189 12
7215A2l4l0K51m02M9j32N7L12k79L11P3K0J04M1J30j25K62k81l0j70L1n0k25j72
$$ 12 -22 -52 199 -203 -154 -286 -229 83 -196 115 188 208 312 353 483 358 620 339 309 139 170 120 -105 -277
7239b77L1k16J4k81K45k00k32k00j35J11K26k3J12J51o0K23K00M39RP3L38R5q
$$ -277 -246 -462 -448 -729 -484 -684 -916 -1116 -1251 -1140 -914 -937 -825 -674 -734 -511 -311 128 137 210 548 643 635
7262F35J29j27K52m2L7j33J15R4k48k34o7K02l73j82M9j69K1r7k46J42mk10L72
$$ 635 764 637 889 847 884 751 866 960 712 478 411 613 240 58 107 -62 -41 -138 -384 -242 -246 -456 -84
7285h4m58M20K97l6m9m9J73K76j93q3N6o8N6k89q4l76M39l38j3k25j01P7n66K41
$$ -84 -542 -122 175 139 90 41 214 490 297 214 270 202 258 -31 -115 -491 -52 -390 -403 -628 -729 -652 -1218 -977
7309i77J49j0j22N9m0L12J53L71J4J05J15jM16J64Q3Q3K60l21L08r6R4Jl02Q4
$$ -977 -828 -838 -960 -901 -941 -629 -476 -105 -91 14 129 128 544 708 791 874 1134 813 1121 1025 1119 1120 818 902
7333I02j33k33j83J36l10l51j13K6R3n0k39R1ml9m6N0K62K3J04l4L71l87j49K54
$$ 902 769 536 353 489 179 -172 -285 -259 -166 -216 -455 -364 -368 -407 -453 -403 -141 -118 -14 -48 323 -64 -213 41
7357D1lm3R5l6M6j28j35n4k16j25J92lk10J12j66r0L39l64J44K55n5J91M13mm3
$$ 41 38 -5 90 54 100 -28 -163 -217 -433 -558 -366 -369 -579 -467 -633 -723 -384 -748 -604 -349 -404 -213 200 196 153
7382A53M5K49R1J70j07K57J87j96K10j92l6k27J64n3l27mk71L1k03l10K9j18P1
$$ 153 198 447 538 708 601 858 1045 849 1059 867 831 604 768 715 388 384 113 144 -59 -369 -340 -458 -387
7405c87l5J92n91K27J78J68j0o3j05L42M9Q2q9P0j34J88M9J0j24jJ20k58M7R3
$$ -387 -422 -230 -821 -594 -416 -248 -258 -321 -426 -84 -35 47 -42 28 -106 82 131 141 17 16 136 -122 -75 18
7429A8j6r9p2J2q8j02J47j94P1K70j6j97K33J26J75j83K1J87O2J23r1N2k85J59
$$ 18 2 -97 -169 -157 -245 -347 -200 -394 -323 -53 -69 -266 -33 93 268 85 106 293 355 478 387 439 154 313
7453C13K4j46j7J02j98j05J22k04K57l3j57J88l42Q8k24J74j56K00P5k63J69J00
$$ 313 337 191 174 276 78 -27 95 -109 148 115 -42 146 -196 -108 -332 -158 -314 -114 -39 -302 -133 -33
7475c3k94K00Nj52K71k61M71j06j06P0K74k54J00m4j69j73K13K07r6O1q1j11J93
$$ -33 -327 -127 -122 -274 -3 -264 207 101 -5 65 339 85 185 141 -28 -201 12 219 123 184 103 -8 185
7498A85j4q7n2r4P8r4q9lm3J00p1L9p6J37j03rj49Q9J56j23j07L27K0r1j61M51
$$ 185 171 84 32 -62 16 -78 -167 -170 -213 -113 -184 -145 -221 -84 -187 -196 -345 -256 -100 -223 -330 -3 17 -74 -235 216
7524B16l9l6J17J59L8j95j60K74j06O2k4j07J19K26n27Q5K4p7K27k77l2o2J6j13
$$ 216 177 141 258 417 455 260 100 374 268 330 306 199 318 544 17 102 126 49 276 -1 -33 -95 -79 -192
7548a92K41J8k56L00j82q9L3P6J72M9j20J00R9n15L53J08k77k36J77N9l09O6l38
$$ -192 49 67 -189 111 -71 -160 -127 -51 121 170 50 150 249 -266 87 195 -82 -318 -141 -82 -391 -325 -663
7571f63N1K9j37k1N5M0J35j21L62o8j99M48j72K25K45K9J78M00j67J79J80o8o8
$$ -663 -612 -583 -720 -741 -686 -646 -511 -632 -270 -338 -537 -89 -261 -36 209 238 416 816 649 828 1008 940 872
7594H72J56R1n4l60J9l55oR0j83l09Q7k63J9q1k17n8L49j54p2R2k73K23J05L9
$$ 872 1028 1119 1065 705 724 369 363 453 270 -39 48 -215 -196 -277 -494 -552 -203 -357 -429 -337 -610 -387 -282 -243
7618b43J27J77k45J66J66l4L44m82l5k74j2K32l21J31q3k51R1l54K03n3R7k93
$$ -243 -116 61 -184 -18 148 114 458 -24 -59 -333 -345 -113 -434 -303 -386 -637 -546 -900 -697 -750 -653 -946
7640i46J84K04K3J17M1J55L96K78N5J82L33J75Q5pM1O8L3q0l19K18l88J67l81
$$ -946 -762 -558 -535 -418 -377 -222 174 452 507 689 1022 1197 1282 1275 1316 1384 1417 1337 1018 1236 848 1015 634
7663F34j67j45k25l21p7j41l21j7J20k59j19K13J5N0l1R3L86o7J06N7J94j2J38
$$ 634 467 322 97 -224 -301 -442 -763 -780 -660 -919 -1038 -825 -810 -760 -791 -698 -312 -379 -273 -216 -22 -34 104
7686A04p7J02N5J42j95l4j92j95L98n29K34k49P1J29j06k28j0J07K36M9K93n5
$$ 104 27 129 184 326 131 97 -95 -290 108 -421 -187 -436 -365 -236 -342 -570 -580 -473 -237 -188 105 50
7708E0J63L89P6J85K16N8L6R4j25L17j85J56m01N9k40l17Q8j79l63k50k23J08
$$ 50 213 602 678 863 1079 1137 1173 1267 1142 1459 1274 1430 1029 1088 848 531 619 440 77 -173 -396 -288
7730b88m13m33K36k05j82K90p5j11R1K35L2J09J18J84J27L00m1P6m1K02K40j4
$$ -288 -701 -1134 -898 -1103 -1285 -995 -1070 -1181 -1090 -855 -823 -714 -596 -412 -285 15 -26 50 9 211 451 437
7752D37M2p0r1r0j39j49mJ40j56j47Jm6K81j83R1J17j19M57j56L9K27m9J37q1
$$ 437 479 409 318 228 89 -60 -64 76 -80 -227 -226 -272 9 -174 -83 34 -85 372 216 255 482 433 570 489
7776D89K27J59r0M7l1J85k13q2m5j35j64k31l1l17J07k36k66o9r3l4Q5k01O2r1
$$ 489 716 875 785 832 801 986 773 691 646 511 347 116 85 -232 -125 -361 -627 -696 -789 -823 -738 -939 -877 -968
7800i68j50L87o8J51q1K19L83J3Q2k5M90j50J95j33o8R2l6K48k15kn2J2p2k58
$$ -968 -1118 -731 -799 -648 -729 -510 -127 -114 -32 -57 433 283 478 345 277 369 333 581 366 364 312 324 252 -6
7824fj30J23J93m99R9kK60q0Rq8k01M62qJ31j8M1P0j76m4J01P1r6L9m6j26j7N8
$$ -6 -136 -13 180 -319 -220 -222 38 -42 -33 -121 -322 140 132 263 245 286 356 180 136 237 308 212 251 205 79 62 120
7851A20j26o5k46p2J57k30J99J24l02J18j33K18r7J04k03K41J82k68l5K06K31
$$ 120 -6 -71 -317 -389 -232 -462 -263 -139 -441 -323 -456 -238 -335 -231 -434 -193 -11 -279 -314 -108 123
7872A23P8k17L6J57n2J41J2l71N26m48J77J74m19K10J03k56J83k4l39K35R4j25
$$ 123 201 -16 20 177 125 266 278 -93 433 -15 162 336 -83 127 230 -26 157 133 -206 29 123 -2
7894bQ1l76J28P4j46L80j30k9J9j64k41L43n6J40L3j02J48L2j19J73k54K06m8
$$ -2 79 -297 -169 -95 -241 139 9 -20 -1 -165 -406 -63 -119 21 54 -48 100 132 13 186 -68 138 90
7917I0K7L1%N4j15L64l32M3J44j10j85K56m7l04J66O0l06J22Oj89mK6M4Pj23k6
$$ 90 117 148 148 202 87 451 119 162 306 196 11 267 220 -84 82 142 -164 -42 -36 -225 -229 -203 -159 -152 -275 -301
7943c01Q4J65l40L30k80M50k28O2M4l8K36j94K13p2j55J55p9q6j53j10l0L5j12
$$ -301 -217 -52 -392 -62 -342 108 -120 -58 -14 -52 184 -10 203 131 -24 131 52 -34 -187 -297 -327 -292 -404
7966d04R8o7j5L25K73l92L65K7q5R3Q6L88l53J58j72K75J83j92j92K89l49K84
$$ -404 -306 -373 -388 -63 210 -182 183 210 125 218 304 692 339 497 325 600 783 591 399 688 339 623
7988F23j21k72k08J44k69J95k17l24P9j58k2j36j33r8N4L45j11n0L10k37J96J07
$$ 623 502 230 22 166 -103 92 -125 -449 -370 -528 -550 -686 -819 -917 -863 -518 -629 -679 -369 -606 -410 -303
8010c03J7L74j75K05j28J47J00o4L55k51J98k30k1R1j58J65j34j80K10j32k60
$$ -303 -286 88 -87 118 -10 137 237 173 528 277 475 245 224 315 157 322 188 8 218 86 -174
8031a74K29jJ53K6j31j6P7O9j39M33l9k48M36j56j58M77l6j06j73J52l20k59k5
$$ -174 55 54 207 233 102 86 163 232 93 526 487 239 675 519 361 838 802 696 523 675 355 96 71
8054G1j41j77J37o14L7j97J27l33L2q7P6K7J46J07q5J38K73K06q1M27j46K00K59
$$ 71 -70 -247 -110 -724 -687 -884 -757 -1090 -1058 -1145 -1069 -1042 -896 -789 -874 -736 -463 -257 -338 89 -57 143 402
8077D02M7J35r8J75P8m7j35M69k66n34N8L40l30l9m47K94j76Pmj42J66L30N6l29
$$ 402 449 584 486 661 739 692 557 1026 760 226 284 624 294 255 -192 102 -74 -67 -71 -213 -47 283 339 10
8101A0R0K45J44m23K37L3J83k42R4K4j73L09k9l30j72j43l22K23j52l66q0j42
$$ 10 100 345 489 66 303 336 519 277 371 395 222 531 502 172 0 -143 -465 -242 -394 -760 -840 -982
8123i82k2k9j5L4m0L6J00P1K79j33Q3L54J52K44L99N5j54K79J74j21J57k02K84
$$ -982 -1004 -1033 -1048 -1014 -1054 -1018 -918 -847 -568 -701 -618 -264 -112 132 531 586 432 711 885 764 921 719 1003
8146A003k59l3K96l61l05Q3j33k84P8j2J05m00J0M5J9J0r4O1J44J30j27q0K2L77
$$ 1003 744 711 1007 646 341 424 291 7 85 73 178 -222 -212 -167 -148 -138 -232 -171 -27 103 -24 -104 -82 295
8170B95O4j87j8J71l44J98p8pk89J03k98Q2rl29J31l39J70k04j7O6K70
$$ 295 359 172 154 325 -19 179 101 94 -195 -92 -390 -308 -317 -646 -515 -854 -684 -888 -905 -839 -569
8191e69
$$ Imaginary data points
##PAGE= N=2
##DATA TABLE= (X++(I..I)), XYDATA
0@%%%%%%%%%%%lLqJ6j6J6k4L2l5M1m8N8p1Q1r2J08j26J45j67J92k18K49k84L21
$$ 0 0 0 0 0 0 0 0 0 0 0 0 -3 0 -8 8 -8 8 -16 16 -19 22 -26 32 -39 42 -50 58 -68 77 -90 102 -116 133 -151 170
35A70l61M06m56N09n67O32p05P83q68R62j063J174j294J427j572J730j906K103
$$ 170 -191 215 -241 268 -299 333 -372 411 -457 505 -558 616 -678 749 -823 907 -999 1104
53A104k320K560k831L140l492L898m375M946n639O501p610R101j1226J4512k0355
$$ 1104 -1216 1344 -1487 1653 -1839 2059 -2316 2630 -3009 3492 -4118 4983 -6243 8269 -12086
68a2086L3944j27064o7602J54835Q4238J11747Q5382R7228O2433O2942M2514L4588
$$ -12086 21858 -105206 -172808 -17973 66265 178012 263394 360622 423055 485997 528511 563099
80E63099P68Q07j9749l4363m8906m7856o3029o6403o9156o1134o6341o0760m8341
$$ 563099 563867 564674 544925 510562 461656 413800 350771 284368 215212 154078 87737 26977 -21364
93b1364l9830l8293k0007j0926m458L366J5251K1099K2136K5210L2695K4172J9822
$$ -21364 -61194 -99487 -119494 -130420 -134878 -131512 -116261 -95162 -73026 -47816 -15121 9051 28873
106B8873K1304J3210J384l309j0103j9560l0895l3941l6639m8120m8490m2057
$$ 28873 50177 63387 64771 61462 51359 31799 904 -33037 -69676 -117796 -166286 -208343
118b08343m5945m3655l3472k6154k0725j1223M460J3830J9510L5983M7702M8639
$$ -208343 -254288 -297943 -331415 -357569 -378294 -389517 -385057 -371227 -351717 -315734 -268032 -219393
130b19393N9422O7867O7995O8109O9598O9190O0351N2423N0969L8607K3546J8366
$$ -219393 -159971 -92104 -24109 44000 113598 182788 243139 295562 346531 385138 408684 427050
142D27050P250q287j7504k4748l4245m5519m9351m9289n7127n8427n0919n1311
$$ 427050 434300 426013 408509 383761 349516 303997 254646 205357 148230 89803 38884 -12427
154a2427m9319m0604l3043k7767k1271j0475j438J2Q875J7733J6992J9670K4528
$$ -12427 -61746 -102350 -135393 -163160 -184431 -194906 -196344 -196332 -187457 -169724 -152732 -133062 -108534
167a08534K3996K0969J9091J9407J3975O059O092K770p562q026r051j5192j7771
$$ -108534 -84538 -63569 -44478 -25071 -11096 -5037 1055 3825 -3737 -11763 -20814 -36006 -53777
180e3777j6176j5015j7125j5505p655o233n648M205R412J0032J7311K3639K6558
$$ -53777 -69953 -84968 -102093 -117598 -125253 -131486 -137134 -132929 -123517 -113485 -96174 -72535 -45977
193d5977K6954L1308L5586L0671K9797L2711K6774K0174J8858J3971O092o25l634
$$ -45977 -19023 12285 47871 78542 108339 141050 167824 187998 206856 220827 226919 226294 222660
206B22660r206j9032k0412k2102k9909l1517k9725l1653l2548l0730k5219k4483
$$ 222660 213454 194422 174010 151908 121999 90482 60757 29104 -3444 -34174 -59393 -83876
218h3876k3851j4860j1252j1292l429J953L288O529J1052J4770J3849J4550J9849
$$ -83876 -107727 -122587 -133839 -145131 -148560 -146607 -143319 -136790 -125738 -110968 -97119 -82569 -62720
231f2720J6583J3333J7007J4957R400R346Q752N602M07J211J137m314n552j542
$$ -62720 -46137 -32804 -15797 -840 8560 17906 26658 32260 32667 33878 35015 30701 25149 23607
245B3607n565p427l924l261m474m039n53R71j804K183N291J503L211O071N106
$$ 23607 18042 10615 6691 3430 -1044 -5083 -5636 -4665 -6469 -4286 1005 2508 5719 11790 16896
260A6896L256M141N413K805Q7L149J612l386r77q95m700n116m127m136p215o739
$$ 16896 20152 24293 29706 32511 32598 35747 37359 33973 32996 32101 27401 22285 18158 14022 6807 68
276F8l209n771p378l008l422n031k740q22q35k368R08L466J15J010N790L051K110
$$ 68 -3141 -8912 -16290 -19298 -22720 -27751 -30491 -31313 -32148 -34516 -33608 -30142 -30027 -29017 -23227 -20176 -18066
293a8066N728N713M088M087O757O037K744N870O947K308K820N313J875M11M28
$$ -18066 -12338 -6625 -2537 1550 8307 14344 17088 22958 29905 32213 35033 40346 42221 42632 43060
308D3060J051k516m640k289m452q811o519o752j0588j0092q766r526j1010j0011
$$ 43060 44111 41595 36955 34666 30214 21403 14884 8132 -2456 -12548 -21314 -30840 -41850 -51861
322e1861o407q088q026k519k294k442J522M598N195O678J0065J2827J0539J2845
$$ -51861 -58268 -66356 -74382 -76901 -79195 -81637 -80115 -75517 -70322 -63644 -53579 -40752 -30213 -17368
336a7368J6467J3159J2684J4918J3039J0098Q557Q732N377M59J535k60o289o266
$$ -17368 -901 12258 24942 39860 52899 62997 71554 80286 85663 86122 87657 87397 81108 74842
350G4842n879r792j1550j0432r961j1961j2027p447p861q917m099k406k660l08
$$ 74842 68963 59171 47621 37189 27228 15267 3240 -4207 -12068 -20985 -25084 -27490 -30150 -30458
364c0458L018L877L481M959P750M729L788O751L460L39L91o08m662p097p116q195
$$ -30458 -27440 -23563 -20082 -15123 -7373 -2644 1144 7895 11355 11694 12085 11477 6815 -282 -7398 -15593
380a5593j2775j1884j0154j3541j2840r075q575p875m596l63J642L065R262J2722
$$ -15593 -28368 -40252 -50406 -63947 -76787 -85862 -94437 -102312 -106908 -107271 -105629 -102564 -93302 -80580
394h0580J2557J7087K1027K0231K1179K3557K3662K0970J9450J9758J6100J0326
$$ -80580 -68023 -50936 -29909 -9678 11501 35058 58720 79690 99140 118898 134998 145324
406A45324J0096N516p24l793o194j0988j5931j7370j8185k2617k3909k0672k2511
$$ 145324 155420 160936 160212 156419 150225 139237 123306 105936 87751 65134 41225 20553 -1958
419a958k2583j8450j6246j4515j2148o375l413k813K139P105O111Q436J2056J1358
$$ -1958 -24541 -42991 -59237 -73752 -85900 -92275 -95688 -98501 -96362 -89257 -83146 -74710 -62654 -51296
433e1296J0354J1009J1064Q397N316N805L068k316j998l657p320q764q373q924
$$ -51296 -40942 -29933 -18869 -10472 -5156 649 3717 1401 -597 -4254 -11574 -20338 -28711 -37635
447c7635j0472r600o139n792n176L33K860L857Q442J2646J4338J5872J9801K2287
$$ -37635 -48107 -57707 -63846 -69638 -74814 -74481 -71621 -67764 -59322 -46676 -32338 -16466 3335 25622
461B5622K0741K0855K3318J9729J6771J6310J2708P580L003J091m127j0650j2888
$$ 25622 46363 67218 90536 110265 127036 143346 156054 163634 166637 167728 163601 152951 140063
474A40063j5550k1187k3915k3001k6103k7164k5942k3880k3331k1795j5735j3346
$$ 140063 124513 103326 79411 56410 30307 3143 -22799 -46679 -70010 -91805 -107540 -120886
486a20886j2172n662n57M60M837R173J1819J2872J4904J7634J6559J4826J6864
$$ -120886 -133058 -138720 -139277 -138817 -133980 -124807 -112988 -100116 -85212 -67578 -51019 -36193 -19329
499a9329J4598J0562R741Q103M467Q28N0j477o337o709n250q166q593n690n161
$$ -19329 -4731 5831 15572 23675 28142 28970 29020 27543 21206 14497 9247 1081 -7512 -13202 -18363
514a8363m940k653J196L253L391Q158J0905J0435J2751J5871J4516J3578J4268
$$ -18363 -23303 -25956 -24760 -21507 -18116 -9958 947 11382 24133 40004 54520 68098 82366
527H2366J4067J0409P524P254L472k245l413o244j2267j4451j5940j8797k2209
$$ 82366 96433 106842 114366 121620 125092 122847 119434 113190 100923 86472 70532 51735 29526
540B9526k2316k0793k3380k3086j8340j7707j6934j1864q065n230k592K928O657
$$ 29526 7210 -13583 -36963 -60049 -78389 -96096 -113030 -124894 -132959 -138189 -140781 -137853 -131196
553a31196P847J1209J5753J5571J5904J8888J8023J6660J5543J5576J2725R057
$$ -131196 -123349 -112140 -96387 -80816 -64912 -46024 -28001 -11341 4202 19778 32503 41560
565D1560Q768O226J650q3r6l922o314o064o376p924q380n121n640o201k384n02
$$ 41560 50328 56554 58204 58121 58025 54103 47789 41725 35349 27425 19045 13924 8284 2083 -301 -803
581h03o85J535M317N445N023O919Q681O703O352P946N506K282L178N36k679m607
$$ -803 -1488 47 4364 9809 14832 21751 30432 37135 43487 51433 56939 59221 62399 62935 60256 55649
597E5649n494p644j1547j1525j1389j4840j4976j2489j3612j3326j1299q461p316
$$ 55649 50155 42511 30964 19439 8050 -6790 -21766 -34255 -47867 -61193 -72492 -80953 -88269
610h8269o599j804Q57L39N172P693Q551J0172J1995J3748J2678J3018J4534J2682
$$ -88269 -94868 -96672 -95815 -95476 -90304 -82611 -74060 -63888 -51893 -38145 -25467 -12449 2085 14767
624A4767J0331J0991R712N869N048M087J448j336k207k550n791o777m940p161
$$ 14767 25098 36089 45801 51670 56718 60805 62253 60917 58710 56160 50369 43592 38652 31491
638C1491q191o216n709o163n392k926k300l003r9J596L89J286L966K467K272K862
$$ 31491 23300 17084 11375 5212 -180 -3106 -5406 -8409 -8508 -6912 -6523 -5237 -1271 1196 3468 6330
654F330L287K043J91J398R40k786j283k076m134m759l836m499n639n359l655m493
$$ 6330 9617 11660 11851 13249 14189 11403 10120 8044 3910 -849 -4685 -9184 -14823 -20182 -23837 -28330
670b8330m557k046j502k257M58J535J933K346M031N456M630M832P128N799M953
$$ -28330 -32887 -34933 -36435 -38692 -38234 -36699 -34766 -32420 -28389 -22933 -18303 -13471 -6343 -544 4409
685D409O160N663M114L666L771K680J75J000J157k375k087j048l282l959l623
$$ 4409 10569 16232 20346 24012 27783 30463 30638 31638 32795 30420 28333 27285 24003 20044 16421
700A6421l102m240m763k759k920m653k577j185k997j456p74l73j045j97J754Q21
$$ 16421 13319 9079 4316 1557 -1363 -6016 -8593 -9778 -12775 -14231 -15005 -15378 -16423 -16620 -14866 -14045
716a4045k80K923J504N43K429K492J764J353K257K736Q20J272L204O10K19J948
$$ -14045 -14325 -11402 -9898 -9355 -6926 -4434 -2670 -1317 940 3676 4496 5768 8972 9582 9801 11749
732A1749Q46q9j1N78k10j787o01j22k618k264o30k288k846j811j998k274k759
$$ 11749 12595 12506 12495 13073 12863 11076 10475 10353 7735 5471 4841 2553 -293 -2104 -4102 -6376 -9135
749i135q42j026k564j32M01j027K69J350J068O17J374K722J413P02K796J853J60
$$ -9135 -9977 -11003 -13567 -13699 -13298 -14325 -14056 -12706 -11638 -11021 -9647 -6925 -5512 -4810 -2014 -161 -1
766aJ309J323Ro30M1k87j815j510j77j905k380R5q52r54n65J217J232O49K294
$$ -1 1308 2631 2640 2010 2051 1764 -51 -1561 -1738 -3643 -6023 -5928 -6780 -7734 -8299 -7082 -5850 -5201 -2907
785b907L675K233L672N140L711L612M645M350L427K382K904J534q87j86r64l869
$$ -2907 768 3001 6673 11813 15524 19136 23781 28131 31558 33940 36844 38378 37491 37305 36341 32472
801C2472m200m691n967p169p166o940q479q451o522p030p199m656l695l009k148
$$ 32472 28272 23581 17614 10445 3279 -3661 -12140 -20591 -27113 -34143 -41342 -45998 -49693 -52702 -54850
816e4850N34J862J732L887O450N129O074Q343P754O740P499P608O008M733N013
$$ -54850 -54316 -52454 -50722 -46835 -40385 -35256 -29182 -20839 -13085 -6345 1154 8762 14770 19503 24516
831B4516M161J000J220J071k012k254k377l050m220m245k910l442l964j760r24
$$ 24516 28677 29677 30897 31968 29956 27702 25325 22275 18055 13810 10900 7458 3494 1734 810
846H10j536J33J975J626K507L578M489L814L308N130L550J832K724J215p38j869
$$ 810 -726 -593 1382 3008 5515 9093 13582 17396 20704 25834 29384 31216 33940 35155 34417 32548
862C2548k469m030o344o776o515r648r571q518r311r659q449o661o522n701k438
$$ 32548 30079 26049 19705 12929 6414 -3234 -12805 -21323 -30634 -40293 -48742 -55403 -61925 -67626 -70064
877g0064q34o61K527N129N473O833R297J0072J0029J0541J2009J0887R239J0261
$$ -70064 -70898 -71559 -69032 -63903 -58430 -51597 -42300 -32228 -22199 -11658 351 11238 20477 30738
891C0738R052N681N795M480J683p5r98j766m698n642m587o867p873n701o325o763
$$ 30738 39790 45471 51266 55746 57429 57354 56356 54590 49892 44250 39663 32796 24923 19222 12897 6134
907F134n323l633l481l082q68J096jJ631L446L110K523L918L500K553J379J858
$$ 6134 811 -2822 -6303 -9385 -10253 -9157 -9158 -7527 -4081 -971 1552 5470 8970 11523 12902 14760
923A4760Q74j721k204k061m862n713n398o288q072p211o167p166o854m249l354
$$ 14760 15634 13913 11709 9648 4786 -927 -6325 -12613 -20685 -27896 -34063 -41229 -48083 -52332 -55686
938e5686l634o19J161J998L544N831P469P515Q870J0917J0349R797J1222J0056
$$ -55686 -59320 -59939 -58778 -56780 -53236 -47405 -39936 -32421 -23551 -12634 -2285 7512 18734 28790
952B8790Q614Q231P266N526K852K370J082k110l260l468o019p137p198p567q027
$$ 28790 37404 45635 52901 58427 61279 63649 64731 62621 59361 55893 49874 42737 35539 27972 19945
967A9945q932o674o976p675m894l952l730k489k45J36N54J856L417K571K984L987
$$ 19945 11013 4339 -2637 -10312 -15206 -19158 -22888 -25377 -25622 -25486 -24932 -23076 -19659 -17088 -14104 -10117
983a0117L338J790L240K313N30k6Q4r34k608k925k127l854m154k534l418l734
$$ -10117 -6779 -4989 -1749 564 1094 1068 1152 218 -2390 -5315 -7442 -11296 -15450 -17984 -21402 -25136
999b5136k058j321p05o71J337K794K126M041N731N008N469O719O761O078N430
$$ -25136 -27194 -28515 -29220 -29891 -28554 -25760 -23634 -19593 -13862 -8854 -3385 3334 10095 16173 21603
1014B1603O642M964L055L708K909M75l25o68k359l362m367l926n871o320n415
$$ 21603 28245 33209 36264 39972 42881 43356 43031 42363 40004 36642 32275 28349 22478 16158 10743
1029A0743n871p088n018m673m989m038k664k004k328n76J342N03Q93L393K322
$$ 10743 4872 -2216 -7234 -11907 -16896 -20934 -23598 -25602 -27930 -28506 -27164 -26661 -25768 -22375 -20053
1044b0053K419L223L847K862K141L479K930Q75J588J907K63M61J55j17j006q42
$$ -20053 -17634 -14411 -10564 -7702 -5561 -2082 848 1723 3311 5218 5481 5942 6097 5980 4974 4132
1060D132l10j077k098j9k28j295o06M22K7m26L81J257K15L46J663P45J83J188
$$ 4132 3822 2745 647 628 400 -895 -1501 -1079 -1052 -1478 -1097 160 375 721 2384 3129 3312 4500
1078D500J121p6K73M30M24o76l11M3j030j431J08j239j198q57p26j284j528k81
$$ 4500 5621 5545 5818 6248 6672 5996 5685 5728 4698 3267 3375 2136 938 81 -645 -1929 -3457 -3738
1096c738o19j308o27L64r16J3Q7L75k15M04J157P15k25J772J311P64J499K235
$$ -3738 -4357 -5665 -6292 -5928 -6844 -6831 -6744 -6369 -6584 -6180 -5023 -4308 -4533 -2761 -1450 -686 813 3048
1114C048J140J391K201J985J027R73K210N44J87O77Q4j057j060p84j669l099k422
$$ 3048 4188 5579 7780 9765 10792 11765 13975 14519 14706 15383 15467 14410 13350 12566 10897 7798 5376
1131E376k415l605l548k993m230l691l223k687k889k816j002k05j298O44K158
$$ 5376 2961 -644 -4192 -7185 -11415 -15106 -18329 -21016 -23905 -26721 -27723 -27928 -29226 -28582 -26424
1146b6424J364K433M092L617L878M735N425M689L874N033M365L009L162K901J096
$$ -26424 -25060 -22627 -18535 -14918 -11040 -6305 -880 3809 7683 12716 17081 20090 23252 26153 27249
1161B7249M08J95j75j883k595j715k932m175k963k879l679l135k121k154k197
$$ 27249 27657 27852 27677 25794 23199 21484 18552 14377 11414 8535 4856 1721 -400 -2554 -4751
1176d751o63P4m94P03J939J171J345K578K231J516J164J509Q85q76p26j187l174
$$ -4751 -5414 -5340 -5834 -5131 -3192 -2021 -676 1902 4133 5649 6813 8322 9207 8331 7605 6418 3244
1193C244l141l452m349n073n105m693n540m891l689l044l292j222r2Q89J825L564
$$ 3244 103 -3349 -7698 -12771 -17876 -22569 -28109 -33000 -36689 -39733 -43025 -44247 -44339 -43450 -41625 -38061
1209c8061N027N091O929Q153P850Q398R395Q817P658P796O837N817L708K909K315
$$ -38061 -33034 -27943 -21014 -12861 -5011 3387 12782 21599 29257 37053 43890 49707 53415 56324 58639
1224E8639m99j781k305m651n807n928p268p693q301p237p328p785o018m765n113
$$ 58639 58140 56359 54054 49403 43596 37668 30400 22707 14406 7169 -159 -7944 -13962 -18727 -23840
1239b3840l102j504q61j91J383K835K219K859M613L576L058L951K717J553J177
$$ -23840 -26942 -28446 -29307 -29498 -28115 -25280 -23061 -20202 -15589 -12013 -8955 -5004 -2287 -734 443
1254D43L49o68j764k561k451l744m885l857m435m555l318k594j880j025N73K202
$$ 443 792 124 -1640 -4201 -6652 -10396 -15281 -19138 -23573 -28128 -31446 -34040 -35920 -36945 -36372 -34170
1270c4170K639M252O258O180P682Q762R164Q982Q712R177Q285O193O508M783K585
$$ -34170 -31531 -27279 -21021 -14841 -7159 1603 10767 19749 28461 37638 45923 52116 58624 63407 65992
1285F5992J506j42k326m188m968o765q014r483q978r923j1047q995r543q966p282
$$ 65992 67498 67356 65030 60842 55874 49109 41095 31612 22634 12711 1664 -7331 -16874 -25840 -33122
1300c3122o256m596l637k053M31M91J737L992M330M830N653O117N632M702N345
$$ -33122 -39378 -43974 -47611 -49664 -49233 -48742 -47005 -43013 -38683 -33853 -28200 -22083 -16451 -11749 -6404
1315f404M807K720K709K277J4j39p72k170k547k868k388l027l572j430j938j260
$$ -6404 -1597 1123 3832 6109 6123 5984 5212 3042 495 -2373 -4761 -7788 -11360 -12790 -14728 -15988
1331a5988L53J250J776K570M230N127M978N678P183O434N301O534N395M011L578
$$ -15988 -15635 -14385 -12609 -10039 -5809 -682 4296 9974 17157 23591 28892 35426 40821 44832 48410
1346D8410K409J138o56k063k350n077n974o336p818q707q287q586q610q870p049
$$ 48410 50819 51957 51301 49238 46888 41811 35837 29501 21683 12976 4689 -3897 -12507 -21377 -28426
1361b8426o330o701m569k705k384m18J218K005L330M266N517N777N312P001O656
$$ -28426 -34756 -41457 -46026 -48731 -51115 -51533 -50315 -48310 -44980 -40714 -35197 -29420 -24108 -17107 -10451
1376a0451N322N926N284L700L535K914J879L66l6k8j697k332j994k283k906k457
$$ -10451 -5129 797 6081 9781 13316 16230 18109 18475 18439 18411 16714 14382 12388 10105 7199 4742
1392D742k011j613j680n50J35l5O85K429J304K044K998K766K218K554K756J961
$$ 4742 2731 1118 -562 -1112 -977 -1012 -327 2102 3406 5450 8448 11214 13432 15986 18742 20703
1408B0703J029P74L86j009j341j646l198l506l701m305m346n352m004m473m737
$$ 20703 21732 22506 22892 21883 20542 18896 15698 12192 8491 4186 -160 -5512 -9516 -13989 -18726
1423a8726l331l006k812j887j002L13k04J744K384K151L099M195M046L684M495
$$ -18726 -22057 -25063 -27875 -29762 -30764 -30451 -30655 -28911 -26527 -24376 -21277 -17082 -13036 -9352 -4857
1438d857M331L899L397L413L367J472J823K110l9l58P7p29j755j652j282k104
$$ -4857 -526 3373 6770 10183 13550 15022 16845 18955 18916 18558 18635 17906 16151 14499 13217 11113
1454A1113k526j941j689k652k034r18j430j645o36n76o56l06N52j12J81N99Q50
$$ 11113 8587 6646 4957 2305 271 -647 -2077 -3722 -4358 -4934 -5590 -5896 -5344 -5456 -5275 -4676 -3826
1471c826K54N55O29Q22O7L60Q07K67j95Q40L21q08O65l6Nk23K44K95p99J57M85
$$ -3826 -3572 -3017 -2388 -1566 -1499 -1139 -332 -65 -260 580 901 93 758 722 727 504 748 1043 244 401 886
1492H86k71l30PJ65l06n48P01J19n18L39M58m95K43P71R4k5M76P50j6k60J156
$$ 886 615 285 292 457 151 -397 304 423 -95 244 702 207 450 1221 1315 1290 1766 2516 2500 2240 3396
1513C396j87n25O87m58j102m62k94j178j572j041r22k008j883r37j217j935r63
$$ 3396 3209 2684 3371 2913 1811 1349 1055 -123 -1695 -2736 -3658 -5666 -7549 -8486 -9703 -11638 -12601
1530a2601o50q46o57K47J316J69J540K591J649K413L752L208K989L374L922L018
$$ -12601 -13251 -14097 -14754 -14507 -13191 -13022 -11482 -8891 -7242 -4829 -1077 2131 5120 8494 12416 15434
1546A5434K656K927K306J306J078O79j92j426j104j790l406l180l318m099m555
$$ 15434 18090 21017 23323 24629 25707 26386 26194 24768 23664 21874 18468 15288 11970 7871 3316
1561C316l757m206m324l622l041k997k309j418l94n78J58J948J414J426K808K791
$$ 3316 -441 -4647 -8971 -12593 -15634 -18631 -20940 -22358 -22752 -23330 -23172 -21224 -19810 -18384 -15576 -12785
1577a2785K742K602K940K506J947J460J818L20p1J66r38j040j226j592k150j538
$$ -12785 -10043 -7441 -4501 -1995 -48 1412 3230 3550 3479 3645 2707 1667 441 -1151 -3301 -4839
1593d839j533j102j528m8N63K0J358K239K499K997L660M421L956L901M832M145
$$ -4839 -6372 -7474 -9002 -9050 -8487 -8467 -7109 -4870 -2371 626 4286 8707 12663 16564 21396 25541
1609B5541L118L392K389J569n4J15j328k696l660m001n494o086n830o824o928
$$ 25541 28659 32051 34440 36009 35955 36070 34742 32046 28386 24385 18891 12805 6975 151 -6777
1624f777p002o150n966n982m114k846l131j082j05J135J611L079M120M283M830
$$ -6777 -13779 -19929 -25895 -31877 -35991 -38837 -41968 -43050 -43155 -42020 -40409 -37330 -33210 -28927 -24097
1639b4097O155N637N128N800N168M388L750L356K087J110Q26j95j288j605j736
$$ -24097 -17942 -12305 -7177 -1377 3791 8179 11929 15285 17372 18482 19308 19113 17825 16220 14484
1654A4484k662k883k632k314j880k414n53o61l26J003J918J781K551L496L477
$$ 14484 11822 8939 6307 3993 2113 -301 -854 -1515 -1841 -838 1080 2861 5412 8908 12385
1669A2385L397L415L399K868J894J741J177p69j213j715l502m121n011n737o325
$$ 12385 15782 19197 22596 25464 27358 29099 30276 29507 28294 26579 23077 18956 13945 8208 1883
1684A883o984o707o660p153o250m890n221l384k351q37l83J195L017L216M396
$$ 1883 -5101 -11808 -18468 -25621 -31871 -36761 -41982 -45366 -47717 -48554 -48937 -47742 -44725 -41509 -37113
1699c7113O308O247O417P504P355O808O387O101N773L831L614K599J096L29o60
$$ -37113 -30805 -24558 -18141 -10637 -3282 3526 9913 16014 21787 25618 29232 31831 32927 33256 32596
1714C2596j535k553l073l158l953m471l536l224l810k324j578j582j060K46P88
$$ 32596 31061 28508 25435 22277 18324 13853 10317 7093 3283 959 -619 -2201 -3261 -3015 -2227
1729b227J031J523K927K067K140K591K322J113J270Q43k34j293j354k583l664
$$ -2227 -1196 327 3254 5321 7461 10052 12374 13487 14757 15600 15366 14073 12719 10136 6472
1744F472m208l923n134n527m868n302m810m725l267k836k265q09N19J006K264
$$ 6472 2264 -1659 -6793 -12320 -17188 -22490 -27300 -32025 -35292 -38128 -40393 -41202 -40683 -39677 -37413
1759c7413L798M349N140N673O685O317O663O670O670N254N041M606L281K145J945
$$ -37413 -33615 -29266 -24126 -18453 -11768 -5451 1212 7882 14552 19806 24847 29453 32734 34879 36824
1774C6824L63q16j682j887l255m415l501m382m852m285m206l782l393k634j862
$$ 36824 37187 36371 34689 32802 29547 25132 21631 17249 12397 8112 3906 124 -3269 -5903 -7765
1789g765j865o28j16K43P54J470J736J790J753K184J262J316J075N97o76n18p04
$$ -7765 -9630 -10258 -10374 -10131 -9377 -7907 -6171 -4381 -2628 -444 818 2134 3209 3806 3130 2612 1908
1806A908j930k203k521k485l286k993k460k667l037j227q89j186K70R85J330K027
$$ 1908 -22 -2225 -4746 -7231 -10517 -13510 -15970 -18637 -21674 -22901 -23790 -24976 -24706 -23721 -22391 -20364
1822b0364K964L708M239L868N190M645M359M856L936L757K844K819J689Q51O5
$$ -20364 -17400 -13692 -9453 -5585 -395 4250 8609 13465 17401 21158 24002 26821 28510 29361 29426
1837B9426O9j821j960k311k848l966l638l577l900m284l257k915l278j937j905
$$ 29426 29495 27674 25714 23403 20555 16589 12951 9374 5474 1190 -2067 -4982 -8260 -10197 -12102
1852a2102j297n79l91N00N45P03J382J682J437J896K005J269J006J427L56Q25
$$ -12102 -13399 -13978 -14369 -13869 -13324 -12621 -11239 -9557 -8120 -6224 -4219 -2950 -1944 -517 -161 664
$$ [...]
8191c39
##END NTUPLES=NMR FID
##END=
