##TITLE=1H_Pr 4-Br
 CDCl3
 8 sc, 
 18.10.2022
##JCAMPDX= 6.0         $$ Bruker NMR JCAMP-DX V2.0
##DATA TYPE= NMR FID
##DATA CLASS= NTUPLES
##ORIGIN= UXNMR, Bruker Analytische Messtechnik GmbH
##OWNER= root
$$ XWIN-NMR		Version 3.5
$$ Tue Oct 18 16:55:54 2022 Russian Standard Time (UT+4h)  she@DPX200
##.OBSERVE FREQUENCY= 200.1313499994
##.OBSERVE NUCLEUS= ^1H
##.DELAY= (6, 6)
##.ACQUISITION MODE= SIMULTANEOUS
##.ACQUISITION SCHEME= undefined
##.AVERAGES= 8
##.DIGITISER RES= 18
##SPECTROMETER/DATA SYSTEM= spect
##.PULSE SEQUENCE= zg30
##.SOLVENT NAME= CDCl3
##.SHIFT REFERENCE= (INTERNAL, CDCl3, 0, 15.7039)
##AUDIT TRAIL= $$ (NUMBER, WHEN, WHO, WHERE, WHAT)
$$ ##TITLE= Audit trail, XWIN-NMR		Version 3.5
$$ ##JCAMPDX= 5.01
$$ ##ORIGIN= Bruker BioSpin GmbH
$$ ##OWNER= she
$$ F:/spectra/data/she/nmr/H-F/1/audita.txt
$$ ##AUDIT TRAIL=  $$ (NUMBER, WHEN, WHO, WHERE, WHAT)
(   1,<2022-10-18 16:54:27.43 +0400>,<she>,<DPX200>,
      <created by zg, POWCHK disabled, PULCHK disabled
       configuration hash MD5:
       00 E9 B6 7A A2 85 ED C7 34 08 36 98 17 FE 4E 26
       data hash MD5: 16K
       AC 7C 51 88 2D D9 C3 B2 42 71 E9 AA B3 D7 40 E9>)
$$ ##END=
$$ 
$$ hash MD5
$$ 73 B4 AA A6 06 A0 1D FC DC F3 6F 41 D4 C5 E9 F4
##$RELAX= 
##$RELAX= 
##$RELAX= 
##$RELAX= 
##$RELAX= 
##$RELAX= 
$$ Bruker specific parameters
$$ --------------------------
##$DU= <F:/spectra>
##$EXPNO= 1
##$NAME= <H-F>
##$PROCNO= 1
##$TYPE= <nmr>
##$USER= <she>
##$AMP= (0..31)
100 100 100 100 100 100 100 100 100 100 100 100 100 100 100 100 100 100 
100 100 100 100 100 100 100 100 100 100 100 100 100 100 
##$AQSEQ= 0
##$AQ_mod= 1
##$AUNM= <au_zg>
##$AUTOPOS= <>
##$BF1= 200.13
##$BF2= 200.13
##$BF3= 200.13
##$BF4= 200.13
##$BF5= 200.13
##$BF6= 200.13
##$BF7= 200.13
##$BF8= 200.13
##$BYTORDA= 1
##$CFDGTYP= 0
##$CFRGTYP= 5
##$CHEMSTR= <none>
##$CNST= (0..31)
1 1 145 1 1 1 1 1 1 1 1 1 1 1 1 1 1 1 1 1 1 1 1 1 1 1 1 1 1 1 1 1 
##$CPDPRG= <>
##$CPDPRG1= <>
##$CPDPRG2= <>
##$CPDPRG3= <>
##$CPDPRG4= <mlev>
##$CPDPRG5= <mlev>
##$CPDPRG6= <mlev>
##$CPDPRG7= <mlev>
##$CPDPRG8= <mlev>
##$CPDPRGB= <>
##$CPDPRGT= <>
##$D= (0..31)
0 1.2 0 0 0 0 0 0 0 0.06 0 0.03 0 0 0 0 0.0002 0 0 0 0 0 0 0 0 0 0 0 0 
0 0 0 
##$DATE= 1666097666
##$DBL= (0..7)
120 120 120 120 120 120 120 120 
##$DBP= (0..7)
150 150 150 150 150 150 150 150 
##$DBP07= 0
##$DBPNAM0= <>
##$DBPNAM1= <>
##$DBPNAM2= <>
##$DBPNAM3= <>
##$DBPNAM4= <>
##$DBPNAM5= <>
##$DBPNAM6= <>
##$DBPNAM7= <>
##$DBPOAL= (0..7)
0.5 0.5 0.5 0.5 0.5 0.5 0.5 0.5 
##$DBPOFFS= (0..7)
0 0 0 0 0 0 0 0 
##$DE= 6
##$DECBNUC= <off>
##$DECIM= 32
##$DECNUC= <off>
##$DECSTAT= 4
##$DIGMOD= 1
##$DIGTYP= 9
##$DL= (0..7)
0 120 120 120 120 120 120 120 
##$DP= (0..7)
150 150 150 150 150 150 150 150 
##$DP07= 0
##$DPNAME0= <>
##$DPNAME1= <>
##$DPNAME2= <>
##$DPNAME3= <>
##$DPNAME4= <>
##$DPNAME5= <>
##$DPNAME6= <>
##$DPNAME7= <>
##$DPOAL= (0..7)
0.5 0.5 0.5 0.5 0.5 0.5 0.5 0.5 
##$DPOFFS= (0..7)
0 0 0 0 0 0 0 0 
##$DQDMODE= 0
##$DR= 18
##$DS= 0
##$DSLIST= <SSSSSSSSSSSSSSS>
$$ [...]
##$SUBNAM2= <"">
##$SUBNAM3= <"">
##$SUBNAM4= <"">
##$SUBNAM5= <"">
##$SUBNAM6= <"">
##$SUBNAM7= <"">
##$SUBNAM8= <"">
##$SUBNAM9= <"">
##$SW= 18.0517283424941
##$SWIBOX= (0..15)
0 0 2 0 0 0 0 0 0 0 0 0 0 0 0 0 
##$SW_h= 3612.71676300578
##$TD= 16384
##$TD0= 1
##$TE= 0
##$TE2= 300
##$TE3= 300
##$TEG= 300
##$TL= (0..7)
0 120 120 120 120 120 120 120 
##$TP= (0..7)
150 150 150 150 150 150 150 150 
##$TP07= 0
##$TPNAME0= <>
##$TPNAME1= <>
##$TPNAME2= <>
##$TPNAME3= <>
##$TPNAME4= <>
##$TPNAME5= <>
##$TPNAME6= <>
##$TPNAME7= <>
##$TPOAL= (0..7)
0.5 0.5 0.5 0.5 0.5 0.5 0.5 0.5 
##$TPOFFS= (0..7)
0 0 0 0 0 0 0 0 
##$TUNHIN= 0
##$TUNHOUT= 0
##$TUNXOUT= 0
##$USERA1= <user>
##$USERA2= <user>
##$USERA3= <user>
##$USERA4= <user>
##$USERA5= <user>
##$V9= 5
##$VALIST= <valist>
##$VCLIST= <CCCCCCCCCCCCCCC>
##$VD= 0
##$VDLIST= <DDDDDDDDDDDDDDD>
##$VPLIST= <PPPPPPPPPPPPPPP>
##$VTLIST= <TTTTTTTTTTTTTTT>
##$WBST= 1024
##$WBSW= 4
##$XGAIN= (0..3)
0 0 0 0 
##$XL= 0
##$YL= 0
##$YMAX_a= 77025
##$YMIN_a= -100520
##$ZGOPTNS= <>
##$ZL1= 120
##$ZL2= 120
##$ZL3= 120
##$ZL4= 120
##$ABSF1= 10
##$ABSF2= 0
##$ABSG= 5
##$ABSL= 3
##$ALPHA= 0
##$AQORDER= 0
##$ASSFAC= 0
##$ASSFACI= 0
##$ASSFACX= 0
##$ASSWID= 0
##$AUNMP= <proc_1d>
##$AZFE= 0.1
##$AZFW= 0.1
##$BCFW= 1
##$BC_mod= 2
##$BYTORDP= 1
##$COROFFS= 0
##$CY= 11.3945322036743
##$DATMOD= 1
##$DC= 2
##$DFILT= <>
##$DTYPP= 0
##$F1P= 2.36226072786647
##$F2P= -0.459571619588291
##$FCOR= 0.5
##$FTSIZE= 0
##$FT_mod= 4
##$GAMMA= 1
##$GB= 0.15
##$INTBC= 1
##$INTSCL= 1
##$ISEN= 128
##$LB= 0.24
##$LEV0= 0
##$LPBIN= 0
##$MAXI= 10000
##$MC2= 0
##$MEAN= 0
##$ME_mod= 0
##$MI= 1.114404
##$NCOEF= 0
##$NC_proc= 0
##$NLEV= 6
##$NOISF1= 3.799351
##$NOISF2= 2.8
##$NSP= 1
##$NTH_PI= 0
##$NZP= 0
##$OFFSET= 15.70392
##$PC= 1
##$PHC0= -18032.05
##$PHC1= 9.400702
##$PH_mod= 1
##$PKNL= yes
##$PPARMOD= 0
##$PSCAL= 0
##$PSIGN= 0
##$REVERSE= no
##$SF= 200.130013532006
##$SI= 16384
##$SIGF1= 3
##$SIGF2= 2
##$SINO= 400
##$SIOLD= 16384
##$SREGLST= <1H.CDCl3>
##$SSB= 0
##$STSI= 0
##$STSR= 0
##$SW_p= 3612.71676300578
##$SYMM= 0
##$S_DEV= 0
##$TDeff= 0
##$TDoff= 0
##$TI= <>
##$TILT= no
##$TM1= 0
##$TM2= 0
##$TOPLEV= 0
##$USERP1= <user>
##$USERP2= <user>
##$USERP3= <user>
##$USERP4= <user>
##$USERP5= <user>
##$WDW= 1
##$XDIM= 8192
##$YMAX_p= 0
##$YMIN_p= 0
$$ End of Bruker specific parameters
$$ ---------------------------------
##NTUPLES= NMR FID
##VAR_NAME=  TIME,          FID/REAL,        FID/IMAG
##SYMBOL=    X,             R,               I
##VAR_TYPE=  INDEPENDENT,   DEPENDENT,       DEPENDENT
##VAR_FORM=  AFFN,          ASDF,            ASDF
##VAR_DIM=   8192,          8192,            8192
##UNITS=     SECONDS,       ARBITRARY UNITS, ARBITRARY UNITS
##FACTOR=    0.0002768,     1,               1
##FIRST=     0,             0,               0
##LAST=      2.2672688,     0,               0
##MIN=       0,             -100520,         0
##MAX=       2.2672688,     77025,           0
$$ Real data points
##PAGE= N=1
##DATA TABLE= (X++(R..R)), XYDATA
$$ [...]
1922a218RJ058R90n08j358n33P14J527N47j223r09J60Q78J125o6j304j082K25
1940i68J514Q82p91j237n53J103J113J57j197o36L6P89O94l31j030j043P21J428
1958F51J91r41j317J19J185J049r0j260o22L09J457P12m38j715k30Q72J127N0
1976A109r95r99j63J204J103m44j294p16P91J098L69p69j159j34P25J132j16q12
1994g0j183J87J046J193p43j224n24J006J092L31r33q31J57J006Q24m55q04j026
2012i51N62J015N00p55j235l42J107R59k81q77r99L40J241M74l94r55n44R02O56
2031D23O10j006j313J56J163J052j34j259o39P98J003P53j134q93n93Q86J074
2048I47J47j145j292L26Q68J094q91r63k94N16J261L79q96p89k01J087Q14J02
$$ y = [-1218, -1209, -151, 839, 331, -1027, -1560, -846, 681, 1228, 5, -904, -744, 134, 1259, 1193, -111, -1193, -968, 546, 1428, 637, -600, -1153, -50, 1063, 1220, 23, -613, -577, 212, 906, 575, -455, -1498, -777, 651, 842, -99, -1416, -1297, -112, 937, 847, -413, -1035, -726, 731, 1443, 1005, -710, -940, -68, 1059, 1109, 114, -885, -1048, 156, 1259, 815, -479, -1195, -404, 694, 1063, 294, -865, -999, -274, 858, 742, -70, -1253, -1066, -20, 1173, 430, -794, -1318, -312, 780, 1111, 178, -653, -496, 510, 1334, 879, 75, -951, -389, 626, 1126, 371, -864, -1206, -99, 860, 579, -298, -1297, -957, 284, 758, 364, -591, -1135, -233, 423, 1033, 27, -1286, -1130, 33, 1085, 951, -308, -947, -149, 854, 1607, 473, -420, -1013, -127, 947, 1094, -51, -1343, -1017, -149, 945, 54, -909, -1203, -687, 574, 953, 57, -732, -933, 154, 968, 1070]
2066A070j226o97P4Q46J290q56j209m66J120J218k01j134n49J62J102O05m60j216
2084e27k71J98J022K10q76r94j55R70J232m86q03m27L35J566K22o23r16k39M18
2103a44Q45K75p71j331n9J071J007p29q58o39J051J090M47q33r92k76O84J010
2121H48l57j143m10k7R25Q16m42j271J39P52J379j33p94p27O8J510K89o52r37
2140a67n33J31O58M05m75j211q5R63Q70N4o70o68P3J146M45l89q36l45M32R68
2160G66j62p45o83l35R80R99l00r16m36M26J245K58m91j017j66O88Q08k40j112
2179d33m02J21Q32N39n85o22p42J099Q81K37p93q24N0R19O95k55r71l06J38R38
2199E16M51p10p87j79P37R61m4j096o92M37Q18L78p32m42m56L94R17L09q06r11
$$ y = [1070, -156, -853, -779, 67, 1357, 501, -708, -1174, -54, 1164, 963, -171, -720, -558, 544, 1149, 689, -527, -798, -600, 422, 632, -244, -1238, -1393, -423, 809, 323, -480, -907, -572, 994, 1216, 593, -323, -562, -144, 701, 976, 205, -1126, -1185, -114, 893, 164, -694, -1333, -282, 808, 1255, 422, -570, -846, -162, 848, 491, -652, -1062, -1089, -164, 652, 210, -1061, -922, -170, 1209, 1076, 282, -445, -377, 1133, 1422, 770, -167, -700, -569, 89, 494, 19, -1192, -1277, -314, 556, 610, -60, -728, -655, 491, 936, 547, -289, -634, -202, 766, 604, -141, -824, -1159, -179, 820, 520, -396, -832, -406, 839, 1097, 606, -411, -577, 111, 919, 679, -433, -835, -714, 118, 657, 72, -550, -1292, -193, 688, 925, 132, -692, -642, 277, 972, 717, -254, -560, -422, 516, 967, 257, -530, -709, 28, 989, 945, -151, -843, -406, 412, 790, 58, -384, -840, -446, 471, 780, -26, -937]
2219i37K46P88N57K9j059m80L54J171J99p13n81l36Q44P31n7n90r92K53Q52N16
2239G95l45q85l82P24O43J74q58p09J77P73N74k52r51m45L46O89P23m30p88m31
2259h58R51N21K41o45q41J32P37N77j95p94n11M45O07L12n47p32k61O78R73l29
2279D61q49m90L7J342J17l61j060K3O00Q79k28n06l50l21J063M91j57q32m61L61
2299b41Q20J05n12p33j09Q65O35j13p55q27K43M87P10k42j077n53J021R07j7q25
2319b11p40J77R87M59j7p22n21M29O27K24k89o21l97O69M85Jm12p88M70M31R21
2340A162p02j069k79O60Q17j01n40n31p6M09P62k57n58o36N36R15K25m12m84l25
2360d84P16N69l8n02n81J35N79J39l9r45m29N80Q22J1q75l45k8P29L38J49r54
$$ y = [-937, -691, 97, 654, 683, -376, -856, -502, 669, 868, 155, -426, -762, 82, 813, 756, 166, -826, -573, 279, 795, 450, -435, -817, -93, 550, 724, -134, -843, -666, 107, 681, 429, -522, -967, -621, 68, 791, 361, -427, -858, 93, 614, 855, 210, -631, -499, 238, 815, 620, -174, -685, -240, 367, 679, 132, -600, -861, -183, 790, 461, -388, -878, -841, 501, 618, 257, -803, -780, -180, 699, 471, -35, -385, -706, 357, 848, 691, -141, -602, -241, 579, 684, 172, -561, -670, 195, 830, 717, -38, -865, -622, -135, 575, 333, -744, -1297, -276, 631, 614, -211, -951, -774, 213, 672, 655, -67, -588, -159, 468, 692, 403, -218, -615, 54, 539, 540, 128, -660, -190, 241, 1162, 460, -609, -888, -228, 589, 488, -52, -583, -659, -250, 512, 255, -303, -939, -403, 512, 737, 325, -159, -484, 232, 801, 763, 261, -320, -185, 394, 533, 494, -451, -880, -300, 522, 533, -342, -687, -715, 14, 352, 501, -453]
2381d53j80J71Q75K63m93o35q9N64J73L97o27m54J28P79M27m08n92k92K53Q17
2401F24k5r4r22j49O26K56o0m86q77N56O82K31o42n42L32L88P80J90p25n40R8
2422b99Q64K57p04k96k69L07L81O31r65o65L37N74O07l73n10k06K93L54K15m87
2442D6o13m4N71K60J41o75l67P8Q59L59m10o61R1L08P10L69q15l55m24N77L82
2463C87n2n50n95L00P25K63r6r21N1N44M13N3n97n34Q4O16M78j04o70m25L01P11
2485C82J29l58m64J04K50N61L14q07n54M91O14J75n50q88Q5Q0Q01L31r43m61J18
2506e90O10O37m04n09l20K86O60J03m56l44k05N37N68j85n22k87R4O73M72o80
2526A38m57N7K95N61q7n88l25l40N60M64O0q75K3L6M44M25k88p45p2P34M84o2
$$ y = [-453, -633, -462, 413, 676, 183, -452, -541, 23, 196, 593, -34, -488, -360, 419, 846, 438, -154, -446, -193, 624, 599, 505, -417, -566, 60, 316, 256, -230, -1107, -551, 131, 362, -280, -822, -490, -102, 678, 868, 143, -397, -299, 565, 822, 118, -178, -447, -140, 241, 872, -93, -758, -421, 153, 760, 387, -123, -329, -36, 318, 533, 46, -567, -611, -40, 220, 361, -314, -681, -603, 256, 615, 205, -456, -365, -57, 653, 1022, 207, -148, -572, 5, 387, 335, -215, -810, -510, 215, 478, 382, -539, -488, 56, 469, 522, -75, -609, -525, 91, 569, 465, -205, -630, -329, 382, 511, 153, -311, -207, 43, 604, 918, 111, -443, 48, 662, 837, 287, -601, -516, -436, 365, 696, -247, -708, -590, 20, 657, 253, -256, -576, -290, 370, 473, 17, -327, -532, 5, 573, 388, -134, -421, -327, 346, 818, 138, -319, -262, 33, 594, 507, -81, -406, -746, -186, 278, 338, -537, -514, -478, -34, 391, 103, -642, -714, 20, 504, 442]
2548D42o12o46M96O06L07l95l28l47K13N02L61m92m36q7M35P24j95m83m83K32
2568a86O67j3o35j44l69M89L89J74p15m39K75Q25J03On31j59L54N40J52o43n03
2589c63J62O50k3K0m38n06N05J92L90n56m80J46J56P22q5q66K4K12N9O38o80j86
2611c07n59M95M99M32p95l00J65N74K66k23k99m42M76M22J62m54n69L2N49K22
2631C46K8l98o66J46M26L95k51m61l10O43N67L0n13k89K06pO34k69l06n00K74
2652b75N26M03m63k69k81M81M00q3n05l04pN87L85k65p12J6J97L01J46%p83j86
2674f91Q27L36J0o69n5M49J2J73k42l50k12L54K42K67l17m70J65L40L85l80k97
2695a23m41M85M78J22n08m97O4M39J96J17m76o09L97L07O41j46p71J66K23O16
$$ y = [442, -170, -816, -320, 286, 593, 198, -130, -477, -264, 238, 599, 107, -329, -416, 19, 743, 548, 65, -418, -186, 481, 468, -167, -311, -680, -191, 198, 372, -343, -782, -507, 318, 421, 427, -104, -263, 91, 631, 783, 140, -363, -201, 449, 426, 446, 8, -498, 7, 199, 589, 33, -447, -301, -145, 577, 492, -374, -350, -138, -79, 559, -121, -307, -866, -371, 128, 560, -235, -535, -370, 204, 470, 247, -52, -494, -18, 404, 566, 112, -457, -425, 124, 346, 374, -24, -690, -544, -118, 277, 26, -435, -745, -102, 465, 495, -18, -307, -101, -108, 526, 257, -49, -549, -275, 251, 654, 191, -78, -359, 122, 522, 439, -66, -370, -377, 210, 595, 330, -382, -366, -169, 132, 278, 278, -505, -691, 136, 472, 482, -187, -242, 207, 219, 392, 150, -200, -412, -58, 184, 451, 134, -336, -171, 169, 554, 174, -123, -564, -79, 399, 521, 13, -484, -420, 19, 215, 332, -144, -753, -356, -49, 592, 446, -325, -159, 64, 680]
2715F80k45m08j15k50O58J50j65m00l25j9O47L93n17m16r7K12N69o8n61l42K30
2736c89M33k3J67n82k05P08K11J6l34m89N09M37j95K13o48l06M02N91o7l00m19
2757b70J8M56J08J65p03K9k19M80N82q20j91k08O89K76k33k63k76J87M06K51j51
2778C13o42p2K41M91N4k58m04k04O49K26m9k28o47K87M06m0L0n56k34M74L80m5
2800A72k36k57j04L27K50O1m09l03M18K40M83o34j23j46M88L43p5n11k99J71M19
2821B75m9j34j78k81L61J56K09j94o15J36N07o3q6n47K55J23K33J12j23l95j93
2842d91M90M96m6m54k78K45L27O2k45j99k95K24M42R7n49j91j39M84L54j31l36
2863a33l40K13M09L64l18n41K08j25L37L41n00l5l5K72K21M0n83q1L02P6K25j88
$$ y = [680, 435, 27, -88, -338, 320, 470, 305, -95, -420, -439, 208, 601, 84, -332, -429, -217, 352, 284, -277, -619, -389, 44, 21, 188, -394, -599, 109, 320, 336, 2, -487, 22, 459, 264, 477, -171, -477, -75, 516, 449, 149, -270, -252, 204, 312, 477, -226, -197, -416, 64, 646, -174, -365, -573, 116, 392, 159, -104, -380, -193, 213, 464, 313, -329, -401, -160, 331, 385, 127, -277, -481, 168, 394, 345, 117, -530, -243, 163, 123, 153, -403, -637, -163, 217, 172, -64, -321, -425, -98, 152, 213, -196, -499, -81, 159, 642, 8, -115, -261, 227, 570, 495, -16, -315, -144, 275, 226, 92, -86, -367, -6, 150, 359, 165, -450, -314, 193, 130, 44, -503, -248, -125, 108, 220, 97, -298, -491, -1, 495, 449, -5, -283, -38, 289, 351, 106, -93, -388, -164, 278, 375, -174, -365, -504, -20, 334, 203, -133, -473, -260, 149, 513, 195, -346, -138, -263, 74, 415, -85, -120, -155, 117, 338, 378, -205, -286, 16, 92, 317, 129]
2885A29j68j02L33K39j93l44l25K34L88j53j7n85L6M77M92m12j42K3l24P42L6
2906C64k90k14k97M59R2R3k04k47J58J1L42M8m00k79K11K03L42j57m13k2n5K71
2928A6L32k44n46J80K36M00m79P5m13K38O13O4k07m26p1N92k71p1M5l70M8O54
2950C95R9m40k13j67K07K73K82l14p21L72n8L93rm96J06Q9M47N8k44l44K24N4
2972gL33k41q0l19L69K48K44l67j76l0j69J71M24n34n9p8J31K11N3m25k8K84Q6
2995D1K08l78l8P3j35N54J46n42l46M17P9L81l18m14J20L43J28k57J6m20n4L52
3017d4M6J44k69k46J34L07K20l28j2j61M07l4l2l48RJ46J68Q8J08m84o6K02N51
3040E06k39q3m97P6L03J44j6l00j42K46J6J62n5m82RK45L95j64k32l03p3O83J52
$$ y = [129, -39, -141, 192, 431, 238, -106, -431, -197, 191, 38, 21, -564, -528, -51, 441, 29, -113, -90, -414, 328, 364, 74, -140, -437, 22, 114, 207, 3, -244, -86, -75, 267, 315, -85, -364, -153, 50, 392, 235, -178, -200, -255, 16, 348, 104, -442, -262, -26, 374, -105, -30, -443, -205, 408, 472, 265, -161, -232, 360, 89, 18, 63, -307, -259, 395, 494, 54, -159, -326, -119, 154, 436, 122, -599, -227, -285, 108, 99, -397, -291, -202, 245, 303, 59, -285, -61, -7, 326, 85, 5, -314, 55, 303, 547, 180, 4, -26, -195, -24, 400, -134, -193, -271, -140, 71, 124, -301, -329, -45, 41, 249, -129, -167, -94, -229, 325, 471, -71, -417, 0, 79, 460, 142, -272, -152, 191, 319, 62, 78, -342, -396, -44, 2, 146, -123, -369, -235, 72, 292, -36, -48, -209, 198, 164, 132, -216, -207, -61, 107, 195, 303, -181, -247, -45, 506, 267, 184, -313, -237, 66, 210, 194, -106, -248, -2, 14, 176, 121, -361, -352, -107, 288, 124, -108, -411, -484, 199, 351]
3063C51j03o20J34L8L29n6K39n92J56L14J00j34m78J45N1L01J36k40m54K83K24
3084A24n7L29n47j17J10L95j36K9n17M04r2J47O4m07N7K11m3L67j0n98K15K18
3106A46R1K10o02J5J30J54J74j72r0k75j4K81O3o1k05k71N89q0J87l08j10k27
3128c75O33j73M3k31j16J16K37j52J95l01R7j05K18j8j22m7r5J44M08l07k94J7
3150b28L25O2j67M1n24N75l6qk94M51n35L23J44J53Rn10J38J54K03l39j27M9k22
3173c63N79j36J63n01p5O14J40k90j27l70L97LR1q4k27K3J69j06L13k21j74L1
3195a51j74M35L58l03k79QP6J7M1l2o2R9K48l5j51k42p0k9O18j44k57j69K59p
3219E4k05K42j76j10K91J97k49k37N6J15J82o5J53k43r6J91K35J27o41N8N5l5
$$ y = [351, 248, -372, -238, -200, 129, 73, 312, -280, -124, 190, 290, 156, -322, -177, -126, 175, 311, 71, -383, -100, 124, 67, 396, -151, -268, -158, 237, 101, 130, -387, 17, -75, 72, 136, -271, -214, -3, -46, 321, 311, -287, -72, 146, 237, 447, -155, -140, -10, 144, 318, 146, 56, -219, -233, 48, 111, 50, -155, -426, 163, 83, 270, -38, -148, -375, 258, 85, 128, -103, -219, -103, 134, -18, 177, -124, -27, -132, 86, 68, -54, -101, -196, -52, 356, 49, -245, -228, 97, 159, -8, 33, -491, 84, 48, 40, -254, 197, -338, -15, 129, 282, 291, -219, -81, 73, 276, -63, -190, -141, -363, 216, 80, 243, -258, -333, 281, 421, 131, 4, -366, 31, 34, 125, 41, -186, -163, 6, -100, 213, -8, -182, -151, -325, 110, 468, 165, -114, -106, -30, -13, 28, -4, -66, 33, 281, 246, 95, -147, -217, -246, 372, 228, -29, -198, 61, 54, -151, 91, -85, -195, 96, 293, 44, -193, -137, -22, 160, 95, 248, 5, -91, 100, 335, 462, -179, -121, -66, -101]
3241a01K81L8l0l78K04M5J1j24K23k80QJ53Q0O2l60J50K11M7k91J40j23o6J93
3264I3M6l0k3j37L25j08j29l98J75J55J2P8j50q1k4l1K85q3j47j59K18J68J50
3287B05k28k68J6K46J88J94j06j80l36L79J16K9k63j06k21M47L05k87k04j70P4
3308a70J23R6o4j49K17j41L59l73J79k9k21K44j13P0j1l86L26Q0j9k09N0J85k42
3331a98M78l84r2o1K85J84OJ4o21M0L15K62p5n2m09P3M92k71o6l65L53K43J92
3354C43j26k10l09M65K19l21J37k54j17O4K19K30k66j63K88j3J18k74j89r5L46
3375I2J26Mk76J6l4j65M50o9k29l66L32L99j24k48j16q0K47L96k15j02l86J23
3397b25J90j2J84l30J78k64K84r9R7k24j27K15L58P0l23k0k63L42k8O6k86J27
$$ y = [-101, 180, 218, 188, -190, 14, 59, 70, -54, 169, -111, -103, 50, 130, 192, -168, -18, 193, 240, -51, 89, -34, -100, 93, 139, 109, 86, -51, 274, 166, 37, -361, -186, -31, -19, 59, -91, -172, -196, -227, 58, -25, -172, -331, -113, 55, 205, -23, -291, -275, -29, 159, 353, 247, 67, -269, 110, 226, 255, -8, -114, -335, 112, 417, 130, -74, -244, -170, -47, 49, -15, -164, 53, -88, 271, -102, 77, 48, -173, 71, -42, 28, 17, -369, -43, 37, 18, -191, -141, 44, -198, 280, -104, -196, -257, 28, 212, 218, 232, -389, -349, -34, 228, 153, 101, -308, -235, 257, -14, -80, -445, -92, 151, 343, 217, 7, -302, 163, 382, 61, 198, -56, -173, -109, 110, 340, 74, -89, 199, 186, 304, 30, -159, -254, 92, 218, 222, -54, -38, -72, -237, 213, 144, -85, -451, -119, 280, 156, -92, -208, -288, -41, 355, 140, 38, -348, -225, -35, -47, 137, -193, -15, -279, 5, -94, 3, -221, -348, -133, 225, 295, -28, -48, -311, 31, 3, 69, -217, -90]
3419i0j61K91k0N0k15k08K76K27k31Pk2n8K62K69m08j60J42K21j9j5o3k43J38
3442c0P3L13l51j84K72R2r6j74L0K7N8M7K00o6Ln56M59K65j06k29k24L2J79J33
3466A67K04n33p3o3M44k13J82l80nJ65K88Ol30l51K84J28L67k03K3k93N4J99j4
3489E3Q3j75j88L01k5j0Mk21l2J38L04l32J45O4k73k9R1j03j96L06R9l0l6L9N0
3514B7k90M68j31J46l55N4J97P0j96k40M22j61J25K62n03R9q0K84j97K31n20J57
3536a31l3NJ81j22J09j80J81k84L92j23n3k29K15K02K80n74J31L3K73L4l82J00
3558B5k54J67q1J97k5k9l5J34O4j59N4q4q8J19J82k49j9k21L42R7Jj61k84J52
3582a55Q9Q0L19m27j11J26L43p8k91Q8m9J55M3K20m56kK21L8p9R7k72j39K97J59
$$ y = [-90, -251, 40, 20, 70, -145, -353, -77, 150, -81, -74, -96, -154, 108, 377, -31, -191, -49, 172, 153, 138, 75, -168, -30, 43, 356, 5, -179, 93, 185, 89, -85, -55, -28, 30, 77, 277, 211, 214, -342, 117, 382, 276, 47, -177, -145, 34, 167, 371, -162, -235, -298, 146, -67, 115, -265, -270, -105, 183, 189, -141, -492, -208, -80, 287, 84, 107, -186, -132, 67, 53, 136, -39, -227, 74, 49, 39, 43, -178, -210, -72, 232, -100, 45, 109, -164, -193, -102, -205, -401, -95, 4, -26, -62, -23, 27, -263, 205, 74, 220, -135, -81, 116, 186, -10, -250, 172, 11, 136, 398, -105, -6, -86, 198, 1, 232, -288, -131, -164, -159, 22, -100, 9, -171, 10, -274, 118, -5, -58, -287, -72, 130, 410, -164, -33, 0, 273, 307, -75, 25, -229, -62, -143, 54, 29, 0, -35, 99, 163, 4, 58, -26, -114, 5, 187, -62, -81, -302, 40, 137, 138, -23, -307, -155, -66, 14, 333, -94, -205, -79, 264, 186, -105, -17, -66, 89, 132, 352, -104, -106, 115, 153, 74, 171, -101, -240, 57, 216]
3606B16k14j36J29l1J60J22l58J87k95l4N53K5j48j25k50P1L90Ok27j48J70R3
3628A56K45j61k45J4k90J81K4p9R3K1J44K05r4o83N21K9m5P6j99J68l79P07l14
3651I5L6l35Q3K80k9o3R7j23k08K68j4R4m21J43K51k86K53L5m03L4J33K07l3j66
3675g2Pk01L37n3l09K24j39P9Q7K38k42J11j12J60OJ15k02k20l0K14K06j61l6
3698Gn3j14L57l5L4m3m37J89o2J12m13J16J60K19M1M7j07k9J49Q9q2k53K5N4L
3723b6R2K7m06M4K03J82J38m45Q9q6J74M05k59k96QL04j19K1J21j17k92M08P5
3746B45k94O3j37O3k9K02j1j81j50J37K28J71j12m20r8K47O79m35k40o3k71N20
3768A14k0m08K78k79L70J20j40j15k34K95J70k7O4K3j17p9J86j72nl42M10k36
$$ y = [216, 2, -134, -5, -36, 124, 246, -112, 75, -220, -254, 299, 324, 176, 51, -199, -128, 262, 268, 41, -107, 63, 156, 401, 240, -5, 9, -281, -100, -76, -155, -62, -41, 103, 308, 214, -469, 52, 81, 36, 112, -87, 81, -298, 409, 95, 131, -204, -121, 159, 130, 67, 164, 41, -167, 101, 87, 181, -240, -97, 154, -132, 121, 156, -247, -213, -80, 127, 94, -72, -65, -266, 71, 18, -291, -67, -206, -127, -40, 198, -44, 67, -45, 115, 121, 236, 34, -186, -216, -2, 204, 43, 7, -46, -160, 197, 162, 196, 153, -284, -95, -157, -45, -458, -342, -182, 37, 78, 125, 18, -11, 138, 227, 145, -108, -83, -29, -26, 66, 93, -313, -269, -66, 116, 254, -191, -102, -188, -14, 391, 132, -164, -156, 148, 29, 50, 171, 54, -238, 170, 245, -49, 14, -123, -60, -89, 113, 102, -79, -229, -92, 136, 307, 195, -225, -323, -76, 603, 168, -72, -135, -406, 114, 94, -314, -36, -315, 55, 175, 35, -80, -314, -19, 151, 124, 188, 211, 94, 15, 201, 29, 24, -318, 92, -144]
3790a44J52OJ6l87N70k9k4k67K49o27N70N3l05j25N2L81j08j78J77kj72K09l1
3813C6J55N6n48O9N89l11J21j37k16J6K82n7k8jk10K09k30J12L8L6j99O8M37k14
3837G3q1k52L60J8j14n3l1K3j71N05l81N6q0J49J51J25j76m1k39R0K51k57M6r6
3861a25l2L71j08p8K9o10M54J70m8l0k22J28J31M3K0l43J80Q2r2M12k08j20o7
3884f3J38K98k76j32J19k12J98K38j78k62n1L92m5j55k95K6J81L4J12Q1q9j55
3906i6J59q5K4J8L6n4K87n9j09j76j12o1K49J32j08k26L4l9L23k6k29J60l57M88
3930A73J40l18j48j07n2M59j33O5j59P8l4J79M0k70r0Q2K41l4o7L0p0oK05q4j09
3955A1l19J40L61j2j96N9p5l01L34O4J46k25k33J09K98k44Q6j30J91K32l46PP6
$$ y = [-144, 8, 14, 30, -357, 213, 184, 160, -107, 142, -485, 85, 138, -167, -292, -240, 141, 33, -145, 32, 30, -142, 67, 36, 191, 247, -301, -232, 357, 46, 167, 30, -186, -170, 112, 55, 27, 26, -184, 25, -205, -93, -55, -19, -218, -150, 287, 73, -8, -260, 100, 118, 4, -49, -80, -57, -228, 277, -104, -48, -128, 21, 172, 297, 121, 80, -159, -69, 182, -75, -29, -125, -157, 214, 106, 28, 57, -553, -99, 71, 23, -7, -229, -101, 30, 73, 93, -250, -70, 12, -80, 332, 124, 4, -63, 75, 373, 97, -35, 84, -128, 70, 308, 130, -132, -183, 209, 164, 9, -286, -260, -79, -45, 67, 148, 59, -96, 63, -22, 2, 20, 56, 2, 289, 230, 121, -55, -167, -228, 21, 153, 45, -181, -147, -186, 137, 111, -118, 42, -315, 173, 313, -5, -153, -260, -312, 147, 14, 79, -80, -2, -36, 143, 183, -87, -177, -95, 146, 112, 45, 75, 5, -1, 204, 120, 11, -308, -168, 193, 181, -15, 44, -31, -332, 2, 66, 212, -13, -246, -137, 161, -83, 3, -127, 64, 296, -50, -43, 33]
3978C3K04m07L01l18J80m5j76K72J20j18j03o9J67J6L7L1k96J8J55r3L37r0k92
4001a36J32J96k05J88p1m43M26j86J99j66l9qK63k7K4k35J41m6M7j49J16J71l77
4024a85K01K49k53M0l48K50J36J43k19K7k84J69M0nL34m69k3K51K5J3mk28J10
4047c0J64qJ6j41j13l1K93Q4l50n7K04J04k77K7Q6r7J48j13K85k25Ql81N36%j89
4072e7o8K46j77J18J52j78j63Q5J54N4j03K11k18j61m2K06J31l13m1M60j18p0
4094A08j4l90Q3K37K40l12j22J93m1k6K42K8l28p5J2L44r1j5Rj66m1K10r6j37
4118a48J09j7q9K74k85n9j19M04j6r8j59J00J14J18R3j64l18J92J35L2nk41J21
4141b6J98l36J31K37r9pj2J28o3j75p8J31J02k50L37l93l8K51l4J60m5p3j87K38
$$ y = [33, 237, -170, 131, -187, -7, -52, -228, 44, 164, 46, -57, -126, 41, 57, 94, 125, -171, -153, 2, -91, 246, 156, -136, -4, 192, -13, 175, 104, -339, 87, -99, 100, -66, -105, -113, 150, 123, 147, -88, 53, 7, 54, -95, 21, 192, -185, 16, 265, 12, 52, -296, -46, 90, 233, 14, 41, -243, -74, -34, -39, 295, -174, -197, 54, 79, 92, 88, -140, -30, 134, 126, 142, 1, -112, -143, 150, 234, -116, -173, 31, 135, -142, -115, -29, -126, 22, -91, 194, -31, -23, -404, 132, 132, -57, -125, 121, -56, 62, 214, 36, -127, -42, 112, 166, 63, 274, 56, -105, -147, 59, 190, -123, -164, 296, 178, 108, 94, -296, -213, 24, 264, -48, -170, 23, -18, -44, 198, 226, -102, -177, -165, 179, 88, 73, 82, -84, -125, 85, -11, -148, -39, -56, -145, 129, -156, -215, -334, 70, 54, -44, -203, -103, 11, 129, 222, 58, -260, -68, 67, 99, 94, -147, -26, 172, -164, -33, 204, 105, 98, 86, 214, 151, -24, -102, 29, 131, -119, 218, -175, -213, 38, 4, 164, 119, 46, -141, 97]
4165I7q3J32J11l27k7K53J0l91L28m32K81J14J61o2k67o8J59K28j75p4k28K85
4187B5J8j31N2J0r8J91J12k25K22l49L12j84n8N01m80rKK40Q9m72K04j00N1j21
4211a98J16J14k76J66j28L62l3o5k14R9J47j2L3k40l4K40j47K78j37k96O0P2J63
4234G0J82p1k71o7L73q0l12J89n3J75j09K46m43J70J06j89L93k69j71NK98k96
4256a24K95j84k59K29K60K4k39k00Q8n5j07K99J00rl89K31J47j27R3j27l2J18
4278C2q3J41j55J28o2J30jk56j07J60K41k24J52l60Q3J98p4j99L21l18K81k03
4300a75L60q4J77k80K15j49J7M4j06J0j79P9R7k11R3L07p2l20L49l1j32J40L88
4323E37n30K5j07Q9J11q9J74k51J26j23R3k33M8K9l7kK38p0J40k04J53J2k59K70
$$ y = [97, 14, 146, 257, -70, -97, 156, 166, -225, 103, -329, -48, 66, 227, 165, -102, -170, -11, 217, 42, -32, -260, 25, 43, -88, -36, -26, -124, 67, 179, -46, 176, -173, 139, -45, -103, 398, -82, -91, -89, 151, 240, -232, -28, -128, -77, -198, -82, 32, -244, -78, -206, 156, 123, 58, -156, -57, 90, 78, 111, -129, -163, 77, -70, 208, 71, -225, -165, -93, 70, 252, 181, -90, -157, 216, 136, -176, 13, -40, 135, 26, 272, -171, -1, 105, -84, 309, 40, -131, -126, 172, -124, 171, -13, -272, -43, 217, 241, 2, -198, -110, -165, -272, 27, 127, 118, -271, -40, 107, -20, 73, -54, -86, 32, -51, 90, -65, 63, 1, 131, 130, -126, -233, -73, 168, -56, 96, -264, -181, 17, -57, -256, 65, -253, 28, -175, 185, 101, 278, -2, 213, 64, 81, 125, 19, 29, -150, -71, 26, -185, -92, 215, 143, -177, 172, 141, 9, 149, 537, 7, 32, -75, 14, 125, 36, 210, -41, 85, -38, 55, -178, -130, -101, -138, -140, 98, 28, 168, -36, 117, 129, -130, 140]
4347A40l68K04M2kJ60r1k31Q8l9M4j2J26j59J24K1k67j17K08J61p1M2K45l48J09
4371In5k6KK49pl8l33M3L37m05o8L72k39K34R7k37j45K08J68k92Q9R1l17Q9K25
4396E1L08l04k74K78L8r0J69k69J19J77O9j62l26L17J1p8k71j15M36j12j09N0
4418h7m5k9o3K70j70J69Q3k27kj53N26r6j81O1K06k22m22N07r0n5j0j9P0K5k02
4443a56M6P3K53l10Q2k52M81O7j24k03j77R4L97j77qK1l22L47j00j09J59j06J31
4466A07j01j69j8J48k2k53m1L78j15J61k4l21N26k24J54k34k8k49M60pO7j03k40
4489a48NJ17Q4k45J29J33J36m56L24k12L30N1j09k46K39k7k49R9J96Kk42Q0Q9
4512H0j08M6k55oK74j6k4N8l08J58K14j38M4l5J35l15K89k67K44J0L2k01J81l1
$$ y = [140, -228, -24, 18, 16, 176, 85, -146, -58, -97, -53, -65, 61, -98, 26, 47, -220, -337, -129, 32, -39, 3, 248, -100, 9, -46, -72, -70, 179, 172, 134, -199, -156, 181, -224, -292, 80, -159, 75, 172, -65, -210, -2, 166, -126, -37, 54, -263, -174, 51, 359, 55, -219, 59, 97, 7, 176, -93, 26, 203, 272, 110, -216, 101, 112, 34, -237, -352, 84, -28, -137, -87, -132, -161, -224, 46, -124, 45, 128, -99, -101, -254, 272, 176, -5, 56, 262, 40, -382, 125, 35, -20, -30, -49, 21, 46, -156, -110, -37, 216, -94, -12, -264, 217, 284, 160, -43, -220, -126, 271, 94, 86, 107, -215, 132, 32, -77, 82, -24, 107, 6, -163, -181, -33, -55, -308, -349, 29, -86, 75, 51, -270, 256, 32, 186, -48, -76, -325, 135, 128, 195, 92, -148, -143, -26, 58, -187, -58, 75, 211, -245, 79, -133, 197, 248, 139, -107, 132, 105, -144, -45, 151, 153, -89, -9, 80, -28, 18, -237, -243, 31, 15, -9, 49, -259, -101, 113, -25, 19, -16, 119, -196, 93, -174, 70, 80, 112, -89, 92, 61]
4536F1R1l04K17l2k26K41j27k3k54K45P5K06k21j4q1j5R4M9j40o3L91q3M1k48
4560a20J0K49j9Q6k44J67k5nj28J00k7J09l93M75l59P5N8l77K72P3R2mk49J67
4584a7k9j59L48j84k28J77K2K68l00K04j30O6Q3m26K88j41K24J44l00j25J28k48
4606c35N12k69M3K54k27J47k57j9J72L9p6M7j50J0L77l72J24l41N08j71k06K49
4628E9j05K05J16l9k78mJ1R0J26l65K80o2J21k75O5j31J1J48k8K01m4k07O6J78
4652A39k17R5O7j39k1L36j73k77J66K9J12j76J75n4j13n7O6n0L10k29l94N19j28
4675a4j32j15lM96l59K14j74K84j0l43L82j82M1o7q4K93j02%j06k5k29J88J28
4698H1q1M3l3K9j10J33P2k81L9J23P1Q4L1k50j40K12mM9r7P0k23L82r6m3k44K18
$$ y = [61, 152, -152, 65, 33, -193, 48, -79, -102, -356, -111, -36, 170, -51, -65, -146, -161, -67, -18, -158, -221, 170, 87, 128, -120, -110, 139, 120, 206, -38, 129, 104, 99, -29, 71, 44, 153, -240, 235, -124, -49, 9, -368, -96, -23, 69, 65, -184, -17, -46, -205, 143, -41, -269, -92, -70, 198, -102, 102, -28, 38, 121, -305, -17, -158, 66, 210, -90, -215, -87, -335, 177, -92, -49, 205, -22, 125, -132, -151, 21, 60, -16, 31, -119, -109, 268, -104, 20, -321, 187, 16, -190, 59, -46, 159, 275, 236, -42, -46, -35, 55, 181, -184, 96, 34, 155, -120, -55, -186, -175, -27, -55, 146, 102, -105, -39, 139, -78, 17, 84, -55, -76, 260, 87, -190, -24, 5, 117, -59, 116, 62, -51, -108, -42, -92, 218, -11, -405, 114, -14, -146, -261, -264, 232, -127, 87, -87, 197, 187, -156, 226, 44, 85, 18, -66, 227, 125, 125, 19, -6, -235, -47, 81, 0, 43, 10, 39, -71, 62, 134, -147, -108, 15, 86, 170, 201, -49, -189, 23, 19, 68, -29, 41, -182, 200, 104, 61, -183, 35]
4724C5o1m1N5P6p2l09N70j70j93J38K6q8K73k16J9r8k4J3Q5J75j30qk75j6N29
4749B93p1l13K04O3j57P3k3j45O6m1M76n27J8J23K64k10m0j25k05K64LQ1j22K40
4773A89j47J02m12M13l5l85J72j4P9P8l04K07p4L44k98K15k46m3J52p6J96j22
4795iJ11pJ3o3q5J67k42O0K58l62L45l40L97j86j11J24Qk04q1K14K08l54K78k61
4819a22J63Q6J51k95%O9r5J08o7k19M1K58kk92K49O7j90Q9n0R7Pj51O6n5J47j6
4845D4j97M3J59K02k75K55m49P8J04M21k59j92K12j52K5O2p1R6k78J28J11k26
4867a59P7K22m45K01K70k16j11Rl9R0J70o5k32L3J18j03L19k43K22j76J91J47
4889B80m85O4l4K29j09P7Q3j14J1q2O3Q0k04J8J11M9k53j80L25O3N7r5J83l11
$$ y = [35, -26, -67, -12, 64, -8, -317, 253, 83, -110, 28, 54, -34, 239, 23, 42, -56, -80, -67, 18, 193, 63, 55, -220, -236, 293, 222, -91, 113, 176, 19, 92, 69, -76, -10, -51, 425, -102, -84, 39, 303, 93, 53, -72, -277, -13, -10, 71, -51, 189, 42, 144, -268, 145, 110, -275, -103, -117, -38, 40, -264, -57, -131, 213, -85, 130, -116, -159, -7, -83, 113, -9, 102, 95, 108, 45, -40, 127, -115, -55, 203, -159, 186, -154, 243, 57, -54, 70, 78, -126, -207, 7, 215, -139, 139, -122, 41, 127, 278, -17, -17, 52, -43, 65, -2, -221, -180, 78, 76, -216, 33, 100, -90, -1, -51, 46, 53, -98, -32, -87, 60, 44, -153, -110, 49, 251, -24, 231, -218, -140, -36, 385, 126, -66, 146, -6, 19, 81, 10, 106, -172, -44, 67, -159, -82, 140, -305, -104, 166, -50, -161, -152, -191, -101, 69, 4, -228, -195, -77, -180, 139, -104, 118, -58, 133, 280, -205, -141, -175, 54, -55, 22, 105, -9, 2, -80, -17, 63, -141, -123, -12, 37, -216, -396, -71, -8, 49, -46, 137, -174]
4913a74J10N4l1J59r2R4j80Q3k2k16K6O04k06k24J54o2J79l79K66l31J89J89j18
4936G2l95L02J58K35l21r6J94p1k63N1J88k4K06L1j51k58j44L75j18J05o9j11
4958a04J77J1j11o3K45j23q8K0J66P6j76N9k45L5J52l9j30K17l5M5o3j50K62n9
4982G9J43n8q7J68j90r0k3k5p6J29J64j04J98k64Q5k1M1J51j17q4j48j99M02m
5006G0j64K40r6k00M5J16L8J34j94r6nJ39J28j4k16J15j58K74j19k67L64q6J66
5029B14m3j49o1N5J50l17J00K95j62l4j28q3m7K89j57M5Q0k15K53j44K08p3k07
5052a31K36l07R8j8K27j56J32m06J10M9K29n0j37J90p0Q1J62l0k80K96n18J53
5074a40J00K4Q6j31L25k30N7N7j58m9j59j5K37m7J01l9N9j75l3K60r5J14j73k29
$$ y = [-174, -64, -10, -41, 118, 26, 120, -60, 23, 1, -215, -189, 415, 209, -15, 139, 77, 256, -123, 143, -188, 1, 190, 72, -323, -21, 137, 372, 51, -45, 149, 78, -185, -134, 54, 30, 236, 267, 116, -142, -286, 89, -29, 76, 7, -104, 73, 84, -27, -90, 155, 32, -56, -36, 130, 206, 30, 89, -156, -121, 31, -8, -138, 79, 44, 89, 26, -124, 138, 79, 222, 164, 77, 245, 55, -35, -58, -83, -159, -30, 134, 30, 228, -36, 49, 28, 69, 220, 103, 19, -129, -328, 74, 70, -94, 146, 50, -150, -105, 11, 49, 183, -11, -107, -112, 27, 155, 141, -75, 40, -118, 156, 37, -230, 134, 48, 214, 171, 22, -39, 16, 166, -151, -51, 244, 82, 48, -80, -163, -210, 79, -78, -33, 47, -168, 85, -59, 149, 76, -131, 105, -202, -104, -122, 105, -51, 81, -325, -215, -166, 63, 13, -124, 66, -4, 77, 239, 209, -71, 225, -293, -140, -40, -16, 70, -61, 264, 34, 91, 148, -10, -59, -218, -233, 4, -43, 58, 19, 78, -97, -130, 130, 35, 149, -24, -253]
5098b53Q9K04j32K75k21P3l2j1M7K1k08J29J3o5M4K49p1j51K1K2q7j59Q8j43M27
5123A69k62J29j59J80l30K13P2j27m5L59l73J4J45J11k74K57r6j74j7N8J82J55
5145A87p0j94L5Q8j66K25k84L45j39N9j69L53j34k99J43M5j05M9P1p1Rr6R0M8
5169B0j81L34k30N0K5n3j33L19l28J26j65M00j83Q4Qk1k22O8J97j79J13M0q7j16
5193a14kp8P5L14k20K0q1n8J51J60o2j84lQ9R7K28n17Jo9M09J20k8j87j52J49
5218E8j40N5j6J46j85l0Pq8N7K34m04L99R8N8k62R9m7j30N10m84l8J88m2p2l0
5243e9j01M00r4q5q7P0N7l46J1J43L7J90k08Jj23K20Q5m50K88OO2R3l11K14j82
5268a69K01J5k68J21j16J59J89k85K05O7j12k51M05J2l33R6Q2j22J26p9K65l13
$$ y = [-253, -164, 40, -92, 183, -38, 35, 3, -8, 39, 60, -148, -19, -6, -71, -27, 222, 151, 0, 21, 43, -44, -203, -115, -258, 169, -93, 36, -123, 57, -273, -60, 12, -115, -160, 199, -174, -160, -15, 96, -178, 79, -17, -191, -208, -150, 32, 187, 117, -77, -42, 46, -120, 105, -179, 166, 27, 86, -83, 270, 136, -163, -20, 25, -80, -31, 40, -31, -22, -118, -28, 20, -161, 173, -57, -7, 18, -35, -168, 151, -177, -51, -216, 184, 1, 85, 93, 72, -150, -82, 115, -64, 49, 89, 2, -114, -116, -194, -119, 195, -25, -5, -86, -144, 7, 167, 105, -79, -82, 7, 104, 332, -185, -184, -253, 156, 276, 248, 61, -91, 58, -82, -27, -43, 103, -82, -112, -105, -193, -136, 98, -306, 93, 191, 249, -13, 86, 39, -91, 419, -65, -103, 85, 43, -29, -59, -160, 240, 146, 61, -26, 44, 101, -245, -234, -91, -54, 136, -72, -71, -194, 26, 111, -339, -51, -45, 17, 110, -201, 13, -169, 32, 47, -221, -100, -216, -57, 132, -153, 52, 119, 7, -244, 161, 173, -160, -64, 18, -104, 22, -57, 208, -105]
5290a05J06k0j10N0l07K96o1O0j04K9K16N3R0j87J38j99Mr3K11j68R1J49j61n
5314b7P1j8R1l06L80j61N3j24j29O6K03j17k08J26k09K52J33j03J0k42J39N8O
5337e6J1j66L3L43J15l06j60M1K29O6k36l1Q7J9jJ17o6On8K14j40j93m9J54j3
5362d0M0N8K61k47j64P4o4J5Q9M1m1j5Q0J3r5j29j79L39j28j71K18J77k70J68
5386C0j5j11L85m45k3K6J51J16m1n2j99L23n5KL5j77N5K29j96P3r2o0R5k3r2R
5412e2k46K26P7j51n2l1K34o5q6J70l2L6Q6m2J5k24M2J19J71j0p2J36j22j26J78
5437A79j3k29R7p5J31j60J51p6o6J74k58K02J48m10J90j42Q0K4Q7k67L28J19k02
5460A2KJ58k11K08k74K04o4J9l33J40L34r8j53K0P7J39%l70J68j36nlJ72k33O0
$$ y = [-105, 1, -19, -129, -79, -386, -90, -151, -91, -195, -166, 50, 103, 193, 6, 144, -55, -51, -144, 67, -101, -10, 139, -22, -27, 44, 26, 117, -189, 191, 30, 83, -41, -170, -104, 99, -18, -226, -100, -309, -57, 76, -27, -17, -259, -120, -62, -56, -45, -211, -178, 165, 280, -26, -186, -145, 84, 150, -86, -117, -30, -11, -12, 105, 39, 45, -13, 201, 61, -132, -181, -27, -40, 0, 58, 319, 72, -92, -18, -82, -67, 22, 63, 22, 7, 87, 100, 5, -124, -303, 36, -92, -263, -45, 132, -138, 30, 15, -96, 289, -156, -179, -153, -2, 114, 73, 21, -178, 145, 90, 92, 127, -50, 5, 234, 38, 111, 19, -41, 54, 31, -61, -52, -298, -72, 5, -146, -198, -229, 5, -60, -146, 24, -8, 28, 114, 72, 87, -137, -95, 24, 195, 185, 113, 249, 127, 1, 179, 166, -63, 34, -41, 90, -70, 81, 5, -61, 113, -145, 57, 205, -205, -15, -157, -77, -53, 34, -233, 95, 214, 12, 14, 172, -39, 169, -105, 99, 35, 54, -279, -139, 195, 97, -56, -36, 41, 180, 180, -190, -22, -158, -163, -166, 6, -227, -167]
5485a67J22J34k44J99J90m18J99Pk04L22N4l45L48j54J0n3J86l18K97k70k38L58
5507A5l2K02k45j32K99j67N4r3p8J84j57j1K48j8j38J7m2J04j2R4k10J52j06J8
5531e4K06p6L6j60J58rpk84J48J1K44m01J75J32j20j53J13K07k17K0q5l58L92
5554h2J20p3j88J77N8O2K03k76j3J25j81J94k20R6r6k0K4K60o7or7j15L53k46
5578hqN3l3J68M4l80Q2jq1J47J16r4j7j24J15J11k2j9j86O4q8P6p9R0M00l84J22
5605F4R1j29k80j1L09r6JK12K5j93M9q1J6KL6KLJ21k10K80j89l5J7k50K41J29
5631A24k37M79m64K05k64J77p3L21j61J2k18N6P2Q7j70M0J3n7J25r6m7J58k41
5654a59p5K24j0O4j80K79k57J52j76O5K04n9N2P5l85K61j51J10O3L6k0k23J58
$$ y = [-167, -45, 89, -155, 44, 234, -184, 15, 22, -182, 140, 194, -151, 197, 43, 53, 0, 186, -132, 165, -105, -343, 15, -17, 185, -60, -192, 107, -60, -6, -99, -177, 7, -150, -161, 87, 69, -69, -52, -94, 10, -2, 92, -118, 34, -72, -54, 152, 76, 112, -48, 110, 101, 94, -190, -42, -31, 213, -188, -13, 119, -1, -154, -41, 166, -51, -31, -116, -474, -82, 38, -35, -223, -46, 12, 74, 277, 1, -12, 113, -68, 126, -94, 2, -94, -114, -90, 170, 103, 97, 0, -115, 238, -8, -16, 37, 4, 172, 216, -164, -82, -83, -164, -17, 99, 5, -12, -136, -21, 90, 68, 49, -137, -73, -161, -85, -164, -74, 326, -58, 64, 155, 26, -254, -265, 44, -52, -51, 161, 186, -7, 42, -39, -23, -21, 15, 17, 20, 141, -69, 211, 22, -13, 4, -246, -5, 124, -113, 366, -98, 107, -157, 20, -53, 268, 107, 119, -99, -43, 29, 116, -54, -14, -1, -58, 67, -29, -76, 82, -159, -234, -10, -20, 44, -136, 143, -114, 38, -138, -73, 131, 72, 124, 199, -186, 75, -76, 34, 97, 133, 113, -110, 48]
5677D8J39j31O2k6j12J92k69K09j73L3mM5J61k56J2%j03K6L85j35q4K38l80J93
5701G0l19K40j8L7L8j28K04j16n2M1j6J72l6m25J19K49M6J44l36lL98l87K55l02
5725a25J23Q7l56K68r0K38k72K39j17O4Q5j32j35k2J82Kj17K81l17pJ37R2r2r7
5749h1J54r0P6p8r5k1o6M89q6j20Q2j80M3K95l81K94m84K72N4o6l8K46P3j54q4
5774E4n6J66k79R4J52k24q6J44K93m88L07k7K1k4qj30K18j35j88m1L01J08r2n9
5798B1j09J16k29J09K38l22K41p8M4M7j71J55j80o8K49J3M3l28J80k7K1j75K15
5821EJ32j22m5K51l18R8j22L79k24K7j29j73J78o0K12j61m6K20l8r9J22J4j14
5844a3j65K61J16j70o7l11L21m0j02K21J07k20O6or7L69k16L7N2l63L24m3P7m60
$$ y = [48, 187, 56, 118, 92, -20, 172, -97, 112, -61, -28, -32, 13, 174, -82, -70, -70, -173, -147, 238, 103, 19, 257, -123, 70, -249, -9, -27, 10, 48, -80, 124, 8, -44, -3, -19, 153, 117, -308, -189, 60, 106, 250, -86, -89, 309, -78, 177, -125, -2, 85, -271, -3, -93, 145, -127, 112, -5, 59, 144, 12, -123, -145, 37, 39, -78, 203, -114, -121, 16, 108, 16, -81, 73, -17, 59, -19, -114, -135, -201, 288, 202, 82, 164, -16, 27, 322, -59, 235, -249, 23, 77, 11, -27, 219, 292, 138, 54, -2, 164, -115, -21, 131, -93, -179, -35, 258, -230, 77, 50, 71, 47, 39, -91, 127, -8, -196, -237, 64, 172, 80, 21, -88, 28, -201, -92, 146, -176, 65, -13, 31, 78, -93, 62, -118, -186, 63, 76, 119, -209, -29, -56, -35, -210, 5, 137, 15, -30, 221, -97, 1, -121, 258, 34, 61, -68, -241, -63, -123, 89, -72, -118, 102, 64, -35, 87, 101, -13, -178, 83, 199, 29, -38, -349, -28, -68, -170, 51, 158, -62, 4, -2, -99, 270, 54, 91, 143, -220, 104, 61, 138, -322]
5868c22K79jj30J28j64K48j19R2O6k22J51r0Q3J52o5q3%K4j06J10L48l18r6l2
5892f7L10k52j19L82m09K27N6o4L2j11M3L09l87o4j35J46J92l76J14J95m1R8r9
5915b0J06l33K52L09l78r1J13J00q6kj37LJ6K25m6M3K0j79M2k9J36q7k38J99J
5940f1J9J50j69n9J13K23l5k50M7j5j06J37J51Q7o1j77m4J01o3J01k1n6lR0K6
5965A25P1p3j89oK25n0l16J76j0j69M1J39J29m31K00K27j33j11K06J4j64Q5J46
5988A32m12L47L6L2k89K44L16l85R2o8r1Mj18K54k10J10L4k29M91j32j29k09J95
6011A5m0l7n0R2k1K80j40L7k39N5j25K29r2K02k92M3k24K25n8J22J0j42Q3j3K19
6036A39n7J8k8j37M9M0j34k4K76k85Jj10N33n35L15n4l6j13p3L05k48J91l5n7
$$ y = [-322, -43, -44, -174, -46, -210, 38, -81, 11, 77, -145, 6, -84, -1, 151, 86, 3, 3, 27, -79, 31, 379, 61, -35, -67, 243, -9, -128, 254, -155, 72, 128, 64, 96, -15, 28, 337, -50, -114, -249, -103, 89, -287, -173, 22, -19, 79, -20, 86, -247, 5, 314, -64, -155, -42, 58, -28, -30, -167, -164, -148, 77, 31, 74, 94, -85, -43, -72, 64, -23, -261, -62, -61, -42, 108, -61, -120, -7, 216, 181, -69, -22, -37, -143, -6, 145, 232, 171, -6, -50, 51, -12, 89, 68, 12, 9, 99, 125, 196, 123, -66, -72, 153, 103, -213, -37, -47, -216, -175, -36, 93, -338, -138, 89, -44, -155, 51, 65, -99, -14, 132, -280, 67, 103, 135, -154, 90, 406, 21, 113, 45, -46, -42, -160, 94, -116, -6, 28, -201, 290, 158, 29, -180, 15, -25, -62, -112, -20, -41, 239, 99, 136, -103, -48, -173, 56, -36, 166, -126, -83, -307, -82, -140, -18, -8, -150, -67, -80, 139, 82, 100, 72, -65, -16, 24, -110, -134, 142, -143, -142, -252, 281, -254, 61, 7, -29, -142, -215, 90, -158, 33, -2, -59]
6060e9J86l29L27l28L10Oj75J43J36k38N9q6j04J66j5J21MJ56n68k6K98P6R0R7
6084B47j62k4k83K35k79O4j42K78M3r5J61k01K86j61O8m4J3j56K11j68K79j36
6106C4k46L86j42K1j26L11j68q1p1J16L4o8j31K19k02N9J92p9J0q5J94j71k36
6129b30J70P7r9J88k06N0L5k43N75l29J1J77l07j1J41J62j17j04j99L44l29R7
6151a47Q0Q0K6l2Q0k0p3J88J14l57N9L0N0N3J15m17J49Q8q7J36k28K99k13M0j77
6176a64J14nN5k13q6L27K17k21P8j10Lm9J9j75J05L26m3k60K1%J2m1K63r5j81
6201a03J30L8J50k00N5k49J04P3K49k18J3K0j55J09j25M25l07j0k45J86L31k57
6223A4j30K96k10j54K46r3PK10j49Pj28J05l15L72l11K45j09K8K46J53l55j69
$$ y = [-59, 127, -202, 125, -203, 107, 113, -62, 81, 217, -21, 38, -48, -152, 14, -1, 120, 124, 280, -288, -314, -16, 60, 150, 247, 85, 61, -222, 13, -266, -202, -344, -66, -23, -118, 43, -158, 128, -33, 35, -9, 4, -152, 59, -109, 170, 34, -212, 174, 32, 53, -73, 238, 70, -11, -82, 34, 68, 0, -131, 88, -114, -55, 137, 58, 68, -17, 177, 6, -230, -60, 17, -82, 106, -100, -50, -15, -258, 317, -12, -1, 176, -131, -142, -1, 161, 44, -60, -259, 85, -244, -147, -67, 13, 39, 7, 87, 67, -6, 182, 296, -61, -2, 28, 78, 131, 246, -171, -22, 66, -21, 115, -113, 186, -27, 13, -164, -50, -55, 0, -213, -299, 28, 245, 24, 102, -8, -5, -54, -35, -210, -105, 221, 178, -82, -61, -61, -49, -90, 173, 78, -103, 27, 65, 215, 15, 70, -179, -75, -2, 247, 29, 42, 62, -93, 16, -109, 316, 9, -1, -246, -60, 271, 14, -116, 180, -30, -184, 62, -31, -24, 186, 37, 44, -84, 21, -294, 78, -233, 12, -97, -69, 177, 330, -25, -194]
6245a94L42j89J73m71M34P1M7K2j63j95J42N4k55N2k2K40l1j87L03m31K81j10
6267h7J4Q6l16K53J62k49M4J9M8K07O2j50j42J67r1Q4j35J65r5j21P2J7j27l1
6291a44J93j28R9kj74J94J51k36K44p1j73l0oJ66l7m1j08K61n2m5p7j15L17l35
6315a49L03K9l43q4L60r4k50M62m60K47j56J36J05j98L0l3O6K35l10J16N1k09
6337a46L07k65J10K14l44O5J82r6J84j21j28Q7k30J52r9r0J45Qj33J99K24j13
6359A12O9k96J52n0j11O0p5K41J0k58Q8j95R6L92j39jl0k80L21pj44j0j19K04
6383C0r9K42j64n0P5J40m7n1N2P6L6m18J65q5j88L35j81R9j87J31K12k96L73j19
6407H1j34K0N9p5J57l0j5J82l1k88P4J65k56n5J23K57m53K04J9j99M78k81K9j34
$$ y = [-194, 148, -41, 132, -339, 95, 166, 213, 235, 72, -123, 19, 73, -182, -130, -152, 88, 57, -130, 173, -258, 23, -87, -73, 13, -303, -50, 112, -137, -93, -74, -26, 181, 243, 93, -49, 118, 27, 111, -24, 141, 46, -75, -3, 14, -113, -144, 49, -79, 20, 18, -156, 38, 189, -47, 197, 126, -47, -77, -83, 83, 46, 5, -103, 158, 106, 61, -16, -131, 186, -149, 154, 183, -160, -244, 116, 22, -228, 234, -226, 21, -135, 1, 106, -92, -62, -95, -29, 206, -104, 12, 63, -146, 161, -104, 6, 220, -124, -59, 123, 27, 211, 90, -38, 49, -181, -29, -128, -218, -73, -65, -198, 1, 225, 112, 181, -115, 37, -13, -124, -64, -139, 102, 112, -146, -58, -253, -157, 235, 96, 95, 65, -215, 106, 99, -45, -55, -174, 30, -69, 173, 9, -41, 34, 174, 127, 76, 128, 204, 240, -178, -13, -98, -286, 49, -132, -33, -220, -89, 123, -173, 200, 81, -53, -33, 26, -49, 108, 78, 63, 245, 214, -74, 0, 165, -91, -146, -23, 234, -219, -15, 4, -195, 283, 2, 31, -103]
6431a03K01r5j14K73l08K62k12K11k7L0k51L12m9j34J02k70NK28k13L88j47J38
6453B27m95K16J38j47J37k36J80q4L89l98O0j67j80M11J5J27r0j05j05J03o7K16
6475A45j56j69K60j92M19m60j3nK52j57M8P8o3j90K88j40K03k8l23L25J65r0l76
6498a79J58J35o3l7K83j06m6j66k25K66l1j9m5K5k6R3j92KR9K5J45j35j78J65
6522e2L5k1m9Q6k46J76J03O6j0N8K4j26j26M01k29l86L62lj85J48K81k85j15K07
6546A14j44J4J05J99j17l63O03l55k6N1P1j46k92J06K90k31K49j8j09L21K0l85
6568d3R9O4k89J72J0k0jO3o9J03k96L05k23J11R6j10j4j35q1K05O7O5O6k2Kk9
6594I6o0J04n2k92J88l4O9q4J43k61K59k36J42p1J45j35p1rNj51J75K9J65Q2k90
$$ y = [-103, 98, 3, -111, 162, -146, 116, -96, 115, 88, 118, -133, 179, 130, -4, 98, -172, -167, 61, -152, 236, 89, 227, -268, -52, 86, -61, 76, -160, 20, -64, 325, -73, -13, -180, -360, 51, 66, 193, 103, -2, -107, -4, -71, 145, -11, -180, 80, -112, 307, -153, -166, -171, 81, -76, -28, 50, -13, -203, 85, -55, 148, 120, -203, 122, 287, 197, -179, -21, 114, 51, 14, 297, 191, 145, -21, -246, 20, -11, -30, -75, -50, -76, 17, -175, -173, -74, -49, 96, -39, -217, -52, -17, -38, -87, -1, -247, -71, 32, 98, 88, 146, 170, 44, -82, 319, 90, -296, 66, 63, -122, 26, 307, 22, -93, 114, -30, -16, 89, 288, 171, -192, 411, 56, 30, 81, 152, 6, -286, -180, 110, -121, 128, 110, 1, 322, 342, -43, 56, 120, -169, 3, 13, -7, -8, 55, -14, 89, -207, 98, -125, -14, 82, -28, -42, -177, -258, -53, 14, 79, 145, 123, 125, 96, 36, 140, 88, -204, -16, -50, 19, -65, 78, -183, 76, -160, -18, -89, 56, -79, -150, -159, -154, -305, -130, -101, 64, 146, -144]
6619a44L01L8j26k28N28m60K31l06L37K9j52O4l09J91j23R6o2J39K30k88q3jn5
6642a53l7P4J64n9j67Q9K9l4K75l60K66K14m34M2J10R1Q7l21j45n7O19l99J30
6665B4n2J5l3J03K04m2j53j09k65M61J44q9j59J52l7j7Rk55K72l06j58K45k0k22
6689b88K64o3nQ2L3j75L40J2j48j10J03q9J46k11P7K42M5n4q7p3J0k34J33n6L1
6714g5K92j68j64L7J44k50J83j04J22N9Mj27L33l97J90j11L8K68l06M06l03n6
6736A5K38j62K4k44J65M3j05P8J5m7O8J61k00R3j91J84J8o8k77J51J39j18m2K45
6760A83j14r9k4J54j64p2J10J19m8j14J56j02M2j64L63m14K00O2j82L5mJ59j43
6783f1j44O7P1l7J45j13lj48O64m74j09L04k70O6K62l85K64j20j40J66n9J36r1
$$ y = [-144, 157, 195, 69, -159, 369, -91, 140, -166, 171, 200, 48, 112, -197, -6, -129, -33, -95, 44, 274, -14, -97, -98, -153, -190, -116, 48, -11, -178, -89, -60, -94, 181, -179, 87, 301, -133, -91, 19, 110, 197, -124, -269, -326, 293, -106, 24, -28, -13, -46, 57, 261, 219, 66, -43, -308, 153, 297, 208, 49, 201, 164, 147, 156, -99, 173, -133, -291, -46, -66, -288, -24, -87, -92, -10, 23, -152, 188, 200, 52, -58, 45, -44, 102, -109, -32, 210, 255, 201, 114, 41, 51, -183, -50, -106, -75, 217, 49, -115, -78, 66, -184, -1, -105, 17, 76, 80, -47, 286, -111, 79, -32, 6, 274, -32, 374, 71, 15, 253, 91, 115, -129, 36, 79, -26, 52, 67, 20, 88, 249, 49, 142, -49, 135, 153, 85, -192, -41, 98, -20, -62, 183, 69, -30, -54, 100, -64, -136, -26, 93, 45, -69, 87, -15, 27, -137, 226, -188, 12, 74, -108, -73, -77, 82, -61, -205, -138, -67, -104, 41, -72, -75, -223, 441, -33, -142, 162, -108, -42, 220, -165, 99, -21, -161, 5, -54, 82, -9]
6806iqj67J86j94N24j35k91k8L52k54J8k3j15J26L94m77J09Q6J20k17J6J50o8
6829I5L1l33J25j76L81j87j67J48J82J5J4Pk21n1K33k98M25l58J11k47P5j1K21
6852A4k08K00j2l1j32J94J86j65j1L1o4l05M97j81L6J16Oj26J14k51p8R3J64r6
6876ir5Q7M0M7J06l73J27j28M87j47k0k47J30R7j84M2J92L9k45K22k66J33P6j36
6900b5o6K48m9j42J23j39Pk3J06K15l07j33L54m09K14J98m7j74j07K98q9K21k33
6923D1k0RJ28j94J79j72l7J50k06jK62j71J49j33J43j6Pj55p3M15l46l01L00O
6947c6K23m96K29K04j92J08K44k91K10j43n3J48k68J23R7L0j59Q8n9R6K40l48
6969ej08J30Q4j23R5j30M6j11K49j87J65k80k4J48k1J63l51K33p5J92N4k66r6
$$ y = [-9, -17, -184, 2, -192, 332, 197, -94, -122, 230, -24, -6, -29, -144, -18, 376, -101, 8, 94, 214, -3, 13, 163, 95, 126, -207, -82, -258, 123, -64, -231, -83, 99, 114, 128, 135, -86, -137, 96, -202, 223, -135, -24, -271, -196, -207, 14, -194, 6, -6, -37, -169, 25, 211, 46, 35, 66, 2, -303, 194, 13, 49, 165, 171, 45, 159, -92, -170, -77, 87, -9, -104, -17, 23, 70, 176, -197, -70, -198, 289, 142, 122, -125, 5, 102, -82, -40, 152, 191, -54, 168, -98, 35, 111, -25, -91, 157, 108, -34, 89, -50, -43, -66, 40, 255, -52, -185, 169, -240, -26, 172, 125, -49, -156, 142, 53, 274, 41, 21, 30, 158, -36, 143, -29, -66, 84, -122, -123, 139, -32, 117, -16, 127, 111, 118, -37, -110, 305, -41, -342, -42, -36, 187, -309, -80, 124, -68, 40, 284, -7, 203, 60, 7, 155, -113, 10, 107, 137, -22, 66, 7, 103, 343, -5, -113, 17, 101, -22, 73, -57, -11, -122, 127, -60, 105, -175, -199, -51, -72, 91, -260, -27, -102, 90, 144, -122, -218]
6992b18L67l82K60K49l24J71r6k40kL01k96J88Ln1p7lK94j57q4R1j56J25M2L6
7016D1j07j5K51j80J13Kk2q4j00O5K08j29R8J10k51k47M65j52j48J31n6j9O7j3
7040B8mq1J8J47k25K11o7K2j78j47K59J38p8J12k4j04oJ78l26J93k19K38k02P6
7064d1k88M13K57m35K36o1O5J3j51J38j18k97K16J17k69M1J99P9K4j22K4j19J73
7087I4j49p4L51j53J70m58K76K04l11K07j79J07l26N61j63j17n3J76l76L33K7
7108A47m0j02l6LJ21k77J3J68p6K77k54j8j16K99L1l65R0J27J87j59R8k74N2J27
7132B3K4JJ8o1m1Q5j40K12j12m6j48L50j10k36J28J62k00R4K15j17k47J03k5Q5
7156A7Q9L9k89J9J38J22J21m63K84q8J47k35L42k37K87j56j18Q2j36k21M9R4L02
$$ y = [-218, 149, -233, 27, 276, -48, 123, 27, -213, -215, 86, -210, -22, -19, -70, -147, -150, 144, -13, -97, -6, -162, -37, 5, 41, -66, -81, 170, -10, 103, 105, 83, -1, -101, -36, 172, 43, 141, 251, 0, -247, 218, 66, -82, 49, -7, -26, 41, 28, 24, -57, -39, 108, -117, 94, 27, 49, -129, -276, -17, 121, 43, 155, 131, 27, 21, 199, -127, 66, -153, 85, -117, -41, -329, 84, 341, -94, 142, 81, 146, 159, 8, 146, 28, -269, -53, 64, -205, -164, 35, 114, 138, 16, 40, -79, 94, -55, -129, 222, 69, 239, -219, 57, 261, -50, 157, -22, 85, -241, 320, 157, 40, -13, 163, -213, 120, 147, 107, 5, -31, -28, 93, -184, -171, -3, -79, 198, -56, -74, -190, 109, 140, -225, -135, -8, 179, 20, 118, -156, -104, 23, 47, 48, 66, 5, -36, 49, -91, 121, 9, -37, -185, 165, 55, -181, -53, 109, -91, 3, 218, 101, -146, -43, -68, 17, 106, 145, -144, -125, 13, 135, 256, -207, 77, -11, 136, -99, 243, 6, 293, 137, 19, 101, -35, -256, -207, -113, 189]
7179A89j65l38K64k6J08n0K02l22J44K0J08l07K82J13k75j61Q2M52n24J03J92
7200I1l05R6J90j0j81L02k06k9r8Q5J60j21o4L2P3P7k55P3K36L6j33L6j60R8p5
7225e2L21l07j35L06j40L1p7p8K31j39J24j28N1j50j4N1K69m19K14m7O9n9J66
7248H8J34m12J44Q0Q2j77%L6j18K98n3l01M07m9M3k87K65rl64J69P9r2k9pJ43
7273G0j67O6k7n1K08m36K67l8j06K99j95L0K30j37J16q9k73J49K75r0j62p0J69
7296C8Lqj4K80l76j26J09N8j56R9L2L53l48p1L4m2j01L2K5Nj23K12n5M26l74L17
7322B29j22J0J27k43l8Q1q4q5L06j48J5j04j05LJ24J07j04N2k25K28l6k30L50
7345A08j81J26%j68K77l7k30J81k10K66J01j27j56k73J71L56k30L15j2k52J02
$$ y = [189, 24, -314, -50, -76, 32, -18, 184, -138, 6, 26, 134, -173, 109, 222, -53, -214, -132, 320, -204, -101, 91, -214, -118, 72, 62, -119, 183, -23, -52, -150, -65, 95, -26, -90, -58, 15, 92, -163, -90, 146, 182, 49, 85, -75, 23, -52, 269, -38, -173, 133, -7, 24, -53, -131, 100, -39, 85, -43, 8, -142, -156, -105, 164, -255, -41, -88, -19, -78, 88, 222, -190, -46, 34, 116, -61, -61, -25, -143, 155, 102, -199, 208, 159, 202, -85, 180, 171, -193, -24, 55, -37, -66, -73, 70, -97, -31, -58, -109, 99, -337, -70, -108, -214, 85, -110, -80, 150, 13, 129, 40, -233, -84, 191, 101, -61, -131, 38, 41, 33, 19, 299, -77, -203, -94, -36, -192, -93, -61, 292, -56, -127, -93, -135, -236, -204, -179, -174, -297, -85, -140, 286, -88, 229, 107, 117, 244, 1, -37, 44, -40, -125, 181, 33, 48, -56, -161, -158, -34, 73, -31, 21, -204, 24, -12, -242, 108, -73, 53, 53, -115, 162, 125, -105, 76, -134, 132, 233, 106, -50, -323, -152, 204, -26, 289, 277, 25, 127]
7366A27l05K44J62p3o9j14l40N15k69J75j02J08Kj38J43JJ01j13l70K30R2P9p0
7389A6j42J79Q3n9k24L2N7J50J62k57R7q8J2M9j73J18j05N8J11j01j18K03J46
7412B06o3k81L3M8O9L8P0k38K30k02j32K27j57L59j35j42N0J23M4k59K49l39k15
7435d17K60R2L2Pk3k93M20o7p5L84l20k7N2j06l2r3L20j82L5J21j09K6j97K94
7459A02l28K24n7%l1J20pq5K61k36K3M8J90l50k4pM85m39k8J36P9q4P7k13O6J20
7485D2j74J64N9j33K14k20N5L77l07n8k01M5J63j04K53P5l10J59k14J80o9j39
7507a43J00q1K42k71M53l37o0K89l9K3k78M6k63O01P6o26M49l2L1l39K46r3J16
7530A10p0j89N0J25k79K33ok94M51p4k56K32k91K63O0j31K8mJ03n2J90o0j40J5
$$ y = [127, -178, 66, 228, 155, 86, -28, -368, 147, -122, 53, -49, 59, 61, -77, 66, 67, 168, 55, -315, -85, 7, 86, 16, -126, 53, 136, 77, -147, -115, -58, 92, 254, -3, 94, 6, 18, 67, -106, 12, -93, -35, 76, -25, -143, 60, 206, 143, -138, -105, -57, 12, 50, 120, -118, 112, -90, -222, 5, -152, 207, 72, -70, -20, 103, 147, -112, 137, -202, -417, -157, -65, -33, -26, -49, -342, 78, 11, -64, 320, 0, -27, 25, -81, -113, -206, 114, -68, -33, 88, -21, 5, -192, 102, -226, -2, -59, -59, -90, 30, 23, -62, 199, -37, -14, 34, 224, -126, -150, -157, 328, -111, -139, -3, 76, -8, 69, -144, -78, 42, -132, 32, 91, -42, 172, -48, 7, 384, 77, 19, -182, -137, 26, -78, 175, 250, -60, 99, -115, 65, -4, -143, -43, -124, 118, -153, 300, -37, -97, 192, 153, 176, -102, -56, -319, 282, 358, -268, 181, 149, 180, -159, 87, -6, 110, 40, -149, -99, 26, -253, -20, -26, -320, 131, 57, -199, 33, -258, 5, 65, -66, -38, -42, 61, 9, 199, 139, -1, 14]
7554A4M1k9L5p2R9j10Q6k03J53j92J73k8J92k52j1J09o5K94k04q1k60J94L63j16
7578A30j14N4k79M95k52l7O6j37L12j64j03l9J06j56K49j9n8j75N8Q7l4jo2J57
7602H4R3l54Q2L6ML34n25L49L00k72m56L77j70N3oj87J48K73j91R3L4j54j66K63
7626D2q4K17r1k12P5J02j50r2L92k8l9k52JM9j3J84n0o0J40l20j60J11M39p2m9
7651H0j31N1o2j98K03O6r4p6M46j57k11K11k79L13k86k1K79q0Q8k44J9J42k86
7674b27J08J17LO6l12J5M5j45N16j04R3m16L61m3m3m3L0p4o9J25K01j33N9n1r4
7699a5Qk1J20p6mj8QK8j1O0r4J16l31P8L85l44K90k62L65m24P7J32M5K59l63J0
7725A8l23J57K50k51K54k26K29l39J57O3L53m40l2J96j06j05L03j58K50m80K49
$$ y = [14, 55, 26, 61, -11, 88, -22, 64, -139, 14, -178, -5, -33, 159, -93, -104, 5, -60, 234, 30, -51, -311, -117, 246, 130, 16, 70, -209, 286, 34, -3, 63, -74, 238, 74, -29, -68, 38, -118, 131, 112, 54, -121, -63, 24, -10, -11, -73, 84, 177, -177, -95, -59, -55, 279, -246, 103, 403, 131, -325, 52, -118, -65, -71, -258, -110, 163, -28, 65, 99, -55, -221, 42, -42, 175, 84, -128, -53, 49, -101, -193, 199, 171, 132, -120, -119, -70, -83, 101, 51, -9, 131, -189, -349, -238, 201, 129, 80, -51, 0, -62, -260, -57, 9, -85, -161, 285, 128, -83, 128, -151, 162, -124, -145, 134, 54, 142, -102, -83, 59, -227, -119, -2, 1, 67, -245, -230, -185, -330, 186, 82, 175, -241, 120, 77, 34, -9, 21, -53, -122, 3, 204, 71, 130, 79, -15, -7, -28, 92, 16, 12, -6, 2, 30, 19, 79, -15, 101, -230, -152, 233, -111, 179, -83, 282, -142, -65, 67, 112, 371, 8, 18, -305, -148, 102, -149, 105, -121, 108, -231, -74, -11, 342, -98, -130, 66, -40, -145, 158, 0, 250, -230, 19]
7746A9k5j41J93k4j96K27Jl73J78O8l0J32K23k99K67k74J00K2L3j48P8l6j7j30
7770a52K31j58O0q1J40J09j75J26n9l4ql8k28L90k43J60%n6k44O5K70k22J21j68
7794a94K79j50M8n8n1K70j83r7K75k17j05K54j61J71Q9k94n2L89l09K53j73K38
7816B22k93L27j35k57j00J9M2J42k22J88J02n90M39J83l7k28J3l6M47m80J70q1
7838a65K22J7m2k09L5J80l9j01J25j17L37r7n82N76l57M90k11j33K78k83K2Q9
7860C5j26q0J80k09K50n9P1J37l20K83k85k22L72P9j45J9j60K7M8K3J59k56L81
7883B02k04k69N58l77K06r8K3Q1k19P8J28R1r3K06m48J07R5q4J13j88Q7l48K06
7906a47K03N9k4l6N2j74J95j27j16R3j32J02K26j19J3j11N4K19l97K52k03l8P9
$$ y = [19, -6, -147, 46, 22, -174, 53, 54, -319, -141, -73, -103, 29, 252, -47, 220, -54, 46, 68, 101, -47, 31, -5, -22, -152, 79, -79, -19, -100, 40, 149, -26, 100, 41, 7, -1, -39, -267, 123, -120, 40, 40, -16, -260, -195, 75, -147, -26, -194, 85, -65, -17, -75, -126, 144, -39, -136, 139, -78, -183, 71, -90, 81, 170, -124, -176, 213, -96, 157, -16, 222, -71, 256, 121, -136, -236, -217, -175, -33, -255, -67, 35, -555, -116, 67, 30, -198, -185, -221, 226, -254, -84, -165, 57, 74, 32, -177, -142, 38, -1, -102, 23, -94, 243, 146, -436, 140, -217, 273, 62, -71, 207, -76, -54, 35, -91, -171, 9, -200, 50, -9, 62, 199, -121, 162, -123, -345, 27, 106, -39, -20, -180, -153, -105, -82, 77, -179, 202, -2, -271, 287, -90, 116, 18, 41, 122, -97, -19, 109, 200, 107, 313, -135, -28, 67, -17, 96, -92, -5, -353, -147, 56, 115, 91, 55, 107, -67, 128, 1, -115, -22, -154, -52, 174, 55, 68, -43, 11, 230, -167, 85, -118, -156, -77]
7929g7j13J52Q0R0J21l28K71j25J20k46j40Q2P1k34L68k6K5j6J98m34J52mp8K17
7953A26j20L9o4K11j99O1q2J07k24K48lm36J72P4J95k29K7K13r0l3P9k5k45J73
7977b5J70k98J70K50l19k5O1J20j65J83j55K1K80m16L56p6j80pM5K33l82LJ96
8000D0k24L14l42J89k15K22j78K69j45K50J29n52L44J32j60K3k69J30K17J5k93
8021a04K3J10J30j21J77l85M2K54l79L11l6l0O4l7j26M9j05J50K8L3O9j55j01
8044a39K80j28k5R7j13m8J68J31k6j43p2J38k65N74l51J01k79P2K03n0j77M01
8066C49m36l1J85J0j46qj9J12m5K23k1k95K46n3Nk55K57r9j34J40J16o6J16o8
8090H3J28k15M3j14q1J04P0J50p3o1q0K0Q3j32K4r1J90K31m85K58j20n1NK40l64
$$ y = [-77, -190, -38, 42, 132, 253, -75, 196, 71, 191, -55, -195, -113, -42, -276, 92, 66, 91, 75, 273, -161, -9, -13, -91, 126, 6, 45, -19, 192, -7, 54, -28, 79, -145, 103, 100, -336, -164, -90, 105, -124, -97, 116, 26, -7, 72, 47, -198, -25, 145, -153, 17, 267, -52, -77, -16, 104, -61, 122, -33, -12, 268, -148, 208, 132, -48, -55, -10, 223, -159, -156, 40, -184, 130, -212, -23, -238, -16, -194, 75, -70, 180, 309, -243, 101, 233, 73, 96, -173, -43, 174, 189, -104, -81, 29, 159, 38, 215, -170, -128, 126, -253, 58, 22, -8, 56, 19, -107, -58, -163, -13, 15, 48, 117, -38, -139, 141, 13, -12, 85, -28, -76, 92, 223, 197, 54, -18, 120, -145, 429, 78, 179, -100, -28, 175, 125, -52, 349, -87, -118, 67, 77, -69, -77, -96, 16, -29, 194, 173, -122, 124, 71, 76, -179, 78, -21, -155, -15, 101, 35, 151, 83, 211, -4, 39, -75, -156, -52, 18, 168, 95, 34, -46, -26, 57, -75, -51, -142, 48, 279, -206, 52, -68, -119, -114, 126, -238]
8115b38M30k88j2J55j26L17j67J0l58L50k6K08l4m76J56K78K4j37j2j08O5j6M0
8138C5R0k1l9n9L57m5m85K35k82L79j67j66L75l84J88j6K32j86l40M74l09K96
8160A62j71J59k83R1L09j62j30k11M71k76J70k55J31j23l4R8Q6j00j22J3J83j53
8182a47L06l2j14K11p8K2j89j20J16
$$ y = [-238, 192, -96, -108, 47, -79, 238, 71, 81, -277, 73, 47, 255, 221, -255, -99, 179, 203, 66, 54, -54, 11, -5, 35, 125, 104, 65, 6, 363, 318, -167, 68, -214, 165, -2, -168, 207, -177, 11, -5, 227, 41, -299, 175, -134, 162, -9, 150, -133, -42, 267, 105, -25, -236, 235, -41, 129, -126, 5, -118, -152, -54, 32, -68, -190, -177, 6, -147, 159, 127, 13, 224, 146, 168, -21, -141, -25]
8191b5
$$ Imaginary data points
##PAGE= N=2
##DATA TABLE= (X++(I..I)), XYDATA
0@%%%%%%%%%%%%%%%%%pJ5j6J6j6J6j8K6l2L2m0M8n5O3p1Q0q9J03j17J30j44J62
39H6j81K00k22K46k73L02l32L66m05M47m92N43n97O57p27Q05q91R90j104J234
59F52j388J577j808K101k484L004l768M996p269J2811n0405n8539J30373L5772
73F5625m9244K0640J3659n7011K5458N7898n0908o5408K4324N478k3466K4701
85h254J2914m1690l457L6389R849N248J3709k0256j5091L1106J9200k1479j8153
98C5j8507j5340K5511K5897k9814k7289J7262J6518J1109J9641j6211l1925K2589
111e24M0166j0451j8490Q48j4757p516K2660Q86k6682o086M528M47K0701J3457
125A9187k5329j8184J6389J5379P872K133k3191j9480K4328K3139j4716j7074
$$ y = [0, 0, 0, 0, 0, 0, 0, 0, 0, 0, 0, 0, 0, 0, 0, 0, 0, 0, -7, 8, -8, 8, -8, 8, -10, 16, -16, 16, -24, 24, -31, 32, -39, 41, -48, 55, -62, 68, -76, 86, -95, 105, -117, 129, -144, 158, -174, 192, -213, 234, -258, 285, -312, 345, -382, 423, -468, 522, -582, 652, -736, 841, -967, 1134, -1350, 1654, -2114, 2882, -4387, 8424, -41981, -100520, 29853, 65625, 16381, 37021, 50680, -6331, 19127, 77025, 26117, -39291, -14967, -9489, -32955, -8254, 4660, -37030, -40487, -4098, 5751, 10999, 24708, 4452, -10639, 20467, 39667, 18188, 35, -18472, -33812, -8301, 17596, -12218, -39507, -22245, -5727, 5382, 25023, 8812, -23113, -524, 39642, 29191, 10701, 11549, -3208, -10724, 11936, 12822, -13860, -19946, -15418, -14971, 5730, 19187, -6142, -24326, -7937, 7442, 15314, 17447, -5744, -25224, -896, 22243, 7527, -9547]
137i547o826n333J8290K6796j1690k6433O253J6034K996Q764l338k6574k332K6282
151A3342L525j4316k263j0147j3806J8652K2899j5800k1950O117J0228Q793J1956
164A7230j2158k6556M955K5751O057r829r825q742N082J9018M967j5153j0560
177i763K595J0252J3275J225j6248j0703M397J0015O411m920j6812p695J2162
190e809J3102l49r623j1642l495J5632J6938m998j7192n668R848J4695M257j2642
204C054j3989J693J2802Q151j215r912j1102J957J4441P029p393j0625n727N856
218d980J5426M887j4099j4689K056J2011R078k657j4043r168Q349J2993K752o535
232A381j0484n059J1607J5985o9j4384q257N691J1757O647p532j2754k812P772
$$ y = [-9547, -16373, -21706, -3416, 23380, 11690, -14743, -8490, 7544, 10540, 19304, 15966, -10608, -12940, 13342, 16867, 2551, 288, -9859, -23665, -5013, 17886, 2086, -19864, -13747, -3519, 5274, 17230, 5072, -21484, -16529, 9222, 15279, 5450, -4375, -13117, -8035, 10983, 15950, 797, -9763, -7168, 3084, 16359, 17584, 1336, -9367, -4970, 5045, 11456, 6536, -10276, -17971, -5809, 7293, 6944, -2679, -14321, -17816, -2184, 14754, 9756, -7436, -13104, -3256, 11439, 15696, 3054, -10935, -9242, 3560, 11711, 10496, 584, -10518, -8561, 5880, 12909, 5516, -5109, -10836, -4980, 10446, 15333, 1234, -13455, -11399, 612, 9690, 7033, -7010, -16178, -7829, 5164, 7916, 1381, -9103, -14162, -2555, 13430, 13361, -1023, -9280, -3589, 8168, 14815, 7283, -5471, -8283, -511]
246e11Q160K536p727j2818j518J1412Q846k147j0618q685L308J4922P391j0245
260B306j3308q61J0247J1554M46j2556r005N143J0408N374k162j0475q633P377
274d145J5668J747j1810r228Q24Q564J0006k747j2821n865N130Q193M624m625
288C515j3156n231J0930J0457j484p135q319n96J3039J1512o676j2511j513O932
302b36R427L885q315j2382N54J0156N805j835q256j0489K827J4990M588r210q958
317g449j098N834J0333K315j1388r613L782P830N102p17j0796q245Q275J2813
331F978J177o695o509j945Q605J2406j720j2914n130M795O471N203m007j3918
345g203m839R184P937p50o861q851p07J2600Q963o372r193j026M137Q074O062
$$ y = [-511, 7649, 10185, 2458, -10360, -11878, -466, 8380, 6233, -4385, -13070, -9762, 5160, 12551, 2306, -11002, -11863, -1616, 9938, 10384, -2172, -11177, -6034, 4374, 9748, 7586, -2889, -11522, -4145, 11523, 13270, 1460, -7768, -6944, 1620, 11626, 8879, -3942, -9807, -4677, 3516, 8140, 3515, -9641, -14872, -3942, 6515, 5031, -2104, -10423, -11019, 2020, 13532, 6856, -5655, -7168, -236, 9191, 13076, 4761, -7621, -7067, 3089, 8894, 7059, -1197, -11686, -8859, 6131, 10719, 1509, -7449, -8547, -2713, 7620, 9935, -1453, -11066, -7284, 546, 5648, 4931, -5865, -14110, -5835, 6978, 8155, 1460, -5049, -6994, 1611, 14017, 12297, -617, -5747, -952, 5519, 10722, 6715, -7203, -12042, -2858, 5079, 4329, -2532, -11383, -12090, 510, 9473, 3101, -6092, -7118, -2981, 5093, 11155]
360A1155o819j1540o4Q263O119O51q365j0360K919J3909M132p061o766k210M510
375a527J1468K702j1064q477K770O425M666j453j1090r111O237J1201Q71n948
389b330o909j910J0031J1587k274r555k587L747N575N674k562j1736n981P037
403b193P943Q39o499r062p46J2121P759m894p872k984K583Q450N279p599j1602
418h477l47O694N012M09o792r190K541J2300N881m881o829k508O264J0410R52
433A1439q684o223J551M171N089N94j0181q459M659R976K760n191p954k270P718
448a005Q936j041q808n355J569O506N543l499j0021l549N797P201K922l774p377
463e955p04J0291R058k160q955m891L085P813K811p427r417k439M778N875J122
$$ y = [11155, 4336, -7204, -7268, 995, 7114, 7765, -600, -10960, -8041, 5868, 10000, 2939, -3827, -6037, -1527, 9941, 12643, 1579, -6898, -4128, 2297, 6963, 5510, -5580, -14691, -8454, 2747, 3618, -2330, -9239, -11149, -1118, 10469, 8195, -1360, -3947, -200, 5375, 11049, 8487, -3249, -9230, -2193, 5750, 6589, 90, -8972, -9718, 2403, 10162, 5268, -2604, -5588, -3005, 5445, 10724, 3125, -8477, -8824, -2130, 2882, 3291, -3501, -12691, -10150, 2150, 8031, 3150, -3679, -6187, 77, 10487, 11439, 2755, -3468, -1917, 2254, 7343, 7937, -2244, -10703, -6044, 3932, 6692, 1501, -6453, -8723, -1005, 7931, 6890, -1918, -7273, -5704, 802, 6345, 2846, -7175, -10724, -4927, 2274, 5196, 1422, -5955, -6659, 3632, 12690, 10530, 1575, -3316, -231, 7582, 10393, 2966, -6451, -8890, -4112, 1763, 2885]
478B885p537p638K940J0978N847l295o849k213M684Q288J352p017p951j552N229
493a849O536q71q580o262M125R733N128l116p351k303P505R101k51r033p222R26
509c784O403L425m048r418l488M184O541K371m050o271M75Q100P299j277o059
524D03l713J523N946M590l605q549m337N179P885J252p412p683J926R694O730
539I829m193q319k372N258O417O81p135p596p5N699M391j927n537m479J489P930
555F1O266k366o791j801N790P940J150o273p453o55O085N841k523q590n995L853
571e461R130K901p070p768J243Q172O301k231p049m293K605O163K151l517n677
586d400k430M044N852K444m202o399j577P044P703r60q624m613M345P862J871
$$ y = [2885, -4652, -12290, -9350, 1628, 7475, 4180, -2669, -4882, -198, 8090, 9442, 2425, -5526, -7078, -1849, 4687, 3816, -4764, -11026, -6901, 2832, 7960, 4844, -2507, -4810, 2695, 11796, 11545, 2512, -4710, -3784, 2619, 6044, 1996, -7422, -10910, -6726, -185, 2186, -1864, -8135, -7660, 440, 7739, 6462, 403, -3310, -1787, 4159, 8749, 5144, -3405, -7742, -2563, 5322, 6574, -838, -8521, -6595, 3099, 9829, 5636, -2683, -5055, 203, 6620, 7301, 166, -7430, -7505, -1806, 2585, 658, -4879, -9358, -7869, 61, 6327, 3961, -2830, -4631, 1159, 9099, 10249, 3976, -3477, -4132, 1953, 7794, 5271, -3319, -9314, -5461, 3669, 6570, -500, -8268, -7025, 1147, 7448, 5217, -1832, -6125, -3520, 2643, 4794, 1277, -4400, -6830, -2786, 3066, 5510, 1308, -5091, -6668, 376, 8079, 7119, -1505, -6118, -1773, 6089, 7960]
601G960n853o743j095N967N743o42o371o197J829P744L284n108o186j121M376
616b413N520J745n528n631R88N793M930l36n777m126K432P341L503m744p186k591
632f080N769P968m90r145n682L721O561K243l634n975k213M190O802J061n012
647H4n336m94N744N664j473o418l258K372N720L810l322p599j973N959P076J78
663F734o167n054Q84O803M444l953p010l212M357O486L76o080n631J214M900L537
679B628n15m200m064K209O796L492l122o112k417M625O813O10o498n014J183N704
695B118M231k191p018l700N006O786L87m961n370o11N208M873j574o454l023K354
711c939N343K992l137n260j492L935N051J567l762n008n31O214N583k569p151
$$ y = [7960, 2107, -4636, -5731, 236, 5979, 5337, -1034, -7231, -5402, 2342, 5626, 518, -5668, -6789, -2413, 3107, 4852, -676, -6307, -5319, 474, 5404, 5068, -709, -4835, -2403, 4938, 8441, 3697, -3489, -6080, -311, 7657, 7167, -1978, -7660, -3939, 2622, 4865, 1231, -4744, -6957, -2767, 4035, 5096, 84, -5252, -5746, -2, 5662, 4189, -2229, -5487, -3115, 2605, 6415, 3093, -4506, -6479, -520, 6556, 6734, 567, -4487, -3603, 3200, 7644, 3691, -3319, -6531, -2174, 4312, 4688, -1392, -7023, -5809, -909, 2628, 2113, -2087, -6151, -3942, 2854, 6346, 3224, -2888, -5305, -680, 6133, 6743, 245, -4769, -3586, 2118, 6349, 4158, -2860, -6560, -1554, 5232, 5619, 658, -4712, -5323, -115, 4758, 3184, -3270, -6293, -3939, 1404, 4396, 1259, -4001, -5493, -1558, 3493, 5060, 1298, -3710, -4241, 1973, 7556, 4987, -2164]
726b164l322L960O628J826o006n698L70M921M069j187n439m539K356O221K942
741D938l844n618j691L992N803R31m740m603J053N368L856j096n299l651K696
756a905N458K448k922o082k156N235N817p50o741m277K839O019J724l180n343
771c816j674L658M439Q65l998n167M47N487M233j562n331k715L087N766K562l599
787B682n338o73M454M543p17n124m176Q28M980L572k558n986k766L897O053Q71
803D542n009m771J084N031L501j616m940l174J788N378K745l507n405p66M789
818c30M990J33m524l600J466N320L276k623n637k407K887M771L64m591m546q00
834e851M281M514n42n293l626L032N779K537l739m352m96M051M383j17m185m149
$$ y = [-2164, -5486, -1526, 5102, 6928, 922, -4776, -4406, 515, 4584, 3397, -2042, -6581, -4225, 1996, 4938, 1094, -4524, -6215, -2223, 3580, 4511, -229, -4832, -3779, 1589, 5445, 4349, -950, -4601, -1905, 3553, 6001, 3079, -3003, -5159, 76, 5893, 5143, -1598, -5875, -3036, 2983, 4707, 1527, -3816, -5490, -1832, 2607, 3472, -526, -5693, -5246, 241, 4474, 2912, -2419, -5134, -2047, 3719, 6281, 2682, -2656, -3329, 1125, 5668, 4951, -173, -4349, -3521, 1459, 5031, 2473, -3513, -6279, -2382, 3671, 4542, -467, -5238, -4154, 877, 4378, 2762, -2178, -5352, -3564, 1814, 4559, 1052, -4353, -5119, -330, 4660, 4793, 269, -3331, -1865, 3455, 6731, 4108, -1529, -3936, -1049, 3722, 4086, -505, -5051, -5851, -1570, 2944, 2402, -2891, -6517, -3485, 2294, 4831, 1092, -3260, -3756, 295, 4678, 4561, 376, -3773]
850c773M75M673L654k113n804j995L605M886R05l580m076L2M619L729j597m439
866g99l569J466M470J998l126n264j610L519N112R59m416m035J810O008L033j725
882C831m606k035K568M703R39l648n016r61L728M565o95n625l299L062M855K053
898D419k683m127j310L005L928J82m054l958l30M371L537j292m657k352L165M947
914B791K157k958m483p5M421L642q48m548k622N94M077K165k485m746k136L127
930a927M830L48m393l897J343M590K468j465l724k452J857M519J795k960m197
945c265n47L639M227K5m335k914J390M582K344k497m710j660L394L495J66l945
961f11l274o3L582L630q51m571k618K733M798J398l370l991k70L664L166o41l630
$$ y = [-3773, -3298, 1375, 5029, 2916, -2888, -4883, -1278, 3608, 4513, 933, -3143, -3111, 1508, 5237, 3640, -799, -4368, -2902, 1568, 3566, 440, -4824, -6434, -2915, 2197, 3156, -1260, -5295, -3485, 2523, 5556, 3831, -775, -2810, -242, 4461, 5400, 1752, -3264, -4225, -497, 4068, 3373, -2252, -5551, -2489, 2366, 4419, 1736, -2391, -3701, -696, 3232, 3414, -640, -4598, -4928, -557, 2980, 1688, -2969, -5321, -2156, 2791, 4948, 1990, -2493, -2568, 1853, 5495, 4647, 99, -2523, -1929, 2148, 4313, 1828, -2918, -5054, -1927, 2903, 3251, -1142, -5039, -3696, 894, 3362, 1897, -1827, -4279, -2422, 2097, 3892, 932, -3265, -3812, -173, 4054, 4079, -256, -3170, -1780, 2802, 5146, 2649, -2061, -3721, -327, 3168, 3334, -611, -3885, -3948, -366, 3264, 2413, -2158, -4776, -2043, 2755, 4153, 783, -3208, -3478, 186, 3352, 2711, -919]
978i19l012N85M327L068j614m471j003K743M172J208l375m465J45L901K946j343
994B893n075k750J979M233J032k584l308j068L160M463L72m264k795J385M766
1009B439J771k098l823r84K239L639N73k941l540k98L330L490r71l832k505J656
1025a855L650J989k647m156j094L236L592j23l748k932O82M175K418j889l419
1040b121j493K396M244J322l624l678P58M009K458j365l413k370J558L054J402
1055C137j700l478j771K795L826M64m126l469J064L912K701j411m397j835K676
1070a612L765J283k730l548m07L442L371o09l274k281J049M070J763k542m025
1085b285l82K487L155k74k863k793J26K918K690q53l650k449J643M406R51k939
$$ y = [-919, -3931, -3346, 981, 4049, 2435, -2036, -3039, -296, 3876, 5084, 1709, -2756, -2611, 1290, 4236, 2893, -2182, -4932, -2953, 1280, 2312, -272, -3580, -4648, -1488, 2975, 3347, -917, -3712, -2327, 2439, 4210, 2112, -1711, -2695, -456, 3183, 3756, 815, -2725, -3023, 307, 3797, 2826, -1006, -3511, -1855, 1795, 3784, 1137, -3019, -4113, -877, 2715, 2592, -1156, -4088, -3406, 769, 3187, 1298, -2121, -3614, -1218, 3026, 4348, 724, -2954, -2196, 1813, 4271, 2906, -507, -2877, -1319, 1735, 3137, 1437, -2041, -3812, -1017, 2809, 3273, -853, -4322, -3258, 654, 3355, 1944, -2453, -4288, -1612, 2153, 3436, 706, -2842, -3249, 193, 3564, 2955, -319, -2600, -1551, 2519, 4282, 1740, -2285, -2667, -180, 2975, 2701, -162, -2955, -2829, 89, 2779, 1926, -1724, -4173, -2530, 1876, 2827, -112]
1101a12l246K16L175L108o56l268j940J435L537J646k066l215j209K491L064K27
1117C187k903k938K5K961K787j173m176j535K225K934J039k111l490k94K916L240
1133B694J67l775k976J692M123J939k418l634m22K546K925L24k633k746J87L047
1149A040K360q49l252k455J305L748J212k495l634q60L003L266n60l569k306J910
1165b136K893J788j088l322q93K123L754L76l080k630M69L077J837j117l112j307
1181b368J042K833J500j885l103j090K683L032m0l346k866P03L288K294j969l402
1197b694j350K942L205M39k967j746Q10K362K410q50k718j930Q39L609Q11j909
1213A263l264n89K686J895q7k540k490O62K788K335j214l414j495J953L346P06
$$ y = [-112, -3358, -3142, 33, 3141, 2485, -783, -2723, -1288, 2249, 3895, 1829, -1386, -2595, -104, 2960, 3187, 284, -2654, -2629, 332, 3119, 1946, -2230, -3765, -1540, 1394, 2433, 322, -3168, -3462, -546, 2694, 2861, -914, -3890, -2198, 1925, 3864, 1446, -2188, -2610, -64, 2861, 3185, 552, -2194, -2007, 1040, 3400, 2551, -701, -3156, -1851, 1897, 3109, 614, -3020, -3880, -877, 2389, 1829, -1740, -4046, -2136, 757, 2545, 1457, -1865, -2758, -635, 3119, 3495, 415, -2215, -1746, 1331, 3168, 2051, -1061, -2368, -1326, 1507, 3007, 1122, -1981, -3071, -388, 2644, 2604, -742, -3608, -2905, 383, 2677, 708, -2694, -4044, -1102, 2103, 2542, -425, -2171, -1361, 1001, 3411, 2561, -157, -2087, -1248, 2361, 3172, 1263, -2001, -2590, 96, 1991, 1904, -636, -3126, -2464, 324, 2659, 1445, -1969, -3464, -1511, 1835, 2541]
1229B541k443l130J08L243K564q95l088j724J865L230O63j920k397n36J914K432
1245B427M02k489k924L65L447J864j401l477j149K014K792N43k547k734J65K218
1261d84K414k04k830k092J147L428J345j505k788p75K961K545J70k913k152J117
1277f16K196J491j180k897j596J143K340Q58k020k881l93L024L023p93k803j449
1293b553J433K891J193j829k652q76J462K635M37k647k636O22L496J670o74k706
1309g34j024J687K680R79k286k750n70K312K079q80k786k225N90K691J491j099
1325A55k500p80K365L096K11k143k280J056K133J741r51k422j998J176K515J023
1341B397k303k774K8K352K561k13k521j504Q13K560J269j389k889r68J792K319
$$ y = [2541, 98, -3032, -2924, 319, 2883, 1988, -1100, -2824, -959, 2271, 2934, 1014, -1383, -1919, -5, 2427, 2829, 340, -2584, -2219, 1228, 3092, 1691, -1786, -2935, -921, 1871, 2414, -133, -2867, -2702, -484, 1930, 1726, -1104, -3196, -2049, 1379, 2724, 1219, -1569, -2344, 617, 3162, 3332, 419, -1733, -616, 1580, 3071, 1891, -1006, -2602, -1459, 881, 1739, -281, -3162, -3555, -531, 2492, 1699, -1104, -2553, -1120, 1771, 2964, 1135, -1517, -2393, -931, 1704, 2141, -506, -3142, -2520, 976, 2646, 1972, -734, -1758, -71, 2609, 3588, 1302, -1448, -2018, 294, 2373, 1493, -1293, -3518, -2928, -237, 1254, 155, -2345, -3125, -760, 2336, 2547, 404, -1876, -820, 1313, 3054, 2103, -319, -2317, -1141, 1374, 2397, 94, -2680, -2652, -300, 2261, 2048, -473, -1977, -1164, 1396, 2665, 1276, -1613, -2581, -789, 1530]
1357A530J56k080k241j91K596K095m92k785j374J984K729Q13j690j937o93J877
1373B97K387Qk094k434J13K794J902j750l116q52J914K717l82k030k160J18K165
1390d03K158n36k303j458J376L037R99j851k098q36K120K458m48k672j873Q58
1406a472K294J070j200k011q90J301K467P35j708k560p6K261K226j001k895j600
1422c059J668J982J176j602k219l73K264K297J03k042j794O93K329J793j656k381
1438h21r66J281K260L04k085k211K69K118J569m57j908j336P74K221J352j779
1454E85j945j139K104K429k03k712j669J340K160R69p98j914r80J449K233P40
1470B649j967j928j34K327J576p56k232j830N72K497R89j444k286o53J752J811
$$ y = [1530, 1686, -394, -2635, -2826, -230, 1865, 1373, -1412, -2786, -802, 1927, 2740, 1050, -887, -1580, 297, 2684, 2692, 598, -1836, -1723, 1071, 2973, 1223, -1893, -2745, -831, 1886, 1504, -526, -2686, -2568, -403, 1755, 1219, -1084, -2542, -1166, 1871, 2870, 1019, -1079, -1915, 205, 2663, 2215, -457, -2330, -1472, 822, 1892, 692, -1319, -2209, -908, 1559, 2294, 586, -1974, -2050, 211, 2437, 1436, -1459, -3059, -1391, 591, 1767, 165, -2054, -2427, -163, 2134, 2237, 195, -1599, -906, 1423, 3216, 1560, -821, -1787, -506, 1754, 2058, -27, -2238, -1969, 149, 1718, 1261, -647, -1983, -1209, 1012, 2364, 585, -1360, -2499, -395, 2034, 1831, -881, -2550, -1210, 950, 1919, 1121, -793, -1773, -324, 1909, 2649, 682, -1246, -1380, 947, 2523, 1767, -465, -2295, -1723, 774, 1763, 319, -1967, -2620, -868, 943]
1486I43M73j715j803N47J947K178j090k015j330J310K408N49j729k192qJ729J873
1503B075l88j846j857O11K494J340j840k225j61J021K181J86k280j200M3J886
1519D0J484n84k175p88J402J718J003j232k113k89J888J940j47k701j292Q23K288
1536A265P87j442j688n35J122J914M23j879j795j49K147J641q25k394j268J651
1552a025J914M64j338j688k8J789J929j79j690j011L54J580J351r32k068j357
1568a935J449K261j12j909k037O03K106J176o96j692r25N65J859Q99j118k143
1584a649o63J842J810Ok056j336Q39J997J016o61j875m67J128K060L05j721j589
1601a014j03J381J436m41k232j554J211J944Q31j558j689l50K233J707m28j711
$$ y = [943, 1416, -299, -2102, -1555, 392, 2570, 1480, -535, -1865, -555, 1853, 2402, 673, -1519, -1527, 202, 2075, 1687, -159, -2016, -1405, 1089, 2429, 589, -1636, -1797, -776, 1405, 1591, -689, -1889, -1846, 40, 1524, 940, -1235, -2023, -621, 1097, 2100, 868, -1245, -1534, 354, 2294, 2147, -554, -1846, -1023, 1265, 2052, 610, -1078, -1613, -491, 1423, 1846, -33, -1828, -1977, 170, 1811, 986, -1408, -2676, -1025, 889, 1353, 15, -1673, -1701, 88, 2017, 1838, 148, -863, -509, 1071, 2422, 1490, -578, -1935, -486, 1775, 1663, -246, -2283, -1680, 426, 1602, 906, -786, -1711, -1146, 713, 1612, 494, -1649, -2312, -470, 1340, 1346, -710, -2046, -1207, 790, 1806, 1145, -730, -1197, -69, 1991, 2296, 575, -1014, -1117, 264, 1700, 1259, -973, -2527, -1316, 628, 1459, -99, -1788, -2138, 95, 1802, 1374, -337]
1617c37j278L44J739J229q40k235p38J118K175M28j688j621M66J834J706m36j714
1634A52j323Q49J668Q17j393j861m99J059J164J74j773j439M12K017J259r54j394
1651a065n53J070K125L01j275j509k86J732J423k03k611j018J079J891L48j177
1667B72j560m34J486J587l05r54j602J40J761J367r25j629j079P45K023K22j175
1684f0j372l34J793J493l2j701j068P29J718P41r26k032o14J889J187N6j787j801
1702b121R26J543Q66o09j350p70P20J689N22r04j582m56J348J599j26j994j203
1719a902P80J880Q58r45j512q01J720J528J93j339j592K12J442J142o44j583j228
1736a791J064J699M53j535j334l42J812J086k42q92j154J07J501Q85n35j781m43
$$ y = [-337, -1615, -1271, 468, 1697, 857, -1378, -2116, -998, 1177, 1605, -83, -1704, -1238, 596, 2302, 1866, 152, -1171, -322, 1346, 2163, 770, -1091, -1590, -531, 633, 807, -966, -2405, -1993, 24, 1283, 329, -1065, -1618, -548, 1577, 1878, 603, -906, -1192, 540, 1963, 1760, -851, -1869, -790, 1101, 1449, 272, -1288, -1722, -236, 1351, 1046, 92, -1510, -1370, 391, 1758, 833, -796, -1875, -1130, 893, 1115, -60, -1432, -1766, 27, 1520, 1488, -213, -1281, -552, 1166, 1907, 981, -1051, -1665, 224, 1411, 1467, -320, -2121, -1195, 348, 1214, 605, -745, -1515, -795, 894, 1416, 512, -1070, -1526, -178, 1421, 1295, -699, -1902, -1122, 758, 1616, 671, -841, -1642, 78, 1606, 1799, 460, -1132, -920, 522, 1664, 1020, -563, -1791, -727, 972, 1425, -110, -1444, -1786, 26, 1112, 870, -22, -1176, -1069, 432, 1317, 782, -999, -1442]
1753a442P46K015K63j598j260L11J701J194p04j556p28P86J716L26j287j484n32
1770a533J202J113M0j538j647Q12K053O96p71j485l57J440J545P1j132j294j66
1787i51J511J055l16j979p80P03J735M29j070j389k77J194J350N6j442j258N66
1804h63J407P00n51j701p47J044J751O6j109j449o1J614J408m82j464o91Q39J253
1822I64O73j004r85l58Q31J677m93j571j440N06J559N89o25j534l86P94J708K44
1840A149r91j443L38J400R31k14j691o81N23J490M03r53j426k67J362J102Qr37
1858A03r13L81J258R07p76j180r95J007J103J82j321j408n3J412Q29j70j229q65
1876a728O97J968O91q20j301l77J291J225p9j265j200J50J148Q77p10j549n04
$$ y = [-1442, -696, 1319, 1582, -16, -1276, -965, 736, 1930, 1226, -330, -1058, -272, 1444, 1770, 483, -1001, -1533, -331, 782, 822, -716, -2363, -1551, 502, 1198, 427, -1058, -1415, 25, 1570, 1641, 509, -785, -951, 560, 1615, 1299, -680, -1460, -757, 978, 1407, 337, -1052, -1329, -135, 1215, 1271, -171, -1429, -863, 544, 1244, 693, -1008, -1755, -711, 1040, 1106, -3, -1452, -1513, 101, 1509, 1027, -437, -1128, -289, 964, 1637, 633, -352, -710, 121, 1798, 1305, -266, -1706, -1200, 359, 948, 323, -1211, -1597, -803, 905, 1149, 158, -1285, -947, 453, 1384, 1170, -521, -1202, -679, 811, 1214, 261, -1165, -1432, -70, 1032, 1040, 103, -810, -429, 829, 1736, 960, -220, -1215, -208, 895, 1077, -244, -1652, -1705, -293, 536, 366, -863, -1728, -1031, 937, 1628, 808, -493, -870, 421, 1646, 1567, 302, -898, -748, 400, 1277, 567, -982, -1486]
1893a486R13J450m1q71p74l9J027J251J07j719j075K94J388N55j222r49l44J035
1911e00J264J4q66p87K60R80J287n22j248q11O31J374L07r13j645r5J002J312
1929A044l91j371o93P23J120M58n75j004l07M84J159O12j223j202K05J390P62
1946A191m38j332m98O77J457K14p92j224j95R80J232k7j350j147J62J384O07p40
1964A61j407j66Q15J252J0r63q17K97J292O11m01j010p05P94J153M32p58j390
1982h00m47Q98J578l43r63r13L57J009P60l27j330m40L66J479J0r10j242J0J251
2001CO64l84j122n39O75J202M26o53j121m8J390R04j38j065r52K19Q49R56p85
2020D81j137k80O08J192k1q45r01j81P48J441k53j075j034M05J198N62p97j040
$$ y = [-1486, -573, 877, 836, -35, -809, -848, 179, 1430, 1537, -182, -1257, -963, 425, 980, -242, -1191, -1535, -500, 764, 778, -88, -875, -615, 365, 1652, 1130, -118, -929, -298, 1076, 1383, 470, -1175, -1270, -268, 1044, 653, -718, -1411, -688, 432, 890, 315, -689, -996, -512, 647, 1259, 36, -1166, -961, 429, 1191, 753, -579, -1077, -400, 1057, 1271, 479, -745, -940, 40, 1272, 1245, -105, -1252, -1090, 294, 901, 161, -1246, -1412, -597, 655, 665, -298, -1115, -818, 474, 1085, 684, -326, -1031, -237, 916, 1348, 590, -800, -1247, -349, 1229, 886, -77, -990, -633, 376, 1136, 809, -521, -961, -595, 884, 894, -16, -1258, -1248, 3, 667, 283, -839, -1378, -703, 499, 925, 272, -849, -897, 493, 1397, 1259, 194, -758, -539, 310, 1266, 481, -656, -936, -328, 864, 843, -2, -903, -1084, -336, 1105, 852, -223, -1257, -852, 346, 908, 111, -929]
2038i29m03J070J192j26n43j048M52J046O71l32j122q18P52R03K47p45j256k51
2056a240J378Q38o67p92o98M02J390N65j020o92l13N27R31M44r06j453M52R29
2074G5P75l54j223k34M27J212L45p70p27k9P33R82j32r21j052N52N43N06m55j284
2094a031k67Q66P50K49r19o94N54Q22Q96l59r36l17K08Q97K99p73j168l19J061
2113a81R04p9r47q53P94J027O63l80j110k48L02J147k28p99j131p3J045O56m75
2132C4p54p24P03J350M24n79q94J14Q26Q28k58r50q67L6J157M72m58j358n78Q60
2152f16J314o5j035o11M04R16Q30l47q10o59K47P59L12n69j171J09R52M38J99
2171E97o96r78M77J000M83j81r22n12P69Q86J16q20j051p8J144L61j86j005n20
$$ y = [-929, -1332, -262, 930, 804, 261, -787, -335, 711, 1382, 1050, -72, -890, -138, 765, 1012, 267, -989, -1240, 138, 976, 309, -483, -1181, -779, 611, 1176, 156, -536, -849, -322, 609, 1053, 147, -1306, -854, 75, 850, 496, -727, -961, -534, 678, 1023, 253, -474, -503, 230, 1212, 1080, 159, -893, -341, 202, 708, 253, -1031, -1298, -432, 318, 567, -352, -1046, -492, 330, 1226, 867, -69, -386, -178, 719, 1018, 245, -923, -1242, -181, 723, 644, -303, -1156, -362, 665, 1328, 948, -162, -410, -108, 1039, 811, 12, -1119, -1192, -147, 509, 34, -720, -1444, -741, 609, 1033, 454, -440, -326, 500, 1328, 1070, 120, -747, -711, 446, 918, 460, -898, -1476, -616, 698, 633, -402, -1013, -609, 307, 1137, 790, -20, -679, -432, 327, 639, 70, -1101, -992, -40, 398, 597, -99, -1077, -600, 400, 883, 702, -220, -732, 37, 923, 1039, 219, -832, -910, 234, 595, 409, -596, -1116]
2190a116J67J708r2m59r57l20J028Q71k7p81r72L25J124N16o83r25j51L36R29
2209E21J89o53p98M92L59O19l43l99p28J71R21N16n91q35m56J035O17P8j030p53
2229a068M12Q30L00L8q64l32L52J126J59o14p07r4Q09P24j78r52p93P57N80M15
2249I00m92r80l31P25N78K96q02j028J45N95R76l25q73l00L67J194J04n14r27
2268f92L48N78N91m3n75p11J20R31L91n50j044j04K84J047l0q84m41M05N52Q36
2288A009q09o87R0N8N53J49o4p43n38J001O50j18o60p71M76P34N69m24q93q9O01
2309I4N99K50q15n82j03M25Q21q6j229l89O44O81J72m08p64O3O17O25j31p77l90
2330f83J15R49J46j86m85k64J70Q81L33m90r09o5P34L26J69r81l52K87P62J95
$$ y = [-1116, -949, 759, 667, 208, -749, -1069, -41, 830, 803, 22, -950, -625, 499, 1015, 332, -593, -744, -408, 521, 710, 57, -741, -249, 110, 729, 386, -13, -741, -570, 351, 867, 276, -559, -1015, 20, 637, 715, -315, -1068, -656, 174, 474, 512, -352, -684, -332, 794, 953, 339, -368, -462, 347, 1071, 893, -59, -852, -95, 485, 900, 408, -572, -903, -178, 400, 696, -106, -1134, -989, -394, 582, 257, -616, -916, -549, 645, 749, 235, -692, -344, 234, 825, 782, 207, -504, -384, 547, 938, 388, -656, -760, -476, 571, 541, -343, -784, -379, 173, 1009, 200, -487, -397, -339, 214, 363, 299, -444, -982, 19, 669, 551, -109, -880, -404, 330, 899, 475, -418, -507, 94, 693, 943, 128, -454, -557, -132, 689, 603, -626, -1015, -371, 310, 482, 74, -690, -627, -10, 615, 484, -293, -683, -568, 381, 527, 341, -144, -408, -238, 643, 976, 486, -423, -488, 246, 572, 741, -240, -592, -305, 457, 652]
2350F52o18p23l31J040L97K3p55n27K13P78M62m28m41j87K74O13M59p07m67k88
2370e61R53L89j23j003k01J58M58O38p69m33j0M54L42J63n93m52l8N26O33l28
2390B03n25n58O32P14Q0q56l80J74Q13L40r9n64n38J95Q76L48n57p16k17O05O63
2411F33k49m82p98N78J69M69k64o05n75Q94M74K35k81p18l3O13O29k88k29p46
2431e74M39M87O02p06n36l37Q22M09j9m32n76J9M08O94k00j157k08O45N82n4j73
2452A35p55lM68N44Qn46m03L03O01M65m51l79m07O59L48L30q68n21J01P20M06
2473G55n13l37m40M26M52J64l70o46j81N39N54N2o42o43J95R65J5j87l82k84K08
2494c00O11N30o35o02K29N01N27n21l78n99L36M92K60l18p25M6L58O20k30k28
$$ y = [652, 34, -689, -1020, 20, 417, 440, -315, -842, -629, 149, 611, 183, -258, -445, -171, 442, 901, 194, -273, -561, 392, 781, 658, -345, -546, -388, 70, 708, -61, -494, -504, -50, 292, 455, -138, -590, -628, -102, 531, 203, -322, -880, -248, 466, 546, -310, -690, -516, 297, 637, 538, -26, -564, -369, 507, 855, 298, -418, -635, -30, 633, 384, -98, -896, -318, -149, 320, 56, -549, -1124, -230, 244, 479, 198, -520, -553, 60, 689, 401, 172, -574, -135, 352, 954, 248, -288, -625, 197, 606, 587, 155, -421, -402, 6, 700, 500, -657, -865, -220, 362, 308, 135, -620, -623, -155, 389, 397, -149, -552, -249, 352, 817, 366, -13, -420, 239, 587, 917, 49, -472, -371, 349, 755, 242, -95, -535, -109, 343, 507, 137, -509, -690, -151, 403, 455, -187, -830, -635, 330, 345, 158, -224, -508, -300, 311, 841, 206, -396, -167, 334, 861, 340, -38, -637, -301, 191, 451, 133, -592, -546, -188, 432, 202, -26]
2514b6m52R6M75K90k18o08k92L96P33J04o77k32K27M97M36p0m61p38K86O39M02
2535H07p43m34q6N41N11k99m93l11j44Q30K95o50r4k02M32O41l08j01m42j85M81
2556D6N53n21j54p07K08Q54K44m64m09O0M54L21J12p14o21N29N05L57m55k78n50
2577f30N38M74K5m63o67K38N39L41m6q22k46N67Q88k8n07k36k96K72P71l85m02
2598g5l67RN10L52j45n18n7K96M96K68o12m68k74M51M49j61n24m36M01N54M58
2619F07p01j24k79M78K32L68m75n93K8J073p7j57l71l61R9L43N40o18m87M69j47
2640a53R23m40p65pK55M55K88k65m95l05M17O66l08l92l39L36L19M49m69m20j48
2661c98L15M01J07q1n81R6P5L20J30n81j30J17L28Q1ln88RK68M49O5j7o07j48
$$ y = [-26, -478, -382, 93, 383, 165, -443, -735, -339, 394, 498, -179, -411, -184, 313, 749, 679, 218, -520, -234, 405, 807, 64, -370, -456, 85, 596, 297, -196, -507, -651, 179, 474, -176, -270, -472, -40, 601, 293, 192, -250, -435, 46, 599, 78, -76, -783, -575, 279, 523, 59, -350, -290, 164, 485, 597, -117, -738, -209, 296, 653, 198, -80, -630, -92, 382, 407, -56, -723, -485, 54, 395, 349, -473, -719, -152, 736, 708, 201, -35, -331, -59, 712, 327, -75, -442, -433, 77, 429, 284, -234, -291, 5, 501, 769, 157, -311, -585, -134, 315, 154, -370, -806, -405, 149, 607, -94, -218, -497, -19, 213, 581, 106, -487, -459, 614, 537, 380, 9, -352, -253, 90, 630, 12, -475, -6, -153, 770, 330, -435, -442, -187, 268, 556, 291, -204, -509, -92, 574, 266, -126, -465, -129, 190, 639, 170, -250, -398, -83, 318, 425, 344, -237, -141, -66, 254, 384, -197, -327, -210, 118, 199, 196, -392, -383, -115, 334, 399, 382, -225, -373]
2684c73N75L32j98n21k50N31O10r1p46l06J59M34O19m30m96m45M58M62K93p08
2704i1j38k29L82J9M61o20j57j40N04M28l14j78n16O51K05K12l78m97R7N05L41
2725E47r1m36l13N1O13R8l29k76j13L35J42n6j68o37N07L34m0M5n30j48J34O31
2747C00J28m05l46O6J73O18k26o02j17M15L01J56J74p70k90K18M35L6j19p44Q6
2768e13M59K15L1o03L8L41K56J4j52l43J0R5M22N9m98k46K56M57M7l74l28J28
2790b29M86L13j73l90m03K92J53M86j61m90j72J15N03O0m66l22k51N23M00n7o7
2811A50m01R3L02L05l19l36j31M46J70Ol24n0j00K96K31k3l85j94K16M70r2k11
2833A19o11j6L03M74P3l88m72K67pP15l33k83k85L56k4M88m20j61J74J09K07L2
$$ y = [-373, 202, 534, 336, -185, -435, 96, 706, 615, -131, -437, -278, 156, 775, 345, -151, -596, -138, 324, 617, -91, -229, -458, -76, -57, 404, -216, -373, -513, -9, 419, 105, -73, -589, 62, 267, 479, 101, -396, -299, 206, 547, 456, 20, -293, -242, 371, 469, 140, -136, -249, 86, 228, 172, 4, -633, -126, 208, 168, 213, -317, -465, -331, 300, 428, 23, -323, -257, -84, 534, 308, -294, -411, 4, 305, 461, 635, -135, -425, -207, 228, 264, 145, -599, -513, -54, 161, 192, -411, -373, -32, 224, 238, 86, -257, -247, -152, 270, 329, -169, -415, -159, 298, 345, -29, -357, -229, 257, 570, 397, 7, -396, -104, 49, 535, 374, -116, -288, -173, 330, 390, -76, -398, -649, -126, 274, 217, 150, -251, -158, 144, 449, 130, -206, -337, 109, 279, 285, -39, -89, -189, 107, 338, 315, -70, -264, -48, 422, 330, 119, -492, -508, -205, 269, 342, -46, -518, -251, -258, 457, 124, -159, -444, -88, -112, 376, -44, -205, -31, 78, 285, 317]
2855C17n94pK49K05K43l17o69L2P85pr9k24l69M53K29M6m6j97l09J21K18J12o4
2878A08l95j0K28K00J22l46k66j9M23K56k42k68k02L41L71K37n53m31J35M79O
2899A74j90k72q7L27K55P9m41K5j98M06L83k26m48j63L65O0K29j8o32K8L06L04
2921B66J20n85j35K47K21J50J19n25j26r1N39M2k56k90p4J97L13J23m79J21m5
2942a48K92J23j01j94j32j33P68j48n15k33Q4M54L79k19k01n88N59K38j35j12
2962C8m66N5M74O8j5k84j61J01J60J42j62j56j18K23J70L49l40j42j39L11L13
2983D21k33k03l00M45n5J23l80O1NN15k07k43k37M1J2L37P1j8m35J13j67N68j03
3006A31j12j20k85K78K57R5l57j86J6O90J9k94k74J1J35M57l0m10j53J61j23M38
$$ y = [317, -277, -284, -35, 170, 413, 96, -573, -541, 244, 237, 138, -86, -455, -2, 227, 273, 227, 30, -279, -158, 60, 172, 108, -287, -297, -69, 131, 253, -93, -359, -378, 45, 301, 59, -209, -411, -70, 301, 538, -15, -446, -311, 168, 174, -16, -288, -375, -48, 207, 286, -155, -130, -328, 78, 461, 235, -213, -376, -11, 49, 278, 260, -372, -344, -38, 266, 386, -199, -334, -87, 134, 284, 403, -122, -248, -339, 200, 242, -14, -304, -378, -181, 132, 255, -224, -103, -148, 144, 267, 166, -28, -160, -293, 475, 327, -188, -421, -337, 117, 496, 277, 76, -512, 47, 285, 150, 38, -428, -373, 101, 169, 154, -130, -291, -190, -30, 112, -50, -206, -324, -101, 69, 418, 78, -64, -203, 108, 421, 188, -15, -315, 130, 75, 198, -182, -121, -116, 399, 192, -51, -288, -247, -235, 102, 173, 155, -280, -167, -334, 234, 131, 19, -101, -386, -108, 149, 244, -113, -299, -283, 407, 426, 132, -142, -131, 4, 461, 431, 21, -132, 29, -94, 344]
3028C44k46k98k7J36L46j25J34n48n6N61J80k23k58k30JL18K37k03k62j2L99K59
3050D27O2n68k01L72p0L98m61p7j67K57J17K05l46n43M50L08p8pk03O0N2P0J46
3073B03j62l20J99J54L04l17J80k04j32L45J69j25m56k85K55M37J80k40m15P6
3093a54K60N0N5n67J3L70j78K13j23n0j92J69L01J06j40n44K76M31J74o17q5O1
3115a71J95O8J43k31m7l60N68K27k96r2l94K00L32Q4k64l44K03J36K93q1k76j19
3137b26J96J37J18m1j97J35k39L72r1j7l25r1L11M02j78j12n08K47K02J12J0q26
3159f09L32K58J25Pj55l66N10o9L42k53j55j44L52nJ81Qm33o4K96O4n1l21q4K40
3183FM75j07l47N1j34j73K46M44l24m44L3M61j32m0l73J73J52L21n5j24k88J87
$$ y = [344, 98, -200, -227, -91, 255, 130, 264, -284, -340, 221, 401, 178, -80, -310, -309, 9, 246, 43, -219, -231, 168, 427, 489, -79, -280, 92, 22, 420, -41, -118, -285, -28, 89, 294, -52, -595, -145, 163, 85, 78, -125, -65, -13, 57, 203, 41, -279, -80, 74, 378, 61, 241, 37, -95, 250, 419, 294, -162, -447, -192, 245, 425, 185, -230, -154, 106, 156, 211, -356, -343, 27, -151, 62, -61, -111, -303, -134, 167, 273, 133, -411, -135, 296, 470, -147, -232, -171, 24, 92, 235, 4, -43, -403, 165, 392, 96, 4, -390, -190, 142, 226, -38, -382, -179, -43, 250, 169, -107, -226, -30, 107, 225, 184, -13, 122, -117, 255, 164, 147, -178, -269, 42, 444, 266, 154, -354, -107, 95, 207, 217, -609, -277, -19, 106, 113, -42, -408, 102, 33, 375, 122, -33, -177, 175, 170, 351, 359, -74, -138, 158, 222, 171, -150, -234, 6, 481, 374, 27, 78, -56, -229, 17, 461, 137, -307, -274, 187, 55, 15, -358, -185, -33, 288, 233, 109, -179, 8]
3205HK9j0j4r7j9M8J9L69k26l56j63K25M11l34K8j91L07M8J00l03j92K54m7p2
3229a78K12J52n28k3J86L80L50o71J43r6J18K46k85k95L11J15J08k74J12l05L07
3250H5k84M13j30k02j13K89R5Q9l13j65l6N74l14R1r6q3o3L79j28k29L28j60J08
3273A35K50j95l06j40J76K08m0q8j69j78M31jm8K0p1l90M38K41j95k77Q6j9P9
3296e3K26k47j21OK66K63k80j41K5J40j04N05o04P0L1p9J30N50m15l24j69K78
3318d7L81k54l37K09j15K15oK9m26L86L6L40k11J27m31j17L47j71J77j93j94K73
3340A8mK16k47l07J86j16L99k55J1j20L77k02j28K50o0l61K19NJ41K7j56J21Q6
3363A00N5k35r4K5Q6N1J21P4j85N5J73N7l23J58j56Q2qj54N66m32OJ0J83j26k10
$$ y = [8, 37, 27, 13, -84, -103, -55, -36, 333, 107, -249, -412, -187, 224, -110, -82, -273, 34, 82, 182, -121, -313, -59, -106, -178, 34, 186, -342, -365, -179, 201, 551, -120, 23, -73, 45, 291, 6, -289, 22, 137, 245, -29, 83, -222, 85, -199, 214, 84, -118, -231, 58, 153, 242, -71, -236, -272, 302, -12, 79, -17, -100, -163, 216, 88, -141, 187, 27, 135, 385, 190, -116, -256, -80, 128, 88, 0, -169, -347, 84, 83, 35, 55, -16, -406, 32, 273, 78, -199, -113, -132, -53, 173, -74, -195, -189, 77, 340, 60, -81, -56, 84, -20, 485, -119, -49, -18, -97, 33, 583, 168, -156, -325, -47, 334, 80, -257, -48, -163, 52, 46, 75, -351, 35, 71, 411, 200, 327, -104, -221, 126, -45, 132, -61, -255, 18, 14, 230, -17, -324, -138, -254, 145, -110, -99, -219, 158, -44, -172, 78, 18, -343, -124, -119, 22, 49, -107, 14, 100, 155, -80, -174, -149, -63, -12, 109, 183, -2, 53, 226, 283, -40, 118, -38, 44, 36, -118, 448, 16, 22, 32, 215, 89, -121]
3388a21j61K48J2k7K98k68n6J05L9K03k24O4k05K34K03k68o0l22L60Mmk06J20
3411c2N0J46q6J61j11k24q4M42K9l19j09Q6J76K6J0k96p4k4J16n2M21l50k08K74
3435c2M87k25k12j7n93O95K4m6k74J12K1O5J38P0j07l08r5L96P9j26J85k37mo2
3459f6L13j58o7pqL07k16l0rj39L64l5k56l82L47j7K45j19K1j93M9L52k85J48
3483A59m86J83L08l86J52J17k38mK01P8j17N6j76N17J25l13j69P6k68K88J55j79
3505G9k4L8p2M1L19k71l40q3K78K8J13l1l54k3K60J13Q6k91K2pK25k2k4j82R2
3530c0K46Ll2j98j76Q9K25m8L45m87K63l00K15J52k01j60k6K05k06J91k80j29
3552c39L0M26m0j56l7l27N67j61L15l70r3J10J00J45n6k20p5K29K7r4K3k29M24
$$ y = [-121, -282, -34, -22, -49, 249, -19, -75, 30, 69, 272, 48, 112, -93, 141, 344, 76, 16, -306, 54, 58, 54, -152, -32, 18, 164, 78, 239, 128, -96, -180, 262, 291, -28, -137, -51, 125, 151, 161, -135, -209, -233, -117, -169, 252, -98, -306, -32, 455, 230, 18, 1, -592, 103, 127, 81, -193, -81, -60, 5, 143, 213, 106, -202, -297, 99, 178, 52, 237, 0, -4, -66, 247, 89, 22, 15, 7, 314, 98, 68, 59, -80, 284, 249, -7, -389, -42, -59, 186, 67, 88, -105, -56, 296, 11, 159, -327, -144, 164, -222, -70, 47, -191, -195, 6, 84, -33, 23, -153, 364, 489, 176, 7, 83, -185, 103, 258, 79, 55, 93, 21, 62, 381, 110, -230, -313, -35, -7, 106, 75, -279, -302, -42, 71, 157, -134, -112, -119, 106, 84, 60, -122, -30, 216, 219, 187, -11, -187, -98, 127, 79, 424, -63, 200, -100, 115, 267, 66, -94, -120, 85, -121, 70, -210, -339, -309, 117, 77, -79, -116, -443, 124, -37, 278, -92, -185, -75, 25, 170, 114, -106, -181, 48, 75, -19, 4, -225, 199]
3575A99L6o4l28o6K24m8M00j11k61J50l11m3M07j81j70j14M18o6j7j99J48p5K93
3598B21M1j43l25j7K34k66M88k51l7P8J02j1o1nk15O6L92r5k30P6k13M6K25r9
3622Ak4j15q5L01j5j2j8k69N10k32L08o36M31k30j55M81o3k5l02J10k73J76J09
3645b7m9K9K28nj8M5l77J96j17L20k63R0j46K70N3k6j60J39k28q1K41J58m38L
3669a63j24N69o3m85J29J10j35P7K06j00l03K21J32P7k3j63k01J05K18j35K7j91
3691b15K70j82RL25j00%k85N3K07j38J46l05K72l6J39o7k49J85M1P8rJ2j38n3
3715d0J03K5J76l69n5M11l2J32k42k81Mp4M10m8m01j2N29L0J8k80j21J05K1K79
3739B88q1l06K1j33J17L80k06j37j67L00J20j55p0J24j49K62p7q4j33P3J90j03
$$ y = [199, 235, 171, -157, -223, 1, -47, 353, 242, -19, 131, -180, -223, 184, 3, -167, -281, 137, 71, 54, -145, 3, -72, 221, 262, 119, -206, -223, 11, -255, 233, -18, -55, 23, 125, 114, 53, 48, -167, -101, 291, 196, -34, 42, -171, -125, 100, 1, -23, -138, -223, 78, 63, 51, 33, -236, 274, 42, 350, -286, 145, -85, -240, 241, 178, 153, -149, -39, -312, -136, -27, -76, -47, 181, 176, 158, 203, -174, 22, -95, 225, -38, 52, -94, 176, 229, 203, 43, 182, -46, -127, 114, 272, -166, -163, -287, 282, 219, -266, -137, -27, -162, -85, 121, 21, -282, -61, 71, 148, 125, -38, -239, -134, 84, -51, -24, -215, 55, -127, -118, 207, 107, 107, -178, -125, 82, -56, 90, -215, 57, 21, 160, 93, -156, 29, 70, 148, 139, 151, 13, -40, 63, 88, 264, -105, -160, 251, 219, 351, 109, -172, -168, -242, 168, 120, -281, -293, 236, 266, 284, 4, -117, -12, 9, 288, 207, -99, -78, -211, -94, 286, 80, -57, -224, 76, 196, 41, -29, 95, -54, 208, 131, 47, -86, -13, 177, 74]
3761G4K00k50k38L17q7P9oj99kj01L1J91l1k95J33K94R6q5j46L3k86K25J26k38
3785a65J62J92k92j66N76j77q1k36J35K57j08k01n2M4M74k18ok71j70J64J73o3
3807b9J77K4l63L70K3l70J41j23M3J35P2k51l9k5K68l5K04j24j08j72L78j03j47
3830e4J38r2J62j74p4J85k31K66j94J22N9l1k79K21J4P7j39j46P7K1K42j42l04
3853b76J45K93r8P0Kk80J77K9M3L6j91l43J41K99J51J0j87l60N60j33k4k03J54
3876A5n6M3qO8q3k89K4J83P8J58j41r2J03Q5o7j42lK69j41l9L82m44mJ38R6QJ95
3903C36n18L6p0J92R7q1j7J72j77K92j36k99J30J92r7J68q5k49L33j40P0Q1m28
3926a98k9M57o6N3k13Qj16j33L10J35j63k02R7K27m6j33M0k64Q0p6L05M8j87J55
$$ y = [74, 274, 24, -214, 103, 16, 95, 89, -110, -112, -213, -182, 9, -22, -317, -184, 110, 206, 121, -25, 8, -278, -53, 73, -165, -3, 189, -103, -269, 307, 130, 49, -187, -52, 205, 97, -104, -156, -112, 362, 144, 138, -133, -303, -139, 34, -29, 148, 172, -191, 179, 202, -168, -27, -150, -107, 28, 100, -151, -190, -215, 53, 18, 222, 98, -10, -182, 196, 93, -54, 84, -8, 154, -20, -94, 91, -140, 126, -68, 54, 113, 82, -197, 24, 38, 115, -24, -170, -93, -72, 170, 28, -276, -131, 162, 64, 134, 136, -144, 33, 62, 105, 141, -50, -393, -252, 47, 198, 208, 21, -339, 221, 88, 64, -139, 15, -41, 2, -6, 62, -21, -310, -286, -103, -25, 133, -8, -100, 3, 88, 21, -121, -124, 145, 4, -35, 347, -97, -101, 37, 133, 141, 336, -182, -146, -216, -24, 73, -8, -25, 147, -30, 262, 126, -173, -43, 149, 52, 220, 135, -114, 219, 79, 149, 230, -198, -227, 230, 164, 217, 4, 12, -104, -237, 73, 208, 45, -157, -60, 167, 121, -12, 28, -236, -156, -232, 73, 121, -66, 89]
3950H9rk52L68n37M18j01L40k62k8o5K1J45P3J54m01j82J03j0K17q2k93Q8J06
3973a00P6J62j83M1l72M39n2RK5k44J64J88O9j84k9J18j2K11j51k51J0J14j24
3996g6J15j37J18k6n6J34n9j77J71k36K23o1J70q5Jj01M03m29J51m5m5k24M34
4019A63ML5k39m5J91j36k2j55L39l5k09L34j33l26J52K86k33R1p0l38L81k66J85
4042d6Q5j73j48K76J41p9j18J35k02K48J12j33p9l13L38j18M8k6j04p4oN06j11
4065A59m62J83K1N2J56j77J65l0k02J35Q6k13J72k67N8M36k13j24J26O3J48m8
4087B24k86O0j09L08k20J53j90j15P9K72K25m16j02O3j43K83Q1l45q6L14K9r8
4109a9j6j76P0R0l6J60oj84K78N9k12K61k72j15J68l5OJ01r1k14L34M3k62q2l5
$$ y = [89, 80, -172, 196, -341, 77, -24, 316, 54, 26, -39, -18, 127, 200, 354, -47, -229, -126, -136, 81, -1, -294, -206, -100, -24, 138, -45, -4, -376, 63, 11, 20, 45, -199, -35, 153, 222, 38, 9, 127, 115, 326, 175, -76, -66, 48, -76, 39, -98, 20, -6, -62, 72, 13, -164, 7, -229, -6, -67, 103, 18, 19, -82, 321, -108, 43, -2, -47, -271, 163, 167, 202, -37, -82, 109, -27, -49, -204, 135, 100, -109, 225, 92, -234, -82, 204, -29, 62, -8, -346, 35, -231, -46, 39, -134, -282, -6, 135, 56, -62, 73, -129, 119, 231, 98, 19, -294, 44, -74, -26, -52, -156, -230, -236, 270, 159, -303, -120, -99, -47, 109, -68, 97, 67, -135, 0, 86, -127, 45, -222, -164, 272, 59, -65, 61, 124, 272, 224, -62, -2, -111, 197, -23, 130, -60, -175, -96, 176, 401, -15, -117, -54, -197, 86, 167, -178, -264, 50, 79, -19, -35, -211, -141, -51, -87, 73, 67, -117, 161, 220, 8, 269, -3, -118, 50, 15, 21, 122, 31, -183, 151, 194, -68, -150, -185]
4134a85N6K67J2m03l7L54O5j30J84k23M8J43k84J70O2m1j23K34j85j28O2m3K49
4157A24o0j64j8k05K36j94J89L72k40j12J29n8j21K50J21n78J6K64M7J25j43k68
4179b88J18K84p5k19L97m33L07j15J37j60J19j40J79k32J60k76K44L84k39l47
4199a95J18J79l30N5J47J6K1k37J06J74o3J75j98O4j05K22q8j8mj60J70L3k06
4222a24M1J27j37L58j56k27R2r2n4J05K50l91j58J42N59j54k48J46k23Q9J48J95
4244B88j31p9K52k25j82Q3Q1k72Q9J88o3ol48L31J71k3k48O5J30k19L26j83q4
4267e9m14M88O0j16J42k34p2J16K54j39Lj74J74J95k00k55K31K57j52k08J52J45
4289A94l30j9L84j99L9n1J4r5K41k99J11K6k61J02l0K41J11n63L0K31L32lj04
$$ y = [-185, -129, 138, 150, -253, -290, 64, 129, -1, 183, -40, 8, 151, -133, 37, 99, 58, -65, 169, -16, -144, -82, -125, 124, 64, -100, -118, -323, -87, -281, -92, 280, 40, -72, 57, -1, -122, 128, 249, -329, -313, -49, -2, 123, -20, -288, -170, 114, 39, -180, 217, -216, 91, -24, 113, -47, 72, -68, 111, -121, 39, -237, 7, 391, 152, -195, -77, 102, -228, -173, -26, -10, 11, -226, -120, 54, -9, 166, -32, 32, -73, 149, 61, 43, 39, -121, 49, 82, -124, -83, 44, -93, 265, 109, -118, -26, -118, -172, -67, 183, -208, -366, -224, 335, 181, -67, 79, -144, -55, 93, 288, 157, 78, 330, 105, -77, 6, 87, -185, -96, 92, 29, 23, -325, 6, 177, 154, -94, -29, 101, -118, 208, 25, -59, -473, 15, 75, -41, 101, -133, -205, -89, 165, 26, 29, -145, 29, 224, 24, -231, 0, 257, 105, -103, 49, 194, -136, -155, 229, 30, 69, 18, 32, -63, 178, -121, -10, 16, -245, -143, -173, 68, 179, -384, -354, -123, 209, 206, 102]
4312A02j86M2J3J69J29k83J92k24J75m9J1l1m5j17Q8J69j73j6k01J29J67j29l4
4335a02J71P0L5l09j8K77j66PL49m59L39l03L5M71l00J32l21po7Q9K32l49L41
4358A47j00l7J70k34M1j08k13M94j38j32j60J88K89l51J01l2l5k89N33J67j76
4379A25j01j92r2N10j21j92j0j9K92j66K42k15k14P6J35Oj45k90L25Qj83k8K12
4402c7J28k09j9K47k35J68k42l3N00k89J21l4j05K9L2J69k12k71J01J31J66j06
4424@j16L1r9K06loj02j84K54j90K61j02m0L21k34J13j22L07m64L60j56o8M3k73
4448b63K03K90M4l25J7j28J31J67o9o8l32K84K7Q3j10q1KP3L60j66k67m7K54o2
4472A7K4j97J60k16nL0K91j77N9K7P2o7j32L01o50L57k0K40j57N3j63R6J22L2
$$ y = [102, -84, -42, -29, 140, 269, -14, 178, -46, 129, 80, 91, 60, 15, -102, -14, 155, -18, -34, -235, -106, 61, -68, -102, 69, 139, 174, -135, -153, 124, -42, -35, 314, -145, 194, -109, -74, 397, 97, 229, -92, -99, -166, -77, 155, -194, 147, 47, 10, 180, -54, -13, -121, -334, 160, 22, -110, -270, -82, 207, -144, -43, -75, -110, -399, 134, 301, 125, 24, -168, -260, 250, 129, -63, -73, -92, 200, 34, 276, 61, -153, -77, 58, 64, -81, -371, -46, -38, -221, -249, -37, 91, -118, -137, 110, -125, 43, -199, -232, 268, -21, 100, 66, -39, -10, 22, 191, -21, -292, -191, -60, 106, 0, -116, -85, -184, 22, 19, 13, -89, -273, -19, -209, 52, -50, -90, 231, -3, 110, -12, 295, -169, 191, 35, -33, 10, -263, -60, 230, 274, -51, -34, -162, -31, 136, 67, -1, -333, -49, -22, 61, -49, -130, -128, -55, 305, 139, -128, -175, 79, 17, 41, -156, 4, -212, -217, -187, 104, -73, -14, 13, 85, 18, -114, 187, -463, -106, -126, 114, -43, 10, -153, -57, 65, 97]
4496I7l9k4l66J10L07j32Kj33J37N0j14J78o6j83J16K56k36O5j51L20l5j76Lj35
4520a49j38J2J16L49R4n11K84k9O9k01k9K01l50N79j64j38O2k13J71qj86N5m6
4543a70J6K94O9l04K8k03L22R4j52K8j37j5K01q4j33P6p2K7N5L0J97k67j74M64
4567A90j8l4j93L0n6l9RL28m15J0m3L46p9J18j18k34J87L60n91M06l49Q0J37Q1
4591A13L5k35k2J97K2j71O2k18M2K13J50Lj76m2L06k54K2k20J09p0L59j75m7n5
4615e2k01J71Q1mj18L9j79J71L74j28j87K13k26o1J01l4j72K17r7R9j35J24J5
4638A1j54K70j12k11J91J72j30k3qp7J88m91M31J14k76j34P8O7K48j48q7M3q6
4661a24N5K6J60j73n3K44n2j91L58n2l11p9J88K9n0J11p4L15k44j30J52k26j5
$$ y = [97, 58, 34, -332, -222, 85, -47, -45, -178, -41, 9, -105, 73, 7, -176, -60, 196, -40, 25, -126, 194, 159, -17, -14, -149, -287, -275, -159, 190, 284, -227, 57, 28, 97, -104, -133, 68, -282, 297, 133, -5, 57, -156, 15, 7, -179, -124, -170, -154, 140, 209, -95, -67, -270, 52, 146, -6, 22, -115, -130, 71, -13, -146, -70, -142, -115, -60, -30, 167, -100, -274, 190, 172, 138, -55, -25, -81, -120, -111, 217, -198, -188, -231, 115, 36, 154, 36, -198, -11, 349, -242, 164, -185, -105, 32, 113, 148, -87, -109, 88, 110, -61, 1, -217, -175, 38, 188, 191, 15, -27, 279, 25, 47, -173, -64, -134, 225, 50, 3, -52, -253, -82, -1, -5, -123, -84, -263, -92, 282, 154, -33, 180, -46, -107, -6, -40, -212, 5, -92, 7, -128, -4, 11, -143, 127, 15, -196, -5, 167, 37, 14, 6, -71, 117, -374, 57, 171, -105, -239, -161, -94, 154, 6, -81, -38, -124, -69, -43, 117, -56, -109, 135, 83, -108, 250, 198, -113, -192, -4, 25, -25, 86, 12, 327, 83, -47, 105, -121, -136]
4684a36J64j66M5j38J58jJ46j92L2j24K02K9K36q9j50O9l13J89L17j91m4j50j04
4707b11J46J61k22K03o5k17L32l61L53j40O1M0k65K3m2O5n9Q1K36k19J78nmL42
4731D11l63J5k04K46P4k29j63J91J28j34R6n0K2j88j06j0K86j70nM3M36m14L39
4754B51l11J48k30K25j4m8RjN1K96l02J11l90K94j89J92ml76M78k07R1j38K48
4777A84l71L91P7q5p4M1m97L57j26L10k14l2N8j82K33j54L44n39L39N8p8j46J71
4800F5j22K44k81J08J59j02p5J33pj74%j46K97j8o6K58l36Q2l87N21q8j19m7j16
4824b17K57j22L16l80K89j53j94M15j04j78J30j14K85m15J05O8pJ93k11k1O8j03
4846i3L9j44M39n30j06L41m7M61l69j37m4J94l4L06j56j82m1n5k5j08J41m1J30
$$ y = [-136, 28, -138, -93, -231, -73, -74, 72, -120, -88, -212, -10, 19, 255, 166, 16, 85, -228, -39, 278, 87, 43, -107, -211, -65, 96, -126, 77, 12, -205, 127, -234, 119, -21, 40, 80, -185, -162, -204, -139, -198, -117, 119, -100, 78, 73, 69, 411, 48, 63, -141, 105, 179, -50, -213, -22, 106, -28, 68, 18, 40, -148, -254, -264, 22, -148, -153, -110, 326, -88, 251, -60, 88, -142, 83, 69, 21, 30, 29, 80, 376, 74, 185, -205, 89, -100, 92, 88, -288, 190, -17, 74, -64, 184, -187, 204, 281, 196, 122, 163, -334, 23, -103, 207, -7, -39, 19, -163, 70, -84, 260, -279, 60, 118, 40, -106, 65, -57, 187, -94, 14, 173, 71, -4, 129, 122, -52, -52, -198, 99, 81, 15, 273, -63, 19, -368, 153, 65, -54, -101, -217, 40, -82, 234, -146, 143, -10, -204, 211, 107, -71, 59, -55, 230, -185, -80, -12, -19, 174, -37, -58, 10, -93, -54, -198, 241, -289, -395, -54, -101, 360, -9, -146, -190, 4, -30, 276, 120, -62, -103, -158, -183, -291, -150, -191, -61]
4869f1J09j48J75N0q7l51L22J5j42J68k00P1Q1p0J73k30K79l3Ro6j52K6J4J44
4893I6L1j33j16K00j19K55j71j00J87j01j06k3J44j65N3Q4J27j05k4J30m61L13
4915dj25L9j21K2K43k22P6K6k06L72q8Rj45P7jL41k78k0J36l42M5R0J42R2j96
4940c8J7J73q5J32q1L7k22L3K94k06N6j65K95r4n5k04j87K81M3Q4M0j81O9n4L43
4965C25j10k32k36J58J83j52J74j82j71J15K77k62lK61m8j53J40P3j70J82k62
4986i3J40j9K02k15j22K40j99MJ04K0O5k48J35P6q4P3q2j1J75j03j23J88k27J18
5010A4j6J86m83N3J02J93q0j1M0n0K7K11l94K22q2J71K32j77p6k07o8J60j55J22
5034f6J61o9J7n9L37j58k96K55j18P4j33m7J35j41J51K43k37J94j85N9r0K9J72
$$ y = [-61, 48, -100, 75, 125, 38, -313, 9, 24, -118, 50, -150, -79, 2, -68, 105, -125, 154, 121, 130, 64, -88, -62, -48, 96, 127, -6, -122, 78, -41, 214, 43, -57, 130, 29, -77, -100, 44, -121, -68, 16, 143, 38, 14, 144, -317, -4, -129, -90, -211, -189, 54, -168, -92, -66, -272, 100, 12, 21, -124, -47, -48, 293, 15, -5, 131, -211, -166, -76, 66, 158, -38, -21, 152, 67, 199, 118, 155, -67, -34, 260, 54, 110, -55, 240, 146, 91, -113, -300, -19, 24, 108, 148, -33, 36, -18, 325, 215, -17, -253, -95, 88, -64, 110, -72, -243, -128, 149, -113, -116, 145, 97, -56, 84, 157, -13, 169, -93, 47, 28, 230, 15, -107, 133, -66, -62, 42, 62, 127, -121, 14, 90, 6, 79, -3, -14, 161, 58, -65, 123, -104, 14, -2, 184, -299, -246, -144, 49, -31, -42, -2, -52, -25, 186, -208, 14, -68, 103, 335, 158, 82, -125, -193, -33, -188, -66, 95, 26, 43, -16, 321, 163, -133, 122, 4, 78, -55, -102, 33, -108, 43, 286, 49, 243, 58, 117, 27, 56, 228]
5057B28k50R2l38K33K63j84L42l29j52j29L97j95JK04o8M9J45m84j4Q2p0N8K10
5080I1j08q7J78j01N5J3j10J57j23N5k13J31J42j69J43o0l2K6j05L51j71p8m1
5103e6R2j62K13j29J70J12k15q9J11j94k11K92l3j90J17K14O7o6l4R3k76nP5J44
5127D0L33l88Q7r1J19l1L08l04j39J76rr3J59J2m04J97P1j76R1M0j51N3K91j56
5151C5J9l31J67K71m0q9ll16J94J75J0j08Q4k10O6J90j32p7n9J37K25k89P6j47
5175a52o3O2m9L28Mj81K88m09L77k88j93M79l20K75m48L31M2j83K97n3j02%k36
5198a94N0J34j69J10J70k38J98l30M40k33K23k54L4O3n9rJ10p6K63J7j28l56L11
5221G7K19n28L22m3j02J51k11J19J6M8j5j09J57k57K6j36L32l07K54o4O2PO4K9
$$ y = [228, -22, 70, -268, -35, 228, 44, 386, 57, -95, -224, 173, -22, -21, 183, 115, 164, 309, -175, -189, -107, -177, -119, 91, -17, -104, 74, -27, 28, 41, -69, 88, -35, 20, -193, -62, 80, -89, 54, -6, -38, -12, -117, 234, 63, -15, -56, 36, -126, 87, -42, 128, 240, 25, -64, 47, -147, -358, -66, -99, -289, -172, 42, 109, 43, 9, 102, -174, -179, -104, 40, 373, -15, 72, -19, 100, 69, 377, 73, -66, 110, 101, 8, 167, 179, -225, -28, 43, -133, -42, -2, -153, -100, 191, 35, 54, -277, -110, 161, 121, 32, 29, -287, -93, 82, 92, -16, 68, -142, -76, 114, -18, -95, -154, -17, 208, -81, -5, -152, -215, -153, -202, 126, 130, -51, 237, -172, 205, -83, -276, 203, -117, 158, -290, 41, 83, -100, 197, 144, 42, 42, -194, -144, -10, -179, -69, 101, -137, 61, -269, 171, -62, 161, -93, -59, 4, -55, -64, 46, -30, 233, 250, 122, -234, 77, 296, -232, 90, 47, -55, 96, -115, 4, 20, 68, 53, -56, 101, -156, -130, -266, 66, -241, 13, -51, 11, 18, 82, 111]
5245A11m4m24M50k45K05Pj07J48p4N6j54K08N5j4l38J44R2j27R8l4J45k87k38
5268c67K27j11L39l01K73r4k36K99J92l51J6J74k09N3J33J16q0J82j66j52L8m3
5290f8Kp6J39l9l03N30M2m9l15q7J66j24L03l82L91j17K2Jk72qJ83P6J01n6K4
5315H4j27K01l68L31j14O4l62K66l7n6K09Pl33J14J16q9J83p8j13K21k22J84r7
5338a6j30K14l4j2J33l84R7P6O1p5j16L13j09N8J19k6j89j39R2k34J78Q8q5J11
5362io8R8Q1r9k85L52j30K0J0L6j47pJ76K3r9J41RL2j43j31J85q2J16k6j4O8k50
5389a43M59k36l1O0j05l1k72K99j20L37k69L34m01JK42j94J3k75N23l19J18P7
5411F7J44J18m53KQ1k27J4M75r9Q2j51P9r9J38j82J2qN9j09K33j4k30j58L35k13
$$ y = [111, 67, -357, 93, -152, 53, 60, -47, 101, 27, 83, -71, 137, 192, 178, -160, -16, 76, -51, 47, 13, 158, -129, -367, -140, -251, 88, -213, 60, -34, -270, 29, 221, -130, -114, 60, -149, -96, 37, 153, 73, 255, 89, -63, -25, -68, -66, -142, -3, -42, -345, 185, 227, 178, -137, -224, -58, -182, 121, -261, 130, 13, 35, 36, -236, -244, -61, 15, 116, 60, 84, -43, 158, -210, 121, 7, 71, -291, -25, -62, -118, 91, 98, -235, -121, -5, -94, 89, 11, -102, 119, -103, 81, -16, -146, 68, 34, 22, 155, -229, -132, -56, 5, -70, -186, 127, 18, 76, 195, 169, -20, -159, -67, -301, -123, -35, -120, -9, -77, 21, 102, 3, -282, 70, -60, -40, -30, 6, -141, -148, 28, 51, -48, 93, 102, 134, -9, -140, 45, -37, 79, 53, 39, 107, -143, 316, 80, 49, 109, 4, -27, -299, 0, -120, 217, -52, 282, -119, -118, 124, -70, -57, -332, 191, -128, -10, 67, 211, 329, -124, -122, -41, -268, -254, 221, 122, 204, 53, 132, 33, 171, -11, 1, -7, 52, -57, 176, 162, -68, -226, 109, -104]
5436a04j98K14K2k9K12Lj84J24Pk48O8K88j68j25L17j24k40M3J72O0j31O6l2k6
5460a3NJq9J44J86j36j01j32J78j9N2R0j65J8k55J43J34J59j82K99k79o7l21L88
5484C8Kk03J62j07j1P8J64Q8P2j92m11K86K4P6k00K97P2k31k18K52l3j89P2RJ29
5509B6J20j98L24l08J08j31q1J02j78M53k46L50l93n5p0K03K03m43J01j71M59
5530A75o1l6J37m29k3L70k30N56m67k08J92J03j22j67J57L1p1K80j86J85j74j45
5552a33K82k78K21k07K94k52O8N3L6N5m33L01K44l07J45Q0j35J00J22l56K37J02
5574B39j38j03P9k45R3k10M74l16M1K63j87J6j10L05l79K49m2J79j08J09O6k78
$$ y = [-104, -302, -88, -66, -95, 117, 120, -64, 60, 67, -181, -113, 175, 7, -118, 199, 75, -165, -122, 50, 110, -21, 45, 13, -13, -8, -7, -96, 48, 234, 98, -3, -135, 43, 24, 76, 166, 1, 19, -236, -93, 41, 200, 18, 317, 38, -29, -350, 38, 40, -163, -1, -108, -119, -41, 123, 211, 283, 91, -320, -34, -10, 66, -134, 163, 235, 4, -214, 38, 5, -184, -112, -103, 26, 146, -52, 272, -36, 72, -59, -140, -38, -216, 237, -9, 341, -52, -107, -177, 26, 229, -214, -113, -284, 175, 114, 78, 215, -214, -237, 133, -97, 459, -8, -216, -24, 79, -43, -210, -53, -22, -93, 187, 1, 186, 12, -133, 149, -129, 92, -115, 179, -73, -5, 48, 84, 139, -294, 7, 251, -56, 89, 169, 34, 134, 256, -100, 137, 239, 101, -2, 77, -168, -75, -285, 189, -127, -86, 177, -10, 6, -104, 201, -178, 71, 29, 208, 100, 209, 275, -3]
$$ [...]
8191e9
##END NTUPLES=NMR FID
##END=
