##TITLE=1H_Pr 4-BnCl
 CDCl3
 8 sc, 
 12.3.2024
##JCAMPDX= 6.0         $$ Bruker NMR JCAMP-DX V2.0
##DATA TYPE= NMR FID
##DATA CLASS= NTUPLES
##ORIGIN= UXNMR, Bruker Analytische Messtechnik GmbH
##OWNER= root
$$ XWIN-NMR		Version 3.5
$$ Tue Mar 12 15:57:56 2024 Russian Standard Time (UT+4h)  she@DPX200
##.OBSERVE FREQUENCY= 200.1313
##.OBSERVE NUCLEUS= ^1H
##.DELAY= (6, 6)
##.ACQUISITION MODE= SIMULTANEOUS
##.ACQUISITION SCHEME= undefined
##.AVERAGES= 8
##.DIGITISER RES= 18
##SPECTROMETER/DATA SYSTEM= spect
##.PULSE SEQUENCE= zg30
##.SOLVENT NAME= CDCl3
##.SHIFT REFERENCE= (INTERNAL, CDCl3, 0, 15.7039)
##AUDIT TRAIL= $$ (NUMBER, WHEN, WHO, WHERE, WHAT)
$$ ##TITLE= Audit trail, XWIN-NMR		Version 3.5
$$ ##JCAMPDX= 5.01
$$ ##ORIGIN= Bruker BioSpin GmbH
$$ ##OWNER= she
$$ F:/spectra/data/she/nmr/H-F/1/audita.txt
$$ ##AUDIT TRAIL=  $$ (NUMBER, WHEN, WHO, WHERE, WHAT)
(   1,<2024-03-12 15:56:18.84 +0400>,<she>,<DPX200>,
      <created by zg, POWCHK disabled, PULCHK disabled
       configuration hash MD5:
       00 E9 B6 7A A2 85 ED C7 34 08 36 98 17 FE 4E 26
       data hash MD5: 16K
       EC AA 57 72 9F 75 50 1F 17 38 A2 EE 5E B4 32 B1>)
$$ ##END=
$$ 
$$ hash MD5
$$ CE 84 08 1C 9B 04 7C 56 CE 65 76 2D 35 75 78 84
##$RELAX= 
##$RELAX= 
##$RELAX= 
##$RELAX= 
##$RELAX= 
##$RELAX= 
$$ Bruker specific parameters
$$ --------------------------
##$DU= <F:/spectra>
##$EXPNO= 1
##$NAME= <H-F>
##$PROCNO= 1
##$TYPE= <nmr>
##$USER= <she>
##$AMP= (0..31)
100 100 100 100 100 100 100 100 100 100 100 100 100 100 100 100 100 100 
100 100 100 100 100 100 100 100 100 100 100 100 100 100 
##$AQSEQ= 0
##$AQ_mod= 1
##$AUNM= <au_zg>
##$AUTOPOS= <>
##$BF1= 200.13
##$BF2= 200.13
##$BF3= 200.13
##$BF4= 200.13
##$BF5= 200.13
##$BF6= 200.13
##$BF7= 200.13
##$BF8= 200.13
##$BYTORDA= 1
##$CFDGTYP= 0
##$CFRGTYP= 5
##$CHEMSTR= <none>
##$CNST= (0..31)
1 1 145 1 1 1 1 1 1 1 1 1 1 1 1 1 1 1 1 1 1 1 1 1 1 1 1 1 1 1 1 1 
##$CPDPRG= <>
##$CPDPRG1= <>
##$CPDPRG2= <>
##$CPDPRG3= <>
##$CPDPRG4= <mlev>
##$CPDPRG5= <mlev>
##$CPDPRG6= <mlev>
##$CPDPRG7= <mlev>
##$CPDPRG8= <mlev>
##$CPDPRGB= <>
##$CPDPRGT= <>
##$D= (0..31)
0 1.2 0 0 0 0 0 0 0 0.06 0 0.03 0 0 0 0 0.0002 0 0 0 0 0 0 0 0 0 0 0 0 
0 0 0 
##$DATE= 1710244578
##$DBL= (0..7)
120 120 120 120 120 120 120 120 
##$DBP= (0..7)
150 150 150 150 150 150 150 150 
##$DBP07= 0
##$DBPNAM0= <>
##$DBPNAM1= <>
##$DBPNAM2= <>
##$DBPNAM3= <>
##$DBPNAM4= <>
##$DBPNAM5= <>
##$DBPNAM6= <>
##$DBPNAM7= <>
##$DBPOAL= (0..7)
0.5 0.5 0.5 0.5 0.5 0.5 0.5 0.5 
##$DBPOFFS= (0..7)
0 0 0 0 0 0 0 0 
##$DE= 6
##$DECBNUC= <off>
##$DECIM= 32
##$DECNUC= <off>
##$DECSTAT= 4
##$DIGMOD= 1
##$DIGTYP= 9
##$DL= (0..7)
0 120 120 120 120 120 120 120 
##$DP= (0..7)
150 150 150 150 150 150 150 150 
##$DP07= 0
##$DPNAME0= <>
##$DPNAME1= <>
##$DPNAME2= <>
##$DPNAME3= <>
##$DPNAME4= <>
##$DPNAME5= <>
##$DPNAME6= <>
##$DPNAME7= <>
##$DPOAL= (0..7)
0.5 0.5 0.5 0.5 0.5 0.5 0.5 0.5 
##$DPOFFS= (0..7)
0 0 0 0 0 0 0 0 
##$DQDMODE= 0
##$DR= 18
##$DS= 0
##$DSLIST= <SSSSSSSSSSSSSSS>
$$ [...]
##$SUBNAM2= <"">
##$SUBNAM3= <"">
##$SUBNAM4= <"">
##$SUBNAM5= <"">
##$SUBNAM6= <"">
##$SUBNAM7= <"">
##$SUBNAM8= <"">
##$SUBNAM9= <"">
##$SW= 18.0517328524113
##$SWIBOX= (0..15)
0 0 2 0 0 0 0 0 0 0 0 0 0 0 0 0 
##$SW_h= 3612.71676300578
##$TD= 16384
##$TD0= 1
##$TE= 0
##$TE2= 300
##$TE3= 300
##$TEG= 300
##$TL= (0..7)
0 120 120 120 120 120 120 120 
##$TP= (0..7)
150 150 150 150 150 150 150 150 
##$TP07= 0
##$TPNAME0= <>
##$TPNAME1= <>
##$TPNAME2= <>
##$TPNAME3= <>
##$TPNAME4= <>
##$TPNAME5= <>
##$TPNAME6= <>
##$TPNAME7= <>
##$TPOAL= (0..7)
0.5 0.5 0.5 0.5 0.5 0.5 0.5 0.5 
##$TPOFFS= (0..7)
0 0 0 0 0 0 0 0 
##$TUNHIN= 0
##$TUNHOUT= 0
##$TUNXOUT= 0
##$USERA1= <user>
##$USERA2= <user>
##$USERA3= <user>
##$USERA4= <user>
##$USERA5= <user>
##$V9= 5
##$VALIST= <valist>
##$VCLIST= <CCCCCCCCCCCCCCC>
##$VD= 0
##$VDLIST= <DDDDDDDDDDDDDDD>
##$VPLIST= <PPPPPPPPPPPPPPP>
##$VTLIST= <TTTTTTTTTTTTTTT>
##$WBST= 1024
##$WBSW= 4
##$XGAIN= (0..3)
0 0 0 0 
##$XL= 0
##$YL= 0
##$YMAX_a= 733961
##$YMIN_a= -877529
##$ZGOPTNS= <>
##$ZL1= 120
##$ZL2= 120
##$ZL3= 120
##$ZL4= 120
##$ABSF1= 10
##$ABSF2= 0
##$ABSG= 5
##$ABSL= 3
##$ALPHA= 0
##$AQORDER= 0
##$ASSFAC= 0
##$ASSFACI= 0
##$ASSFACX= 0
##$ASSWID= 0
##$AUNMP= <proc_1d>
##$AZFE= 0.1
##$AZFW= 0.1
##$BCFW= 1
##$BC_mod= 2
##$BYTORDP= 1
##$COROFFS= 0
##$CY= 11.3945322036743
##$DATMOD= 1
##$DC= 2
##$DFILT= <>
##$DTYPP= 0
##$F1P= 15.7292609196834
##$F2P= 12.9074282941183
##$FCOR= 0.5
##$FTSIZE= 0
##$FT_mod= 4
##$GAMMA= 1
##$GB= 0.15
##$INTBC= 1
##$INTSCL= 1
##$ISEN= 128
##$LB= 0.24
##$LEV0= 0
##$LPBIN= 0
##$MAXI= 10000
##$MC2= 0
##$MEAN= 0
##$ME_mod= 0
##$MI= 1.114404
##$NCOEF= 0
##$NC_proc= 0
##$NLEV= 6
##$NOISF1= 3.799351
##$NOISF2= 2.8
##$NSP= 1
##$NTH_PI= 0
##$NZP= 0
##$OFFSET= 15.70392
##$PC= 1
##$PHC0= -25298.9
##$PHC1= 5.187311
##$PH_mod= 1
##$PKNL= yes
##$PPARMOD= 0
##$PSCAL= 0
##$PSIGN= 0
##$REVERSE= no
##$SF= 200.130013532006
##$SI= 16384
##$SIGF1= 3
##$SIGF2= 2
##$SINO= 400
##$SIOLD= 16384
##$SREGLST= <1H.CDCl3>
##$SSB= 0
##$STSI= 0
##$STSR= 0
##$SW_p= 3612.71676300578
##$SYMM= 0
##$S_DEV= 0
##$TDeff= 0
##$TDoff= 0
##$TI= <>
##$TILT= no
##$TM1= 0
##$TM2= 0
##$TOPLEV= 0
##$USERP1= <user>
##$USERP2= <user>
##$USERP3= <user>
##$USERP4= <user>
##$USERP5= <user>
##$WDW= 1
##$XDIM= 8192
##$YMAX_p= 0
##$YMIN_p= 0
$$ End of Bruker specific parameters
$$ ---------------------------------
##NTUPLES= NMR FID
##VAR_NAME=  TIME,          FID/REAL,        FID/IMAG
##SYMBOL=    X,             R,               I
##VAR_TYPE=  INDEPENDENT,   DEPENDENT,       DEPENDENT
##VAR_FORM=  AFFN,          ASDF,            ASDF
##VAR_DIM=   8192,          8192,            8192
##UNITS=     SECONDS,       ARBITRARY UNITS, ARBITRARY UNITS
##FACTOR=    0.0002768,     1,               1
##FIRST=     0,             0,               0
##LAST=      2.2672688,     0,               0
##MIN=       0,             -877529,         0
##MAX=       2.2672688,     733961,          0
$$ Real data points
##PAGE= N=1
##DATA TABLE= (X++(R..R)), XYDATA
0 0 0 0 0 0 0 0 0 0 0 0 0 0 0 0 0 -8 8 -8 8 -8 12 -16 18 -18 20 -27 28 -35 37 -44 48 -55 63 -71 79 -89 98
37 98 -108 120 -131 146 -162 178 -195 217 -238 260 -288 316 -347 385 -423 468 -518 577 -640 723
57 723 -815 926 -1065 1239 -1469 1776 -2216 2876 -3957 5960 -10408 24376 -156162 -867849
71 -867849 -513428 182210 519266 733961 470477 -83569 142343 704348 421612 -157040
81 -157040 -285130 -412717 -459090 -137262 -193684 -595328 -281166 359122 332572 63432 -62342
92 -62342 -336462 -278047 311948 404709 -62371 -51410 265652 268236 270313 191540 -287119 -377760
104 -377760 183903 302187 -158976 -337835 -262544 -104527 383957 557694 -131203 -657575
114 -657575 -376975 -37666 104915 232790 -28620 -380457 -43357 414273 233735 -2049
124 -2049 64649 42112 124491 379092 161910 -263650 -98352 195100 29448 -149572 -237828
135 -237828 -451375 -321202 119661 71989 -245974 -114591 133090 147481 214731 145791 -170093
146 -170093 -45012 472150 498538 121440 -83664 -213264 -196279 152577 203449 -306408
156 -306408 -553174 -288497 -60928 103338 233412 6752 -210166 57906 253646 27098
166 27098 -84422 8701 30106 179231 336982 64876 -223699 -43119 123133 -9536
176 -9536 -89343 -165273 -292920 -77886 252683 130607 -99421 -7607 72243 27508 42567
187 42567 -110496 -350081 -140478 271962 267395 55259 -38103 -121160 -32280 267119 229261
198 229261 -149559 -240158 -50892 57811 156551 173094 -77733 -207999 -12303 27030 -167696
209 -167696 -193794 -111988 -55741 133929 238224 21356 -93067 102278 192427 98099 40463
220 40463 -69107 -152156 43128 202540 11141 -157255 -90447 -45993 -25773 7306 -147017
231 -147017 -282013 -50957 227486 192102 62144 -16655 -87027 26912 235042 137081 -118824
242 -118824 -123798 -4225 44927 99655 46615 -147885 -150917 32953 33155 -91618 -87295 -41279
254 -41279 17193 155171 142759 -71681 -121796 26713 75763 35841 5527 -76327 -73610 110227
266 110227 172296 -2163 -106691 -58845 -12136 45951 55699 -93223 -164230 14942 161176
277 161176 98062 -17355 -115414 -155445 -22448 123260 43839 -82365 -33013 65939 113409
288 113409 127253 27884 -109710 -65767 59063 33541 -54971 -66423 -41665 25099 105943
299 105943 35817 -127922 -135737 -20676 32741 30923 3365 -45770 5928 145129 151460 12134
311 12134 -72005 -54815 -3189 54353 32627 -83439 -107587 18913 103295 56999 -38632 -120634
323 -120634 -116019 484 76705 13358 -53131 -11680 69201 113014 85566 -19388 -91042 -30795
335 -30795 54407 39642 -25082 -53392 -22455 50706 80714 -2408 -108792 -106447 -19723 40376
347 40376 31152 -21884 -46857 16032 99911 87861 -7166 -73548 -49788 28795 73358 30823
359 30823 -43410 -49897 20363 72866 34274 -59419 -107171 -58834 26010 52344 5116 -45701
371 -45701 -25629 51145 82272 21788 -55613 -66802 -8526 59142 61058 -6640 -46665 1745
383 1745 61781 48321 -18823 -79350 -79034 -14 65336 28451 -38499 -37686 7564 42662 35990
396 35990 -31816 -92248 -45402 51234 69649 28618 -171 -7865 25542 71856 27684 -70116
408 -70116 -77323 -8557 32099 35273 2677 -58268 -51035 30901 38960 -38550 -69553 -43468 1052
421 1052 71498 87947 6851 -27453 38331 66189 24676 -13933 -57606 -71422 9048 64725
433 64725 -4092 -60785 -32707 -10334 5501 24501 -30481 -83934 -9574 77061 57460 26381
445 26381 21232 -4852 14874 63973 4179 -87460 -53302 12328 18048 28394 9712 -60754
457 -60754 -41180 49208 28951 -47286 -40307 -17660 -356 68740 71245 -31437 -45513 30757
469 30757 27334 -8627 -5786 -40839 -49303 50666 87294 -3944 -34620 2605 -8698 1859 30988
482 30988 -38997 -87417 1974 50857 -2480 -10815 -4866 -39931 1271 65746 -898 -60136
494 -60136 12557 58224 40411 59970 29148 -58484 -25652 50353 -5830 -67066 -37693 -38313
506 -38313 -32752 44521 32146 -66400 -40616 37504 13664 3432 32974 -10018 -10684 91054
518 91054 86299 -18505 -22697 2396 -33795 -9058 23250 -58747 -81338 22703 37183 -21570
530 -21570 -1384 -4584 -49760 12088 65575 -18416 -45599 38363 43733 16675 48848 3286
542 3286 -74465 -6330 57302 -14833 -38333 6009 -18428 -7708 68501 20528 -74103 -26483
554 -26483 20825 -25230 -10110 18636 -41029 -23923 73248 36807 -41455 -830 17625 -15344
566 -15344 33824 51329 -37889 -27404 66972 36179 -22629 -242 -35563 -78055 3766 32345
578 32345 -58407 -49055 26333 3607 1318 52092 -1979 -50223 39733 68469 -9821 2525
590 2525 38645 -8640 10930 63689 -21664 -90204 -17119 3707 -40446 -1380 7930 -59503
602 -59503 -14701 69629 11468 -34302 21015 9004 -20095 46168 44247 -37020 2518 67700
614 67700 5381 -28151 5824 -36871 -51616 39243 32191 -57721 -26029 24793 -13361 4304
626 4304 39571 -38393 -63922 29697 33363 -22346 19617 34376 -20144 18702 59229 -24771
638 -24771 -44653 35982 21006 -21784 20395 1542 -58367 4814 51634 -32381 -55189 -3819
650 -3819 -30404 -28752 50517 24562 -43406 16810 56183 -3821 4853 37591 -19458 -17753 57269
663 57269 17633 -48221 4323 22524 -29655 -4038 7252 -70809 -54495 37455 16020 -22336
675 -22336 22274 9843 -30122 31713 53604 -26416 -19595 41515 5932 -10203 38327 1806
687 1806 -41727 22609 30516 -49806 -37831 8004 -24434 -8601 45821 -9931 -55142 16535
699 16535 33486 -16527 9959 20973 -37180 -7007 60058 12167 -22924 28716 15740 -26756
711 -26756 14081 12740 -52485 -17903 40063 -8101 -28963 13247 -13227 -32759 28503 19414
723 19414 -48794 -15805 33859 2233 11522 46873 -5404 -28480 34579 23863 -33353 -4571
735 -4571 14949 -23146 2515 33869 -26571 -43688 18008 7620 -29608 3852 1346 -36549
747 -36549 12301 52366 -4257 -17517 24428 1943 -13457 30405 10598 -37876 5392 34674
759 34674 -13114 -10968 17594 -20207 -24508 23960 -3794 -46159 -760 22619 -8829 10231
771 10231 24904 -24351 -17990 36818 12144 -23198 8692 9198 -13966 23442 32715 -25182 -23867
784 -23867 16820 -6945 -22395 8217 -7745 -28699 18332 29295 -20166 -12914 15617 -8213
796 -8213 -4316 27219 -1672 -24501 20053 27591 -10184 85 9018 -23571 -10246 23046 -9550
809 -9550 -28755 10008 11393 -10385 11357 9073 -27252 -6334 27607 -1619 -15919 10058 461
822 461 -8300 24532 16204 -25875 -10242 14121 -7001 -5978 12832 -9546 -15126 22170 16130
835 16130 -18310 -6092 5222 -13441 -389 16371 -11393 -14750 19827 14749 -8361 2875
847 2875 759 -16917 3965 19954 -8840 -13633 11900 5162 -5388 8285 -4426 -24924 -1103
860 -1103 15866 -5028 -6175 8155 -1879 187 20770 5620 -18053 -1215 9429 -4162 1462
873 1462 6281 -12263 -7748 14488 2560 -15882 -5074 -1599 -7599 7317 11998 -7503 -2440
886 -2440 17623 8870 -2624 1933 -5454 -10623 6725 9387 -9475 -8506 4097 -522 -1854 2688
900 2688 -9917 -15007 4871 11821 664 1249 4777 -133 5671 12077 -2112 -12160 -1340 3831
914 3831 -353 2519 -611 -8746 -943 7917 -1338 -8915 -5020 -2951 -183 7078 3935 -5120 -536
929 -536 7905 4387 -833 -2897 -5728 -1392 8483 7077 -1215 -2023 1510 2603 1604 -3158 -10009 -8700
945 -8700 552 4479 704 -3499 -4041 -390 3990 2789 -2040 -3976 363 7847 9703 4400 51
960 51 16 1991 2617 -176 -6858 -9857 -3411 2002 -1022 -3661 -3585 -4143 398 5273 -182 -5646 512
977 512 6571 6479 7589 5376 -2421 127 7434 758 -7617 -4723 -3810 -3779 4285 2968 -8798 -6314
993 -6314 3106 -335 -3496 594 -2931 -3445 10130 11359 -2098 -1151 4922 -971 205 5558 -4453
1008 -4453 -8496 5455 6727 -4096 -1445 364 -8499 -2395 6850 -5357 -10172 3960 4184 -2157
1022 -2157 5970 4600 -8219 647 11401 -1417 -5634 5472 480 -3471 10006 4970 -11662
1035 -11662 -2148 6720 -6173 -5648 3119 -7676 -8452 10694 6012 -9891 501 5795 -6093 1797
1049 1797 10728 -5627 -5727 14178 7123 -5583 4957 2279 -12214 161 8552 -10540 -9792 8434
1063 8434 -765 -7610 6865 -45 -14296 3281 11517 -6663 -2415 11458 -1333 -2549 14527
1076 14527 2303 -13691 4120 8092 -9386 -1315 7096 -11007 -7090 12731 -857 -13230 4588
1089 4588 3500 -10840 4458 10158 -10954 -3554 16033 477 -6934 9520 -182 -12983 7172
1102 7172 9538 -12523 -2836 12239 -4928 -5560 11503 -4195 -15371 7572 6354 -13495 667
1115 667 10407 -8016 -1606 14211 -5825 -13405 10390 6666 -8884 7544 9544 -11950 569
1128 569 16227 -5770 -10964 8393 -2598 -13516 7307 5181 -15849 -445 12581 -8649 -6630
1141 -6630 11917 -2942 -8339 14895 7476 -12534 5418 13381 -7232 98 12701 -10251 -14023
1154 -14023 10253 254 -14637 5234 5666 -14370 581 12240 -10863 -7583 15122 1081 -8897
1167 -8897 11702 5872 -11669 8114 14725 -11381 -7187 9846 -6657 -8240 13810 1193 -16244
1180 -16244 4334 7506 -12928 -985 11580 -9581 -7783 13613 -1208 -12260 10874 8611
1192 8611 -10678 3631 9628 -12006 -2808 17394 -746 -9577 9366 361 -13770 7103 8892
1205 8892 -15246 -5515 9152 -9661 -8142 12706 -804 -11547 10039 6839 -13313 3014 14204
1218 14204 -5334 170 15742 -4715 -11523 11669 4576 -13020 2621 3657 -16952 -3684 12988
1231 12988 -6703 -8619 11200 -1482 -12386 9382 8064 -10269 5705 14824 -7606 -5046 12401
1244 12401 -2188 -7866 11465 1368 -17248 1071 8479 -9519 -369 11351 -8932 -10529 11230
1257 11230 1517 -10541 8177 7520 -11515 1571 11878 -7659 -3889 13887 -1853 -11560 7075
1270 7075 2127 -11386 7120 11655 -10719 -5441 9174 -6192 -7588 11673 -4 -13627 5474
1283 5474 7272 -10199 1566 11571 -7243 -5182 11763 -2184 -9989 10264 7174 -9879 2774
1296 2774 6950 -11660 -3483 12159 -4481 -10111 6888 -414 -10792 6976 8696 -9638 -147
1309 -147 10813 -5939 -5428 11390 296 -8061 8774 5014 -11840 574 8252 -8135 -4072
1322 -4072 8617 -5717 -9960 9647 4693 -8455 4744 6025 -10164 -195 11606 -4182 -5554
1335 -5554 9798 74 -9350 5541 3567 -10668 1156 8547 -7889 -5126 9106 -1451 -5776
1348 -5776 9168 2608 -10350 3240 7945 -6850 -1219 8353 -5649 -6456 8596 406 -9020 4441
1362 4441 4442 -8543 561 7499 -5974 -3425 9883 -173 -6807 5624 1925 -8633 2972 6800
1376 6800 -7307 -2548 7672 -2743 -4647 7363 168 -8191 4343 5581 -6497 285 7170
1389 7170 -4583 -3625 6920 -2612 -8047 4385 2952 -6705 1795 5308 -5586 -722 8592 -1702
1403 -1702 -5073 6009 1417 -5536 3858 3976 -7130 -1241 5355 -4437 -4682 4629 -1712 -5903 4542
1418 4542 3109 -5649 1782 6420 -2715 -547 6177 -1911 -4312 5041 1471 -5768 1545 2892 -5108
1433 -5108 -675 4308 -4185 -4410 4564 338 -3533 3977 2757 -4099 1641 4831 -3452 -2726 3661
1448 3661 -1389 -3223 3851 932 -4894 1352 3556 -3022 -607 3696 -1624 -1844 4217 420 -4168
1463 -4168 1395 1575 -3757 -330 2240 -3551 -2094 3636 -93 -2311 2867 1883 -1678 2579 3334 -2265
1479 -2265 -929 2626 -1075 -2124 1446 -1130 -3723 544 636 -3363 -1061 1583 -892 386 3716
1494 3716 914 -771 2546 1918 -1105 615 1245 -1784 -513 1533 -1366 -2529 -56 -612 -2075 180
1510 180 572 -1306 593 2479 155 -395 1246 267 -127 1302 497 -1370 0 673 -103 -165 433 -358
1528 -358 -574 648 454 -808 -498 -234 -490 -33 22 -621 -1084 -403 -164 -221 -214 131 766 1095 1516 1359 682
1549 682 274 785 627 -678 -857 -367 -917 -841 -690 -1591 -2281 -471 51 -528 480 1294 446 1320 2917
1568 2917 909 -166 1676 865 -800 362 -11 -2366 -1404 362 -1706 -1877 356 -833 -1922 1211
1584 1211 1241 -1230 941 2680 -55 340 2519 -5 -1538 1594 599 -2480 15 1167 -2050 -528
1600 -528 1866 -1927 -2352 1958 184 -2318 1226 1376 -2201 458 2875 -1713 -1717 2727 -44 -1942
1616 -1942 2677 1592 -2648 1316 2870 -2078 -959 2549 -1657 -2747 2314 -136 -4084 853 1653
1631 1653 -3414 -295 3020 -2253 -1358 4175 547 -2491 3214 2470 -2660 1676 3443 -3440 -1878
1646 -1878 3091 -1902 -3951 2308 -443 -4679 1596 2612 -3977 -609 4040 -1739 -1419 5087 627
1661 627 -3329 3485 2665 -4097 377 3259 -3782 -1756 4092 -1862 -4279 3225 780 -4739 1743
1676 1743 3091 -4139 -203 5235 -1962 -2763 4565 255 -4208 3404 2731 -4740 452 4482 -3586
1691 -3586 -2399 4789 -1541 -4091 4252 1594 -5639 1191 3413 -4400 -586 5212 -2662 -3537 4976
1706 4976 666 -4711 3205 3034 -5197 585 5343 -3319 -2413 5426 -1104 -5202 3363 1490 -5715
1721 -5715 1908 4760 -4798 -1885 5109 -2427 -3590 5528 936 -5637 3106 3738 -4975 404 5661
1736 5661 -3621 -3270 5590 -862 -5323 4238 2404 -6065 1188 4403 -5125 -1654 6482 -1842 -4687
1751 -4687 4723 439 -5909 3693 4978 -5189 -301 5595 -3785 -3464 5941 -245 -5529 4042 2425
1766 2425 -6387 994 5522 -4389 -2053 5789 -2599 -5279 5813 2327 -5257 2780 3658 -6409 -843
1781 -843 6277 -2730 -3518 5693 -698 -6409 3953 3510 -5529 1538 5511 -4923 -2777 6278 -1403
1796 -1403 -4320 5525 1167 -7257 1752 4551 -5218 -519 5861 -4198 -4683 5884 728 -4796 4635
1811 4635 3511 -6499 391 5396 -4121 -2082 6836 -1520 -5991 3929 1222 -6244 2653 5148 -5599
1826 -5599 -1894 5736 -2374 -3055 6667 1019 -6368 2829 3299 -5590 917 6015 -4086 -3626 5079
1841 5079 -1795 -5474 5110 2859 -6067 1449 4369 -5264 -849 7071 -1859 -4457 4563 85 -6268
1856 -6268 3523 4168 -5767 -401 4921 -4236 -2984 6562 -170 -4917 3983 1843 -6275 1613 5491
1871 5491 -4143 -1621 5230 -3333 -5309 5203 1567 -5159 2950 3654 -5615 -116 6137 -2504 -2819
1886 -2819 5406 -780 -5666 3570 2668 -5652 961 4407 -5230 -2678 5490 -1318 -3574 5335 1312
1901 1312 -5823 2326 4399 -4128 285 5474 -3516 -4026 4654 -452 -5302 3309 2290 -5682 637
1916 637 4633 -3498 -1409 6047 -985 -4254 4208 1607 -4775 2492 4068 -5238 -1556 4393 -2988
1931 -2988 -3166 4944 215 -5056 2949 2991 -4582 886 5108 -3170 -1988 4887 -1480 -4351 3586 1255
1947 1255 -5206 1112 3151 -4214 -808 5109 -1669 -3089 4251 456 -4213 3239 3157 -4354 -151
1962 -151 3870 -3399 -2448 4256 -901 -4169 3083 1464 -4662 1217 3797 -3282 -741 4545 -1709
1977 -1709 -3021 3938 567 -4300 1588 2242 -4123 -271 4098 -2304 -2166 3839 -270 -3481 3071
1992 3071 1960 -3494 1125 3278 -3165 -1702 3364 -1598 -3165 2765 537 -3822 1668 2723 -2817
2007 -2817 16 3842 -1540 -1693 3788 201 -3131 2046 1587 -3641 91 2457 -2962 -1523 2880
2022 2880 -1090 -2694 2550 984 -2353 1757 2789 -2056 -45 3325 -1242 -1763 2644 -153 -3049
2037 -3049 1328 1169 -2986 -167 2091 -1959 -1416 2657 -352 -2100 2291 1419 -2011 1010 1862 -1782
2053 -1782 -437 2398 -1006 -1571 1803 312 -1989 1101 1096 -2081 -91 1974 -1332 -1144 1559 -652
2069 -652 -1874 1083 447 -1943 516 1630 -1092 -310 1873 -345 -902 1580 773 -1085 863 698
2085 698 -1549 -322 906 -1161 -1115 778 -313 -1217 578 363 -1051 436 1135 -375 64 1322 334
2102 334 -113 812 244 -1082 155 519 -783 -431 285 -492 -580 255 -203 -580 367 536 -23 354 466
2121 466 -89 -188 391 207 -289 175 290 -278 -17 -78 -196 -62 -18 343 118 -217 -36 46 -239 -183 29 -352
2143 -352 -203 331 212 -354 50 433 -233 195 885 -44 -370 969 292 -542 183 148 -1010 -197 607 -447
2163 -447 -899 583 -163 -1085 670 414 -978 362 1085 -622 -416 1118 -101 -868 1073 363 -1408
2180 -1408 736 1144 -1277 -193 1370 -1219 -982 1539 -73 -1639 792 554 -1822 -146 1519 -1206
2196 -1206 -872 1824 -300 -1400 1569 657 -1635 909 1923 -1230 -265 2091 -1102 -1593 1678 -41
2212 -41 -2532 862 1172 -2265 -150 2084 -1320 -1018 2408 -188 -2273 1990 1269 -2601 810 2086
2228 2086 -2294 -846 2522 -986 -1977 2373 323 -2800 1224 1844 -2545 -109 2656 -1442 -1592 2857
2244 2857 -159 -2852 1860 1410 -2947 660 2515 -2201 -902 3238 -966 -2552 2796 874 -3056
2259 -3056 1482 2107 -3214 -632 2905 -2106 -2166 2946 -6 -3235 2342 1787 -3383 688 3357 -2406
2275 -2406 -1320 3621 -865 -2846 2831 828 -3876 913 2459 -3369 -674 3731 -1699 -2606 3655
2290 3655 542 -3270 2616 2594 -3594 64 3384 -2814 -2184 3491 -871 -3805 2657 1209 -4138 1277
2306 1277 3440 -3077 -860 4261 -1379 -2542 4196 821 -3910 1968 2576 -3954 -314 3912 -2603
2321 -2603 -2395 3864 -832 -4300 2932 2184 -3924 1264 3695 -3510 -1401 4631 -1353 -3437 3894
2336 3894 732 -4581 1967 3106 -4024 -297 4269 -2830 -2980 4254 128 -3806 3102 1978 -5139
2351 -5139 356 3923 -3207 -1557 4813 -1495 -4033 3570 1643 -3883 2350 3836 -4189 -804 4605
2366 4605 -2338 -3094 4208 -47 -5239 2186 2236 -4810 651 4495 -3515 -2498 4556 -694 -3189 4667
2382 4667 2457 -4607 1348 3508 -4161 -884 4962 -2479 -4104 3505 -238 -5081 2655 3255 -4610
2397 -4610 -264 4318 -2982 -1947 5626 104 -3868 3250 1689 -4841 1385 4634 -3546 -1915 3943
2412 3943 -2344 -4137 4422 1376 -4417 2064 2859 -4724 -321 5100 -2098 -2592 4365 -510 -4639
2427 -4639 3264 2881 -4119 832 3796 -3998 -1926 5176 -910 -3437 3732 702 -5403 1528 3618
2442 3618 -3943 -413 4428 -2864 -3577 4384 550 -3617 3443 2740 -4779 327 4307 -2677 -1424
2457 -1424 4655 -1563 -4842 2987 1273 -4522 1526 3342 -4329 -1422 4208 -1793 -2387 4843 700
2472 700 -4428 2320 2637 -3922 743 4471 -3041 -2730 3648 -1126 -3785 3321 1650 -4594 773 3341
2488 3341 -3584 -731 4769 -1585 -3185 3680 783 -3960 2433 3211 -3862 -350 3746 -2681 -2357
2503 -2357 4137 -94 -4012 2421 1405 -4282 939 3547 -3101 -1402 3927 -1296 -2984 3457 1241
2518 1241 -3634 1664 2672 -3532 -148 4300 -1762 -2379 3419 -464 -3729 2261 2020 -3628 320
2533 320 2967 -2958 -1799 3758 -763 -2786 3270 1165 -3466 1492 2681 -3009 -575 3368 -1935
2548 -1935 -2510 3010 13 -3550 1870 1776 -3434 -26 3108 -1901 -1320 3299 -814 -2823 2381 1335
2564 1335 -2945 1141 2817 -2600 -840 3138 -1461 -2306 2696 458 -3026 1634 1711 -2745 -4 2763
2580 2763 -1902 -1690 2902 -241 -2400 2325 1223 -2848 723 2314 -2010 -737 2877 -702 -2037
2595 -2037 2332 322 -2758 1026 1784 -2271 -265 2366 -1642 -1441 2488 -166 -2138 1692 1222 -2181
2611 -2181 569 1981 -1878 -865 2338 -805 -1675 1740 508 -2235 774 1613 -1823 -360 2079
2626 2079 -888 -1105 1978 256 -1849 1122 760 -2050 207 1717 -1442 -938 1843 -520 -1394 1316
2642 1316 591 -1584 704 1480 -1152 -192 1698 -756 -1074 1424 -65 -1351 859 896 -1380 -21
2658 -21 1280 -934 -848 1392 -151 -1191 1153 515 -1296 272 971 -923 -305 1079 -287 -848 851
2675 851 232 -1015 620 862 -693 82 996 -322 -526 706 -36 -748 339 246 -540 63 608 -544
2693 -544 -445 580 -208 -318 797 319 -301 305 335 -250 -263 169 -238 -364 235 -24 -342 6 173 -227
2713 -227 212 238 -35 68 180 168 90 -90 -17 -181 -188 -46 7 -76 -287 121 102 -223 108 444 15 198 373
2736 373 118 -270 218 59 -531 -6 357 -510 -168 294 -188 -555 402 159 -626 612 586 -558 120 979
2756 979 -538 -472 780 40 -720 487 237 -980 -145 632 -725 -413 1066 -336 -812 832 327 -1331
2774 -1331 289 784 -1058 -175 1189 -654 -906 1099 215 -1142 915 870 -1158 325 1337 -945
2790 -945 -826 1262 -409 -1355 980 411 -1710 330 1155 -1467 -449 1657 -486 -968 1593 545
2806 545 -1535 1005 1192 -1602 71 1756 -1207 -1066 1818 -363 -1881 1053 651 -1963 389 1601
2822 1601 -1487 -540 2174 -500 -1544 1856 494 -1975 1018 1462 -1863 -334 1831 -1315 -1366 1982
2838 1982 -131 -1956 1357 1209 -2358 506 1941 -1586 -987 2324 -584 -1823 1958 695 -2483
2853 -2483 875 1771 -1911 -251 2535 -977 -1614 2288 234 -2529 1430 1608 -2408 64 2189 -2013
2869 -2013 -1352 2463 -585 -2380 1948 1021 -2569 1009 2309 -2227 -623 2662 -1091 -1922 2485 632
2885 632 -2618 1505 1667 -2820 -158 2645 -1613 -1427 2681 -306 -2715 1914 1307 -2773 797 2528
2901 2528 -2269 -1080 2835 -983 -2137 2762 352 -2926 1354 2055 -2610 43 2810 -1779 -1998
2916 -1998 2722 -224 -2765 2050 1366 -3387 177 2419 -2435 -1144 3148 -860 -2596 2397 786
2931 786 -2981 1473 2702 -2675 -533 3131 -1520 -1892 3175 90 -3218 1610 1611 -3085 282 3045
2947 3045 -2123 -1763 2903 -858 -2744 2933 1483 -2947 1091 2332 -2749 -594 3569 -1045 -2141
2962 -2141 2907 -120 -3373 1745 2228 -2961 -133 2915 -2397 -1682 3499 -112 -2863 2284 1110
2977 1110 -3656 745 3146 -2218 -697 3210 -1457 -2893 2894 998 -3056 1563 1962 -3265 -618
2992 -618 3181 -1644 -1783 3221 -368 -3373 2128 1809 -2837 744 2883 -2621 -1469 3324 -685 -2415
3008 -2415 2985 945 -3641 815 2424 -2836 -262 3295 -1737 -2564 2574 107 -3080 2197 1979
3023 1979 -3214 -65 2978 -2246 -1278 3553 -415 -3036 2147 1047 -3132 1314 2721 -2737 -1210
3038 -1210 2890 -1300 -2360 3043 848 -3191 1499 1751 -3016 52 3291 -1607 -1871 2780 -518
3053 -518 -2947 2394 1764 -2991 449 2506 -2652 -1160 3217 -791 -2218 2608 357 -3322 1401
3068 1401 2316 -2372 -249 2587 -1930 -2068 3012 59 -2619 2068 1344 -3120 198 2720 -1942 -1123
3084 -1123 2940 -733 -2440 2286 1001 -2747 1148 1922 -2618 -624 2909 -1067 -1792 2534 -42
3099 -42 -3016 1252 1670 -2485 167 2532 -1760 -1548 2625 -351 -2105 1966 1043 -2660 720 2106
3115 2106 -1892 -577 2631 -1077 -1837 2067 453 -2362 1323 1576 -2474 -229 2175 -1359 -1144 2397
3131 2397 -7 -2392 1562 969 -2080 610 2101 -1620 -860 2328 -937 -1742 1822 554 -2331 850
3147 850 1449 -1880 -354 2203 -1110 -1491 1946 -58 -1742 1443 1230 -1922 114 1479 -1362 -999
3163 -999 1991 -298 -1552 1675 783 -2008 541 1529 -1712 -349 1793 -828 -1194 1621 104 -1826
3179 -1826 918 1101 -1735 87 1691 -1084 -746 1853 -238 -1519 1258 648 -1447 432 1285 -1150
3195 -1150 -452 1505 -594 -1174 1364 380 -1465 629 748 -1525 -226 1307 -879 -771 1410 74
3211 74 -1219 1055 753 -1378 360 1212 -978 -565 1117 -501 -992 878 248 -1120 234 791 -1192
3228 -1192 -208 1059 -546 -686 967 -95 -955 884 547 -1048 90 566 -852 -515 896 -107
3244 -107 -669 761 367 -896 186 520 -738 -287 749 -200 -465 660 119 -692 451 263 -645 107
3262 107 605 -224 -237 569 58 -509 252 260 -581 0 240 -511 -349 302 -186 -475 362 237 -140 129 252
3283 252 -299 -71 275 -132 -96 422 -95 -182 110 4 -443 -37 143 -89 -5 128 -10 -124 -72 113 -48
3304 -48 3 157 197 125 25 153 34 -35 14 115 -152 70 -30 -89 -318 47 10 -155 -30 78 24 -49 463
3327 463 -94 -192 183 116 -350 150 174 -231 -21 273 -383 -184 269 -70 -208 330 122 -375 -10 526 -356
3348 -356 -181 532 -130 -299 445 129 -628 144 460 -661 -80 631 -372 -370 626 -50 -813 286 360 -665
3368 -665 153 721 -470 -345 640 -91 -662 724 449 -763 280 500 -733 -334 874 -599 -649 677
3386 677 -111 -831 412 505 -917 -32 888 -664 -429 1164 -77 -947 912 352 -862 235 771 -849
3404 -849 -459 953 -715 -856 791 153 -1090 619 862 -1075 -143 1133 -457 -629 1199 44 -1215
3421 -1215 859 810 -1180 309 1018 -1143 -481 1266 -403 -1083 1049 343 -1278 327 1078 -1122 -208
3438 -208 1417 -609 -790 1280 79 -1286 701 787 -1273 69 1390 -902 -714 1510 -315 -1379
3454 -1379 954 467 -1331 456 1143 -1269 -234 1272 -726 -1065 1357 297 -1505 771 988 -1401
3470 -1401 38 1542 -932 -924 1493 -296 -1499 1052 658 -1593 176 1398 -1326 -352 1632 -265
3486 -265 -1021 1306 263 -1474 942 1307 -1518 -287 1513 -934 -1158 1476 -102 -1619 1000 819
3502 819 -1649 381 1387 -1088 -783 1662 -446 -1457 1291 694 -1622 724 1098 -1549 -204 1801
3518 1801 -727 -1052 1383 -39 -1712 800 1135 -1517 165 1456 -1212 -877 1723 -202 -1385 1236
3534 1236 517 -1861 395 1453 -1335 -377 1736 -988 -1207 1451 424 -1572 882 1147 -1747 -184
3550 -184 1565 -967 -830 1712 -311 -1655 982 709 -1534 591 1612 -1361 -630 1490 -453 -1324
3566 -1324 1511 427 -1711 656 1208 -1461 -55 1735 -1058 -1298 1295 -1 -1597 1203 763 -1584
3582 -1584 97 1424 -1244 -596 1851 -420 -1554 1288 351 -1641 741 1475 -1272 -411 1523 -894
3598 -894 -1070 1727 201 -1623 795 783 -1767 -43 1673 -1038 -827 1542 -375 -1501 1355 739
3614 739 -1462 537 1229 -1365 -407 1665 -551 -1252 1336 68 -1743 764 1082 -1547 6 1413
3630 1413 -1202 -1061 1603 170 -1078 1085 586 -1634 255 1525 -1059 -462 1468 -612 -1526 1227
3646 1227 401 -1426 809 1026 -1489 -221 1508 -709 -761 1480 -41 -1476 830 837 -1355 334 1318
3663 1318 -1154 -612 1197 -429 -1068 1324 637 -1535 471 1025 -1256 -154 1480 -513 -974 1228
3679 1228 60 -1310 886 876 -1165 20 1175 -908 -614 1298 -124 -1271 786 424 -1200 364
3695 364 1002 -1062 -574 1053 -531 -934 1192 255 -1252 776 656 -1185 61 1130 -779 -532 1113
3712 1113 -128 -1010 805 430 -1198 302 1012 -912 -382 1204 -198 -835 922 212 -1123 482
3728 482 662 -857 -84 1044 -839 -554 993 -34 -876 687 475 -1151 133 840 -694 -271 945
3745 945 -272 -626 769 165 -980 374 712 -845 -30 782 -321 -648 735 147 -785 385 611
3762 611 -640 -96 796 -572 -387 825 -73 -544 761 313 -562 157 689 -642 -166 688 -270 -544
3780 -544 572 236 -542 580 348 -611 -30 754 -535 -319 599 -8 -578 520 402 -434 73 737 -408
3799 -408 -190 517 -289 -472 273 -143 -498 227 345 -501 -88 752 -245 -319 642 96 -325 382 192 -566
3819 -566 -65 516 -406 -201 328 -159 -525 340 -22 -318 24 243 -435 -152 447 -178 -146 363 30 -365
3839 -365 377 344 -302 91 412 -195 -194 270 -170 -242 127 117 -316 59 157 -104 -20 207 -160 -113 393 157 -144
3862 -144 184 203 -225 29 124 17 -61 156 -83 -220 126 -105 -102 184 81 57 -3 142 -48 -250 145 -15
3884 -15 -213 109 216 -159 -26 6 -47 -114 174 63 -53 60 -79 26 199 32 56 -70 -11 -23 -10 54 155
3907 155 52 -131 -94 109 -61 -35 88 -39 -243 -226 22 -56 -7 159 63 -190 229 1 -31 98 53 -246 20
3930 20 261 -111 40 102 32 -242 222 -75 -112 119 321 -54 -30 186 -44 -184 163 -112 -60 -25 222 -203
3952 -203 131 317 -115 -189 30 38 -249 136 117 -348 -50 333 -160 -87 381 -11 -283 251 -47 -294 -34 266
3974 266 -278 -82 361 -175 -349 368 145 -448 248 143 -310 50 186 -208 -337 362 7 -267 465 136
3994 136 -309 -25 368 -394 -114 259 -99 -564 270 186 -511 134 418 -448 -148 525 -278 -221 358 150 -482
4015 -482 184 336 -471 -46 482 -171 -152 397 -64 -355 312 92 -503 165 504 -381 -117 447 -211 -273 425
4036 425 162 -684 324 200 -472 -123 382 -308 -337 609 -70 -537 413 173 -578 26 362 -488 -81 664
4056 664 -210 -420 324 64 -776 279 265 -575 66 686 -444 -302 532 -169 -414 421 142 -644 128 524
4076 524 -280 -152 520 -139 -535 337 63 -501 214 285 -558 -57 450 -306 -340 449 -11 -575 356 354 -651
4097 -651 156 756 -454 -352 589 -359 -489 456 264 -540 204 384 -655 -80 577 -491 -571 571 -68
4116 -68 -539 464 415 -769 245 673 -395 -193 601 -122 -540 552 190 -515 229 367 -550 -177 462
4135 462 -306 -337 566 86 -555 427 407 -525 67 609 -450 -359 468 -76 -472 472 356 -457 288 320 -394
4156 -394 -52 593 -298 -442 434 60 -770 249 521 -513 -9 504 -300 -269 706 -44 -586 524 148
4175 148 -599 100 492 -352 -225 446 -366 -555 456 53 -456 435 373 -545 30 632 -305 -354 667 8
4195 8 -519 491 276 -488 182 365 -300 -175 553 -92 -238 634 202 -542 197 353 -431 -30 577 -374
4215 -374 -458 368 56 -429 371 378 -621 58 377 -306 -42 397 2 -408 304 204 -510 405 313 -537 -219
4236 -219 316 -252 -348 392 120 -481 292 179 -489 -29 537 -351 -43 524 -248 -363 480 67 -588 115
4256 115 362 -386 -34 426 -189 -215 355 122 -462 338 158 -342 13 386 -341 -61 446 -140 -357 224
4276 224 18 -380 130 442 -397 -255 442 -303 -316 353 53 -512 266 185 -520 30 542 -221 -104 450 -37
4297 -37 -285 156 115 -311 205 279 -401 -280 414 -133 -132 320 -89 -433 232 26 -338 37 349 -355 -42 330
4319 330 -149 -208 46 79 -330 161 369 -305 -39 379 -179 -185 62 -120 -441 196 175 -178 111 184 -186 -87
4341 -87 319 44 -128 170 42 -393 173 223 -335 -12 281 -126 -347 365 -24 -391 145 192 -52 -43 201 -74
4363 -74 -96 199 -37 -151 267 196 -236 73 129 -328 -161 264 -207 -226 234 81 -289 -49 113 -310 18 152
4385 152 -173 -215 288 145 -12 132 25 -232 -98 217 1 6 173 -109 -213 36 60 -131 59 118 -155 217
4407 217 270 -29 -178 283 11 -193 169 220 -139 92 134 -152 -52 -49 199 -241 226 31 -65 18 175 -125
4429 -125 -64 102 -63 120 171 133 -56 -2 124 -190 -111 9 -119 -149 73 127 -102 62 21 17 -35 13 14 119 220
4454 220 57 -87 -2 -14 -294 69 68 5 35 130 72 -11 103 8 101 70 -46 -52 79 -71 -34 48 32 -58 137 25
4480 25 -187 17 -116 100 -1 -4 19 69 41 -60 -75 -20 9 130 19 106 78 -36 50 -19 -23 -45 -40 -73 131 -88
4506 -88 60 -54 74 -70 -30 -93 37 -14 -79 91 -25 121 47 0 101 114 -63 82 62 85 32 100 -195 -69
4530 -69 -33 -191 -124 -14 -45 -122 -5 137 -165 -77 -40 106 -64 -65 84 -149 -99 -77 -8 -55 -19 -79 -140 113 1
4555 1 -57 -46 26 -152 120 210 -115 -128 101 -34 -131 272 -28 -336 78 188 -254 -95 214 -86 -2 108 -116
4578 -116 -202 -47 115 -324 110 254 -113 -166 137 -2 -242 78 93 -87 -16 213 -247 18 46 133 16 220
4600 220 -27 -252 20 82 -135 -100 141 -129 -111 276 -24 -221 198 137 -386 240 88 -321 53 248 -130
4621 -130 -315 225 -50 -151 121 195 -149 -230 195 -274 -178 381 7 -176 332 17 -391 62 133 -187 -167 324
4643 324 -69 -372 162 19 -329 154 4 -218 -94 200 -214 -248 341 -147 -531 261 37 -495 -46 198
4663 198 -426 -188 175 -236 -176 292 63 -358 115 237 -213 4 360 -324 -222 207 -27 -339 123 169 -448
4684 -448 138 247 -261 -86 352 -114 -465 367 225 -286 142 419 -419 -227 257 -266 -175 216 75 -208
4704 -208 316 222 -431 55 313 -353 -276 490 6 -495 401 230 -300 -3 303 -602 84 703 -263 -287 389
4725 389 115 -324 260 467 -350 74 496 -273 -246 487 -11 -282 327 130 -421 70 466 -269 6 344
4745 344 -132 -434 344 182 -372 208 105 -410 -174 481 -321 -308 618 59 -466 360 206 -439 8 376
4765 376 -407 -178 610 -117 -241 422 -36 -425 113 380 -318 44 479 -287 -384 455 29 -509 328 184
4785 184 -325 -52 438 -364 -372 494 104 -456 246 -132 -280 321 472 -429 -168 491 -343 -370 449 65 -436
4806 -436 406 251 -342 54 433 -429 -145 413 -292 -335 430 237 -386 67 230 -357 -115 397 -254 -264 461
4827 461 -16 -441 255 373 -302 -54 423 -238 -263 448 22 -251 429 230 -567 68 278 -510 -199 535
4847 535 -281 -358 415 224 -483 387 324 -402 -55 341 -14 -229 480 -75 -373 144 77 -408 65 327 -485
4868 -485 -200 482 -160 -29 553 190 -547 128 165 -338 -150 661 -256 -388 346 -30 -486 331 238 -448 38
4889 38 308 -350 -205 391 -67 -276 412 89 -350 -65 369 -525 -18 446 -310 -134 315 97 -423 113
4909 113 118 -182 158 449 -157 -185 421 18 -191 363 54 -407 -69 181 -358 -181 325 -157 -395 401 84
4930 84 -335 142 115 -320 29 383 -178 -200 369 -10 -466 149 202 -156 139 152 -327 -68 288 -68 -93 181
4952 181 91 -314 207 263 -513 87 121 -226 -115 190 -31 -337 249 100 -296 -112 173 -192 -266 324 -204
4973 -204 -165 246 104 -308 294 178 -266 -147 305 -18 -202 197 57 -80 123 197 -303 -7 240 -146 12
4994 12 79 -87 -125 95 124 8 177 167 -255 -193 238 -64 -142 190 -65 -303 135 77 -107 81 109 -75 1
5017 1 55 -166 -276 198 -28 -151 206 221 -132 -158 211 -74 -174 191 194 -17 22 46 11 -66 -112 41 -122 84
5041 84 16 -5 91 -66 -50 2 166 38 -59 -37 -127 -76 -84 -3 37 31 -69 -177 47 46 96 13 76 170 -57 -126 110 0
5069 0 -9 27 -98 33 115 77 -11 207 -55 -7 36 -17 -113 22 5 -106 59 -16 73 94 -74 -52 -138 -121 -156 -30 -31
5096 -31 -89 67 200 45 155 -88 37 -60 -78 -140 -144 -59 120 86 -69 41 -55 46 87 -15 -124 -38 -114 -75 -90
5121 -90 128 -100 -136 11 -84 -263 21 104 -146 57 221 -83 128 99 -82 -48 202 96 -182 71 103 -56
5143 -56 239 146 -49 -239 198 26 -198 -10 228 -169 106 237 -248 105 291 -31 -245 100 -34 -204 181
5164 181 42 -295 -39 107 -249 -148 278 220 -109 117 53 -86 86 250 -95 55 292 -55 -108 187 -36
5185 -36 -178 78 -36 -169 -69 163 -88 -209 322 181 -262 244 227 -197 35 90 -304 -182 262 -90 -287
5206 -287 447 44 -287 66 255 -332 -67 407 -150 -138 408 -60 -396 209 -78 -433 -8 393 -69 -231
5226 -231 442 -207 -284 397 197 -484 56 317 -238 -13 289 -82 -277 340 202 -345 270 380 -382 -6
5246 -6 440 -249 -208 270 -9 -440 262 230 -443 66 164 -353 -147 386 -217 -327 365 85 -440 212 238 -254
5268 -254 85 381 -263 -483 465 197 -429 40 178 -334 -33 380 -271 -359 574 -37 -349 332 208 -363
5288 -363 293 407 -438 -75 457 -238 -275 418 -30 -546 273 271 -449 -13 450 -440 -449 424 37 -450 454 246
5310 246 -592 45 519 -233 -134 573 -260 -401 325 -167 -499 131 373 -533 17 540 -186 -201 460 84 -388
5331 -388 177 123 -413 -116 492 -329 -306 455 -237 -380 480 249 -556 48 552 -497 9 531 -187 -442
5351 -442 545 182 -595 391 375 -413 -15 392 -356 -279 460 3 -409 221 321 -387 193 404 -260 -189 529
5372 529 -107 -289 297 202 -542 347 305 -472 -216 506 -183 -326 448 17 -409 223 191 -370 35 374 -387
5393 -387 -172 559 17 -246 401 216 -440 263 313 -430 54 453 -283 -298 514 3 -322 375 87 -492 4
5414 4 303 -429 -39 454 -40 -602 316 -20 -354 185 437 -366 -56 385 -172 -237 518 243 -376 243 137
5435 137 -430 -18 461 -331 -168 287 72 -355 382 148 -414 36 425 -278 -128 515 -204 -473 317 151
5455 151 -416 197 254 -500 -66 241 -163 -232 273 3 -396 289 178 -487 148 299 -192 -265 278 -124 -283
5476 -283 265 39 -459 63 574 -480 -8 243 -155 -271 487 -74 -61 188 329 -200 -93 374 -292 -310
5496 -310 494 -14 -100 183 -1 -322 -16 265 -221 68 276 -193 -180 282 -42 -416 161 187 -237 -36 387
5517 387 -158 -214 177 6 -216 219 177 -402 197 349 -234 -34 296 -53 -215 353 10 -414 402 160 -219
5538 -219 85 267 -64 -148 282 38 -355 107 58 -308 47 167 -221 -278 397 -9 -157 203 107 -329 2
5559 2 113 -77 -157 210 -122 -76 90 90 -191 228 42 -254 62 156 -32 -213 253 -27 -84 141 -40 -216 -74
5582 -74 309 -27 -308 333 -14 -39 171 -33 -42 239 200 -146 33 215 -114 -116 154 1 -252 7 92 -173 75
5605 75 100 -7 -43 172 -8 -38 99 -24 -282 182 40 -116 59 186 -140 -164 38 64 -1 91 -59 -104 187
5628 187 108 11 -88 62 -141 -99 82 104 -79 -7 153 34 -72 74 -19 -9 24 -58 72 -23 -62 -19 -6 33 -14
5653 -14 -79 233 -12 -78 -14 129 8 60 89 36 -55 -41 96 -9 -174 -20 18 -136 11 209 -162 38 -13 -40
5677 -40 48 101 149 -69 6 12 20 -171 127 -6 -159 31 125 -270 107 30 38 -70 38 25 -142 10 -42 -10 -9 150
5703 150 21 -6 202 -255 -38 3 2 -58 -5 31 -11 80 102 -160 -152 115 5 -124 144 127 145 -35 147 -127 -176
5728 -176 9 -157 -199 146 58 -156 -30 -2 -209 -15 85 -68 -3 321 137 -250 42 143 -27 0 269 -121
5750 -121 -119 204 74 -213 171 126 -149 90 75 -159 21 268 67 -105 101 -18 -186 134 173 19 -117 430
5772 430 -71 -220 156 6 -335 245 229 -228 76 306 -103 -143 234 130 -118 28 166 -420 -34 222 -123
5793 -123 -101 91 12 -124 219 9 -366 100 289 -252 -144 310 -89 -130 153 -46 -297 25 185 -308 109
5814 109 174 -223 -135 286 77 -292 211 154 -426 187 322 -284 -162 271 -116 -332 356 -24 -292 204 225
5835 225 -91 -21 329 -26 -175 337 -92 -237 284 292 -241 53 127 -391 -32 298 -118 -319 361 250 -205
5856 -205 171 252 -314 -50 471 -96 -170 363 71 -314 105 329 -366 88 344 -220 -119 379 162 -408 242
5877 242 78 -323 102 309 -406 -263 295 -84 -33 187 11 -199 200 234 -518 -17 344 -57 -151 350 34
5898 34 -420 264 55 -401 -26 398 -342 -116 467 -284 -212 390 1 -335 124 291 -70 -49 302 -198 -311
5919 -311 393 -83 -399 191 239 -299 138 206 -88 -159 313 -204 -425 235 83 -466 80 189 -556 -278 380
5940 380 -21 -286 383 -47 -236 339 92 -287 103 352 -129 -109 257 -194 -264 320 185 -406 27 476 -250
5961 -250 -166 402 -12 -327 343 68 -336 156 314 -72 -80 389 -429 -231 385 51 -547 291 178 -353 153
5982 153 469 -245 -30 246 -91 -207 112 63 -237 134 342 -421 -115 278 -224 -354 232 -15 -340 360
6002 360 101 -457 56 34 -320 -156 427 -70 -220 377 229 -210 64 245 -333 -48 504 -261 -261 419 175
6023 175 -273 244 99 -534 -63 374 -164 -30 418 -153 -313 105 9 -250 42 335 -159 -217 384 -172 -247
6044 -247 306 146 -349 141 271 -261 56 159 -101 -276 237 56 -184 307 240 -315 33 241 -166 -76 337
6065 337 -73 -170 232 79 -263 160 254 -293 98 230 -165 -160 290 83 -302 -74 260 -342 40 299 -315
6086 -315 -199 271 1 -424 165 135 -266 73 302 -299 0 305 71 -293 73 -135 -86 79 244 -251 33
6107 33 143 -93 -7 179 -22 -306 132 75 -92 0 200 -295 -22 123 -98 -192 193 65 -189 67 215 -160
6129 -160 -85 328 -108 -227 126 -4 -287 240 93 -190 79 312 -128 -16 93 -65 -158 218 173 -203 -35
6150 -35 303 -151 -83 130 3 -191 125 88 -255 155 -27 -106 77 211 -81 45 252 62 -87 56 -25 -193
6172 -193 -33 170 -325 26 252 -112 -68 100 144 -54 11 122 -78 -147 -78 -137 -33 72 16 -197 225 -78
6194 -78 -159 1 103 -169 9 135 25 -27 131 62 -56 125 62 96 11 2 -67 -63 22 7 -29 20 30 34 -3 12 16 24
6222 24 -50 108 -38 16 -15 -45 38 99 97 -34 -99 -63 -94 -28 -65 -6 -78 -28 120 -50 71 -25 -116 29 -1 29 25 -24
6250 -24 -20 -49 -29 -12 94 79 113 -1 154 -4 42 55 -85 136 -66 -79 105 -44 43 -12 -109 -25 190 -152 20
6275 20 -169 96 63 -115 34 13 64 86 200 -212 -24 89 59 26 2 1 82 -62 55 -63 23 -101 87 -63
6299 -63 121 135 7 -6 19 -11 -135 39 -145 -3 229 86 -140 68 209 -62 -35 99 109 -70 142 -24
6321 -24 -202 20 177 -241 11 97 -252 15 102 -136 -22 -39 18 -134 77 127 -85 -81 92 -161 45 -15 6
6344 6 -198 95 164 -79 -67 85 -103 -204 120 -47 -171 126 78 -221 -56 159 -133 -2 5 -45 -103 64 73 -217
6368 -217 263 79 -39 -75 292 -113 -123 203 51 -42 -22 -5 -208 15 28 53 -112 110 -110 -206 138 80 -93
6391 -93 44 90 -320 -129 235 -163 -15 257 -17 -160 168 86 -186 95 65 -173 -43 244 78 -287 218
6412 218 100 -248 161 286 -155 -244 194 -144 -120 223 94 -224 105 304 -66 -90 149 -270 -126 123 -19
6433 -19 -292 73 50 -309 43 299 -275 -34 299 -118 -269 172 88 -197 105 241 -218 -82 148 -168 -115
6454 -115 307 102 -270 157 163 -51 163 124 -123 -178 176 -59 -334 214 -117 -247 15 140 -13 -198 261
6475 261 -116 -305 402 221 -243 111 120 -463 77 165 -61 -218 166 -38 -411 134 -41 -402 21 367 -367
6496 -367 -179 313 -187 -135 301 -37 -317 191 113 -355 -125 226 -150 -281 242 -61 -347 65 98 -270 15
6517 15 204 -160 -64 188 -183 -267 198 156 -219 98 176 -314 -9 223 -129 -174 481 84 -254 84 35 -426
6539 -426 -17 96 -333 -71 252 50 -216 359 76 -307 21 166 -206 17 145 -17 -77 207 -57 -322
6559 -322 299 124 -282 189 103 -185 -82 270 -72 -302 184 206 -226 9 226 -155 87 136 -119 -302 133
6580 133 167 -206 159 108 -199 -70 373 1 -143 163 -179 -204 181 264 -269 5 172 -162 114 212 8 -276
6602 -276 186 120 -60 179 37 -163 104 377 -18 -157 218 98 -115 61 60 -65 -5 274 -103 -219 319
6623 319 18 -98 219 107 -389 65 219 -218 -112 210 -73 -50 142 118 -244 24 131 -288 -99 319 158
6644 158 -38 141 -37 -123 151 191 -167 -19 152 -74 -26 144 -44 -152 274 69 -158 52 102 -102 84
6665 84 194 -64 -38 346 -33 -169 60 -9 -179 -44 282 -299 -192 302 -32 -210 124 15 -96 158 195
6686 195 -374 -140 227 -53 -156 164 40 -104 -79 143 -76 -21 -1 -85 -110 176 -42 -183 92 45 -61 83
6708 83 82 56 -114 18 51 -403 287 -54 -186 18 18 -34 -69 97 -107 -87 45 -12 -216 -25 232 -142 -52 171
6732 171 -79 28 287 -108 -143 -8 26 -205 -18 10 -177 78 180 -100 -63 162 -119 -54 127 62 -42 24
6754 24 218 -50 -39 104 17 117 174 -89 -121 28 -22 37 -102 130 -147 37 14 8 -100 216 83 -163 105
6777 105 41 -35 -71 146 99 -198 155 5 -58 90 71 -21 -53 65 -123 -56 37 135 -123 -123 -53 101 167 95 18 57
6803 57 113 46 85 84 -168 -147 -166 -42 134 175 73 -66 97 -8 23 -80 58 33 -59 71 114 168 -121 122 -25
6828 -25 133 -69 -3 -65 89 99 39 -123 -68 -34 27 18 145 -35 -105 81 -92 69 -159 13 -49 117 17 4
6852 4 22 -48 203 60 25 79 138 87 106 138 81 8 15 147 56 27 72 19 65 -81 -63 -38 65 56 -1 41 160 -117
6880 -117 56 37 -30 79 -7 -116 -19 -33 6 -16 -77 -4 -9 4 -20 6 9 69 -135 -54 -60 -153 -45 34 61 -104 -5 -64
6908 -64 -17 -109 59 84 -105 -22 154 -31 -63 -42 -72 -70 197 36 -39 23 -41 -3 84 -12 -32 -6 58 -51 -209 133
6934 133 -55 -123 164 125 -84 47 242 41 1 165 -90 29 -56 47 -5 -76 40 -168 128 166 -92 -64 184
6957 184 -47 -74 101 -14 -122 39 180 -155 -55 -81 -94 -169 125 169 -39 117 305 -93 38 71 12 49 27
6980 27 -75 -223 91 35 -100 -2 65 -45 4 130 -80 -12 104 90 -186 68 72 -130 116 216 -113 -193 52
7003 52 4 -155 147 -88 -116 -150 -14 -46 -115 203 117 -96 79 25 -222 -11 353 -140 4 268 2 -57 133
7026 133 42 -80 109 158 -174 26 148 -59 -209 62 -103 -200 42 -56 -125 136 75 -109 -21 62 -37 -172 158
7049 158 90 24 117 122 34 55 232 -91 -127 95 -32 -79 6 14 -37 -14 141 -62 9 88 -35 -212 232 -4 -131
7074 -131 47 182 -74 94 220 49 39 18 63 -64 23 199 -247 -105 56 -95 -112 150 37 -258 3 35
7096 35 -63 47 215 -75 -66 227 -25 -162 177 74 -69 97 -7 -194 101 307 -205 -140 339 106 7 16 -15
7119 -15 -238 149 230 -79 18 24 -25 -195 91 71 -209 -77 191 -236 -4 275 -95 20 123 79 -90 162 137
7142 137 -111 133 215 -121 -83 307 -22 -197 136 -12 -124 82 72 -67 -101 143 -137 -171 152 184 -114 -3
7164 -3 206 -161 27 274 -79 31 26 -112 -23 116 121 -89 143 182 -174 -59 282 -58 -177 220 137 -170 186
7187 186 59 -71 35 107 -15 -8 232 -38 -173 70 33 -118 23 214 -69 18 224 165 -98 75 -16 -81 73
7210 73 231 -134 3 189 -31 -206 159 72 -38 56 158 -81 92 101 -57 -153 72 73 -109 -28 72 -218 93
7233 93 108 -127 36 248 -194 -147 238 -35 -73 -1 30 -42 -11 22 -61 44 180 -117 25 54 95 -101 86 55
7257 55 -72 -96 408 224 -10 66 -153 10 141 141 -106 175 82 43 -45 -31 46 -93 48 86 -137 89 129 -46
7281 -46 -66 182 29 -85 43 79 1 231 -9 -61 51 125 -107 -22 233 75 -134 -67 -85 -91 -6 99 -67 -85
7305 -85 204 49 36 89 -49 -124 -85 -103 204 -28 81 -159 -72 -21 114 -236 18 82 23 147 -49 -39 -52 171
7329 171 -15 -69 -88 56 65 -141 89 53 41 48 3 -119 -1 -160 -107 -7 72 -193 -81 28 -80 14 -114 33
7353 33 -79 93 46 -127 57 153 -81 110 -188 153 63 61 27 30 81 -37 -109 -38 239 -57 -116 151 -66 26 81
7378 81 45 -22 11 -4 -25 151 103 157 -53 93 -157 58 8 63 75 -194 137 -5 -19 3 -65 51 -7 145 -200
7403 -200 -26 -27 -52 36 -80 117 -81 10 113 -94 129 165 -4 -142 75 -87 -101 -102 -56 -8 18 -104 -164 -44
7427 -44 -195 -177 11 153 153 -34 -46 -150 93 -20 38 132 -65 38 -1 72 -13 -29 111 -42 -242 254 -173 -58
7451 -58 -122 259 58 104 247 -16 101 58 24 -4 149 136 17 30 -91 -17 -255 -96 -223 -88 24 -198 -240
7474 -240 -8 -38 -98 -20 2 -58 -62 -61 -110 -222 77 51 -174 -47 48 21 86 137 -110 44 125 50 -39 -103 7 -27 -56
7501 -56 -43 -74 84 140 -18 -57 64 88 40 53 72 59 -119 -60 89 -84 70 55 28 145 -80 28 27 119 178 -24
7527 -24 49 33 -78 195 16 14 -34 -14 28 16 105 -81 21 115 -79 -157 120 71 -175 -24 38 -34 159 90 -178
7552 -178 -122 120 107 -5 -67 61 -99 82 119 -115 -77 87 1 -90 -61 144 156 35 78 -2 -154 82 -32 4
7576 4 66 -107 -109 87 -47 -77 -117 160 34 31 52 7 -77 90 157 -217 16 129 -45 -90 217 -27 96 63 -73
7601 -73 -245 122 237 -107 -100 204 -66 151 9 -21 -130 77 216 -35 2 4 -42 -32 126 -39 13 169 -90
7624 -90 15 68 205 114 -103 53 -24 -184 73 41 -204 99 195 -128 -61 130 62 -103 165 94 -106 -19 -29 -58
7648 -58 -57 123 -115 40 115 -108 -62 133 133 -302 -72 340 -138 95 26 -170 -137 64 -45 -145 122 194 -272
7671 -272 52 93 -101 -154 175 41 -87 33 109 -148 -39 155 -134 -17 53 -7 -164 0 -109 -177 30 179
7693 179 -77 226 145 -82 121 -9 77 -150 101 26 -41 145 156 -188 -99 221 -128 24 58 69 -211 -192 92
7716 92 -120 67 128 -46 -3 110 33 53 37 153 4 140 -22 -120 198 -66 110 -28 11 56 -132 19 88
7739 88 -176 75 319 -55 -268 238 -58 -58 24 17 -4 76 31 -209 -49 67 -32 75 78 25 -139 84 90 -222 -123
7764 -123 201 -31 -100 126 -114 -101 95 50 63 -13 136 10 -56 85 42 -70 75 132 -195 -4 85 -82 -46
7787 -46 96 -120 -107 -31 85 -104 -51 99 -45 24 200 -109 3 113 117 -186 -44 75 -172 35 155 -142
7809 -142 -118 36 -49 -218 19 -92 -96 100 -57 -186 -1 131 -45 12 102 -88 -169 84 -99 18 -130 10
7831 10 -43 -41 152 -90 -133 117 -73 -275 -29 39 -128 38 156 37 -96 248 -40 -128 37 42 -52 149 11
7854 11 -191 40 75 -61 -141 124 64 -65 12 198 -77 -27 22 -102 -18 259 -58 -5 7 0 21 -41 15 -110 -27
7879 -27 184 -151 -47 154 115 -83 -46 83 19 4 173 -68 113 -11 129 -17 44 -110 10 108 -13 -73 -55
7902 -55 51 -85 -149 134 99 41 93 -114 -28 25 206 -81 22 35 -1 -56 112 -41 -67 -40 123 -94 94 32
7926 32 38 -53 -9 121 -289 -44 -45 -51 54 -77 -121 28 106 5 -61 -43 9 41 -55 76 -178 -9 -56 6 -153 60
7952 60 -73 6 24 132 -7 77 99 31 -118 -3 109 -166 27 -30 126 -54 38 127 -82 106 68 -25 -111 -73
7976 -73 -92 -126 86 49 -43 -41 -108 196 78 67 -18 -9 -87 38 32 -102 -44 12 -52 121 23 223 -34 -64 -113 -119 20 -158
8004 -158 -168 -18 -23 -59 -88 104 176 -101 -76 73 -150 75 -34 18 5 -199 -49 1 -25 -29 1 60 -9 128 -94
8029 -94 -60 -103 62 -11 46 -89 71 -104 -81 -90 132 67 -21 201 -52 165 115 -59 -4 64 -156 -80 28 149 -11
8054 -11 -47 75 -13 -142 -91 79 17 -129 -99 -47 79 157 14 12 -13 25 -139 118 56 -70 19 116 10 -6 -101 202
8080 202 1 2 9 -135 88 31 17 -13 127 -10 -90 236 51 -82 43 -72 -83 86 184 -93 -9 -119 -60 -226
8104 -226 -18 -64 3 -20 79 -66 -96 30 129 -194 14 -26 -81 32 46 3 -2 245 -138 -101 78 -16 -38 102 -161
8129 -161 33 -82 62 25 -49 175 24 77 146 -109 123 119 -49 15 -68 54 47 -13 -86 124 -66 186 -37 -244
8153 -244 88 53 76 -168 89 150 -234 -78 -68 -80 131 -71 -113 4 67 -24 -22 -29 21 -36 -35 190 -54 60 88 -133
8179 -133 -88 166 123 -25 36 86 -61 -170 137 -136 52 141
8191A41
$$ Imaginary data points
##PAGE= N=2
##DATA TABLE= (X++(I..I)), XYDATA
0 0 0 0 0 0 0 0 8 -8 8 -8 8 -16 20 -24 32 -40 48 -64 72 -88 104 -128 152 -182 209 -246 288 -328 382 -436
30 -436 500 -569 645 -732 826 -930 1042 -1168 1308 -1454 1617 -1801 1994 -2208 2443 -2699
46 -2699 2975 -3283 3619 -3984 4389 -4837 5332 -5883 6506 -7200 7999 -8916 9985 -11243
60 -11243 12764 -14632 16997 -20099 24367 -30629 40740 -59789 108223 -496794 -877529
71 -877529 190066 268852 236891 -15641 -283703 30699 726594 473792 -101303 -66168
81 -66168 151003 141226 356638 286785 -153838 -54018 407426 113465 -450123 -561166 -547373
92 -547373 -388887 169299 277479 -196793 -184592 268814 270706 99346 41026 -221068 -232087
103 -232087 319604 422741 -121898 -273102 33127 228748 439064 401254 -280982 -690488
113 -690488 -177578 298838 232083 96039 -163966 -462347 -168591 257176 -6501 -353332
123 -353332 -189469 -26193 47909 263456 165837 -146432 88620 480157 290098 2674
133 2674 -7877 -82713 -23410 262016 100616 -366284 -325169 -60927 -133729 -210760 -203688 -325153
145 -325153 -125603 404478 414882 -21448 -119590 31594 161717 404526 379682 -137799
155 -137799 -353866 13829 232535 141511 40667 -217368 -435342 -177193 67519 -145598
165 -145598 -246126 -12620 113821 183879 273487 47210 -203522 18927 241313 55427
175 55427 -93136 -73987 -99663 60287 305352 118323 -195022 -100300 46381 -36788 -70957
186 -70957 -115120 -225251 -7417 349114 224208 -133339 -205300 -146654 -43565 172482 117948
197 117948 -225191 -224387 115674 257978 228561 171897 -42161 -156250 46922 110501 -115522
208 -115522 -163414 -25912 9371 57178 71286 -152442 -264684 -29731 104536 -16904 -60506
219 -60506 -31811 -9291 179259 317182 102252 -96593 7100 82680 21752 -15023 -128514
230 -128514 -225228 -19003 201162 55836 -165110 -184003 -133017 -164 179172 90889 -137723
241 -137723 -72511 138886 172224 129999 54095 -105390 -102706 80587 71693 -95965 -93822 -917
253 -917 29380 76948 35015 -154200 -169498 33907 99307 11488 -22355 -39264 -17560 122688
265 122688 147368 -52452 -148423 -32002 51939 63482 49404 -55557 -92482 84091 192455
276 192455 47332 -111711 -145574 -109191 19134 124678 16384 -125739 -55309 67832
286 67832 70222 26663 -50122 -125322 -37675 116205 92733 -11037 -1349 53711 82774 92200
298 92200 -4181 -154296 -132095 13802 49738 -6370 -43569 -62812 -14223 90477 67838
309 67838 -77936 -119778 -25418 61274 95231 63534 -26484 -29723 92056 135065 22751 -93406
321 -93406 -126859 -77553 32241 76152 -14683 -87135 -28917 51434 53728 -4193 -81535 -98780
333 -98780 1097 97588 68235 -5072 -11289 35591 81353 67911 -29888 -113235 -71915 31432
345 31432 64332 14099 -47500 -57497 3019 59572 17518 -76726 -99776 -25889 64494 86510
357 86510 27664 -33897 -16156 57246 81437 13941 -72020 -81466 -5660 67146 55497 -17363
369 -17363 -61831 -29294 35819 39912 -34163 -89505 -56687 25388 76108 51047 -19793 -43356
381 -43356 15501 64886 27795 -42860 -67377 -27340 52275 90057 27116 -48420 -35159 18487
393 18487 30428 -2945 -60648 -87806 -21479 68786 58252 -13874 -39907 -22003 12162 43196
405 43196 5970 -64500 -36764 60120 90491 53517 6636 -38322 -28789 35942 26564 -65474
417 -65474 -89436 -31847 13855 42919 32054 -45661 -68818 15169 55400 6124 -22213 -15614
429 -15614 4672 73856 108059 19374 -54517 -17194 12377 -4478 -13721 -54662 -90570 -14901
441 -14901 68365 25689 -31827 -20429 -13430 4147 48458 10691 -59738 -5653 79979 62446
453 62446 25489 1396 -52117 -39850 40151 17019 -70906 -52519 6894 19476 48138 40398
465 40398 -52888 -64206 30226 36018 -22614 -18093 -14916 -17483 56301 79638 -24451 -62870 4669
478 4669 17466 5992 30089 -10743 -50725 33672 81677 -1163 -40934 -18572 -39565 -24642
490 -24642 27538 -26783 -86079 -3075 62614 22449 14038 11098 -41988 -3752 86626 40010
502 40010 -35168 5696 31663 10540 39651 16664 -88901 -76973 14255 -9606 -50477 -12902
514 -12902 -18600 -22967 64212 68580 -37265 -34594 36923 22364 22279 55724 -6004 -42105 48596
527 48596 58832 -37491 -43193 -19184 -54645 -17351 40609 -29668 -64859 31177 53435 -3656
539 -3656 9670 -1519 -59601 2349 79049 5029 -41341 20170 19592 646 50917 15179 -78165
552 -78165 -28618 47555 -259 -17004 22014 -19428 -28976 49886 16785 -79452 -39424 14824
564 14824 -18301 5211 39794 -26496 -23725 78426 58056 -25006 -40 9567 -27398 31290
576 31290 63835 -34728 -52853 27659 4190 -42239 -6727 -33993 -81794 2974 54368 -24083
588 -24083 -22795 46384 20679 14564 66580 7282 -60910 19728 63165 -4522 -2521 17621 -45941
601 -45941 -32696 43868 -12942 -82291 -18839 5477 -30919 19037 40785 -31951 -6938 71350
613 71350 15977 -38267 11284 6512 -18863 50931 52201 -47521 -30230 41522 1566 -18977
625 -18977 16514 -36200 -67887 25658 43699 -33707 -13164 23760 -27379 -14096 38399 -23385
637 -23385 -50393 42173 49284 -13227 17955 29874 -25433 15366 66830 -17967 -60988 6710
649 6710 2545 -25554 28760 11243 -69174 -23768 34739 -25457 -36136 19543 -7917 -16918 59335
662 59335 41232 -31999 16258 57547 -3103 -5903 21390 -38248 -38425 49386 26346 -46336 -15062
675 -15062 -3328 -47143 -4409 32499 -37710 -40067 40707 23571 -13400 33177 22176 -27922
687 -27922 22998 47306 -32070 -31849 33858 9213 -8900 33284 -8803 -64458 2111 34903
699 34903 -29306 -23899 10017 -31704 -17437 52785 14023 -38687 14438 26828 -22352 7227
711 7227 30536 -24873 -5091 59470 12745 -32847 10737 3744 -32088 11675 15249 -54060 -30347
724 -30347 34562 2814 -16903 19398 -11868 -40802 23411 33688 -26861 -3132 38906 3683
736 3683 5682 39417 -10202 -39872 21711 22471 -31931 -10447 7416 -29936 -2037 40069 -16243
749 -16243 -44144 9474 6794 -20242 18184 18338 -28753 6329 48264 -434 -16469 22100 -1529
762 -1529 -20716 23403 9357 -39453 -986 33292 -8826 -12914 9578 -27045 -30536 26705 12284
775 12284 -33047 -110 21551 -5950 14926 32049 -19810 -25023 26655 13059 -17254 10633
787 10633 9111 -19888 11571 25996 -27402 -30848 10657 -4589 -15684 16238 1098 -25760
799 -25760 15211 31847 -11589 -10532 13682 -9185 -6682 28235 3103 -25499 11223 20776 -12889
812 -12889 -3599 5410 -25509 -12309 26277 1065 -23542 6750 10340 -7680 14552 13961 -26921
825 -26921 -14250 21193 2712 -8751 12294 -392 -13406 17831 16751 -22385 -13298 10861
837 10861 -5071 -3244 15915 -5732 -16515 15793 13920 -17404 -8947 2686 -11043 2872 22095
850 22095 -3494 -14235 14719 12686 -7543 2027 -664 -19307 248 19911 -4153 -13759 4490
863 4490 -109 -6720 9950 1427 -21443 -2838 17125 2596 943 10641 -3048 -4374 15918
876 15918 5025 -18448 -7668 3594 -5368 1223 7202 -10947 -9819 11950 5131 -10601 -2304
889 -2304 1031 -2466 12124 16487 -3684 -5818 9409 4455 -4859 -1729 -8539 -13839 4035 11044
903 11044 -4961 -7753 502 -1752 448 7174 -2864 -10432 3567 12400 4432 3032 2485 -4460
917 -4460 -64 8079 -1821 -11174 -4211 1468 1427 4535 1175 -7679 -3783 5171 610 -6467 -4909 -3148
933 -3148 1426 9381 6718 -3051 -2677 3383 4361 1816 -1441 -4443 -1143 7440 8074 70 -5668 -5506
949 -5506 -2347 -215 -3170 -7642 -7237 -1191 5334 5429 -554 -3336 579 4890 5478 3376 -423 -859
965 -859 5475 8811 2543 -3882 -4057 -4424 -3099 -576 -6017 -10830 -3281 4028 2296 796 503 -3250
981 -3250 -226 8483 4402 -3689 1297 6227 4229 6755 4527 -7590 -7183 3038 -525 -7482 -3304
996 -3304 -3038 -4497 5280 6670 -7254 -7128 3716 814 -822 5948 315 -4327 8394 11197 -2691
1011 -2691 -3130 2724 -3853 -2209 7355 -2484 -10335 3506 5904 -5186 -1244 1007 -9873 -3884
1025 -3884 9120 -1462 -8650 4701 5211 -2050 7656 6848 -9258 -1930 11457 -683 -5381 5516
1039 5516 -903 -6393 8763 5903 -13608 -6522 4679 -6669 -4786 7324 -4758 -8389 11548
1052 11548 8739 -8288 937 6401 -6427 1679 13921 -2965 -7669 11308 4970 -9522 1798
1065 1798 857 -14858 -1796 10435 -7779 -9272 8149 -28 -7215 9192 3829 -13069 3162
1078 3162 14244 -3973 -2142 11041 -3622 -6378 12904 2677 -15338 762 6734 -10255 -1496
1091 -1496 9200 -9567 -7870 14189 1926 -12390 4668 3918 -11147 5007 13383 -8786 -4820
1104 -4820 14599 -149 -8981 9060 474 -14594 6076 11707 -10852 -3108 12149 -5439 -7739
1117 -7739 10045 -4310 -16855 7020 9935 -10691 430 10323 -9401 -3284 16957 -1008 -12178
1130 -12178 9716 6609 -9677 6671 10811 -12311 -4041 12707 -7387 -13622 7511 -1399 -13710
1143 -13710 7837 7434 -14712 -238 15666 -3919 -3847 13768 -2312 -11228 13624 9996 -11493
1156 -11493 3234 10136 -12345 -5334 10728 -9598 -13761 10827 2374 -14264 4835 8017 -11678
1169 -11678 2402 15467 -8826 -9767 13363 2804 -7245 12916 6113 -15240 1555 11975
1181 11975 -9723 -5462 12047 -5790 -11669 11077 2223 -14634 5398 9700 -12742 -4044 10056
1194 10056 -8453 -6306 16752 2797 -12512 7329 7554 -9972 5939 14127 -10494 -6921 12995
1207 12995 -2647 -9995 10068 1541 -16204 2008 6168 -15463 -4242 13499 -4568 -6597 12786
1220 12786 -555 -11857 11938 12128 -9756 1644 10756 -8826 -3182 15888 -2796 -13787 6288
1233 6288 11 -16074 2716 8267 -11967 -2110 12848 -6739 -9383 12571 4006 -8337 9432
1246 9432 6990 -13687 1180 15031 -4837 -4665 10238 -6100 -13478 9035 4809 -12678 2429
1259 2429 8549 -11034 -3266 12368 -4605 -8046 11898 1357 -13218 5387 8142 -8615 3711
1272 3711 13092 -8918 -9118 10757 -151 -8535 9841 3888 -13856 2178 10417 -9281 -3896
1285 -3896 10367 -6099 -10033 9349 1533 -11147 7595 10234 -9384 -1069 10105 -6134 -4125
1298 -4125 13883 167 -11866 5718 4389 -10368 2778 8927 -10523 -6573 9255 -4063 -8764
1311 -8764 9617 3948 -9232 5836 8340 -9716 -1000 11670 -3873 -6181 8772 -1562 -10634
1324 -10634 7357 6551 -10920 -1412 6339 -8883 -3509 11843 -1398 -8084 8395 4171 -9126
1337 -9126 3764 7495 -8363 -1170 10215 -5406 -8126 8315 811 -8812 4810 3837 -10726
1350 -10726 469 10177 -4609 -4102 8897 -1504 -7098 8008 3976 -9451 1733 6463 -7691
1363 -7691 -2699 7957 -3738 -6172 8145 1709 -8899 2940 4891 -7016 1050 8660 -5017
1376 -5017 -4875 7862 -435 -7049 4852 1870 -8752 2056 7520 -5371 -2152 7992 -1880 -5246
1390 -5246 6301 680 -7798 3828 5566 -6496 -1332 5402 -4884 -4157 6676 -999 -7361 4192
1404 4192 4058 -4961 2863 6432 -4693 -1558 7646 -1216 -5142 4375 756 -6769 2022 3290 -6557
1419 -6557 -1975 5289 -3105 -3696 4994 -322 -4587 5008 4300 -4196 1264 5291 -3151 -1904 4657
1434 4657 -2585 -5374 3766 1601 -4827 1234 2822 -4568 -351 4976 -2358 -3536 4315 1435 -2969
1449 -2969 3114 2231 -4998 -323 3824 -3041 -2383 3480 -546 -2608 3645 1854 -3649 1300 3445
1464 3445 -2446 -858 3014 -2082 -2923 2663 -299 -4531 702 1481 -3006 61 2815 -1810 -979 4099
1480 4099 1591 -971 2917 1603 -2388 912 1741 -3113 -2404 1001 -1533 -2194 1162 -572 -3275 413
1496 413 1893 -1088 711 2698 307 692 3087 489 -1730 753 567 -1854 -561 265 -1952 -895
1512 -895 909 -978 -2045 374 277 -595 1018 918 -947 218 1384 191 -419 423 -117 -658 706
1529 706 495 -597 -107 713 537 832 558 -120 -606 -522 -309 -666 -918 -931 -349 -211 -292 -348 -615 -212 852
1550 852 1438 698 783 1840 1262 646 641 -534 -1576 -398 -351 -1753 -1822 -710 -1457 -1251 722 -296 -1190
1569 -1190 1263 1907 329 1647 2264 163 361 2538 250 -1358 242 -547 -2557 -467 294 -2520
1585 -2520 -1144 1353 -880 -1270 1428 281 -1342 1808 2049 -1155 511 2534 -730 -751 1996 -1021
1601 -1021 -2699 1671 1051 -2501 288 1698 -2237 -799 2361 -1406 -2687 2048 564 -2490 1294
1616 1294 1705 -2701 125 3245 -1190 -1336 3344 561 -2109 2721 1778 -3098 461 2776 -2887 -1870
1632 -1870 2144 -2250 -3518 2190 331 -4021 1375 2757 -2371 369 4251 -1551 -1646 4613 1089
1647 1089 -2954 2479 1877 -4121 431 2782 -4166 -3105 2967 -1477 -3579 3087 1040 -4272 1823
1662 1823 3732 -3222 -325 4784 -1343 -1974 4658 433 -4345 2501 2415 -4589 -193 3480 -3756 -2165
1678 -2165 4574 -1468 -4409 3296 1688 -4480 1857 4089 -4088 -1020 4982 -1800 -3421 4800 791
1693 791 -4371 3091 3011 -5242 -176 4722 -3110 -2284 4938 -1185 -4920 3769 2067 -5610 1152 4080
1709 4080 -4334 -1074 5924 -1771 -3831 4920 796 -5431 2679 3846 -4821 317 5500 -3900 -4028
1724 -4028 4883 -555 -4735 3877 2103 -5999 924 5018 -4007 -1547 5795 -1849 -4536 5367 1490
1739 1490 -5532 2958 4272 -5377 -722 5564 -3484 -3261 5994 -456 -6231 3146 2524 -5589 1618
1754 1618 5884 -4526 -2783 5651 -1846 -4597 5564 2076 -5776 2499 4411 -5453 -864 6191
1768 6191 -3031 -4286 5186 -468 -5789 4565 4040 -5723 214 4910 -4702 -2335 6918 -876 -5216
1783 -5216 4338 1216 -6538 2484 5354 -5067 -1407 5651 -3543 -4317 6209 1019 -5269 3810 3283
1798 3283 -6435 547 6523 -3524 -2727 5572 -2373 -6036 4853 2592 -6020 1694 4398 -5982
1812 -5982 -1649 6497 -1761 -3447 6328 708 -6656 3102 4055 -5132 714 5648 -4910 -4174 5560
1827 5560 -553 -4885 4639 2172 -6967 1234 5400 -4026 -602 6846 -2541 -5229 4821 932 -5542
1842 -5542 3361 4121 -6263 -1210 5017 -3585 -2635 6788 -399 -5882 3626 2461 -5393 2277 5582
1857 5582 -4845 -2534 5404 -2303 -4309 5548 1477 -6205 2101 3561 -5471 327 6622 -2709 -3613
1872 -3613 5197 -860 -5719 4336 3463 -5792 304 4319 -4881 -2257 6255 -1334 -4573 4532 1491
1887 1491 -5505 3016 4914 -4450 -684 4940 -3502 -4190 5191 316 -5316 2930 2168 -6368 647
1902 647 5678 -2995 -1580 5788 -1300 -4476 4728 2344 -4897 2095 3755 -5385 -1610 4920 -2726
1917 -2726 -3701 4672 12 -5280 2987 3518 -4365 1031 5086 -3795 -2548 5292 -620 -4091 3993
1932 3993 1439 -5652 775 3739 -4168 -1082 5138 -1830 -3597 4807 826 -4507 3167 3381 -4497
1947 -4497 -149 4291 -3152 -2556 4365 -822 -4775 2817 1789 -4479 1624 3908 -3651 -1290 4733
1962 4733 -1428 -2992 4238 1030 -4389 1760 2681 -4474 -549 3966 -2584 -2659 3920 -342 -3669 3123
1978 3123 2304 -4067 928 3611 -3077 -1191 4330 -1343 -3651 2924 859 -4095 1653 3058 -3294
1993 -3294 -242 4085 -1910 -2083 3750 314 -3364 2368 1720 -3950 161 2863 -2994 -1877 3117
2008 3117 -959 -2829 2801 1538 -3003 1633 3126 -2358 -82 3494 -1378 -2236 2763 -258 -3580
2023 -3580 1165 1138 -3303 -68 2464 -2219 -1517 3272 37 -2036 2651 1484 -2443 1179 2567 -2259
2039 -2259 -819 2373 -1422 -2196 1864 53 -2789 1152 1521 -2474 -130 2345 -1431 -924 2532 17
2055 17 -1887 1602 1168 -2032 273 1625 -1494 -546 2258 -507 -1571 1620 559 -1803 809 1265
2071 1265 -1814 -244 1377 -1123 -1234 1307 -138 -1457 1104 904 -1068 444 1549 -835 17 1611
2087 1611 -83 -885 1051 347 -1333 -18 274 -1475 -666 703 -835 -1023 753 130 -821 675 728
2104 728 -539 527 1194 -83 -272 725 44 -745 281 -149 -958 -134 272 -408 -344 32 -343 -247 239
2123 239 177 -80 159 291 -167 -32 192 45 121 12 175 308 -139 162 203 -52 11 404 -40 -306 72
2144 72 158 -649 -502 253 -353 -242 715 -36 -544 693 398 -492 207 882 -400 -47 1048 -112 -811
2163 -811 570 110 -1027 347 587 -889 -368 1104 -774 -867 943 26 -923 672 817 -1450 62
2180 62 1338 -722 -626 1515 -46 -1059 1345 488 -1432 377 1408 -1200 -421 1488 -645 -1386 1492
2197 1492 78 -2058 794 835 -1874 230 2072 -994 -850 2246 70 -1537 1668 1218 -2004 627
2213 627 1884 -1817 -890 1811 -1165 -2046 1789 202 -2336 1111 1719 -2228 -110 2536 -1240 -1301
2229 -1301 2784 54 -2448 1743 1311 -2677 398 2379 -2091 -1106 2835 -892 -2278 2416 646
2244 646 -3053 1367 2137 -2733 -507 2812 -1513 -1982 2876 -67 -2907 2061 1869 -3037 453 2970
2260 2970 -2207 -1232 3489 -731 -2877 2575 1000 -3440 816 2364 -3271 -870 3476 -1640 -2409
2275 -2409 3488 699 -3134 2185 2306 -3392 268 3453 -2280 -2016 3457 -738 -3620 2363 1257
2290 1257 -3883 1153 3320 -3080 -851 4061 -1193 -2649 3731 943 -3781 1667 2359 -4066 -372
2305 -372 3584 -2809 -2757 3504 -555 -3735 3123 1996 -3980 889 3728 -2907 -1125 4685 -811 -3301
2321 -3301 3345 700 -4362 1813 3013 -3956 -834 3904 -2579 -2677 4445 205 -4084 2874 2280 -4384
2337 -4384 772 4153 -3010 -1678 4269 -1205 -3731 3814 1768 -4298 1690 3065 -4358 -919 4794
2352 4794 -1686 -2848 4009 -287 -5106 2335 2724 -4327 571 4312 -3334 -2188 4784 -186 -3439
2367 -3439 4008 1856 -4828 1229 3844 -3753 -1222 4265 -2799 -4304 3590 660 -4417 2622 3015
2382 3015 -4790 -233 4794 -2258 -1648 5570 -424 -4325 3053 2058 -4614 1271 4012 -4350 -2601
2397 -2601 4195 -1761 -3493 4334 1020 -5101 1637 3350 -3888 335 5481 -2345 -3149 4221 -315
2412 -315 -4249 3668 2818 -4989 114 3682 -3978 -1791 5219 -1003 -4179 3321 882 -4840 2269
2427 2269 4115 -4074 -1118 4143 -2564 -2972 4995 760 -4253 2727 2250 -4838 637 4951 -2785
2442 -2785 -2084 4043 -1559 -4728 3667 1809 -4371 1310 3087 -4233 -1114 5062 -1343 -2566 4505
2457 4505 367 -4678 2778 3300 -3996 34 3807 -3571 -2908 4121 -633 -3895 3048 1369 -5131
2472 -5131 803 3857 -3009 -595 4693 -1478 -3352 3828 1250 -3737 2491 2778 -4581 -620 3979
2487 3979 -2572 -2471 4095 -661 -4416 2510 2116 -3889 1192 3967 -3269 -1613 4088 -1268 -2870
2502 -2870 3793 1245 -4197 1429 2855 -3728 -252 4172 -2094 -2809 3466 -224 -3813 2384 2268
2517 2268 -3839 90 3312 -2638 -1541 4155 -652 -3241 3006 976 -3689 1746 3319 -3030 -891
2532 -891 3428 -2169 -2734 3604 156 -3618 1810 1940 -3720 151 3464 -2061 -1619 3601 -557 -2940
2548 -2940 2998 1596 -3262 957 2763 -3087 -915 3401 -1294 -2499 2661 283 -3541 1550 2059
2563 2059 -2971 135 3160 -1881 -1898 3222 -186 -2693 2418 1522 -2998 750 2591 -2330 -1072 2770
2579 2770 -1167 -2246 2469 778 -2948 1141 1903 -2653 -523 2641 -1416 -1634 2474 -18 -2603
2594 -2603 1684 1322 -2556 454 2457 -1828 -1071 2464 -912 -2176 1945 547 -2545 1175 1777 -1990
2610 -1990 -380 2163 -1276 -1409 2351 138 -2127 1454 1133 -2122 350 1799 -1522 -1199 1967 -348
2626 -348 -1752 1629 974 -1957 676 1634 -1532 -337 1961 -897 -1228 1539 128 -1936 673 860
2642 860 -1694 61 1500 -939 -846 1429 -255 -1290 1180 649 -1367 434 1276 -1090 -533 1370
2658 1370 -449 -993 1190 258 -1242 687 849 -1193 -157 1062 -656 -633 906 -238 -1112 364
2674 364 479 -1138 26 995 -546 -302 1073 -262 -751 601 342 -445 235 643 -405 -197 584 -414
2692 -414 -605 439 -178 -527 364 277 -413 45 530 -269 -111 434 -44 -231 348 223 -519 2 33 -350
2712 -350 -276 252 -53 -90 99 93 110 -38 93 265 -8 23 26 -102 -260 -301 7 -210 -156 275 -20 -264 317
2735 317 78 -99 343 448 -33 180 605 -172 -299 311 -181 -615 277 139 -751 -89 297 -793 -442 624
2755 624 -175 -504 697 577 -789 312 754 -782 -200 818 -498 -599 826 24 -845 672 569
2772 569 -1151 10 1254 -696 -391 1236 -292 -1216 850 402 -1358 374 1167 -895 -217 1388
2788 1388 -433 -1068 1200 267 -1371 861 1129 -1454 -149 1456 -1134 -1044 1408 -290 -1625 947
2804 947 781 -1784 218 1588 -1118 -392 2181 -283 -1116 1651 390 -1784 709 1266 -1648 -380
2820 -380 1830 -1130 -1459 1767 -58 -1945 1258 1074 -1841 604 1920 -1391 -800 2194 -507 -1761
2836 -1761 1741 819 -2034 682 1630 -2094 -323 2303 -1008 -1635 2145 190 -2264 1258 1425 -2328
2852 -2328 48 2049 -1551 -1137 2194 -295 -2276 1793 852 -2532 817 2308 -1743 -484 2473
2867 2473 -910 -1969 2229 374 -2610 1324 1571 -2542 -191 2476 -1882 -1466 2505 -283 -2342
2882 -2342 1957 1395 -2590 552 2415 -2196 -936 2984 -934 -2109 2360 445 -3078 1312 2095
2897 2095 -2425 -388 2898 -1708 -1852 2823 11 -2753 1983 1288 -3032 496 2626 -1968 -934
2912 -934 2763 -957 -2606 2463 1155 -2627 1330 2324 -3010 -530 3137 -1271 -1969 2758 -30 -3308
2928 -3308 1448 1693 -2845 205 2879 -2249 -1597 3124 -326 -2325 2691 1173 -3139 977 2550
2943 2550 -2456 -564 3239 -1505 -2669 2570 140 -3085 2037 2025 -3104 -290 2773 -1937 -1543 3465
2959 3465 -80 -3039 2154 1366 -3015 999 3049 -2635 -1215 3133 -1338 -2585 3128 1197 -3200
2974 -3200 1217 1837 -3155 -314 3528 -1585 -1862 2864 -638 -3292 2413 1933 -2943 428 2552 -2670
2990 -2670 -1561 3517 -739 -2739 2341 820 -3679 1242 2552 -2830 -524 3054 -1969 -2570 3308
3005 3308 450 -2881 1720 1833 -3673 -38 3346 -1855 -1354 3196 -819 -3263 2122 1362 -3020 1023
3021 1023 2553 -3125 -1179 3155 -1096 -2323 3100 354 -3586 1322 2165 -2731 245 3148 -2094
3036 -2094 -2105 3080 -56 -2797 2276 1568 -3330 106 2573 -2276 -707 3489 -1008 -2766 2346 713
3052 713 -3009 1591 2275 -2847 -557 2673 -1725 -1745 3176 45 -3039 1733 1566 -2994 682 2853
3068 2853 -2077 -1346 2908 -715 -2561 2399 1050 -2977 788 2017 -2692 -589 2831 -1230 -2129
3083 -2129 2484 234 -2842 1839 2051 -2663 -27 2549 -1921 -1418 2879 -219 -2247 2004 909
3098 909 -2865 686 2493 -2034 -713 2707 -1154 -2166 2467 701 -2353 1340 1829 -2547 -256
3113 -256 2525 -1378 -1498 2442 -56 -2502 1718 1469 -2365 491 2195 -1969 -887 2494 -496 -1808
3129 -1808 2042 614 -2624 778 1515 -2060 -160 2508 -1055 -1605 2179 83 -2073 1389 1211 -2167
3145 -2167 244 2134 -1491 -1014 2152 -490 -1922 1541 713 -2111 651 1398 -1743 -537 1872 -895
3161 -895 -1265 1971 412 -1916 912 1004 -1952 37 1886 -1277 -1016 1655 -220 -1541 1289 652
3177 652 -1750 367 1451 -1433 -448 1914 -664 -1460 1443 330 -1663 759 1250 -1411 -130 1612
3193 1612 -872 -842 1629 98 -1309 995 906 -1543 169 1120 -1141 -586 1343 -553 -1220 1119 321
3210 321 -1388 524 1071 -1233 -127 1250 -657 -820 1216 -83 -1055 684 590 -1154 -14 853 -771
3227 -771 -510 1132 -27 -1072 806 129 -1006 306 878 -1023 -255 1106 -536 -536 887 180 -831
3244 -831 494 534 -891 -44 709 -512 -393 622 -267 -687 485 211 -828 98 574 -605 -78 626
3262 626 -269 -557 621 -30 -606 289 504 -274 -28 531 -278 -306 361 -132 -639 291 243 -365 -97 66
3282 66 -223 -124 397 -85 -79 336 131 -178 203 195 -82 -120 264 -178 -144 -45 -167 -115 -124 -28 -56 61 18 -162 79
3307 79 32 127 -71 -38 196 165 219 -92 4 -45 -61 39 62 -80 -78 125 -84 -141 179 -77 -227 228 259 -237 183
3332 183 267 -175 42 327 -5 -227 211 185 -496 78 191 -478 -140 427 -283 -407 585 -36 -458 340 58
3353 58 -481 68 595 -407 -267 591 -192 -516 646 46 -617 383 391 -505 -118 800 -319 -578 668
3372 668 147 -757 453 692 -902 -75 898 -516 -345 803 71 -713 637 162 -890 264 563 -946
3390 -946 -386 968 -379 -975 930 236 -1212 520 653 -769 12 1156 -310 -757 1007 -58 -934
3407 -934 795 441 -1185 31 931 -961 -595 1108 -235 -917 1026 408 -1224 404 863 -1045 -303
3424 -303 1162 -729 -830 1155 -19 -1177 732 782 -1338 22 1154 -885 -689 1168 -447 -1321
3440 -1321 949 488 -1236 364 1134 -1082 -376 1456 -372 -1036 1168 180 -1407 857 1099 -1347
3456 -1347 -99 1417 -1117 -972 1534 -187 -1202 998 612 -1558 277 1233 -978 -288 1760 -435
3472 -435 -1210 1313 362 -1475 619 915 -1447 -267 1621 -916 -1021 1620 -216 -1513 956 844
3488 844 -1578 275 1471 -1094 -555 1545 -324 -1247 1232 559 -1666 427 1305 -1321 -400 1638
3504 1638 -841 -1228 1359 95 -1621 992 1012 -1619 88 1353 -1067 -858 1883 -349 -1453 881
3520 881 486 -1647 570 1486 -1308 -501 1574 -858 -1484 1483 452 -1747 824 982 -1671 -204
3536 -204 1774 -950 -1006 1649 -96 -1633 1051 951 -1690 454 1301 -1191 -608 1846 -390 -1232 1443
3553 1443 160 -1985 645 1308 -1523 -204 1652 -935 -1198 1579 19 -1449 1143 919 -1801 -23
3569 -23 1515 -922 -699 1696 -447 -1551 1328 703 -1512 708 1346 -1446 -478 1805 -693 -854 1565
3586 1565 83 -1747 688 957 -1691 198 1603 -1045 -999 1576 -399 -1379 1477 513 -1679 460
3602 460 1109 -1373 -367 1749 -666 -1173 1368 55 -1623 973 1086 -1559 -141 1357 -1021 -767
3618 -767 1934 -26 -1490 1007 817 -1530 412 1600 -1247 -582 1544 -802 -1384 1495 484 -1660
3634 -1660 537 883 -1674 -98 1703 -692 -725 1380 -135 -1502 971 1018 -1345 145 1348 -1133
3650 -1133 -723 1560 -262 -1338 1216 294 -1693 457 1234 -1237 -271 1495 -874 -1085 1406 192
3666 192 -1274 796 815 -1687 -80 1190 -988 -641 1326 -285 -1338 779 679 -1300 493 1294
3682 1294 -1057 -431 1364 -317 -863 1231 303 -1299 493 816 -1160 -38 1239 -787 -871 1031
3698 1031 -132 -1100 881 695 -1316 264 900 -936 -328 1411 -417 -972 909 527 -1142 421
3714 421 955 -901 -139 1133 -582 -831 1144 -38 -1027 671 502 -1109 186 899 -724 -530 900
3731 900 -53 -862 800 437 -1052 147 897 -853 -271 851 -479 -690 811 -17 -1040 612 484
3748 484 -675 68 733 -449 -425 1138 -63 -703 760 286 -859 92 620 -756 -300 782 -395
3765 -395 -642 770 11 -726 595 544 -672 158 880 -515 -422 920 157 -611 570 388 -642 114
3783 114 544 -473 -257 611 -452 -576 378 192 -641 150 576 -609 53 540 -359 -394 568 -32 -549
3802 -549 450 250 -537 112 637 -285 -182 479 -146 -591 415 212 -439 120 529 -297 -222 442 -107 -292
3822 -292 438 33 -384 333 90 -371 -13 363 -274 -280 322 -96 -397 180 88 -377 197 279 -254 40 333
3843 333 -166 -370 257 54 -319 -26 109 -274 -28 107 -213 -109 183 -8 -150 143 157 -264 6 125
3863 125 -142 -36 307 -95 -122 109 -45 -210 41 -43 -88 -25 43 -46 42 108 63 -42 12 -10 25 88 13 -11 -57
3888 -57 182 -6 -36 46 -52 -16 -65 -91 -56 133 -92 -93 67 2 -55 41 17 -56 88 43 -214 46 18 33 129 -52
3914 -52 -135 -37 128 -34 -105 -14 -157 -158 42 19 -140 -57 260 176 -34 277 -69 -72 324 -17 -254 -77 187 -36
3938 -36 33 193 -141 -196 72 62 -234 8 168 -264 -57 221 -158 -126 316 -70 -259 158 49 -323 82 240
3960 240 -257 -246 240 -275 -333 397 30 -415 172 97 -415 58 408 -210 -217 265 -109 -256 174 239 -440 -4
3982 -4 282 -404 -245 450 74 -351 212 123 -311 134 474 -308 59 255 -96 -154 476 -28 -376 383 308 -393
4004 -393 51 245 -360 -170 422 -101 -420 187 212 -361 156 346 -312 17 415 -97 -439 419 -2 -457
4024 -457 149 317 -478 63 409 -346 -302 389 -35 -354 509 229 -479 263 496 -538 -158 313 -271 -347
4044 -347 449 35 -631 258 360 -502 -26 542 -282 -436 399 9 -508 219 227 -658 5 548 -422 -212 337
4065 337 -211 -369 488 218 -562 127 445 -802 -52 512 -302 -448 434 123 -496 465 387 -566 -51 554
4085 554 -461 -43 743 -81 -512 350 138 -643 -38 324 -637 -104 755 -227 -312 533 136 -412 299 220
4105 220 -707 88 707 -280 -240 638 -183 -603 338 228 -601 129 586 -653 -146 484 -265 -233 541 -2
4125 -2 -512 239 312 -536 32 718 -388 -296 528 97 -382 511 276 -560 14 498 -327 125 628 -273 -294
4146 -294 415 198 -617 436 549 -606 13 446 -425 -235 684 16 -620 242 51 -609 162 446 -404
4165 -404 -247 526 -105 -616 760 210 -434 127 243 -471 31 498 -279 -356 562 14 -470 325 457 -485
4185 -485 49 433 -548 -91 507 -28 -336 506 160 -408 231 276 -396 -62 438 -328 -205 500 107 -456
4205 -456 284 152 -508 104 501 -367 -117 512 -261 -298 595 238 -352 317 396 -579 -201 513 -145 -462 470
4226 470 -61 -716 259 152 -526 110 509 -338 -194 478 -34 -224 501 282 -542 120 335 -488 -147 427
4246 427 -241 -331 300 -96 -528 443 446 -419 -65 374 -153 -265 502 54 -501 465 156 -462 193 589 -381
4267 -381 -102 458 -416 -258 406 85 -444 -24 118 -508 -71 332 -446 -313 504 -46 -374 336 274 -375
4287 -375 -31 237 -392 -60 441 -296 -139 263 18 -368 258 214 -328 -33 339 -266 -137 457 100 -227
4307 -227 368 273 -349 70 178 -581 -124 455 -88 -241 373 67 -368 184 196 -341 -12 411 -287 -268 365
4328 365 -95 -200 308 246 -195 -84 360 -432 -131 414 14 -406 336 81 -286 155 222 -431 50 304 -221
4349 -221 -156 216 17 -266 223 36 -351 64 268 -222 111 253 -182 -220 253 146 -203 102 -39 -139 121
4370 121 376 -154 -244 172 -30 -372 2 62 -206 -120 117 -284 -167 141 26 -216 44 50 -228 114 93 -216
4392 -216 -14 147 -274 -173 236 54 -194 -44 123 -148 45 138 -106 -213 219 102 -197 206 129 -273 -5
4413 -5 171 -8 -66 111 -60 -89 -19 -134 -217 45 -17 -200 55 150 -168 141 134 -7 -64 130 239 -105 -82 109
4437 109 -13 -45 103 -94 -262 90 -35 -117 -32 108 -130 14 42 -208 -42 -41 66 -71 23 116 -136 114 -158
4460 -158 1 -42 131 25 -22 109 2 -63 -13 -53 -119 -92 -159 -60 56 214 -66 62 8 -14 50 227 96 60
4484 60 -35 75 -58 79 -6 -52 91 17 -90 -71 -130 -140 -33 125 25 53 153 -11 -71 -205 151 88 53 121
4508 121 -60 41 75 -181 -57 -15 114 30 -15 -192 -53 187 18 -128 109 53 34 66 55 -11 -188 133 80
4531 80 48 71 109 62 -90 35 -136 -33 13 -73 -151 104 -5 -148 130 219 -66 -122 21 -62 -164 198 93 -79
4555 -79 30 157 -84 -253 -9 -201 -135 82 -62 -223 67 84 -57 -122 47 -96 -95 139 -51 -287 98 52
4577 52 -217 -41 -43 -290 -109 182 -60 -109 448 -41 -207 161 101 -266 76 122 -137 -14 286 59 -164 199
4599 199 -88 -193 30 171 -203 -89 399 -60 -191 244 121 -467 179 70 -201 -72 141 -248 -260 353
4619 353 -128 -234 217 172 -312 206 235 -252 -113 281 -90 -296 378 99 -299 81 96 -448 77 307 -169
4640 -169 -14 293 -144 -225 208 67 -336 -109 259 -279 -110 382 -180 30 274 26 -361 102 384 -332
4660 -332 -4 179 -214 -251 279 -134 -475 242 205 -448 -146 418 -198 -65 471 -183 -336 314 -2 -438 199
4681 199 331 -306 -179 242 -155 -273 285 -54 -465 275 121 -529 116 305 -198 -244 271 5 -392 400
4701 400 267 -287 118 375 -457 -125 419 -121 -371 348 15 -344 269 242 -650 -140 232 -273 -51 501
4721 501 34 -401 185 152 -309 74 560 -364 -173 432 30 -283 245 -99 -428 193 201 -321 -28 294 -103
4742 -103 -313 395 -221 -421 316 258 -485 56 274 -307 -112 363 -63 -362 390 145 -337 208 406 -290
4762 -290 -59 339 -235 -336 349 5 -362 251 341 -464 -9 327 -398 -291 435 -111 -427 246 211 -445 213
4783 213 392 -304 -193 441 -293 -373 424 100 -363 192 284 -319 79 329 -241 -239 396 -20 -362 331 296 -518
4805 -518 96 372 -160 -74 450 -219 -320 455 -28 -338 360 65 -411 64 325 -365 2 521 -139 -493
4825 -493 285 235 -536 211 480 -251 81 325 -349 -318 377 55 -522 210 246 -588 92 320 -346 -115 454
4846 454 -198 -218 202 164 -225 49 264 -379 -165 448 -74 -431 153 57 -446 267 266 -349 -1 251 -222 -354
4868 -354 345 -17 -425 269 271 -509 13 422 -367 -17 539 -29 -384 442 61 -418 142 248 -180 -53 310
4889 310 -341 -325 333 9 -414 61 153 -350 -45 448 -223 -83 258 -195 -184 291 94 -212 116 50 -303
4910 -303 -204 378 -62 -315 332 103 -279 213 294 -401 4 440 -225 -177 192 -146 -297 310 170 -328 142
4931 142 288 -449 -142 310 -255 -219 288 101 -391 228 278 -113 -79 308 -146 -146 217 -23 -398 116 233 -309
4953 -309 76 251 -167 -19 295 -18 -67 143 180 -234 213 342 -233 -282 406 -176 -67 185 33 -104 139
4974 139 178 -290 104 277 -121 -117 158 -171 -217 304 115 -133 -84 152 -157 -161 357 -19 -65 27 81 -240 148
4997 148 91 -61 -138 260 -151 1 242 14 -353 161 58 -136 173 178 -216 -178 276 4 -73 69 -29 -301
5019 -301 196 5 -255 24 232 -127 -178 253 -35 -247 158 9 -233 -163 219 -70 134 187 44 -134 248
5040 248 121 -288 -37 208 -116 23 63 -138 -235 57 188 90 24 39 -104 -103 -5 -31 -7 59 16 -78 97 71 -99
5065 -99 -23 -37 -34 37 -90 -87 84 49 -6 70 31 -3 -10 63 70 -130 -76 94 -12 70 49 22 81 -2 -93 145 -83 105
5093 105 75 165 -56 -62 65 -151 -62 -94 -28 -198 -49 -194 -240 -33 38 48 -10 70 -37 -161 28 -82 -203 163
5117 163 193 -66 -12 237 3 -4 -76 96 -264 76 -51 31 8 37 40 -109 59 133 -100 76 59 -104 56 150
5141 150 -173 -148 207 -46 -23 121 46 -316 -40 -2 -220 -78 347 -55 -38 183 14 -270 -18 71 -196 25
5163 25 219 -157 -217 202 -183 -59 227 -100 -345 75 219 -351 -13 246 -98 -216 283 -114 -224 123 262
5184 262 -248 -29 230 -240 -133 192 -33 -105 268 -78 -265 -18 214 -209 -91 305 -212 -89 365 58
5204 58 -264 120 52 -371 -91 334 -241 -147 221 -147 -172 212 69 -447 115 358 -179 -190 434 3 -81 368
5226 368 -63 -248 179 211 -284 -169 237 -125 -77 414 16 -421 105 211 -473 103 188 -279 -111 418 -230
5247 -230 -264 464 175 -385 202 215 -478 -128 323 -129 -164 447 -158 -541 254 280 -427 -116 343 -189 -206 394
5269 394 -132 -324 343 264 -252 195 364 -315 -81 404 -76 -317 407 47 -262 190 261 -388 60 341 -318
5290 -318 -308 285 -92 -328 264 -18 -489 -11 450 -430 -155 334 -196 -286 287 95 -560 176 438 -347 -63
5311 -63 560 -232 -322 429 39 -592 319 454 -283 78 319 -335 -233 588 10 -420 314 277 -365 160 342
5332 342 -405 -12 425 -197 -242 352 49 -345 348 177 -536 -66 403 -334 -219 569 -72 -496 406 252
5352 252 -548 64 650 -487 -210 389 -184 -418 532 88 -527 148 256 -470 130 442 -333 -326 440 -153
5372 -153 -320 474 237 -500 101 399 -413 -264 490 43 -333 599 -71 -413 171 511 -354 -165 468 -213
5392 -213 -227 473 112 -568 269 357 -213 -19 339 -444 -343 411 -171 -337 438 229 -281 94 468 -358 -263
5413 -263 457 -155 -341 632 109 -472 240 381 -360 28 627 -275 -254 478 16 -443 418 137 -394 120
5433 120 227 -496 -117 487 -58 -505 410 160 -337 237 240 -383 -151 417 -185 -283 544 -58 -435 178 242
5454 242 -619 12 553 -449 -104 352 -247 -198 375 163 -371 207 212 -356 -11 465 -281 -389 407 -49 -201
5475 -201 236 198 -357 -57 150 -203 -59 444 11 -128 396 178 -447 108 349 -270 -69 473 -145 -418
5495 -418 264 44 -343 173 349 -381 65 247 -78 -192 330 68 -269 147 172 -337 -36 263 -274 -233 315
5516 315 -207 -280 138 -52 -416 256 238 -302 -51 284 -215 -188 372 -7 -314 247 338 -310 20 333 -246
5537 -246 -131 391 -17 -252 223 133 -223 -9 205 -190 -162 349 -63 -226 194 21 -230 118 70 -273 -35
5558 -35 278 -376 -215 273 -114 -220 160 -24 -249 105 241 -152 -41 107 59 -34 163 134 -196 128 61 -206
5580 -206 3 305 -100 -74 375 -24 -125 46 129 -248 29 284 -82 -95 260 -142 -211 96 -167 -108 49 148
5602 148 -114 5 82 30 -78 78 -46 -75 200 76 -8 44 6 -28 49 81 -207 -12 216 33 -219 88 114
5625 114 -144 -15 69 93 -6 -86 10 116 -65 122 -25 101 71 -60 -239 173 -134 83 46 -36 2 65 68 -99
5649 -99 -15 127 -133 -124 -33 104 -30 -38 -44 1 -72 68 32 -65 -107 2 41 -84 56 -31 53 42 30 -39 -12 184 73
5676 73 45 55 198 -18 -46 147 -68 129 -245 52 -11 23 281 -108 38 26 -34 -80 -23 -98 -110 66 215 -104
5700 -104 26 29 -8 -22 133 68 -109 120 25 -177 45 126 -31 31 152 22 137 -50 -102 -94 -63 78 -210 -29
5724 -29 195 -36 -137 129 -41 -254 8 100 14 -106 159 -91 -62 14 84 -185 -192 -177 -242 -50 -7 -180 -172 163
5748 163 -102 -198 78 147 -217 53 274 -256 -140 80 -89 -278 98 32 -149 104 97 -271 -68 244 -48 -159
5770 -159 117 0 -220 250 0 -147 16 329 -107 -219 367 -64 -356 317 29 -271 112 53 -110 -5
5790 -5 253 -70 -232 234 -47 -286 161 251 -173 -101 302 -192 110 341 -120 -185 206 84 -328 101 71 -253
5812 -253 -182 363 36 -125 381 42 -329 134 151 -274 -141 298 -200 -102 137 6 -239 324 207 -393 114
5833 114 276 -184 -144 348 -1 -240 261 -18 -330 191 436 -149 44 430 -278 -102 409 -10 -367 276
5853 276 263 -308 50 159 -446 -123 194 -195 -307 267 365 -227 225 294 -367 -148 308 -121 -345 286 159
5874 159 -548 55 221 -322 106 287 -146 -154 341 -13 -283 127 141 -387 8 252 -137 -138 225 -165 -492 224
5896 224 -57 -213 327 286 -322 -79 477 -152 -415 506 -77 -310 132 125 -442 79 390 -309 -117 483 53
5917 53 -127 291 247 -325 24 190 -385 -57 476 -254 -153 425 20 -310 76 352 -444 -61 318 -250 -209
5938 -209 308 -29 -322 234 192 -497 201 362 -257 -8 547 -75 -204 332 98 -339 162 414 -463 -57
5958 -57 301 -245 -393 304 -28 -459 370 259 -404 91 286 -306 -95 324 -163 -199 479 74 -421 45 309
5979 309 -471 -285 524 -146 -385 396 16 -341 275 107 -364 2 337 -295 111 442 18 -251 206 150
5999 150 -337 -85 248 -189 -92 208 -83 -315 155 31 -362 -10 335 -367 102 247 -103 -366 292 114
6019 114 -321 305 55 -331 -47 292 -235 -21 388 -138 -374 419 22 -356 -47 283 -310 -331 403 -85
6039 -85 -256 436 64 -394 122 199 -408 -20 202 -409 -118 296 -153 -395 174 237 -122 -150 293 -317 -151
6060 -151 342 -144 -58 95 -109 -219 118 88 -132 87 158 -149 -94 246 -161 -327 169 171 -409 -27 169 -148
6082 -148 -82 356 -10 -223 159 -90 -314 215 266 -365 8 285 -214 -110 261 -8 -239 213 161 -272 63
6103 63 169 -149 -143 223 -6 -231 253 58 -286 59 25 -92 115 147 -131 -17 282 1 -302 142 178 -267
6125 -267 -76 165 -304 -3 341 41 -202 73 92 -377 -11 -60 -260 -128 129 -123 -230 254 -58 -262 61
6146 61 155 -226 45 265 16 -320 20 -39 -147 228 94 -182 13 52 -220 -232 177 -55 -349 98 79 -37
6168 -37 -69 210 -11 77 186 -94 -5 211 79 -109 46 -40 -251 24 135 -25 -128 182 -11 -145 56 -101
6190 -101 -130 86 174 -218 22 6 -9 -138 19 0 -123 -51 -112 -133 7 191 -78 -53 105 -21 97 134 -95
6213 -95 -28 25 170 -19 -85 113 31 76 124 -11 -217 -25 -15 -146 69 -60 -32 -44 -42 122 -18 86 8 -175
6237 -175 12 -100 -18 -114 -66 58 -171 -49 -133 93 121 -57 -126 44 24 52 18 58 49 -53 -20 -66 -32 5 -12 -25
6263 -25 -4 -26 -10 -38 8 11 92 -28 25 77 -35 96 -146 -11 -30 20 175 -84 -82 14 -31 -102 -78 -27 -186 -100 102
6290 102 -69 -59 -16 118 -75 92 146 -44 -130 -55 50 68 -91 -93 -131 177 -112 -79 105 47 -172 26 -102 -145
6314 -145 -41 219 -75 -175 41 -18 -124 -48 7 -205 -90 148 -109 -104 136 -16 -84 -85 69 -105 -100 -64 66 -118
6338 -118 106 -120 -211 132 0 -144 1 170 -159 -1 80 -98 -84 237 13 -188 91 -29 -179 -15 124
6359 124 -125 -32 116 46 -145 102 -50 -246 26 356 16 -69 147 -174 -219 -95 -123 -156 249 108 -192 -30
6381 -30 130 -16 -266 357 72 -115 123 167 -175 -131 386 -142 -35 346 -218 -275 306 95 -216 172 328
6402 328 -93 -53 158 -44 -129 169 61 -328 97 181 -237 61 245 -44 -65 158 -41 -226 81 195 -250
6423 -250 27 250 -198 -174 214 2 -73 186 134 -198 -11 172 -258 54 217 -123 -304 228 -15 -173 256
6444 256 148 -261 -137 237 -186 -113 171 -124 -24 192 91 -220 25 178 -242 -42 314 -54 -185 259
6464 259 259 -375 182 175 -411 45 210 -175 -9 224 -109 -348 125 -32 -131 17 195 -181 -233 290 -202 -144
6486 -144 203 87 -334 107 276 -122 -14 247 -80 -355 235 10 -261 218 68 -241 35 196 -170 -180
6506 -180 214 -98 -177 206 5 -270 -12 56 -68 44 128 -59 -23 143 3 -324 67 145 -149 -76 335 -179
6528 -179 -203 305 -38 -219 351 143 -350 47 204 -224 24 169 -166 -55 269 -93 -225 241 36 -283
6548 -283 91 297 -190 -142 402 145 -142 163 147 -183 36 188 -108 -226 486 -153 -270 272 166 -283 103
6569 103 233 -181 -258 229 -168 -206 242 5 -363 223 270 -201 30 214 -124 51 310 4 -200 87 -31
6590 -31 -254 66 226 -131 -201 308 -63 -90 374 104 -333 220 85 -367 73 263 -220 -55 53 -106 -215
6611 -215 44 49 -209 136 157 -167 -142 136 -62 -18 128 174 -155 6 81 7 53 154 -104 -74 137 -55 -87 23
6635 23 75 -274 70 279 -164 -85 172 -61 -397 127 155 -255 67 188 -130 -107 199 -191 20 103 83 -184
6657 -184 182 -42 -77 9 18 -209 -21 223 -101 -115 141 59 -210 144 166 -77 -14 280 -81 -86 132 4 -190
6680 -190 207 177 -178 39 95 -121 -184 155 117 -103 172 138 -218 100 112 -50 25 155 -216 -265 146 12 -145
6703 -145 -219 88 -114 13 199 -6 -18 157 -123 -143 143 87 -265 65 97 -34 51 216 -45 -69 -19 -26 87
6726 87 84 198 -149 63 271 -144 -159 197 52 -141 102 103 -165 156 195 -160 -85 109 -111 28 136 -27 -68
6749 -68 -44 83 -59 -134 192 -42 -29 96 95 -202 4 55 19 61 72 -128 119 235 10 35 133 22 -115 80
6773 80 23 -83 49 64 -57 -164 -28 -70 -52 102 -9 -8 -68 45 43 58 179 71 39 -52 23 65 53 102 -222 -123
6799 -123 163 -37 2 56 40 37 -82 -84 -75 -73 107 48 -126 9 -8 -53 22 -26 75 -3 40 -132 -24 70 84 45 58
6826 58 2 -24 100 52 -2 -86 78 12 126 1 -122 -103 -96 -69 59 27 34 21 -140 28 -66 -85 43 35 -65 -115 18
6853 18 -204 21 -44 -39 -19 73 11 -216 29 90 -14 76 79 25 58 -63 84 53 -115 100 66 34 -77 39 43 8
6879 8 -110 121 38 12 37 -190 -82 0 42 -5 -25 95 -90 4 140 11 -206 116 12 -105 35 -34 -45 -70
6903 -70 -136 -217 -47 85 86 58 19 32 -203 136 81 -36 54 -39 65 35 97 -66 45 7 21 -44 39 -11 26 80 102
6930 102 53 -49 25 -95 -182 108 87 -185 133 97 -59 9 159 -46 -83 178 30 12 -90 105 -160 -182 85
6953 85 5 -89 28 -44 -3 -121 18 -128 -67 236 -193 -171 183 -51 -52 98 80 -68 -100 76 -118 -84 367 4
6977 4 -117 -76 49 -226 -84 99 -114 -8 62 -227 -72 180 77 -91 125 -2 -17 41 98 -179 -201 66 205
7000 205 -278 -70 84 45 -37 206 -91 -20 92 19 -138 32 43 -179 77 85 43 -8 41 -33 -99 205 30 -130
7024 -130 98 88 -163 -86 138 -179 -87 135 -87 -229 212 61 -82 -21 139 -164 54 190 29 -64 31 -71
7046 -71 -90 76 -39 -74 -144 122 -170 45 17 -56 -274 -38 94 -92 195 31 -125 111 64 -108 -58 147 170
7069 170 -95 175 91 -79 -158 150 -137 56 228 -117 39 283 187 -20 -62 -65 -120 -143 227 -152 -85 183 -72
7092 -72 -187 -23 134 -290 -3 280 -92 7 232 -46 -104 162 237 -95 19 213 -57 56 178 -70 -94 156
7114 156 -133 -176 78 76 -190 -257 359 13 -226 138 23 -149 28 172 -170 130 290 -149 -144 136 -75 -152
7136 -152 18 14 -177 98 76 -185 85 -14 -26 -90 143 20 -187 108 86 -212 22 139 -222 -44 49 -34 -47
7159 -47 30 28 -247 -72 32 18 -2 -86 -95 -154 0 65 -32 -2 228 -292 95 125 -164 -118 106 54 -275 169 90 -110
7185 -110 86 214 -211 -57 239 -95 -120 123 -231 -175 71 69 -131 155 246 -127 -79 149 90 -379 179 4
7207 4 -259 187 202 -132 -138 54 88 -98 161 -7 -156 66 -8 14 1 241 -201 -9 210 156 -73 69 56 -104
7231 -104 52 119 -59 -136 58 -120 -22 53 27 -29 -57 20 -47 128 99 -29 -39 154 -61 -101 -16 -50 -152 90 35
7256 35 -33 5 107 -72 -164 78 32 -19 -3 89 -279 99 106 -59 -203 -4 50 -150 9 24 -115 -18 114 -123
7280 -123 -117 35 19 -161 -31 -35 -282 40 160 -284 -108 190 -159 -101 132 -36 -29 -14 30 -111 150 83 73 -122
7304 -122 143 -160 151 -45 -12 -38 113 178 -148 -111 -25 5 -172 15 -92 -11 30 227 -60 -168 -126 -1 -31
7327 -31 217 63 -15 -51 0 -68 -118 -157 -35 -42 -53 73 -53 -50 -141 27 20 -136 -141 -107 4 -10 12 115 165 -98 -37
7354 -37 32 -92 60 54 82 -130 43 -101 -128 43 117 -125 78 94 -87 69 176 52 78 107 0 107 70 28
7378 28 -41 146 -3 -58 -138 -14 173 -215 -6 -58 86 -92 121 90 38 228 -15 -96 168 -124 -110 156 -46
7401 -46 -62 47 -186 -28 -14 65 78 -41 21 8 58 137 15 115 37 169 -131 10 69 96 -55 148 15 -122
7425 -122 90 -30 67 73 64 38 7 34 129 36 20 3 25 48 21 -25 -102 -186 -63 -46 115 89 64 68 28 -99 -196 -6
7453 -6 -53 -42 -82 33 77 74 -78 72 44 96 -33 82 -36 13 -7 -239 -59 -133 133 -5 -72 -104 -134 42 -130
7478 -130 33 85 94 -27 -45 18 13 72 81 75 -130 -133 -19 -21 124 -108 75 -61 -57 105 -18 21 45 22 -43 -10 4 -109
7506 -109 4 50 48 58 76 -52 -90 -101 -162 -143 132 91 -140 56 -116 61 85 -14 44 189 -37 -14 116 137 111
7531 111 3 -71 238 -208 71 -138 5 -29 -117 7 37 31 76 -91 -14 33 -146 11 257 -79 -229 137 125
7554 125 -127 -35 -21 -40 -163 23 107 -4 160 -20 -1 57 136 -181 -14 68 -47 -124 95 -147 -74 95 0 -15
7578 -15 -136 141 -132 -52 189 -190 -87 -23 96 31 -43 -111 -199 -28 106 -133 131 129 -20 -9 73 20 -86 -106
7602 -106 186 -160 -64 111 144 -98 132 51 -73 35 -119 -125 -17 278 -127 -79 242 257 -179 85 18 -74 -2
7625 -2 310 98 -52 77 5 36 38 67 -69 -115 182 -96 -30 146 -12 -91 23 91 -72 82 132 -184 -39 131
7649 131 44 -36 239 224 -255 157 -27 -274 17 65 -95 -59 70 -111 -99 155 115 -119 -18 87 -101 -130 19
7672 19 -92 -69 -30 71 -271 -73 222 -96 -98 189 -98 -119 164 -77 -159 175 -24 -63 137 167 93 -62 225
7695 225 -139 -225 190 1 -185 -108 7 -130 -44 186 -131 -43 34 -39 115 61 102 8 75 -29 -110 -4 108 8
7719 8 -194 128 83 -11 -19 241 -55 -73 -94 91 -33 70 82 -163 -19 87 -116 -84 79 -158 122 122 -48 -218
7743 -218 101 122 -113 -54 225 -138 94 52 -104 -19 115 126 -313 -68 -4 -100 37 136 -81 -135 78 -53 -78
7766 -78 19 63 -240 74 132 -107 -49 79 -22 -191 162 216 -31 -18 188 -336 125 148 -133 9 -14 50 -15 157
7790 157 65 -154 31 59 154 -36 -35 -38 27 -18 -255 -48 -57 49 -90 92 -94 12 -26 248 -13 -38 40 148 -88
7815 -88 99 38 -8 -69 -29 40 76 -44 5 -84 117 -11 -41 69 30 -132 36 98 9 -19 104 90 -122 116 122 -211
7841 -211 -130 133 -29 -143 -28 39 29 -184 -1 8 -41 104 -94 14 227 17 -173 76 85 44 152 370 -119
7864 -119 -60 155 -39 -231 19 107 -85 105 -21 -77 -199 45 -94 -190 -5 13 -122 -96 -83 -2 96 -66 75
7887 75 160 16 8 51 182 21 -177 113 217 -79 -25 233 40 86 55 101 -277 155 46 -259 -7 205 -20
7910 -20 1 66 -40 -25 14 -69 5 74 -50 -112 -16 8 -26 -45 150 -53 -185 8 -12 -72 18 145 -24 -96 -128 93
7936 93 -64 -49 133 -134 105 113 20 9 77 19 83 -94 100 161 111 74 33 -117 71 120 -89 -34 65 -101 148
7961 148 53 -104 -63 76 142 82 109 -48 -6 83 -10 -218 -22 122 -103 166 54 76 -26 57 -6 -38 -141 37
7985 37 -4 -113 -62 -82 -71 -22 49 -82 -1 177 91 19 -92 -29 29 143 -66 43 -44 -109 -132 12 139 -118 36
8010 36 -56 57 75 16 -26 -9 -89 110 8 144 44 48 -56 -39 75 61 210 128 79 -42 -57 -64 44 52 175 -103
8036 -103 -224 -64 -75 2 -27 -96 45 -168 48 -154 90 122 19 -117 -53 -72 -75 -46 150 38 8 106 147 -57
8060 -57 33 37 -109 -105 -39 80 -90 -106 9 -45 -6 84 -66 163 144 142 131 215 127 104 27 36 -20 -46 146 58 -8 -91 65
8089 65 -86 -30 100 -90 148 134 -115 -71 89 -104 41 91 -81 -73 -29 91 133 -31 178 -188 -50 100 -25
8112 -25 -63 183 158 -182 2 21 84 -100 51 -19 -27 -103 189 -68 122 141 -153 50 51 5 -146 124 8 -36 149
8137 149 9 9 6 42 -86 -85 102 15 19 178 97 -21 43 41 -196 -12 95 -28 -145 233 218 -128 14 -9 -157
8162 -157 39 175 -116 -92 6 92 -69 3 -7 -91 -40 3 -138 -92 89 -47 -69 -32 27 -72 128 -2 -109 -10 -10
8187 -10 -83 -120 2 122
8191A22
##END NTUPLES=NMR FID
##END=
