##TITLE=1H_Pr 4-AMeB
 CDCl3,8 sc, 
 10.03.2021
##JCAMPDX= 6.0         $$ Bruker NMR JCAMP-DX V2.0
##DATA TYPE= NMR FID
##DATA CLASS= NTUPLES
##ORIGIN= UXNMR, Bruker Analytische Messtechnik GmbH
##OWNER= root
$$ XWIN-NMR		Version 3.5
$$ Wed Mar 10 10:35:41 2021 Russian Standard Time (UT+4h)  she@DPX200
##.OBSERVE FREQUENCY= 200.131506
##.OBSERVE NUCLEUS= ^1H
##.DELAY= (6, 6)
##.ACQUISITION MODE= SIMULTANEOUS
##.ACQUISITION SCHEME= undefined
##.AVERAGES= 8
##.DIGITISER RES= 18
##SPECTROMETER/DATA SYSTEM= spect
##.PULSE SEQUENCE= zg30
##.SOLVENT NAME= CDCl3
##.SHIFT REFERENCE= (INTERNAL, CDCl3, 0, 15.7039)
##AUDIT TRAIL= $$ (NUMBER, WHEN, WHO, WHERE, WHAT)
$$ ##TITLE= Audit trail, XWIN-NMR		Version 3.5
$$ ##JCAMPDX= 5.01
$$ ##ORIGIN= Bruker BioSpin GmbH
$$ ##OWNER= she
$$ F:/spectra/data/she/nmr/H-F/1/audita.txt
$$ ##AUDIT TRAIL=  $$ (NUMBER, WHEN, WHO, WHERE, WHAT)
(   1,<2021-03-10 10:34:23.84 +0400>,<she>,<DPX200>,
      <created by zg, POWCHK disabled, PULCHK disabled
       configuration hash MD5:
       00 E9 B6 7A A2 85 ED C7 34 08 36 98 17 FE 4E 26
       data hash MD5: 16K
       22 4A F1 94 EE D2 48 3F 90 49 E3 37 92 F2 06 A7>)
$$ ##END=
$$ 
$$ hash MD5
$$ 9B 47 50 45 E3 B1 10 78 29 5E F1 E1 92 DF 1D 36
##$RELAX= 
##$RELAX= 
##$RELAX= 
##$RELAX= 
##$RELAX= 
##$RELAX= 
$$ Bruker specific parameters
$$ --------------------------
##$DU= <F:/spectra>
##$EXPNO= 1
##$NAME= <H-F>
##$PROCNO= 1
##$TYPE= <nmr>
##$USER= <she>
##$AMP= (0..31)
100 100 100 100 100 100 100 100 100 100 100 100 100 100 100 100 100 100 
100 100 100 100 100 100 100 100 100 100 100 100 100 100 
##$AQSEQ= 0
##$AQ_mod= 1
##$AUNM= <au_zg>
##$AUTOPOS= <>
##$BF1= 200.13
##$BF2= 200.13
##$BF3= 200.13
##$BF4= 200.13
##$BF5= 200.13
##$BF6= 200.13
##$BF7= 200.13
##$BF8= 200.13
##$BYTORDA= 1
##$CFDGTYP= 0
##$CFRGTYP= 5
##$CHEMSTR= <none>
##$CNST= (0..31)
1 1 145 1 1 1 1 1 1 1 1 1 1 1 1 1 1 1 1 1 1 1 1 1 1 1 1 1 1 1 1 1 
##$CPDPRG= <>
##$CPDPRG1= <>
##$CPDPRG2= <>
##$CPDPRG3= <>
##$CPDPRG4= <mlev>
##$CPDPRG5= <mlev>
##$CPDPRG6= <mlev>
##$CPDPRG7= <mlev>
##$CPDPRG8= <mlev>
##$CPDPRGB= <>
##$CPDPRGT= <>
##$D= (0..31)
0 1.2 0 0 0 0 0 0 0 0.06 0 0.03 0 0 0 0 0.0002 0 0 0 0 0 0 0 0 0 0 0 0 
0 0 0 
##$DATE= 1615358063
##$DBL= (0..7)
120 120 120 120 120 120 120 120 
##$DBP= (0..7)
150 150 150 150 150 150 150 150 
##$DBP07= 0
##$DBPNAM0= <>
##$DBPNAM1= <>
##$DBPNAM2= <>
##$DBPNAM3= <>
##$DBPNAM4= <>
##$DBPNAM5= <>
##$DBPNAM6= <>
##$DBPNAM7= <>
##$DBPOAL= (0..7)
0.5 0.5 0.5 0.5 0.5 0.5 0.5 0.5 
##$DBPOFFS= (0..7)
0 0 0 0 0 0 0 0 
##$DE= 6
##$DECBNUC= <off>
##$DECIM= 32
##$DECNUC= <off>
##$DECSTAT= 4
##$DIGMOD= 1
##$DIGTYP= 9
##$DL= (0..7)
0 120 120 120 120 120 120 120 
##$DP= (0..7)
150 150 150 150 150 150 150 150 
##$DP07= 0
##$DPNAME0= <>
##$DPNAME1= <>
##$DPNAME2= <>
##$DPNAME3= <>
##$DPNAME4= <>
##$DPNAME5= <>
##$DPNAME6= <>
##$DPNAME7= <>
##$DPOAL= (0..7)
0.5 0.5 0.5 0.5 0.5 0.5 0.5 0.5 
##$DPOFFS= (0..7)
0 0 0 0 0 0 0 0 
##$DQDMODE= 0
##$DR= 18
##$DS= 0
##$DSLIST= <SSSSSSSSSSSSSSS>
$$ [...]
##$SUBNAM2= <"">
##$SUBNAM3= <"">
##$SUBNAM4= <"">
##$SUBNAM5= <"">
##$SUBNAM6= <"">
##$SUBNAM7= <"">
##$SUBNAM8= <"">
##$SUBNAM9= <"">
##$SW= 16.9725357007746
##$SWIBOX= (0..15)
0 0 2 0 0 0 0 0 0 0 0 0 0 0 0 0 
##$SW_h= 3396.73913043478
##$TD= 16384
##$TD0= 1
##$TE= 0
##$TE2= 300
##$TE3= 300
##$TEG= 300
##$TL= (0..7)
0 120 120 120 120 120 120 120 
##$TP= (0..7)
150 150 150 150 150 150 150 150 
##$TP07= 0
##$TPNAME0= <>
##$TPNAME1= <>
##$TPNAME2= <>
##$TPNAME3= <>
##$TPNAME4= <>
##$TPNAME5= <>
##$TPNAME6= <>
##$TPNAME7= <>
##$TPOAL= (0..7)
0.5 0.5 0.5 0.5 0.5 0.5 0.5 0.5 
##$TPOFFS= (0..7)
0 0 0 0 0 0 0 0 
##$TUNHIN= 0
##$TUNHOUT= 0
##$TUNXOUT= 0
##$USERA1= <user>
##$USERA2= <user>
##$USERA3= <user>
##$USERA4= <user>
##$USERA5= <user>
##$V9= 5
##$VALIST= <valist>
##$VCLIST= <CCCCCCCCCCCCCCC>
##$VD= 0
##$VDLIST= <DDDDDDDDDDDDDDD>
##$VPLIST= <PPPPPPPPPPPPPPP>
##$VTLIST= <TTTTTTTTTTTTTTT>
##$WBST= 1024
##$WBSW= 4
##$XGAIN= (0..3)
0 0 0 0 
##$XL= 0
##$YL= 0
##$YMAX_a= 186022
##$YMIN_a= -139576
##$ZGOPTNS= <>
##$ZL1= 120
##$ZL2= 120
##$ZL3= 120
##$ZL4= 120
##$ABSF1= 10
##$ABSF2= 0
##$ABSG= 5
##$ABSL= 3
##$ALPHA= 0
##$AQORDER= 0
##$ASSFAC= 0
##$ASSFACI= 0
##$ASSFACX= 0
##$ASSWID= 0
##$AUNMP= <proc_1d>
##$AZFE= 0.1
##$AZFW= 0.1
##$BCFW= 1
##$BC_mod= 2
##$BYTORDP= 1
##$COROFFS= 0
##$CY= 11.3945322036743
##$DATMOD= 1
##$DC= 2
##$DFILT= <>
##$DTYPP= 0
##$F1P= 15.9154993809931
##$F2P= -4.1035820241983
##$FCOR= 0.5
##$FTSIZE= 0
##$FT_mod= 4
##$GAMMA= 1
##$GB= 0.15
##$INTBC= 1
##$INTSCL= 1
##$ISEN= 128
##$LB= 0.24
##$LEV0= 0
##$LPBIN= 0
##$MAXI= 10000
##$MC2= 0
##$MEAN= 0
##$ME_mod= 0
##$MI= 1.114404
##$NCOEF= 0
##$NC_proc= 0
##$NLEV= 6
##$NOISF1= 3.799351
##$NOISF2= 2.8
##$NSP= 1
##$NTH_PI= 0
##$NZP= 0
##$OFFSET= 15.70392
##$PC= 1
##$PHC0= -11118.14
##$PHC1= 10.20094
##$PH_mod= 1
##$PKNL= yes
##$PPARMOD= 0
##$PSCAL= 0
##$PSIGN= 0
##$REVERSE= no
##$SF= 200.130013532006
##$SI= 16384
##$SIGF1= 3
##$SIGF2= 2
##$SINO= 400
##$SIOLD= 16384
##$SREGLST= <1H.CDCl3>
##$SSB= 0
##$STSI= 0
##$STSR= 0
##$SW_p= 3612.71676300578
##$SYMM= 0
##$S_DEV= 0
##$TDeff= 0
##$TDoff= 0
##$TI= <>
##$TILT= no
##$TM1= 0
##$TM2= 0
##$TOPLEV= 0
##$USERP1= <user>
##$USERP2= <user>
##$USERP3= <user>
##$USERP4= <user>
##$USERP5= <user>
##$WDW= 1
##$XDIM= 8192
##$YMAX_p= 0
##$YMIN_p= 0
$$ End of Bruker specific parameters
$$ ---------------------------------
##NTUPLES= NMR FID
##VAR_NAME=  TIME,          FID/REAL,        FID/IMAG
##SYMBOL=    X,             R,               I
##VAR_TYPE=  INDEPENDENT,   DEPENDENT,       DEPENDENT
##VAR_FORM=  AFFN,          ASDF,            ASDF
##VAR_DIM=   8192,          8192,            8192
##UNITS=     SECONDS,       ARBITRARY UNITS, ARBITRARY UNITS
##FACTOR=    0.0002944,     1,               1
##FIRST=     0,             0,               0
##LAST=      2.4114304,     0,               0
##MIN=       0,             -139576,         0
##MAX=       2.4114304,     186022,          0
$$ Real data points
##PAGE= N=1
##DATA TABLE= (X++(R..R)), XYDATA
0@%%%%%%%%%%%%%%qJ6j6J6j6K4l2L3m1M8n6P2q1Q9j04J20j37J60j83K07k33K60
36A38k93L30l68M10m58N09n64O24o90P63q44R29j023J128j244J371j509J664j839
55i66K036k260K518k816L167l589M103m749N592o738Q393j1000J5739k7033J02778
70H5175J00847j51016O5568P0579j28263p1307J23056l2514j03223R7664R3943
81A50509j10058n110J17164p1860j21754P5872J8854j35164J1986J16707o6171
92a9025n7180J17204K1288j20166L5664Q0218j03183n2829J09888n907r3413Q1455
104e986Q7709q6596r862J12336l6308r7224P8345M3952j05670J1272J08439m7657
116E2750o4292R9899K3829j07670K1544Q0185q4683n9066R5435m527r6179N1928
$$ plain form
0 0 0 0 0 0 0 0 0 0 0 0 0 0 0 0 -8 8 -8 8 -8 16 -16 17 -24 24 -32 40 -41 48 -56 64 -73 87 -96 111 -122 138
36 138 -155 175 -193 217 -241 268 -296 328 -362 401 -443 486 -537 591 -653 718 -791 873 -966
55 -966 1070 -1190 1328 -1488 1679 -1910 2193 -2556 3036 -3702 4691 -6309 9430 -17603 85175
70 85175 186022 35006 100574 171153 42890 -28417 94639 62125 -41098 56566 150509
81 150509 40451 35341 152505 80645 -41109 34763 53617 -81547 -69561 47146 -19025
92 -19025 -76205 40999 62287 -57879 -22215 58003 -45180 -98009 11879 5972 -87441 -5986
104 -5986 81723 -4873 -14735 97601 61293 -35931 42414 86366 -19304 -8032 100407 52750
116 52750 -11542 88357 112186 4516 26060 106245 21562 -37504 57931 53404 -42775 9153
128I153P3821q6121k9001R5187l0955r2096O0061M7668r4952j794R7053m0168
140G856o4109Q1573L1465r2718J7523Q0099o1053n1136Q6023J1338q5077M3154
152D938P1575o9049k9922Q6081j4761q2162N1695M9648p9958j1257Q7162l1671
164C2319o7560O8161L1175q4676N651P5916n1676n4883P4711J3493q1317K7594
176a1092O8912o2429l5862P7461p131p7542M1424N2172p1225j5907P7718k2210
188A4289o5329N6020L6340p6158J066P0600l9032n2654O4631J9544p2820J9726
200b3777O4123m9521l7457P0024J450o9855L4238N2215n8568k0719P2324j3758
212B0719o1575M7198L8934o5925n678O8723l1346n2253N6133K3764o8346J1279
$$ plain form
128 9153 82974 -3147 -32148 63039 32084 -60012 49 47717 -47235 -49029 48024 7856
140 7856 -56253 25320 56785 -35933 -18410 61689 636 -50500 35523 46861 -38216 4938
152 4938 76513 7464 -22458 63623 48862 -33300 18395 68043 -11915 -23172 63990 32319
164 32319 -35241 32920 64095 -20581 -14930 60986 9310 -45573 29138 42631 -38686 -11092
176 -11092 57820 -4609 -40471 36990 29859 -47683 -6259 45913 -25312 -41219 36499 14289
188 14289 -51040 4980 41320 -34838 -33772 36828 -2204 -54858 9773 29317 -43503 -23777
200 -23777 40346 -9175 -46632 23392 24842 -45013 -10775 41440 -17128 -37847 34477 20719
212 20719 -40856 6342 45276 -20649 -26327 42396 11050 -41203 14930 38694 -29652 -18373
224a8373O2022m4473m0762O2269O814o8793K6057N2385n4724k5037O5057q079
236A4363o1938L9483M0706o0344j0027O3972k1931n2756N0763K6883o1383O237
248b5972O0050l4175m1031N6884J2606o1352J9355N2265m5113k8287O0548k866
260B2912n7395L0938M1608n3507j5310N9984j7026n1755M1203L0093n8431p13
272b7399N6911k9042m2842M9099J7551n9234J2841N1813l8822l1247N5321M392
284A9342n6820K6640M3393m5879j8841N6681q013n1086L6736L2808n0310n849
296b1198N5218k0986m2905M3503K0554n2344N998M9814l1778l3308M8226P931
308B8725n1902J7129M2488m0594k2115M9805m540m8295K7430L4307m6438j0080
$$ plain form
224 -18373 43649 -824 -41586 20683 27497 -41296 -15239 37146 -17578 -42615 22442 14363
236 14363 -47575 -8092 32614 -27730 -37757 26215 4284 -48472 2291 29174 -32209 -25972
248 -25972 34078 -97 -41128 15756 28362 -32990 -13635 38630 -6483 -34770 25778 22912
260 22912 -34483 -3545 38063 -15444 -30754 29230 12204 -39551 1652 31745 -26686 -27399
272 -27399 29512 470 -42372 6727 24278 -34956 -22115 29698 -9124 -40371 14950 19342
284 19342 -37478 -10838 32555 -13324 -32165 24516 16503 -34583 2153 34961 -15349 -21198
296 -21198 34020 13034 -29871 13632 34186 -18158 -12160 37654 5876 -27432 20794 28725
308 28725 -23177 -6048 36440 -4154 -26269 23536 18996 -29299 -1869 32438 -14000 -24080
320b4080N0378j5286m3017L7422K3573m9098K319M7910k5485l4554M4309J2599
332B6990m9727J3773M2766l4160k5238M8119M00m7273K3695L4729m0784j4509
344b1219M8222j1217m2325L1348K5378m5165l469M5989k1915l4581L7437J4924
356B3407m5809P632M1123k9514k5845M1647N126m4505J8250L5074l5293j6159
368b4866M3683m828m0678K7285K7363m0152n625M3333j5093l5385L3980J7803
380B6820m2455L954M0410k4388k8364L8610P844m2690J2992L5251l1704j9775
392b3495M1130k693l9750K1390K8241l6536j0195M0950j1743l5008K8516K0230
404B1037l9521Q8L8416j9749k8381L2835J1275l9747R077L3357k6416k1212L6417
$$ plain form
320 -24080 26298 11012 -32005 5417 28990 -20108 -17789 30121 4636 -29918 14391 26990
332 26990 -22737 -8964 33802 -358 -25596 22523 22923 -24350 -655 34074 -6710 -21219
344 -21219 27003 15786 -26539 4809 30187 -14978 -18447 27542 5627 -28954 8483 23407
356 23407 -22402 -14770 26353 -3161 -29006 12641 17767 -26738 -8488 26586 -8707 -24866
368 -24866 18817 13989 -26689 596 27959 -12193 -17818 25515 10422 -24963 9017 26820
380 26820 -15635 -11681 28729 4341 -24023 14587 22431 -20259 -7267 27984 -3720 -23495
392 -23495 17635 14942 -24808 -3418 24823 -11713 -21908 19042 7299 -27709 807 21037
404 21037 -18484 -18396 20020 271 -28110 4725 16000 -23747 -14670 18687 -7729 -28941 7476
417G476J809l8068J7505K7751l1698j2570L7916o810l4463K4709K1520l4831l179
430b2933L7764j5112k8681L1162J3871l5937N388L5195k2559k1993L5052M710
442A5927l5874J3580K9740k9465j4435L5471m325l4506K0334K2134l3945o350
454b1714L4076j3004k9979K5730J4276l4875J961L1594j8693k2983L0690O870
466C949l3497J1534K8527k3396j4915L3972J72l0357J8860K4016k7179p348L4549
479A8887q367k7110K4247J6349l0999k42L1354j6776k3195K6395P742l3417O153
492h979K7171k4310j7765K8503l63l2797J3291K2333k7530j0362L0750o581k7839
505c4478K0980J7468k8006j217L1202j1465k1859K6754J1996k7519O418K9074
$$ plain form
417 7476 9285 -28783 -11278 16473 -15225 -27795 10121 3311 -31152 -6443 15077 -19754 -22933
430 -22933 14831 -281 -28962 2200 16071 -19866 -14478 20717 -1842 -23835 11217 15927
442 15927 -19947 -6367 23373 -6092 -20527 14944 10619 -23887 -3553 18581 -15364 -21714
454 -21714 12362 -642 -30621 -4891 9385 -25490 -23529 8065 -10628 -33611 -2921 3949
466 3949 -29548 -18014 10513 -12883 -27798 6174 6346 -24011 -5151 18865 -8314 -15662 18887
479 18887 10520 -16590 7657 24006 -6993 -7235 24119 7343 -15852 10543 18285 -15132 -8979
492 -8979 18192 -6118 -23883 4620 4257 -28540 -15249 7084 -20446 -30808 -58 -6639 -34478
505 -34478 -13498 3970 -24036 -25253 5949 -5516 -27375 -621 11375 -16144 -9726 19348
517A9348j6584j5912K8771M600k7312J1805K3830k2770j1210K8517l897k6889
529g703J5713J7178k7637n760K7193j1913k4441K0018J0952k9580J180K5687j6808
542e921j8934K4491N535k8037R559K3258j9766j1594K7531K27k5068J6178J9371
555A6830k2083n411K8263o190k2008K0289J3532k4790K87K5739j3038j8537K1831
568A4714O633k6334N177K2088j8650j4553K3644k96k5485J0503J8170k2278p941
581a4608K4463n374k2498J6097J4105k3607j340K4480r905j8273K0962R123k4106
594a0481N108K2496j4388j3866K3323L137k3393R762J9077j8649r373K4140l277
607A3616k1962J3876J4295k1228m492K3234q697j9346J7486R616k2900J488K1433
$$ plain form
517 19348 2764 -13148 15623 20223 -7089 4716 28546 5776 -5434 23083 19186 -7703
529 -7703 8010 25188 -2449 -8209 18984 7071 -17370 2648 13600 -15980 -14800 10887 -5921
542 -5921 -24855 -364 5171 -22866 -13307 9951 -9815 -21409 6122 6349 -18719 -2541 16830
555 16830 -5253 -10664 17599 11409 -10599 9690 23222 -1568 -1281 24458 11420 -7117 14714
568 14714 21347 -4987 190 22278 3628 -10925 12719 12423 -13062 -2559 15611 -6667 -14608
581 -14608 9855 4481 -18017 -1920 12185 -11422 -12762 11718 1813 -16460 4502 13625 -10481
594 -10481 -5373 17123 2735 -11131 12192 15329 -8064 1698 20775 2126 -7247 16893 13616
607 13616 -8346 5530 19825 -1403 -5895 17339 8642 -10704 6782 16398 -6502 -5014 16419
620A6419j2877j5154J9764M985k2894P004J8862j6706j0244K1601n53k1164J1467
633E10J5195j9138n448K1475n452j9157J5322J0593k0659p06K0572j0505j5595
646a2993J8122N782k1175M411J9077j4643j1652K0427O95k0073R298J5901j7380
659d203o604K1236l932j8447J3334J1784j9015j298K0084q393j5385J5864P493
672A2518k0135L389J7744j2300j1682J7819K457j9742P618J4775j5094p834J8789
685H322k114j8061J1168J1939j7134l558J8900o235j5489J4283Q033j8132J359
698f719J7959j0368j2039J6301L817j8047N200J6196j3873q414J7856m39j7331
711i901Q832J2908j6250m104J7542n010j5382J2186R156j7560j51J6699q315j2899
$$ plain form
620 16419 3542 -11612 8152 13137 -9757 -2753 16109 -597 -10841 10760 10207 -10957 510
633 510 15705 -3433 -8881 12594 7142 -12015 3307 13900 -6759 -7465 13107 2602 -12993
646 -12993 5129 10911 -10264 -5853 13224 -1419 -13071 7356 8051 -12022 -2724 13177 -4203
659 -4203 -10807 10429 6497 -11950 1384 13168 -5847 -7145 12939 4546 -10839 5025 12518
672 12518 -7617 -4228 13516 1216 -10466 7353 9810 -9932 -2314 12461 -2633 -10467 8322
685 8322 6208 -11853 -685 11254 -5880 -9438 9462 3227 -12262 2021 10054 -8078 -6719
698 -6719 11240 872 -11167 5134 8951 -9096 -3896 12300 -1573 -9987 7869 7430 -9901
711 -9901 -1069 11839 -4411 -8515 9027 4017 -11365 821 9977 -7583 -7734 8965 650 -12249
725a2249J4646N210j7464M045J4895j1390r184J6041Q63j6348P707J2466j3675
738d437n260J6846l138j4707J0927R428j5445j437J6294o853j2134J3357N678
751I119j5820K499J5106j0446r472J5006J969j5697N948J2867j2978n989J5605
764G717j564j4785R259R954j4438k296J5276n280j2862J1717O510j5051J391J4142
778I690q485j0015J3663L075j4773M125J2794j0959p078J4632q98j3762P327J0051
792I387j2839l732J4897m744j2002J0106P363j4274K4J3937p060r737J1813M030
806G169j4454L703J2225r457p540J3677P45j3760O813J0476j1953l878J3471k410
820D827j2675R689P372j2934p64J3310o045j0330J0988M301j3280K257J2227q877
$$ plain form
725 -12249 2397 7607 -9857 -5812 9083 -2307 -11491 4550 5413 -10935 -3228 9238 -4437
738 -4437 -9697 7149 4011 -10696 231 9659 -5786 -7223 9071 2218 -9916 3441 9119
751 9119 -6701 -4202 10904 458 -9014 5992 7961 -7736 -1788 11079 -1899 -7888 7717
764 7717 6153 -8632 627 10581 -3857 -6153 9123 3843 -9019 2698 9208 -5843 -4452 9690
778 9690 1205 -8810 4853 7928 -6845 -2720 10074 -885 -7963 6669 5771 -7991 -664 9387
792 9387 -3452 -7184 7713 2969 -9033 1073 8436 -5838 -5814 8123 1063 -8674 3139 7169
806 7169 -7285 -3582 8643 -814 -8354 5323 6068 -7692 -879 9597 -2356 -6234 7237 4827
820 4827 -7848 1841 9213 -3721 -4485 8825 2780 -7550 3438 7739 -5541 -3284 8943 66
834F6p565J2048J327j2593M874J0454j0742m590J2783j560j1891P415Q562j1683
848c095j579J2437m503r668R525N226j2314J485J1233o710q273J0831K130j2547
862e822M290R658r184n832J1744j034j2097O646P694j0919k866J1968l890j0090
876i734Q754N260j1129J46J1569o171p181R806L365j0958L043J0413p528n403
890e748J0830N06j0603N597Q045r586k937J0786k563r785P188N692j0762q63J0137
905E934n251q613R003K955j1006J511R646p173o386J0162J195j0592M578Q206
919D169q380l043J0667j429q987P072O567r025j148J0589l649p788Q317M075r823
934a816Q89R351o410o131Q632J116j0324K957P705q032m669Q982j096r985N535
$$ plain form
834 66 -7499 4549 5876 -6717 -1843 8611 -2131 -6721 6062 4502 -7389 26 8588 -3095
848 -3095 -4674 7763 3260 -6408 3117 8343 -3971 -2486 8747 2037 -6236 4595 6725 -5822
862 -5822 -1532 8126 -1058 -6890 4854 3820 -8277 -1631 6063 -4856 -7722 4246 356 -9734
876 -9734 -980 4280 -6849 -6703 4866 -1305 -8486 1320 4685 -6273 -3230 7183 -345 -5748
890 -5748 5082 5588 -5015 582 8627 -959 -3896 6890 4327 -5458 1730 7422 -3340 -4203 5934
905 5934 683 -7930 1073 4028 -6978 -5467 4179 -2994 -9380 782 1977 -8615 -4037 4169
919 4169 -4211 -7254 3413 1984 -7003 69 6636 -2389 -3537 7052 3403 -4385 3932 8007 -1816
934 -1816 -927 8424 2014 -4117 4515 5631 -4693 -1736 5969 -2063 -6732 2250 1154 -8831 -3296
949c296N679q769k303R320k664q434P428M383q648O08R327m573n902R127K329
964C612q645K858Q726o301l879R301J26q648M488P050q271k590Q883k411q046
979c747N599M487r380m88Q593m689o947P021K337r116J528P552n588n094Q341
994D09Q97q536M055O603o420k938R177j046p276N953M897p029j007Q706l061o262
1010b878O743K881p977N98P632n460n149P207J129q729K517O214o697l596P605
1025B040r77p766M802M511p144j456P733k381o386O050L739p401P80P564l556
1040A52n324P414J742p169K293O449n038l560P800l33p172L611N342o923j769
1055b485P291j909o715M890L474p031m18P007l589n273N838K330p432J294O580
$$ plain form
949 -3296 2383 -6386 -8689 631 -2033 -10467 -3039 1344 -7304 -6696 2631 -1942 -7844 1283 3612
964 3612 -5033 -2175 6551 250 -3629 5672 5798 -2850 1638 8688 417 -2173 6710 4299 -3747
979 -3747 1852 6339 -3041 -3529 5064 375 -6572 449 2786 -6330 -4802 2750 -2838 -7932 409
994 409 1306 -7230 -3175 3428 -2992 -5930 3247 2201 -5075 878 5775 -1254 -2261 6445 3384 -2878
1010 -2878 3865 6746 -1231 -633 6999 1539 -3610 3597 4726 -4003 -1486 4728 -1969 -5565 2040
1025 2040 1063 -6703 -1901 2610 -4534 -5990 1743 -638 -7024 -974 2765 -4636 -3856 3708 152
1040 152 -5172 2242 3984 -3185 -892 5557 519 -3041 4759 4426 -2746 865 6207 -716 -2485
1055 -2485 4806 2897 -3818 1072 4546 -2485 -2903 4104 515 -4758 1080 3410 -4022 -2728 3852
1070C852n047l402O814L37o552L321N397n657k315P188j258o116M639L806o558
1085a551k61O677k991n348N640K394p098J023O103m593l954O117N24o494K397
1100a415M981n243k737O497q15o020L629M148n844q51O018j835n107M948K611
1115B965o060P78O061l402m021N666J153o033K125N108m517k699O043m25n825
1130c083L401L827m943j715N989j800n106M356K499n512M8N804l438l733M812
1145A406J526n628J379M886m355k598N457J29n298K837M044m992j659N625j058
1160A701n159L761L265n541J8N183k398m135M641J356n298J013M848l405l316
1175c466N380J92n110J921M176m203k146N535j184m642L143L309m810q59N237
$$ plain form
1070 3852 -1195 -4597 2217 2554 -3998 -677 4720 -937 -3252 3936 2678 -3438 1201 5007 -1551
1085 -1551 -1812 4865 1874 -3474 2166 4560 -2538 -1515 4588 -5 -3959 2158 2682 -3812 -1415
1100 -1415 3566 -1677 -4414 2083 1268 -4752 -1123 3025 -2819 -3670 2348 513 -4594 354 2965
1115 2965 -3095 -2317 3744 342 -3679 1987 3140 -2893 -768 4340 -177 -2876 3167 2742 -3083
1130 -3083 318 4145 -798 -2513 3476 1676 -3430 926 3425 -2087 -2039 3765 327 -3406 1406
1145 1406 2932 -2696 -1317 3569 -786 -3384 2073 2202 -3096 -259 3785 -1207 -2866 2759 1701
1160 1701 -3458 303 3568 -1973 -1955 3228 830 -3305 1336 2692 -2606 -1593 3255 -150 -3466
1175 -3466 1914 2106 -3004 -1083 3093 -1110 -3256 2279 1095 -3547 -404 2905 -1905 -2764 2473
1190B473k291l969M370J780m985Q09M782l148l063M819O44n102K215L661l626
1205f31j945M719k27m599K812L097m324q12M971j621l913L640K012m437J0M413
1221C165k433l015M117P15m505J451L879l547k280M578l90m329K268L067m083
1236a342j175M346r46m121L118K300m384L66L800k123l113L859J161m245J243
1251a256L656k924k226M040M62m233K031K926l324j351M358j081l498K661K215
1266B456l692p06M395j754l217L247J326m144O73L921l132k169L779L99m150J579
1282a189L255l289j458L896n53l401K376K372l323o88M006j336k893L111J799
1297B685l623M14L353k056k269L672J25l254J430K613k869j467L434m87l487J788
$$ plain form
1190 2473 182 -3787 583 2363 -2622 -1813 2969 -179 -3242 1577 2221 -2881 -666 2995 -631
1205 -631 -2576 2143 1916 -2683 129 3226 -1098 -1910 3061 1440 -2473 1167 3179 -1258 -1248 3165
1221 3165 732 -2283 1834 2549 -1956 -505 3374 -173 -2453 2125 1735 -2594 -326 2741 -1342
1236 -1342 -2517 1829 883 -3238 -120 2180 -2204 -1838 1962 -161 -3274 585 1746 -2499 -1256
1251 -1256 2400 -524 -2750 1290 1752 -2481 -450 2476 -848 -2199 2159 1078 -2420 241 2456
1266 2456 -1236 -1942 2453 699 -2518 729 2055 -2089 -1416 2505 -627 -2796 983 1382 -2768 -1189
1282 -1189 2066 -1223 -2681 1215 662 -2739 -363 2009 -1314 -2002 2004 668 -2225 886 2685
1297 2685 -938 -524 2829 773 -1496 2176 2301 -953 477 3090 221 -1246 2188 1701 -1786 2
1313BK176l180j037L493j313k902K537J423l659J72L145j829k283L196P07l574
1329b926J241L019k246j540L159K10l095K076K361k875n00L352p58l083K844J484
1345B723l110O8K859j371k669K743O13l292N39K616k241j713K907J44l122J011
1361a295K313k229j486L115m97k227J738J943k698n28L397r67k047K407J266k690
1377d85O13K715j549j708K853J54k780Q23K571k575j436K673k73k961J270J980
1393A885k897m48K390j156k216K193P94k771L70K295j622j310K514N12k370O69
1409a168K613j760r89K566J91k465J613J737k091k20K286m68k566K160J081k658
1425a38Q0K369j719j776K171M64k628N83J704j511j291K478k29k278J079J536
$$ plain form
1313 2 2178 -1002 -2039 1454 141 -2761 -224 1199 -2460 -2288 857 -972 -3255 -59 648 -2926
1329 -2926 -1685 1334 -912 -2452 707 917 -2178 -102 2259 -616 -1116 2236 1478 -1605 1239 2723
1345 2723 -387 -319 2540 1169 -1500 1243 1856 -1436 -897 1719 -522 -2235 672 816 -2306 -1295
1361 -1295 1018 -1211 -2697 418 -79 -2306 -568 1375 -1323 -1851 1546 579 -1468 939 2205 -485
1377 -485 128 2843 1294 -414 2439 2593 -187 636 3207 632 -804 1869 1596 -1365 -95 1885
1393 1885 -1012 -1460 930 -226 -2442 -249 545 -2226 -1856 439 -1183 -2493 21 533 -1837 -1168
1409 -1168 1445 -315 -1304 1262 1453 -1012 601 2338 247 27 2313 1845 -721 1439 2520 -138
1425 -138 -58 2311 592 -1184 987 1451 -1177 -594 1110 -401 -1692 786 557 -1721 -642 894
1441H94j920q32K588m17j639J575J317k076o7K515j295j017K055L91j938M59J970
1458B563j617j218J993K14k396J151J225k065o72J697l60k079J174J016k000r
1474a383J800r81j695J825O14k095N06J860j208j009K020K76j222J27J880j158
1490A57r71K018pj546Q78J204j700l04J941p76j374R79P18j780J56J346p32j586
1508a379J725O22k225N04J482j492q23J845j18j661J159J055j394k56J807l83
1524D68j751J390J109j471k59K017q30j501J919J26j767N19J648j353r69J725
1540A020k03j651O90J228j679k12J447p20j315R72Q27j578R1J429q30j214J619
1557g9L29j366K58J152q44o72J510J63j387N82J396j426k52J386l93j033O60R99
$$ plain form
1441 894 -1026 -1858 730 313 -1326 249 1566 -510 -577 1938 643 -374 1681 2072 134 593 2563
1458 2563 946 -272 1721 1935 -461 690 1915 -150 -822 875 515 -1564 -390 626 -1374 -1383
1474 -1383 417 -564 -2259 -434 180 -1915 -1409 451 -757 -1766 254 530 -692 -565 1315 157
1490 157 -814 1204 1197 -349 529 1733 33 -271 1670 894 -480 499 1217 -563 -407 939 207 -1379
1508 -1379 346 968 -1257 -753 729 -763 -1586 259 141 -1520 -361 694 -700 -956 851 468
1524 468 -1283 107 1216 -255 -514 1503 673 -828 1091 1217 -550 -31 1617 264 -705 1020
1540 1020 817 -834 -144 1084 -595 -807 640 -80 -1395 -423 404 -1174 -1083 346 -484 -1698 -79
1557 -79 250 -1116 -858 294 -550 -1222 288 451 -936 -354 1042 -384 -636 750 357 -676 -16 983
1575I83j326m4J477p58j081J250M97j683J74J296p98q35J194L08j345P22O03j203
1593e69j06J228j41j419J194M64j337M9J203m62q56J296J65j094l1J315p04j006
1611h11J287J77j102L54R10j104m08J216rj231R30N81j172J9R19m73j206J144
1629B1M05r55K19Q38m37q71J080m6q67N20N30q99j92R98j34r70O62O62r73m15
1649h24J408l26q37Q55M89j243K81R91n63p71Q82K61r14L81Q46q20l63R31r9q56
1669b91L09P48p09l85R53k95r16P34O93j142jP60j51j065J046L47j434O24P21
1688E46j016j48J136n16o77K35R05r53OP73m09n80Q48J51n55j44J040o75q34J154
1708B87K6p64K36Q10p98j40N61jp22M47M73r82j9N29J8q73P84K64o49K15N73l38
$$ plain form
1575 983 -343 -387 1090 332 -749 501 998 -685 -511 785 -13 -848 346 654 -691 31 634 -569
1593 -569 -675 553 412 -1007 187 651 -686 -637 566 104 -752 544 709 -385 -416 899 195 -811
1611 -811 476 653 -449 -95 815 -289 -697 519 510 -721 209 790 -382 -363 556 83 -1123 21
1629 21 426 -529 -310 528 91 -780 300 254 -613 -93 437 -462 -654 344 210 -760 -98 564 -409 -824
1649 -824 584 258 -579 276 765 -478 -197 794 231 -540 342 603 -311 70 916 96 -267 664 565 -291
1669 -291 18 766 57 -328 625 330 -586 148 841 -301 -302 458 307 -758 288 635 -799 -175 546
1688 546 -470 -618 518 2 -675 -440 465 -488 -482 291 -118 -698 150 301 -254 -398 642 -33 -867 287
1708 287 313 -451 -215 595 -203 -343 218 217 -505 -58 415 -567 -586 -57 -39 -912 -128 136 -513 -298 275 -63
1730f3q32Q35L30j119K89P73l75n37J121k4j092N48P25m86l00P99Lo50L23M49
1750G17o12MN88m02o19O39K58p71o1P68o40k95L53J30o18N2N05o92l55Q77m06
1771e80j45K24L48n54lO84k79m81N43M37p14M22P62o87l53P45L33q81L06Q49r10
1792F6l59P66R3q41M47J87m30l46P99l13j099R05M5o94J52M72p5o90N82K16n18
1813f35K60M96m00k38N69M63o63L24O42n29p1P38j56n53L69L96p23J58O19o02
1833D64m85K85K59n19N6L99n79l78M88k08n77M13Jo57O81K88l84l71N26K25n13
1854e86k6P66j52l15O79K1l54K05M14k87j55N05J98n88K50O1l71k61P59l53o18
1875b08L28L87p78j88L82R1o42O99l94k33J33M57k75k22M64L5k04K78J85l6k23
$$ plain form
1730 -63 -895 -60 270 -849 -560 213 -162 -699 422 398 -694 -146 579 93 -207 592 595 -55 268 717
1750 717 105 109 697 295 -324 315 573 -198 -259 509 -131 -426 -73 57 -561 -509 -4 -696 -1051 -174 -580
1771 -580 -725 -501 -153 -707 -710 -26 -305 -786 -243 194 -520 -98 664 -23 -376 369 702 -179 127 976 66
1792 66 -293 473 566 -275 172 359 -71 -417 382 69 -1030 -125 -80 -774 -622 -150 -225 -915 -333 -117 -635
1813 -635 -375 121 -279 -517 52 515 -148 176 818 289 218 956 800 247 616 1012 289 447 1066 464
1833 464 -21 264 523 4 60 459 -120 -498 -10 -218 -795 -382 -381 -1038 -357 -69 -453 -824 -298 -73 -586
1854 -586 -612 154 2 -313 366 387 33 238 652 365 210 715 913 325 575 636 265 4 763 410 -208
1875 -208 120 507 -271 -459 -77 14 -628 71 -323 -556 -423 34 -241 -463 1 36 -168 110 295 259 36
1896C6N47J05n53P69P8n50L8O64l69l64K43p3k12k83P01n31l75L14p3m93k7L06
1918a02l46k51K45L5j70J36K03k76lM61j11l24L63K40l12L06K51k32n8N48k11
1939C92k85K10L36n11P5L85k7l39j87M56m23k92L72j89l27L08r2j69J06J16j28
1960b13l80M87R1l97L40Q0j52j01L57K09k67J06K68l95K36K30j63l53M91p3l52
1981D9j36N64k11m70L85J36n65%M29l82j84J55O7k33j35M54k17j7M61l26l04K43
2003b37P8k19k96O75m0n5n4J0l9kM44n05K9K57R7k90L12K4j15j19K11M0n22M09
2027I3O3k50L4L58k22p20Q92k49J24l27L21k73k08M48q7k45K27J69r3j33K71m7
2049A46l21K60J57m51J68J55l3o4K31o1j13K20k59j11j91L62p2p5J77J26m29N3
$$ plain form
1896 36 583 688 135 904 982 432 470 1134 765 401 644 571 359 76 777 246 -129 185 112 -381 -408 -102
1918 -102 -448 -699 -454 -419 -589 -453 -250 -526 -529 -68 -179 -503 -140 100 -212 94 345 113 55 603 392
1939 392 107 317 653 142 217 602 575 236 49 505 82 -210 162 -27 -354 -46 -138 -307 -201 -85 -213
1960 -213 -593 -106 -15 -412 -72 8 -144 -245 112 321 54 160 428 33 269 499 336 -17 474 401 49
1981 49 -87 477 266 -204 181 317 -248 -248 181 -201 -385 -230 -163 -396 -531 -77 -294 -311 150 -176 -480 -237
2003 -237 -159 -378 -674 1 -39 -94 -148 -138 -177 -179 265 -240 -211 46 143 -147 165 189 74 -45 166 206 -316 93
2027 93 156 -94 -60 298 76 -644 248 -1 123 -204 117 -156 -364 84 -3 -248 -21 148 55 -78 193 146
2049 146 -175 85 242 -209 -41 114 81 17 248 187 74 294 35 -76 -267 95 23 -52 125 251 -178 -125
2071a25L62j02k60J54K8j03oK08k62k80J91J99k14J08R1L0k40q0L19j45qK21l45
2094b59J37L4K50m46K68J97k37J33J69j84J8j15L78m39K45L7j6N5j27jR2K8nr8
2118A14r7L12j98j79Q3K02m31K11lL31n48P5N1Q9k12L68k83j20J71l46M35j37
2140a12K48K7K1K5k33p2R5J94l55K02j56R4k99L15K55m34L92j40r4j02R4j90N8
2163a67J22n4o0k51L85j50m4K69k47J65nr8j92J31J92j51j75J46K58k97K45P7
2185I9N2l02K52K47j56j07J49J1m66P21K1l30QR1j60J30j07j8j72J82k36K58l95
2208b28J70k95J12O7O9j90j02R5l7m0O7K31k29L6K22k20L8K30Q7n88N11p6Q2J1
2232B3L43l67j09M31m8j30%P1k00j45K07j20p2p5J17pj66N0j94r3K22J94l39K94
$$ plain form
2071 -125 237 135 -125 29 57 -46 -52 156 -106 -386 -195 4 -210 -102 -11 19 -221 -301 18 -127 -135 86 -259
2094 -259 -122 -88 162 -284 -16 181 -56 77 246 62 80 -35 343 -96 149 186 170 225 98 97 189 217 212 114
2118 114 17 329 131 -48 35 237 -194 17 14 345 -203 -128 -77 12 -200 168 -115 -235 -64 -410 25 -112
2140 -112 136 163 184 209 -24 -96 -1 193 -162 40 -116 -22 -321 -6 249 -185 207 67 -27 -129 -35 -225 -167
2163 -167 -45 -99 -159 -410 -25 -175 -219 50 -197 -32 -37 -135 -327 -196 -4 -155 -330 -184 74 -223 22 99
2185 99 151 -151 101 348 192 85 234 245 -221 500 521 191 199 290 130 260 153 135 -37 145 -91 167 -228
2208 -228 -58 -353 -241 -174 -105 -295 -397 -302 -339 -379 -312 -81 -310 -274 -52 -272 -234 -4 83 -505 6 -70 12 23
2232 23 366 -1 -110 321 273 143 143 214 14 -131 76 -44 -116 -191 -74 -81 -247 -197 -391 -484 -262 -68 -407 -113
2256a13j96K01j87M13o9K6N9J4oj7M40j71k96K68J57j57j63J96K2j98O9L41m13
2279B20j20M2k38K48j99J22l61lN0J35l33J06j22j16j00L40Rr2J63J2j19P1M08
2302A23l15K01J86M0l65N17K3j34o6kM9Q1N2P8j01j55j15K49m75m5J68k02o9P9
2326a98k28j70K86k06J94L8k15J63J4J94j57L84n0J24k12K55J62l75L43p6L39
2347F09l64J92J55k65J69j57P5r1nL9l74L6j02K0j18J68q3k41j42M22j18j92K36
2370a31m1j94N0M8J0J06J77k03J15P1K09l24K99k7j72K64J79m81O9K14j71K4J8
2393A09m4K11p4l33N8K3r7M3J49p4j98J67k30J44j70K48q2p4J43K80m20M24j21
2416H2j17K56j15k6J86J87m27K83Mn0m2P9J55l57J40R0k64o4o2K19j99N4Kl55
$$ plain form
2256 -113 -309 -108 -295 118 49 75 134 148 142 125 565 394 98 366 523 366 203 399 421 223 292 633 220
2279 220 100 142 -96 152 -47 75 -286 -289 -239 -104 -437 -331 -453 -569 -669 -329 -320 -412 -249 -237 -356 -285 123
2302 123 -192 9 195 235 -130 387 410 276 210 208 257 338 390 468 367 212 97 346 -129 -174 -6 -208 -277 -198
2326 -198 -426 -596 -310 -516 -322 -284 -499 -336 -322 -128 -285 99 49 173 -39 216 378 3 346 270 609
2347 609 245 437 592 327 496 339 414 323 318 357 -17 19 -83 -63 -181 -13 -96 -337 -479 -57 -175 -367 -131
2370 -131 -172 -366 -316 -268 -258 -152 25 -178 -63 8 217 -107 192 165 -7 257 436 -45 24 238 67 91 109
2393 109 65 276 202 -131 -73 -50 -147 -104 45 -29 -227 -60 -290 -146 -316 -68 -150 -224 -81 199 -221 203 82
2416 82 -35 221 106 80 266 453 26 309 313 263 221 300 455 98 238 328 64 0 -62 157 -42 12 14 -341
2440c41L60j46j35k74L58M7q8O7p7K01l89J27J68L0l9R7O7J07k37Oj88J24J74
2463A9k11J97n9j64J17m7J89k03J27J35l7O8k30J21l28K30K10k94%J18J08j59
2485i3J89j73n3M06l07o1J71k43K31k70Q9M23l82M4j00N41m07P1j0q8J81n0j56
2508d7j13K02K55l62K56k04K22m73L1L01n40M12n3J81l66K70m0m9n9Q0N8PJ11
2531H0j44q8o9K0q3J09J52j90J0P0j59L26k08K19j08O2J1J26j51N4j84J8L07n0
2555A30j45O0J18K4j20M6j51J88J08r3L9j14J97k02n2j27K33o4j22L8K19o0l34
2578a84L59k72r4J21l5O7J13M6r9P1N1k63J43K11j81pJ02n6l0L2n1q1K46k93K15
2603A31j02j69O4L6o0P4J67p3k12L1K18j87l17L05m3k13K06K63l47M2L99j77j11
$$ plain form
2440 -341 19 -127 -262 -536 -178 -131 -219 -152 -229 -28 -417 -290 -122 -92 -131 -34 33 140 -97 -91 -279 -155 19
2463 19 -192 5 -54 -218 -101 -148 41 -162 -35 100 63 131 -99 22 -306 -76 134 -160 -160 -42 66 -93
2485 -93 96 -77 -130 276 -31 -92 79 -164 67 -203 -114 309 -73 -29 -129 412 5 76 66 -22 159 109 -47
2508 -47 -160 42 297 -65 191 -13 209 -264 -233 68 -472 -60 -113 68 -298 -28 -68 -117 -176 -96 -38 -31 80
2531 80 -64 -152 -221 -201 -284 -175 -23 -213 -203 -133 -292 34 -174 45 -63 -1 10 136 -15 39 -145 -127 180 130
2555 130 -15 45 163 187 67 113 -38 150 258 165 204 90 287 85 33 -94 139 75 -47 -9 210 150 -184
2578 -184 175 -97 -191 -70 -105 -38 75 121 22 93 144 -119 24 235 54 47 149 93 63 95 44 -37 209 -84 131
2603 131 29 -140 -76 -40 -100 -26 141 68 -144 -113 105 -82 -399 -94 -137 -350 -144 119 -228 -186 213 36 -75
2626g5Q0l8j52K93k14J77o8K34l20J46mK55l72J38L6L12l97L00q4k91K53Mj56
2649E7j8K01k53J76j89K8J02j64R7k67J13m0K28j12L0o9j10l5L49k54O1j67J93
2672d3j6R3J02j32k8j70J69J99n2j14N2k79L60N4l38J64j08L86k01k97J55j64
2694b08R6k26k0J36Q0o3j47K56r5J75q8K34lj45Rj49L02j46J7J89J0NN8j5p4l6
2720A52J67om0Q8k4k20n3J44p6l75J99J71k43J68n8j38L45k47l22j6L78k23n3
2743b82qK52O5k84R3J18p1P2o9K8L62l5k4j86j07L64Mj91j54J19J22MJ4l83M4
2768a33Kk73K74P5j97L3k83K89k84J40J94j53J02k9J44j52M4M40k35k2L39q7m2
2791A86O4P0j15j64K32J35r8K5Q4j85N8j26J02j18J99q8m8k34Ok42N0J70j61j25
$$ plain form
2626 -75 5 -33 -185 108 -106 71 3 237 -83 63 59 314 -58 80 116 428 31 331 247 -44 209 213 57
2649 57 39 240 -13 163 -26 2 104 -60 37 -230 -117 -157 71 -41 -11 -80 -190 -225 124 -130 -69 -236 -43
2672 -43 -59 34 136 4 -24 -194 -25 174 122 8 60 -219 141 195 -143 21 -87 299 98 -199 -44 -208
2694 -208 -112 -338 -358 -222 -142 -205 -352 -96 -191 -16 -104 130 127 -18 -9 -158 144 -2 15 204 214 219 277 262 188 152
2720 152 319 313 273 361 337 117 64 208 132 -243 -44 127 -116 52 -6 -144 201 -46 -368 -384 -6 -229 -282
2743 -282 -290 -38 27 -257 -164 -46 -117 -45 -114 -86 276 241 217 31 -76 288 292 101 -53 66 188 192 206 -177 -133
2768 -133 -131 -404 -130 -55 -252 -219 -502 -213 -497 -357 -163 -316 -214 -243 -99 -251 -207 233 -2 -24 315 228 186
2791 186 250 320 205 41 273 408 310 335 419 234 292 166 268 150 349 261 213 -21 -15 -257 -207 -37 -198 -323
2815c23J8N5k32L78j04j06K77NN1l00L32J60l88K8L03o0j21Q0J21N0j81J26k78
2838a09j52N45k86n1l3K43q0l13J44p9j19K24Kj61J27J37k95L87k31O6Q3j37K29
2861A41l86K18m7J95p5J54q9J09k04K4K28j99K93k99K72l12J76k12J28J12n0j56
2883B1j62l5J44r7k33M69j04j66O4m4P0J19N4m2j79J90k1J06j99O6j30p5J86j65
2907a63j04L08j05m6J20j7o5J9j50K37k0N4j46j2n5R5k6j02M2K5J18k9q5M3M9
2932a5j32j1Q4K7J5J45j5Oj50P5l33M22L9j93p6K08o5J14J16j44j70O4j65M02
2956B48N0k12k71PN84m50j4J8M8L3m0J07L5k5m9m9O6k5l04J96N1j85L19j70n2
2981h4j05J73M0J66j44j27J24j12r0J94j69J31qp7J63j94J7K50k67K57J17q3j44
$$ plain form
2815 -323 -305 -250 -482 -104 -208 -314 -37 -32 19 -281 51 211 -177 -149 154 94 -27 53 174 224 43 169 -109
2838 -109 -261 284 -2 -53 -86 157 77 -236 -92 -171 -290 -66 -64 -225 -98 39 -256 131 -100 -34 49 -88 141
2861 141 -245 -27 -74 121 46 200 111 220 16 40 268 69 362 63 335 23 199 -13 115 227 177 21
2883 21 -141 -176 -32 -129 -362 107 3 -163 -99 -143 -73 46 100 58 -121 69 48 154 -45 21 -109 -184 2 -163
2907 -163 -267 41 -64 -110 10 -7 -72 -53 -203 34 14 68 -78 -90 -145 -50 -76 -178 -136 -111 7 -22 -107 -64 -15
2932 -15 -147 -158 -74 -47 -32 113 98 104 -46 29 -304 118 157 -36 -112 96 31 145 261 117 -53 11 -154 248
2956 248 298 86 -185 -178 406 -44 -58 -40 8 41 1 108 143 118 69 20 86 61 -243 -47 4 -181 138 -32 -84
2981 -84 -189 -16 24 190 46 -81 43 -69 -159 35 -134 -3 -11 -88 75 -119 -102 148 -119 138 255 172 28
3004B8p5J64j2m4%K1k16N5o9K84k39KM4K1K61j82r6P7l3N2K7j50j95L02K0K02
3030B49q0j29j84J22o1N3K59J35m59K37l4R0K3k75K69k64J78l13K37k59K87k30
3052a49J92j01nJ47j90o0j37P1J84j76k45M33O7j27m5P1j52R8O1j43J2l1L64k26
3076h7JL0J22r6kJ82l30k30L95j44J67P8J73l21K6K64k36qK01j54K29k40K23j71
3100G2k1L8L0j69J84q6j26J05q5Q1o3L42j85k44K81j62Q0j02L3l6mN5J21l40q2
3125b83L7K77J87k73J68j72J92j75J72k07J36j38M5n2L14m88R8L1K12L0k31j04
3147b24K6j65K25J5Q4J15K4o8o4j0n9L30l78J82K85l40L29q7k77J74MJ10q6j31
3171A4j39L69j3o0l9r6OJ27q7Q7k25P5n0J38k58K52l14N3j06J49K02k71N9J91
$$ plain form
3004 28 -47 117 105 61 61 82 -134 -79 -148 136 -103 -101 -57 -36 225 43 -53 24 -9 43 70 -80 -275 27 47 249
3030 249 169 40 -144 -22 -83 -30 229 364 -95 142 108 198 221 -54 215 -49 129 -184 53 -206 81 -149
3052 -149 43 -58 -63 84 -106 -166 -303 -232 -48 -224 -469 -36 31 -96 -141 -70 -222 -124 -63 -206 -194 -225 139 -87
3076 -87 -86 -56 66 -30 -32 150 -180 -410 -15 -159 8 86 259 -62 -36 228 -8 -16 185 31 260 20 243 72
3100 72 51 89 119 -50 134 48 -78 27 -58 23 -40 302 117 -127 154 -8 72 -30 3 -33 -37 18 139 -201 -283
3125 -283 -246 31 218 -55 113 -59 133 -42 130 -77 59 -79 -34 -86 228 -260 -162 -131 81 111 -120 -224
3147 -224 -198 -363 -138 -123 -39 76 100 32 -32 -42 -101 229 -149 33 318 -22 307 220 -57 117 121 231 145 14
3171 14 -125 244 231 171 132 36 42 169 82 169 -56 19 -31 107 -151 101 -213 -160 -266 -117 85 -186 -127 64
3195F4O2k80L8Q5J77p8J20j82J69j49J94j55M9kqn6n3j07M8n0q1K36m08N18k03
3220e2k11R8P9O6k15K56j78o7J37m1K92l15J27M1k20M5K58n0p1L9P6QJ46k26m9
3245b7j8j4K53j48J2L53k45L6q4n7k45N9L36k63n32Q08k70k2k0Q6l70K16pn7K79
3270E9k67M04k99J59J60k02R4j61o3J7K64k65k4K63k85L3lJ44P6l6o1j4j14J77
3294E6l8Q1l31J79j5q3RJ97l48J47P6N2j65K88m5j01RQ8m7N0M0o3j94K56K6j12
3320A2Q7J17k4j72PQ0q4K63p4p8j03K05kk12L0p4j3j80K63Mj23O4o5J32j77kl7
3347a56%J13J56j32l9J83j62k3J17r6j3M2J31J5p7L5l3K7nL9J06k90M7o7J07k35
3373b10K75o5Q2o0m7J6J30m6L2m25L33j49J8N1j25j82L40L44j60J5j62J63l41
$$ plain form
3195 64 126 -154 -116 -31 146 68 188 6 175 26 220 65 114 112 104 48 -5 -112 -64 -114 -195 41 -367 151 -52
3220 -52 -263 -165 -86 -20 -235 21 -157 -224 -87 -128 164 -151 -24 17 -203 -158 100 50 -21 18 94 102 248 22 -27
3245 -27 -45 -59 194 46 58 411 166 202 118 61 -184 -125 211 -52 -584 224 -46 -68 -88 -2 -372 -156 -163 -220 59
3270 59 -208 196 -103 56 216 14 108 -53 -116 -99 165 -100 -124 139 -146 -113 -116 28 104 68 7 -7 -121 56
3294 56 18 99 -232 -53 -68 -151 -142 55 -293 -146 -70 -18 -183 105 60 -41 -32 56 9 59 99 36 -158 98 124 12
3320 12 99 216 192 20 27 107 23 286 212 134 31 236 234 22 52 -22 -35 -215 48 52 -71 -7 -72 60 -117 -119 -156
3347 -156 -156 -43 113 -19 -58 125 -37 -60 57 -39 -52 -10 121 136 59 94 61 88 83 122 228 -62 -15 -82 25 -210
3373 -210 65 0 82 22 -25 -9 121 75 107 -318 15 -134 -116 -65 -190 -372 -32 312 152 167 5 168 -173
3396a73J03R5j46J43J64k69K80j69o5K3j39L13J28k09j27J11j93J33L2M2k38K27
3418F6J37l31J32j94J56K6KOj35K0kJ34j6l7n9j11K89k65J69j62Q4j73J59K8M8
3443b9j66K07O9k59J47L87l85Q4k88K56K5j35M88l65n8o2m1K94m19M54j80j30
3465a06K49j79j5n4L29k23O4L0l2j63J31J78k05o3J43J4N3l01K1l3K52qN4j33
3489CN5K4j96p6K45k46J40L52j53J6j09J5j26K33k58lj34R8M12k56j72J77m4r1
3513i4J45l01K28k5on7Q7pl4K7K1K20j74j6m7k0m5PL31l31J20o5L0J27J58q9k85
3540i5O2J24M9j99R8j73K43k9r1M1j32J61K58m59J8J93o2J63N7J08k70p1N0J47
3564A91k63J15k6J56j47M3k89J41K36l08P5J32n9o7j04M67k25j95J00Q5l21K55
$$ plain form
3396 -173 -70 25 -121 22 186 -83 197 28 -37 -14 -153 160 288 79 -48 63 -130 3 35 77 -161 66
3418 66 203 -128 4 -190 -34 -8 -6 0 -135 -115 -117 17 1 -36 -95 -206 83 -182 -13 -175 -91 -264 -105 -77 -29
3443 -29 -195 12 81 -178 -31 356 -29 55 -233 23 48 -87 401 36 -22 -84 -125 169 -250 204 24 -106
3465 -106 143 -36 -51 -105 224 1 65 95 63 -100 31 209 4 -59 84 98 151 -150 -129 -162 90 82 136 3
3489 3 58 82 -114 -190 55 -191 -51 301 148 164 55 70 -56 177 -81 -84 -218 -120 292 36 -136 41 -3 -94
3513 -94 51 -250 -22 -47 -53 -110 -23 -30 -64 -37 -16 204 30 14 -33 -53 -98 -91 240 -91 29 -36 -6 121 279 190 -95
3540 -95 -33 91 140 -59 39 -134 109 80 -11 30 -102 59 317 -142 -124 69 7 170 227 335 65 -6 44 191
3564 191 -72 43 17 173 26 69 -220 -79 157 -151 -76 56 -3 -70 -174 293 68 -127 -27 58 -263 -8
3586hJ36k45K08l64K09j43M4L32l11k5K50O1l41M0J96m06J83J66j41p5K69J36
3608A71j99j78M85k59k5N9j6j52R9J13l7Q5N5J62k67J4j59k9K12J05j41m7m3O4
3632G2M1j38N6p7k25L08j90k22M59j43q3K07J01j75J8j60J87k17O3K53k96J27
3654c4Q6N3j28o9rm4J74J85k32J11k57L29l33K0N7J38j98J07q1L8K40k94j74O7
3678b48K39J08j23j8P0k3k08J75q5k53M40K5q0rq9K95m00K61L9k33L02p7j44j32
3702a68L77n1l19L46q1M6k71J54P2m88K74J59j94K91k1k97L6oN21m02PJ50j92
3725e7J96OJ7l61M15K8m53J90J04j61J46j66K88n21J01P0P3J7N2Q9J9n2M0k18
3749a38j78L82o9Q1j19J03M7k76K79j58m3J55j27J66k89K46M8K05k37L55m88J39
$$ plain form
3586 -8 128 -117 91 -273 -64 -207 -163 169 -142 -167 83 144 -197 -157 39 -367 -184 -18 -159 -234 35 171
3608 171 -28 -206 279 20 -5 54 38 -114 -15 98 61 146 201 363 96 110 -49 -78 134 239 98 51 8 72
3632 72 113 -25 31 -46 -271 37 -153 -375 84 -59 -142 65 166 -9 9 -151 36 -181 -118 135 -161 -34
3654 -34 52 105 -23 -92 -101 -145 29 214 -18 93 -164 165 -168 -148 -91 47 -151 -44 -125 -87 153 -141 -315 -248
3678 -248 -9 99 -24 -42 28 5 -203 -28 -113 -366 74 99 19 10 -79 216 -184 77 116 -117 185 108 -36 -168
3702 -168 209 158 -161 185 104 150 -121 33 105 -383 -109 50 -144 147 126 -171 -135 -141 380 -22 -15 135 -57
3725 -57 139 145 162 -199 216 244 -209 -19 85 -76 70 -96 192 -329 -228 -158 -85 -68 -16 73 92 40 80 -138
3749 -138 -316 66 -3 78 -41 62 109 -167 112 -46 -89 66 -61 105 -184 62 110 315 78 433 -55 84
3771H4j8N1l1p5J04n7K51j75j47k3N3l2j52QK76j40PR5j20j29K00J60j94N5L4
3796H5j16m2Q4J55k31m5K32Nj04q0o0K5O7J31j20OK98j20k79o9L02j26kK5K64
3821B85n19K43J08k42K36j89N1l48L47j04r2k03K38J30j48K76k57J11P0K96j64
3842A25k59M5K97k74J01K5koO0p5J3p8j6O7K25k2j41J22j52N2k38J92j95K06j70
3867i8J39o6j90J20N3k1k13K66N2L5j06M4k7o5L08m01pN5J48rl8j16l8K10j7m3
3893b5j62L39L1j37l66M77k2j23Q5J76m83K19k09K61k46L24k03m9K67m0j01k51
3915b38J55J10r6ML23k36j2k0L9k58K85J4Qk43M59k59M9l2J39l31p5L26q5r3K57
3940A90J06o02K50L05j90L4Q3k2l05M39q6l24o8J55J4K7q8q7J25k29M15j68M1
$$ plain form
3771 84 66 117 86 11 115 58 309 134 -13 -36 17 -15 -167 -159 117 -23 -16 79 -41 -170 30 190 -4 51 85
3796 85 -31 -73 11 166 -65 -110 122 127 23 -57 -117 -92 -25 106 -14 -8 290 170 -109 -178 124 -2 -4 21 285
3821 285 -234 9 117 -125 111 -78 -27 -375 -28 -132 -224 -427 -189 -59 -207 69 -188 -77 -7 289 125
3842 125 -134 -89 208 -66 35 60 58 52 112 37 50 -28 -44 23 248 226 85 207 55 107 -131 61 -134 72 -98
3867 -98 41 -25 -215 -95 -42 -63 -276 -10 42 77 -29 15 -12 -77 231 -170 -177 -122 26 17 -21 -137 -175 35 18 -25
3893 -25 -187 152 183 46 -320 157 135 12 97 273 -210 9 -200 61 -185 139 -64 -113 154 114 13 -238
3915 -238 -83 27 -69 -65 258 22 10 -10 29 -229 56 70 78 -165 294 35 84 52 191 -140 -215 111 26 -67 190
3940 190 296 -306 -56 249 59 93 176 154 -151 288 202 -122 -190 -35 -21 6 -82 -169 -44 -273 142 -26 15
3963A5j02K6j41L34k73J77j55J52j80k99K97K21o8jJ26oj82j3L06N3k29m9j4K26
3987B21l39J73j06j14L33Oj90K1L1k5J73j98k19L04p1J86l08K45J61l64KK33o8
4010H7K4j27J20j75J77l5o4l5J52j81J42J22j23l50K41K81l21j43L31K2q9K12
4032B68m39J03j27M10k54j43K14J0K7k67L2K49k52Q0K15k06j29J70r5P4l5K62
4054A67l38pK13j41J03k3j7N9r9J75K2K5j06Oq3J11j32Q4J7L1k0q3K15j49Q1j95
4080h4l3K82k96K02L5j83j98K42j25o7K11j75L33l42L06o4k29J23K21l98R8N4
4102h7k45L11j32K11k02J52n9k00K02N2J59n18K94K07p4J5j88P0J88j85J8j03
4124a14N8j66J44p9r9J18K0J25j58Lj89N41k64M2P7j46k24L90J03l24j73M62m21
$$ plain form
3963 15 -87 -61 -202 132 -141 36 -119 33 -147 -446 -149 72 4 3 129 123 -59 -72 234 287 58 9 -5 221
3987 221 -118 55 -51 -165 168 174 -16 5 36 11 184 -14 -233 71 0 186 -122 123 284 -80 -78 155 87
4010 87 111 -16 104 -71 106 71 7 -28 124 -57 85 207 84 -266 -25 256 -65 -208 123 145 56 268
4032 268 -171 -68 -195 215 -39 -182 32 42 69 -198 -166 83 -169 -89 126 -80 -209 -39 -134 -60 -95 167
4054 167 -171 -178 35 -106 -3 -26 -43 16 -83 92 114 139 33 39 -44 67 -65 19 36 67 47 -36 179 30 111 -84
4080 -84 -117 165 -131 71 106 -77 -275 -33 -158 -225 -14 -189 144 -198 108 44 -185 -62 159 -239 -141 -87
4102 -87 -332 -21 -153 58 -144 8 -51 -251 -49 3 162 -356 -62 145 71 86 -102 -32 156 -29 -11 -114
4124 -114 -56 -222 -78 -157 -256 -138 -118 7 -151 -148 -337 204 -60 -18 59 -87 -311 79 182 -142 -315 147 -274
4147b74L17M8PJ24k01m6n4L8P2O5k92J01K29k02l1J30K65k52m0J55k9j69K16k40
4171f3J47J5kj79k70L18K6j03k8K17k02R3k27K27k50J73pk27L45JmQ3k80K80j25
4196d2N2j6j63K47J38j42J01o9j87j48J93J85J56o8j28j46o4J82K08j21l04J01
4218c5L51l85R0K6O1j56K65j31k84J35K05m01J32J11Q5k20J19Pj5o9J00r7J4J99
4242A07O0j93N0J61q5j01K00M8k63N0K31j32j10K97k61J5O3l3k15K93k39J36k37
4265a58J83N4k73J05P2j27j45J92o1J9L3j30K45j51K99j01m88J98L20q5n0J81
4287A32j14nK1k9k11K64j62K45KK6j05j51K42j0Q4o4M1K4l81P7J95J02k56J46
4311A13j2o2J3j81m0J79j71P6j0m8Kl6P2L2k05l3K83K4m17M46K73n58M09L9k73
$$ plain form
4147 -274 43 91 98 222 21 -25 -79 -41 31 96 -196 -95 134 -68 -99 31 296 44 4 159 130 -39 177 -63
4171 -63 84 99 97 -82 -352 -34 -8 -111 -139 78 -124 -31 -258 -31 -281 -108 -115 -342 3 4 0 83 -197 83 -42
4196 -42 10 -6 -169 78 216 74 175 106 -81 -229 -36 149 305 237 109 -37 -101 81 289 168 -136 -35
4218 -35 316 -69 21 47 108 -48 217 86 -198 -63 142 -259 -127 -16 69 -151 -32 -25 -40 -109 -9 -106 -92 107
4242 107 167 -26 24 185 100 -1 199 247 -16 34 265 133 23 320 59 74 137 104 -111 182 -57 79 -158
4265 -158 25 79 -194 -89 -17 -144 -289 -97 -158 -139 -106 -236 9 -142 157 56 -432 -234 86 1 -49 132
4287 132 18 13 34 5 -206 58 -104 141 143 169 64 -87 155 145 229 165 206 230 -151 -74 121 223 -33 113
4311 113 101 39 52 -129 -169 10 -161 -85 -95 -143 -141 -177 -105 -73 -278 -311 -28 -4 -421 25 298 -260 149 188 -85
4336h5m1L91l8l57k17J82P3M4jP0o0J65j17o2Q5j9J0J8k06R9j58K07K27k24j68
4361a82K13L1oj73K24j62mJ12K67k99k37J69Q0J63rj59j6R2K27j85k97K78P9k84
4385g8K2J74q5O2L6nj00J31j39M4n0m6j34N4K16J14j71k6J31j41p5j06K62k36
4409a46J09J49l59K08j32l1Q1L6L30k89Q8J24k6j64J74N2mj34J73k47j00O3l3
4432g8J74J16k51j6N1J33k31L72j66k3J3j24L05J7k68n6K99m04k9K69j46p0L24
4455B11j02j77O6J89j21r8J03J30l45J10j14J86m9K50k92o6K64J35j19q6O4k39
4477a00K14k4j65P6J00J75j91j21R1O7m42Q0K00L3k0L6q6n5Q3Nj06K46q1K02l24
4502a07R7k8j50N8JO0j35K89j35M5Q3jm3N8J80j53k3J8j05R8K7j49J13j07K00
$$ plain form
4336 -85 -126 265 227 -130 -347 -165 -92 -48 -49 21 -39 126 9 -53 32 13 23 41 -165 -66 -224 -17 210 -14 -182
4361 -182 31 62 56 -117 107 -55 -59 53 320 21 -216 -47 33 196 187 28 12 104 331 146 -151 127 206 -78
4385 -78 -56 118 33 95 131 126 26 157 18 62 12 -34 -168 -114 102 216 45 19 150 9 -66 -172 90 -146
4409 -146 -37 112 -247 -39 -171 -202 -121 -85 245 -44 44 168 142 -22 152 204 200 66 239 -8 -108 -45 -78
4432 -78 96 212 -39 -55 -4 129 -102 270 104 81 94 -30 275 292 24 -32 267 -137 -166 103 -43 -113 211
4455 211 109 -68 -2 187 66 -32 71 201 -144 -34 -148 38 -11 239 -53 -119 145 280 161 75 139 -100
4477 -100 114 90 -75 1 101 276 85 -36 55 122 -320 -240 -40 -7 -27 9 -77 -132 -49 -44 -150 96 15 217 -107
4502 -107 -10 -38 -188 -130 -129 -69 -204 85 -50 -5 78 77 34 92 272 119 96 114 9 107 134 -15 98 -9 191
4527A91j93l99N23n3M5k15J4R3J48k37M2k25M02N0j83k04n0K47q6MJ90l20N2J33
4551c1Qk06L69o8l8L7Q1q1K1k99L62m44K01J9j9j41J37K10j79M0L1j02k60J00
4575b52K38o7j0J98Om00M47Pk78j3J66j60K53P1m76L72k03K33k57J87j09J86l81
4598b42L85k27q6K00K15q0j52k8K28r8K0j22j79J81J37k43J04J02k04K33kQ6L3
4621B61n48L16K0Mr2K5j91j68J03J46N9o4J44m95L60j5J63k70J81j62J07J6J12
4644A2n9J15rJ04m3j28L4R3l29M94p8k05J2J32j83Q4k51L70j34J4J68m37RM39
4668B24j67l88J39J93k29N9J42l9j0p5L84l14RJ09p8J6R9J3k4OJ71l47k0J89M4
4693A06j64J76j48M8l4J09L5k33Q9L39k13j95J34j01k13L68nk1j06N2p5P5j31
$$ plain form
4527 191 -2 -401 122 69 114 -101 -87 6 154 -83 -41 -266 136 186 3 -201 -251 -4 -90 -86 104 -216 -164 -31
4551 -31 -23 -229 140 72 34 71 152 71 92 -207 155 -289 -88 -69 -88 -229 -92 118 -61 -21 10 -92 -352 -252
4575 -252 -14 -81 -91 107 113 -287 160 167 -111 -124 42 -118 135 206 -270 102 -101 132 -125 62 -47 139 -242
4598 -242 143 -84 -170 30 245 165 13 -15 213 115 135 13 -166 15 152 -91 13 115 -89 144 142 228 261
4621 261 -287 29 49 53 -39 -14 -205 -373 -270 -124 -65 -129 15 -480 -120 -135 28 -242 -61 -223 -116 -100 12
4644 12 -47 68 59 163 120 -8 26 119 -210 284 206 1 13 145 -38 46 -205 165 31 45 213 -224 -215 224
4668 224 57 -331 -192 1 -228 -169 -27 -66 -76 -151 233 -81 -72 37 -41 -25 74 87 63 69 240 -107 -127 62 106
4693 106 -58 118 -30 18 -16 93 128 -105 -16 323 110 -85 49 -52 -265 103 98 77 -29 23 -52 23 -108
4716a08K57m41K83n1j56J61J33j98L1n2K00l10j7L31l63L73m6P2o8J15j28J71
4738A89k42j36K61j49L6N0k28K15M4J07j77J45nR8l8J6k42J51Qlj25m9K09j1j04
4763B0J82p9j75k18L59k39Q0J59k12K25j09L9j83J83r2JJ58K38k49p7p0L31j13
4786A59k36J66K1j43k5L4p8J17J44o2Jl74M87J6m15K27J8j90J11j24L5J0L31j62
4810F8k03O7N8j95J14j0n9J70N4J87n05J60J94k3j84K10j46o3K29L3k64L5M11
4833C38l22J78p8J18m34K03K08k76J27K10k60%Q6j96%J54r7P6j04J53pk45%J65
4857cj10r5L20L8l92K59j62J66j94J92jp9Ln5N9K62k26J09k22J09J64k12P4j7
4881a3J31p0j11L53q5l08K74j58k46L57r2R1j06j3K7k96N09k44j21J52p0K06k04
$$ plain form
4716 -108 149 -292 -9 -60 -216 -55 78 -120 -89 -141 59 -251 -268 63 -300 73 27 99 31 146 18 189
4738 189 -53 -189 72 -77 -41 9 -219 -4 40 147 -30 115 110 208 170 186 -56 95 103 100 -25 -74 135 124 20
4763 20 202 123 -52 -270 89 -150 -70 89 -123 102 -7 32 -151 32 -60 -59 99 337 88 11 -59 272 159
4786 159 -77 89 110 -33 -58 -24 -102 15 159 97 98 -276 211 227 -188 39 57 -133 -22 -146 -111 -101 230 68
4810 68 -135 -68 -10 -205 -91 -101 -160 10 64 251 -254 -94 100 77 -107 103 -43 -106 123 156 -108 -73 338
4833 338 16 194 116 234 -200 3 211 -65 62 272 12 12 98 -98 -98 56 -41 35 -69 84 77 -168 -168 -3
4857 -3 -113 -208 112 150 -242 17 -145 21 -173 19 18 -61 -58 -113 -54 208 -18 91 -131 -22 142 -70 4 -13
4881 -13 118 48 -63 290 205 -103 171 13 -233 124 32 123 17 4 31 -265 244 0 -121 31 -39 167 -37
4904c7P3k0q8J59MJ7M0j5Q9j77L9J03j43L12m6k10l3N2J07l72mL29q7j28J96M5
4930B05m1j70O3J8k46J94o7K2J73l43J42j5P9n1K87l34K5j13L46k1k30n1j16J88
4954e6j17K40k44J48J61j02J21j88KJ21j93O1J22J03k76K90K5l04J10O0m7Q2K23
4977C42l27m7J95o5j35P1k5j03j8p1K84q6k53K45J13Ok56J91k94M17j41kj57J47
5001C1kop5m2J61k2J95k64j30J45J02n5J2j61M78l19P3M0r6l00N01l58N5R2j89
5026a34j5l8J14L4J17o0q6r7K30K7l07J15j54K50j0J35L7k97K74l64M04j50pj42
5050a24K8K7K15j95LK01o9j37l3J42L06l17J17q7P8j20J18j83q7J96k68K70n2
5073B9j57j56K90o5q8l2L3l5J04j05L52l2j79O5j54K60j15K73q2k03R0k41q2J1
$$ plain form
4904 -37 36 16 -72 87 91 108 148 133 222 45 84 187 44 356 310 100 67 119 226 -146 -150 179 92 -36 160 205
4930 205 164 -6 57 75 -171 23 -44 -22 151 -192 -50 -65 14 -37 250 -84 -59 -172 174 153 -77 -128 -244 -56
4954 -56 -173 67 -177 -29 132 30 151 -37 -35 86 -107 -46 76 179 -97 193 218 -86 24 84 37 119 342
4977 342 15 -32 163 98 -37 34 9 -94 -112 -183 101 15 -238 7 120 126 -130 61 -233 184 43 41 -116 31
5001 31 29 23 -52 -94 67 45 240 -24 -154 -9 93 38 50 -111 367 48 121 161 65 -235 266 -92 -37 55 -134
5026 -134 -149 -187 -73 -39 78 18 -68 -165 65 92 -215 -100 -254 -4 -14 121 158 -139 135 -229 175 25 18 -124
5050 -124 -96 -69 146 -49 -46 155 86 -51 -84 58 364 47 164 77 155 35 153 -30 -117 79 -189 81 29
5073 29 -128 -284 6 -59 -147 -179 -146 -181 -77 -182 170 138 -41 24 -130 130 15 288 206 3 93 -148 -230 -219
5097b19M01j85j71J40k7K6J74k53R1P4N3k04k40M42Q2k36M3p7O3k4R9Ok05J10
5121c7K01k96J15N9p0l3k1J99m6p1P0OJ57j52K86n58PJ64j78J44K59j70J96r9
5145A32j71J19J7l3k62K28j3k95L18L4P1k21J19L66l39J08m3qk82J09J11j1j25
5168g1pL49j09k87J09k8K4R1J91k69n5l2M8N0k7J34j10j0J24ko1n0lL5N5O6o2
5195I3J8J25j50J11j12j83J26j8R1pj64J84l7J42j26m9l3l1q0O7N0R3j21k3j26
5220a60l3K06n8J52k24L38l73M13l48j49J20J33k28L09q0j4M3j20J17k36K51l06
5242b47K00j26L03l7j01j11J53k18K85j75J06j34K6J08o2r9J86K5k50L16k11L0
5264c3J14l6L5o0K55l34j05K97J8k60RJ26R6k10J9J08m0k67L20O9k87K50L3l35
$$ plain form
5097 -219 182 -3 -174 -34 -61 -35 139 -114 -23 51 104 -100 -340 102 184 -52 -9 -86 -23 -47 52 58 -147 -37
5121 -37 164 -132 -17 42 -28 -61 -82 117 71 0 70 76 233 81 367 -191 -184 -20 -198 -54 205 35 231 132
5145 132 -39 80 97 64 -198 30 17 -278 40 74 145 -76 43 409 70 178 135 127 -155 -46 65 54 -71
5168 -71 -78 271 162 -125 -16 -44 -20 71 262 -7 -62 -94 -46 4 -23 111 1 -9 115 113 52 2 -1 34 89 155 93
5195 93 111 236 86 197 85 -98 28 10 101 94 -70 114 77 219 93 44 11 -20 -100 -33 17 110 -11 -34 -160
5220 -160 -193 13 -45 107 -117 221 -152 261 -87 -236 -116 17 -211 98 18 4 47 -73 44 -192 59 -247
5242 -247 -47 -173 130 93 -8 -119 34 -184 101 -74 32 -102 -76 32 -30 -129 57 82 -168 148 -63 -33
5264 -33 81 45 80 20 275 -59 -164 133 151 -109 -100 26 122 -88 -69 39 -1 -268 52 121 -166 84 117 -218
5288b18K12l9J57kj03o7J78l6r4j39K62l98M15j30Ok10K83K6q2J26mk25q9L3J98
5313F0M7q2J18k82K13m9M2j0j27Q1K05k27k3R8Ok11q4M78O0l96J4Q3j97J95J89
5338B01l23p6L39l18J49r5J8R5r9J38J70k03J11k97K43r2Q2j04j34O8J1J31j11
5361i6O4R5m9l5L9N1J75j49j81K9K7O4k75K02K18k37pK06k80J92l1K03K1k30j84
5386a68K03k01N8K8j17J59p6J34K8J05j60N4j4n5j71K09j22O2k0J99j28k08J83
5409a8N7q6J40j34l24L37N0J8k37J6K31l7j93Q5K08j83o9P0K8P7j8R9j18p4O4
5434a1J08j68K61j61o9O1J11j44O5l2P7o1k1j05N6r8j06J11P3J43jl14M65p5l23
5459a58L28k95o3K79j61J51J0R9j86j35N3j16R2J16j31R3o9N8m0P0J03k61J92
$$ plain form
5288 -218 -6 -45 112 110 7 -60 118 82 -12 -151 111 -287 128 -2 4 -206 77 103 21 147 143 -82 -171 -138 60
5313 60 107 25 143 -139 74 25 67 57 -70 11 216 -11 -34 64 70 -141 -225 253 313 -83 -69 14 -183 12 201
5338 201 -122 -198 141 -177 -28 -123 -105 -10 -109 29 199 -4 107 -190 53 -39 43 -61 -195 -127 -116 15 -96
5361 -96 -32 63 14 -21 18 69 244 95 -86 -57 -30 34 -241 -39 179 -58 -65 141 -139 53 22 225 246 16 -168
5386 -168 35 -166 -108 -80 -197 -38 -114 20 48 153 -7 47 33 -22 -193 16 -106 -44 -64 135 7 -201 -18
5409 -18 39 -47 93 -41 -365 -28 22 40 -197 -181 50 13 -180 -95 113 -70 -139 -69 -41 36 18 117 -1 -75 -11
5434 -11 97 -71 190 29 -40 21 132 -12 53 21 98 37 16 -89 -33 -131 -237 -126 -53 90 89 -225 240 165 -158
5459 -158 170 -125 -188 91 -70 81 91 190 4 -131 -78 -194 -102 14 -117 -24 -93 -35 -75 -5 98 -163 29
5482B9j98N1%J88j06R2m5j91J96l3N0o3m2J59k35M3J07p1j0L65l55o7K20k66K59
5507G7j01J61n8M0j50J34R1m64L62ok04J67o4l6J93l51K81j68k33N20j31m35N42
5530A67q9pJ83l40J6j57K65J64k08J62j79R9M2k55l7O8o5K42R8j25j21L4O1K0
5554C8J09j33J63j91M5j50jQ5J06j7j97K69l0q6m5N3k7p3l4M1O1O7l8J90k48M6
5580Ck7J77j15J12K1k8j10M1j94j83M6K38J15l7k32K37j51J33Q6k76j22K53n9
5603g2M3RJ50j04l8J29j00m6K9p1Q3j77L07K39n81L69J51l41k27J85O1j47P3r5
5627a71K79k09P1K3k57J93J17L2q9mj50J13N0q0J83q5K5J39j04j31J94l30J09
5650h2j07l9L08P8J34k75l6k26M01k75J08Ok3J41J63q6p6o4m1Pm1J95j04r0lj84
$$ plain form
5482 29 -169 -118 -118 70 -36 56 11 -180 16 -17 33 -30 -72 87 -148 -105 2 -69 -79 286 -69 -136 84 -182 77
5507 77 -24 137 79 119 -31 103 194 -270 92 86 -118 49 -15 -51 142 -209 72 -96 -329 191 60 -375 167
5530 167 78 71 254 -86 -70 -227 38 202 -6 156 -23 76 118 -137 -174 -106 -171 71 169 44 -77 -43 18 38
5554 38 147 14 177 -14 31 -119 -120 -35 71 54 -143 126 96 10 -35 18 -9 -82 -116 -75 -14 53 15 205 -43 3
5580 3 -24 153 38 150 171 143 33 74 -120 -303 -257 -19 96 59 -173 64 -87 46 132 -144 -266 -13 -72
5603 -72 -29 -20 130 26 -12 117 17 -29 0 -71 12 -165 142 381 -200 169 320 -21 -248 -63 -2 -149 -76 -171
5627 -171 108 -101 -30 -7 -264 -71 46 78 -11 -15 -165 -52 -2 -82 101 16 41 180 76 -55 139 -191 -82
5650 -82 -189 -228 80 158 292 17 -19 -245 156 -119 -11 -5 -28 113 276 190 114 50 9 16 -25 170 66 -24 -27 -211
5676b11J13j74J32K0r8L15J62k57j21p2M5K66k66L19m86K94N2k59L02k72K16M2
5698F2j01J39j81J63j02K4P4k58mK30l1J11o3k86J49o8j28L03J80l36j25J24J28
5721Dp6N1J06j5K51n6n35L70O0j00j42L15l76J31n7j29J29J65j42J61J7J44j37
5744A39j19L66m83R2j33L71l33K04j07J19k49Q4J35j46M0n3J45k25L30j96l0P
5766d2L28l78j0M8j75J13J03p3j78L82j27j89P0K87k78K6r1K67k34K85j27m5N3
5789A5K7j08J92l4j26l3L8o5l9J45J11k04K43k00j45J66r4O6j4o6j89L84j07r9
5813a36J66Q7q0K04k35l09J81O8J85j28p0k64M43J93m97J22J33O9l26J61j54K24
5835C7J04k87QQ3J1m9J11j09j7J32P4l75M05j63j93N10m40L10k29J69k08P1j24
$$ plain form
5676 -211 -98 -272 -140 -120 -218 97 259 2 -119 -191 -146 120 -146 173 -313 -19 33 -226 76 -196 20 62
5698 62 -39 100 -81 82 -20 4 78 -180 -184 46 15 126 63 -223 -74 -142 -270 33 213 -123 -248 -124 4
5721 4 -72 -21 85 70 321 265 -270 100 160 60 -82 233 -143 -12 -69 -198 -69 96 -46 115 132 276 139
5744 139 20 386 -97 -5 -138 233 -100 104 -3 116 -133 -49 86 -60 -20 -73 72 -153 177 -19 -49 -42
5766 -42 286 -92 -102 -54 -229 -116 -13 -86 -264 118 -9 -198 -128 159 -119 -93 -184 83 -151 134 7 -38 15
5789 15 42 -66 126 92 -34 -67 -29 -94 -133 12 123 -81 162 -38 -183 -17 -111 -45 -59 -125 -314 70 -37 -136
5813 -136 30 117 37 241 6 -303 -122 -54 131 3 -67 -331 112 305 -192 -70 63 132 -194 -33 -187 37
5835 37 141 -146 -138 -55 -44 -93 18 -91 -108 24 98 -277 128 -35 -228 282 -158 152 -77 92 -116 -45 -169
5858a69R3J07l5k48L17m2k70L94k20J08j24K55k57L37l65R6r7J11R1j18J09j32
5880e9L3k13L08j46k00J90l3J26r5J95k49L42k31O7O9J00N9k33m1O9j81o6K04
5903A5p3j91K41j93j2L03k08j38K94j46Q0j69K42j36J04J77j83J41k89J93j91
5924a39k13M35K1k5k90J07Q9NMO6K6p0j72L77l52j33K19K18q4N1l86K03J0k9J96
5949A34l03K42j70K04j20N8l2p1L03j50k32J53k80K60j4J46k18J67J22j31p8j05
5971a15L8l3J58j31p1J74j24Q9L4k09J19nJ27K62m41J56j30L1m1J20q8K01k7l22
5995b28l2K81p8j87M47m77M86l50Q7J74n9k7Q6J0J81m12K3K02J79l99p9J21J83
6018A32r4k6J72q7N2j65J65j09N6k27J16R9j60J58j81K04l1j65K06j54K33n4m7
$$ plain form
5858 -169 -76 31 -4 -252 65 23 -247 147 -73 35 -89 166 -91 246 -119 -23 -120 -9 82 -36 73 -59
5880 -59 -26 -239 69 -77 -277 -87 -120 6 -89 106 -143 199 -32 35 104 204 263 30 -11 58 -123 -189 15
5903 15 -58 -249 -8 -201 -213 90 -118 -256 38 -108 -28 -197 45 -91 13 190 7 148 -141 52 -139
5924 -139 -352 83 104 79 -211 -104 -15 -10 -6 60 86 16 -156 221 -131 -264 -45 173 89 140 -246 -43 -33 -62 134
5949 134 -169 73 -97 107 -13 45 13 -58 245 95 -137 16 -264 -4 -18 128 -90 77 199 68 -10 -115
5971 -115 -77 -110 48 -83 -154 20 -104 -15 19 -190 -71 -76 51 313 -128 28 -102 -71 -112 8 -80 121 94 -228
5995 -228 -260 21 -57 -244 203 -274 212 -138 -51 123 64 37 123 133 314 -98 -75 127 306 -93 -172 -51 132
6018 132 38 12 184 97 149 -16 149 40 96 -131 -15 84 -76 82 -99 105 74 -91 115 -39 194 140 93
6041I3Q7J16j78r4K3l4M10l39j6j15q2L62j46l6n3L49k51j37J66J15l65J36J57
6064A68j43j95L78k00j1k40K41J8J70r5m5J88k06j75N1N7Oj29K3M5j09K76k35
6087a62K64L1j33j3o5N1M6j27J63M1p9j85J95R8j29q9q0L71k64n4L52j13p2J9
6111F6k56K50m0M4j1j20K02l2J9j92n7K91j41j17L48k49j35L09k71J23P3k66P
6134a55q0L15j82LN7L6j79Q0kK35k9M5j9j10M1Pl8p2l2L68q2j60Q1j56l29M68
6160A11j19k5J18j74K38j28K6P9l77L53Q0k26L7PL2j05K44m33J75K08n9J4j68
6183i2K28j62J18J9j3P1p7rR6r6k68M26k06J3m5q8K79l92L92l13J27J29O6j19
6207H4K8m8P1k4k85J09K65k16j38K46j41n3L50k90J54R4j28j41j55L74Q7k68j3
$$ plain form
6041 93 180 296 118 24 47 13 423 84 68 -47 -129 233 87 51 -2 347 96 -41 125 240 -125 11 168
6064 168 25 -170 208 8 -3 -243 -2 16 186 91 46 234 28 -147 -96 -39 -33 -162 -139 -94 -203 73 -162
6087 -162 102 133 0 -13 -78 -27 19 -108 55 96 17 -168 27 125 -4 -93 -173 198 -66 -120 232 119 47 66
6111 66 -190 60 20 64 53 -67 135 103 122 -70 -127 164 23 -94 254 5 -130 179 -92 31 104 -162 -155
6134 -155 -235 80 -102 -99 -42 -6 -185 -105 -107 128 99 144 125 15 56 63 25 -47 -79 289 207 47 128 -28 -357 111
6160 111 -8 -33 85 -89 149 21 47 126 -251 102 182 -44 -7 0 32 -73 171 -262 -87 121 62 76 -92
6183 -92 136 -26 92 111 98 169 92 83 179 83 -185 241 35 48 3 -85 194 -198 194 -119 8 137 203 84
6207 84 112 64 135 111 -174 -65 200 -16 -154 92 -49 -102 248 -42 112 206 78 -63 -218 156 243 -25 -38
6230c8j39J36j32Q7J82j25J31k84J43L25k77j82J52M5K5l8j3J16O3k12j17J63
6252A1J13P5j30n5j32O7P0no8j85M69l16K92j46j58K72j73N7o5J5m9k28L28j51
6276i2Q3Qj12J99j48j72K97j35L0M9q6k5O6p7M9j19K40k46K45Q1k58K10J3R1j7
6301A74l25J15Q3j00J57k16M3k6K18Ok40K6J27j73j0J6J82L2j01O2j59N7K1M1
6325A0K41m23J07j2nJ03M3j13j09P3M0k4J24n9k56K99O8j62N4M9j88J85k86L81
6349A40l81J59L7K6k49K53j08r6L63k99J39m9j27K60k15p5k1L24M0j92K7M7JM6
6373E0P2j87K06o7n7k0k8Qn4J31l08J33J52l5M4q2J12j06JL8j44p8M73j15l16
6398a77R7n0J14k9J10m6q8qp7J22J79n2j80k8J9J4K85k31j5L6l2m6P1R2n5j14
$$ plain form
6230 -38 -177 -41 -173 -86 96 -29 102 -182 -39 286 9 -173 -21 24 49 11 -2 114 177 -35 -152 11
6252 11 124 199 69 14 -118 -51 19 14 -54 -239 230 -86 206 60 -98 174 1 58 -7 8 -41 -269 59 -92
6276 -92 -9 -1 -113 86 -62 -234 63 -72 -42 7 -79 -104 -38 -115 -66 -185 55 -191 54 135 -123 87 100 191 174
6301 174 -151 -36 47 -53 104 -112 -69 -95 123 129 -111 -85 42 -131 -141 -125 57 89 -12 50 -109 -52 -31 10
6325 10 251 -172 -65 -77 -82 21 64 -49 -158 -85 -45 -69 55 -4 -260 39 107 -55 -1 48 -140 45 -241 140
6349 140 -241 -82 -45 -19 -268 -15 -123 -219 144 -155 -16 -65 -192 68 -147 -222 -243 81 121 -71 -44 3 4 50
6373 50 122 -65 141 74 17 -3 -31 -23 -77 54 -254 -121 31 -4 40 -42 70 -36 -35 3 -141 -219 254 139 -177
6398 -177 -80 -130 -16 -45 65 19 -69 -77 -154 -32 147 95 -85 -113 -94 -80 205 -26 -41 -5 -37 -83 -12 80 25 -89
6424h9K41j62R9j17p3J43r1O4l6Q5j4mj35Q4k30K58N7l4J18j54M1j28P0j77K50
6449F6P5j11Kp8R2P2m9j74K2O4J56J2J6l1k15K1J73p5k53K90j04l5m9m0K50N3
6475A50M3k6j47j55P5P1O1k51P3L7J48j07j28K20j2j56K82l01N7n1J90l0J9O6
6499A28q5J62j74P3r6P3o9k89M88k10J12j56J91j6k25j52J22K81jp6j07K78j94
6522E8j14nK58k40m9o0j43L08P0r2k04K60j55n3J78J01l90M52k30K05k09k11K76
6545A1k3J57p6j9l7L2k10L7n2J78J12l4l04J29J82j47K52k66J56n8n7ML34k70
6569C1j62K01R2l7m00L55j0p1n9j5J60q1j85L51l33N7M12n69K36K2p3J39q0J5
6593dk86K40M5r7L53k21k2J44l04J22J56k20J53j46K28l34j6K9O9P7j32L18j90
$$ plain form
6424 -89 152 -10 89 -28 -101 42 -49 15 -21 64 50 46 -89 -5 -235 23 80 46 164 10 51 -77 -7 -184 66
6449 66 141 30 32 -46 46 118 69 -105 -83 -19 137 149 165 134 -81 -60 113 38 -215 75 -29 -64 -113 -153 97 150
6475 150 193 167 20 -135 -60 11 72 -179 -106 -69 79 -28 -156 64 52 -104 178 -123 -66 -117 73 43 62 128
6499 128 43 205 31 104 8 81 12 -277 211 1 113 -43 148 132 -93 -245 -123 158 157 81 -26 252 58
6522 58 -56 -61 197 -43 -92 -152 -295 13 83 -9 -213 47 -108 -161 17 118 -272 180 -50 155 -54 -265 11
6545 11 -12 145 69 50 13 45 -165 -128 -180 -2 110 76 -228 -99 83 -64 188 -78 78 20 -37 -33 301 31
6569 31 -131 70 162 125 -275 80 70 -1 -60 -75 85 4 -181 170 -163 -106 306 -263 -27 -5 -78 61 -19 -4
6593 -4 -290 -50 -5 -102 251 30 8 152 -152 -30 126 -94 59 -87 141 -193 -209 -180 -111 -34 -166 152 -38
6616c8k22O6J43M5j68M14j00j66J53n8j31j46J87m3L0J48j91J13J53n7k89L26
6638A69k53K28J8k84K88M2k27R7o9K03r2R0p3k45M7K14l16K89j68J12o6L3J03
6661A40l41J79j84M68k92j06Q9K20k05o8J12o7q0J3r4K86j65J81pj4j20J8J30
6684I3j82J11j42K95j22k31M57k17q6J96j24J7J57k25m4K4K31k7m18L00r8j59
6706a94K05n0J72j57J09k09K32k06j6J76K50m97J1K61J0j58j82L07k21L85k99
6727g1K26k03K08j98l0K39m35M12l1k29J84j85J25j14m0K02k54K11K1J41j34j79
6749a34K42k41J27K4j35J19km3j58J15L11l10l5M4L0R7j75K51k58J43j14L11k71
6772f2j34L99j84K61n41L33J7j5P3k30j93K51QJ45j62j08K1P7K76k64j39J64J09
$$ plain form
6616 -38 -260 -194 -51 -6 -174 240 140 -26 127 69 -62 -208 -21 -64 -34 114 -77 36 189 132 -157 169
6638 169 -84 144 162 -122 166 208 -19 78 9 212 120 210 137 -108 -61 153 -163 126 -42 70 4 37 140
6661 140 -201 -22 -206 262 -30 -136 -47 173 -32 -100 12 -55 -135 -122 -216 70 -95 86 79 65 -55 -37 93
6684 93 -89 22 -120 175 53 -178 279 62 -24 172 48 65 222 -3 -47 -23 208 181 -237 63 -35 -194
6706 -194 11 -39 133 -24 85 -124 108 -98 -114 62 312 -185 -174 87 97 -61 -243 64 -157 228 -71
6727 -71 155 -48 160 -38 -68 171 -264 148 117 -112 72 -113 12 -102 -142 60 -194 17 38 179 45 -134
6749 -134 108 -133 -6 18 -117 2 0 -43 -201 -86 225 -85 -120 -76 -46 51 -124 127 -131 12 -102 209 -62
6772 -62 -196 203 19 280 -261 72 89 74 147 -83 -276 -25 -17 128 -34 -142 -121 -44 232 -32 -171 -7 102
6795A02j48l3J26j75N4J6J40J70l44N1J23p8J22m7j03j79L73j71N0l16K78m8k43
6818b80L87j53k2J42j55O4j60K57j86J40J14k27J11j37K80Rj00k85K2K02O3j29
6840d3J87l5j01q6rQ7l2j58K84j48M3P8K4Pk1o3j09J24j95J67j22J13K2L8k73
6865b21J5J85JR2N2J31j69n3m3O7k23L4lJK0Q2J39j66M9j50L1J13O1L4l61K02
6891h0J72k01K11j55J27j11k7K27l0l63j23K52N7J16l7L3j9J08J3l88Q6m5K34
6914E7Q7l46L36k91P9P4J46j47j29K97m08M54j20mm5K8rj27k51K98k89J53K82
6937A25N5k84K24l66q8K54J92j25J45J29j00l11J15R3k46J97J36k13L7J57j95
6958f9K08J8k94J68J03l24J20j0J63j61Q6k42K66q9J69J03l28P0M9l7%J37K82
$$ plain form
6795 102 -46 -79 47 -128 -74 -58 82 252 -92 -41 82 4 126 79 -24 -203 170 -1 49 -267 11 -37 -280
6818 -280 107 -46 -68 74 -81 -17 -177 80 -106 34 148 -79 32 -105 175 184 84 -201 -179 23 86 -43
6840 -43 144 109 8 -78 -87 0 -32 -190 94 -54 -11 67 91 98 77 14 -95 29 -166 1 -121 -8 14 52 -221
6865 -221 -206 -21 -20 72 124 255 86 33 -10 57 -166 -132 -135 -134 -114 -32 107 -59 -10 -160 -129 -16 45 79 -282 -80
6891 -80 92 -109 102 -53 74 -37 -64 163 133 -230 -353 -101 -44 72 35 68 49 157 170 -218 -132 -177 57
6914 57 144 -202 134 -157 -78 -4 142 -5 -134 163 -245 209 89 85 40 68 59 -68 -319 -21 -310 -157 125
6937 125 180 -104 120 -246 -334 -80 112 -13 132 261 161 -150 -35 58 -188 9 145 -68 -31 126 -69
6958 -69 139 157 -137 31 134 -190 -70 -80 83 -78 8 -234 32 -57 112 215 -113 -43 6 -31 -31 106 388
6981C88n33K18q2J58j18j7j1Q4j26K11j20k55L41q2Q5j96J18k1j32K03j06J33
7003A40k63J21j69J85r0K29k37L14k79J48J87j62j09J2J99k18J01K2q5j70L65
7024B41j59k5n7j14J48P4k58L32j20j45K19l78J58L6J9n4q2J72l8m1K76l09m7
7047a52K2K27J22k00k5k98K58P7Nj4j64K08k33K90j77j0l4J24j32j5N1O2K51k47
7071dj6l7J62l16M74k11l9j67J88P7j10R4j32K12o6k36n1K21O8j01k8R5n3M1l
7096F2j38q8L18j50LJ4M3j29o2k8K71k22K26j58k6J08L4L7r4O9n8m6J76l39K77
7121A00j17j34J99k13J66M2j13L1K53l35K92k12R7K8k25L10m7m1l45K57l0j37
7143a74K33j39K19k11kP3R3l38J60J02O9j01M1R9j82l7K63k11R8Q6k91L26j37
$$ plain form
6981 388 -145 73 -9 149 31 14 3 87 -39 172 52 -203 138 56 141 -55 63 42 -90 113 7 140
7003 140 -123 -2 -171 14 -76 153 -84 230 -49 99 286 124 15 27 226 8 109 131 46 -124 241
7024 241 82 57 0 -114 34 108 -150 182 62 -83 136 -242 -84 -48 -29 -83 -165 7 -31 -72 204 -105 -152
7047 -152 -130 97 219 19 -6 -304 -46 31 36 22 -142 66 -167 123 -54 -64 -98 26 -106 -121 -70 -8 243 -4
7071 -4 -20 -57 105 -211 263 52 13 -154 34 111 1 95 -37 175 109 -127 -178 43 111 10 -18 77 24 65 62
7096 62 -76 -164 154 4 7 21 64 -65 -127 -155 116 -106 120 -38 -64 44 78 115 21 90 32 -14 162 -177 100
7121 100 -17 -151 48 -165 1 43 -70 -39 214 -121 171 -41 56 84 -141 169 122 81 -264 -7 -37 -174
7143 -174 59 -80 139 -72 -74 -1 92 -246 -86 16 85 -16 25 124 -58 -95 168 -43 55 141 -150 176 39
7166C9K17l69K27jRmK28l95J42k10J28R5l1k09K86n1k57Q2M13o09L56N5Rl5j79
7191f4J44k56K51n9L3K1k74J85K43k07N4j87l7K88o4L0o3M4n1j49K92j6p3k34
7215a49K12N3k01J53k20kK52k75K13k04L02J1j05J90j01K1k48J71j14kJ59j37
7237b1J77j09J14l93L0J19P7j05J54p3qn3ml5K60j34k85N59l41R1j4J56k5j54
7261a7m4n0OJ41j31K41k14J89o6n3jj68J66k08L99k2j24p3j21K87l19J61K81k44
7285A6P7n8q9R0k30L17j98M1pNK85l36K9J8j59J82J53l95K08J76m57K25LJ27m6
7310b3j78L94j00j27q5J97j40J82j52L1j44L84l43L27j85J60k79J27nj53J05j30
7332a37j94N11k30rJ78k0NJ91k10r4R8p9l43L81j53K13j74K78k49L8m2R5j67K91
$$ plain form
7166 39 256 -113 114 113 122 118 346 -49 93 -117 11 106 75 -134 152 101 -156 -74 339 -270 86 141 150 115 -64
7191 -64 80 -176 75 16 49 70 -204 -19 224 17 71 -116 -153 135 71 101 38 82 31 -118 174 158 85 -149
7215 -149 63 116 -85 68 -152 -154 98 -177 36 -168 134 145 40 230 129 150 -98 73 -41 -43 116 -21
7237 -21 156 47 161 -232 -202 -83 -6 -111 43 -30 -38 -91 -95 -130 130 -4 -289 270 -71 20 6 162 137 -17
7261 -17 -61 -111 -105 36 -95 146 -68 121 55 2 1 -167 -1 -209 190 168 44 -29 -150 137 -182 -21 260 16
7285 16 93 35 -54 36 -194 123 -75 -34 -41 -36 249 -87 -58 -40 -199 -17 136 -259 -51 125 -332 -107 -104 23 -23
7310 -23 -201 193 93 -34 -119 78 -62 120 -32 -1 -145 239 -104 223 38 198 -81 46 41 -112 -7 -137
7332 -137 -331 180 -50 -59 119 99 104 295 85 -9 89 10 -333 48 -105 108 -66 212 -37 1 -41 54 -113 178
7356A78j97P5o3m0K2l4Q2j3k02K22k37K85k36K13J28l00L7J66j83O1J9P6j00K83
7380B42j02k04j30M1J42J24p6j8k2k51P3K78k77n4P5J52P9j71Q2O2k61L92J1k82
7404i5J13j88K6L78m4k00J2R5k00p1L76o9k99J24j92LJ34L74m07M2J27Q3J0j12
7428B0o3k08J80J59q7m2j38K66r7q6Q2j1J12q2J71l33J07JP7l6j55r4Q9m4M11
7453A99k93O7j22J9J82j65L9k79N10k09K56l82K87j89K03j33o8K12K8l41J0K59
7475I0r4pj51J92J05J09q3m5j7q1J48o4l7qPj6j16%K53l33q9J54K30l8j68J41
7501H2J27l28m9K72l08J72j88K04J21k09o2N0l4J92q5nQ2O2J68l52N9j3j21J58
7525eJ36k07N8j82J83J20nk46J70J83k02J92m11L88k58k2k5J91l8l8O8p6N0K2
$$ plain form
7356 178 -19 56 -7 -47 -25 -59 23 10 -192 30 -207 78 -158 55 183 -117 -80 86 -97 -36 -17 59 -41 242
7380 242 140 -64 -194 -153 -11 113 37 19 -3 -254 -181 97 -180 -234 -159 -7 72 -99 -17 45 -216 176 187 -95
7404 -95 18 -170 -144 234 190 -10 2 97 -103 -174 202 133 -166 -42 -234 -231 -97 277 -130 -88 39 122 132 20
7428 20 -43 -251 -71 88 1 -41 -179 87 -10 -96 -14 -25 87 5 176 -157 -50 -49 28 -8 -163 -257 -168 -212 199
7453 199 -94 -27 -149 -130 52 -113 -74 -353 157 -52 204 -178 109 -80 123 -10 -78 134 162 -179 -169 90
7475 90 -4 -11 -162 30 135 244 161 116 99 18 166 102 65 57 64 48 -68 -68 185 -148 -237 -83 147 109 -59 82
7501 82 209 -119 -168 104 -204 -32 -220 -16 105 -104 -166 -116 -150 42 -43 -48 34 96 264 -88 -29 -42 -163 -5
7525 -5 131 -76 -18 -200 -17 103 98 -148 22 205 3 195 -216 172 -86 -108 -133 58 20 -18 50 -26 24 46
7549D6J32l27K80j04K9q4Ko4m6K01lQ3j83j6LL5j49PK69l04J89r1J53O1j28N2
7575D3p2L0Q7J5l2k65K40j39L74l57j15J41J25o8m8K85l93M0Q0R9N7J24l12j24
7599a85K64j87j49K11j43K34m8J42k69J12LR3J3q9K03j18J07j96j5M0j00J23K19
7622B65l29J20o8l9k6J47l2k4k59J08J85j65M9J42k15L59l7L4m00J96J1j14K45
7645A53L2k71R5L6k41J10J7P2j11J23q5P5J28M9j88k0l6K16k08J4J45q1m3m5J27
7670F3o0n5O6j20J34M1J27l5j53p6j00O9J99k81K25l0J96j6j99J01m7j86M4L55
7694B62k66K36r8j31j6K01q9J07o04K79l1j9L94n2K2k19R8j16q3J76L2j13N8j6
7718A2Qj25N4K15j01m9l4j14J70K1r6R3j67J76m4R7o2MK6j54M55n54M55r5k68
$$ plain form
7549 46 178 -149 131 27 56 -28 -26 -90 -136 65 62 145 -38 -54 -51 -16 -165 -158 111 -193 -4 -95 58 119 -9 43
7575 43 -29 1 88 103 71 -194 46 -93 281 -76 -191 -50 75 7 -41 244 -149 -109 -29 70 127 251 -61 -185
7599 -185 79 -108 -257 -46 -189 45 -3 139 -130 -18 -15 78 91 2 205 87 194 -2 -17 23 -77 46 265
7622 265 -64 56 -12 -51 -77 70 38 14 -245 -137 48 -117 -68 74 -141 218 181 215 -185 11 22 -92 153
7645 153 185 -86 9 45 -196 -86 -69 3 -108 15 -70 5 133 182 -6 -26 -62 154 -54 -40 105 24 -19 -64 63
7670 63 3 -52 14 -106 28 69 196 161 8 -68 -168 -99 100 -181 44 14 210 194 -5 96 49 -137 -93 262
7694 262 -4 232 134 3 -13 188 99 206 -398 -119 -150 -169 225 173 195 -24 74 -42 -125 51 83 -30 28 12
7718 12 20 -105 -51 164 63 14 -20 -134 36 57 -39 54 -113 63 19 116 54 58 84 -70 385 -169 286 191 -77
7743g7L5M8j96M2J94j43P4O5PK05j54J37l71L20j41j4l0Rj17K03j78l4J37k75
7767b54L13J9k05J03p1O6K9j94O6J97n8M3j2M4J18k49N2m7j00J00k4m4J50r3j05
7792a56J83k6j02r7L34M1l11K35l16K07k9j13K38j34Ro5K54l10R3L9J45j83J49
7815H5k99K95j60mj27M24m9k00K91k22M0K43m77P8p1k41K70rM5J36n0O4j13l2
7839h3J30j02J89k31K60j16j66K9K61O3j61o7j63L25k04nJ23k46RJ42j5N5j88
7862a61Q3J54j55J71L5j81J7J18K8k52J79P8j87J45l3k38J17K74PO0l31J31J94
7885B53j87j71k16K70j71K72j46l4K75l17J15K45k56O8j51K74p8J56k08P3p7j59
7907a70L17j7k70K51k54J85j96L84k42j54K25p1K9J20k1j39L67k14q0j64Q9m2
$$ plain form
7743 -77 -42 6 -190 -148 46 -97 -23 42 49 254 100 237 -134 186 45 31 1 10 -107 96 -82 -116 21 -254
7767 -254 59 78 -127 -24 -95 -29 0 -194 -128 69 11 54 42 86 204 -45 7 -40 -140 -40 -64 -108 42 -51 -156
7792 -156 27 1 -101 -198 136 177 -134 101 -215 -8 -37 -150 88 -46 -37 -102 152 -158 -65 -26 119 -64 85
7815 85 -214 81 -79 -83 -210 214 165 -35 256 34 74 317 -160 -82 -153 -394 -124 -133 -88 48 -2 62 -51 -83
7839 -83 47 -55 134 -97 163 47 -119 -90 171 234 73 6 -157 168 -36 -41 82 -164 -155 -13 -28 27 -161
7862 -161 -78 76 -79 92 127 -54 -37 81 109 -143 36 114 -73 72 39 -199 -82 192 199 259 -72 59 253
7885 253 66 -105 -321 -51 -222 50 -96 -130 145 -172 -57 188 -68 0 -151 123 45 201 -7 66 -11 -170
7907 -170 147 130 -140 111 -143 42 -154 230 -12 -166 59 -12 17 137 116 -23 344 130 50 -114 -25 -67
7929f7M1L10l25J09q1OJ36k9k01K07j69K34r2j53pK17l18J06J9K98l09J58l9k26
7953a75L56k1n0l7N1k83K53k24J38N9K4r0J26Q2l34N2J05p4l5r8K11mJ40j05q3
7978a6Mq0qJ37m8J73p7p4k17K64p6J09k6k21J84K06k78J53L6k19m7K20L0n6n2
8003B1L5k25J47q6M30n20K03K50l87K48Mk95L39j70P6K1J3l47Q5L39j28M5p2J08
8027A34k20J50q5O0j19O4O0P9r2p0l7K84m26L31k24j4J21L6L45o20L43l9q0R7
8051G8p3J78q5J14j31Q5L1k90K74n9Q6k06j9pr6M1L5R8Nq1RK4j71K23J87p3k33
8078e6n7P5O2L6j51k3J63n6j76P3J56l18K30P9l86K85j79L18r1j20J11l8R5l5
8102cK35o1j23J69l14K23J51j71q0Q7j26J12k24J42P9n9J79k7J3k52n7K06k0k37
$$ plain form
7929 -67 -26 284 -41 68 -13 -7 129 100 -101 106 -63 171 79 -74 -81 136 -182 -76 -57 241 -68 90 51 -175
7953 -175 181 160 110 73 124 -159 94 -130 8 67 91 1 127 209 -125 -73 32 -42 -77 -175 36 32 172 67 -16
7978 -16 -12 -92 -100 37 -11 162 85 11 -206 58 -18 91 65 -156 28 234 -44 109 145 -74 -121 99 129 73 21
8003 21 56 -169 -22 -108 322 -198 5 255 -132 116 120 -175 164 -6 70 91 104 -243 -158 181 53 98 26 134
8027 134 -86 64 -21 39 -80 -16 44 123 31 -39 -76 208 -218 113 -111 -125 -4 32 377 -243 100 61 -19 78
8051 78 5 183 98 212 81 166 197 -93 181 122 208 2 -17 -24 -120 -79 -44 54 59 -22 -13 11 -160 63 250 177 -56
8078 -56 -113 -38 24 60 -91 -114 49 -7 -183 -110 46 -272 -42 37 -349 -64 -243 75 -16 -136 -25 -63 32 -3
8102 -3 232 171 48 217 -97 126 277 106 26 113 -13 99 -125 17 96 37 216 189 202 -50 -107 99 79 -158
8126a58P7j17J94nQ8j73j04L14q5n8j31J04K5R5qk08k5N61k72k41RJ08M8J14r3
8151E9J55o2j79J70o7N4Q7j04M4J5n25J52M24j93l07L97k89L78j55k51M96m05
8173a06j7R3l4J15j12J33k27K75K7k35plm5K36J5k2J18k77
$$ plain form
8126 -158 -81 -198 -4 -9 79 -94 -198 116 31 -27 -158 -54 -29 66 58 -150 -175 386 114 -127 -118 -10 38 152 59
8151 59 214 152 -27 143 76 130 217 113 157 172 -353 -201 223 30 -277 120 -169 209 54 -197 299 -106
8173 -106 -123 -30 -64 51 -61 72 -155 120 147 -88 -95 -98 -143 93 108 86 204 -73
8191g3
$$ Imaginary data points
##PAGE= N=2
##DATA TABLE= (X++(I..I)), XYDATA
0@%%%%%%%%%%%%%Qj6J6j6J6k4L2l3M1n1N9p2Q6r8J13j33J53j73J97k26K57k89
35a53L26l67M10m60N13n71O37p07P84q68R60j059J167j287J420j564J721j897
53i95K092k309K555k832L148l511L934m439N050n805O766q044R834j2546J7202
68A0100k7418R5083m1495m1541J08757j26169p2428J20006K9518j18210P6096
79A2299R6536j08193o5209J07954n0740j32223O8496P3591j05175O327J40435
90D4098k9897q3191J00307L9070j22981M047J04045p1408o2890J17763L4432r6002
102b2607N2824R8589q6557n2419R7880j9006j13807N5510P1490r6204j4660J10285
114H1318l1153r2147P1930L8427j14495q346R0664n8722p4362R3944K8937r7685
$$ plain form
0 0 0 0 0 0 0 0 0 0 0 0 0 0 0 8 -8 8 -8 8 -16 16 -17 24 -27 32 -40 46 -52 61 -72 81 -92 105 -121 136 -153
35 -153 173 -194 216 -244 269 -302 335 -372 412 -456 504 -555 612 -675 745 -819 902 -995
53 -995 1097 -1212 1343 -1489 1659 -1852 2082 -2357 2693 -3112 3654 -4390 5444 -7102 10100
68 10100 -17318 77765 36270 -5271 103486 -22683 -95111 24895 54413 -63797 12299
79 12299 108835 642 -64567 43387 -7353 -139576 -71080 2511 -102664 -96337 44098
90 44098 14201 -68990 31317 70387 -52594 -48547 55498 -15910 -78800 38963 73395 -22607
102 -22607 30217 128806 42249 -10170 87710 68704 -45103 10407 81897 -14307 -28967 81318
114 81318 50165 -41982 29948 68375 -46120 -54466 36198 -22524 -96886 -2942 25995 -71690
126g1690L1109Q7861p1499n4615R2288k688r6588M7925P5085p6046k1954J04028
138D3216j6791q0465O3919M9872r1094p529Q9526m0950o6436P6681L4367q7913
150c3597J7176Q0395n9808n4135P7001N812q9644L3284O7359o8428l1629Q6192
162B9978j0764q1137N0498M8894q0448j4428Q1786k9977o7527O6244L5777p9643
174e0747P558P7960m7337n4526P2527J3833p9859K5363O7673n7486l4243P7865
186A8581k348p3544M0196N3162o8721j7322P5917k0151o2236N3920L9338p0211
198c3419J210P1362l5446n2468O2086K0456p2074J7811O2919m7207l7426O7950
210B5754L440o9617L1220N0930n9010k4031O9366j3984o3109M4972L9010o4844
$$ plain form
126 -71690 -40581 47280 -24219 -78834 13454 10766 -85822 -37897 37188 -38858 -60812 43216
138 43216 26425 -54040 9879 59751 -31343 -38872 50654 9704 -56732 19949 54316 -33597
150 -33597 -16421 63974 4166 -49969 27032 32844 -56800 -23516 43843 -24585 -56214 29978
162 29978 19214 -61923 -11425 37469 -42979 -57407 24379 -5598 -73125 -6881 28896 -50747
174 -50747 -43189 34771 -12566 -67092 5435 19268 -60591 -35228 32445 -25041 -59284 18581
186 18581 16233 -57311 -17115 36047 -32674 -49996 25921 5770 -56466 -2546 36792 -33419
198 -33419 -32209 39153 3707 -48761 13325 33781 -38293 -20482 42437 -4770 -42196 25754
210 25754 29194 -40423 -9203 41727 -17283 -41314 28052 14068 -49041 -4069 34941 -29903
222b9903o926O7407k9340n3843N4665K4134o7210R598O3315m1423l9043O2174
234A3605R505o4884K4741N3830n1095k5474O4805n070o0027L8655M1985n7897
246a7321r944O2570k0171n2708M7120K7705o1441L361N8223l3360m2180N4564
258A6418J2403o1302J7035N0257m3660k9716N8195j080n7508K9835M2665n1531
270a7989j5784O0181j4651n1028M0826L1622n5407j928N8283k6321m2141M9004
282A4667J9463n7442J1769N2113l7459l1277N2921N653n5876K3453M3144m4971
294c842k0440N4072p964n1405L3263L1671m9773q149N2272j9976m3462M0863K0599
307B7729n1798M151M8992l0417l3999M6975R073n0647J6418M3132l8206k2973
$$ plain form
222 -29903 -36829 30578 1238 -52605 2060 26194 -41016 -31418 31897 -9526 -48569 13605
234 13605 23110 -41774 -17033 36797 -14298 -39772 25033 19963 -40064 -1409 40576 -17321
246 -17321 -27265 35305 15134 -37574 9546 37251 -24190 -20829 37394 4034 -38146 16418
258 16418 28821 -32481 -15446 34811 -8849 -38565 19630 18550 -38958 -9123 33542 -17989
270 -17989 -33773 26408 11757 -39271 1555 33177 -22230 -24158 34125 7804 -34337 14667
282 14667 34130 -23312 -11543 40570 3111 -28166 24755 30408 -25468 -2015 41129 -3842
294 -3842 -24282 29790 21826 -29579 3684 35355 -14418 -22567 29705 9729 -33733 7130 27729
307 27729 -24069 -19918 29074 -1343 -35342 11633 20706 -29941 -13523 29609 -8597 -31570
319c1570N0441k546m7607K6967L5111m4980j0565N0418j4307m2198L5724K4785
331B9673m8816P01M7362k5033l5326M2147J2947m9763J2190M1646l3555k5829
343c1656M5566J639m7419K1935L4434l9499j5308M7497r812m1706L0689K5838
355B2198m2556l943M5572j9105l4134L7162J5941m3778O816M1999k7922k6094
367b7844M0844O028m3523J6573L5333l4945j7108M2656m528m1237K5055K7106
379B4410l9782p091M1697j4592l5878L2407J8220m2635L233L9354k3232k8873
391c2762L8094Q130m1890J2792L4840k9740k0055M0441j144l8841K0271K8786
403A8922l4906j0781M0224j0093l4194K7132K0719l7641j183L8296j8309k8057
$$ plain form
319 -31570 18871 16325 -31282 -4315 30796 -14184 -24749 25669 11362 -30836 4888 29673
331 29673 -19143 -18442 28920 3887 -31439 10708 23655 -26108 -13918 27728 -5827 -31656
343 -31656 13910 15549 -31870 -9935 24499 -15000 -30308 17189 7377 -34329 -3640 22198
355 22198 -20358 -24301 21271 2166 -31968 5194 21135 -22643 -15827 26172 -1750 -27844
367 -27844 13000 19028 -24495 -7922 27411 -7534 -24642 18014 13486 -27751 -2696 24410
379 24410 -15372 -22463 19234 4642 -31236 1171 19391 -23244 -20011 19343 -3889 -32762
391 -32762 5332 13462 -28428 -15636 19204 -10536 -30591 9850 8706 -30135 -9864 18922
403 18922 -15984 -26765 13459 3366 -30828 -3696 17023 -20618 -21801 16495 -1814 -29871
415b9871L2334J2525l8529Q652L4589k5298k0033L5807L656l6738J7121K9380
427B3595l0861j2165L8073n779l4263K4232K2168l4750m306L6691j4451l0309
439b2125K9749J3017l7128M261L3247k3078k3103L3110M064l6156J2211K9013
451A7082k8616j4454L4841l291l2700K0364K3427l1070n100L5343j0053k7417
463b1644K6508J7043l2019L060L3026j6876k1720L0308Q146l3014J0255K7501
475C0574k3430j6238L0982j094l2574J5618K1614k9420j0359L1457r704k9732
487b2306K1239J5314l1807j863L0767j5914k3375K7285R409l1014P533K9595k0329
500e466j5277L1101L944k8717J5488K5097k3886q307L2167l964k6739K0786J8087
$$ plain form
415 -29871 2463 14988 -23541 -14889 19700 -5598 -25631 10176 13832 -22906 -5785 23595
427 23595 -7266 -19431 18642 12863 -21400 2832 25000 -9750 -14056 22635 8184 -22125
439 -22125 7624 20641 -16487 -12226 21021 -2057 -25160 7950 12014 -24142 -11931 17082
451 17082 -11534 -25988 8853 5562 -27138 -6774 16653 -14417 -19517 15826 5773 -21644
463 -21644 4864 21907 -10112 -7052 25974 9098 -12622 17686 25832 -7182 3073 30574
475 30574 7144 -9094 21888 20794 -11780 3838 25452 -3968 -14327 17130 7426 -22306
487 -22306 -1067 14247 -17560 -19423 11344 -4570 -27945 -660 8749 -22265 -14732 14863 -5466
500 -5466 -20743 10358 14302 -14415 1073 26170 2284 -6023 26144 22180 -4559 16227 34314
513C4314k7947k547K9092j1834k3868K2858R518l0065K823K4969j9060j9996K5493
526A3750J946k9903Q806K1631k3189j2868K7786l817k6592J5744J8386k5175m357
539a7852K9170q755k1594K1962J3973k6044K966K7982j4263j7049K5694O828k6902
552c884Q952K3272j9415j2954K5812o37k6756J3220J7676k4322p560K5388q174
565A0618k4075J7654J1569k5499j643K4436j2798j9755K1729P113k5365N548K2572
578A2104j6445j3085K4239K161k3387J1562J9715j9967p277K5335m016k1515J6138
591E562J4724k2863k209K4212r982j9163J9308Q719k4405K849K1525j4965j5370
604a2058K1516K876k4299Q325J8430j8616j0302K3334k541k2659J3591J4796k0872
$$ plain form
513 34314 6367 3820 32912 21078 -2790 20068 29586 -479 2344 27313 8253 -11743 13750
526 13750 15696 -14207 -5401 16230 -6959 -19827 7959 4142 -22450 -6706 11680 -13495 -17852
539 -17852 11318 2563 -19031 2931 16904 -9140 -6174 21808 7545 -9504 16190 23018 -3884
552 -3884 5068 28340 8925 -4029 21783 21146 -5610 7610 25286 964 -6596 18792 10618
565 10618 -13457 4197 15766 -9733 -11376 13060 262 -19493 2236 9349 -16016 -10468 12104
578 12104 -4341 -17426 6813 8974 -14413 -2851 16864 -3103 -10380 14955 10939 -10576 5562
591 5562 20286 -2577 -4786 19426 9444 -9719 9589 18308 -6097 -3248 18277 3312 -12058
604 -12058 9458 12334 -11965 -3640 14790 -3826 -14128 9206 6665 -15994 -2403 12393 -8479
617h479m266K3062p693j8417J6751J0348k1874J007K1662j2166j5020J9777N013
630I705k1821N857J8861j6124j0412K0887l72k0906J0586J5330j8964n388K1378
643H617n163j8844J5029J1119k0364n69K0949r735j5393J8037O718k1386N234
656e751J8539j3667j1687K0151J290j9863Q436J5992j6900p382K0295l904j8272
669a2723J2756J1429j8882k292J9328p987j5249J5225P400j9384K528J7573j1470
682a748j1723J7266L488j9291P198J5367j4441p659J8327j086j7423J0336J2297
695A0908j6591l274J8589n712j5795J3986Q179j8253Q93J7690r874j2993J6569
708D322L774j8132M862J5604j3139r017J7540n50j7068Q768J2910j5564m609J7623
$$ plain form
617 -8479 -12745 10317 2624 -15793 958 11306 -10568 -9561 12101 -65 -15085 4692 9705
630 9705 -12116 -6259 12602 -3522 -13934 6953 6581 -14325 -3739 11591 -7373 -12761 8617
643 8617 3454 -15390 -361 10758 -9606 -10175 10774 1039 -14354 3683 10401 -10985 -5751
656 -5751 12788 -879 -12566 7585 8875 -10988 -2552 13440 -3460 -10842 9453 5549 -12723
669 -12723 33 11462 -7420 -9712 9616 1629 -13620 1605 9005 -10379 -7851 9722 -1748
682 -1748 -13471 3795 7283 -12008 -4810 10557 -3884 -11543 6784 5698 -11725 -1389 10908
695 10908 -5683 -8957 9632 3920 -11875 2111 10290 -7963 -7070 10620 746 -12247 4322
708 4322 8096 -10036 -5174 10430 -2709 -11726 5814 5264 -11804 -3036 9874 -5690 -10299 7324
722G324m103j5286J2144R522j7044K1J6803p736j2542J4395N508j6809L689J4934
736A0820j0665r018J5717J205j6285P403J2404j3572n472J6354k671j4931J0426
749A715R070j5166j871J6237o650j2722J2987N722j5849J777J5104j0062r694
762i402J4613K235j5855N629J2938j2409o653J5626j573j4540Q817J0110j4148
775d612k581J4964m981j2463J1262O831j4974J002J4022p967j0046J3018L132
788F607j4755M162J2346j0002p314J3964k73j3602P522R856j2631l699J5006m017
802C170j2107R664P651j3667k06J4338p495r781J2146M060j4016L090J2434r716
816d35p072J2667O49j3535O163J0227j1639m410J3637k692j2346Q726P512j2575
$$ plain form
722 7324 3221 -12065 79 9601 -7443 -7422 9381 1645 -10897 3498 9006 -7803 -4114 10820
736 10820 155 -8863 6854 8059 -8226 -823 11581 -1991 -7463 8891 6220 -8711 1715
749 1715 10785 -4381 -6252 9985 3335 -9387 3600 9322 -6527 -4750 10354 292 -9402
762 -9402 5211 7446 -8409 -2780 10158 -2251 -8904 6722 5149 -9391 -574 9536 -4612
775 -4612 -7193 7771 2790 -9673 1589 8420 -6554 -5552 8470 503 -9543 3475 6607
788 6607 -8148 -3986 8360 -1642 -8956 5008 4735 -8867 -1345 8511 -4120 -7819 7187 3170
802 3170 -8937 727 8378 -5289 -5495 8843 1348 -8433 3713 7773 -6243 -3153 9281 -435
816 -435 -7507 5160 5809 -7726 -1563 8664 -2975 -7385 6252 3560 -8786 -60 7452 -5123
830e123j309J3063n454j0362J0677M826j2816K157J1832p853p722J1991J518j2478
844g053M902R934r965m493J1910j514j1836P560P860j1887j672J1786m514j0092
858i074R081N010j2232O51J1620p146q037J0776K528j2197M098J0012q420n445
872h775J1780l12j0984O703Q121r940k523J2339l241r877Q837N580j0790n4J1172
887H036n608p949R532K595j1159K231R662q260n965R911J28j0782M798P822r642
902d650l347J0469k133r637P176O271j0190m59J0738m026q296R721L674j0315
916e004K640R805o342o018J0384Q13j0002M554P947q075m141J0339k040r907N904
931H57N928r673k058R604m170q387P209L720j0123L17R400n985o111Q682K104
$$ plain form
830 -5123 -6432 6631 1177 -9185 1492 6318 -6498 -4341 7491 -362 -8084 3907 5425 -7053
844 -7053 -2151 7783 -2182 -6675 5235 3721 -8115 -555 7305 -4582 -6254 5532 1018 -9074
858 -9074 7 5017 -7215 -6564 5056 -2090 -10127 649 3177 -9020 -4922 5090 -3330 -8775
872 -8775 3005 2693 -8291 -1588 6533 -3407 -5930 6409 3168 -6709 2128 7708 -3082 -3136 8036
887 8036 2428 -5521 4011 6606 -4553 -2322 7340 -920 -6885 3026 3154 -7628 -2830 4992 -4650
902 -4650 -7997 2472 339 -9298 -2122 4149 -6041 -6500 4238 212 -8084 1637 5311 -5004
916 -5004 -2364 7441 1099 -4919 5465 6278 -3724 830 8777 702 -3439 6900 4860 -5047 857
931 857 6785 -2888 -4946 4658 488 -7899 -690 3030 -7093 -6776 2624 -3361 -9472 -790 1314
946A314r636L658Q250o855l862R766J17q471N712O888p937j315R432k028p857
961b824P141M620q832J77Q702m861p004P856J903r407J792P595o905n133Q239
976C059l38r102L867O375q200k525Q881j901p831N986N198q782M97Q971l630o078
992e553P473L669q728K138P999n022m632P811J134q343L557O304o921l170P950
1007E666j176q233M618M577p923j589Q005l504o923O252K883q049O60P603m898
1022b031n122P915J125p797L053O885n723k944Q006l54p086M797N636o967j241
1037a848P825k250o222N662L653p928K27P056m003n474O477J644q051J888O068
1052D724n596l746O973r6p137L466N009o147k400P743j831n779M639L797o378
$$ plain form
946 1314 -8322 -4664 3586 -3269 -7131 2635 2752 -5719 -7 6881 -1056 -2371 7061 5033 -2824
961 -2824 4317 8937 105 282 8984 4123 -2881 4975 6878 -2529 -737 6858 -47 -5180 3059
976 3059 2721 -6381 -2514 3861 -4339 -6864 2017 116 -7715 -1729 3469 -5313 -4816 4155 525 -5553
992 -5553 1920 5589 -3139 -1001 6998 1976 -2656 5155 6289 -2054 1503 7807 886 -2284 5666
1007 5666 4490 -3743 875 5452 -2471 -4060 3945 441 -6482 -230 2653 -5396 -4736 2867 -2031
1022 -2031 -7153 762 1887 -5910 -2857 4028 -1695 -4639 3367 3013 -4073 724 6360 -607 -1848
1037 -1848 5977 3727 -2495 3167 6820 -1108 -881 6175 2172 -3302 3175 4819 -3232 -1344 4724
1052 4724 -872 -4618 2355 2259 -4878 -1412 3597 -2550 -4950 2793 962 -4817 -178 3619 -2759
1067b759j45P175l460m831N893K273o980J583O597m836l825O419K37o850L143
1082c66N275n813k880P069j144o895M602L627o359q64O571k716n404N616K292
1097B611o534J053O001l853m056O371P23o116K684N063m760k347O222n53n707
1112c198L617M211n636r12O154k178n224M688K437n891K84N917l563m198N526
1127B034J103o582K483M888m561k724N890m83n802L236L809n079j298N826j579
1142A161m994M337K730n589j51N764k900m141N225J183n449J468N084m277l016
1157c565N581K00n342K468L976m606j820N669j144n079L723K800n124l98N400
1172B739k353m130M404J901n448J294M600l259l150M873M05n028K514L891m249
$$ plain form
1067 -2759 -2904 4271 811 -4020 1873 4146 -2834 -1251 5346 510 -3315 3104 3341 -3509 -366
1082 -366 4909 -904 -3784 3285 2141 -4754 -152 3475 -2884 -3748 2823 107 -5297 319 2611
1097 2611 -3923 -2870 3131 -722 -4778 1593 2316 -3800 -1116 3947 -813 -3160 3062 2509 -3198
1112 -3198 419 4630 -1006 -1918 4236 2058 -3166 1522 3959 -1932 -1648 4269 706 -3492 2034
1127 2034 3137 -3445 -962 3926 -635 -3359 2531 2048 -3754 -518 3291 -1788 -3086 2740 1161
1142 1161 -3833 504 3234 -2355 -2506 3258 358 -3783 1442 2625 -2824 -1356 3728 -549 -3565
1157 -3565 2016 2216 -3126 -658 3318 -1288 -3108 2561 1417 -3662 61 2861 -2263 -2661 2739
1172 2739 386 -3744 660 2561 -2887 -1593 3007 -252 -3402 1471 1876 -3152 -638 3253 -996
1187i96j955N113m60m849L319L224m808p52N432k228m029M147K197n251P84M650
1203C538l119k819M250R87m994J488M214l782k096M853n66m679K743L131m412
1218a263r17M652j501m179L676J799m375P8M310k567l114M081Q30m309J215L903
1234B319l294k065M096J35m257K201L377m011j096M937j485l707L045K355l974
1249a424j34M169j899k967L416J321m380R70L865k915k204M008Km153J729L181
1265B585l117j586L695m48m051K881K517m105m64M097j808l031L420J422m010
1280b003N77L735k192k133L656K42l702J797L165l295j253L900m82l526K074K616
1296C176l757l30L363j458k990L187J142l952K73L375k362k486L036R25l918J175
$$ plain form
1187 -996 -2951 2162 1702 -3147 172 3396 -1412 -2164 3268 1040 -2989 1158 3355 -1896 -1112 3538
1203 3538 419 -2400 1850 2837 -2157 -669 3545 -237 -2333 2520 1954 -2725 18 3149 -1263
1218 -1263 -2180 2472 971 -3208 468 2267 -2108 -2030 2280 -287 -3401 680 1510 -2799 -1584 2319
1234 2319 -975 -3040 1056 1191 -3066 -865 2512 -1499 -2595 2342 857 -2850 195 2550 -1424
1249 -1424 -1558 2611 712 -2255 1161 2482 -1898 -928 2937 22 -2182 1826 1828 -2325 -596 2585
1265 2585 -532 -2118 1577 1129 -2922 -41 2476 -1629 -2093 2004 196 -2835 585 2007 -2003
1280 -2003 -1426 2309 117 -2016 1640 1882 -1820 -23 3142 -153 -1406 2494 2012 -1514 560 3176
1296 3176 -581 -911 2452 994 -1996 1191 2333 -1619 -1346 2029 -333 -2819 217 1142 -2776 -1601
1312a601K877k604j667L579l75l327K176K493l102n85L406o88k567K220J921l061
1328i05R3L416j415k158K538J041l138R07K909k515j482K999l66l026J620K059
1344B577k934r57K847j024k966K282J504l097j58L235j649k238K725O67k889R94
1360a081K832j953j539L189N23l094J025K801k150r91L227o24k627J608K057l080
1376A23k94K730j522k577K373J066l253M14K163j965j711K501K21k984J033K216
1392E34k160r83K968n97k485J799J818k203l26K853m19k337K422J414k740N89
1408A47K274j454j326K328M56k644N37K461k383j089K340m11k405J219J417k203
1424g36p13K170p81j932J441J350k506J84K033r35j634K184P60k431Q70K137j323
$$ plain form
1312 -1601 1276 -1328 -2995 584 209 -3118 -942 1551 -1551 -2136 1270 582 -1985 235 2156 -905
1328 -905 -812 2604 1189 -969 1569 2610 -528 379 3288 773 -709 2290 1924 -1102 518 2577
1344 2577 -357 -1314 1533 509 -2457 -175 1329 -1768 -1926 1309 -340 -2578 147 814 -2075 -1081
1360 -1081 1751 -202 -1741 1448 1971 -1123 -98 2703 553 -438 2789 2165 -462 1146 3203 123
1376 123 -171 2559 1037 -1540 833 1899 -1354 -940 1223 -742 -2453 48 269 -2715 -1682 534
1392 534 -1626 -2609 359 -238 -2723 -924 894 -1309 -1635 1218 799 -1538 884 2298 -442 147
1408 147 2421 967 -359 1969 2425 -219 318 2779 396 -693 1647 1236 -1169 50 1467 -736
1424 -736 -1449 721 -60 -1992 -551 799 -1707 -1523 510 -425 -2059 125 885 -1546 -676 1461 138
1441A38j136K468p3k127J226J669k174n83K314o13k203J702J278k423k79K234
1457A418j316j749J622M36k229K40J948j547j125J905l9j738Q29J566j691k84
1473a754K184n46j803J634J336j479j27J985o22j630J634N86j717N69J470j206
1489E14j048J672J48k065P42J682k146p02J847m52j606Q97R50j616m79K138o62
1506a86j717J493Q80j967N26J547j045r32J906L10j727O35J385j096p37J938p3
1523A140j848J055J007j476m43J584o26j384J261P00j830J95J405r87j438J347
1539c38M71j637N44J401j244q53J728p0j498Q40J128j317l23J735l80j388J258
1556E7R74j427N9J407p73j132J543M55j218J65R06p85m48J181l20j238N96J108
$$ plain form
1441 138 -998 1470 1397 -730 496 2165 -9 -592 1722 1109 -1094 608 1886 -537 -816 1418
1457 1418 102 -1647 -25 411 -1818 -1578 370 -1177 -2302 -397 -436 -2174 -1345 221 -1470 -1754
1473 -1754 430 -116 -1919 -285 1051 -428 -555 1430 808 -822 812 1398 -319 250 1720 514
1489 514 -534 1138 1286 -779 -37 1645 -501 -1203 644 192 -1414 -517 433 -1183 -1662 476 -186
1506 -186 -1903 -410 470 -1497 -971 576 -469 -1401 505 815 -912 -277 1108 12 -725 1213 1140
1523 1140 -708 347 1354 -122 -565 1019 393 -991 270 970 -860 -665 740 -247 -1685 -338
1539 -338 133 -1504 -960 441 -803 -1656 72 2 -1496 -656 472 -845 -1168 567 187 -1201 57
1556 57 1031 -396 -337 1070 297 -835 708 1163 -55 110 1016 231 -217 964 644 -594 2 1110
1574A110j128r17J641j93j077P44O19j273P8J249o93r34J014M61j326K00J261
1591H36j137n98J447K9j300P20P69q85n35J196n5j270J024M66j034j20J300l43
1609E10j315J142J99p81j28J081o62o23Q95M8j165M84R27j080l95J064jr71N67
1628b04O42j010j26J373n84r16R51L71q35O8J110q19m45Q45L30j314M39J008r36
1647e2k97Q89M9r61P03N68r29l60J191l46r40P80L76r03J02Q95o12o13P07R0j059
1668g22L99P76q10m54J224k41r91L76R54r63l02R30m06n89P59M81j034K24Q13
1687D24n40n33K29P11j035Q08M25q20l05Q84J24j029N70O54o75m15R16r1r14Q70
1707B58J77p62j76Q78m74m30M99J65o14K8Q81o17m39P60N4r19Q33M89p93L9N90
$$ plain form
1574 1110 -18 -935 706 513 -564 180 799 -474 -396 853 160 -774 240 701 -625 -425 836
1591 836 -301 -899 548 577 -723 -3 766 -119 -654 542 487 -783 241 707 -327 -447 853 510
1609 510 -805 337 536 -245 -373 708 46 -577 318 366 -799 -315 612 -468 -863 201 200 -771 -204
1628 -204 438 -572 -698 675 91 -825 126 497 -338 -270 840 21 -424 421 751 -563 -124 884 -52
1647 -52 -349 540 589 -372 331 899 -30 -390 801 455 -485 295 671 -232 -130 765 153 -460 247 337 -722
1668 -722 -323 453 -357 -811 413 172 -819 -443 511 -452 -754 176 -230 -819 -60 421 -613 -389 424
1687 424 -116 -649 -420 291 -744 64 489 -331 -636 248 372 -657 -87 567 -108 -523 393 302 -612 258
1707 258 435 -327 -503 375 -99 -529 -30 135 -479 -451 430 -187 -626 134 188 -731 102 591 -202 -163 427
1728D27k42p68O56N91p49j34J011m91m77O97L81q27m3R56p77n71J125m60o50L46
1748AM56p64k55R10j11p51M95M56j133n5Q34n22m30N61L39j164O51P29n96k25
1768e74P69J08p75L40P24o86Q1P11k68p05P77K17k54k30O57l10m96L57L14q17
1788f0J12L35m41l54P28j93n17K07M84p36j42P56j66n77K92N10n76J38P21m18
1808A03l57L47O90o51L05N43m90k98O65J73p98M06L07o97o9M34J1p26L81K65p50
1829b06j85O36l37p01N48P8m52K6M74m25m69O22N4l85J77Q55m00j32O02K30o80
1850g0L73L55m53J32L64k42l76M37M62o80l5M03l54k43K64J08r17M40K67m51l09
1871e25N13j94m85M61L43n85j13M69R3m38L64K87m64K78N44k23k97P60p7n55J47
$$ plain form
1728 427 185 -583 73 664 -85 -219 792 301 -176 521 902 75 32 988 211 -360 765 305 -345 1
1748 1 457 -307 -562 348 237 -514 -19 437 -696 -751 83 -439 -869 -308 31 -1133 -482 247 -349 -574
1768 -574 195 303 -472 -132 592 -94 -13 698 430 -275 502 719 465 235 892 582 86 443 757 -60
1788 -60 52 387 -54 -408 320 127 -390 -183 301 -435 -577 179 13 -564 -272 238 -338 -200 521 103
1808 103 -254 93 783 132 437 980 490 192 857 1030 232 638 945 248 179 613 624 -102 279 544 -206
1829 -206 -391 245 -92 -793 -245 -167 -619 -593 -119 -544 -1013 -391 -337 -722 -545 310 -90 -222 380 610 -70
1850 -70 303 658 205 337 701 459 83 520 982 302 267 670 316 73 337 445 -472 -32 235 -216 -525
1871 -525 -12 -206 -691 -230 113 -472 -585 -116 -23 -461 -97 190 -274 4 548 325 28 788 711 156 303
1892C03N32m06k37J56J37n63K90R9l95j17J89p8l28K80K17o68j42L65m5m32K33
1913f10Q8n60N39M09l88k94N10R3m65N78K48j74m5K91J00m71M12N22n96n4M96
1934F29l03k06J02K88o17J35M21o47k66L54j4l36K1J53j23j24M29q8m37M75M5
1955a09k66j1K80Pj42K24P3k8l6O05k82l57M09J89l95NM40n17J1J49r1n11J78
1978a75M52n43j28L66j24k97j63N37n23J98J49j51m54N07K86k78j4K78k74j7K85
1999h3Q4l00K72J68l63J10K40p7J78M7O7j90r6L90l58k19M74Ln17J36L36l01N4
2022E5K4O9l19K72o3j46J75J02j23k19P7K15k96pK44j91k03M63K62l56O0J13l2
2045A76l44K80o1j61K18jm36K10K88j08k74K80J0J7k55K74j41j22K47M1o63N17
$$ plain form
1892 303 835 429 192 348 485 -78 212 311 -84 -201 -12 -90 -418 -138 79 -589 -731 -366 -411 -843 -610
1913 -610 -522 -1082 -543 -134 -522 -816 -306 -213 -678 -100 148 -26 -71 220 320 -151 261 783 187 133 629
1934 629 326 120 222 510 -107 28 449 -198 -464 -110 -124 -460 -439 -286 -409 -533 -104 -192 -629 -154 -109
1955 -109 -375 -386 -106 -99 -241 -17 56 28 -8 597 315 -42 367 556 161 166 606 89 100 249 158 -353 -175
1978 -175 277 -266 -394 -28 -152 -449 -612 -75 -598 -400 -251 -402 -856 -349 -63 -341 -355 -77 -351 -368 -83
1999 -83 1 -299 -27 141 -222 -112 128 51 229 276 343 153 57 447 89 -130 344 347 -170 -34 302 1 55
2022 55 79 148 -171 101 38 -108 67 169 46 -173 -96 119 -177 -184 60 -131 -334 129 391 35 95 208 176
2045 176 -168 112 51 -110 108 107 -329 -119 169 61 -213 67 77 94 -161 113 -28 -150 97 138 -525 -8
2067hL96m02m61L04J89m24L34l9k74K92OQ4k85L10j24j22N0M09m7j57J44m9j16
2090A0J88J27l75J38P0L44n17J34m4K11j30J76k28K06K5j76j29p1L47k93j0o3
2112f0L41m09K20m0pn00L90J95j80pj23K46l02K21k29j37K79k5mj28M48n86J39
2135b58K33j03l8J83j26K72k85L1J08k77J33M02j75k92L87j81j24p4L33k69J64
2156D4k05P1K1r5L15l34k17L24L7j13K62k58J35L45l60M4k63L15n8n9Q7J64pj45
2180E0J97k13K27k23L05l75J56L7K10m29J45o1O1j04J65m09L37k6j55j06q7M0
2202b58j13k15M44j14j09r6R3P8kNP9p2K27j3k1N5K62l63j17N35k70J32j8J80
2226C09l3j87M18l40nj2j4k63P8J01j61K53m02O6j22J63J46k04r5L07m04K06J84
$$ plain form
2067 -8 388 -14 -475 -171 18 -406 -72 -111 -385 -93 -87 -3 -288 22 -102 -224 -174 235 188 31 175 126 10
2090 10 198 325 -50 88 158 502 -15 119 75 286 156 332 104 310 335 159 30 -41 306 13 3 -60
2112 -60 281 -128 92 52 45 -455 -65 130 -50 -57 -180 66 -236 -15 -244 -381 -102 -127 -131 -259 189 -397 -258
2135 -258 -25 -128 -166 17 -109 163 -122 -91 17 -260 -127 275 100 -192 195 14 -110 -184 149 -120 44
2156 44 -161 -90 -69 -164 151 -183 -400 -76 -39 -152 110 -148 -13 332 -28 16 -247 68 10 -49 38 202 195 50
2180 50 247 34 261 38 343 -32 124 161 371 -58 87 26 87 -17 148 -261 76 50 -105 -211 -298 -258
2202 -258 -371 -586 -142 -256 -365 -461 -368 -290 -292 -287 -208 -280 -53 -66 -87 -32 230 -133 -250 285 15 147 129 309
2226 309 276 89 507 167 162 150 136 -127 -49 52 -109 144 -258 -192 -314 -151 -5 -209 -304 3 -401 -195 -11
2249a1j13j17K07L59o7j90K98j83R9J35R8k2j11P5K7k27K83J46l42J2n7j97j09
2272gL50j17k56n3k31j24J77M3q0j96r1L13l17K4L88rk56Q3J46K32n2R0J54k45
2296c4K66l2J56k85J12R4P9J24j04o3J93j87M3j26n2j9k03j54K33j66j16n5J12
2319a84k96K15P2m55M27j59J64r1M12l04J33L10j38j37N1M43o9K72l11J51l49
2340A57L67p5k06j41K09J27j66j04m4k70J1j87Q3Q0l43L77k31j94J08j06J25J8
2362d05kk1J11J6K12%jq9P4K48L0K4o5K41r6l53L94N6Ml43M35l63p2J48l5k42
2388i4M8m0J57m59O11l00k36K65k26J11k00L43j77J17RK9l48K05j46N12j15J18
2410A84J04P2j73j13R2k8O6K74j71o9M6j0jj83k47O7N4l14K28k9J65l8k41N6J58
$$ plain form
2249 -11 -124 -241 -34 325 258 68 366 183 282 417 515 493 382 457 484 257 540 686 344 356 299 102 -7
2272 -7 343 226 -30 -83 -314 -438 -261 -218 -298 -494 -585 -272 -589 -565 -177 -186 -442 -359 -213 19 -33 57 211 -34
2296 -34 232 200 356 71 183 277 356 480 376 313 506 319 362 236 184 165 -38 -192 41 -125 -241 -296 -184
2319 -184 -480 -265 -193 -648 -221 -380 -216 -307 105 -199 -66 244 106 -31 20 463 394 666 355 506 157
2340 157 524 449 243 102 311 438 272 168 124 -146 -135 -322 -239 -159 -502 -125 -356 -550 -442 -548 -423 -405
2362 -405 -407 -428 -317 -301 -89 -89 -90 -179 -105 143 173 197 132 373 277 -76 318 374 378 35 470 107 35 183 148 -94
2388 -94 -46 -86 71 -388 223 -77 -313 -48 -274 -163 -363 -20 -197 -80 -71 -42 -390 -185 -331 181 66 184
2410 184 288 360 187 74 166 138 204 478 307 238 284 274 273 90 -157 -90 -36 -350 -122 -151 14 -24 -265 -209 -51
2435e1k31m1K50l38N8K52j74J26j86Q6L1J95l9P0j9l3O6K2j46O5J61k88Q1K79
2459A96j94N1R4L3k33L89j44k82M9j86N32l66O9Q5m8q9K50k11j21K45p9jn3J15
2483A01k03M4L86l36K0J83q7J8o9R8q9J98l67J24j41N8P7J3k34K45J40l47J88
2506B0k18O2k10M84k22j97K44j44j17L20j81l3l2Q6K73k68j26j75K91qJ54k74
2528b71K12J82k11m2K72j31J14nj4p3j40K21O9j28j75K78k05J04R8J40k03j31
2550c9K47J16l47L69k60K3j86K74k49n4K2L68j97L2P2k87R2jJ69m01K37K30k25
2573EJ28j41k01J29p6l7P8j35L14l45M9J63o9p9K49j41P1p7j28Q0J84q2J42k07
2597a26j57J60kJ22J28m5j11j9K53l66R7j08K79k66L8K14m3J21l39J02j06L64
$$ plain form
2435 -51 -282 -323 -73 -411 -353 -101 -275 -149 -335 -249 -218 -23 -62 8 -11 -44 22 44 -102 -37 124 -164 -83 196
2459 196 2 53 147 180 -53 336 192 -90 -41 -227 305 -61 8 93 45 -44 206 -5 -126 119 40 39 -14 101
2483 101 -102 -58 328 -8 12 195 108 126 57 155 66 264 -103 21 -120 -62 15 28 -206 39 179 -168 20
2506 20 -198 -136 -346 138 -84 -281 -37 -181 -298 22 -159 -192 -224 -138 135 -133 -259 -434 -143 -151 3 -271
2528 -271 -59 123 -88 -130 142 11 125 120 106 33 -107 114 183 55 -120 158 -47 57 155 295 92 -39
2550 -39 208 324 -23 346 86 109 -77 197 -52 -106 -84 284 87 119 191 -96 -4 -5 164 -237 0 230 5
2573 5 133 -8 -209 -80 -156 -193 -115 -250 64 -281 -232 -69 -138 -217 32 -109 -38 -115 -243 -163 21 -61 81 -126
2597 -126 -283 -123 -125 -3 125 80 -31 -50 203 -163 -66 -174 105 -161 -123 91 48 169 -170 -68 -174 190
2619A90j65k82L07Q1J58l26L34r0o5N5j78K28m3j7J99m42K98L4j85P3l0J96l97
2642f7R2j16j47K05J47k56q7K73j48n7M7j18L9k56M30j79J64p6n1n5RL67K9l25
2666a36N5n8K48k37K43K24l06m8K10k08j67J41q9J18j22M3ro6Oj8l5J90J55l23
2690a89J4j51J84J71Qj47J78P5p7J09p0PR2j17J46m0L8r6J8J75j83M8K71j18Q
2715C54J08n89J11J21p2L5j8O5k26j43K16j64o6l6K62k37J19j2j95L90l79R1J5
2738b50j35L18p5p1M57j80J11Rn8J05k39J67P4L0j35p0o1q7K03k67L19j88K7O6
2762G0j99J40k86j39M44k48k67J44K75k05J45p0J20J51q1L05l14k9K17o4Q8M9
2784B46l8k1K62r9k5j51J78K37l20r3r7P1o9q9K0k74L71l66k5J03m1j14k52K01
$$ plain form
2619 190 25 -257 50 131 289 -37 297 207 142 197 19 247 204 187 386 -56 242 276 91 164 134 330 -67
2642 -67 25 -91 -238 -33 114 -142 -229 44 -104 -161 -114 -232 -193 -449 -19 -198 -34 -110 -161 -216 -207 160 189 -136
2666 -136 -81 -139 109 -128 115 339 33 -15 195 -13 -180 -39 -128 -10 -132 -89 -98 -164 -158 -176 -211 -21 134 -189
2690 -189 -175 -326 -142 29 37 -110 68 143 66 175 105 112 204 87 233 193 231 135 153 328 145 193 464 346 354
2715 354 462 -127 -16 105 33 68 50 115 -111 -254 -38 -202 -268 -304 -42 -279 -160 -172 -367 23 -356 -265 -250
2738 -250 -385 -67 -142 -213 244 64 175 184 126 231 -8 159 233 263 128 58 -3 -90 113 -154 165 -23 4 70
2762 70 -129 11 -275 -414 30 -218 -485 -341 -66 -271 -126 -196 -76 75 -6 299 -15 -44 173 109 197 246
2784 246 208 187 449 350 325 174 352 589 269 176 79 150 81 -8 12 -262 109 -257 -282 -179 -220 -334 -586 -385
2808c85j72K15r0J77rj09J04J23j21L14K1j24n0K4j53J05K64J18LJ1k04K4J30
2831B16l9o4n6o1M37n16q5J97n2j50k17L21k9q4q5J42M6j01J61j03J8J49K91l19
2855A7J14J75j30j26j3R4j2J0m4n6L23N9k28LN0k8j44k63K87k50Q0l2J50k36J37
2880f3j34j12J27j9K01k07K50o7j02l7K12j62L8R3j61K03l26L03j55p7J40P3q9
2903g1p4Q5n5Q5r8J47J53l01O9K3KJ24l22K3J53J32P0l08J78N4m60L88q9J2N4
2928b6K0M7K4k01K80r7L1L5Q9k39P7J44m4N8j30j54K49k30J14jLk15L68rj67j13
2954h7rJ00j29j1R0J51j48K69m1m6j22l59K48q2k5J1k12M04L4J55m35J12J53p5
2978e4j61L49k76L1J44l1K17j42O6j94Q0NJ14J84j89k7L3j30M8j39J83K3j87K17
$$ plain form
2808 -385 -557 -342 -432 -255 -264 -373 -269 -146 -267 47 68 -56 -106 -82 -235 -130 134 252 255 266 62 86 216
2831 216 177 113 57 -4 433 -83 -168 29 -23 -173 -390 -69 -98 -182 -267 -125 -79 -180 -19 -122 -104 45 336 17
2855 17 131 306 176 50 37 131 119 129 85 29 352 411 183 186 236 208 64 -199 88 -162 -82 -114 36 -200 -63
2880 -63 -197 -309 -182 -201 0 -207 43 -24 -126 -163 49 -113 -75 18 -143 60 -266 37 -118 -195 -55 18 -71
2903 -71 -145 -60 -115 -30 -128 19 172 -129 -60 -37 -35 89 -233 -210 -57 75 145 -163 15 69 -391 -3 -92 -80 -26
2928 -26 -6 41 65 -136 144 47 78 113 202 -37 40 184 140 198 68 -86 163 -67 47 46 49 -166 202 193 26 -87
2954 -87 -96 4 -125 -136 -46 105 -43 226 185 139 17 -342 -94 -176 -201 -190 -402 2 36 191 -244 -132 21 -54
2978 -54 -215 134 -142 -111 33 2 219 77 143 -51 29 34 148 332 143 116 149 19 67 -72 111 134 -53 164
3002A64k0p7J06K1j90J4N9n0N1R2j76O5j6N4j44L9k0p8j0J70K82m42jM83l00j21
$$ plain form
3002 164 144 67 173 194 4 18 77 27 78 170 -6 59 43 97 -47 -8 -28 -106 -116 54 336 -106 -107 376 76 -45
$$ [...]
8191H0
##END NTUPLES=NMR FID
##END=
