##TITLE=1H_Pr 3_So2Am
 200.13MHz,CDCl3,
 8 sc
 
 1.7.2025
##JCAMPDX= 6.0         $$ Bruker NMR JCAMP-DX V2.0
##DATA TYPE= NMR FID
##DATA CLASS= NTUPLES
##ORIGIN= UXNMR, Bruker Analytische Messtechnik GmbH
##OWNER= pz
$$ XWIN-NMR		Version 3.5
$$ Tue Jul  1 16:32:17 2025 Russian Standard Time (UT+4h)  she@DPX200
##.OBSERVE FREQUENCY= 200.1313
##.OBSERVE NUCLEUS= ^1H
##.DELAY= (6, 6)
##.ACQUISITION MODE= SIMULTANEOUS
##.ACQUISITION SCHEME= undefined
##.AVERAGES= 8
##.DIGITISER RES= 18
##SPECTROMETER/DATA SYSTEM= spect
##.PULSE SEQUENCE= zg30
##.SOLVENT NAME= CDCl3
##.SHIFT REFERENCE= (INTERNAL, CDCl3, 0, 14.3821)
##AUDIT TRAIL= $$ (NUMBER, WHEN, WHO, WHERE, WHAT)
$$ ##TITLE= Audit trail, XWIN-NMR		Version 3.5
$$ ##JCAMPDX= 5.01
$$ ##ORIGIN= Bruker BioSpin GmbH
$$ ##OWNER= she
$$ F:/spectra/data/she/nmr/H-C/1/audita.txt
$$ ##AUDIT TRAIL=  $$ (NUMBER, WHEN, WHO, WHERE, WHAT)
(   1,<2025-07-01 16:30:42.93 +0400>,<she>,<DPX200>,
      <created by zg, POWCHK disabled, PULCHK disabled
       configuration hash MD5:
       00 E9 B6 7A A2 85 ED C7 34 08 36 98 17 FE 4E 26
       data hash MD5: 16K
       87 D9 7C CF DB 7D 62 FD 88 5F 76 2D 97 C3 39 39>)
$$ ##END=
$$ 
$$ hash MD5
$$ 24 CB AE 33 0B 47 85 90 34 80 0E B4 9E 1C EA 52
##$RELAX= 
##$RELAX= 
##$RELAX= 
##$RELAX= 
##$RELAX= 
##$RELAX= 
$$ Bruker specific parameters
$$ --------------------------
##$DU= <F:/spectra>
##$EXPNO= 1
##$NAME= <H-C>
##$PROCNO= 1
##$TYPE= <nmr>
##$USER= <she>
##$AMP= (0..31)
100 100 100 100 100 100 100 100 100 100 100 100 100 100 100 100 100 100 
100 100 100 100 100 100 100 100 100 100 100 100 100 100 
##$AQSEQ= 0
##$AQ_mod= 1
##$AUNM= <au_zg>
##$AUTOPOS= <>
##$BF1= 200.13
##$BF2= 200.13
##$BF3= 200.13
##$BF4= 200.13
##$BF5= 200.13
##$BF6= 200.13
##$BF7= 200.13
##$BF8= 200.13
##$BYTORDA= 1
##$CFDGTYP= 0
##$CFRGTYP= 5
##$CHEMSTR= <none>
##$CNST= (0..31)
1 1 145 1 1 1 1 1 1 1 1 1 1 1 1 1 1 1 1 1 1 1 1 1 1 1 1 1 1 1 1 1 
##$CPDPRG= <>
##$CPDPRG1= <>
##$CPDPRG2= <>
##$CPDPRG3= <>
##$CPDPRG4= <mlev>
##$CPDPRG5= <mlev>
##$CPDPRG6= <mlev>
##$CPDPRG7= <mlev>
##$CPDPRG8= <mlev>
##$CPDPRGB= <>
##$CPDPRGT= <>
##$D= (0..31)
0 0.7 0 0 0 0 0 0 0 0 0 0.03 0 0 0 0 0 0 0 0 0 0 0 0 0 0 0 0 0 0 0 0 
##$DATE= 1751373042
##$DBL= (0..7)
120 120 120 120 120 120 120 120 
##$DBP= (0..7)
150 150 150 150 150 150 150 150 
##$DBP07= 0
##$DBPNAM0= <>
##$DBPNAM1= <>
##$DBPNAM2= <>
##$DBPNAM3= <>
##$DBPNAM4= <>
##$DBPNAM5= <>
##$DBPNAM6= <>
##$DBPNAM7= <>
##$DBPOAL= (0..7)
0.5 0.5 0.5 0.5 0.5 0.5 0.5 0.5 
##$DBPOFFS= (0..7)
0 0 0 0 0 0 0 0 
##$DE= 6
##$DECBNUC= <off>
##$DECIM= 32
##$DECNUC= <off>
##$DECSTAT= 4
##$DIGMOD= 1
##$DIGTYP= 9
##$DL= (0..7)
0 120 120 120 120 120 120 120 
##$DP= (0..7)
150 150 150 150 150 150 150 150 
##$DP07= 0
##$DPNAME0= <>
##$DPNAME1= <>
##$DPNAME2= <>
##$DPNAME3= <>
##$DPNAME4= <>
##$DPNAME5= <>
##$DPNAME6= <>
##$DPNAME7= <>
##$DPOAL= (0..7)
0.5 0.5 0.5 0.5 0.5 0.5 0.5 0.5 
##$DPOFFS= (0..7)
0 0 0 0 0 0 0 0 
##$DQDMODE= 0
##$DR= 18
##$DS= 0
##$DSLIST= <SSSSSSSSSSSSSSS>
$$ [...]
##$SUBNAM0= <"">
##$SUBNAM1= <"">
##$SUBNAM2= <"">
##$SUBNAM3= <"">
##$SUBNAM4= <"">
##$SUBNAM5= <"">
##$SUBNAM6= <"">
##$SUBNAM7= <"">
##$SUBNAM8= <"">
##$SUBNAM9= <"">
##$SW= 18.0517328524113
##$SWIBOX= (0..15)
0 0 2 0 0 0 0 0 0 0 0 0 0 0 0 0 
##$SW_h= 3612.71676300578
##$TD= 16384
##$TD0= 1
##$TE= 0
##$TE2= 300
##$TE3= 300
##$TEG= 300
##$TL= (0..7)
0 120 120 120 120 120 120 120 
##$TP= (0..7)
150 150 150 150 150 150 150 150 
##$TP07= 0
##$TPNAME0= <>
##$TPNAME1= <>
##$TPNAME2= <>
##$TPNAME3= <>
##$TPNAME4= <>
##$TPNAME5= <>
##$TPNAME6= <>
##$TPNAME7= <>
##$TPOAL= (0..7)
0.5 0.5 0.5 0.5 0.5 0.5 0.5 0.5 
##$TPOFFS= (0..7)
0 0 0 0 0 0 0 0 
##$TUNHIN= 0
##$TUNHOUT= 0
##$TUNXOUT= 0
##$USERA1= <user>
##$USERA2= <user>
##$USERA3= <user>
##$USERA4= <user>
##$USERA5= <user>
##$V9= 5
##$VALIST= <valist>
##$VCLIST= <CCCCCCCCCCCCCCC>
##$VD= 0
##$VDLIST= <DDDDDDDDDDDDDDD>
##$VPLIST= <PPPPPPPPPPPPPPP>
##$VTLIST= <TTTTTTTTTTTTTTT>
##$WBST= 1024
##$WBSW= 4
##$XGAIN= (0..3)
0 0 0 0 
##$XL= 0
##$YL= 0
##$YMAX_a= 36475
##$YMIN_a= -40875
##$ZGOPTNS= <>
##$ZL1= 120
##$ZL2= 120
##$ZL3= 120
##$ZL4= 120
##$ABSF1= 10
##$ABSF2= 0
##$ABSG= 5
##$ABSL= 3
##$ALPHA= 0
##$AQORDER= 0
##$ASSFAC= 0
##$ASSFACI= 0
##$ASSFACX= 0
##$ASSWID= 0
##$AUNMP= <proc_1d>
##$AZFE= 0.1
##$AZFW= 0.1
##$BCFW= 1
##$BC_mod= 2
##$BYTORDP= 1
##$COROFFS= 0
##$CY= -3
##$DATMOD= 1
##$DC= 2
##$DFILT= <>
##$DTYPP= 0
##$F1P= 0
##$F2P= 0
##$FCOR= 0.5
##$FTSIZE= 0
##$FT_mod= 4
##$GAMMA= 1
##$GB= 0.15
##$INTBC= 1
##$INTSCL= 1
##$ISEN= 128
##$LB= 0.25
##$LEV0= 0
##$LPBIN= 0
##$MAXI= 10000
##$MC2= 0
##$MEAN= 0
##$ME_mod= 0
##$MI= 1.114404
##$NCOEF= 0
##$NC_proc= 0
##$NLEV= 6
##$NOISF1= 3.799351
##$NOISF2= 2.8
##$NSP= 1
##$NTH_PI= 0
##$NZP= 0
##$OFFSET= 14.38212
##$PC= 1
##$PHC0= -1193.902
##$PHC1= -3.007805
##$PH_mod= 1
##$PKNL= yes
##$PPARMOD= 0
##$PSCAL= 0
##$PSIGN= 0
##$REVERSE= no
##$SF= 200.129724274929
##$SI= 16384
##$SIGF1= 3
##$SIGF2= 2
##$SINO= 400
##$SIOLD= 16384
##$SREGLST= <1H.CDCl3>
##$SSB= 0
##$STSI= 0
##$STSR= 0
##$SW_p= 3205.1282051282
##$SYMM= 0
##$S_DEV= 0
##$TDeff= 0
##$TDoff= 0
##$TI= <>
##$TILT= no
##$TM1= 0
##$TM2= 0
##$TOPLEV= 0
##$USERP1= <user>
##$USERP2= <user>
##$USERP3= <user>
##$USERP4= <user>
##$USERP5= <user>
##$WDW= 1
##$XDIM= 8192
##$YMAX_p= 0
##$YMIN_p= 0
$$ End of Bruker specific parameters
$$ ---------------------------------
##NTUPLES= NMR FID
##VAR_NAME=  TIME,          FID/REAL,        FID/IMAG
##SYMBOL=    X,             R,               I
##VAR_TYPE=  INDEPENDENT,   DEPENDENT,       DEPENDENT
##VAR_FORM=  AFFN,          ASDF,            ASDF
##VAR_DIM=   8192,          8192,            8192
##UNITS=     SECONDS,       ARBITRARY UNITS, ARBITRARY UNITS
##FACTOR=    0.0002768,     1,               1
##FIRST=     0,             0,               0
##LAST=      2.2672688,     0,               0
##MIN=       0,             -40875,          0
##MAX=       2.2672688,     36475,           0
$$ Real data points
##PAGE= N=1
##DATA TABLE= (X++(R..R)), XYDATA
0@%%%%%%%%%%%%%%%%%%%%%kJ0j6J6j6J6j6J8k6L2l2L5m3M8n1N9o7P6q4R2j03J13
43E9j26J42j56J71j88K07k30K53k77L07l40L74m12M57n10N70o38P23q28R57j124
64f09J351j679K196l146N452k3888k0552M2263L5087n062k2087j0378l799j677
78f528j611J5104k669j1270m146K577O778K725N847O688m283j2458m466O023Q76
93h13N072J413l582p916p746Q474O137m411R29R157M499m838n19J615l772j3821
109a0122l946J1861J460l127j645J445L550L032P488N217n615j1494q62J632m707
124e833k225N280R951l679j2181K782Q757j066n739K493P370P80p399m678M212
139a175O29K369K059l087q81J297J553n81m391P89N495J03n245l533l765r49L669
$$ plain form
0 0 0 0 0 0 0 0 0 0 0 0 0 0 0 0 0 0 0 0 0 0 0 -2 8 -8 8 -8 8 -8 10 -16 16 -16 19 -24 24 -27 32 -35 41 -43 49 -54 59
43 59 -67 75 -81 90 -98 109 -121 132 -145 162 -178 196 -216 241 -269 301 -337 386 -442 515 -609
64 -609 742 -937 1259 -1887 3565 -20323 -40875 1388 36475 31413 9326 -1052 -4851 -6528
78 -6528 -8139 6965 4296 -6974 -11120 -8543 -1765 960 6807 13495 9212 -3246 -7712 -1689 -813
93 -813 4259 5672 2090 -5826 -13572 -5098 1039 -3372 -2443 6714 11213 6375 5856 7471 3699 -10122
109 -10122 -14068 -2207 -747 -3874 -5519 -4074 -524 2508 9996 15213 9598 -1896 -2758 -1126 -5833
124 -5833 -8058 -2778 7173 3494 -8687 -5905 2852 1786 -3953 -1460 5910 6690 -709 -5387 -1175
139 -1175 -546 1823 3882 795 -86 1211 2764 2183 -2208 -1419 4076 4179 -1066 -4599 -8364 -9313 -5644
156e644N553O350l993o411N629O493l106o229J572P214M08r323l710J828j52K657
172h64K831j041j118k380P26J172k279j77L655L7j298n85j45J990J39J936O245
189H844m02n439l172n65K41j507j677K191o7k941N02m05k71K766K939J840K61
206C138j477N59K97j520J503J711j671j527k077m89M09j709R01M479K47l440k970
223c636K71J596j700q25L829K271r49K54o55Q01K303Q67L61j998k697j85n24k040
241b656M65N72P23Q5k272q00R81m0J828L022O57L38j962J26J734j322j023J365
259A821m4j050p12j730l49K90Q34J816j230j645K79L53o92J416P81J243N55j457
277D79L23J12r03P21J025L89l02k436m25J195j001q16J345n95J74q33o58O08J37
$$ plain form
156 -5644 -91 6259 2266 -4145 1484 7977 4871 -1358 214 7428 7836 -1487 -5197 -3369 -3521 -864
172 -864 1967 926 -192 -2572 -1846 -674 -2953 -3130 525 562 -736 -1321 -1466 524 663 2599 8844
189 8844 8442 3003 -169 -734 -493 -2000 -3677 -1486 -1553 -4494 -3992 -4397 -4668 -1902 1037 2877 3138
206 3138 1661 2220 2517 997 2500 4211 2540 1013 -1064 -1553 -1144 -2853 -1952 2527 2774 -666 -3636
223 -3636 -3365 -1769 -3469 -4294 -465 1806 857 1111 456 1257 3560 4427 4788 2790 93 -92 -616 -2656
241 -2656 -2191 -1619 -896 -811 -3083 -3883 -2902 -2942 -1114 1908 2565 2903 941 1067 2801 1479 456 1821
259 1821 1777 727 15 -1715 -2064 -1774 -940 876 -354 -1999 -1720 -1367 -2059 -643 138 1381 1936 479
277 479 802 914 11 732 1757 2146 1844 -592 -1017 178 -823 -1639 -294 -889 -715 -1548 -2206 -1598 -1461
296a461J379K202n31n84P69o34l48K97p38R43o14j820j81l63m21R39L26O57O78
315D95j355J30J158m27N29M23n4N36j112k03M49j164K61J302r87n10j60m93M46
334g36M85p40J397J63o80L64o79K57L76M6K57R91j217M30j57m71L67l40l19N5
354a51q38l12K84j118J279R35j73J48r2L26P05o3K24N53p07L32n18r21l14l48
374g69j290M09K25k99Q32L04K95J018R3M99M28j554K49K19q53O37k29j2M61l77
394B86l61N54p63l82K00o77M27K92j023O47P33J9L22j43J5O72L75N11J79j112
414G71L53M4q10l78r00r39K9K84L55M27n27R61J308l26r3p1j95R16q7n88M06k46
436F94p0qm95o5j29q68K62j61j74K76k66j51Q20L85J15j8j15K54J11M31L40l52
$$ plain form
296 -1461 -82 2120 1589 1005 1774 1140 792 1089 351 1294 680 -1140 -1321 -1684 -2105 -1166 -840 -183 495
315 495 -860 -730 428 1 530 953 899 1435 323 120 569 -595 -334 968 -19 -529 -689 -1182 -736
334 -736 -251 -991 406 569 -111 253 -426 -169 207 253 510 1501 284 714 557 86 453 113 -206 -151
354 -151 -989 -1301 -1017 -2135 -856 79 -94 54 -38 288 993 930 1154 1707 1000 1332 814 -107 -421 -769
374 -769 -2059 -1650 -1425 -1724 -892 -588 -293 725 818 1317 1745 191 440 659 -194 443 214 202 663 286
394 286 -75 479 -284 -666 -466 -1143 -716 -424 -1447 -800 -67 -48 274 131 146 818 1193 1704 1883 771
414 771 1124 1168 358 -20 -920 -1859 -1830 -1546 -1191 -764 -1291 -330 978 652 559 488 293 1209 1122 534 940 694
436 694 624 616 121 56 -73 -941 -679 -840 -1014 -738 -1004 -1155 -335 50 165 147 32 286 397 828 1168 816
458H16p08Q48N1r06N0j030O89M28j006l02m22K46O30P0j81J218J82k52M49k28
478F42j51O90q05P73l06p49J38n77j05k50j30k76M42r33J20J161P73K14l23q7
498B61J432l59j167k82k36O26Q42j001k52J79k6j45j05l21j00o34J76Q20k43K7
518e08O54M50M42q6p81j1J38m24O16L5M40k27r91l05J51j64o00j60L49J102R7
539B17o97K21M21N35N79q58r17K58p1Q89K93o50r3m7J21n15j044m07O89M17L72
560b87L42q8N60kj07M54j78l03k85l38P2M41m48L58K29l04j62k02n13J03J39J01
582d18J093k08l03o67j17P44M29l60k28O03N60k44m06l18L38k74n82k38o80N9
602a217o2J61Q40O57J89L2j73L29o0k17j23K53m85k31j4o01J50L50k03N34r9k32
$$ plain form
458 816 108 956 1007 101 151 -879 -190 238 -768 -1070 -1492 -1246 -616 -546 -727 491 673 421 870 642
478 642 491 1181 376 1149 843 94 232 -345 -450 -700 -830 -1106 -664 -1597 -1477 -316 457 671 348 261
498 261 1693 1334 167 -115 -351 275 1117 116 -136 43 17 -128 -233 -554 -654 -1288 -1112 -292 -535 -508
518 -508 146 596 1038 952 171 160 298 -126 490 525 965 738 -253 -558 -407 -571 -1171 -1331 -982 120 217
539 217 -480 -259 162 697 1276 418 -499 -241 -312 577 870 220 127 80 201 -314 -1358 -1765 -1076 -659 -287
560 -287 55 -33 527 525 418 872 694 391 106 -232 -160 281 -167 191 420 116 -46 -248 -761 -658 -519 -418
582 -418 675 467 164 -503 -620 124 553 193 -35 568 1128 884 478 160 498 224 -358 -596 -1276 -1217
602 -1217 -1279 -1118 -278 379 568 600 427 756 696 479 356 609 124 -107 -121 -722 -572 -222 -425 109 10 -222
624b22j73K04J58N50j004N0P81m13K20l90r5R04L05K73j60q71J29p8l38k44k97
645g11j90M50l36l75M1Q75P79L95k2o1o2m24q7K12m52L17l25o33K94k33k05M91
667b62n8K43l1o08M01P5r9M50J76r1J44J4m2o4K88o0j55k43K69o39m53L54j53
690e44k3N28k37j08J52l35K72O91l0M59l10k92Q6j66j28L38j13j79J10j86q5m23
712e23p4J02J69k44M28l56k60Q39p7L08O55m86K19J5j91k58l38K3J14l58k29n
734e27k41M32P2O0J47J96R5m06M69l10M88l48K13j87J19q0K5l3Q3j39l02j6j58
757c48J3J75n11J73L65J20j27J73k67M95J7L43p2J32k90J08p27J93j99k62O62
778A66k34j99k9j5k52M37J56J70N9j01j10J77n1M12j26l00j11J09k60j59j8J72
$$ plain form
624 -222 -395 -191 -33 517 -487 -437 344 -69 151 -239 -334 570 875 1148 988 117 246 168 -170 -414 -711
645 -711 -901 -451 -787 -1162 -1121 -246 533 928 906 845 783 359 272 484 32 349 24 -609 -315 -548 -753 -262
667 -262 -320 -77 -108 -716 -315 -240 -339 111 287 196 340 354 312 248 536 476 321 78 347 -292 -745 -391 -544
690 -544 -567 -39 -276 -384 -232 -567 -295 396 366 825 515 223 309 143 15 353 240 61 171 -15 -100 -523
712 -523 -597 -495 -326 -570 -142 -498 -758 81 4 312 967 481 700 715 524 266 -72 -49 65 -293 -522 -527
734 -527 -768 -336 -264 -204 -57 139 234 -172 297 -13 475 127 340 153 272 192 217 184 267 128 -174 -190 -348
757 -348 -335 -160 -671 -498 -133 -13 -140 33 -234 261 278 621 549 681 391 499 -228 -35 -234 -496 166
778 166 -68 -267 -296 -311 -563 -126 30 200 259 158 48 225 174 586 460 160 49 158 -102 -261 -279 -107
800a07j08k5O4J25j85J57K77l25J69L4O9K70n30K85L99k23k43L13l24O6j7j65
822b4l12M21p18N80l47l64M97J7K18K53n65O67l20L72J29j01j12J65l90j06Q5
843D5p26P2k2j00N80J27k10L61m10N27j80M6l99N89j30P2j40J69J11j42j35L10
865D15m84p6J90m00J36r4J47j07J85r6o5N10m47M32m7M4K15J41j95k93l37K00
887b6q9m32L62j70j97J68J75k35N41j08J06o6j34O00l16O3R9K1m86L44k59J26
909H7j88Q3o6o4J86l21R6l66M12J43rL26m68K04K23j33lJ39l80L55k03j6M5k14
933a32l1M1j72K2k39K06J55k53L18J65q9n3J25J97R6m5K01k27L3P0n06kk07K13
957a14l30n0K56J8q8K39L4J59N1k08J35JL05m38k1j83O53l92J12K63n52m1K72
$$ plain form
800 -107 -215 -240 -176 -51 -236 -79 198 -127 42 76 145 415 -115 170 569 346 103 416 92 158 141 -24
822 -24 -336 85 -633 -53 -400 -764 -267 -250 -32 221 -344 323 3 375 504 403 291 456 66 -40 45
843 45 -681 -609 -631 -731 -151 -24 -234 127 -283 244 64 110 -289 300 170 242 102 271 382 240 105 415
865 415 -69 -145 45 -355 -219 -313 -166 -273 -88 -184 -249 261 -186 246 199 243 458 599 404 111 -226 -26
887 -26 -115 -547 -185 -355 -552 -384 -209 -444 97 -11 95 29 -105 495 179 242 341 362 -124 220 -39 87
909 87 -101 -18 -84 -148 38 -283 -187 -553 -141 2 -7 319 -149 55 278 145 142 281 -99 256 53 37 82 -132
933 -132 -163 -122 -294 -272 -511 -305 -150 -403 -85 80 -9 -62 63 260 356 311 512 285 318 388 -118 -120 -327 -114
957 -114 -444 -494 -238 -220 -308 -69 -35 124 175 -33 102 103 408 -30 -51 -234 419 27 139 402 -150 -191 81
980H1j27j45j72J17L93k58K25j0k94J22J97K65k00P5n1J09j80j8j03p2k38j39
1002d23Q4J83j0n52P38k85J72J24m5j39M15k21M83k79QL1k78J12j9k23l7j07R6
1025a72J7M3j40L61m0k76J26K35q5JJ71m78L32Q8j64M49j73l43J02P3l19kj51
1048c45K44N6j60P6p8J33j18L28k38L97n1Mj98L14k4l44Q1J02r0m06K19Nk53r
1072c55K15J58k55L8N84j87N5n4r3O5K80k97l79M40l73M3Q0J6m8j47mL03n45L67
1096i3Nl81M71J24m1k00K15K2K37l12N1L23m43J1L14l29j1J36l10j09K80k60P
1119b93L02nk9j16M75m3o1J10n0K4K4j32k34L6l90J07O46n50j81P7K04p9P9M4
1143c5K94j35l9L28j85j63O1j51K24J03l39l03J97p2K65q0j89K69j73P3R9j3k61
$$ plain form
980 81 -46 -191 -363 -246 147 -111 114 104 -190 -68 129 394 194 269 218 327 147 129 26 -46 -284 -423
1002 -423 -339 -156 -166 -718 20 -265 -93 31 -14 -153 262 41 524 245 253 284 6 118 99 -124 -161 -268 -172
1025 -172 -155 -112 -252 109 69 -207 -81 154 69 70 241 -237 95 183 19 468 295 -48 54 127 -192 -194 -345
1048 -345 -101 -45 -205 -129 -207 -74 -192 136 -102 295 244 248 50 364 340 -4 77 179 89 -317 -98 -93 -346 -355
1072 -355 -140 18 -237 -199 385 198 253 199 106 171 451 154 -225 215 -158 -115 -35 -19 -67 -214 -218 85 -460 -93
1096 -93 -88 -469 2 126 85 -115 100 122 359 47 98 421 -22 -11 303 -26 -37 99 -211 -320 -40 -300 -293
1119 -293 9 4 -25 -141 334 291 230 340 290 314 338 206 -28 8 -382 -275 371 -179 -360 -283 -79 -158 -79 -35
1143 -35 259 124 85 413 228 65 126 -25 199 302 -37 -340 -143 -215 50 -30 -219 50 -123 -50 49 36 -225
1166b25o5J81L36l03O0J78np8Q7l36L42K8k6m77k6K3p3K2qQ3J20j98K21NK32N7
1192A55J79RJ34l57Qj3J13q7j82k8j5j02k0k5Kk3M04k21L66n53K89K74l14pN3
1217C9K20l92N1o1L65m22K80J74l63J04K25l84K43k55J95l17M20j38K33J15nm3
1239B84n9j85J76j39m4Q7k52q0K7j9j06M5k6L91r7q1L02l35P8J64L43k30J02n92
1263b46K71K16m40L51m55R2J61j61K32j90J71j08M31n49O2M39k43q1J70J37N3
1284C13o7j76K37l31K1rj27J21Pj25j12J59k50K20M9NJ17k57L80L4N8j50J09k16
1308A0J0nL5j5n1j03K91L1j59Rm99N35k04J22J9j23J13J92K25m36K99R7j41j84
1332F8k53K18j04L8r6LJJ92j47J39J00j27j52J62q2j55K62LJ29j73K92j35Kk1
$$ plain form
1166 -225 -290 -109 227 -76 -16 162 157 79 166 -170 172 200 174 -303 -329 -306 -379 -357 -365 -282 -162 -360 -139 -134 98 155
1192 155 334 343 477 120 128 115 228 141 -41 -69 -84 -186 -206 -231 -229 -252 152 -69 297 -256 33 307 -7 -14 39
1217 39 259 -133 -82 -143 222 -200 80 254 -109 -5 220 -164 79 -176 19 -298 122 -16 217 332 327 284
1239 284 225 40 216 77 33 120 -132 -212 -185 -204 -310 -265 -291 100 3 -78 224 -111 -33 131 474 244 346 -246
1263 -246 25 241 -199 152 -303 -211 -50 -211 21 -169 2 -106 325 -224 -162 277 34 -47 123 260 313
1284 313 246 70 307 -24 -3 -12 -139 -18 -11 -136 -248 -89 -339 -119 -70 -65 52 -205 175 209 267 117 226 10
1308 10 20 15 50 35 -16 -119 172 203 44 53 -446 89 -115 7 26 -97 16 208 433 -3 296 393 252 68
1332 68 -185 33 -71 -33 -129 -126 -125 67 -80 59 159 32 -120 42 -40 -195 67 70 199 26 318 183 185 164
1356A64k64j60N13k61q9K57k50k22L1K95l2o5l8M80j91n7j38K26n2m3o4m09J27
1379b42n1M4L07r0m3J5l55M49K7j51n6m7K68O9M1l03K92j61P1K94m96J29K24k59
1403b4m2mO5R0R4j77qj26Q8K27k06M46j24j69K7NJ7j08QO4J25n67J64J52j91n8
1429b32K17R3J61j52Nk17M0K92kJ56j51J19j63j99O6l31J16q3L03j7j28k2K31
1452A02l12J51J08r9J06J54k82k0N1j18M11k05Q6j53j97qL83k94K50n1l51L53
1474F5j25M0K11j03j71K09q8l6L68k69O7j38M21m86k8jp8Qj56M5K7J89R0k27q3
1499b49K51K2r8M8J41j27J5l16J69M55r5q1q2k49J64m1o3k90J25J32j70M80k04
1522f3N6J00K1j11j71K45j3J54k41J73n7O2J8k47J42q2l5k47L24Nj81O7k13M89
$$ plain form
1356 164 -100 -260 253 -8 -97 160 -90 -312 -281 14 -18 -83 -121 359 168 111 -27 199 147 104 40 -369 -242
1379 -242 -293 -249 58 -32 -75 -60 -415 34 61 -90 -146 -193 75 144 185 -118 174 13 84 378 -118 11 235 -24
1403 -24 -66 -70 -5 85 179 2 -6 -132 -44 183 -23 423 299 130 157 162 179 71 79 143 268 -299 -135 17 -174 -232
1429 -232 -15 78 239 87 92 -125 -85 207 205 361 210 329 166 -33 33 -298 -182 -265 38 21 -107 -129 102
1452 102 -210 -59 49 -50 56 210 -72 -92 -41 -159 252 47 133 -20 -217 -225 158 -136 114 63 -288 65
1474 65 -60 -20 191 88 -83 126 38 2 370 101 168 30 451 -35 -63 -64 -142 -134 -290 -245 -218 -29 61 -166 -249
1499 -249 2 24 -74 -26 115 -12 3 -313 -144 311 216 135 53 -196 -32 -73 -136 -426 -301 -169 -339 141 -63
1522 -63 -7 93 114 3 -168 77 64 218 -23 150 93 155 173 -74 68 -14 -49 -296 28 33 -148 -81 -294 195
1546A95j91rj42J43J49N6J55l21P3j9p6k45J24q2K16j83rJ36L8r0M9K32l82K41
1570E8Nl6J34o5J46j26O7k92L56j97l3J06o8o4J7J16k70l22L48Q7JK24j69K49
1594B72j53j07N5Q0o3j72J49K52l37%k94L74L4l05K49j85K22J98l14Q7L35l11
1616F6K05j46j35L72l81R2k70K19N7l35J75k9q8Q0Q0P0j25N9k2K2kJ25M3k56L6
1641h8K58k47K77k82L98n8m23M5j41J51j7q1K9L1l5K67j39j2K68J13k34j27K98
1664B51M7L7k7m85J13O8J11n2J04l32k5L81n23K95J9l6O9l61L26L24m65L02l19
1687a78j09J86J10j89K75j80R3R3j47q3N1O9R0j03P5o1qK54q7m3N6O5l21K81k87
1712i8K75k09j88J59Q9J32m39J35k15J92J25j5K95j48q9K66j20P0J0k90Q0j08
$$ plain form
1546 195 4 -5 -147 -4 145 201 356 35 108 89 13 -232 -108 -190 26 -157 -166 -30 8 -82 -33 199 -183 58
1570 58 63 27 161 96 242 116 183 -109 247 50 17 123 55 -9 8 124 -146 -468 -120 -33 -32 192 23 272
1594 272 119 12 67 147 84 -88 61 313 -24 -24 -318 56 90 -215 34 -151 71 269 -45 42 377 66
1616 66 271 125 -10 362 -19 73 -197 22 79 -256 -81 -110 -198 -118 -38 32 -93 -34 -56 -34 -36 89 132 -124 -88
1641 -88 170 -77 200 -82 316 258 -165 -120 -261 -110 -127 -208 -179 -148 -183 84 -55 -67 201 314 80 -47 251
1664 251 298 335 308 -177 -64 4 115 63 167 -165 -190 191 -332 -37 -18 -54 15 -346 -20 304 -161 141 -178
1687 -178 -287 -101 9 -180 95 -85 8 101 -46 -129 -78 -9 81 -22 53 -8 -16 238 151 108 164 229 -92 189 -98
1712 -98 177 -32 -220 -61 28 160 -279 -144 -359 -167 -42 -57 238 90 1 267 147 217 227 -63 17 -91
1734i1L07l79J6K32J4j07J10n0J2k77K97j23J19P7Mj6l03K39Q3l4R1l64K86j46
1758cj98J73K1k6L8N2jj57j73K97j87J75k57L01J21k19J67J70m7l79L40k89J81
1781A00k67o3R3J37p7J08j39K13K6r1m46M50k44K62j4j36J3J04J37k47J23k45
1803b03K30j14J36N4K01l38j75j3J52o1o4O8L92l53O2j8N5J82qP8p3j8J55l95
1827f8J61k26O2j11K10Q0m49K72O0l9N4N2n3k01M84j61l35O99m80J58n2j71P9
1850B5m4jNj33l8N88m48J24j4m3J2M8k0MO5n8j63J06J20o9j22K24R4k20j47Q2
1876b3J8j08J00J15q0J15j28L75n77m4K88n2Q1J26j88o3P0j9j54M9q2K00r3j80
1900b54K7o0K04R4K77n4k04P1j96%Q5J36j57m9M8p0L17m75K36j42R4j58po0L75
$$ plain form
1734 -91 216 -163 -147 85 99 -8 102 52 64 -213 84 -39 80 157 161 145 -158 81 164 130 221 -143 143 -3
1758 -3 -201 -28 -7 -33 5 57 56 -101 -274 23 -164 11 -246 55 176 -43 124 294 247 -132 208 -81 100
1781 100 -167 -230 -137 0 -77 31 -108 105 131 40 -406 44 -200 62 48 -88 -75 29 166 -81 42 -203
1803 -203 27 -87 49 103 304 -34 -209 -222 -70 -131 -195 -127 265 -88 -26 -44 11 193 185 263 190 172 327 -68
1827 -68 93 -133 -71 -182 28 108 -341 -69 -9 -48 6 58 5 -196 288 127 -208 491 11 169 117 -54 25
1850 25 -19 -20 -15 -148 -186 402 -46 78 64 21 33 81 61 65 130 72 -91 15 135 66 -56 168 262 42 -105 -23
1876 -23 -5 -113 -13 102 22 137 9 384 -193 -237 51 -1 80 206 18 -45 25 6 -148 -99 -181 19 -74 -254
1900 -254 -227 -287 -83 11 288 234 30 101 -95 -95 -10 126 -31 -80 -32 -102 215 -260 -24 -166 -72 -230 -237 -297 78
1925G8j12J46k00k7P0k2r1NJ44Q3j07N3K09m19L42k13M3J39l33J16Q9O1N2O8m76
1950c02J78K70n7N1K9j98nj90L05j49L0j80K57j62J42j60Q3l7J02j79J59%k44
1973b57J98j06O9K19Q0j45R9k4J39l79J64k21j0O9K13j21j24K03j50L16j97j95
1995a60M3K23o6R7pq2Q6r9j63j62K11J49q8j72L81P5m78J60J3j24K43j86j40K91
2019D5K14k46K39k61M9J67j67m4K2j09J57j21j72K09K25L5j33O5N7l47J03K21
2041B08j74J1J40k74K68k7j04r3J08j66N0q3m7m0L65k44L8l9J33m0j90K76J02
2064A78J66m15K66j54j02J11k03K2q4P1K3P1Q1k5N0j12l8J09k43J19K59j10o1
2087b1m7L23k43j27p9O8j5J66k1p0K00m67O4M09l22Q6n4K08J10j82l9r4J35J37
$$ plain form
1925 78 -34 112 -88 -115 -45 -67 -158 -153 -9 74 -33 20 229 -190 152 -61 -18 121 -212 -96 -7 54 106 174 -302
1950 -302 -124 146 89 140 169 -29 -34 -224 81 -68 -38 -218 39 -123 19 -141 -58 -95 7 -172 -13 -13 -257
1973 -257 -59 -165 -96 123 203 58 157 133 272 -107 57 -164 -174 -105 108 -13 -137 66 -84 232 35 -160
1995 -160 -117 106 40 137 130 48 134 35 -128 -290 -79 70 -18 -190 191 266 -212 -52 -39 -163 80 -106 -246 45
2019 45 259 13 252 -9 40 207 40 -4 18 -91 66 -55 -227 -18 207 242 109 174 231 -116 -13 208
2041 208 34 45 185 -89 179 152 48 -45 63 -103 -53 -136 -183 -223 142 -102 -64 -103 30 -10 -200 76 178
2064 178 344 -71 195 41 -61 50 -153 -131 -215 -144 -121 -50 31 6 56 -56 -94 15 -228 -109 150 40 -21
2087 -21 -68 255 12 -115 -194 -126 -141 25 4 -66 134 -333 -269 140 -182 -96 -150 58 168 -14 -53 -147 -12 125
2111A25j02K1J08j15j13J27k4j28M3J72k72kj37K3K23K71k00K70l21J05j56K79
2133A97k77j87n0O49p32K16L50k75K03m35K50j20J36k71J54K84j48J35k02L2K73
2154A82j69k75K89Mp6j91R8J79l2k61j98M85k11P4J86j20J74j83J36k89K96k23
2176a25J96L9J02m21K58m4k6M0J17r4p3J5l22N25q1j93l27M48o9P5j0j14K31k39
2200i2Q6J51J3j73L47l67P2j62j5J13k19K03p4j06J36K87j97p0L28m27M11m65
2222b20K57J78k71K6J0J25k19K2J75r8J91k17m4K13k37l4L7M9k50L06k8O6K3L3
2246I3j07J72k18k57N74j97j38J3jL8j03J50l35M24l1J1l7M5j67J61J82l14J60
2269A18k30L18k07j61P5N2J26j37q9J24N4r6J71k67K31J9o8J88k3m7j99J44M9
$$ plain form
2111 125 23 44 152 37 -76 51 27 -101 -58 114 -158 -160 -297 -274 -51 220 20 290 -31 74 -82 197
2133 197 -80 -267 -317 332 -400 -184 166 -109 94 -341 -91 -211 -75 -346 -192 92 -56 79 -123 -91 182
2154 182 13 -262 27 31 -45 -236 -138 41 9 -252 -450 35 -176 -102 84 -36 138 -45 91 -198 98 -125
2176 -125 71 110 212 -209 49 5 -21 19 136 42 -31 -16 -338 187 106 -87 -414 34 -35 40 30 -84 147 -92
2200 -92 -6 145 158 -15 332 -35 37 -125 -140 -27 -246 -43 -117 -223 -87 200 3 -67 261 -166 245 -220
2222 -220 37 215 -56 -30 -20 105 -114 -92 83 -15 176 -41 -85 128 -109 -143 -106 -57 -307 -1 -29 37 60 93
2246 93 -14 158 -60 -317 257 60 -78 -65 -66 -28 -131 19 -316 108 77 88 51 96 -71 90 272 -42 118
2269 118 -112 206 -1 -162 -87 -35 91 -46 -135 -11 43 -53 118 -149 82 101 33 221 198 151 -48 96 145
2292A45n4L8j76k50K75ok3j82M23n28L45o4K18o5l89L73Q0j47P2L92m30mK11n05
2316b51M81j19k09P8pP6L0K6k78K75j34J05j67J96J44l18J04m1j55J15k20K15
2338e4J59k09L2j35M31j28J99l09LJ53k0j81K5J88j81J74k2K6m40L34L6l4k10
2361a63K30m88N44J85m63J8J75oL68n77J6J47J93j40m5K64k77J9M9l7J46k20l4
2384i6K38K0k27J82j33J0r2J91P0k24j26J77Q6j26o2M07l34k36J87K76l83R3J62
2407F0K8j16j0J00k21K3j2J3K04J30j68j95k15J71J54K26j99N8j32J19k45J30
2429i7L03k07J69j83N0r7J47j47n8K64N4l95L89j61Q5q7P3K60l42P3l45L06p5
2452b1Lj35N4j29lK50Q3r3P1k22L67j07l6k5n8Q4j45J76p6J74o7k76K96j06m64
$$ plain form
2292 145 91 129 -47 -297 -22 -28 -51 -233 190 -338 7 -57 161 96 -293 80 160 13 85 477 47 43 254 -251
2316 -251 230 111 -98 -20 -27 49 79 105 -173 102 -32 73 -94 102 246 -72 32 -9 -164 -49 -269 -54
2338 -54 105 -104 -72 -207 224 96 295 -14 -11 142 122 -59 -34 154 -27 147 125 151 -289 45 81 47 -163
2361 -163 67 -421 123 308 -155 -137 38 32 400 -177 -161 -14 179 39 -6 258 -19 0 49 12 158 -62 -96
2384 -96 142 162 -65 117 -16 -6 -98 93 163 -61 -187 -10 76 -50 -112 295 -39 -275 -88 188 -195 -102 60
2407 60 88 -28 -38 62 -159 -136 -148 -135 69 199 31 -164 -379 -208 -54 172 -27 31 -101 18 -227 -97
2429 -97 206 -1 168 -15 35 -62 85 -62 -120 144 198 -197 192 31 116 29 102 362 20 93 -252 54 -21
2452 -21 -18 -153 -99 -228 -231 19 102 9 80 -142 225 118 82 57 -1 83 -62 114 38 212 145 -131 165 59 -405
2477d05M22J36j19Q5j57K02j83m0J44l58L45qj02Q8RP5l55J05J23r0L00n29J95
2500a17M61o49K57J88j70%J60l53K15j43J45j09J28j08O2M2J20j68o7L5J32j09
2522d8N9O4k18K85k79q6K60j3j67J28l21K82J90l42Q4R6j41m4J45k14J51P7j15
2545a67N9J0k15P5K62L3J05l63K03J93j80M3J07l07K64j05l91L15L08k68K04k56
2567g1O0q2J37k66J91j4K77l45J40O7k05M9k6L23n2j38j25j1L9JO1l40L77kj14
2592f9J72j42o5K32q5QP7k40P3p9K07p7j9R7k1Jj45jL3j29m4M74r6j94l16K27
2618a21M4k10K02K47j16o9O6J18Q1k40k23K40K77k96K94m32k9L28j27q0J65j05
2640A4q2J46J35k41l3L6O7K76k99J53l44J06Q9J73k85R1j9K54Km58K90r2J10k48
$$ plain form
2477 -405 17 153 34 119 -38 164 -19 -59 85 -273 72 64 -38 50 59 134 -221 -116 7 -83 217 -312 -117
2500 -117 344 -305 -48 140 -30 -30 130 -223 -8 -151 -6 -115 13 -95 -33 9 129 -39 -106 -71 61 -48
2522 -48 11 75 -143 142 -137 -223 37 24 -143 -15 -336 -54 136 -206 -122 -26 -167 -211 -66 -280 -129 -52 -167
2545 -167 -108 -98 -313 -238 24 57 162 -201 2 195 15 58 165 -142 122 17 -374 -59 249 -19 185 -71
2567 -71 -11 -93 44 -222 -31 -45 232 -113 27 94 -111 -62 -88 235 183 45 -80 -91 -52 -51 10 -330 47 45 -69
2592 -69 103 -39 -104 128 43 51 128 -112 -39 -118 89 12 -7 90 69 70 -75 -76 -43 -172 -216 258 162 -32 -348 -121
2618 -121 -77 -287 -85 162 46 -23 43 161 242 2 -221 19 296 0 294 -138 -167 161 34 -46 119 14
2640 14 -68 78 213 -28 -61 -25 42 318 19 172 -172 -66 23 196 -89 2 -17 237 239 -219 71 -21 89 -159
2664a59m9n7L82k28J48o6k36L31m7j30J3n0J23j55KL09j86k7k82M00J23k86J98
2687G1q9P8j48J52j08j8K05j11M3k64M36k80J08M6k37J01n7K4j11K2L7J99n6M0
2711H3j76J74kj90J69p4J53J05o1m91K22LK44o6k06q2P7M04k82rj42K87j00J02
2735A42j07j37QK23K39j71k18N5j24mJ98j94J00K5l75K5L48q3L17m30N0n3n0Q5
2759a31L03j73m0K17j55l1J15m12K53k6J18J45j66n8J11P4j20M1m4J32rJ07o00
2782c49Q4K61ll8q7K47J6l5m8j83lR4k0K20k35J35k52J55J2J82j2j36j12J18j0
2807Aj26K17j11K6k1J9j66L63k32J59L5J33l22k07K47P6j17K15q4j99J31k00J51
2830a2j00J9L4p6N9P9J41j83m7N1k36M41j61J37q8j18M5P7j52P8J41l51L19J84
$$ plain form
2664 -159 -208 -265 117 -111 37 -29 -265 66 19 -111 -98 -148 -25 -180 -178 131 -55 -82 -364 36 159 -127 71
2687 71 -18 60 -88 64 -44 -62 143 32 75 -189 247 -33 75 121 -116 -15 -72 -48 -159 -137 -100 99 43 83
2711 83 -93 81 79 -111 58 -16 137 242 181 -310 -88 -85 159 93 -113 -195 -118 286 4 -5 -147 140 40 142
2735 142 35 -102 -94 129 368 197 -21 34 -90 -94 104 -90 10 35 -340 -315 33 -50 267 -163 -113 -166 -216 -131
2759 -131 172 -1 -41 176 21 -10 105 -307 -54 -80 38 183 17 -41 70 144 24 65 21 153 144 251 -349
2782 -349 -265 -4 -7 -45 -132 115 131 96 48 -135 -138 -44 -64 156 -79 56 -196 -41 -29 153 141 5 -107 11 1
2807 1 -125 92 -19 7 -14 5 -161 202 -30 129 164 297 -25 -232 15 91 -26 189 105 -94 37 -163 -12
2830 -12 -112 -93 -59 -135 -76 3 144 -39 -86 -35 -271 170 9 146 58 -60 -15 62 -90 -12 129 -222 97 281
2854B81n0R1k77k89K24j09L23j9O0r6j11rk2j44J95k2J63l28J09o9K0J01j01K27
2878A48m04J97J2N0j23j4L16k50j0l02M50k86K34K5L8J3Qm7k57K90j34J53j59
2901e2L03j38k57L48k18Lq8O1J35k21J37O8ro3m3o7M5k5O2K10l98P7J9J50%k23
2927a84J69jm2P7k43L14k2o1J00j44O4k59MK27L4r1J85j16k68K09Q3k35Q1J68
2951D9J76m38K95j14M1j44J48j4k60J08R1N3K4o6N9L7r4J18j68r1L6K38j3J08
2975A79j70J73j76j95M7M5L46Pl57L35n08L67l79L09j34j26J2K31j26J49J14M7
2997A90m45J17K27j74K42k10J51m0k1q2j06J55K42k68k20O9J56l1P6o5J3R7j00
3020b7J6J88j62K6m1K43k94JK70l99J52j50J02J15J3k22L49jQ7k31o0O9o8L6o1
$$ plain form
2854 281 231 322 45 -244 -20 -129 194 175 235 139 28 19 -3 -147 48 26 189 -139 -30 -99 -79 22 -79 148
2878 148 -256 -59 -47 3 -120 -134 182 -68 -78 -380 70 -216 18 43 81 94 102 55 -202 88 -46 107 -52
2901 -52 251 113 -144 204 -14 -11 -99 -38 97 -124 13 81 72 9 -34 -101 -56 -81 -19 191 -207 -130 -111 39 39 -184
2927 -184 -15 -16 -58 19 -224 90 68 7 107 -37 27 -232 -228 -1 33 -58 127 11 -257 -48 35 -200 -119 49
2951 49 225 -213 82 -32 9 -135 13 -1 -261 -153 -62 -9 15 -51 8 45 -49 69 -99 -190 -154 84 71 179
2975 179 9 182 6 -189 -142 -97 249 256 -101 234 -274 93 -286 23 -111 -237 -225 6 -120 29 143 190
2997 190 -255 -138 89 -85 157 -53 98 58 37 -45 -151 4 246 -22 -242 -173 -17 -48 28 -37 -24 73 -27
3020 -27 -11 177 15 41 0 243 -51 -50 220 -179 -27 -177 -75 40 53 -169 180 179 266 35 -25 44 -24 12 -49
3045d9K5j49K15m88O15ll26O4kM34n49L47J7J03k83j40J16j79N15j96j67K66j2
3068A74k8M3j34q7J20n1l1J41k17m9l7J1K70j95o3J00J42n03M96j94Oj78L87r6
3092B7O1j26r3O7J56J5m06J89K62o0j37K35j26Q1j19j0J10q0j07J12j93lj66M16
3116A05k61J19L3Q7j29M8J10O6o2l40N5J27J18m0J0k11M22l88K59k93K93K3j43
3139Hj54Q9J24l28M16l47K00K56l92K10o8J16k92K14k1Q2j41Qk0J13%N4j94J30
3163F3p5j62KK30k47L45oM2l66K70m7k71J92q4J56O0j60L1J31k16K48l24M8J74
3187C4j5O2k68k50M67j43J43m16K00K64j88Q7j43K81k42k9J4k05J93J76j79J25
3209c2M35l19j98MO0J03k04j1o6K30l6Q6j09K96k94N5n7J85l64L31k40M46l89
$$ plain form
3045 -49 -24 -173 42 -446 169 166 -160 -96 -98 336 -213 134 151 254 -29 -169 -53 -232 283 87 -80 186 174
3068 174 146 189 55 -32 88 37 6 147 -70 -119 -156 -145 125 -70 -133 -33 109 -394 102 -92 -86 -264 123 27
3092 27 88 -38 -131 -64 92 107 -299 -110 152 92 -45 190 64 145 26 16 126 46 -61 51 -142 -145 -311 105
3116 105 -156 -37 -4 83 -46 2 112 178 116 -224 -169 -42 76 36 46 -165 257 -131 128 -165 128 151 8
3139 8 -146 -57 67 -261 155 -192 8 264 -128 82 14 130 -162 52 31 113 -28 -20 -40 73 73 127 -67 63
3163 63 -12 -174 -172 58 -189 156 150 192 -174 96 49 -222 -30 -114 42 102 -58 -27 104 -112 136 -188 -140 34
3187 34 19 81 -187 -437 30 -113 30 -386 -186 78 -110 -23 -166 115 -127 -156 -142 -347 -154 22 -157 -32
3209 -32 403 84 -114 -110 -50 53 -151 -162 -228 2 -34 52 -57 239 -55 0 -57 128 -236 95 -145 301 -88
3232h8J89k80K80K9K6M7k2k02L2J00N2m1Qj94K03k15p2O7J38J93l14K04k50K25
3256A15Ql0p6k28N4N2j1K83m2O2q8m4Q4j94J7N1j43J78j66J88O3J43m25K26j11
3281c4R9O2l49J46M25m10j9n0k32K43K31r5l4P7r4r7K34l50K89j7J25j16o3KJ29
3306A02m00L69J66k83M7J64j79NL88l09O4k83J60Q2Q6l12J28j13J3J39k5r6n6
3329a43J8J25o6K40l72L18L7j12l71J98R3Q6j65K33l7M0l60Q9N7J23%k3n0NK5
3354a2J45j79J12P1L1m36L63j32N0nP1j45J11j09r2l8K65l9j37R0J84j44K6J24
3378A75m03O3K19j49p1K45k25L32n29L56j42K22j7J70k21j6L0k10M7M0L88k26
3400G8J6j85pj43K51k69L48J75n71L15r3K18k17mJ63k05L43k4j21j30J36n8Lk01
$$ plain form
3232 -88 101 -179 101 130 156 203 181 -21 11 111 163 122 130 -64 139 -76 -148 -81 57 250 -64 140 -110 115
3256 115 123 93 17 -211 -157 -105 -116 167 125 187 99 55 139 -55 -38 13 -130 48 -118 70 133 276 -149 77 -34
3281 -34 65 127 -222 -76 349 -61 -80 -130 -362 -119 112 17 -17 60 -34 -131 103 -247 42 25 150 34 -29 -27 102
3306 102 -298 71 237 -46 1 165 -14 -9 379 70 134 -149 11 93 179 -133 -5 -118 -105 34 9 -87 -143
3329 -143 -125 0 -66 174 -198 120 157 45 -326 -128 -35 51 -114 119 82 122 -238 -149 -92 31 31 8 -42 -37 -12
3354 -12 133 -46 66 137 168 -268 95 -37 13 8 79 -66 45 -64 -156 -194 71 32 -105 -15 169 25 51 175
3378 175 -228 -165 54 -95 -166 79 -146 186 -343 13 -129 93 76 246 25 9 39 -171 -124 -84 304 78
3400 78 94 -91 -98 -241 10 -259 89 264 -307 8 -85 133 -84 -88 75 -130 213 189 68 -62 74 16 19 -182
3424a82J89o4J0J6J21L2k27R1J17l7k48K47J73k2k91N34k42l4l11N0o2L44l89
3447a85N7K63k20p8K50N5j29j37j53N22l56J12j23j9J17J83j92k7R5Nk86qM69
3470B15j52l92M28j62J24j11MK40j78J57k30L35l58J52K3m9p7J1j7J68j11j20
3492a00K6j19J54Q9Q5m5j9R4j28j28J65j91J38N8K8k58j61J73M7J51j59K38j71
3515c3J7J69l32k1L39l20J55R2j04l5rL01k84J38J10k01J15N3J84m14J93k48O7
3538f8L9j8J58j76k4m4Qp7N16j99Q0k1k22o6J24kM02l66j02K7l8J37j93ML13k34
3564d2K90P6k59k17L2J07J4K85n9k32L7O1j42K23k76L26k84K22J78l63Q2j26K63
3587A96k80M5P4j5j25Q4rq5R7K53m85L95k76J11q6J53l63L94k40L28r1q6J7K08
$$ plain form
3424 -182 7 -57 -47 -31 90 122 -105 -14 103 66 -182 65 238 216 -75 459 217 183 -128 -78 -140 204 -185
3447 -185 -128 135 -85 -163 87 142 13 -124 -277 245 -111 1 -122 -141 -24 159 -33 -60 35 40 -246 -254 215
3470 215 63 -329 99 -63 61 -50 -46 194 16 173 -57 278 -80 72 95 46 -31 -20 -37 131 20 -100
3492 -100 -74 -193 -39 50 135 90 71 165 37 -91 74 -117 21 79 107 -151 -312 -139 -92 59 -100 138 -33
3515 -33 -16 153 -179 -200 139 -181 -26 66 -38 -73 -82 219 -65 73 183 -18 97 150 334 -80 113 -135 -68
3538 -68 -29 -47 111 -65 -89 -133 -125 -202 314 115 195 174 -48 -114 10 8 410 44 -58 -31 -69 68 -125 -121 192 -42
3564 -42 248 324 65 -152 -120 -13 1 286 227 -5 32 93 -49 174 -102 224 -60 162 340 -23 59 -67 196
3587 196 -84 -39 35 20 -105 -21 -30 -115 -18 235 -250 145 -131 -20 -106 47 -316 78 -162 166 75 -11 6 214
3611B14j26m10M42j13jj72K78r5%J62l23R1K1j14p5J63J65j83K44j41R2j23j0
3634a4lJ39k08J73k29J24L08k76j63j54K74J19j67K7P8jJ8k21J54P6O3m2j96J62
3658D1o4J17K9k33K19mj34P4J9J15l90J81R8l3P9j33M7k88K34N1J28k08J37n3
3682B9N7p5P0j95L51k08j40j24RL25O8l48K47j93J21L92j80j18j87J72P9K2Q6
3705B60l6l64L02k96m6M0O1M1J11j25J07l1P6j07J23q8j11k5L5l2N06o31J32L91
3729B93m15jK08l03K12J6L30o25K93K04j94l6m8K8Q5l3j18m6K28Q7k09Qk51L05
3753A8J11m30O65l83O9N7J45n98K55J44k59O7J20J86j73R0j51L50l55K50j7o4
3775I7p1p7K46m4k05J44k09N4K9J34k66K76m4n6j43J27n0rK30l26K29K41n2k32
$$ plain form
3611 214 88 -322 120 7 6 -166 112 17 17 179 -144 -53 -32 -146 -221 -58 107 -76 168 27 119 -4 -14
3634 -14 -17 122 -86 87 -142 -18 290 14 -149 -303 -29 90 -77 -50 28 27 45 -176 -22 54 117 75 -121 41
3658 41 -23 94 123 -110 109 105 -29 45 64 179 -211 -30 68 35 114 -19 28 -260 -26 25 153 -55 82 29
3682 29 86 11 81 -114 237 29 -111 -235 -226 99 167 -181 66 -127 -6 386 206 88 -99 73 152 174 260
3705 260 224 -140 162 -134 -180 -140 -79 -38 73 -52 55 24 100 -7 116 28 -83 -108 -73 -105 401 -230 -98 293
3729 293 -122 -123 85 -218 -6 10 340 -285 8 212 18 -18 -66 -38 47 14 -104 -150 78 165 -44 -36 -287 18
3753 18 129 -301 364 -19 50 107 252 -346 -91 53 -206 -139 -19 167 -6 84 -67 283 -72 178 161 97
3775 97 26 -51 195 151 -54 90 -119 -65 -36 98 -168 108 64 8 -135 -8 -58 -67 163 -163 66 307 255 23
3799B3k37K89J37j98j86l1N29j63k11K5J0M2J15m03N5L68j26R9o7Ok16O8j24K36
3823D0p8O6M0k74kM13l85K12J7j84M6J96q6j20K3J41L4j59K31k31R8J45k26k03
3847b46L21m0l37K2J95J49j7j3o6K7r8J02J68j90J42q9l76J86J87M9m0K81l22
3870eL2K10k54L70n19q4K38k65L43K37l27j10J71k49K89j9J9j7k95J21J68o5K50
3893B39l17O1j21jO1L07r2j49N1j14J8O0k1J17j05J48rnj03j38pL51k17O1N7k54
3919a22J32n9Q1N5J81l07Q5j54J49J09l45K37k28J60K52m88J38K50k64L52L5j24
3941A25m2q4j1j16P5Q6k1m6n3Qj05J93J79k79K29k15K58j71j94K53pj06KQ4k9
3966A3k42J24K09l2L19n71K83j48r3J06j1K41j59N1j41J17k96L48p7J20m11J71
$$ plain form
3799 23 -214 75 212 14 -172 -203 326 163 -48 -23 -13 29 144 -259 -204 164 38 137 70 76 -140 -72 -196 40
3823 40 -38 28 68 -206 -208 205 -180 32 49 -135 -89 107 21 -99 -76 65 99 -60 171 -60 38 183 -43 -246
3847 -246 75 35 -302 -280 -85 64 47 34 -32 -5 -103 -1 167 -23 119 30 -346 -160 27 76 36 317 -5
3870 -5 27 237 -17 353 -166 -250 -12 -277 66 303 -24 -134 37 -212 77 58 77 60 -235 -114 54 -11 239
3893 239 -78 -17 -138 -139 -78 229 137 -12 39 -75 -57 3 -18 99 -6 142 133 128 25 -113 -120 231 14 75 132 -122
3919 -122 10 -49 32 87 268 -39 46 -108 41 150 -195 42 -186 -26 226 -262 -124 126 -138 214 249 125
3941 125 83 -1 -12 -128 -53 33 12 -34 -87 -79 -184 9 188 -91 138 -77 181 10 -184 69 62 -44 -42 42 13
3966 13 -229 -105 104 72 391 -180 103 -45 -138 -32 -43 198 39 90 -51 66 -230 118 41 161 -250 -79
3988g9K89j54J40k26JJ37l03L77m27J85K43k37k08M82l37r9L35J61l28M8M69n77
4010a08K46k85M79n11K02J19k96K22k08K19R0jl04K91M2l18J20k07J65P5l13L60
4032G9j02k6J05J5O6J11J1j61q9mJ56j15Jj35J13j24J3Q4K03l83J40J53j41K22
4056A92J8m39Q1K01N4Q6k5k02L5k05J92m7k07O51l83j08L7j48K66l58N36k92m9
4079a14J91O0m46L73Lj11k9K83k50L01k28q3%l4J62k5m8L46j46p5j23R2j8r0J41
4104A32j44J92m42M18Q9j51k70K44P2k8j54J97m83K98QJ61j1l80M26l79J80J2
4126a3j00K23r6k91N58n05N39j38l94M17K0l11n2K88r2p9Qj19M68k96K12k57J49
4149A39m1k18L9K07j82p3K99Q4l92l0L16J0j96L14o0m41J34P0J30j13l5K6J24
$$ plain form
3988 -79 210 56 196 -30 -29 108 -195 182 -245 -60 183 -54 -262 220 -117 -216 119 280 -48 0 469 -108
4010 -108 138 -147 332 -179 23 142 -154 68 -140 79 169 168 -136 155 197 -121 -1 -208 -43 32 -281 79
4032 79 -23 -49 56 71 137 248 259 98 9 5 161 46 47 -88 25 -99 -86 -2 201 -182 -42 111 -30 192
4056 192 210 -229 -148 53 107 193 168 -34 1 -204 -12 -59 -266 385 2 -106 -69 -217 49 -309 227 -65 -114
4079 -114 77 137 -309 64 67 -44 -73 210 -40 261 33 -50 -50 -84 78 53 5 351 205 130 7 99 81 -9 132
4104 132 -12 180 -262 156 245 94 -176 68 140 112 -42 155 -328 -30 -22 139 128 -252 174 -205 -25 -13
4126 -13 -113 110 14 -277 281 -224 315 177 -217 200 220 -91 -143 145 53 -26 -18 -137 331 35 247 -10 139
4149 139 98 -120 -81 126 -56 -129 170 254 -138 -168 148 158 -38 276 216 -225 -91 -21 109 -4 -39 -13 111
4172A11l33Q4J99J13j96J12m02K48J42q1K79k03J28l21K9P6K3J43j32M7j98L44
4194B12k21k7K54k09J36K8r7j64L24k45J36l24J57k0j92J30m8N8K76j73j34N3
4216i0j90K60N3J7j9j39j72J18N9K55k1j1k08J03j38lL37p7j56l3j03K60o5j04
4240f7J18M2k50J7K77J58l60K12j63N4k32L2K09k79Q5P2J26J79m77K26K74k91
4262c8K17k92K74q0l12L54K86l71j39j34R2J37l47M08O3k68K41Q8l68K59j73l8
4284a41L85l24j6J65j11Rk10K31L5O1j16K14Jj68j64k1R3M2j3K5J67k18Q6l5q
4309c1m6L62j23l74M00l7j61k50M1O1j9j7J70j34K8k41K97J52l37J76J09O6l20
4332b28K71ol00j52L44J65Ok10K83j51k04L59j88j15k33K45L26j86k7N8k53K57
$$ plain form
4172 111 -222 -138 61 174 -22 90 -312 -64 78 -3 276 73 201 -120 -91 -15 8 151 19 66 -132 212
4194 212 -9 -36 218 9 145 173 76 -88 236 -9 127 -197 -40 -60 -252 -122 -170 -112 164 -9 -143 -90
4216 -90 -280 -20 33 50 31 -108 -280 -162 -103 152 131 120 -88 15 -123 -126 211 134 -22 -55 -158 102 37 -67
4240 -67 51 93 -157 -140 137 295 -65 147 -16 38 -194 -162 47 -232 -147 -75 51 230 -247 -21 253 -38
4262 -38 179 -113 161 81 -231 123 409 38 -101 -235 -143 -6 -353 55 118 -150 91 179 -189 70 -103 -141
4284 -141 244 -80 -96 69 -42 -33 -243 -12 23 84 -32 182 183 15 -149 -170 -77 -35 -48 -23 144 -74 12 -23 -31
4309 -31 -77 285 162 -212 188 151 -10 -260 -219 -158 -177 -194 -24 -158 -130 -371 -74 78 -259 -83 26 92 -228
4332 -228 43 37 -263 -415 -71 94 100 -110 173 22 -182 177 -11 -126 -359 -114 212 26 -1 57 -196 61
4354F1j11J08l2L19q7j17j83MM5P6k28k7K03k13k9K49J28k80J74q2rr4j6M7L2
4379f2n7L0J23j69L89%l47J97J20j84Q8k48J48r0L8J16k17L21k49n8K54l49K49
4402D3j15L35k71j9JoJ49j19k23J99R2k28K51j08j15J55R0j69K70j22j71K29l59
4425b11R5L14j13k48j5L45m16L62M2k40K07j13p3J72M7J35k87r2K41k06j03K92
4447A35j53J08n1j3j70K31j28j83j00K55J88j25k16n6J09rm3O03m60J91m4n3L13
4470C29l18J45k76M8r7jK36K1j80k19M39j67L1k3K19r6j25Q0m8M6R3Lk19j1J48
4495E8O7lk93J13P6M0r3R9J62l23j07K75l68K84N4j76J61kJ35k19p6K20l08K74
4519E0n7KM7J81l26k42L82nl30M44p3k03M4J15O5k31L15j55O8m6j84J18k7J04
$$ plain form
4354 61 -50 58 26 345 258 141 -42 -38 7 83 -145 -172 31 -182 -211 38 166 -114 60 -22 -31 -125 -141 -94 -62
4379 -62 -119 -89 34 -135 254 254 -93 104 224 40 128 -120 28 -62 -24 92 -125 196 -53 -111 143 -206 43
4402 43 -72 263 -8 -27 -26 -32 117 -2 -225 -26 66 -162 89 -19 -134 21 111 -58 212 90 -81 148 -211
4425 -211 -116 198 85 -163 -178 167 -249 113 155 -85 122 9 -64 108 155 290 3 -89 152 -54 -157 135
4447 135 -18 90 39 26 -144 87 -41 -224 -324 -69 119 -6 -222 -278 -169 -178 -221 382 -78 113 69 16 329
4470 329 11 156 -120 -72 -169 -170 66 87 -93 -312 127 -40 -9 -32 187 91 -34 46 -2 44 137 140 -79 -90 58
4495 58 125 122 -171 -58 18 58 -35 64 226 -97 -204 71 -297 -13 41 -135 26 24 159 -60 -136 84 -224 50
4519 50 -7 -5 42 223 -103 -345 37 32 -298 146 73 -130 -86 29 94 -137 178 23 91 45 -139 -21 -48 56
4543E6J79l52k9N2O1j7N9p8P6J56p0J78m95J23K41j12J49k0m25K09j76L94l25
4566a66K04J28N6j78k44L91m15K5J62nr6N86m82lJj87K34Q8n2J1j13Q0Lk38J15
4591i5J42k36K14J0j57j44K81j74l6O5K16m65O11m84L59K3k69K25N9l21K59j42
4613e9J9Q0j7J68q8j19O3k46K26Q9j34j22K08O1l38N7J05m4J93k2m07K01K35K8
4637A37j04j78L7J08j28K58j73K09j5l42K07J42p9j93K05J07k18k82K46K81l85
4658a60L90Qj64k81L16k30L19j03j39Q1J80r8J2q4j76J9O8J66Pj18r7P5J73l95
4682b31J06l9K48M1k00J08k39K37J47k34K43m17K66j19j02K22M2L9j87J29l1k2
4704GN2j32r5R8M94n19K54l63M19l13K25r0J15k34K23m04K99J22p3J53l01K6l4
$$ plain form
4543 56 235 -117 -146 -94 -33 -50 9 -69 7 163 93 271 -224 -101 140 28 177 157 -268 -59 -235 159 -166
4566 -166 38 166 222 44 -200 191 -224 -199 -37 -42 -138 448 -34 -37 -36 -223 11 99 47 58 -55 25 28 -210 -95
4591 -95 47 -189 25 35 -122 -266 15 -159 -195 -130 86 -379 232 -252 107 130 -139 86 145 -176 83 -59
4613 -59 -40 40 23 191 103 -16 47 -199 27 116 -18 -140 68 129 -209 -152 -47 -91 102 80 -327 -126 109 137
4637 137 33 -145 -108 0 -128 130 -43 166 151 -191 16 158 79 -114 91 198 -20 -302 -56 225 -160
4658 -160 230 238 74 -207 109 -121 198 95 -44 37 217 119 131 47 -129 -110 -42 124 131 13 -84 -9 164 -231
4682 -231 -125 -164 84 125 -75 33 -206 31 178 -56 187 -230 36 -83 -185 37 79 118 -69 60 29 7
4704 7 59 -73 -168 -70 424 -95 159 -204 215 -98 127 37 152 -82 141 -263 36 158 85 238 -63 -37 -71
4727g1J52p8M6j60j91L11j2K9J43l75L73j2m60K98m9J69O6m42L17ok49J9K12K0
4751E0N7O2k7j71n5Q9P9J6j02l5K63l00j1M2J9j11Q5L4K42j95j7k90M39j31j81
4776a49J83J66j58r1J73k95J44K6J69r2j05J01k24l3J44M6j66K44j11j40K29L1
4798I2k08N8J33mk31K9P9pK35J6l31K19k61J50K23j26j05J57o4k3l0J03P4k02
4822b4j91j55M66j07j54O06k51mj4k08m7L42j26k51j48L07l1k45K22J22j75R3
4844B7j19J4J70L2j62Nj69k0M42q0j97J95j78j0K00p1k51R4nK03j71L2J25k02
4868i6J37nj8r7L66j33k98J17q6K73q2j08q0L1l3%j22O8K64j83K25k94M18k60
4892Dm15L99J95k66J84L9l05J39k7j59K42k40K88k7j00K03q2l38K67O2j69NO5
$$ plain form
4727 -71 81 3 49 -111 -302 9 -3 26 169 -206 167 155 -305 -7 -56 113 179 -263 54 48 -201 -182 30 50
4751 50 107 169 142 -29 -84 5 84 100 -2 -37 226 -74 -85 -43 -24 -135 -50 -16 226 31 14 -276 163 32 -149
4776 -149 34 200 42 -49 124 -171 -27 -1 168 76 -29 72 -152 -185 -41 5 -161 83 -28 -168 61 92
4798 92 -116 -58 75 71 -160 -131 -52 -59 176 192 -139 80 -181 -31 192 66 -39 118 54 31 1 104 178 -24
4822 -24 -215 -370 96 -11 -165 441 190 186 172 -36 -83 259 133 -118 -266 41 10 -235 -13 109 -66 27
4844 27 -92 -78 92 124 -38 -33 -202 -222 220 140 -57 138 -40 -50 150 79 -172 -78 -83 120 -51 -19 106 -96
4868 -96 41 36 18 -79 287 154 -144 -27 -113 160 78 -30 -110 -79 -112 -112 -234 -166 98 -85 140 -154 264 4
4892 4 -411 -12 183 -83 101 140 -165 -26 -53 -212 30 -210 78 51 -49 154 72 -266 1 63 -106 -101 -36
4915c6K43R5k98J02K2j69L8K85m87r8M85j80k69J16j5K42j93L12j32o9n8o2k12
4938c38N61k11o1O3l18Q3K47j06j3m8j44K20N3J7M0l5k45M83l49r1K2J09l04M00
4962C5k46J23J76j84J68l40K30j81K74mk48K25Kp6k5J57J64r8Qk32q0Q4o2K9P2
4987b9j21R3L3Q3K2m0k4K6K52o20L83j49Q2J25j78K32r2j03L9P5j08J1j94o1l9
5012c02K88R2j62N9J99k22K33k81J54J68k23q5P8j74J36L8n5R7J08l62J75K51
5034B10k26L15k41o7J85l9l38L41P8j46L5l17Q7J32Rj71P6J72k00L91n15K26r7
5057a00P8K44l96j16J74j22K69r5j19K26k3L2L0L8N1k78J26l8j51K88j71o0M6
5080f7j8J60L0k19o5J45k11L38k28K71j37k13L58j06k51J18k7j7n0N13j02M9k42
$$ plain form
4915 -36 207 302 4 106 128 -41 -3 282 -205 -303 182 2 -267 -151 -166 76 -117 195 63 -6 -64 -126 -338
4938 -338 223 12 -49 14 -304 -221 26 -80 -93 -141 -285 -65 -12 5 45 10 -235 248 -101 -192 -170 -61 -365 35
4962 35 -211 -88 88 -96 72 -268 -38 -219 55 51 -197 28 30 -46 -71 86 250 152 160 -72 -152 -68 -130 -101 -29
4987 -29 -150 -57 -24 59 81 41 17 43 295 -325 58 -91 -9 116 -62 170 78 -25 14 89 -19 -8 -202 -263 -302
5012 -302 -14 78 -84 -25 174 -48 185 -96 58 226 3 -82 -4 -178 -42 -4 -59 38 146 -216 -41 210
5034 210 -16 299 58 -9 176 137 -201 140 218 72 107 -210 -123 9 18 -153 -77 95 -105 286 -229 -3 -100
5057 -100 -22 222 -174 -290 -116 -238 31 -64 -183 43 20 52 82 120 171 -107 19 -19 -170 118 -53 -113 -67
5080 -67 -85 75 105 -114 -179 -34 -245 93 -135 136 -1 -214 144 38 -213 -95 -122 -139 -189 324 222 271 29
5103B9p8R6n5J24K06k18R0k42J77j37Nl8L3M51j60m24J67k19J03R1l87N23k93
5126a56J65j92K28p1k69K70J51q9M0j78L59k18L0k59Q6J85J4K3l06K29j46M1r4
5149a57K05j86J05o8K44l40L86p0m46K86J35k80K43j1l69O53o12K38KL3RR3no7
5173B1j85J36m1J28J29p0n6O3l22J02J11n50O41j8L1n2J8R7kqJ5k22j02j11K38
5198iJ51M2n7j72oL88l82j46M93k47j29j88J21pL06l18J8J17J69j52oJ67m7j67
5222f1L16k26l9j6J05J97m6k91oJ87p3n2j62K54J62j41q1p6J14P9k85L14j06R6
5246A63k11L60k05K9Q0r6L7m15K24R6j11Q6j12j03J9K26r6j03qJ38jL3j0K0q0
5271d0K5J90j77J66j38J49k87K60j59p8J45q0j99M86k52K70l66K54j68K87j90
$$ plain form
5103 29 -49 47 -8 116 322 104 194 -48 129 -8 -3 -41 -8 443 283 -141 26 -193 -90 1 -386 137 -156
5126 -156 9 -183 45 -26 -295 -25 126 37 77 -101 258 40 70 -189 -103 82 96 119 -187 42 -104 -63 -157
5149 -157 48 -138 -33 -101 143 -197 189 119 -327 -41 94 -186 57 46 -323 330 -282 -44 -42 -9 0 93 88 21
5173 21 -164 -28 -69 59 188 118 62 125 -197 -95 16 -534 107 89 120 68 86 183 181 173 188 -34 -136 -247 -9
5198 -9 142 184 127 -45 -51 337 -45 -191 302 55 -74 -262 -141 -148 158 -160 -142 -25 144 -8 -14 153 106 -61
5222 -61 255 29 -10 -26 79 276 230 -61 -67 120 47 -5 -167 87 249 108 27 -49 65 144 -141 173 67 163
5246 163 -48 312 107 136 216 120 157 -258 -34 62 -49 37 -75 -178 -159 67 -29 -132 -140 -2 -3 30 20 40 -40
5271 -40 -15 175 -2 164 26 175 -112 148 -11 -89 56 -24 -223 263 11 281 -85 169 1 288 98
5292I8m4Pl48N97k80N2k07K83l7J55l96Q0q3m5J50k00J54K99l94K09Q1j49P1J01
5316A54N3l35K35l08K31j77L32k73P5L4j83j9J79j27P6J0k43L19j27J45rM1r7
5339a4Q5K51l31k0l7O4j77J76N8o0p2J80J07Mj10j87K55k0k45J68R3l92L47j42
5363a9O5rJR2j47p7J41K94m79J68J9j21K17r0j52N5L0j16K00o5J28q2n4o6o1J35
5389GJ87j8qj51q0K80j12l10K37j27nL83m9p5m40M31j40j65J76Lj65K00k91K05
5413b7P4q8J16q3j81K11q5n6J01j45J56k20L26l11J13J58k11L80k01Kj45n4J69
5436aJ9o1n7L26k91J81l88M02j65o7L8L1L20l12KJ64O3L9k62J3N8j42l5P2J7N8
5462B2o2k7j10K06j33M7L54k2j47j45J07j03o6L34j75n5k56R1M12j80j16ON8j19
$$ plain form
5292 98 54 61 -287 310 30 82 -125 158 121 276 -120 -40 -123 -168 -18 -218 -64 235 -159 50 131 -18 53 154
5316 154 207 -128 107 -201 30 -147 185 -88 -13 21 -162 -181 -2 -129 -53 -43 -286 33 -94 51 42 83 -14
5339 -14 71 322 -9 -29 -66 -2 -179 -3 55 -5 -77 103 210 214 104 -83 172 152 -93 75 168 -224 123 -19
5363 -19 46 37 38 130 -17 -94 47 341 -138 30 49 -72 145 55 -97 -42 -12 -128 72 7 135 53 -1 -67 -128 7
5389 7 194 176 168 17 -63 217 105 -205 32 -95 -100 283 234 159 -281 150 10 -155 21 24 -141 59 -232 -27
5413 -27 47 -41 75 -8 -189 22 -63 -119 -18 -163 -7 -227 99 -212 -99 59 -152 228 27 29 -116 -170 -1
5436 -1 18 -43 -100 226 -65 116 -272 130 -35 -102 -64 -33 287 -25 -23 141 204 243 -19 -6 52 -90 -125 -53 -36 22
5462 22 -40 -67 -177 29 -104 -57 297 275 128 -17 90 -13 -79 255 80 25 -231 -140 272 92 -24 -18 40 -79
5486g9K34J0j59J08l11K52kL9j19R2K6l72J26J93r7Q9j94N3J77j35l4o4K8k75
5510d14P45k47j14r5N8K93k7j02J2k22M1m5j3K55K35k59l01L82j53m9J33k26K80
5533A67j21l14K02M0P4K92l21q0L3K3N1M5K3m28L35j5j08P0J92j90o4k2J17n1
5557e0O6p1K48j16P2l2j84N1j36K31o5j03p1K21j0J44l29J5J54J1J6j61m6K01
5581E6J39k64p5J41QQJ79k73P1J9p1K06k1j46J52j73m3M16j17j49j49L0J98j75
5605c3n3K50k38J98n5k24M7J68j85M5K19m7j62K41m6L3k87p2L17j10K12j71j86
5628a39K19k01K22R5l18K95l27L08m46L58J56o3k14p6K55Q3j61m3r9L47Jk62J94
5651A84l79J63j97J49J26O6k67O7K0L38l29K23k96K34j48J7O3J57j50J50q4q1
$$ plain form
5486 -79 155 165 6 114 -197 55 53 92 -27 65 91 -281 -155 38 -59 30 -164 -111 66 -69 -103 -167 -139 -414
5510 -414 331 84 -30 -125 -67 226 199 97 109 -113 -72 -117 -130 125 360 101 -200 182 29 -20 113 -113 167
5533 167 46 -268 -66 -26 48 340 19 -61 -28 -5 46 91 114 -314 21 6 -102 -32 160 -30 -94 -116 1 -50
5557 -50 16 -55 193 77 149 117 -67 -16 -152 79 14 -89 -160 61 51 195 -134 -119 35 46 62 -99 -145 56
5581 56 195 -69 -144 -3 5 13 192 -81 -10 9 -62 144 123 -23 129 -44 -87 329 212 63 -86 -56 142 -33
5605 -33 -86 164 -74 124 69 -155 -108 60 -125 -80 139 92 -70 171 125 158 -129 -201 116 6 218 47 -139
5628 -139 80 -121 101 196 -122 173 -154 154 -292 66 222 159 -55 -131 124 207 46 3 -96 251 252 -10 184
5651 184 -195 -32 -229 -80 46 112 -155 -88 -68 270 -59 164 -132 102 -46 -29 34 191 41 191 107 26
5673B6o4p9P7k29L93j32N6j22J55o2J37j37k3J20Q6j84L43l20j30K17j37K30l38
5696a17L86k03R6N0k75P5K6J27j68j23L75m03M20k84j60K45o4j17L87k90%N8J21
5719A62l26J2J94K9Ok89J62rK84m65J62O2Q2R1j11P6pp5J17j71J04l5J14N7l45
5744a19K3O3j7K1j40k9O0N4J81l47L03O5J10j48k08jK24j42K10j83j18J51j28
5767a15J33qj0J65k87R9J50o5J06jo8k24J91O6k24o9L08j90l1j05K38j52M8J2
5791c3JK24n1l43J90pj30M6M7n6j04R7L05l03N6J15k22J32p6r0J55K00j8o4k97
5816b26R8J53J6q4p7M5N4j36N5J80k27L11o0j75J42r9J60q0Q1k32n3N6m7J78P
5841D0m3M7J38k69J15K24k55L5k03J76k18L63j83J10o4O2qO1k14M36m52J36R2
$$ plain form
5673 26 -38 -117 -40 -269 124 -8 48 -74 81 19 156 19 -4 116 202 18 361 41 -89 128 -9 221 -117
5696 -117 269 66 162 212 -63 12 38 165 -3 -126 249 -154 266 -18 -178 67 3 -114 273 -17 -17 41 162
5719 162 -164 -152 42 71 77 -212 -50 -59 225 -240 -78 -16 66 157 46 122 115 40 157 -14 90 55 169 226 -119
5744 -119 -96 -33 -50 -29 -169 -198 -138 -84 97 -250 53 118 228 80 -128 -129 95 -47 163 -20 -138 13 -115
5767 -115 18 10 0 165 -122 -23 127 62 168 167 99 -125 66 132 -92 -161 147 -43 -74 -179 59 -93 -45 -33
5791 -33 -32 192 141 -202 -12 -19 -149 -103 -56 -112 -216 -119 186 -117 -61 54 -168 -36 -112 -202 -47 153 135 71 -226
5816 -226 -128 25 41 -43 -120 -75 -21 -157 -102 78 -149 162 102 -73 69 -30 130 50 131 -101 -154 -98 -145 33 40
5841 40 -3 44 182 -87 28 252 -3 32 -171 5 -213 150 -33 77 13 75 67 128 -86 350 -102 34 126
5864A26j41K69j72J2k89J81j48J47LK18k10Q5j55K63l86K42j7j16m8O6J94J06
5886B30k80j68Q8J62j65nJ94J8N0l53K91J8R7k16j7P9K7k3k24J28%M0K56r0m1
5911I6M6p6jJ42k14K39j76k14J5K16Q7L3m44L07J27j77j65J90k96Q8J96k26P5
5934a32m6K31j07Q7j69L7K6J14k15J79k7L0J87k68j7l0P4j1P1M2n3J70l2k45k00
5959c04L47k3J26n4O1k42O3q4K80l40K86j71O8J1p5q6J59J63m98K71Ql28O48k60
5983B6j38j26M27k74R0M1k02L44k9K5l07J6J2K37k29J49Q7k37J42J9M1k66J55
6006Cj7j99J7K19k85L35k64J41K94l28Q7j71L17m2J67m22J14J03j03M7J34k6m
6029A17k20l5Q8K51k53j23J38N6K52m2j05j26j31J00p3J90K22k38Q4j37r4l0K08
$$ plain form
5864 126 -15 254 82 94 -195 -14 -162 -15 -12 206 -4 81 -74 189 -197 45 28 -88 -136 -70 124 230
5886 230 -50 -218 -130 32 -133 -138 56 74 124 -229 62 80 177 -39 -56 23 50 27 -197 -69 -69 -29 227 137 96
5911 96 142 66 65 207 -7 232 56 -158 -143 73 160 193 -251 56 183 6 -159 31 -265 -177 19 -207 -132
5934 -132 -178 53 -54 33 -136 -99 -73 41 -174 5 -22 8 195 -73 -90 -120 -46 -57 14 56 3 173 141 -104 -304
5959 -304 43 20 146 92 153 -89 -26 -110 170 -170 116 -55 13 24 -51 -137 22 185 -313 -42 -34 -362 286 26
5983 26 -112 -238 189 -85 5 46 -156 188 159 184 -123 -107 -95 142 -87 62 149 -88 54 73 114 -152 3
6006 3 -14 -213 -196 23 -262 73 -191 -50 244 -84 3 -168 149 107 274 -148 -34 69 -34 13 147 121 117
6029 117 -103 -138 -50 201 -52 -175 -37 19 271 229 124 -2 -133 -33 -106 84 306 68 152 15 -79 -109 99
6052I9O6k5r3m1j74J31P1J15p9Lk2k86K85k4J02j16j11L09J46m3l12J0L50n89
6076b28M17o1K09l12j20n9J33J33k54K75j89K4j0J93l05K64p0Q4j32j33LL6K45
6099A43k09K04r2J85m7j67Q5m4K77l06k04K04K3j47J84j97PM38o06K99J7K1m7
6122B1k4k56R3K87k58O2P0J48r3p1J22k20J66%J05Qj66J32l17J81K6K3r6K65j65
6147D3q3J3O3J63k13J90j63o6K46j42Rl50M61j85K00l64L14k9l7n5qm65N75k2
6171I5j87L71j70k54M75m42Q1p1o1K05l63K91M0J55l57L38j08O0k36K02K90k89
6193F5n9op2j7L5j14N9K29k80J40J70j96J97m41L97m2l17L7L37l6J27j28k62L57
6217A80k2k10J47m3K09L7k28j67J80q4J8J7l45M06j32M63m42m5K30k18j28O9R4
$$ plain form
6052 99 165 140 47 6 -168 -37 34 149 70 73 51 -235 50 26 128 12 -99 210 356 313 1 11 361 -228
6076 -228 189 128 337 25 -95 -154 -21 112 -142 133 -56 -32 -42 151 -154 110 40 124 -8 -141 -138 -102 143
6099 143 -66 138 46 231 184 17 102 58 335 29 -175 29 52 -95 89 -108 -101 337 -269 30 47 68 21
6122 21 -3 -259 -166 121 -137 -75 -5 143 50 -21 101 -119 47 47 152 160 -6 126 -191 -10 16 39 -57 208 43
6147 43 -40 -27 36 199 -14 176 13 -53 193 51 60 -290 171 -14 186 -178 136 107 70 15 7 -458 117 95
6171 95 -92 279 109 -145 330 -112 -31 -102 -163 42 -321 -30 10 165 -192 146 38 98 -138 64 354 65
6193 65 6 0 -72 -89 -54 -168 -109 120 -160 -20 150 -46 151 -290 107 65 -252 -215 122 86 213 85 -177 180
6217 180 158 -52 95 52 261 298 70 -97 83 -1 17 34 -311 95 -37 426 -16 -61 169 -49 -177 -108 -14
6240a4lK3J13j7l15J20J12K52m77K69l73J22O0K18k76K89L02n01K36j83L5J20
6262A12j02J1R4j75Kj05J64L3k6J77j38l0j07J44m1k24L22K70m38n8K45k93K24
6285F1j20N7N0j39qLQJR5j2RjJ55j75j07k6N14k72j99K93l93K50j82k7R1Q7l7
6312b4N0J12J16k43k3p8K06j5k19K29j17o2J67l16K16J83j44K6L1R9k49J52q1
6335A6J21l07K23J51l45Q3K44k30j6N7p4k31L87j48J33k81L01J11k16J7J12L6
6357A44K47m57K21l49N4J0n4M07k73N8K07j82p0K57k56N7J69j98J11j77O0p2J33
6380D7K00l24J03l7K02j38j61K53n1Pr0O7R8k28m3O8L3j02J06L8J56l80N17l37
6404Dk20K20K95k54p2l07K46J97q8J01L6k05o5R7o5NL3O4k8k13l1M08j96R4n9
$$ plain form
6240 -14 -17 6 119 102 -213 -93 19 271 -206 63 -310 -188 -128 90 -186 103 405 -96 140 -43 -8 112
6262 112 10 21 115 -60 -58 -163 1 34 8 185 47 17 -90 54 13 -211 111 381 -57 -115 130 -163 61
6285 61 -59 -2 48 -91 -99 -96 -88 -87 8 -4 5 4 159 -16 -123 -149 365 93 -106 187 -206 44 -138 -165 -74 13 -24
6312 -24 26 138 254 11 -12 -90 116 101 -118 111 -6 -68 99 -217 -1 182 38 64 95 194 -55 97 16
6335 16 137 -170 53 204 -141 -58 186 -44 -60 -3 -77 -308 79 -69 64 -217 84 195 -21 -4 108 144
6357 144 391 -66 155 -194 -140 -130 -184 223 -50 8 215 33 -37 220 -36 21 190 -8 103 -74 -14 -86 47
6380 47 247 -77 26 -11 191 53 -108 145 94 101 11 78 176 -52 -95 -27 6 -96 10 48 204 -176 341 4
6404 4 -216 4 299 45 -27 -334 -88 109 21 122 158 -47 -112 -15 -80 -75 -42 22 -6 -219 -250 158 -38 56 -3
6429cn3j01K98r5n3J18L4m34K18p8K84l04j3K40o7K40j51p1k23P0K51p1n0J7J66
6454A69j41J13Lq0j43n9L31l18L7P5j23N6J46j35q6P0K30K9k70J28j9J11j79K24
6478A69R7j44j61Q7J47k70L04o1j54n2R5q4j98J76j3J44R4k24J8L20k54j29M26
6501C33k01j3p1M3j30m4K63j48l4j43K40q3m9QO1r9KK62l41J25jj44J87R8j72
6526e1K03k87K00%k42J25K2O7j68J98j5K8j48j44N46n95N57n17L81m3k67L19j41
6549B8J5R8l08J95MN4R0oj71lJ13k13J74l34J97j96O7J44J74Q1q3j9n1k34R3J37
6575D6NQ7J9j53Q7L1j81n0K26m91L24l14M57r9j66N8O2j09M10j39q2j10r5L70
6599A93j65l12L65j2r0Q8K7k44j13L22j39k6K29q7J01j5j41%J50l16L31o4K2j08
$$ plain form
6429 -3 -56 -157 141 46 -7 111 145 -289 -71 -149 135 -169 -182 58 -9 231 80 9 -214 -144 107 36 -14 3 169
6454 169 28 141 144 64 -79 -138 193 -125 -88 -13 -136 -80 66 -69 -155 -85 145 174 -96 32 13 124 -55 169
6478 169 266 122 -39 48 195 -75 229 168 14 -38 57 -27 -225 -49 -62 82 176 -48 -30 290 36 -93 333
6501 333 132 119 48 91 -39 -83 180 32 -2 -145 95 12 -37 -29 32 -67 -65 197 -144 -19 -20 -164 23 121 -51
6526 -51 152 -135 65 65 -177 -52 -30 37 -131 67 52 80 -68 -212 334 -261 296 -221 160 117 -150 169 28
6549 28 43 141 -167 28 32 86 176 170 -1 -4 109 -104 70 -264 -67 -263 -196 -52 122 203 120 101 50 -184 -91 46
6575 46 51 138 157 4 91 122 -59 -109 117 -374 -50 -364 93 -6 -172 -114 -52 -161 249 110 28 -82 -177 193
6599 193 28 -284 81 69 -21 67 94 -150 -263 59 -80 -106 123 36 137 122 -19 -19 131 -185 146 82 104 -4
6623dj62K85p3k5Mo0j16K23q7n3J24j60K52q4k70K27r7j13K20N3k10L1p2J04R
6648e4K20p7P0k27q9n2L12j38K36l62K53J11k76J23k19KK15P4j19O6n7KO1j83
6672a08N6L81m31N2J98K14m34J03K85n47K37N2M2M0l93K90O0k63l4n7J07K99j25
6695B4J6J53r5M3j03J52j62J33o6K8k21K88j85J7m2K65l02r7J93l7q3P1j02j64
6719b76K78j0p2J83n2J2l8j91J91k7L75k39J85k35J08k30j77L94k84%J99j67J02
6742B9n9P8K5K30k39k16J15R5J03j91J03J61k36L3r1J49k95L36k43MK21j80j2
6765h0J48j28J74j7j1P7j30%m0J18L5j2L0r6k9Nj00O1M3L5m03K10N12j15n81K30
6791f4M8J48l29M62l13J00q0n2j49J85J03k16K63J53l55Q8J4j46J50k0J60l16
$$ plain form
6623 -4 -166 119 46 21 25 -35 -151 72 -15 -68 56 -104 148 64 -206 21 -76 -189 31 84 -126 -95 -167 -63 -54
6648 -54 166 89 159 -68 -157 -209 103 -35 201 -161 92 203 -73 50 -169 -167 48 122 3 69 12 14 75 -108
6672 -108 -52 329 -102 -50 148 362 -72 31 316 -231 6 58 100 140 -253 37 97 -166 -200 -257 -150 149 24
6695 24 40 193 98 141 38 190 28 161 95 123 -98 190 5 22 -20 245 -57 -154 39 2 -81 -10 -112 -276
6719 -276 2 -8 -80 103 51 63 25 -166 25 -2 373 134 319 84 192 -38 -215 179 -105 -105 94 -73 29
6742 29 -30 48 73 303 64 -152 -37 58 161 -30 73 234 -2 31 -60 89 -206 130 -113 -109 112 -68 -80
6765 -80 68 -60 114 97 86 163 33 33 -7 111 146 134 164 68 39 44 -56 5 48 83 -320 -110 402 287 -294 -64
6791 -64 -16 132 -197 265 -48 52 -28 -80 -229 -44 59 -157 106 259 -96 -8 6 -140 10 -10 150 -166
6813a66K05O6k31q9K63o4L3pL5k67L62k41Q7K3O9k9J02qm64L43K5p2j48K02j10
6838h1J80k03j3RJ09K32k96p7K6Nk26K00K46k72J8R2J19r0K36n9j93N8k10J37
6862e3j7q6k91M07m9J54l8J09k93R5K64k45K05j93N5J58j25J10k89O8L7o1l6K3
6886i1m8K08k23O4P2j54P4L30l44j1J93K82J5l22j14J29k45O6J76J08j52r9Q8
6909BK3j28J19j88K35n11K49L51m3o2J10j04O8Qk01k20J25L31k27lN7j9k08L32
6933I6k38K05j45j72L34n5j95J87Q9J04M8m0k44J67l9k18J85o4K70j86k02K84
6955A71j36l3m9P9M2k91J56J64k64J74L5j95J12j78Q8j3J40j35K91l6l59O04l93
6978b6J40k61L23j44j59K46lk10J71q7Q6j76J49k8n7R4p3K00L3k53J07k92P9J75
$$ plain form
6813 -166 39 105 -126 -215 48 -16 17 10 45 -222 140 -101 -14 9 78 49 151 143 -321 22 47 -25 -173 29 -81
6838 -81 99 -104 -117 -108 1 233 -63 -140 -114 -109 -335 -135 111 -161 -143 -51 68 -22 214 155 -38 20 -190 -53
6862 -53 -70 -156 -447 -40 -89 65 27 136 -157 -62 202 -43 162 -31 24 182 57 167 -122 -54 -17 -78 -114 -91
6886 -91 -139 69 -154 -90 -18 -172 -98 232 -112 -123 70 352 367 45 -69 60 -185 -119 57 165 13 -86 2
6909 2 25 -103 16 -172 63 -448 -199 152 109 47 157 53 121 129 -72 -292 -167 164 -63 -66 -9 -28 -236 96
6933 96 -142 63 -82 -254 80 25 -170 17 106 210 258 218 -26 141 102 -116 69 5 275 89 -113 171
6955 171 35 2 -47 32 74 -217 -61 103 -161 13 48 -147 -35 -213 -125 -138 2 -133 158 122 -237 367 -26
6978 -26 114 -147 176 32 -127 119 116 -94 77 -10 76 -100 49 21 -36 58 -15 185 218 -35 72 -220 -141 34
7002C4j08J2j0R5p7J37J86o5k42J94M6k06J86j77MK4k32J13J67k54K33j21K37
7025A76n7k35K15J31J32n16L31Mk25R6o0MP2k3p0N1l36O65k58J19j47l3m9m9J60
7050I8k38j30L4K71j56J09p8J28k05K85K1k14m8K05O8j18Q2r6L5J06k65J1LJ33
7074D1j5Q7j9P4j45j55k6J00oJ58j79P1K7k69R1lJ01J04p3K33k01K7M7o6k0K14
7100A98l67L27k79Q2J59j02J43l19L50k5Jk63J3N2r6R4l0J72k07J08J78j76j40
7123a27K99L0k43O3O5k1j61L47l33M7K78l99K25L7%j5l27L28r5K4L06n49J07L2
7147h2J74k19L83k73j95L28k9p6OK11j75mj27K23j34qk04L77j49m5j49K88n5J77
7171B43l17K3j16RR6K59j05J04l34q7K93j02J62o2M5j12NK5N5r2K19j84K8o6J40
$$ plain form
7002 34 -74 -62 -72 23 -54 83 269 204 -38 156 202 -4 182 5 9 33 -199 -86 81 -173 60 -61 176
7025 176 119 -116 99 230 362 -154 177 181 -44 52 -8 -4 68 45 -25 26 -310 355 97 216 69 36 -13 -62 98
7050 98 -140 -270 -236 35 -121 -12 -90 38 -167 118 139 -75 -123 82 150 32 114 18 53 159 -106 -95 -92 41
7074 41 26 113 94 168 23 -132 -158 -58 -64 94 -85 -14 13 -256 -165 -168 -67 37 -36 197 -4 23 70 4 -16 198
7100 198 -169 158 -121 -39 120 18 161 -158 192 167 168 -95 -82 -30 -126 -32 -62 110 -97 11 189 13 -127
7123 -127 172 202 -41 22 87 66 -95 252 -81 -34 244 -155 70 107 107 92 -235 93 -2 22 328 -221 -114 -82
7147 -82 92 -127 256 -17 -212 116 87 11 17 228 53 49 -78 145 11 3 -201 176 27 -18 -167 121 66 243
7171 243 -74 -51 -167 -158 -62 197 92 196 -138 -225 68 -34 128 66 111 -1 4 29 84 -8 211 27 55 -11 129
7196A29o6j44J63m98L67L34j35Jj73J78m27L63n9lj69J65k23P3K03P5l72Q5K55
7219A22k72O9k62M30J82k28k4j29J4J25Q7m56N65k74J06p5K36j70q0L01j64l24
7241b21J3M11j62p4J09k69M20l62J27k8K47p5k64JK18k29K18m8j59J24R6J3J38
7264B44l44K59k8k77L26j51J61k39P5J19m9l8Q8j84m0K74j74NN9k23K47j61J07
7287E6M8k03j19J72k03K05L03l94R4q8M11l69O4J6Q6j0k77K04J49j51L2m7j2P8
7311D5L8k56K62N5j53j18M28k51r7k33J21M06j58j72J10J57Lk40lq0K71j76O0
7334A9k00L09L9o4J97m67J12j30K66R7l1j96J21j58O8j53K4K80j64J30P5L8j03
7357A09j91J67k57N3l6J71K2Nj5j61N2K08o0k16K99M1l21R2rJ44P2j01M6m6nj58
$$ plain form
7196 129 63 -81 82 -416 -49 285 150 151 -22 156 -271 92 33 30 -139 26 -197 -124 79 154 -218 -133 122
7219 122 -150 -81 -343 87 269 41 17 -112 -98 27 114 -342 223 -51 55 -20 216 46 -34 267 103 -221
7241 -221 -208 203 41 -33 76 -193 227 -135 -8 -36 211 136 -128 -127 91 -138 80 32 -127 -3 93 106 244
7264 244 -100 159 131 -146 180 29 190 -49 26 145 96 58 146 -38 -78 196 22 27 86 -137 110 -51 56
7287 56 104 -99 -218 -46 -249 -44 259 -135 -41 -129 282 -87 -23 -7 79 69 -208 -4 145 -6 26 -21 -33 45
7311 45 83 -173 89 144 -9 -127 301 50 -47 -280 -159 247 89 -83 27 184 187 -53 -56 -136 135 -41 19
7334 19 -181 128 167 103 300 -167 -55 -185 81 178 147 -49 72 -86 -18 -171 -147 133 -31 99 174 212 109
7357 109 -82 85 -172 -119 -155 16 38 43 28 -133 -81 127 67 -149 150 191 -130 -38 -47 97 169 68 114 68 63 -95
7383i5K77j75K11k39j65K97m7K65l74J7k9R9l6r8O4O8j1mo4L79k93j3K15l24M
7408g1j60L17j66j24P7M1m4K51j4k2j4j78M92l68Q1j74K33j66J94j15j01k84L84
7431F9J22l92K99j83K83j68J28k65L26k7k77Q8O4j74j02M67m60n7L17j21J41P6
7453A54m19K06L9P1r9J25J14l26L75j42k97J34j02M0J63J14j50J99k35M1j36J37
7475FJ83j69Q4l8j58j54M97k60J02l7q8k3K53o3k67K53j64p8Q3J68p3J09k03J40
7499A03j29j6J53Q5l62m1K87k00O3k59M67K8l89J66L31m08L31m65K92n5J11K26
7521C19l65n0J40K33m46K79O1Pll20K50k56N7J08L77n41L32J0l9k83P1J52l12
7544b19L55o2o0j27j39J98q3J52o9k91L46K98r1j85N8j34J25k71K33Q9n5j37J08
$$ plain form
7383 -95 182 7 218 -21 -186 111 64 329 -45 -28 -57 42 6 -92 -28 40 29 25 -39 340 47 34 249 -75 -71
7408 -71 -231 86 -80 -204 -127 -86 -130 121 107 85 71 -107 385 17 98 -76 157 -9 185 70 -31 -315 69
7431 69 191 -201 98 -85 198 30 158 -107 219 192 -85 3 67 -107 -209 258 -202 -259 58 -63 78 154
7453 154 -265 -59 -20 51 -48 77 191 -135 240 98 -199 -65 -167 -127 36 150 0 199 -36 5 -131 6
7475 6 189 20 104 66 -92 -246 251 -9 93 56 -32 -55 198 135 -132 121 -43 -121 -38 130 57 166 -37 103
7499 103 -26 -42 111 196 -166 -207 80 -120 -57 -316 151 179 -210 -44 287 -121 210 -255 37 -18 93 319
7521 319 -46 -96 44 277 -169 110 171 178 175 -145 105 -151 -94 14 391 -150 182 192 153 -130 -59 93 -219
7544 -219 136 74 14 -113 -252 -54 -137 15 -54 -345 1 299 208 23 81 -53 72 -199 34 123 68 -69 39
7567C9m3R5J57p1j68r4K27j8M7j43k23L29n6j01M3O3k19J23J03l31K87n6k14L87
7591A63j53l4K00k08M2q7Q2p7NJ11P2j23j44J90l2j28J66J49k41o4K08k58L19
7614A58K0l36J75L5J27k04j39J64l0LJ6J42j07j45K00j19MP4P7k53O6j01K56q4
7638aP7j36J01k3M5l44K93J43j26k55L72k6k57L01j34M0k83K7M91k23on4j13k08
7662b99R3K77J65j59j10o2J7M8J3l12M2M95P2n87N50l38k49M04M1P5m17L40k40
7685a41K4Q0J55j11K4K0j58J48k00J65M5M1j04L1k4j1nLL4J77r5k85J89n1L4o7
7711h2K24m4k07J21k35K21J80m60J83l1L79k97K62r7J33l24N1m9r7J93k1k80K6
7734b51K73k49N49j35m5j36M5K4J95k69L31m58j55K48L8LKkJ56K09k75k07K87
$$ plain form
7567 39 -4 91 248 177 9 -85 142 124 171 28 -195 134 78 -23 20 83 -136 -13 90 -241 46 -10 -224 163
7591 163 10 -24 176 -32 10 -77 5 -72 -67 44 116 -7 -151 39 7 -121 45 194 -47 -111 97 -161 158
7614 158 178 -158 17 52 179 -25 -164 0 -30 -27 -11 131 24 -121 79 -40 -36 38 115 -138 -72 -173 83 -1
7638 -1 76 -60 41 18 63 -281 12 155 29 -226 146 120 -137 164 30 70 -213 -186 305 82 76 22 -91 -299
7662 -299 -206 71 236 77 -33 -95 -78 -30 -17 -329 -287 208 280 -307 243 -95 -344 60 101 176 -241 99 -141
7685 -141 -117 -37 118 7 31 51 -107 41 -159 6 51 92 -12 19 -5 -16 -21 -18 16 193 98 -187 2 -49 -15 -82
7711 -82 142 98 -109 12 -223 -2 178 -282 -99 -130 249 -48 214 117 250 -74 -23 -72 -169 24 3 -277 -251
7734 -251 22 -227 322 187 142 6 51 75 270 1 332 -126 -281 -33 5 8 10 8 164 373 98 -109 178
7757A78j91j47J51P3j43j52M12j07j20K1j36K51j88o8K02r7J78L6j76J65R8k43
7779cR0J87j23j79o4r3K6O5R0n4K96j38j21Pj56K97m4K1j5k15K19k0k10K46pj85
7805h3L5M7j17J07o5J99l57J02O6K09J1j45K1K37l42R8k90K83j06J03K63k04k12
7828a40r3L20k07K81j54K03J09l89K11o4Lj48K27k47J68j16k38L87j46O0P3L7
7850A37l18K69L8p8k05j3J34P7R2j95O4M3P2n18N04O8j48L8j98L93l04q0Q7J28
7874H7j4m0n8K64O6m99K7J72o6J30k34L96P7k85QJ73j12O4l49M3J82k52K49K13
7898B42j85O7l23J35M9J78k64J70O9k09J82k73J50J0j17K43j68J90j98M3J80O0
7920B31p9J05m35K8K10P1K5j79j01J42J20k54J80k93K75l9k4J27J23k33j43J41
$$ plain form
7757 178 -13 -160 -9 64 -79 -231 181 74 -46 -25 -161 90 -98 -166 36 -61 117 153 -23 142 240 -3
7779 -3 87 274 151 -28 -92 -185 -159 -94 -4 -58 238 100 -21 -14 -170 127 83 104 89 -126 93 73 -137 109 102 -83
7805 -83 -48 -1 -118 -11 -76 123 -234 -132 -66 143 154 9 30 267 -75 23 -267 16 -90 13 276 72 -140
7828 -140 -233 87 -120 161 7 210 319 -70 141 77 80 -68 159 -88 80 -36 -274 113 -33 27 100 137
7850 137 -181 88 126 48 -157 -170 -36 41 133 -62 2 45 117 -401 103 171 23 61 -137 256 -48 -128 -41 87
7874 87 73 33 -25 239 305 -194 -167 5 -61 69 -165 231 308 23 31 204 92 156 -193 -150 32 -220 29 242
7898 242 57 124 -199 -64 -15 163 -101 69 138 -71 111 -162 -12 -2 -119 124 -44 146 -52 -9 171 231
7920 231 152 257 -178 -150 60 131 156 -23 -124 18 138 -116 64 -229 46 7 -17 110 233 0 -143 -2
7942bj78J88J52l97L72l23K86m6L3P8k86K01l94M18k14O6o6L45k33n2j4j24K88
7965I8n9j20Q1j3K29j68KK0m18L24K51l60J89J83l02J03j26m9Q2j18J75L7P3k24
7989a10L86k5j61j37J04nk56K92M2j47J39r4J3LK5l8O9j99n6Q0m8L09r7j13L1
8014GJ62n9j14M6K72k50k88K96l79K28n6Q5k4J45m7j46o6J43J32j63J11J45Nk56
8038g1j70J56j11N45k89k29J64O0k44L28j21j27P7Q6J8Q5l22Q9Q6LK08J27l42
8061FP2Kr9l25K06R9JK68m07K73J22j52J9j26q5l1J83j89J55L2l2J00l58J87K56
8086A77k34K14q5p6N5j99J75j66J95L2J29j50Jo6J08K0N3k21J87ol25M21l19m5
8110a25O6j16J45L39k85jn7j34O8K71k05J14k30M13k25O4k70J34Jr3K48k79J39
$$ plain form
7942 -2 -180 8 160 -237 135 -188 98 52 85 163 -123 78 -316 102 -112 -46 -112 233 0 -52 -66 -190 98
7965 98 39 -81 0 -13 216 48 50 70 -348 -24 227 -133 56 239 -63 40 -86 -135 -53 -171 4 41 114 -110
7989 -110 276 251 90 -47 57 52 -204 88 130 -17 122 28 41 44 69 31 100 -99 -155 -75 -123 186 89 -24 7
8014 7 169 110 -4 42 314 64 -224 72 -307 -79 -135 -50 -74 71 24 -122 -188 -45 87 -76 35 180 185 -71
8038 -71 -241 -85 -196 349 60 -169 -5 55 -189 139 18 -109 -32 54 72 157 -165 -76 10 13 221 348 6
8061 6 78 80 -19 -344 -138 -39 -38 230 -177 96 218 66 85 -41 -126 -157 26 -163 -8 24 -8 92 -266 -79 177
8086 177 -57 157 72 -4 51 -148 27 -139 56 88 217 67 68 2 110 130 183 -38 149 143 -182 239 -80 -125
8110 -125 -59 -175 -30 309 24 23 -34 -168 -100 171 -34 80 -150 263 38 102 -168 -34 -33 -126 122 -157 -18
8133a8K32j61M8k27K1K19j13J09j30J61k91J16k65K21K9Nl8J09k60K21J47l14
8155a79J62K17l73M47J1k62j07J49J03l24L8L17o9p2k48L33j38j1Q8k9R7j60j80
8178a90J20NO9j69L83Q3m55J49M1J71j36k68L81
$$ plain form
8133 -18 214 53 101 -126 -105 114 1 110 -20 141 -150 -34 -299 -78 -49 -44 -82 27 -233 -12 135 -179
8155 -179 -17 200 -173 274 285 23 -84 65 168 -156 -118 199 130 58 -190 143 5 -6 82 53 150 -10 -190
8178 -190 -70 -65 4 -165 218 301 -154 -5 36 207 71 -197 184
8191A84
$$ Imaginary data points
##PAGE= N=2
##DATA TABLE= (X++(I..I)), XYDATA
0@%%%%%%%%%%%%%%%%%qJ6j6J6j6J7k5L2l2M0m8N4o2P2q1Q9j04J19j34J50j68J88
39I9k10K34k59K87l19L54l90M30m76N24n77O37p01P73q52R39j039J151j280J430
59G55j603J811k064K378k781L318m077N248p303J1975m6437N622M9426j4575p643
74e950k416J8734j781L304M713p56j3815m063L963j346l770j067J876L641q657
89g390N074N900j791m518k378L8n46M465Q459K205j3576j1153P317M675L525P853
105H159Q426k43j3178l352Q014P63r485n193j491m267o44J595O766K157j119Q898
121E806N459n628q152Q10O317j903o013M638J0756o349j1691M17O336L893n122
136d26j277L567k308m325j405o70J493O213K349l096m203r58Q235L802o39R99
$$ plain form
0 0 0 0 0 0 0 0 0 0 0 0 0 0 0 0 0 0 0 -8 8 -8 8 -8 9 -16 16 -16 24 -24 30 -32 40 -41 48 -56 63 -71 79 -89 99
39 99 -111 123 -136 151 -168 186 -204 226 -250 274 -303 334 -367 406 -446 493 -546 605 -675 755
59 755 -848 963 -1101 1277 -1504 1814 -2263 2985 -4318 7657 -38780 -33158 16268 1693 -5950
74 -5950 -8366 10368 8587 11891 16604 15848 2033 -2030 1933 587 -3183 -4250 -2374 1267 -7390
89 -7390 -2316 3584 1793 -2725 -5103 -5065 -5611 -1146 7313 9518 -4058 -15211 -7894 -3219 306 8159
105 8159 16585 16342 3164 -188 7826 8589 -896 -6089 -7580 -11847 -12491 -10896 -4130 -1973 -3092 5806
121 5806 11265 5637 -2515 -1705 4612 2709 -3304 1334 12090 5741 -5950 -5533 803 4696 -426
136 -426 -1703 1864 -444 -4769 -6174 -6844 -5351 862 3211 115 -4088 -5046 3189 6991 6352 7351
152G351j170k788k735j528o93l642l093P038P565o685q087J444Q199L961n448
167c11l32L903j873l092K11m85R87L006K566J240m340l534K787L12m66M49r16
184A12j583m032j769M123K700j495K616M041L68k736l634J486K178j227J187o
200B329l573j802N02k01P87J053J365J607k366p94J491o01Q06J284M89o64l566
217a854k316K861J805j169J583K255J025l398m295J593J970r22O8l3n82N91L41
234d77k43J256P15K340P08l403j671J12P6J360n34l75O89k345j743J039M25J97
252a874J577J441J882j353k552J597J192k09Q66q29j292r44r25L13J39r83K080
269A26P61k323l91m47M73J497J93Q82J207j202r04N42M47O37k74k09J435j208
$$ plain form
152 7351 6181 3393 658 -870 -1563 -5205 -8298 -1260 6305 -380 -8467 -7023 1176 5137 -311
167 -311 -643 3260 1387 -1705 -1494 -1979 -992 2014 4580 5820 1480 -2054 733 1045 579 1028 112
184 112 -1471 -5503 -7272 -3149 -449 -1944 672 4713 5081 2345 -1289 197 2375 1148 2335 2329
200 2329 -1244 -3046 -2544 -2745 -1958 -905 460 2067 -299 -1093 398 -203 603 1887 2376 1712 -1854
217 -1854 -4170 -1309 496 -673 910 3165 4190 792 -3503 -1910 60 -862 -794 -827 -1409 -818 -477
234 -477 -720 536 1251 3591 4299 896 -775 -663 -587 773 239 -136 553 -1792 -3535 -2496 -2071 -1874
252 -1874 -297 1144 3026 1673 -879 718 1910 1701 2567 1738 446 -498 -1423 -1110 -971 -1954 126
269 126 887 -1436 -1827 -2274 -1801 -304 -111 771 1978 776 -128 414 861 1498 1224 1015 2450 1242
287A242k568M90M4K58M75r28k39q32p81Q71M97j79K313P86O2j79m11N81J083p98
307A787M35m04j622n87j394L5L52n50K41J087q33l93P17J54J084O04J52R11o70
326A106o79J299m39m10L77m50j75r30j056J35M88n84P99r9p87N93r43O48J271
345A64o51O23J135j28r0J78j8O56m00k43K40j734o67L00o95l67L57O6J73k00m04
366a705R52L63L44J081P15nN27j091J71J36j226p29L3q39J64p7m5Q68k40K18J144
387G59j076J21k25j93K94L55n7P85K3k39Q26m77M0j19r82r5N99q26M1o88l59Q04
409f89o7k22J21j33J005J222m27N33K01k95K71o76p47l71j091K42P07m43q5J74
429g70L01O11R9q98P07K57k61M26j47L46J66q09K41M35n90K16l76n86L65j02k15
$$ plain form
287 1242 -1326 -836 -792 -534 -59 -987 -1226 -2058 -2839 -1968 -1471 -1650 663 1449 1511 1332 921 1502 2585 1787
307 1787 2222 1818 196 -391 -1785 -1750 -1398 -1948 -1707 -620 -1453 -1846 -1129 -975 109 713 865 1776 1106
326 1106 427 1726 1287 877 1254 804 629 -301 -1357 -1222 -734 -1318 -519 -618 -1405 -812 -1755 -1107 164
345 164 -487 136 1271 1143 1053 1231 1213 1869 1469 1226 1466 -268 -935 -635 -1330 -1697 -1340 -1274 -1101 -1301 -1705
366 -1705 -753 -390 -46 1035 1750 1745 2272 1181 1352 1488 262 -467 -434 -1273 -1109 -1186 -1231 -363 -603 -385 759
387 759 -317 -196 -421 -614 -320 35 -22 763 786 547 1373 896 936 817 -165 -260 339 -487 -446 -1134 -1493 -689
409 -689 -756 -978 -857 -990 15 1237 810 1343 1544 1249 1520 844 97 -274 -1365 -1123 -416 -859 -944 -770
429 -770 -469 142 241 -657 50 307 46 472 325 671 837 28 269 704 114 330 -46 -632 -267 -369 -584
450e84K8k22L43M52k22m8n8j49R86O91p72k61k39N79Q64p69p86Q6L70j78n40o80
472a109M87P0l60N50K46j58J74j00P82N14m78J07j8l74J75j64k9k36n13n75K25
493g84k3n11m38O19J554N88p18k49KO45k5m28l82O94K65o9j98m80J95l45j71L56
515I7n75r55M05J03R57j05O4M2N49n06Q6Q0k4P45k84L5Q71o44q90o08k26P61j22
538a44j073k54K18P43P48l16m6J49N07j8k83n01J35J069K11P07r99p75K55l01
558C2o71m21m79O36N34k45K9O65J0K55M06l17K60r06k0O12j83L55J93l77k27m39
580b98l54L88K45l42j37K35L25j79r78p6Q84L53K16k84j04R60L27k74K74k59o6
601H56l89j197j62j08n52L42P38K34M5J67j04O76j26J40J91j46l52l05l05O69
$$ plain form
450 -584 -556 -778 -435 17 -205 -253 -311 -460 526 1217 445 184 -55 524 1388 619 -167 -81 289 111 -429 -1109
472 -1109 -622 -552 -912 -362 -116 -274 -100 -200 582 1096 618 725 707 333 508 344 315 79 -434 -1009 -784
493 -784 -807 -1318 -1756 -1137 417 1005 287 38 40 685 660 232 -150 544 809 740 542 62 257 -88 -259 97
515 97 -478 -1433 -1028 -925 32 -73 -9 33 582 76 162 242 218 963 679 714 1585 941 51 -557 -783 -22 -144
538 -144 -1217 -1471 -1253 -510 238 -78 -124 25 532 514 231 -270 -135 934 1145 1852 853 78 333 32
558 32 -639 -1060 -1539 -903 -369 -614 -585 80 90 345 751 434 694 -212 -232 380 197 552 745 368 141 -298
580 -298 -652 -264 -19 -361 -498 -263 62 -117 -1095 -1171 -287 66 282 -2 -106 854 1181 907 1181 922 856
601 856 467 -730 -892 -1000 -1552 -1210 -472 -238 -193 -26 -130 546 420 560 751 605 253 -52 -357 312
621C12k29k10J54K01j9j08q47l1J051k6q4o33l34J65K26l03O24J48N60J82j13
642F86l62N36o04K10J48r29j35k09n68M73m4N37M45l59K54K66k87J90J21Q7M37
663H93n68m14l1l59K33L26m4Q1km98k31J02j80N56k43J93M78l64j04K77j34R36
685I03n1o52K05L8m44j82n0l3M27j85m09l9k09L19K30J61K45J03j92O5k86j81
707b17O00P5J30j3n24K69k50k97J26Q1m91l2O6l50K18J46L33L69K07J62R8n33
729A73J41J30l17L02l64j26j34l41R6K40n4RN2j9L52k05j26N24Ql78L21k43M49
752D90k31PJ85ko0O9m10k32j26M3k13L50n33N04k41O1J6J35N98J44k09K36L0l64
776B47j89j2J50J13k24l86q0r5LJ29l6r7L13o8l68O72L2n3M05l78L50n7o0J05
$$ plain form
621 312 83 -127 27 228 209 101 -746 -777 274 248 164 -469 -803 -638 -412 -715 -91 57 617 799 686
642 686 324 860 256 466 614 -315 -450 -659 -1227 -754 -798 -261 184 -175 79 345 58 248 369 456 893
663 893 325 -89 -120 -479 -246 80 36 117 115 -383 -614 -512 -692 -136 -379 -186 292 -72 -176 101 -33 903
685 903 852 200 405 443 -1 -183 -233 -266 161 -24 -433 -472 -681 -362 -132 29 274 377 185 250 -36 -217
707 -217 383 458 588 575 51 320 70 -227 -101 -20 -511 -543 -477 -827 -609 -463 -130 239 446 608 706 173
729 173 314 444 127 429 65 -61 -195 -536 -440 -200 -254 -245 -193 -212 140 -65 -191 333 341 -37 284 41 490
752 490 259 266 451 449 389 458 48 -184 -310 -267 -480 -130 -663 -159 -400 -339 -323 -188 410 554 345 581 611 247
776 247 58 46 196 309 85 -301 -381 -476 -473 -344 -380 -477 -164 -232 -600 72 104 51 456 78 428 371 311 416
800D16m58J30ll51j1K45k94q6L73n18O65k38p4N2n9j39L69j13N23K99l88p0j8
823B52Nr7N3n7l03l76m5J88r4jO16m71j9N05j31L1N53l09L85k56j88L09n60j60
847a70J91l61K57q3p6j10K74l12K18K52j02K10k49K96k40P3p4L26j55O5P4j75
869A29lk32O2K0k01J98j65m22k7N42j79K23L0R9K00j55L35J07j64K1r3j57j86
892a8j67j12N2J38o3j73J20j20J53N3J54q2K94N6J36l78M16k13j84J81j21k85
914a63K39l25M47j81l13j9L58k80M58r6j46n9K65l8K13j76N0m9k50L09k42J21
936A23N36n04l70K11l12P0k29N5L54j51Q6j3K48j13L59l2q8L00J3l05Km46J45
959f1k26O9J60j46j83J12O6m4M44j73L8J55k72K81Jk01J42J73l93K64k47R3k28
$$ plain form
800 416 -42 88 85 -266 -277 -32 -326 -412 -39 -557 108 -130 -204 -152 -211 -350 19 -94 429 728 340 270 252
823 252 257 160 213 156 -147 -523 -568 -380 -474 -475 141 -330 -349 156 25 56 609 300 685 429 241 550 -10 -170
847 -170 21 -340 -83 -166 -242 -352 -78 -390 -172 80 -22 188 -61 235 -5 68 -6 320 165 230 304 129
869 129 126 -106 -44 -24 -225 -27 -192 -614 -641 -99 -278 -55 -25 74 274 119 454 561 397 418 325 168 -18
892 -18 -185 -297 -245 -107 -170 -343 -223 -343 -190 -137 17 -65 229 285 421 43 459 246 62 243 122 -163
914 -163 76 -249 198 17 -296 -315 43 -237 221 125 -21 -80 185 147 360 184 234 185 -65 244 2 123
936 123 659 155 -215 -4 -316 -246 -475 -420 -66 -217 -131 -144 104 -9 350 318 230 530 543 238 240 -206 -61
959 -61 -287 -218 -58 -204 -387 -275 -209 -253 191 18 56 211 -61 220 221 20 162 335 -58 206 -41 52 -176
982a76j37M95m60K10J2l57m1M10n1O9L7j12L19lj95J06L75k0m39K68n71L01j7
1005B3j67J97j95j96M03n45M22n6P2K44l38P2L42N3l86M23o8L55k16n14nj63N5
1028a88Q6j93M7k02K06j03M39k27j55K42k16M47l7J45k13K23Q5R5l47J6p1k72
1050a93O2L53j89q5j74J28k3J03l02r2N51l24L95j19K75j59K51k6j89j46j50q5
1072a38J63K7l38K03j77R6j17K11j88L19Q0j75J29j31O7M0j00J82J50Lk36k1j30
1095h1J33k71K70j50l90J27L92k29J21k27J27L12J5N5Ql6j52K46k89L03l73J63
1117G4j65J06j54J53l0j87j23K83J4Jj39L59n4J60p9J46l28J12q3j65lJ09j20
1140a13K34m00K11j19L5K8J00k72M69K1J06j62K20l22O5j56K98j1j77j47K45m3
$$ plain form
982 -176 -313 182 -278 -68 -56 -413 -454 -44 -95 -26 11 -101 218 215 20 126 501 481 42 310 -261 40 23
1005 23 -144 53 -142 -338 65 -480 -58 -114 -42 202 -136 -64 278 331 -55 368 300 655 439 -75 -80 -243 -188
1028 -188 -102 -295 -248 -450 -244 -347 92 -135 -290 -48 -264 183 146 291 78 301 386 481 134 150 79 -193
1050 -193 -131 222 33 -52 -226 -98 -121 -18 -320 -412 139 -185 210 91 366 207 458 432 243 97 -53 -138
1072 -138 25 52 -286 -83 -260 -164 -281 -70 -258 61 141 -34 95 -36 31 71 -29 153 303 306 70 49 -81
1095 -81 52 -219 51 -99 -489 -362 30 -199 -78 -305 -178 134 149 204 212 176 24 270 -19 284 -89 74
1117 74 -91 15 -139 14 -16 -203 -326 -43 -29 -28 -167 192 138 298 219 365 37 149 66 -99 -102 7 -113
1140 -113 121 -279 -68 -187 -152 -124 -24 -296 173 194 300 138 358 36 101 -55 243 232 55 -92 153 110
1162A10k22n3M6j89M0J86o0l7o4M42l95P3P3J29K83k65N2J99l22M86m76J1L24
1185C71n48j5K95k26l54K77N2O0L11K22m08K1o7L58l16r9J25K12k16M02n70J08
1207ej29m1O6M2n5J05j77N6R7P6j49M3K50j90P4p5M32k50q1L03l02j73K93j54
1231E6l14j4L62j38n0n9J52j28K19j03R7J90m3l2P5k45J56k49j94K99k41l9J3
1254b30J16J14r7J31Q2l31L20O4k9k50K51j15r2L13j2l35O7Q3o4j37R9K0j59O5
1278a26o8J53Qk6L6K2J19j33K77j12K77r8k00k05K03M9k57n2L14k07k3Rl33K54
1302a19L4q8K19j46J9J42J00N9l04K29k12J47L1j37J21l9J32o0Kj81j77K73j40
1325i5k52P7L88l8k23L28o2Q1j69J10J56k66K70k03k40j28L02k24K01j47K26j93
$$ plain form
1162 110 -112 -165 -119 -308 -268 -82 -142 -179 -243 199 -196 -123 -50 79 362 97 149 348 26 512 36 47 371
1185 371 -177 -192 103 -123 -477 -200 -148 -88 223 445 37 58 -9 349 33 -66 59 271 55 457 -113 -5
1207 -5 -134 -175 -109 -67 -122 -17 -194 -138 -41 35 -114 -71 179 -11 63 -12 420 170 89 392 90 -83 210 56
1231 56 -258 -272 90 -48 -98 -157 -5 -133 86 -17 80 270 227 195 270 25 181 -68 -262 37 -204 -243 -230
1254 -230 -114 0 -97 34 116 -215 105 169 140 -110 141 26 -66 247 235 -100 -33 50 -14 -151 -52 -32 -191 -126
1278 -126 -194 -41 -33 -59 -23 -1 118 -15 262 150 427 329 129 -76 127 176 -81 -133 181 -26 -49 -40 -373 -119
1302 -119 -85 -173 46 -100 -81 61 161 220 -84 145 -67 80 111 -26 95 56 188 128 130 -51 -228 45 -95
1325 -95 -347 -270 118 80 -143 185 123 204 35 145 301 35 305 102 -138 -266 36 -188 13 -134 92 -101
1347a01K18k55J3K9K9K61p0k49J76R0J36q6R3j88j21J66j87J32k84K30k97n0J60
1370a55K76L8J02k07k3L5L35j98K71k53J25k96k16K43l76M19j17J4o3K79J2l60
1392a15lJ68R4k03Kj25K34P9q8J91k79o4J88J4L8j52J47k99n9K54k94J10K39l30
1416b53K18j67J25n9N6K91j51J13M6O7l4l37K03j71p8M5N2K4j33l6N49l91P3J61
1440B13j25%O4j1J55l29J97k05O1O8j94K91P6j72j78K13m21K53J50k40L6K53n70
1463d15M63k42K92j45L04k18L89m89J70m8j35j2q0K73l35K4m3l3L06R7k24N6K10
1486A65j7R2r0J14rk40N00m69k90K67l33K26L52m57J14O6k22r2K43n2k1J15J17
1509G9J39j04m1J04j65L14j23l18j11K46l67J93P0L0j22J06J73l86J27Q8MJ18
$$ plain form
1347 -101 117 -138 -125 -96 -67 194 124 -125 51 141 277 191 284 96 -25 141 -46 86 -198 32 -265 -315 -155
1370 -155 121 159 261 54 31 66 401 203 474 221 346 50 -166 77 -299 120 3 17 -46 233 245 -115
1392 -115 -118 50 144 -59 -57 -182 52 131 43 234 -45 -109 79 93 131 -21 126 -173 -232 22 -272 -162 77 -253
1416 -253 -35 -202 -77 -136 -80 211 60 173 219 286 252 -85 118 -53 -131 -86 -34 -10 -143 -179 370 -21 52 213
1440 213 88 88 152 141 296 -33 164 -41 20 88 -106 185 261 89 -89 124 -297 -44 106 -134 -98 155 -415
1463 -415 48 -194 98 -47 257 39 428 -61 109 61 -74 -86 -166 107 -228 -204 -247 -280 26 123 -101 -45 165
1486 165 148 240 150 264 255 15 515 46 -244 23 -310 -84 268 -189 -75 -9 -231 -323 -80 -132 -153 -38 79
1509 79 218 114 73 177 12 326 203 -115 -226 20 -347 -154 -84 -54 -176 -70 103 -283 -156 -68 -64 54
1531E4pk7k8M7n4J8J2j61K39l7j65K34k84K45k19J50l65M59k81L3j0l3K18LO5
1556A06j34J98j27L07k18pO8o66N36k06O5j01J49n0j66K26L5k38q7L86J46r2p3
1579E7l31p5N23j94J67j11J8j0nJ4r9k12j3RK69j54K64p5J73j26j48Q6j2n0J55
1604A20q1J63o0j68j6k6k8k18L99m61M3J91m2K71j64M9K87j31q2N2Lj00L55n50
1628a94K4Q1j49M65k09r9J56j12j62r0K44J89j46l8R3l03J46L24n31O72l63r5
1650i7j05K35j8k53L91l27J93N2j52r4K99j03J81k66l2L21l2l1J34m73p3M23p7
1673I6k75K35J25m59L05k01N4q5J85j73K59o7L67j09k60P5o6j06j31M11m17J17
1695a20J56J32q3j31n5l6M4J18k87J32j23K92j43M4JL24k57M5L5M1L8k7%k66K48
$$ plain form
1531 54 47 20 -8 39 -15 3 15 -146 93 56 -109 125 -159 86 -133 17 -348 111 -170 -137 -147 -180 38 41 106
1556 106 -28 170 43 350 132 125 193 -473 63 -143 -78 -179 -30 -80 -246 -20 15 -223 -310 76 222 130 57
1579 57 -274 -349 174 -20 147 36 54 44 39 53 -46 -258 -271 -262 7 -147 117 42 215 89 -59 27 15 -35 120
1604 120 39 202 142 -26 -42 -68 -96 -314 85 -376 -333 -142 -184 87 -77 -28 259 128 46 98 101 1 356 -194
1628 -194 -170 -89 -238 227 18 -81 75 -37 -199 -289 -45 144 -2 -40 53 -250 -104 220 -311 361 -2 -97
1650 -97 -202 33 15 -238 153 -174 19 71 -81 -175 124 21 202 -64 -96 225 193 162 296 -177 -250 173 96
1673 96 -179 56 181 -278 27 -174 -120 -205 -20 -193 66 -1 366 257 -3 72 6 -100 -231 180 -237 -120
1695 -120 36 168 85 -46 -101 -137 -93 25 -262 -130 -253 39 -104 -60 -59 265 8 53 88 129 167 140 140 -126 122
1720A22k81J18p3n5p6L09J2j88L53j63j35RK05k7K11j78l05J37J7j88K00J2j30
1743i4O7K8k0k12K01pqj27J20N8q7NK9J81k4k03RK56l09M02l23j51o3J87L97j51
1769A61k99J03l3J7J6N2J94j21O8O1j49k2q9l7r2P6J65k53J00k46K1K65j03j9
1793a64Q3k8J99O7m9k11L52l62J50J8k34K49l2J78l16K51j13p9K53rj45j71QJ16
1817A1j52OK57k33J57k08L25q9l6OP8j55K96k50Jo3l15L38j51K14J39l64J0R1
1841h7M9K78j12j66P1J7KL05m85Q8k43J46K13j35k64K37k3Q8k45K53n1J47k7n5
1865Al4L9n1K0j91M05j56j56J84j91K10Q4j99K06j06J34k31l21L04j5Q7N8l72
1888b91K27J97p6N0K52j67l7j11q4K23k76n1J98K25n34L65l85K11l8K06j86K7
$$ plain form
1720 122 -159 -41 -114 -169 -245 64 76 -112 241 78 -57 -48 157 130 341 163 -142 -5 12 -176 24 36 -94
1743 -94 -27 1 -19 -231 -30 -37 -45 -172 -52 6 -81 -76 -47 134 110 -93 -84 172 -137 265 -58 -209 -272 -85 312 161
1769 161 -138 -35 -68 -51 -35 17 211 90 158 219 70 48 -41 -78 -170 -94 71 -182 -82 -328 -307 -42 -145 -164
1793 -164 -81 -109 90 157 108 -103 249 -113 37 55 -179 70 38 216 -100 151 38 -41 212 203 58 -113 -105 11
1817 11 -141 -135 122 -111 46 -162 163 74 38 44 122 -33 263 13 14 -49 -364 -26 -177 37 176 -188 -178 -87
1841 -87 -38 240 128 -38 33 50 52 357 -128 -40 -283 -137 76 -59 -323 -86 -109 -21 -266 -13 -64 83 56 1
1865 1 -33 6 -45 -25 -216 189 33 -123 61 -130 80 164 -35 171 65 199 -32 -353 -49 -64 23 81 -291
1888 -291 -64 133 57 107 359 192 155 44 -40 183 -93 -144 54 279 -255 110 -275 -64 -102 104 -82 -55
1910e5L72l87k13M30p8j09p6J77J00j10k71L17k42R9N2n7K1l9Q7j19p7L27j59
1933a0pK6p2P2L4k00J82k31K76L6k27q4J59k27M29r4k55K32O7l27L10j7j3pk2
1958C0j62M03l71J12K92j91l25mL19k98L28k87L86l77K2j05J79J91j93m4K8J49
1980H2j10J9j94L25q7j97K69j66L88l59J12j03L4k66P4L31k00J35K2j06r7J93
2002I9J6j33l2M9J61K36l99m1L7R7k87K78l15P0L13j18k27kJ19K0P1r8K05K2p7
2027F4N3k80J44l67K63J34Qk53K25J74j09k0n50L01k50P37j65j37M33m81l4pm2
2050a59J77J87l39K16j48j55K97k89J90j97Q1J10ON6O7m5J67l16J54J23l11K05
2072G7l3l9K1o7j42M13l01M0j4J38L1k24J3M18j27k8k38J0N8j67J0K18j17j33
$$ plain form
1910 -55 317 -70 -283 147 69 -40 -116 61 161 51 -220 97 -145 -46 6 -51 -30 -69 18 -101 -178 149 -10
1933 -10 -17 9 -63 9 43 -157 25 -206 70 106 -121 -205 -46 -273 156 62 -193 39 106 -221 89 72 59 52 30
1958 30 -132 271 -100 12 304 113 -212 -216 103 -195 133 -154 232 -145 -123 -228 -49 142 -51 -95 -67 82
1980 82 -28 -9 -203 122 35 -162 107 -59 329 -30 82 -21 13 -253 -179 152 -48 87 109 3 -94 99
2002 99 115 -18 -50 -1 160 396 -3 -44 -7 90 -197 81 -234 -164 149 31 -196 -198 -79 -59 12 -86 119 141 64
2027 64 117 -163 -19 -386 -123 11 19 -234 -9 165 56 36 -514 -213 -463 274 109 -28 405 -76 -110 -117 -159
2050 -159 18 205 -134 82 -66 -221 76 -213 -23 -220 -139 -29 -23 33 100 55 222 -94 60 183 -128 77
2072 77 44 5 26 -41 -183 230 -71 -31 -45 93 124 -100 -87 331 204 176 -62 -52 6 -161 -151 67 -50 -183
2096a83K11k9j03Q1j35L29k32O4J5N8q5l9k59L46J64o7K0l66M38r6j82J95r0M5
2120A00Q2j12j10j64J06r3Q4K0j3M32l57j60K71j56j11N91l82l06K96rK78k05
2142H2J5k6k08L5K17j47j06k05M22k00K73l53J35J47o2k24M79l11k1K43l57J26
2164d6M5jk48K17M2l0K05k53N4m5r0J79o0K24j75J94j49q8L0q4K87m37J23L06
2188B00m04K21j8L5q0k31J70K55K9k77P9j43N3J39J3j27lK08j70J64j53J23k36
2211a53M40j93l35K71Q0k02J14r4OJ51q8o2l0K50l16K51j6j59J79O5K5Rj98j03
2235a08K99p8k06j13L15j81j16r7l9K94J19l88M47k79j5K87k26L60j65j06k4n5
2257g5J01K8J25k84J29J14j46q5j52L42j81K40j73J4J21P0k99J09J99j5j51j58
$$ plain form
2096 -183 28 -1 -104 -23 -158 171 -61 3 18 76 -9 -48 -307 39 203 136 156 -210 228 132 -50 145 55 100
2120 100 182 70 -40 -204 -98 -191 -107 -87 -100 332 -25 -185 86 -70 -181 410 28 -278 18 9 287 82
2142 82 97 71 -137 -102 115 -32 -138 -343 79 -121 152 -201 -66 81 19 -205 274 -37 -58 185 -172 -46
2164 -46 -1 -2 -250 -33 9 -21 184 -69 -15 -60 -150 29 -31 193 18 212 63 -25 5 -79 208 -229 -106 200
2188 200 -204 17 -1 34 -46 -277 -107 148 177 -100 -21 -164 -111 28 41 -86 -89 119 -51 113 -40 83 -153
2211 -153 287 94 -241 30 110 -92 22 -72 -66 85 -3 -65 -95 155 -161 90 74 -85 94 159 184 193 -5 -108
2235 -108 191 113 -93 -206 109 -72 -188 -285 -324 -30 89 -299 148 -131 -146 141 -85 275 110 4 -20 -75
2257 -75 26 54 179 -105 24 138 -8 -93 -245 97 -84 156 -17 -3 118 188 -111 -2 197 182 31 -127
2279a27q0K50j27j33K46q2r5p4K45J54J4l74K24R2j64j0L1O8O6j73P5M3jLJ14
2304A85k92K5j10L66k18J13L77m86J35j99L44k67k0lJ60j88J00j22R5J08k22j8
2326a37L02j85k31L33k2J30j61L3k18N1J71l2l55L51j39M7m5P4j0j41P7J50j88
2349a45L29j70j74L06l14J28N2J17j36O9j9J67l0J9j26Q0j13l33J96J38M9k79
2371a89Q4j4K65M0q0j41Q2j03K55k38J7J04m0q4K03k19L5k8Q2P9k41O2l1q4K10
2396B6J31j76m3L7o7J12M1r7K8Q2k28K43o5N4l04R8Q8M12k49j84P7j08J21L3q7
2421b5K4J39j95L35j85J28k39J04J0r9j21L93n2K97o23m3J13j8L7j41O8K55j84
2444b2Q4j96N1M6J09K35k73k15K57K6k00J04q2j34L61O1K30m00J20j57l5J0j34
$$ plain form
2279 -127 -207 43 -84 -217 29 -53 -148 -222 23 177 191 -183 41 133 -31 -41 -10 58 124 -49 26 69 68 71 185
2304 185 -107 -82 -192 174 -44 69 446 -40 95 -104 240 -27 -47 -50 110 -78 22 -100 -5 103 -119 -137
2326 -137 165 -20 -251 82 60 190 29 62 -156 -105 66 34 -321 30 -109 -62 -107 -33 -43 -184 -107 43 -145
2349 -145 184 14 -160 146 -168 -40 12 129 -7 62 43 210 180 199 73 153 40 -293 -97 41 90 -189
2371 -189 -105 -119 146 186 106 -35 47 -56 199 -39 -22 82 42 -42 161 -58 -23 -51 31 110 -131 -69 -100 -184 26
2396 26 157 -19 -62 -25 -92 20 61 -36 -8 74 -154 89 24 78 -226 -128 -40 372 123 -61 16 -92 29 62 -25
2421 -25 -1 138 -57 278 93 221 -18 86 96 -3 -124 269 217 514 -109 -152 -39 -57 -20 -161 -93 162 -22
2444 -22 62 -134 -83 -37 72 307 34 -181 76 102 -98 6 -76 -210 151 212 442 42 162 5 -30 -20 -154
2467a54J03K66k10J86k30J87M2j64j09J17n3j75J92m5o4Mj01M46k06j18J61l1
2489D4J97k98J10rl55K82J32rm06L41P5k58M2J47J3J07m70L70Q0l06L51L4k20
2512fl0l1KJ20K1LL2m76M79j40J82k74K8J01j2J0m1O8P3k09J14k52J54rP8r5J0
2539a00K64j08q2j28L20k24Q6q3L52k01M8J64n37L98m91K89o5l4L17j91j44J78
2561B8k02J7o7N6Q9j8J07m6j93K25J4J23r3r6P6r2K79j29k71J44J38r8j15P5J71
2586A22k70L0L14j61k46m9L32p1l74M25j53K42k1j09j10J84r5J65j87k7J27p7
2608iq4J84j93K2Q5R4j34j6j5m3K02p2ko4l21K29K36l79L82k64M60j27j21j35
2632h5Q5k4P2k75L11j94J30L1r9p4L41k13L0J1p4K68m45L51j10k57M96O5j23j7
$$ plain form
2467 -154 -51 215 5 191 -39 148 190 26 -83 34 -19 -194 -2 -47 -111 -107 -208 238 32 -86 75 44
2489 44 241 -57 53 44 -311 -29 103 94 -312 29 104 -154 -112 35 48 155 -315 55 135 -171 180 214 -6
2512 -6 -36 -67 -65 55 76 79 111 -365 114 -26 156 -118 -90 11 -1 9 -32 36 109 -100 14 -238 -84 -93 -15 -110 -100
2539 -100 164 56 -26 -154 166 -58 28 -55 297 96 144 308 -229 169 -322 -33 -98 -132 185 -6 -150 28
2561 28 -174 -157 -224 -168 -79 -97 10 -36 -229 -4 10 133 40 -56 20 -72 207 78 -193 -49 89 -9 -124 -49 122
2586 122 -148 -118 196 35 -211 -260 72 1 -373 52 -101 141 120 11 -99 85 -10 155 -32 -59 68 -9
2608 -9 -93 91 -102 -80 5 99 -35 -51 -66 -109 93 21 19 -45 -366 -137 99 -280 102 -162 298 171 50 -85
2632 -85 0 -24 48 -227 84 -110 20 51 -48 -122 219 6 36 47 -27 241 -204 147 37 -220 276 341 218 201
2656B01k35J25j69L02k69L6R7j04k5m8l5K10j86K29k61JM12k68l8j33o4K89P4
2679A41k17K74j57M2r8k28L76j4k46k0J27J17j53J66J0l7J27J28k85K48l01P4
2701G4l34L41j20M2J00j91m17O83m18K61m7o5j3J72j51P5n8P7p8P0L5o3P9j44
2725i0J49M6n1l44M96k70J07j02J38l3K1j80J40J20l22K29P8o2k00L72j00Kk70
2748a26p9R8n3J28K46k24j84J57q7L6O2J49l67K64J10l3Q0r8p4M16n84J97J18
2771A52j95n0j12M09k51q9J31J8r9l4P0j12L58qO2l06q1M10k99R7K8N4j57m9r9
2796a52J7L03j88J95p2k23r1L27J8k70l8K44N9j37k53L64l03R6K06r2K33m15J47
2819b5M56m12QJ65j58m7j42k3M95l21k42J44L04r2R8k50o4j49K13O0k03M49m05
$$ plain form
2656 201 -34 91 -78 224 -45 -9 88 -16 -41 -89 -124 86 -100 129 -132 -131 281 13 -25 -158 -222 67 141
2679 141 -76 198 41 83 -15 -243 133 119 -127 -147 -20 97 -56 110 120 83 210 338 53 301 0 74
2701 74 -260 81 -39 3 103 -88 -505 178 -240 21 -26 -91 -104 68 -83 -8 -66 11 -67 3 38 -25 54 -90
2725 -90 59 105 54 -290 206 -64 43 -59 79 46 67 -113 27 147 -175 54 132 70 -130 242 142 144 -126
2748 -126 -205 -107 -160 -32 214 -10 -194 -37 -124 -88 -26 123 -244 20 130 97 177 79 5 421 -163 34 152
2771 152 -43 -93 -205 204 -47 -136 -5 13 -86 -120 -50 -162 196 188 250 -56 -137 273 -26 71 99 153 -4 -53 -152
2796 -152 -135 168 -20 175 103 -120 -211 116 134 -136 -174 70 129 -8 -261 103 -200 -104 102 10 243 -172 -25
2819 -25 431 19 27 192 34 -13 -155 -178 317 -4 -246 -102 202 110 208 -42 -106 -255 -42 18 -185 264 -141
2842a41L16l76L02o0J2j53J91j11K31l91K97k1l68N70j3N6l3m83L61k02j01R7
2864b0n2J69k81K26j89M52j69o1p2k07J5J02K85r4L6k07Q8p7L31m47J3M56k45
2887E2l7K11j17k6j13L6Op4N6j3O1L6NrJ9k63M47j83k5l6k50Q6QP2j52J09J47
2914E3M9k51O0k9J80K22k83P3k08j3K19o7M66n66J06M0j02O3k03K51m8k53l0K25
2938d6J11k02R1J59j04K09n5J28l42l3R1n0m9n2k7K29k54L51r5j0j68K42K04m05
2962g7ROK38j19po9J48J1j65J57k12k08K31K84k12k67M30k33K10k45O5QK75l91
2986a33K61k58L32k05n7q0j01L39j66Q2N5J9J23n6j03j34k0M35j75j61r2J23j00
3009g2J19L0m0j58J72n3J75j00j00R1j50K27j00l25M24k05K6l4N5L63k31m55L90
$$ plain form
2842 -141 175 -201 101 41 53 -100 91 -20 211 -180 117 96 -272 298 285 341 308 -175 186 -16 -117 -20
2864 -20 -72 97 -184 42 -147 305 136 75 3 -204 -189 -87 198 104 140 -67 21 -56 275 -172 -159 297 52
2887 52 15 226 109 83 -30 6 12 -62 -6 -19 42 78 83 74 93 -170 277 94 69 33 -217 -131 -123 -51 -203 -94 53
2914 53 102 -149 -89 -118 62 284 1 74 -134 -147 72 5 471 -95 11 51 -51 12 -191 60 12 -241 -271 -46
2938 -46 65 -137 -46 113 9 218 163 291 -51 -84 7 -43 -92 -144 -171 58 -196 155 60 50 -118 124 328 -77
2962 -77 -68 -62 176 57 50 -19 129 140 -25 132 -80 -288 -57 227 15 -252 178 -55 155 -90 -25 -17 258 -133
2986 -133 128 -130 202 -3 -60 -140 -241 98 -68 14 69 88 211 155 52 -82 -102 333 158 -3 -95 28 -72
3009 -72 47 77 37 -121 51 -2 173 73 -27 64 -86 141 41 -284 140 -65 -39 -73 -18 345 114 -341 49
3032D9O9r1n2k69M18k69J81j63J50Q1j13o6j31L04q6j60j7R5j10P7L35p8l14L64
3056B04n29M54r2J70j44R6m12M04k40j83J36J75m3j01J20j21L6K61k80j22Q1k67
3078c97K20M6j34M06l3q0j05P9o3P2k77K04K67J46m73J43q3qR4K1j6J11k78L30
3102A92m3j59R9k07K12j17J07j12J42j98K12l02N3J80L4K52l32k16K90p5J2l6
3124a2O8OJ56k09M4k2j29J04r3oj66L92k03M5L81k87l35QK49oJ6k71K85K32k33
3149A4j49L71k16k7r9OJ38J84j30J11l33J43j14Q0M3r1J23j75J00K44k99M7q9
3172a18J62k12L52k06J80q6q8Q4m4PM1n0k50K6K64R5k52m5K99n4P5k84O5j12M99
3197C48m60K94Mk33k16J72J72k27L7N5J14j79L60m26K73o7K35l16l3nK49j60J84
$$ plain form
3032 49 118 27 -25 -294 124 -145 36 -127 23 104 -9 -75 -206 98 12 -148 -165 -70 -180 -103 232 154 -160 204
3056 204 -325 129 37 207 63 159 -253 151 -89 -272 -136 39 -4 -105 15 -106 -70 191 -89 -211 -130 -397
3078 -397 -177 -131 -265 141 108 28 -77 2 -61 11 -266 -62 205 351 -122 21 -62 -70 24 45 29 140 -138 192
3102 192 149 -10 89 -118 94 -23 84 -28 114 -84 128 -174 -121 59 93 345 13 -203 87 12 24 -12
3124 -12 56 62 218 9 53 31 -98 6 -87 -93 -259 133 -70 -25 356 69 -266 -258 -9 -15 1 -270 15 247 14
3149 14 -135 236 20 -7 -106 -100 38 222 92 203 -130 13 -101 -21 22 -69 54 -121 -21 223 -76 -29 -118
3172 -118 44 -168 184 -22 158 72 -16 68 24 31 72 22 -228 -202 62 157 -95 -140 159 105 180 -104 -39 -151 348
3197 348 -112 182 186 -47 -263 -91 81 -146 -109 -54 60 -119 241 -185 88 21 256 -60 -93 -98 151 -9 175
3220A75l04L42o6n9O2m1j24M3K1K7L31l72J76k24n2J88Q5q8r9m8J3P7j72J69k86
3245b26M41j22P5k17N2J26l41J58J51j57K21p5j66P7j36J89K8k72L23J1l89K38
3267a1r7M9k3J16J15j52m7j72K66n7j35J37p5J49j88p8K20M4n8j16M1j87M73r8
3291A16j75J25k71N5P9l9Q9j58Q4n8K69k43R8J93j11k74O6K65M0k03q8l9L24j07
3315C7R7L8l31K17R7j36r7k57K57K51k37L52m6k15k81J92p9j2R7J66O2n24K49
3338a03k29M05j18J57l8k08m3L15p1n2o9rk5L6M2j76K49J18j73M68m72l8k0L17
3362B63m86L01J23j68J45l52K68p7K3R5p2n0q0o1K82rr3j72m7R4O3N6JP7k88J10
3388e4K04j80R7k62N02n25M4P7M6L21k00P0k08r6J73k76J84J4j01O0m2L60j66
$$ plain form
3220 175 -129 213 147 88 150 109 -15 28 49 76 407 35 211 -13 -65 123 208 120 21 -27 -14 63 -109 60 -226
3245 -226 215 93 168 -49 3 129 -212 -54 97 -60 161 86 -80 -3 -139 50 78 -194 129 140 -249 -11
3267 -11 -108 -59 -82 34 149 -3 -50 -222 44 -13 -148 -11 -86 63 -125 -203 17 61 3 -113 -72 -259 214 116
3291 116 -59 66 -205 -150 -71 -110 -21 -179 -95 -153 116 -127 -29 164 53 -221 -155 110 150 -53 -141 -180 144 37
3315 37 134 172 -159 58 155 19 -78 -335 -78 173 -64 288 242 27 -254 -62 -141 -153 -56 110 172 -352 -103
3338 -103 -332 73 -45 112 74 -134 -177 138 67 15 -54 -63 -88 -52 -10 -186 63 181 8 476 4 -34 -54 263
3362 263 -223 78 201 33 178 -174 94 17 40 135 63 13 -67 -128 154 145 52 -120 -167 -73 -10 46 47 124 -164 -54
3388 -54 150 -30 67 -195 307 -218 -174 -97 -51 270 70 140 -68 -164 9 -267 -83 -69 -170 -110 -152 208 42
3411D2n2k4j88J99n8J4J02K13j17j1j69J79k24j07N86m91R2L13k62p4j44M84k20
3434H3j56P4N8K51m46J84p5j97M61l75j54J34K13m42K48L08m23K75K42m56J31
3455f2J33j74Orj04J01r6K7R6K14k09J61k31K06k24J87P3j11l8J9o4J28P4k32
3479a29Q7PJ58K2j08j88K19L4j49J64K53n16n4JN4J84J22l22L14j31J29oj80k49
3503b84J20K75l11J81k9L00n29K96j25J01R8j2kl41K91J32j06Kl0j14P5J25j12
3526AJ85J8n7j61K77j05J7j17j7j04K51l9K0k9O3l50K06j40J08R5J4j85P4j70
3550a45K52O9l79M09k95M81m57J97k31J74l72K45m5K07k07j2K5q3j24J70Q5k6
3572f2o6m6J89J17k57K86k64M9P1L31k65j17PL8N0N2j68j09L72k97J08JMQ8j86
$$ plain form
3411 42 -10 -34 -222 -23 -81 -67 35 248 131 120 -49 130 -94 -201 385 -106 -14 299 37 -37 -181 303 83
3434 83 -73 1 59 310 -136 48 -27 -224 237 -138 -292 -158 55 -387 -139 169 -254 21 263 -193 -62
3455 -62 71 -103 -97 -106 -210 -109 -205 -178 -82 132 -77 84 -147 59 -165 22 95 -16 -54 -35 -99 29 103 -129
3479 -129 -42 -35 123 145 37 -151 68 102 -47 117 370 -146 -200 -199 -145 39 161 -161 153 22 151 145 -35 -284
3503 -284 -164 111 -200 -19 -48 252 -277 19 -106 -5 93 81 79 -262 29 161 55 57 27 -87 -12 113 1
3526 1 186 204 147 -14 263 158 175 58 41 -63 188 149 169 140 203 -147 59 -81 27 122 136 -49 25 -145
3550 -145 107 176 -203 206 -89 392 -65 132 -99 75 -297 -52 -97 110 -97 -109 -84 -167 -291 -121 -36 -62
3572 -62 -128 -174 15 132 -125 161 -103 -54 17 348 83 -34 -27 11 61 113 -55 -164 208 -89 19 20 24 112 -74
3597g4k09M15m0k4l05K50o7M77o04K55l90L92j43J52N4p4k68pJ29J54M48o73K62
3620A10j66J9P7r8j11qL39j35j56L15k75K45k28j25K37%r8J19j12J70k61J16J17
3643I1R7j75k31K70k0p4o6K61k83M6O5O6P7k02J56lM20o90L65m1L6j10P7j0j64
3668d2o3M19m19L0L97j84q0jO5k10JJ20j87M4K26j87J35r7J54p8K62j62j58K86
3692B71m17M60l16K91m15N14j36m98K03N0j38J43k59K37K7j73K09o5j5J97k05
3713c5J19l19K52J23k21K08J5k75n8M24l48J98J46m68K97j77mK5K26J3k45J18
3735A4k23L60j83j96K64l3J49l04K18j1j02k63N9K68Q5o3k2j56J62Rk9R5o5j44
3759a11lJ53p6J10n5k97L94j41J3K14m76K46J13j46j98K68l35N49m75L93l01K25
$$ plain form
3597 -74 -283 132 92 68 -237 13 -54 423 -181 74 -316 76 -67 85 139 65 -203 -210 -81 73 521 -152 110
3620 110 -56 -37 40 -58 -169 -177 162 27 -129 186 -89 156 -72 -197 40 40 -58 61 -51 119 -142 -26 91
3643 91 188 13 -218 52 32 -42 -108 153 -130 -84 -19 47 124 -78 78 75 495 -195 170 129 165 55 132 122 -42
3668 -42 -105 314 -105 -75 322 138 58 57 122 -88 -87 33 -154 -110 116 -71 64 -33 121 43 305 143 -15 271
3692 271 -146 314 -2 289 -126 388 252 -246 -43 7 -131 12 -247 -10 17 -156 53 -12 -27 170 -35
3713 -35 84 -235 17 140 -81 127 142 -133 -191 233 -115 83 229 -239 58 -119 -123 -98 128 141 -104 14
3735 14 -209 151 -32 -228 36 3 152 -152 66 55 -47 -310 -251 17 102 39 17 -139 23 32 3 98 33 -111
3759 -111 -114 39 -37 73 18 -279 115 -26 -13 201 -275 -29 84 -62 -260 8 -327 222 -253 140 -161 64
3781F4k9r7L39k54j69J79k53K25J14J71l51L29o4j84m2M4N8j71L28l35K08m8O4
3804A26J48o2MK0p6K2k55j2p4K55j25J60k93R5j20J5L15rj63m8l4K19j86J31J11
3829A64M9m1p4j02O8k1j26J35o2q7J93j91j06K45J2r4m7L0m7Q2L0j9K07l22J56
3854C2Jm3j68j7J68J1j49j46L38k91L22P5l97L40j1J76m55K38q4K61l81jK9J15
3878c7j27K18j61rK74l30M76l26K1p3K10k38L08l98K29O0l87N64l24J35k72L27
3900A40k00l6K05r5J86m39O01k93K56l72Rk6J41m0l4J42j72j04K9K21P9l84J18
3923f8j81K82k26L27p5J45o0l48L06J69n50L70k99L68k67K24r4R8o7q3l9j80M59
3946B11k88k69M11k6k3J23k37L69k54r4M9K87j54r7K38k56l6k24J23J03K4J54
$$ plain form
3781 64 35 -62 277 23 -146 33 -220 5 119 290 -61 268 204 20 -22 22 80 -91 237 -98 110 62 126
3804 126 274 212 216 236 160 182 -73 -85 -159 96 -29 131 -162 -67 -187 -172 143 134 -29 -77 -111 108 -78 53 164
3829 164 213 172 98 -4 64 43 -83 52 -10 -97 96 -95 -201 44 56 -38 -85 -55 -102 -20 10 -9 198 -124 32
3854 32 33 -10 -178 -195 -27 -16 -165 -311 27 -264 58 133 -264 76 65 241 -214 24 -60 201 -180 -181 -152 -37
3878 -37 -164 54 -107 -116 158 -172 304 -22 -1 -74 136 -102 206 -192 37 97 -290 274 -50 85 -187 140
3900 140 -60 -96 109 14 200 -239 362 69 325 -47 -38 -64 77 37 3 145 -27 -131 -102 119 198 -186 -68
3923 -68 -249 33 -193 134 59 204 144 -204 102 271 -279 91 -208 160 -107 117 23 121 54 -29 -68 -248 211
3946 211 -77 -346 65 39 16 139 -98 271 17 -77 -28 259 105 8 246 -10 -46 -270 -147 -44 -20 134
3968A34l32J61Lp0J22K9j42N2L48l95J22j20Q7j6M8q5J18J11q3k18J10j32R3J25
3992G0Qj70K66j77JJ52l27K0J3l3N72n16K31J17j37J41j77J64k38j4R9J8q1k56
4016b54L05k66N41l23M9K14k10l3p6P4K56j58l74K09k95L34J52J22l99J55J8k00
4038a59K13j30j19jK32M9K19k24K0l8n0jj86J99q8P1l9j31J21R3l51L12j5j90
4062a93J75J2oK32j37k4j49M2J08L0p2n17M87M10k80j79P4j34l9K50k88K66K19
4085B87k92K1J85j21p7k4LK2r3k06O08k76l6J4K00k54N5j21L05k19M7r1M27m46
4109h2L10m0k59J40l6M14l65l5J1j57O7k0J18l8n1R2j11R3j83j06L41M2j98L29
4133B76p4n7l31J68Oj03J17j0m4K60k38L4J61m52J96J22J58l15J03j72n3L93k48
$$ plain form
3968 134 -198 -37 -34 -104 18 47 -95 -43 305 -90 32 -88 -1 -17 31 -54 64 175 92 -126 -16 -148 -55 70
3992 70 78 -92 174 -3 -2 150 -177 -157 -144 -177 395 -121 110 227 90 231 54 218 -20 -34 65 83 2 -254
4016 -254 51 -215 326 3 52 266 56 23 -53 21 277 119 -255 -46 -341 -7 145 267 -132 23 41 -159
4038 -159 54 -76 -195 -196 36 85 304 80 100 62 12 11 -175 24 -64 7 -32 -163 -42 51 -300 12 -3 -193
4062 -193 -18 -6 -12 220 83 59 -90 -48 60 90 18 -499 -12 398 118 -61 13 -121 -160 90 -198 68 287
4085 287 -5 16 201 80 3 -21 -18 4 -89 -295 313 37 1 15 215 -39 16 -105 200 -19 28 -63 364 -82
4109 -82 228 188 -71 69 33 447 82 47 58 -99 -32 -52 66 28 -23 69 -42 51 -132 -238 103 145 -53 276
4133 276 202 145 -186 -18 -12 -115 2 -8 -52 208 -30 4 165 -287 -91 31 189 -126 -23 -195 -248 145 -103
4156a03KJ67J6J79l91k2O5K67m28M23k24K39j53M0M16m61j72k0K81k43L86l56
4178i2J8J96K44j31q9O2k39J33LP8k75L9J28j90J09k01M05k79K37M1j43n6J33
4201A31j83J79r4m6Q4j64J59q7N3m1Q5j26P6j18P5m6m8K7Q6J78k42k7K07k47n
4226a34M21k84o9k37L21K40n55L40J09l50J09K8j44L01l0j00LK33m0k00K23k47
4248f2L14O7j51n4j40l11N46k73K59l48J60J03%P4k96K5J42j34J16J42j26j20
4270f7L7K02p2k2k46J56j34q4K6J37J46N2j25k5j41J63N1j83L01k04M27m80j29
4293b14L10m6o1j9M46n90K26r6m2L39l0m51L62k77q8L04Q9kj96O4K37k68J89k04
4317a8m3JK5r0J09K8J93l32k7k7J25J09l7K47k19j1J07l20K18N6j32J84k4j43
$$ plain form
4156 -103 -101 66 82 261 -130 -152 -87 180 -248 175 -49 190 37 77 493 32 -140 -160 121 -122 264 -92
4178 -92 -74 122 366 235 146 208 -31 102 105 183 -92 -53 75 -115 -6 -207 198 -81 156 197 54 -2 131
4201 131 -52 127 33 -13 71 -93 66 -21 32 -9 76 -50 26 -92 -17 -63 -111 -84 2 180 -62 -89 118 -129 -134
4226 -134 287 3 -66 -303 18 258 -297 43 152 -198 -89 -61 -205 96 66 -34 -31 202 162 -38 185 -62
4248 -62 252 319 168 114 -26 -337 209 -64 195 -153 7 110 110 184 -112 -87 55 -79 37 179 53 -67
4270 -67 -30 172 100 78 -168 -12 -146 -230 -204 -67 79 131 6 -19 -160 3 54 -129 172 -32 395 -85 -214
4293 -214 96 50 -11 -30 416 -174 52 -44 -86 253 223 -228 134 -143 -231 73 162 160 -36 28 265 -3 186 -18
4317 -18 -61 -60 -35 -125 -16 12 205 -127 -154 -181 -56 53 16 263 44 33 140 -180 38 94 -38 146 122 -21
4341b1K99j90j0p7j37k8o1K20J45k1l2M6k34o3J95R7r3j17J60j16J33j68l9O4
4365d8K9L12l99k29L33K7r2R8k95K37j68K86j40R5J14l57N4j71K43J71M6l44L65
4388A67k84K33k5J52j7k64l4j13L74j91R7k60rK71J64k43j7o1N1P1r3qL9j67L14
4413A47J0l09J68l22J11l8m2K38K06J37j66k56N0J16j16P5q1O7J04J02J4l63K05
4436E7n0j06K03k19j2L8o1L25r1j0R4k01J7K01n7j36j7K47O0l52O2J48k6P0l89
4461b05l2L90n8p2O2R0l28J87l36J96L16j73l16J49O4j44J89J85p2j13p2J04K3
4484C4p9J08l3J10k66J00J8j8m1O1L27m96J58j63k8J99L5p6J95j33p2r0J26J20
4508I6r6p4l0j31L51J40J64j75k95j2Q7J04j56PK69j18l45l6O24m38K60k54JL7
$$ plain form
4341 -21 278 88 78 1 -136 -164 -225 -5 140 119 87 133 -101 -164 31 128 35 -82 78 -38 95 -73 -112 -48
4365 -48 -19 293 -106 -335 -2 25 -67 31 -264 -27 -195 91 -49 46 160 -197 -143 -314 -71 100 146 -198 167
4388 167 -117 116 91 243 226 -38 -72 -185 189 -2 95 -165 -174 97 261 18 1 -60 -9 62 -31 -39 0 -167 147
4413 147 157 -152 16 -306 -195 -233 -275 -37 169 306 140 -116 -66 50 -66 9 -72 -5 99 201 215 -148 57
4436 57 7 -99 104 -115 -127 -89 -150 175 84 74 168 -33 -16 185 128 -8 -25 222 282 -70 -8 140 114 184 -205
4461 -205 -237 153 95 23 85 175 -153 34 -302 -106 210 37 -279 -130 -66 -210 -21 164 92 -21 -93 11 34
4484 34 -45 63 30 140 -126 -26 -8 -26 -67 -6 321 -175 -17 -180 -208 -9 26 -50 145 12 -60 -150 -24 96
4508 96 0 -74 -104 -235 116 256 420 245 -50 -62 25 129 -27 -20 249 131 -214 -250 374 -64 196 -58 -57 -20
$$ [...]
8191B3
##END NTUPLES=NMR FID
##END=
