##TITLE=1H_Pr 3H-2
 CDCl3
 8 sc, 
 11.03.2022
##JCAMPDX= 6.0         $$ Bruker NMR JCAMP-DX V2.0
##DATA TYPE= NMR FID
##DATA CLASS= NTUPLES
##ORIGIN= UXNMR, Bruker Analytische Messtechnik GmbH
##OWNER= root
$$ XWIN-NMR		Version 3.5
$$ Fri Mar 11 13:46:37 2022 Russian Standard Time (UT+4h)  she@DPX200
##.OBSERVE FREQUENCY= 200.131346
##.OBSERVE NUCLEUS= ^1H
##.DELAY= (6, 6)
##.ACQUISITION MODE= SIMULTANEOUS
##.ACQUISITION SCHEME= undefined
##.AVERAGES= 8
##.DIGITISER RES= 18
##SPECTROMETER/DATA SYSTEM= spect
##.PULSE SEQUENCE= zg30
##.SOLVENT NAME= CDCl3
##.SHIFT REFERENCE= (INTERNAL, CDCl3, 0, 15.7039)
##AUDIT TRAIL= $$ (NUMBER, WHEN, WHO, WHERE, WHAT)
$$ ##TITLE= Audit trail, XWIN-NMR		Version 3.5
$$ ##JCAMPDX= 5.01
$$ ##ORIGIN= Bruker BioSpin GmbH
$$ ##OWNER= she
$$ F:/spectra/data/she/nmr/H-F/1/audita.txt
$$ ##AUDIT TRAIL=  $$ (NUMBER, WHEN, WHO, WHERE, WHAT)
(   1,<2022-03-11 13:45:32.92 +0400>,<she>,<DPX200>,
      <created by zg, POWCHK disabled, PULCHK disabled
       configuration hash MD5:
       00 E9 B6 7A A2 85 ED C7 34 08 36 98 17 FE 4E 26
       data hash MD5: 16K
       F2 48 8B CC 88 C3 44 15 BA 9C CD 74 87 A9 3A B4>)
$$ ##END=
$$ 
$$ hash MD5
$$ 95 DD 15 EC 8D 44 2A 7E 5C 1C 62 1E 28 BF 0E 17
##$RELAX= 
##$RELAX= 
##$RELAX= 
##$RELAX= 
##$RELAX= 
##$RELAX= 
$$ Bruker specific parameters
$$ --------------------------
##$DU= <F:/spectra>
##$EXPNO= 1
##$NAME= <H-F>
##$PROCNO= 1
##$TYPE= <nmr>
##$USER= <she>
##$AMP= (0..31)
100 100 100 100 100 100 100 100 100 100 100 100 100 100 100 100 100 100 
100 100 100 100 100 100 100 100 100 100 100 100 100 100 
##$AQSEQ= 0
##$AQ_mod= 1
##$AUNM= <au_zg>
##$AUTOPOS= <>
##$BF1= 200.13
##$BF2= 200.13
##$BF3= 200.13
##$BF4= 200.13
##$BF5= 200.13
##$BF6= 200.13
##$BF7= 200.13
##$BF8= 200.13
##$BYTORDA= 1
##$CFDGTYP= 0
##$CFRGTYP= 5
##$CHEMSTR= <none>
##$CNST= (0..31)
1 1 145 1 1 1 1 1 1 1 1 1 1 1 1 1 1 1 1 1 1 1 1 1 1 1 1 1 1 1 1 1 
##$CPDPRG= <>
##$CPDPRG1= <>
##$CPDPRG2= <>
##$CPDPRG3= <>
##$CPDPRG4= <mlev>
##$CPDPRG5= <mlev>
##$CPDPRG6= <mlev>
##$CPDPRG7= <mlev>
##$CPDPRG8= <mlev>
##$CPDPRGB= <>
##$CPDPRGT= <>
##$D= (0..31)
0 1.2 0 0 0 0 0 0 0 0.06 0 0.03 0 0 0 0 0.0002 0 0 0 0 0 0 0 0 0 0 0 0 
0 0 0 
##$DATE= 1646991932
##$DBL= (0..7)
120 120 120 120 120 120 120 120 
##$DBP= (0..7)
150 150 150 150 150 150 150 150 
##$DBP07= 0
##$DBPNAM0= <>
##$DBPNAM1= <>
##$DBPNAM2= <>
##$DBPNAM3= <>
##$DBPNAM4= <>
##$DBPNAM5= <>
##$DBPNAM6= <>
##$DBPNAM7= <>
##$DBPOAL= (0..7)
0.5 0.5 0.5 0.5 0.5 0.5 0.5 0.5 
##$DBPOFFS= (0..7)
0 0 0 0 0 0 0 0 
##$DE= 6
##$DECBNUC= <off>
##$DECIM= 32
##$DECNUC= <off>
##$DECSTAT= 4
##$DIGMOD= 1
##$DIGTYP= 9
##$DL= (0..7)
0 120 120 120 120 120 120 120 
##$DP= (0..7)
150 150 150 150 150 150 150 150 
##$DP07= 0
##$DPNAME0= <>
##$DPNAME1= <>
##$DPNAME2= <>
##$DPNAME3= <>
##$DPNAME4= <>
##$DPNAME5= <>
##$DPNAME6= <>
##$DPNAME7= <>
##$DPOAL= (0..7)
0.5 0.5 0.5 0.5 0.5 0.5 0.5 0.5 
##$DPOFFS= (0..7)
0 0 0 0 0 0 0 0 
##$DQDMODE= 0
##$DR= 18
##$DS= 0
##$DSLIST= <SSSSSSSSSSSSSSS>
$$ [...]
##$SUBNAM2= <"">
##$SUBNAM3= <"">
##$SUBNAM4= <"">
##$SUBNAM5= <"">
##$SUBNAM6= <"">
##$SUBNAM7= <"">
##$SUBNAM8= <"">
##$SUBNAM9= <"">
##$SW= 18.0517287032376
##$SWIBOX= (0..15)
0 0 2 0 0 0 0 0 0 0 0 0 0 0 0 0 
##$SW_h= 3612.71676300578
##$TD= 16384
##$TD0= 1
##$TE= 0
##$TE2= 300
##$TE3= 300
##$TEG= 300
##$TL= (0..7)
0 120 120 120 120 120 120 120 
##$TP= (0..7)
150 150 150 150 150 150 150 150 
##$TP07= 0
##$TPNAME0= <>
##$TPNAME1= <>
##$TPNAME2= <>
##$TPNAME3= <>
##$TPNAME4= <>
##$TPNAME5= <>
##$TPNAME6= <>
##$TPNAME7= <>
##$TPOAL= (0..7)
0.5 0.5 0.5 0.5 0.5 0.5 0.5 0.5 
##$TPOFFS= (0..7)
0 0 0 0 0 0 0 0 
##$TUNHIN= 0
##$TUNHOUT= 0
##$TUNXOUT= 0
##$USERA1= <user>
##$USERA2= <user>
##$USERA3= <user>
##$USERA4= <user>
##$USERA5= <user>
##$V9= 5
##$VALIST= <valist>
##$VCLIST= <CCCCCCCCCCCCCCC>
##$VD= 0
##$VDLIST= <DDDDDDDDDDDDDDD>
##$VPLIST= <PPPPPPPPPPPPPPP>
##$VTLIST= <TTTTTTTTTTTTTTT>
##$WBST= 1024
##$WBSW= 4
##$XGAIN= (0..3)
0 0 0 0 
##$XL= 0
##$YL= 0
##$YMAX_a= 289607
##$YMIN_a= -371663
##$ZGOPTNS= <>
##$ZL1= 120
##$ZL2= 120
##$ZL3= 120
##$ZL4= 120
##$ABSF1= 10
##$ABSF2= 0
##$ABSG= 5
##$ABSL= 3
##$ALPHA= 0
##$AQORDER= 0
##$ASSFAC= 0
##$ASSFACI= 0
##$ASSFACX= 0
##$ASSWID= 0
##$AUNMP= <proc_1d>
##$AZFE= 0.1
##$AZFW= 0.1
##$BCFW= 1
##$BC_mod= 2
##$BYTORDP= 1
##$COROFFS= 0
##$CY= 11.3945322036743
##$DATMOD= 1
##$DC= 2
##$DFILT= <>
##$DTYPP= 0
##$F1P= 2.36226072786647
##$F2P= -0.459571619588291
##$FCOR= 0.5
##$FTSIZE= 0
##$FT_mod= 4
##$GAMMA= 1
##$GB= 0.15
##$INTBC= 1
##$INTSCL= 1
##$ISEN= 128
##$LB= 0.24
##$LEV0= 0
##$LPBIN= 0
##$MAXI= 10000
##$MC2= 0
##$MEAN= 0
##$ME_mod= 0
##$MI= 1.114404
##$NCOEF= 0
##$NC_proc= 0
##$NLEV= 6
##$NOISF1= 3.799351
##$NOISF2= 2.8
##$NSP= 1
##$NTH_PI= 0
##$NZP= 0
##$OFFSET= 15.70392
##$PC= 1
##$PHC0= -16584.33
##$PHC1= 6.200781
##$PH_mod= 1
##$PKNL= yes
##$PPARMOD= 0
##$PSCAL= 0
##$PSIGN= 0
##$REVERSE= no
##$SF= 200.130013532006
##$SI= 16384
##$SIGF1= 3
##$SIGF2= 2
##$SINO= 400
##$SIOLD= 16384
##$SREGLST= <1H.CDCl3>
##$SSB= 0
##$STSI= 0
##$STSR= 0
##$SW_p= 3612.71676300578
##$SYMM= 0
##$S_DEV= 0
##$TDeff= 0
##$TDoff= 0
##$TI= <>
##$TILT= no
##$TM1= 0
##$TM2= 0
##$TOPLEV= 0
##$USERP1= <user>
##$USERP2= <user>
##$USERP3= <user>
##$USERP4= <user>
##$USERP5= <user>
##$WDW= 1
##$XDIM= 8192
##$YMAX_p= 0
##$YMIN_p= 0
$$ End of Bruker specific parameters
$$ ---------------------------------
##NTUPLES= NMR FID
##VAR_NAME=  TIME,          FID/REAL,        FID/IMAG
##SYMBOL=    X,             R,               I
##VAR_TYPE=  INDEPENDENT,   DEPENDENT,       DEPENDENT
##VAR_FORM=  AFFN,          ASDF,            ASDF
##VAR_DIM=   8192,          8192,            8192
##UNITS=     SECONDS,       ARBITRARY UNITS, ARBITRARY UNITS
##FACTOR=    0.0002768,     1,               1
##FIRST=     0,             0,               0
##LAST=      2.2672688,     0,               0
##MIN=       0,             -371663,         0
##MAX=       2.2672688,     289607,          0
$$ Real data points
##PAGE= N=1
##DATA TABLE= (X++(R..R)), XYDATA
0 0 0 0 0 0 0 0 0 0 0 0 -8 8 -8 8 -10 16 -16 24 -26 32 -40 48 -56 65 -80 94 -106 126 -144 166 -190 217 -246
33 -246 279 -313 352 -399 447 -498 554 -617 687 -762 843 -935 1032 -1138 1256 -1384 1524
50 1524 -1680 1850 -2039 2249 -2486 2751 -3054 3400 -3804 4279 -4848 5540 -6414 7550 -9093
65 -9093 11321 -14839 21237 -36606 155283 -4059 -355530 -4346 230902 44377 -157233
76 -157233 6870 107640 8831 -72996 -27812 -22759 23816 102782 38570 -151740 -116324 105401
88 105401 132371 -64904 -99265 37606 54387 -49442 -38578 36264 30992 5816 19564 -31131
100 -31131 -79974 22937 128621 22364 -108591 -31995 79003 15813 -54413 11368 53077
111 53077 -11355 -37929 -6493 -11014 -6041 52838 34346 -74683 -68408 55767 52965 -55596
123 -55596 -23576 76610 2761 -107665 -6177 115855 10245 -94512 18618 91316 -45730
134 -45730 -99604 62512 121266 -38605 -104677 20192 67884 -18220 -32175 30854 15588
145 15588 -36123 -13554 13104 -14274 -1618 44204 223 -71906 -22232 64512 23620 -49820
157 -49820 -6609 45182 -11485 -48574 18969 51575 -7342 -27110 15756 8866 -27253 5063
169 5063 43863 2877 -35008 -2737 17431 -12061 -10232 25640 9915 -31236 -15654 14102
181 14102 -3431 -11269 20170 12239 -35720 -21116 33091 13935 -32242 5514 46747 -13198
193 -13198 -60608 12392 71665 2824 -56543 1039 45868 -5150 -36539 10580 35442 -2284
205 -2284 -25376 -10408 -1082 6717 20159 265 -34553 -15318 28935 10837 -33061 -8232 37268
218 37268 6305 -41372 -11738 34473 14662 -16728 -952 10276 -9744 -5107 21779 9867
230 9867 -17486 -1784 19563 -3564 -23571 5510 26342 -1272 -22671 -7146 4831 -471
242 -471 2487 4986 -10387 -13441 8107 8509 -16776 -8044 25370 13035 -28401 -19059 25527 22392
256 22392 -13359 -9371 13759 3844 -12072 2755 15317 1338 -7319 1985 -516 -10101 2077
269 2077 14403 -546 -16146 -5812 5737 -2681 -5132 6545 1927 -12635 -4702 9476 527
282 527 -8735 7289 14729 -8733 -16600 10285 20679 -3152 -12108 6268 11165 -5643 -7393 6869
296 6869 7604 -2271 -3611 -3376 -5266 408 7248 -638 -11837 -3528 6912 -3282 -11209 2979 11701
311 11701 -3061 -13453 -328 9565 1065 -1397 6273 2168 -6327 75 9759 4009 -3404 2347
325 2347 4519 -5081 -5336 5928 6994 -2979 -6589 -1995 -1421 -2469 1957 2363 -5188 -6035 807 980
341 980 -4095 -536 6841 890 -8397 -1451 8226 3806 -2697 1523 5078 -162 -2690 3204 4747
356 4747 12 -16 637 -1786 -2598 1070 2210 -2416 -3916 267 -447 -5032 -3118 2140 2017 -2824 -3867
373 -3867 -676 -6 953 4152 1900 -3482 -1414 4944 4181 -1500 354 5989 2978 -4112 -3725 3376
389 3376 6640 2082 -5166 -6813 -310 5654 1407 -7290 -5552 3124 3290 -6059 -7788 2599 8294
404 8294 -903 -9425 -3226 6572 6844 -210 -3996 -684 4374 5488 534 -3528 618 6676 3688
419 3688 -4777 -5102 3303 6489 -497 -6782 -3904 2285 2160 -3531 -4677 -1004 1057 5 -2232 -3132
435 -3132 -1380 2095 3840 130 -4266 -2250 4870 6598 886 -3804 23 5403 3582 -2042 -1728
450 -1728 2406 3467 891 -2855 -4894 -1525 5554 4824 -7458 -12908 857 12517 1405 -15598
464 -15598 -8331 12153 10722 -10058 -12964 7195 15722 -779 -12821 -2211 11107 8755 -2126
477 -2126 -6504 -1512 7049 8275 -1652 -10255 -2166 11472 6265 -12002 -12525 7074 13427 -5154
491 -5154 -16895 -1837 12812 2599 -12195 -6489 7449 6700 -3894 -5593 642 4675 3689 852
505 852 -2026 -1881 3123 6658 1423 -5664 -1032 7851 3682 -8056 -4609 8467 5296 -9367 -8248
520 -8248 5969 5121 -8439 -6405 6910 3386 -10896 -5861 10765 6491 -11260 -8166 11088 9581
534 9581 -8230 -7834 8321 9737 -3664 -5608 3189 4837 1114 1040 -1048 -4961 212 8798 1601
549 1601 -13211 -6982 12153 8734 -13174 -14672 7518 14416 -5402 -15841 -133 12528 3904
562 3904 -8924 -5739 5000 7779 1147 -4532 -3209 3869 8783 3477 -6524 -6539 5792 11353 -1224
577 -1224 -12991 -2489 12454 4532 -13233 -9351 9779 8845 -10260 -11881 5050 9266 -4858
590 -4858 -8703 3173 5352 -4205 -2620 6397 3443 -5765 -1386 8345 3469 -5619 -503 7083 1837
605 1837 -4058 69 3283 -926 -2097 2653 -316 -6399 -1259 6583 494 -10225 -4611 8270 4771
620 4771 -8586 -7577 4803 7789 -1600 -6209 -1108 5300 4698 -345 -3640 -154 5798 4816 -2646
635 -2646 -5490 1275 7929 3354 -6517 -7118 3084 8897 -576 -11277 -5188 8025 5770 -7920
649 -7920 -9816 3981 9176 -2829 -9848 -254 8092 2722 -4902 -2381 2701 2996 2062 689 -1714
664 -1714 -485 4185 3232 -2504 -2954 3228 3718 -2326 -3546 781 1809 -1306 -2569 -1190 -761 -1059
680 -1059 201 -208 -2886 -2068 1961 2243 -1738 -2338 1869 2869 -331 -253 1831 1965 282 424 1555
697 1555 970 285 403 -46 -417 290 65 -844 -1114 -732 -1395 -1484 -175 322 -1837 -2655 -11 1235 -644
716 -644 -1828 532 2062 -447 -1208 1920 2626 410 -933 1497 2349 939 150 724 724 355 -101 -777
734 -777 -326 706 -349 -2626 -2212 449 753 -2590 -2961 166 1551 -776 -2188 302 1735 -109
750 -109 -533 1131 1545 837 329 972 995 1137 1267 885 23 -23 424 438 120 -185 -1067 -1157 -471 -40 -1004
771 -1004 -2078 -1171 -108 -678 -1629 -810 903 12 -1095 -173 1005 947 261 523 748 854 1164 1715 703
790 703 -403 543 1192 408 -518 -354 281 -547 -946 -636 -946 -599 -189 -1476 -1652 -746 499 202 -1881
809 -1881 -1236 1417 1454 -636 -843 1303 2027 -277 -490 1397 2053 841 -134 170 787 1239 331 -1127
827 -1127 -1096 727 825 -1660 -2113 125 297 -1298 -2289 -470 750 -732 -1372 -276 698 282 307 472
845 472 -266 474 1974 1514 -474 -257 1683 1689 35 -427 1175 834 -300 -740 -515 -69 60 -422 -1641
864 -1641 -1599 -413 711 -952 -2267 -835 759 -147 -697 472 569 -133 265 1645 486 -280 1350
881 1350 2116 2 -1064 1096 2298 -87 -1390 -84 560 0 -547 -720 -1446 -1043 530 134 -2337
898 -2337 -2163 1059 741 -1707 -1966 1266 2012 -743 -1371 669 1607 1365 1034 -287 -553 1445 2908
915 2908 103 -2394 514 2632 -209 -1959 -134 690 -907 -1624 255 -867 -2006 -238 1264 -1543
931 -1543 -3445 524 3079 -620 -3234 595 2579 148 -754 1290 857 -603 1332 3013 -376 -2481
947 -2481 1764 3931 -911 -3902 480 3664 -226 -3930 -1760 1161 767 -1114 -1905 -2032 -149 1815
963 1815 129 -3328 -1762 2517 2479 -1513 -1974 1522 2886 1288 -1021 -1082 1272 4017 1742 -3359
979 -3359 -2379 4010 3837 -3144 -4325 1854 3302 -2045 -3355 781 687 -1890 -835 1133 -1382 -2681
995 -2681 1901 2666 -3112 -3564 4000 4364 -2943 -3431 3803 4370 -2507 -1560 3859 1541 -2803 364 3568
1012 3568 -950 -4196 910 3388 -2102 -3962 912 2492 -1835 -3683 264 1455 -607 -1130 -29
1027 -29 -909 -453 1492 1280 -1576 -1208 2287 2366 -225 -677 418 1724 1498 -124 -1958 -122 3250
1044 3250 1795 -4074 -2681 3743 2801 -4309 -3764 2325 2480 -3323 -2422 1622 65 -2264 631 2103
1060 2103 -1823 -1938 3649 2609 -4153 -1753 5747 3542 -4282 -1705 5500 2592 -4164 -976 4074
1075 4074 -12 -3505 586 2539 -2073 -2891 1427 1074 -3327 -1715 2695 178 -3462 -546 2731
1090 2731 -32 -2405 769 2137 -795 -931 1932 1374 -689 314 1614 356 -298 1363 359 -1574
1106 -1574 564 1920 -1435 -2477 892 1578 -2344 -2619 1767 1416 -2634 -2327 1861 953 -2455 -314
1122 -314 2028 -422 -1664 2202 2628 -1801 -1128 3467 1936 -2791 -554 4279 823 -3395 342 3270
1138 3270 -509 -2908 506 1548 -2276 -2123 1790 429 -2966 -907 1985 -263 -3187 496 2528
1153 2528 -1432 -2345 2175 2557 -1344 -889 2469 1218 -1352 819 2506 -354 -1732 1472 1451 -1436
1169 -1436 -1006 2009 44 -2954 -248 2010 -1128 -2953 2 1550 -1359 -1709 1365 948 -1974 -296
1185 -296 2084 192 -1630 962 2107 -574 -1331 2309 2038 -1412 -671 2446 911 -1636 292 2146
1201 2146 -1092 -2564 1086 1424 -2270 -2102 1193 186 -2822 -1004 2048 -342 -2591 58 1834
1216 1834 -527 -1495 1471 1675 -1455 -377 2898 988 -1467 573 2358 -428 -1621 1148 1824 -1532
1232 -1532 -1053 1096 297 -2101 -649 1373 -755 -2430 421 1663 -1410 -1996 1037 1267 -1397 -532
1248 -532 1720 554 -1178 481 1984 -248 -576 1516 1518 -957 -120 1769 839 -1613 178 1624 -788
1265 -788 -1769 771 588 -1801 -1760 811 301 -2114 -1022 1367 -3 -1715 -138 1562 -467 -1092 1261
1282 1261 1236 -465 116 1925 607 -1193 651 1992 -361 -1276 702 1076 -1021 -1087 801 355 -1725
1299 -1725 -1066 978 -342 -1731 -26 902 -912 -1013 813 736 -1048 -795 1362 1010 -958 188 1638
1316 1638 288 -690 946 1528 -492 -553 914 266 -794 -17 750 -326 -1509 -192 357 -667 -1392
1333 -1392 132 170 -1138 -576 773 484 -910 -104 886 -155 -206 946 861 -500 -49 1474 693 -695
1351 -695 573 769 -154 -639 790 826 -869 -1134 418 436 -1133 -916 486 -286 -1387 -582 744 -131
1369 -131 -1213 106 788 -131 -336 634 811 -84 -173 1148 494 -93 455 777 259 -262 296 513 -358
1388 -358 -304 50 -197 -132 -57 -185 -1022 -617 -401 -207 -585 -304 354 -59 -512 291 475 -14 -271 703 659
1409 659 -259 294 808 463 -387 335 834 334 -872 -161 625 -89 -949 -390 348 -236 -685 -529 232 -393
1429 -393 -647 -197 107 -391 -141 429 681 -139 -196 772 814 671 -119 295 569 417 -169 294 353 169 -187
1450 -187 16 115 -409 -347 -300 -365 -747 -758 29 178 -758 -936 37 548 -30 -626 340 894 42 -214 603 764
1472 764 226 -205 464 717 204 33 514 276 -483 -178 469 100 -944 -858 538 370 -1082 -571 373
1491 373 202 -1265 -689 832 436 -755 18 663 640 -628 192 1235 54 -606 536 1155 100 -530
1509 -530 99 704 -188 -824 76 299 -580 -891 -114 -92 -937 -691 290 -135 -784 -366 192 303 -441 -413 867
1530 867 614 -5 -4 473 919 361 -111 547 777 217 -77 280 194 -388 -402 168 35 -777 -598 460 -74
1551 -74 -1134 -628 646 177 -1034 -551 638 520 -782 -90 913 282 -493 439 990 257 44 742
1569 742 707 -172 -549 503 485 -525 -641 167 63 -853 -496 -9 -156 -1109 -509 161 -77 -712 -387 153
1589 153 450 -294 46 175 275 100 68 676 310 19 59 373 251 43 20 229 -24 -308 -180 26 -252
1610 -252 -678 -608 -53 -351 -699 -480 210 -307 -646 -219 600 259 -342 255 775 287 -195 300 609 170
1630 170 -124 379 558 -159 -48 111 242 -392 -370 311 -77 -626 -397 -227 -237 -574 -68 98 -318 -305 3
1651 3 421 135 -265 257 525 271 340 399 455 157 406 535 83 234 359 241 -209 -282 206 -395 -72 -173
1673 -173 -361 -572 -307 -280 -352 -825 -236 -9 -245 -436 147 377 -90 -292 644 569 11 331 743 314 -219
1694 -219 134 328 76 -389 133 528 -207 -886 40 71 -496 -544 -71 34 -587 -449 91 111 -99 -90 183 -91
1716 -91 123 104 719 295 193 375 229 532 392 126 251 39 360 87 -236 -90 -68 -183 -307 -156 -159 -511
1738 -511 -279 -351 -237 -356 57 306 -18 -315 258 463 -80 -230 311 480 43 202 452 261 -45 -146
1758 -146 494 34 -69 99 -196 -137 -385 -360 27 -444 -612 -239 -84 -381 -191 -147 -20 -5 -140 307 116
1779 116 177 385 339 218 466 213 253 204 259 375 174 186 156 -39 -291 119 -15 -252 -62 -173 -68 -385
1801 -385 -218 -160 106 -273 -188 16 115 131 -79 200 401 307 263 244 451 98 56 417 245 -12 -89 370 138
1824 138 -204 -162 -34 77 -379 -534 110 42 -232 -197 -285 -118 -247 -124 59 185 -124 -85 313 256 -223 379
1846 379 365 379 335 -137 358 56 -39 -216 14 -124 -394 -221 215 -340 -438 -342 -52 -2 -422 -321 34 -30 -408
1869 -408 12 478 -4 -459 300 546 286 145 196 609 229 50 411 573 9 -286 97 447 -158 -348
1889 -348 -188 -57 -348 -476 -198 23 -392 -384 174 40 -249 -302 194 159 -294 220 468 406 -101 181 651 501
1911 501 206 231 334 89 102 -118 76 40 -450 -468 82 63 -373 -252 -244 -82 -259 -219 138 44 -490 22 363
1934 363 223 -37 -37 568 313 -282 314 610 355 -38 279 476 123 -209 -17 57 -185 -277 87 -42 -266
1955 -266 -646 -237 168 -246 -474 107 203 -86 -313 258 543 -149 2 305 300 242 23 319 659 21 -236
1976 -236 232 102 4 -447 -248 122 -183 -459 -108 14 -575 -482 -361 174 -358 -391 -55 118 50 -340 185
1997 185 379 86 -49 614 602 200 -45 806 110 -232 53 475 557 -499 -374 143 -74 -373 -117 219
2017 219 -171 -622 -107 330 -224 -545 79 220 -85 -279 271 288 41 211 303 151 -6 40 395 202 398
2038 398 127 472 122 -207 19 192 -155 -113 -392 -339 -36 123 -535 -695 2 -57 -225 -72 196 33 -44
2059 -44 186 313 76 1 466 393 214 -135 465 495 -85 -231 268 91 -378 -290 450 -54 -591 -367 106 -291
2081 -291 -395 -349 -49 -137 -423 -25 86 -351 -147 285 506 -6 -76 390 184 -62 303 193 294 245 299 63
2103 63 -170 65 21 -238 -184 28 -180 -455 8 196 -192 -380 -53 177 -75 -480 445 374 -195 150 608
2124 608 190 -439 110 682 45 -303 232 580 -121 -94 199 251 -323 -417 147 157 -515 -401 302 -150 -819
2145 -819 -268 315 -221 -417 55 97 17 33 486 474 -104 343 399 86 -1 275 446 -200 8 244 136 -140
2167 -140 -59 174 -500 -295 269 106 -667 -650 172 -81 -541 5 380 -210 -393 501 501 -190 -288 390 289 -282
2189 -282 217 842 194 -439 248 533 -65 -476 102 396 -478 -515 72 211 -618 -306 126 -21 -657 -18
2209 -18 236 -288 -221 65 206 -157 8 135 226 -84 366 363 17 15 516 291 -140 -93 462 -122 -210 -102 189
2232 189 -333 -493 22 300 -670 -402 394 -342 -457 -60 387 184 -642 206 417 -169 -51 279 617 -253
2252 -253 140 508 205 -205 51 470 -495 -445 295 280 -253 -595 188 8 -466 -68 25 -256 -337 -43 336
2273 336 -50 -413 388 201 -243 263 616 -117 29 277 594 -4 -50 598 206 -212 45 112 -171 -600 -244
2294 -244 181 -197 -580 33 224 -508 -452 102 1 -283 -125 464 -266 -222 78 573 -11 -458 101 440 -119
2315 -119 -109 581 14 -228 -297 472 -101 -391 -69 147 -394 -102 -70 -69 -236 -268 -205 -293 -276 119 73 -418 -301
2338 -301 265 285 -78 76 375 -65 -125 180 441 40 123 366 264 -224 -216 543 -297 -646 10 292 -374 -705
2360 -705 -61 255 -225 -404 291 86 -284 -340 289 133 -171 22 305 291 -14 182 304 253 -164 260 151
2381 151 -163 -187 155 -80 -12 -109 -114 -165 -361 -200 -312 -148 -78 8 -297 -263 95 57 -292 -33 358 277 -298 138
2405 138 451 126 -222 296 244 211 -82 237 -25 -356 -81 233 148 -129 3 350 -39 -530 -6 315 -167
2426 -167 -404 268 384 -83 -118 237 276 -197 102 285 82 41 273 458 50 202 30 283 -398 98 -107
2447 -107 -151 -11 -156 -101 -433 -336 -126 -312 -412 -143 -233 -427 -104 173 -103 -144 286 187 164 -48 10 191 -93
2470 -93 149 141 528 -182 -36 441 82 -364 48 208 82 -589 -87 233 -296 -250 -189 97 -524 -102 -29 135
2492 135 -120 -220 126 43 -19 30 415 213 28 55 217 255 -42 -98 91 112 50 305 131 -17 -206 -297 -79
2515 -79 -113 -189 121 16 132 207 -158 7 -79 1 46 244 351 101 107 154 246 -19 67 159 -133 24 202 76
2539 76 10 -37 56 -83 -302 -177 65 60 -182 -411 101 -267 -301 65 140 421 -150 -95 2 267 206 260 124 13
2563 13 86 328 173 75 165 -72 10 97 -53 -226 17 -194 -184 50 -175 -163 -227 -234 14 -130 22 -14 -100 -29 -20
2588 -20 20 162 99 153 -59 -63 -91 137 135 -57 169 154 -57 56 -6 140 83 55 141 27 -190 -134 -234 -235 -233 -225 -258
2615 -258 -42 -117 -101 41 -1 -26 -57 91 362 271 -163 33 16 90 156 255 83 65 -34 135 -97 -106 -275 -349 -2
2640 -2 -74 -1 -132 -66 -180 -8 -100 91 29 52 -23 65 45 209 189 102 -63 -179 3 240 87 -78 -6 -149 56
2665 56 -78 476 -238 -267 -350 4 -152 -433 332 208 -201 -404 262 37 -89 -192 183 262 -32 11 403 173
2687 173 59 25 224 -85 10 203 227 -3 -27 -109 90 145 -181 -242 -112 -107 109 148 -129 -82 -156 7 281 167
2711 167 -242 4 -26 437 49 -151 51 352 174 78 115 178 -35 -150 153 -6 -27 -221 204 -119 -184 -174
2733 -174 267 -86 -326 -168 115 -194 -387 73 74 -2 -284 -30 211 -143 -168 23 35 117 -185 464 50 -60
2755 -60 17 452 -87 -116 -265 327 -154 -201 -136 241 -129 66 -51 -117 -78 -197 -316 104 25 -61 -162 -161 -44 84
2779 84 40 17 -2 99 -249 45 336 117 6 114 19 -356 -310 -197 -25 -116 -121 -10 272 -1 -103 63 -201
2802 -201 -354 -55 206 -111 -353 336 17 77 -157 348 352 50 95 21 126 192 94 108 168 -229 -145 7 -191
2825 -191 -131 -125 -92 39 -214 -251 111 -230 -171 -75 255 -72 67 34 248 289 77 57 108 100 231 -262 32 64 -38
2850 -38 -21 -127 323 -33 -107 107 -147 -204 -244 112 48 -131 -26 229 -99 -210 -14 186 87 -242 -27 415
2872 415 228 -151 73 209 151 239 128 63 60 -57 67 83 -214 -205 149 -115 -57 -123 -126 -17 -147 -60 115 -166
2896 -166 94 -91 -100 -34 19 47 -88 23 -78 12 110 523 279 -164 105 4 -211 -235 376 181 -284 -115 196
2919 196 -10 -225 -372 80 14 -69 -77 314 327 -222 32 153 243 -12 -120 153 57 -175 267 529 104 -135
2941 -135 -76 237 -62 -29 83 -38 -45 -211 81 -6 -147 -11 -79 -250 -163 -135 -44 -75 -154 -115 84 184 42 -109
2965 -109 -2 221 -41 -162 209 7 -83 10 92 286 -176 -30 19 -81 216 -363 22 -109 -224 -138 83 -113
2987 -113 -188 -134 -100 129 -225 114 140 183 -141 -201 314 179 -14 -118 263 89 -21 266 214 -15 -247 -44
3009 -44 -23 187 -124 -64 15 -146 -125 50 -188 -55 -155 141 155 10 181 8 43 -38 208 334 46 99 261
3032 261 120 185 -37 -165 -27 -113 16 -108 -115 -304 -109 106 5 -124 -122 114 5 -200 -190 71 38 140 -92
3055 -92 -6 -18 4 61 102 249 133 296 60 70 185 -79 209 71 -110 -67 -197 81 92 -190 -99 -177 -262 101
3079 101 -206 -191 -193 -408 41 -50 59 12 -439 69 190 12 61 444 173 187 20 51 207 171 -31 -178 -86
3102 -86 40 68 -131 -84 -122 67 -283 13 33 28 -115 100 89 44 -208 161 97 6 -145 -40 139 205 9 151
3126 151 56 195 118 127 -13 -11 -83 -151 -265 -395 -88 -21 -150 -136 -75 -204 -34 -64 51 -244 71 64 26 -145 196
3151 196 73 19 -133 141 173 -93 132 51 22 -63 -12 132 -165 -283 104 -103 -18 -223 53 2 -98 -234 95
3174 95 -294 -214 45 139 141 132 178 311 87 -23 218 -20 -100 176 -11 138 -35 338 190 44 -238 -176 75
3197 75 -101 -238 -133 -64 -51 -116 -34 121 -162 -34 90 37 14 -36 -209 70 14 221 -158 -86 24 146 -170
3220 -170 127 243 -3 -121 -89 85 21 24 207 40 -139 -414 29 45 51 -118 88 42 -75 -94 92 204 -199
3243 -199 211 -72 -157 -86 -87 -47 90 -35 -59 186 -93 -7 289 -90 -140 -10 235 -71 -26 200 -216 -211 6 30
3267 30 -247 -51 -3 73 -202 97 4 -78 -71 102 105 -14 40 158 176 -9 -83 0 -50 -69 -49 248 -55 -398 203
3292 203 -9 -111 -16 -3 215 -98 14 85 87 -74 28 152 5 6 -22 166 122 -87 162 296 -86 59 39
3315 39 0 -83 116 231 -56 -156 122 72 -26 -208 41 -126 -125 -35 -29 107 -276 72 -142 83 -155 -122 61 -76
3339 -76 114 124 73 140 -56 -47 164 -139 196 -10 30 33 148 93 -86 289 96 -365 -125 182 -14 -421 -17
3362 -17 250 -51 -277 -326 289 106 19 184 182 -62 59 272 410 -87 -56 126 105 -217 -51 197 17 -210
3384 -210 -44 -276 -7 -15 -143 61 -5 72 -176 221 21 -48 148 -50 -30 -84 -109 144 78 10 114 142 195 12
3408 12 47 -43 183 152 11 -70 281 46 -330 -109 84 -164 -92 72 127 -315 -389 385 -35 -367 227 206 335
3431 335 -119 -90 230 5 -2 92 278 -120 -49 -108 51 -57 -42 145 165 -30 -113 -120 -306 4 75 -114 -94 -65 -341
3456 -341 45 -112 20 -52 -17 185 -76 66 10 85 196 193 0 82 142 25 62 -241 196 -68 -30 41 108 11
3480 11 26 55 58 -157 -81 316 -91 1 186 124 -45 -95 -31 268 -153 -142 138 106 -91 13 191 -24 25 34 218
3505 218 -26 -89 22 157 -50 12 -252 12 -83 -3 -74 -50 14 -393 -67 -76 -123 110 255 -32 -193 200 34
3528 34 180 -10 -88 -112 -13 106 1 51 24 31 -172 65 -240 1 -190 -40 -175 -63 -155 24 -10 -54 38 121
3552 121 -169 -185 -92 -17 -24 -202 150 54 58 118 23 50 66 258 83 81 82 -111 244 65 -26 -52 52 230 -251 -74
3578 -74 67 -24 68 58 -55 -25 -296 -105 -25 -97 43 12 -39 55 -61 200 257 -179 33 -94 159 27 230 -36
3602 -36 165 -92 -162 142 -72 35 -170 -2 -117 -72 -86 -59 123 0 -22 -141 109 11 4 151 20 -147 138
3625 138 123 -49 37 -153 -48 -119 -55 -195 63 37 64 63 -56 -199 -105 -147 -114 128 126 -18 -74 201 -57 -142 56
3650 56 10 -23 205 208 102 120 -126 104 27 -148 -227 -105 125 -155 13 95 58 -114 74 54 -38 -248 -252 -260 -313 117
3676 117 33 122 -291 55 -31 -103 -96 -82 185 49 64 23 33 -173 192 28 125 327 -117 19 3 -7 -112 203
3700 203 -19 -118 42 -234 302 129 -188 -110 283 83 103 137 -131 189 -101 -125 -46 170 -142 204 104 12
3722 12 105 155 31 -39 -221 79 189 -169 225 -255 86 -49 -51 -16 202 -227 -150 -25 -4 135 -68 157 -39
3745 -39 119 233 203 -18 104 -88 200 177 -119 45 137 37 38 -134 27 -218 43 70 -145 -184 13 -312 -287
3768 -287 -16 152 -149 -106 -25 3 -29 -78 -219 -205 180 196 176 112 56 -1 -39 -25 -269 63 -66 -60 -112 68 -30 -75
3794 -75 113 2 -238 49 100 -126 35 133 -5 -78 -109 -27 56 67 -116 169 155 -357 81 65 126 19 20 -116
3818 -116 29 -321 1 -17 64 5 48 16 -7 -10 152 -174 -264 103 -59 -56 104 238 -155 -78 76 237 -38 -72
3842 -72 -120 46 -53 39 233 16 96 133 181 47 -164 49 -96 -231 -39 -40 -233 -42 -186 13 -38 -59 -204 127
3866 127 29 -17 -95 -5 -114 -44 89 114 -103 182 -8 91 141 -99 222 125 158 230 -107 19 -110 -65 5 -117
3890 -117 119 -82 -69 5 32 -21 -199 -102 -5 13 88 135 -82 -66 40 57 33 -4 39 -125 296 258 114 -264 -44
3915 -44 -59 103 133 175 -22 7 98 -55 -72 -109 -85 -85 164 50 -76 -36 120 283 309 173 180 -31 -69 -72 -57 -85 202
3942 202 -36 65 108 -59 -190 -206 71 113 -67 -55 21 235 8 -42 -184 115 45 -203 172 -59 70 -155
3964 -155 167 133 122 -138 370 167 -10 -104 -3 -59 -343 -180 -153 70 -89 -292 -56 -176 45 -71 305 51
3986 51 -40 -28 226 -145 -49 179 126 -72 140 -82 -142 -135 35 66 8 -116 7 -30 -85 -1 -223 115 -220 123
4010 123 -290 -141 -45 53 232 -85 79 83 37 -24 17 182 218 18 58 163 -28 -26 117 -192 -60 -72 -74 -237 46
4035 46 -33 102 -51 -54 56 -88 -293 20 120 0 33 -226 152 -123 102 -228 36 -182 39 16 -126 55
4057 55 -101 24 -101 199 -48 59 301 100 177 226 54 139 94 -67 -104 -83 -38 -24 -132 10 176 -289 -181
4080 -181 -120 100 26 -246 -74 14 -30 71 -49 66 -105 52 9 24 106 267 151 12 -71 -30 3 139 72 -96
4104 -96 157 104 174 -23 -12 -106 -87 -225 -65 -81 -206 -56 -21 -100 44 60 -29 -171 -27 90 249 17 -123 -72
4128 -72 20 137 26 -22 -34 6 118 75 -232 -243 255 -90 93 68 118 173 -151 -38 43 160 160 -29 193 113 142
4153 142 -41 14 91 51 288 -27 144 -67 -8 263 26 -71 -130 -98 165 53 -196 -124 154 75 105 105 134 -315
4177 -315 -83 -147 155 59 -159 -32 141 76 167 200 115 -3 -191 -205 -93 27 259 -98 -285 51 -125 63
4199 63 71 -109 -62 137 51 152 -94 114 195 47 -171 -82 -189 -79 -40 145 264 -13 -80 26 47 304 231 160
4223 160 -92 -89 45 33 -5 -8 -32 -3 90 -182 -94 77 126 -22 150 -133 -149 69 87 76 -106 68 -72 -36 45
4248 45 79 304 -94 -61 76 71 103 -89 98 99 -84 -97 -113 -157 33 107 -179 51 -104 -162 174 135 -8 -51 -4
4273 -4 28 -158 -5 86 53 -105 95 93 157 26 -182 83 113 117 79 -149 -253 12 -88 -101 -87 68 180 -70 -83
4298 -83 -262 26 -189 -174 -48 -109 38 -26 -219 96 15 31 161 245 5 -76 295 51 177 -45 -38 236 117
4321 117 -59 22 110 -68 -213 56 56 -10 -121 -118 -222 15 86 -160 -137 129 -68 40 -251 223 210 25 -97
4344 -97 105 98 87 41 -221 264 114 -33 -223 -151 -14 150 13 172 67 85 124 -51 -85 110 112 48 -20 76 184
4369 184 147 -31 43 249 -63 -109 175 -13 63 188 289 43 114 31 79 89 168 -230 -58 -19 -353 -265 -289 -218
4393 -218 -167 -147 -12 -154 -60 -45 -181 -36 -169 -20 -26 182 113 -66 -178 -198 161 80 -70 207 126 -121 -68 -167
4417 -167 -16 -225 154 5 -131 -31 55 -42 0 -32 -110 457 79 18 210 -80 -241 -143 50 4 5 -88 220 148
4441 148 13 12 43 -37 107 -213 -116 -31 -44 -130 191 -185 -208 -252 -170 97 6 -239 38 -8 -65 44 67 36 -201
4466 -201 -60 -46 -66 0 42 -16 154 95 91 21 31 -123 -130 -81 -3 -5 20 101 9 -137 -27 112 -111 -28 7 -168 -29
4493 -29 -123 -12 -78 -107 -151 -125 140 105 -107 -32 -53 224 188 -105 -52 -91 84 155 -311 -87 -128 -137 71 44 -25 81
4519 81 76 -43 -140 -33 31 -230 -140 146 104 235 -353 -228 77 -86 92 111 -69 5 -88 233 -20 147 -90
4542 -90 -153 -4 239 0 -67 -65 170 -63 50 117 121 69 320 26 -61 127 -210 85 5 -54 -60 -231 75 12 33
4567 33 73 3 242 21 -167 12 -107 -206 -47 261 -113 36 192 -100 148 -26 84 -106 156 53 83 98
4589 98 34 60 -199 174 -209 106 45 212 2 53 -126 -33 118 -149 -34 232 2 111 162 84 -27 -41 229
4612 229 -118 62 173 64 -25 56 6 300 -58 25 -149 115 -82 62 158 -54 202 -97 -11 -20 242 52 -44
4635 -44 -49 -144 -75 129 -82 -22 102 38 120 315 260 9 -48 65 -11 -103 5 -108 -21 -10 88 -58 82 -67 85
4660 85 120 69 -165 129 285 29 15 264 -328 -100 -34 -84 -4 -45 -126 120 -122 113 89 50 258 17 -122 57
4684 57 56 100 130 83 -111 138 34 -38 52 279 -98 -8 188 -107 132 21 47 -88 11 2 -138 34 -90 221
4708 221 63 -31 6 -46 -142 -76 41 86 221 107 83 242 51 -221 80 54 -15 354 66 -39 113 80 -405
4731 -405 -99 -37 -323 -188 195 37 59 67 -75 48 30 -254 62 -161 -221 -9 -60 113 141 35 -28 45 -33 -128
4755 -128 -33 -30 33 -159 224 19 97 -203 5 142 -2 15 104 -90 16 103 16 -26 76 28 42 -72 -143 151
4779 151 -36 -31 238 -16 80 168 274 -17 35 -24 -205 -226 -89 44 -144 -68 1 -258 -64 31 -12 -153 -36 -59
4803 -59 -254 -120 -90 21 85 -154 -36 147 -54 22 114 -264 -20 -124 64 18 16 -50 71 70 -73 220 -145 -177
4827 -177 -76 -33 -30 108 -181 98 34 183 -155 219 -148 106 -171 -48 22 62 117 -58 -93 -183 56 102 -41
4850 -41 -85 82 -37 19 57 104 74 -118 -160 -23 -142 -149 34 115 -315 115 -112 70 -69 82 15 44 -109 -29
4874 -29 -81 71 140 -33 232 -273 -104 -274 -30 -99 -112 -78 19 -80 186 164 20 -241 -188 -70 -13 218 -113 116
4898 116 -46 34 46 61 -74 -199 138 51 -93 -33 29 -132 152 -109 -276 -23 235 163 -42 -149 239 43
4920 43 -85 5 -230 -194 -170 0 -41 140 118 132 119 90 -20 169 24 370 -121 140 93 64 240 11 195 -208
4944 -208 17 -343 -81 -86 -206 -15 -190 23 168 -18 -217 27 -46 -44 22 -167 13 72 140 -44 -3 -60 -50 97
4968 97 2 30 -183 -106 -96 -6 214 128 -79 -44 113 230 -12 84 37 -135 246 -321 79 -169 -53 31 -20 -56
4992 -56 -123 -62 -41 -67 217 187 129 -142 86 -25 25 -153 33 -40 -56 121 -295 44 -211 67 135 -68 134 56
5016 56 111 10 -103 160 279 16 -58 113 51 -7 167 138 158 173 64 6 221 -98 64 -58 44 -231 25
5039 25 -183 269 42 111 -119 154 -16 -218 -231 -366 101 -135 -234 103 45 46 -33 -75 -70 -153 165 216 174 123 -99
5064 -99 64 136 -91 336 -30 -13 -116 49 203 -267 -108 16 -66 24 64 -174 -4 15 236 -9 -51 -23 -63
5087 -63 -44 -112 215 -122 -181 -170 341 138 21 121 107 79 -121 -59 249 263 23 65 -76 -109 -79 21 -18 159
5111 159 -53 74 63 117 27 -151 -26 -2 -253 -39 10 -26 0 92 198 -72 -104 264 -21 100 36 -25 176 -206
5135 -206 -159 -115 -34 64 -187 -219 -221 -136 -129 -71 -207 -39 -41 -10 116 89 -197 -44 -78 -138 -27 -188 6 228 101 -176
5161 -176 -29 39 -276 139 28 326 -77 -34 -229 64 -8 -85 -30 79 -24 24 69 -106 -11 166 292 103 20
5184 20 133 314 143 -25 57 137 162 -156 10 98 -363 33 -44 174 -222 -42 -142 111 65 101 -314 -58 -94
5207 -94 64 -63 39 -179 282 -156 -48 -19 143 9 -120 110 51 53 215 -178 89 20 117 -133 128 -19
5229 -19 -1 -225 -24 -99 45 -87 -180 -192 -41 81 -25 -155 12 -50 -208 53 308 167 8 114 -85 93
5251 93 -82 -12 -33 -83 173 -52 -122 -147 26 -57 58 69 282 25 -129 -168 -94 75 -42 72 -24 -172 146 77
5275 77 83 117 -225 144 -66 -126 124 53 217 -75 -206 76 -107 109 -110 96 157 -15 -78 -12 146 -117 -59
5298 -59 -198 167 -1 104 -108 55 -30 -180 292 -70 9 216 396 -62 91 27 -266 110 233 23 -15 -150
5320 -150 36 17 94 -28 -155 -46 -192 85 -74 -96 -39 152 133 -200 38 170 -147 103 -55 46 -275 -272
5342 -272 24 143 -24 -112 72 -85 122 -32 -82 270 -17 74 57 22 36 71 -66 -130 -216 -57 -17 6 94 32
5366 32 -154 -152 -88 -186 -174 -127 71 121 25 -51 27 -86 36 54 142 125 60 363 68 -135 -181 -62 -65 -80 -224 -142 231
5393 231 -64 181 -54 230 -156 -83 -30 88 224 58 -54 -15 11 -188 57 184 67 159 180 2 -106 45
5415 45 297 6 77 61 -151 26 21 -189 -80 17 114 27 -64 -36 23 -186 209 -109 254 8 27 -8 57 -230 -216
5440 -216 14 88 -35 -109 -104 -342 -121 35 -275 93 139 -161 -239 -39 -114 10 181 97 -52 20 51 -233 -1
5463 -1 97 94 93 -133 152 138 -113 238 161 142 -305 103 -148 72 -94 64 65 -140 189 -262 -154 140 -133 -143
5487 -143 -66 -142 -41 76 -70 90 -46 85 164 -201 159 179 123 10 -92 -145 8 2 -129 61 60 -133 -335
5510 -335 69 136 71 -47 -78 111 204 30 68 -252 112 27 -60 -134 74 145 -105 -120 19 -183 5 -55 5 24
5534 24 101 -37 96 51 -54 106 5 -297 -58 104 -338 -25 100 -193 -137 167 -140 235 41 -121 -125 -216
5556 -216 -15 -120 234 -39 244 -70 231 32 119 15 156 18 87 81 107 115 -8 140 108 -10 78 32 -67 22
5580 22 104 329 -61 190 44 -110 -72 70 -96 37 22 -29 168 -179 161 6 -156 132 15 -13 -272 52
5602 52 -154 344 -36 13 -48 25 123 52 156 69 -12 269 -76 -113 -56 78 -2 -243 -9 -36 -40 60 190 -62 24
5627 24 71 -58 37 -84 18 89 -63 -287 259 -62 103 -84 163 166 -27 -149 -72 -93 -66 -68 93 26 -39 109
5651 109 -21 -164 69 15 -35 -199 21 106 -130 -290 6 -112 -204 -150 -189 -84 -115 -194 -196 52 -83 -38 -205 -37
5675 -37 252 -170 -146 204 -38 83 -178 -121 -43 155 58 -3 92 152 163 -3 -44 -266 267 -147 -68 98 -164 -21
5699 -21 69 45 89 155 -43 37 315 -228 -85 -33 -22 -5 74 -21 -66 75 -59 88 85 -95 -3 12 37 197 158 210
5725 210 65 63 63 35 -75 -115 -50 132 -147 96 -135 3 -144 -62 263 -130 35 -89 -19 72 -85 -124 95 228
5749 228 61 218 -200 75 -151 -84 11 -8 54 53 -155 225 226 -39 49 56 -27 -93 104 -159 -10 4 -199 218 -24
5774 -24 68 189 43 -14 108 26 16 23 54 118 1 -8 -66 -97 106 64 77 22 140 -143 110 12 -104 25 5 -48
5800 -48 -146 282 43 181 32 -95 208 -13 97 -57 -113 45 -51 -76 -94 -12 -14 -144 -198 152 144 119 -50 -344
5824 -344 -159 -242 -109 -5 -69 153 -111 133 -113 21 -182 45 159 200 171 -28 65 91 78 283 -240 -8
5846 -8 218 105 179 -187 -54 33 -103 41 -170 -53 13 -142 -109 -34 -50 -121 -128 51 -80 177 84 -30 -29 104 -163
5871 -163 -37 133 -70 -16 200 73 292 -92 -76 -50 -98 -252 -120 -240 -142 -42 -22 -72 49 188 107 -85 -57
5894 -57 -36 212 80 -68 2 -142 -69 123 45 286 392 103 -32 -92 19 194 172 -107 -279 -134 43 -193
5916 -193 -11 -10 89 -182 99 -100 -137 50 174 6 -112 -165 0 145 83 -25 223 -236 37 28 -152 -76 126
5939 126 62 17 28 -18 144 169 -341 -101 -17 -179 -117 116 45 -350 -140 -139 -9 -108 114 -217 158 358 221 -6
5963 -6 -145 -117 4 152 78 -132 136 60 -37 -139 -98 194 0 -115 22 -218 -270 8 -342 -41 -142 -30 -62
5986 -62 6 -41 14 -223 174 -49 44 115 -100 -85 125 74 -28 12 -84 79 -353 207 -4 -154 4 -103 -31 -106
6010 -106 61 17 76 -244 96 25 208 2 189 38 102 -29 22 78 279 60 87 -104 139 -173 66 28 -202
6033 -202 34 -191 28 -145 -93 20 -102 -198 16 -52 -43 -66 128 16 -86 298 8 -116 182 204 -116 239
6055 239 247 239 -157 80 -12 114 276 52 -11 243 25 82 21 9 -239 -259 -147 124 -60 -10 -7 66 42 3 -46 -83
6081 -83 -65 36 55 -109 -44 49 -33 96 236 257 -13 38 8 -261 147 92 26 -193 53 -198 -87 -163 21 27 102
6106 102 56 -157 -186 -39 -70 -120 31 113 -90 -128 253 9 176 45 79 -81 -145 -39 -110 -7 45 105 -14 11
6130 11 -52 24 53 86 -126 -88 -195 -18 43 119 -36 -50 -81 -17 52 105 -71 -26 80 117 210 103 103 124 209 122 117 59
6158 59 -111 5 78 183 -304 98 -120 439 -65 246 -196 -151 -175 138 138 50 54 -264 8 64 66 1 -39 -77 40
6183 40 -17 -117 4 -68 4 -91 22 -251 289 -9 130 -156 -35 87 -214 79 -269 170 -85 189 -189 -206
6205 -206 185 -176 -113 221 -10 128 -3 -110 112 310 294 -99 223 196 -30 4 56 145 -64 67 -171 -113
6227 -113 -9 -82 -274 -44 31 56 222 -8 -62 77 -110 -189 -4 213 -65 263 -54 146 225 -158 -27 -191
6249 -191 39 27 -67 82 -134 -158 -17 -103 -27 -23 36 -94 55 13 -31 17 -180 -173 -113 -72 71 -93 -156 49 -33 29
6275 29 -172 115 212 -20 -25 -43 217 99 72 -57 -242 -325 247 86 -44 48 69 30 -330 138 -94 225 -110
6298 -110 160 10 -128 139 -30 -188 -85 -20 216 149 -245 55 -7 -44 23 -133 121 -169 50 -31 -81 -18 8
6321 8 -36 -57 70 -109 -145 -118 98 -354 130 -58 -60 52 25 116 -51 346 -85 171 207 7 120 -177 66 75
6345 75 -2 5 -18 -89 -286 -63 -127 104 5 53 -171 -18 215 132 -189 15 -44 236 147 14 320 27 255 17
6369 17 91 168 183 -42 31 49 9 85 -58 -94 -130 7 -54 -135 -43 -261 -36 -161 -51 220 -47 -165 -4 52 116
6394 116 23 -47 73 -61 200 -13 95 222 53 -28 29 271 -125 140 101 129 115 -126 -29 -204 -20 147 94
6417 94 -154 -13 -74 -124 188 -105 20 22 -130 224 -141 60 2 -70 -134 135 15 -113 -67 131 -161 -116 -6
6440 -6 -7 0 -287 -50 -29 -76 -188 -36 6 -209 219 33 -193 136 107 -267 -63 -116 226 -27 47 37 -91 -79 22
6465 22 120 94 255 -118 173 -47 46 -74 -171 -86 203 -24 -87 7 -194 28 -97 -37 -7 36 -122 -5 -120 16
6489 16 -42 158 -121 143 -20 -66 -112 -250 65 -238 124 269 136 -96 84 72 -11 8 -14 66 -141 -110 71
6512 71 -150 80 50 -279 31 17 149 210 78 -120 -160 93 251 28 33 101 -137 -94 303 -39 19 -12 242 -80
6536 -80 -47 -45 248 73 -117 -21 -44 67 -81 128 187 -21 27 119 67 159 -171 66 -16 -77 -168 -103 79 -42 -100
6561 -100 -26 -29 -32 -210 -161 -3 -5 44 83 -100 57 21 27 170 83 0 124 -79 -74 -89 74 -90 -29 -33 80 178 179 97
6589 97 151 -129 -137 14 131 355 -63 -38 -206 110 -41 66 87 -326 25 -72 -21 101 -89 -225 -183 58 35
6612 35 -251 -9 -33 172 -66 -76 -19 104 137 108 47 87 -71 -207 13 -125 -53 64 1 105 -195 -278 -192 -114
6636 -114 155 91 26 18 91 169 100 -53 134 161 23 -48 -65 18 -58 -227 -30 26 86 14 -64 56 -49 46 -91 -99
6662 -99 -49 170 -139 -109 -32 96 21 -72 -182 375 -104 -62 73 304 -86 98 -21 104 -30 -309 124 -73
6684 -73 82 -121 35 3 -195 -13 -142 58 -170 253 -295 -149 20 -39 -43 -160 113 27 129 78 76 -66 292
6707 292 -6 -141 -155 269 -86 230 191 61 -37 28 37 20 34 85 137 10 -44 -15 113 -73 71 -130 236 181
6731 181 -49 -89 -109 114 59 150 64 224 34 -182 -68 -30 23 201 -35 26 39 -229 -113 131 -205 -66 -32
6754 -32 102 -141 -308 35 -204 75 -9 -294 -35 121 -204 -157 80 153 -63 -276 -26 192 83 -22 -104 6
6776 6 -208 213 -284 47 -24 -100 32 -149 35 -79 224 -91 -165 -187 90 -204 -141 15 267 -151 29 -253
6798 -253 155 -108 -216 -6 -77 -125 130 -128 166 45 -65 187 68 221 108 289 -16 85 -28 -93 200
6819 200 -162 -180 -184 -102 152 42 45 -204 -38 -252 55 -176 202 4 -88 58 99 113 -13 -189 144 100 142 214
6843 214 25 -80 13 58 4 -170 -140 -74 -29 -102 -17 49 -6 19 -147 6 -49 23 -56 -131 21 95 -6 164 -13
6868 -13 105 65 -65 127 58 -92 22 106 222 69 -45 -173 -56 192 -31 -43 -67 95 74 -114 1 -127
6890 -127 108 -108 277 189 -56 -123 79 -2 -87 -119 136 -43 -179 -180 163 158 40 -145 -20 -177 -154 -32 -58 -148
6914 -148 163 155 112 -157 -163 96 -124 -102 49 -33 -308 -138 -167 154 -64 69 135 47 46 -211 88 475 -180 61
6938 61 46 78 49 -256 27 -184 13 -83 131 -53 -61 -41 -19 -239 294 -148 79 -16 124 73 155 25 229 -207
6962 -207 -51 -137 47 -120 -77 -2 121 159 -24 -135 -152 206 -3 -40 -152 -122 115 95 -79 -118 86 30 -125
6985 -125 -32 -161 -46 134 87 -98 117 75 -63 -162 -52 -310 -23 -29 234 121 22 -76 -135 -22 -163 46 113
7008 113 -164 120 -65 196 -97 -171 20 139 1 86 -211 195 -164 -3 -12 153 -15 -97 -192 -38 -89 -189
7030 -189 63 -17 -31 -12 -101 -83 74 -133 68 52 -160 -158 -35 55 105 -47 -269 -70 88 -83 61 190 318
7053 318 175 -24 -41 169 -206 -59 317 87 208 168 -8 -10 13 131 -150 -34 -14 -10 60 99 -137 210 137 120
7077 120 2 -60 229 82 -29 -28 189 -1 -251 84 144 165 276 120 157 25 -172 -17 -111 104 174 65 -187
7100 -187 -27 -154 40 78 -147 -61 -32 -34 77 38 57 28 -218 76 123 36 -94 156 -103 63 46 41 -240 234
7124 234 -105 68 36 5 129 329 82 -194 4 -195 92 139 175 92 -484 130 59 -184 -71 44 254 59
7146 59 107 150 -171 -181 -164 278 -191 -7 9 -192 304 172 -78 13 -191 -135 12 -79 -309 -164 52 -98 -215
7169 -215 55 70 -132 189 40 32 -12 -18 -130 12 103 84 -241 -127 -135 -30 143 63 294 -147 -65 82 116 164 128
7194 128 -129 176 165 -84 -63 -97 -207 -13 47 -229 -7 -304 92 33 -104 -167 121 29 -22 145 8 -27 152
7217 152 52 161 8 -191 78 193 -81 256 44 -226 -85 -18 -210 -38 -116 23 161 -156 259 94 -252
7238 -252 141 -158 41 51 77 133 232 87 78 108 -29 -230 -137 -23 2 25 -214 -210 -274 -12 0 149 -169 -14 -135
7263 -135 30 290 78 -20 49 43 37 -17 118 14 -191 381 284 17 -52 128 -180 241 -16 27 -54 -28 57 169
7287 169 -116 -54 -42 44 17 259 200 -212 6 -172 50 -43 37 -190 -144 -75 14 33 70 15 -381 9 -98 39
7311 39 -39 -224 -258 -238 96 77 -138 -125 169 2 -338 -64 76 145 90 50 75 -75 78 -157 -65 -105 108 182
7335 182 -138 199 136 267 205 -97 222 -175 -245 -52 112 -26 -53 -311 351 202 342 -104 -34 -25 -131 -34 -84
7358 -84 123 20 -66 -4 70 -14 -34 113 24 38 -5 -99 119 12 73 145 -108 -179 286 46 -165 -92 -22 -3 0 -242
7384 -242 -36 -174 -125 -199 -88 -23 -70 -87 75 -74 117 101 -18 145 136 -24 103 -14 -23 -107 -87 -30 -21 -5 155
7409 155 -188 -60 16 8 -8 198 208 -46 -53 -187 -157 -30 275 140 -280 -226 -67 53 -6 57 10 132 -192 9
7433 9 -228 17 154 -29 -240 -3 -279 -99 -23 -54 127 -101 143 141 -296 -77 -119 138 338 51 346 0
7455 0 -60 128 -19 -9 168 112 -176 -89 -13 -148 231 -15 74 -94 185 -6 -56 -23 -16 -61 -57 -119 -117 0 -226 94
7481 94 90 33 -24 -35 34 65 -10 16 208 42 166 -188 70 160 151 -38 69 74 -158 -140 173 -224 57 -49 -129 16
7507 16 -81 69 -62 29 8 6 149 166 224 -30 -247 81 245 100 -46 22 119 84 45 -225 -59 187 134 -27
7531 -27 121 103 47 37 -41 -30 -59 -98 102 147 -195 -78 102 152 -52 178 135 -124 123 4 33 41 -107 2 2
7556 2 -87 200 37 -30 95 -224 38 58 44 -86 61 -111 27 29 179 20 -21 -182 -130 -10 -9 -24 -387 36
7580 36 -122 144 152 106 -107 333 30 64 28 136 -235 200 152 -254 -36 12 106 -72 220 85 -158 30 -19
7603 -19 -39 67 28 283 -45 -96 -76 -29 57 137 62 -11 18 -24 0 -252 203 -7 93 -105 -165 8 49 -120 -113 45
7629 45 195 -74 -123 246 -44 -31 247 -99 -144 181 -40 133 -89 100 280 -24 160 205 -19 192 -187 -159
7651 -159 -27 -82 106 186 -135 -197 -66 -29 104 -24 -49 85 84 -137 -83 108 -279 -30 129 57 155 -171 -59
7674 -59 29 -29 128 -20 -78 191 -54 142 -221 228 124 -59 33 -94 -208 -106 -167 182 203 48 -79 -20 -164
7697 -164 59 -40 -61 2 -114 -60 -93 -83 -104 165 -3 -95 125 -34 78 -91 -44 119 -95 79 -154 -66 7 61
7721 61 170 73 15 -121 -6 -137 -133 -102 -67 14 -230 -52 -51 31 -6 -69 -30 168 -85 -188 188 286 -68 51 189
7746 189 -83 71 85 85 14 -214 -74 -64 5 -31 139 -23 -195 77 70 166 -121 46 162 80 92 99 54 -102 17
7771 17 -3 4 -50 15 -94 -95 -231 -19 -49 -98 -49 57 -68 100 -144 200 136 277 -36 108 -48 -119 -15 0 85
7796 85 38 145 -153 137 12 -65 130 -61 -196 -104 74 225 173 -86 -169 17 93 67 92 -78 6 -182 -16
7819 -16 26 60 98 181 -137 -174 -188 -82 25 47 180 -14 -107 99 128 35 45 -37 128 -166 145 112 -102 -168 144
7844 144 50 -174 247 -51 -213 190 -80 141 14 161 -23 72 13 18 -80 -74 -12 -87 -88 161 -65 -288 -87 19
7868 19 -39 149 155 -39 12 156 42 -2 -18 -280 -39 8 110 162 153 -18 31 -36 91 -8 26 -137 -99 175 285
7893 285 -72 -55 -31 125 101 61 52 -122 179 109 -39 -320 135 -288 84 81 -38 68 123 -200 -133 -164 -24 107
7917 107 -97 -174 6 -137 36 -186 -246 -26 91 -56 193 -107 -86 -17 252 48 60 -43 -180 -38 -297 -8
7939 -8 8 63 64 -19 24 -166 -56 -28 -145 338 -202 -133 72 -17 78 -1 167 5 39 -178 -151 72 -33 -48 172
7964 172 84 41 -312 79 172 -110 -177 -63 -174 -177 -15 -374 -4 -33 29 228 48 -105 -154 -107 -1 38 18 -104
7988 -104 -172 108 214 -18 297 0 97 113 189 -146 232 144 143 -311 -179 -16 134 109 -123 38 196 -173 -139
8011 -139 -129 150 302 47 -11 196 -122 -8 -8 104 252 51 -184 -281 -24 13 -8 251 -120 72 80 -138 -83
8034 -83 -1 -58 68 51 -96 13 -7 39 -143 36 69 231 35 -148 -101 259 -152 162 145 142 -256 214 -153 85
8058 85 -8 71 151 178 -39 -111 57 -76 -130 -44 -140 -177 96 -50 -97 122 147 -3 -48 -57 236 -56 4 15 -57 -87
8084 -87 -57 -18 -22 80 11 -52 -170 48 -49 -62 109 13 66 -97 84 51 -358 126 -44 -27 1 13 -125 78 161
8109 161 -228 201 138 -18 -179 -69 101 97 39 16 -194 116 6 -76 -26 -298 0 97 53 148 -46 246 101
8132 101 33 0 10 -46 -61 -120 -45 -177 37 245 109 -89 -45 3 167 -94 -51 -18 226 199 74 68 4 29 -87
8157 -87 66 -16 2 -106 -27 -141 13 20 75 148 51 -237 -160 4 -81 133 -22 150 47 -85 84 37 -19 137
8181 137 298 -133 -14 279 38 4 122 -52 -51 -375
8191c75
$$ Imaginary data points
##PAGE= N=2
##DATA TABLE= (X++(I..I)), XYDATA
0 0 0 0 0 0 0 0 0 0 0 0 0 0 0 0 8 -8 8 -8 8 -16 16 -16 23 -24 30 -32 40 -45 50 -58 66 -75 85 -98 109 -123
36 -123 137 -153 171 -191 211 -234 258 -287 316 -350 385 -424 467 -514 568 -626 690 -762 843
55 843 -937 1043 -1167 1313 -1488 1701 -1969 2317 -2788 3457 -4485 6244 -9833 19961 -105960
70 -105960 -371663 8522 289607 41538 -188209 -9785 131701 3511 -90295 -11094
80 -11094 33476 39335 69031 5763 -135735 -78819 134375 132824 -85739 -122608 41899 70441
92 70441 -48242 -47740 42041 32904 -21867 -14309 -26548 -52168 30755 109999 -340 -123295
104 -123295 -30497 96615 30494 -59482 4057 57768 -10761 -45244 5489 19695 7176 36086
116 36086 19518 -68410 -55522 65666 63544 -55144 -41694 59546 5898 -97553 -6650
127 -6650 112056 7357 -109163 -1233 88406 -33674 -93032 58733 113505 -51024 -114710
138 -114710 30657 91270 -12384 -43804 27837 24584 -33061 -13003 27975 3490 -4662 28811
150 28811 -3035 -62968 -13619 68557 22521 -60082 -20395 42123 -6997 -49085 14981 49973
162 49973 -14546 -42093 9499 17766 -19489 2382 39915 910 -39011 -1209 29547 62
174 62 -9066 22439 11276 -29115 -13164 24136 7770 -11893 10832 8720 -32359 -20302 32750
187 32750 16382 -34611 -7361 35197 -13317 -56022 13108 67756 -5024 -65334 -1735 52135
199 52135 -612 -37283 11923 39145 -4748 -29468 -1920 15722 12481 13371 -3283 -28886 -8695
212 -8695 31755 12966 -32180 -11389 32218 3245 -43206 -11372 36611 11948 -27715 -10812
224 -10812 11092 -5265 -7196 17461 8781 -18899 -4868 19950 1280 -18356 8231 28180
236 28180 -1388 -23504 -1530 15608 5445 -140 2387 -7962 -11264 7685 9682 -13684 -10006
249 -10006 18439 7354 -30477 -18581 25829 20385 -20587 -17527 12285 6461 -11892 1288 16043
262 16043 1158 -10154 2021 5560 -3316 4690 14991 249 -14838 -2157 11874 2019 -5194
275 -5194 3841 1365 -11865 -5697 9080 1182 -11024 796 9182 -10198 -17496 8807 18593 -6971
289 -6971 -16697 4777 12440 -4500 -7178 8761 9791 -2573 -3795 1355 1326 4281 8169 622 -9219
304 -9219 -1630 8911 -250 -9869 2157 9583 -5686 -15427 -1270 9783 -787 -7369 900 -186
318 -186 -7642 -1388 8820 3174 -5619 -33 4968 -2043 -2506 8477 8746 -2708 -5518 1594 4073
333 4073 1146 2625 2745 -4438 -5205 1905 2272 -3654 -2021 2965 -1743 -9793 -3336 6725 1563 -6741
349 -6741 -2151 3328 -798 -3380 3088 5339 238 -785 2130 1120 542 3837 4300 -251 -1943 2004
365 2004 2167 -2572 -1444 3156 1545 -4014 -4797 -795 197 -910 152 -1550 -5733 -2968 3175 2179
381 2179 -3246 -1683 4099 1748 -4179 -2080 5722 7047 1147 -4546 -2923 4247 7870 2382 -5324
396 -5324 -2912 5079 4166 -4993 -6230 3226 6533 -3684 -11351 -3123 6483 3779 -5282 -7276 -1673
411 -1673 3181 2699 -1818 -4216 693 6446 2720 -4119 -2703 5901 7950 -187 -5379 -85 5948
426 5948 4057 -2243 -3141 1068 2529 -602 -2737 -2846 -896 1145 556 -3014 -5904 -2737 3328 3326 -2812
443 -2812 -5725 -825 5162 2574 -2899 -1469 3781 4402 765 -1624 -952 2823 6838 4150 -6347
458 -6347 -8327 4838 12743 402 -15159 -6146 12507 7828 -12828 -13428 7549 13558 -5533 -15617
472 -15617 -1597 11831 5313 -6995 -8161 1167 8256 6066 -3030 -7909 1467 12843 5920 -10342
486 -10342 -8002 10993 14144 -5522 -14962 1775 14646 1296 -13396 -6076 8553 5051 -7414
499 -7414 -7951 857 4119 365 -3240 -3812 -1639 2353 4652 -150 -5515 -93 7791 3755 -6199 -2400
515 -2400 10028 6463 -7441 -5801 8252 7395 -6429 -5780 7349 3936 -9763 -5562 9761 4679
529 4679 -13013 -8979 9761 7731 -11105 -9972 7555 8341 -6243 -7705 3952 6265 126 -895
543 -895 272 -1563 2498 8512 2197 -9735 -2987 13446 8633 -12543 -11488 10447 14110 -7314
557 -7314 -16418 1337 13215 491 -12528 -6290 5752 5899 -3089 -7091 -2700 4144 6284 -109
571 -109 -7289 -4169 7638 10741 -2206 -11275 769 14479 5032 -11597 -6321 12269 9699 -9904
585 -9904 -10933 7422 10158 -5596 -10380 2214 5399 -5041 -5182 4146 1856 -7304 -3280 6626
599 6626 2224 -7082 -1734 6733 2084 -4389 284 5047 1039 -1190 2864 1955 -3461 646 7211
614 7211 1116 -8092 -2434 9121 3929 -9785 -7311 5646 6322 -4584 -8344 -922 5038 1787
628 1787 -3968 -4810 -31 4764 3193 -3823 -4428 2993 7956 2355 -5989 -4136 6397 9468 -780
643 -780 -9428 -1625 10532 5823 -8153 -8395 5359 8653 -4354 -10850 -167 8221 376 -7916
657 -7916 -3778 2683 2222 -747 -1489 -2315 -232 3552 2768 -2373 -2022 4127 4459 -1388 -2586 2699 3494
674 3494 -54 -1475 515 921 13 114 246 -2324 -2152 1184 860 -3091 -3528 606 1328 -2225 -2308 531
692 531 916 -837 -855 1056 1043 171 735 854 568 1781 1553 692 616 813 566 184 861 1068 -1460 -2071
712 -2071 128 965 -1152 -2941 -515 663 -1702 -2859 229 1220 -1388 -2512 429 1650 252 -645
728 -645 838 1242 785 968 674 811 1891 1198 -586 -228 1751 1727 -1683 -2112 635 1632 -1425 -2692
746 -2692 -775 781 -1119 -2193 -379 408 -975 -1280 -223 204 30 469 1058 194 336 1082 1111 1219
764 1219 633 558 761 1258 1174 3 -921 -200 669 -357 -1268 -953 229 -890 -1938 -1260 207 -367 -1287
783 -1287 -1176 -426 -24 -97 592 -243 -718 865 1777 888 197 619 1622 845 492 686 649 667 479 -406
803 -406 -849 -49 573 -423 -2222 -1458 451 321 -2091 -2263 170 759 -1437 -1694 450 1110 -17 -482
821 -482 46 1451 1664 642 -323 530 1998 1983 -318 -963 1043 1427 -626 -1265 8 1051 -839 -2125
839 -2125 -366 54 -526 -1145 -1211 -1071 -809 484 470 -1551 -918 1251 1371 -567 -254 1638 1487 190
857 190 244 1225 1162 951 520 -504 -341 725 1313 -571 -1843 -528 678 -511 -1773 -868 -456 -846
875 -846 -857 82 -394 -1511 -117 1271 -446 -1179 1204 2339 22 -1044 593 2029 955 116 286
892 286 121 550 1909 910 -1544 -1213 1370 1194 -2144 -2481 661 1115 -1777 -2650 -250 806 -43 -715
910 -715 -1307 -988 938 2270 -519 -2087 1030 3243 807 -1625 965 2434 506 -583 1013 753
926 753 -785 369 1416 -1305 -2870 536 2318 -1736 -4290 -113 2134 -998 -2651 -105 434 -1234
942 -1234 35 1850 -346 -2298 1583 3999 -423 -2988 1669 4903 572 -3280 181 3286 1813
957 1813 -1109 -1341 -700 734 1503 -522 -3342 -1848 2223 1359 -3006 -3122 927 1962 -604 -2429
973 -2429 -1198 1296 2909 770 -3134 -1234 4690 3617 -2909 -3228 3094 4737 -1479 -3022 1887
988 1887 2327 -1214 -980 1141 -606 -2602 810 1944 -3337 -3866 2688 3168 -4498 -4834 3087 3585 -3302
1005 -3302 -2914 3035 2017 -2603 118 4033 39 -3154 1631 4495 -978 -3182 2071 3824 -1202
1020 -1202 -3115 861 2346 -877 -1786 -463 -944 -809 604 351 -2627 -1673 1117 1417 -1735 -1861 502
1037 502 1483 847 -322 -1374 564 3505 1697 -2813 -1444 4689 3483 -3559 -3188 3638 3503 -2753
1053 -2753 -2631 1920 709 -2600 -198 1278 -2245 -3017 1965 1707 -4486 -2980 4679 2232 -5335 -2087
1069 -2087 5193 2512 -4309 -1007 4805 1205 -3091 958 3536 -655 -2181 1833 2353 -2414 -1768
1084 -1768 2737 375 -3862 -975 2177 -529 -3261 -193 1502 -1522 -2278 1116 1023 -1756 -709 1588
1100 1588 316 -754 1085 1076 -796 845 2220 -115 -1347 1581 2591 -1363 -1848 2327 2087 -2411
1116 -2411 -2286 2198 1117 -2660 -1294 1485 -762 -2794 683 1423 -2359 -2235 2543 1514 -3111 -1249
1132 -1249 3733 1224 -3379 79 4251 482 -2213 884 2844 -1058 -1580 2390 1224 -2455 -954
1147 -954 2500 -227 -3020 -20 2124 -1502 -2866 904 1789 -2129 -2124 1295 1116 -1778 -492 2130
1163 2130 -241 -1648 1512 2193 -884 -829 2433 1265 -1920 281 2693 147 -2409 686 1933 -1305
1179 -1305 -1975 1063 985 -2517 -1460 1252 -111 -2398 -317 1468 -1152 -1902 1510 1699 -1833 -723
1195 -723 2586 1196 -1680 512 2665 88 -1548 1762 2459 -1191 -1462 1909 1074 -2240 -704 1839
1211 1839 -305 -2987 -233 1581 -1000 -2203 767 838 -1910 -1310 1997 286 -2213 -61 2205 -201
1227 -201 -1369 1135 2204 -640 -795 2134 1175 -1293 -79 1889 100 -1568 291 1636 -1110 -1904
1243 -1904 510 768 -1370 -1231 1128 71 -2047 -487 1470 -464 -1782 764 1301 -1026 -551 1948
1259 1948 1232 -1449 272 1993 141 -838 1094 1542 -696 -986 1488 1233 -1792 -1026 1263 43
1275 43 -1757 -571 980 -896 -2041 160 842 -1014 -898 1113 329 -1325 307 2134 -308 -1384
1291 -1384 1076 1955 -468 -430 1423 1175 -892 -450 1301 222 -1421 230 999 -890 -1271 366 567
1308 567 -1515 -1334 1142 403 -1663 -710 833 -64 -1254 274 1255 -345 -467 1043 917 -311 157
1325 157 1537 405 -768 553 1410 -40 -879 380 450 -1045 -564 483 -184 -1325 -445 515 -635
1342 -635 -1045 525 280 -1170 -649 901 287 -902 183 1082 115 -308 912 1330 -387 -450 1139 752
1360 752 -735 -197 1215 71 -1267 -57 868 -113 -1373 -565 517 -645 -867 -143 -30 -704 -740 537
1378 537 201 -597 234 622 135 -64 518 951 215 37 445 453 203 398 301 -171 -277 33 63 -390 -554
1399 -554 -26 -268 -1081 -423 215 -334 -611 -253 66 -174 -421 795 93 -603 19 1008 275 -474 238 1158
1419 1158 455 -75 399 732 7 -458 75 395 -155 -508 36 -69 -692 -742 -189 102 -824 -910 -63 137
1439 137 -93 -571 -13 472 172 -11 315 327 301 178 216 727 293 -119 311 33 -199 -42 446 361 -545
1460 -545 -999 78 391 -683 -1067 -206 39 -738 -903 47 382 -314 -393 330 913 488 5 614 508 -17
1480 -17 232 1018 690 -498 122 1128 761 -558 -374 384 285 -705 -705 465 -15 -1024 -777 400 68
1499 68 -1057 -439 693 -267 -762 171 1160 -167 -853 319 1053 313 -453 595 908 73 -374 517 564
1518 564 -640 -569 579 2 -653 -589 269 95 -1022 -687 236 192 -902 -732 340 380 -181 -208 411 370
1538 370 11 -67 498 632 99 -108 953 671 -432 8 631 258 -618 -253 807 333 -1025 -573 441
1557 441 -158 -872 -474 508 -24 -1084 -213 438 -114 -749 176 498 -315 -289 854 1058 -161 -89 726 637
1577 637 -176 -422 301 309 -828 -163 325 -58 -642 -472 125 -337 -697 -564 -277 -298 -506 -227 133 -132 -288
1598 -288 -180 150 163 303 122 500 257 323 253 347 365 4 -49 274 110 -196 -265 -15 -233 -670 -417 259
1620 259 44 -649 -488 -108 -215 -790 -132 280 -241 -291 483 608 -57 -114 576 625 -14 -132 558 777 -166
1641 -166 61 478 -29 -219 -233 134 -413 -681 -225 60 -464 -349 -286 -158 -377 -38 39 -190 -38 339 132
1662 132 -24 204 363 399 390 348 581 332 143 292 -17 -75 309 269 0 -426 -214 -34 -417 -553 192 -96
1684 -96 -693 -488 208 74 -540 -301 437 -19 -173 198 467 255 -311 516 840 -9 29 70 366 -54 -83
1705 -83 304 173 -305 -376 143 -48 -606 -358 -209 -367 -526 -210 -10 -268 -257 41 -24 103 -108 184 241 226
1727 226 372 383 261 384 413 271 108 342 404 92 -100 167 -436 -585 -129 92 -439 -484 -319 27 -431
1748 -431 -590 19 77 -96 -69 321 540 -277 37 488 297 -17 52 344 122 -12 310 300 -72 -426 337
1769 337 48 -304 -226 -44 -61 -407 -236 -246 -478 -334 -338 -162 -96 -26 61 123 22 -66 480 170 470 396 355 176
1793 176 274 303 165 73 7 32 -87 -38 14 31 -202 -525 -320 -234 -344 -506 -295 -18 -328 -61 -84 197 -220
1816 -220 90 435 323 148 123 256 522 -218 441 357 406 -134 283 229 187 1 -161 -5 -81 -157 -108 4 -346
1839 -346 -530 -194 -238 -190 -190 -240 130 -60 -11 57 484 416 123 177 256 272 39 308 461 -48 10 55 321 -27
1863 -27 -388 -313 127 -291 -439 -83 -245 -382 -459 -377 415 -204 -446 250 441 -241 -211 553 493 26 -2 342
1885 342 580 248 -37 245 501 -65 -33 315 144 -323 -436 279 170 -461 -474 -338 -198 -658 -215 76 14
1906 14 -226 -176 199 306 -230 -67 336 270 279 -4 545 472 196 -183 364 217 -151 -345 183 276 -174 -119 102
1929 102 -213 -719 -561 314 -136 -473 -353 193 -53 -214 -215 422 179 -326 271 490 361 -53 255 538 114
1950 114 20 420 475 -24 -275 32 5 68 -285 -81 -20 -416 -367 -149 73 -219 -342 -182 -123 -173 -181 218 359
1973 359 -144 66 274 234 15 245 146 256 255 -27 131 212 -44 8 204 165 -226 -528 -80 -127 -373 -377 2
1996 2 -103 -428 -478 96 333 -111 -433 311 438 105 73 422 195 -322 75 559 621 -154 -103 536 -31 -277
2018 -277 16 241 -247 -783 -238 227 -138 -504 99 -83 -263 -397 178 46 -78 71 107 267 199 -152 463
2039 463 226 278 127 305 281 64 27 99 -35 113 -247 -251 41 -151 -285 -221 -197 -91 -535 -457 64 -103 -329
2062 -329 3 199 -285 -341 401 346 -53 -21 358 406 76 -1 426 502 -330 -61 153 161 -444 53 243 -271 -510
2085 -510 -110 199 -510 -542 142 1 -506 -514 87 -66 -122 -51 -39 134 -118 160 131 256 177 403 293 -28 218
2108 218 190 26 146 -37 -206 -377 -100 120 -253 -401 -22 -10 -388 -288 454 48 -542 -122 385 78 -419
2129 -419 271 671 207 -140 626 790 15 71 346 393 -100 -129 515 64 -406 -110 386 -59 -778 -103 -106 -491
2151 -491 -355 279 249 -419 -65 313 -92 -264 188 356 264 24 463 296 -182 422 209 50 95 550 3
2172 3 -57 -184 282 -53 -305 -240 118 -545 -614 280 260 -412 -601 274 342 -535 -110 414 179 -472 200 658
2194 658 400 -252 348 824 -75 -45 320 421 -173 -204 198 36 -402 -56 247 -525 -557 85 60 -475 -542 140
2216 140 -117 -155 -22 217 6 -466 14 404 -61 93 534 198 -43 341 432 -28 -137 265 290 -486 -15
2237 -15 373 -126 -554 -231 321 -221 -663 75 68 -345 -386 196 98 -602 -179 537 382 -294 -7 482 301 -253
2259 -253 442 795 13 -108 559 241 -212 -135 199 34 -482 22 191 -294 -543 171 -64 -685 -47 216
2279 216 -147 -114 11 248 -71 19 659 150 137 140 461 308 -97 162 342 -16 -257 24 321 -320 -230 231
2301 231 132 -420 -114 120 -222 -395 -36 382 -293 -503 101 504 -309 -102 291 198 -128 45 331 108 -100
2322 -100 213 319 -48 50 154 373 -307 -176 92 -204 -320 -46 -71 -349 -448 -46 -87 -598 -130 130 4
2343 4 -469 127 397 -132 -181 335 385 33 -143 440 567 -358 274 744 -80 -332 339 402 -166 -576 270 53
2365 53 -359 -382 335 210 -492 -191 312 -41 -653 129 321 57 15 185 393 51 56 227 111 -21 324 249
2387 249 108 202 -51 498 -388 11 110 -234 -244 -6 -151 -545 -91 -13 -332 -369 64 304 -71 -412 251 232
2409 232 -188 88 429 281 -348 154 589 263 -88 -148 116 168 -365 135 415 -239 -386 301 296 -404 -280
2430 -280 52 -39 -600 -274 112 -142 -332 -91 9 -20 -98 360 234 -12 23 292 313 225 352 59 75 200
2452 200 65 146 -139 -96 -88 -336 -54 -94 -118 -145 -191 -70 -200 -302 -76 138 -148 -223 45 275 -180 201 496
2475 496 -31 -237 204 356 233 49 204 304 -32 -129 -107 -32 -375 -45 -51 -45 -483 -414 -87 -143 -115 -175 -83 -83 -143
2500 -143 53 286 22 253 10 178 92 31 202 152 135 148 295 -9 113 -103 -69 -149 -17 -117 -118 -202 -197 -455
2524 -455 -190 -144 -161 -434 -38 -19 142 -124 -85 113 36 -80 318 364 48 -117 108 191 362 -16 -85 79 -18
2547 -18 -14 -225 35 -152 -78 32 -151 -101 -82 -53 -415 -342 -102 -179 -41 97 49 170 -79 77 297 -17 130
2570 130 180 167 110 259 306 186 151 9 -66 -358 -29 -33 -93 -258 -265 -141 -128 -126 -182 -237 -122 163 -212 -8 208
2595 208 -41 217 -67 206 145 236 -27 98 66 273 0 186 56 -23 61 46 -7 -149 -60 24 64 -110 118
2618 118 -128 -173 -106 -159 19 -208 9 -59 -95 282 287 241 0 -60 316 346 126 136 20 105 -226 69 23 89 -5
2643 -5 -17 -78 -196 -37 -339 -243 -66 -166 -386 -42 -200 18 -221 -2 351 132 -185 119 358 269 -29 14
2665 14 287 -23 -187 106 185 -50 -312 -129 74 -327 -66 -49 42 -352 -141 81 228 -502 -197 247 -101
2686 -101 -93 -78 168 74 -217 186 129 190 -83 432 230 4 -66 71 3 211 -100 124 -224 -93 -84 -163 -179 9
2710 9 -30 -160 -186 -178 -181 -128 105 131 326 -334 73 216 167 -29 116 208 178 -50 215 85 95 261 173 -4 -157
2735 -157 -283 299 -43 -263 -135 116 -150 -143 110 -210 -234 -124 -24 2 -241 46 162 98 63 -121 127 259
2757 259 -16 -119 432 400 196 111 141 92 -105 -95 -9 21 -36 -317 79 17 -30 -147 -194 -160 -64 -189 0 278
2781 278 -25 -81 107 202 116 -254 15 241 84 -142 307 176 82 -140 205 238 52 -170 162 51 -231 -157
2803 -157 167 -196 -577 -60 110 -44 -310 140 161 -311 -21 256 237 -115 -67 -2 172 25 200 391 124
2824 124 147 -98 160 168 -107 -117 -135 -64 -85 -156 -53 -11 -224 8 -242 -96 -69 275 223 241 -65 1 130 -57
2848 -57 213 -258 241 227 157 -128 149 124 18 -5 251 81 -439 -195 220 13 -451 -333 5 -114 -181 -225
2870 -225 161 -20 -271 222 175 80 18 286 118 264 -20 136 366 10 177 -77 -17 -46 -250 285 -147 -69
2892 -69 110 -29 56 -23 -2 -277 -257 -364 -137 -233 155 -8 -190 -193 -132 73 -344 64 102 -67 160 87 253 26
2916 26 -66 24 73 -202 -201 118 -46 -113 -325 3 96 -245 -323 -32 -133 -117 -21 20 102 -277 78 348 -62 -186
2940 -186 145 55 51 -116 249 122 -171 -133 263 74 165 -161 78 108 -60 -1 -106 -102 -174 4 97 -137 -229 109
2964 109 -53 -136 -117 -26 81 38 -61 139 230 237 -108 80 197 45 -52 17 -20 130 72 -141 160 28 -76 -259
2988 -259 -153 -174 -294 -66 26 -91 -152 135 -213 -64 -19 -133 259 -110 -155 171 301 93 120 386 286 60
3010 60 -7 343 199 -106 231 233 74 -250 -218 -167 -191 -163 -181 117 -254 -222 -263 137 232 -126 -91 121 -16 -82 70
3035 70 22 52 -49 -74 -56 -91 -143 -21 185 256 -9 131 118 -50 -86 -115 -73 -89 -44 1 4 -239 -47 -211 140 -81
3061 -81 39 -96 -228 50 89 -14 91 106 204 45 99 -73 59 211 -10 2 121 -46 148 230 -170 -51
3083 -51 -130 -247 -287 -18 9 -22 -96 6 47 -59 105 52 109 -6 257 145 -128 212 97 161 15 -46 199 112
3107 112 56 77 -32 58 -174 2 97 -90 -134 -34 247 -431 -199 -28 -171 -40 -44 -4 -34 -108 163 -31 176
3130 176 46 179 -6 8 193 356 50 -48 -39 -42 -20 -17 160 -58 -86 -236 -197 -67 -42 25 79 25 -29 218 -164
3155 -164 19 59 -164 118 27 -172 293 98 87 231 -2 -122 -267 81 85 6 214 -180 -61 -313 -64 -264
3177 -264 -153 -120 -67 110 -123 -179 -29 -124 -190 -43 -139 249 -71 -122 50 110 141 181 108 80 131 187 -198 136 85
3202 85 5 59 -240 71 -56 89 -42 132 -168 -124 135 132 -94 60 4 174 -94 -92 -20 -37 27 -172 239 302
3226 302 213 357 163 -50 85 259 154 72 271 60 234 -108 -174 33 -50 6 42 106 -218 -245 71 -98 -148
3249 -148 145 13 173 9 -44 71 250 225 -47 128 -6 117 59 -94 -139 -16 175 -287 -235 -39 99 -72
3271 -72 -225 -56 36 -20 -169 -171 54 -364 -68 334 -142 82 -213 101 -31 -68 347 180 60 36 158 287
3293 287 -60 205 44 -209 -79 -163 58 -362 113 48 -169 -138 -7 20 -144 -477 157 157 -200 -208 52 172 28
3316 28 43 85 -105 -100 -66 -13 89 -125 290 -195 -178 96 143 -35 -256 -50 -85 -107 13 -70 -164 -98 -35 80 240
3341 240 56 -61 74 -85 -115 337 265 -443 95 -47 115 223 -198 47 -10 -178 17 133 -332 -128 176
3362 176 -48 -115 5 260 -34 -345 -31 116 27 -111 -44 196 180 -36 265 190 77 -209 202 62 93 90 143
3385 143 196 -82 81 67 75 -165 -25 -211 69 -322 63 -51 -217 3 1 -77 135 32 -62 153 56 -169 -120
3408 -120 14 46 68 56 142 115 -108 69 6 86 37 -22 278 208 -140 -209 -64 33 -103 -253 103 -166 -251 -185 81
3433 81 -17 -240 -40 102 32 -224 -149 111 143 -67 274 11 -85 -25 27 193 31 -57 123 77 -512 -148 59
3456 59 143 11 -236 -340 -346 -67 -56 -134 -1 -42 -312 178 361 108 161 -23 135 -262 -185 62 69 320 -97 97
3480 97 215 -16 -193 23 -101 56 -216 11 53 -256 -144 310 -150 20 -34 216 -343 -30 -160 205 -103
3501 -103 -64 265 76 -88 -17 421 56 78 27 -56 -103 165 53 31 -402 -179 -231 47 79 -10 -3 172 101 66 -156
3526 -156 -84 -146 312 -419 124 19 -186 78 57 112 243 -6 74 113 13 -65 74 235 -300 -52 -6 -147 101
3549 101 -27 72 133 -93 -189 -101 135 -49 13 -4 -147 -45 -290 129 -72 105 189 99 87 -176 212 22 22 -19
3573 -19 122 12 103 -139 -61 109 -230 -160 21 121 -49 -83 -114 44 -206 -308 -206 84 84 -273 -97 -104 153
3596 153 72 -44 12 34 80 34 -18 -23 292 147 110 -65 -111 -24 -50 -223 18 -140 -47 -199 -113 -140 -210 27 84 -13
3622 -13 112 50 -311 315 -168 -17 189 -31 57 -6 260 292 -53 146 367 -59 1 -183 25 215 -302 5
3644 5 -195 58 -168 11 20 61 -103 75 142 -40 -215 219 90 63 -32 -19 75 52 66 -74 267 47 21 56 -4
3669 -4 86 8 -2 105 58 -290 48 -97 -24 -133 22 -216 -82 60 216 23 -196 -37 88 204 -91 172
3691 172 -115 8 -203 -51 -28 20 -113 54 114 111 -50 -75 96 -78 378 138 -86 -85 -107 91 -63 -49 14 -201
3715 -201 50 29 -126 -115 -48 -16 -75 111 104 49 327 129 74 59 -117 84 -35 317 135 -40 29 -149 -25 -81
3739 -81 -112 -139 -39 -102 -6 -35 -167 53 71 -136 163 180 -213 67 178 34 -275 40 -15 359 -54 28 -77
3762 -77 80 23 44 44 -98 68 147 -123 -1 44 -23 -162 56 7 -92 134 -118 -65 -159 15 -30 -246 49 -41 141
3787 141 -15 -94 5 192 -263 1 174 199 -29 190 -32 56 -239 -230 48 -43 49 94 -90 -254 -32 -148 -102
3810 -102 -205 -55 48 78 -139 -25 305 61 -159 200 36 176 -112 202 140 107 90 90 -109 13 -37 122
3832 122 -135 -92 -119 -102 -275 -232 -70 -29 -243 -199 332 -102 197 -77 34 -228 55 274 -203 -111 56 77 -101
3855 -101 12 204 -161 29 -72 31 106 -252 150 203 -108 -51 -58 -19 -393 99 123 -20 68 -136 127 -133 46
3878 46 -65 119 7 217 121 118 192 48 -5 43 -38 -10 71 -152 -53 93 -26 -44 489 -32 -32 85 265 194 96
3903 96 41 -122 5 -154 238 174 298 141 -72 -1 -36 -109 161 220 134 -106 -53 -11 114 -149 20 -55 -64 -59 -2
3928 -2 27 47 -356 -68 -27 -321 293 -200 75 -197 -107 -6 24 105 39 -62 -131 -15 -5 96 117 128 -46 -3 105
3953 105 -306 -91 -159 -91 34 -125 -82 -153 -46 40 110 83 -71 -421 136 35 -41 190 98 29 -115 33 398
3976 398 37 -248 -68 68 26 -53 76 209 97 -5 29 95 -213 -441 113 -129 -55 -40 391 -61 113 -28
3998 -28 110 137 -136 -52 153 -215 -37 -214 138 253 46 -48 -50 30 108 -20 88 -330 -184 82 -279 -80 120
4021 120 -243 -26 276 -120 -253 -262 -156 -108 -48 -72 -1 52 -127 57 -205 62 102 -111 -300 7 17 102 211
4044 211 -147 -23 170 -65 -79 159 33 -77 143 20 129 -228 -61 207 -54 207 -128 115 98 145 37
4065 37 -123 10 19 120 97 -233 87 -86 69 -174 -24 300 91 -6 -99 68 160 -15 106 55 41 -38 142
4088 142 -82 -227 -252 -20 1 -144 -158 -72 72 9 81 42 134 191 -37 -74 12 95 147 153 -293 -14 -74 32 -205
4113 -205 -174 210 46 350 -99 -189 218 -173 16 109 120 -71 -136 230 176 21 149 7 82 79 -158 129 -20
4136 -20 33 86 158 -178 -114 33 -154 65 -181 -529 84 -160 42 82 -134 34 4 -6 -103 28 79 -75 -142 147
4160 147 44 -93 -271 -59 -78 148 -12 101 97 7 168 55 6 89 -67 15 -208 -45 -44 -105 115 128 -47 130
4184 130 -152 -87 -10 171 -293 150 -148 -74 208 83 -30 104 -28 13 170 63 -28 -73 -77 -93 -278 -158 174
4207 174 -305 -144 -116 13 53 -75 -262 54 82 -247 -103 33 -70 -19 195 166 77 135 116 47 -210 -63 -103
4230 -103 138 -210 -252 -21 -137 -37 -58 -91 -52 10 -144 70 -7 1 -4 -167 106 -8 109 15 20 1 -221 99 78
4255 78 76 -139 -76 -169 -23 52 47 50 175 44 -142 152 47 -53 22 -82 -95 106 -15 250 -92 81 -131 -51
4279 -51 81 100 132 154 92 177 224 55 57 -52 -108 -98 51 -14 -70 -24 -25 199 -175 38 153 -150 -324 24 -96
4304 -96 -133 -50 245 -73 -38 137 -46 110 138 -50 108 -188 -101 -111 -164 245 -213 105 60 145 89 190 34 143
4328 143 -6 36 -66 -86 -205 -25 -75 165 -63 33 60 -115 29 100 -71 -40 -193 -150 136 8 113 -193 106
4351 106 -189 273 20 64 59 291 20 -268 407 17 -19 -253 158 -5 110 -203 -179 -108 -229 -25 -72 -207
4373 -207 109 260 94 -117 32 -96 -96 121 -153 210 -190 65 -116 -77 40 199 -355 158 -193 -126 -7
4394 -7 -8 94 -198 -270 -170 60 -102 -189 97 112 -108 -3 -23 67 81 91 -29 385 -2 60 21 74 23 -11 -15 7
4420 7 -115 -93 -9 102 -51 11 -46 -188 -79 -229 -200 70 135 -148 -35 -101 139 82 280 28 90 129 11 110
4444 110 118 61 121 97 0 -93 233 -7 20 57 -101 -306 -2 -116 -131 -74 -225 -187 -212 32 13 59 1 -194 -193 -132
4470 -132 135 27 116 232 70 35 -177 307 17 143 -58 -90 -40 -95 -43 -182 8 -48 -5 30 190 -2 -56
4493 -56 -20 123 -174 -66 -174 96 -87 11 143 -283 -135 -11 204 153 196 -14 33 102 107 -132 -39 152 -10
4516 -10 -59 -147 -1 46 -36 199 -1 -23 -92 -24 -11 -130 -94 -78 -8 27 217 88 127 158 117 23 58 32 135 -26
4542 -26 185 125 63 36 -86 -28 -129 -291 2 80 -157 -163 -43 -92 -11 -1 104 -61 -83 -105 -231 -316 -313 -192 -8
4567 -8 -20 1 120 57 -116 -314 -62 -238 332 -130 -67 80 -86 -108 -98 -159 -18 84 -338 -28 28 -48 92 -141
4591 -141 -45 -99 -53 -11 -37 208 145 -139 -158 121 -127 43 176 -87 21 61 -165 -214 -15 -143 -171 -213 -32 -242
4615 -242 27 -385 3 221 -159 -192 -131 -23 -5 -32 93 20 79 17 -65 145 -49 -282 -16 265 47 -30 -26 55
4639 55 28 -335 -69 46 -40 -29 -220 82 -25 33 65 117 -152 141 151 -15 -25 156 33 -53 -61 -165 87 -8
4663 -8 -233 129 -3 -50 -66 9 -33 -286 -17 65 -33 -83 -5 -182 179 28 -69 113 -99 -209 -324 15 -82 -166
4687 -166 199 -179 174 149 125 1 123 147 258 175 -120 78 71 98 38 130 -105 84 -30 169 -13 -3 42 -184
4711 -184 -205 -108 118 -52 -138 -19 -131 -317 -195 93 98 -46 7 70 -1 -51 71 94 159 -150 -88 80 -31 -123
4735 -123 -30 73 -41 -98 -42 -232 -278 -265 142 -92 -187 -29 41 23 -1 4 -71 0 -331 174 190 158 -53 138 57
4760 57 31 -24 28 64 -272 -131 -55 132 -227 -366 -129 96 -43 151 54 -324 -198 114 -142 127 117 190 289
4783 289 -26 3 106 212 255 -27 29 164 -149 165 27 -85 109 -27 -176 -210 -25 -245 38 127 213 -126
4805 -126 327 -157 -167 -231 -75 21 -61 74 244 -169 77 33 -101 -14 111 -41 162 95 -161 87 117 -138 124
4828 124 -63 105 -265 19 211 -215 -132 -73 132 71 -83 -46 96 248 -205 77 -152 -54 152 -156 61 41
4850 41 240 55 -201 -77 97 -155 -43 -290 -67 138 25 73 137 -37 3 119 1 -134 -54 -90 -242 -208
4872 -208 84 158 -123 37 20 253 2 142 18 61 -124 -166 49 65 -100 -233 -61 -64 -158 117 205 3 -31
4895 -31 95 -146 -25 -173 -74 -430 -115 11 -248 98 82 -142 -191 27 -35 -89 155 43 107 -303 186 34
4917 34 25 -109 100 -41 -28 127 70 -27 -110 44 138 -24 170 -81 -24 -32 -445 -64 140 153 -152 48 182 -33
4941 -33 25 -92 273 2 29 -123 72 66 90 -54 33 9 -91 -108 70 -154 -271 60 -144 -364 302 37 107
4964 107 305 163 -99 -22 89 -49 -61 -41 -23 -72 -30 -54 -47 -72 -130 59 -143 192 150 -153 153 42 68 170
4988 170 54 80 -142 -151 -50 -222 -136 39 58 203 -40 -129 -64 78 -6 -62 53 -36 166 -13 235 -11 -53 69
5012 69 -215 -247 -77 -60 101 -19 16 -46 27 -72 -206 100 44 90 -83 196 10 -146 -244 247 47 -155 168
5035 168 -43 -51 67 -62 17 -14 107 -26 -325 11 -185 77 21 10 74 -185 145 -61 -36 130 -95 50 86
5058 86 22 -100 112 -71 -72 21 -21 -222 -99 12 147 -15 44 45 9 180 167 -23 134 66 17 116 -21 43 22
5083 22 -87 85 -155 60 -122 -41 98 73 -168 -61 -32 40 144 -124 332 221 130 -46 -23 180 -103 58
5105 58 12 -133 93 -113 3 -41 -76 157 -238 132 76 -141 -39 -153 -202 190 123 15 94 -101 187 -90 19
5128 19 74 124 -121 -69 111 -196 -7 -101 -329 -121 77 112 89 -143 -155 188 -104 42 -162 -54 69 -106 36
5151 36 34 -22 -127 -93 128 36 -209 91 40 49 105 16 178 -142 -61 -47 142 34 81 -24 -116 56 -198 -87 -38
5176 -38 95 -11 -17 -344 -1 -30 201 -21 -70 -71 116 -69 46 295 209 210 45 -25 110 193 31 -33 9 96 193
5201 193 27 -168 33 -20 -164 -73 -19 -208 68 13 -82 -89 198 3 42 85 183 172 -109 35 -75 163 -303 186
5225 186 30 79 57 131 -170 -145 -153 -56 -202 -235 -31 123 366 -46 -141 234 -59 -149 59 -81 -81 122 -190 -212
5249 -212 -161 195 -172 79 -109 5 267 114 -91 -27 142 29 -111 25 249 83 -108 -195 147 44 -155
5270 -155 27 -16 -138 22 209 -80 -87 72 80 21 -22 165 -9 -113 -195 -194 14 168 97 -84 -93 128 -10 -236
5294 -236 65 -107 -11 97 24 -48 -6 -15 -124 11 -29 -55 -142 52 119 110 40 13 146 -264 176 138 -72 284 54
5319 54 236 -51 -184 44 273 -126 93 -203 -9 -55 22 59 -120 46 -79 -202 -43 65 -86 -50 -29 70
5341 70 -138 -30 -26 402 191 86 -29 -74 100 -9 50 -242 389 -61 -37 177 59 95 49 -88 -115 -84 -321
5364 -321 -15 179 -6 51 -148 112 -179 19 -180 255 121 -102 -136 -200 -117 -107 -84 105 100 133 -96 -149 -3
5387 -3 -17 206 88 -109 -5 -132 129 -58 39 166 -128 83 21 -6 -32 -283 223 170 10 41 137 -131 196
5410 196 -27 45 -151 -242 142 135 -6 18 204 -53 76 -146 127 -408 -215 174 42 -2 -30 -217 31 -185
5432 -185 103 206 100 191 99 96 181 10 -4 -44 98 62 -69 50 55 32 103 0 -111 173 76 -74 132 -223
5456 -223 -114 -117 -126 114 -86 -208 -117 -45 -309 -64 112 -168 -24 303 109 47 120 -77 82 63 105 -48 -34 -40
5480 -40 110 5 -9 -80 139 4 208 -50 -269 -114 -23 -166 131 -123 -209 126 278 -97 48 -96 -289 9
5502 9 -31 117 -15 133 194 -149 188 80 -50 -86 -156 -167 -163 121 45 -98 -19 56 -126 108 -190 25 -57 13 73
5527 73 71 -3 169 39 -166 -21 -28 106 59 78 99 -55 306 43 241 355 -155 -16 341 241 1 -192 -62
5550 -62 3 -140 -64 -91 52 -80 188 -84 -154 92 -95 -174 115 -36 70 -77 -92 5 84 18 86 -7 53 -68
5574 -68 43 110 -131 28 -4 14 106 89 160 -29 -5 -199 -98 -46 -34 90 -2 158 -38 125 -38 24 -47 39 133
5599 133 30 -45 98 182 -56 40 18 -107 122 36 46 144 -136 195 68 -5 -85 178 -59 -212 103 95 -113 -200
5623 -200 248 -6 -69 22 -31 26 78 24 -77 33 -190 -4 17 99 -170 -203 182 -25 34 15 -45 -452 -71 87
5647 87 24 114 -190 -207 104 -67 -174 55 119 -157 -34 -62 163 1 -5 3 -280 -94 28 -46 193 20 68 -234
5671 -234 -332 36 111 135 34 -150 16 -266 0 -4 3 192 -37 -244 -191 242 15 150 -49 109 119 119 168 -77
5695 -77 136 248 -72 -34 -171 142 -172 256 -239 -87 67 159 92 -153 -116 44 -268 -132 -79 61 -91 -118
5717 -118 -124 143 -44 -65 -101 49 -29 82 -52 251 100 -45 209 -31 80 39 -81 -51 179 -241 -5 20 -116
5740 -116 -18 -99 -182 80 -21 -54 -250 14 31 -88 263 6 -142 -72 218 -112 18 56 -202 153 243 -147 100
5763 100 -6 -105 -77 -126 -164 -14 201 214 -241 -189 -225 -3 24 28 80 -187 222 -70 9 217 26 195 86 13
5787 13 -5 21 -110 -50 -66 -140 -106 -167 67 -99 -3 62 232 132 32 -62 -72 -238 -88 -69 -204 1 189 157 -18
5812 -18 -73 33 -24 -149 -12 14 26 -135 270 -135 -54 63 5 168 181 -108 131 -62 -77 99 -167 66 -121
5835 -121 48 -150 -100 -80 105 -141 -62 181 -80 116 -194 0 15 -36 63 80 -21 -86 -42 81 -202 -208 -44 -142
5859 -142 18 -95 -18 156 70 -27 -265 -89 115 118 -4 -164 61 142 -38 327 -84 -7 -19 -44 -467 98 31
5882 31 16 -60 -99 -127 99 10 23 -213 -208 -9 61 22 -80 62 11 43 -15 203 188 -34 200 51 -245 -31 54
5907 54 -5 202 -4 -69 168 -252 -80 228 162 -27 37 -82 33 -190 -148 86 102 16 127 -154 -140 -14 -118
5930 -118 20 -137 113 39 -149 -79 -171 132 113 -17 -90 97 218 -64 88 8 -69 127 194 177 -94 -264 33
5953 33 51 -72 -190 -151 -19 21 44 72 70 -24 -214 -211 13 -59 46 80 -65 198 -133 9 -178 -163 97 -79 202
5978 202 -150 -92 -353 -247 34 -69 -3 92 -188 125 -68 35 -4 91 118 -19 134 -185 -57 -20 -237 -135
6000 -135 95 157 -74 128 -36 259 120 -32 122 187 145 138 93 86 263 -112 63 121 15 -255 -143 -128 -51 -170
6024 -170 -90 100 -106 79 10 120 64 -136 136 110 14 213 104 -117 170 -14 272 262 23 108 -103 2
6046 2 -19 -23 101 24 -193 61 -77 135 -173 -181 -52 54 -44 -51 227 1 -333 -92 -155 3 178 -71 -47 -218
6070 -218 171 -168 -132 110 95 -34 187 -51 -375 27 -230 -106 -237 176 -23 263 142 -56 -41 126 -43
6091 -43 -158 -71 -6 -8 228 -55 151 -112 -72 54 198 -50 -67 46 128 -59 -158 131 136 -129 -28 201 230 58
6115 58 63 -161 -86 168 -109 51 -55 -149 -92 42 -158 -58 4 28 -83 15 -111 -119 -88 -115 -107 120 171 49 8 -22
6141 -22 -39 85 89 -25 -10 24 -120 -440 14 2 -82 54 -185 120 14 -2 99 -73 103 283 -12 83 -19
6164 -19 128 45 25 99 48 -116 -57 -14 -8 6 -206 111 59 -206 132 -250 69 -71 -178 22 -182 31 -96 -154
6188 -154 -63 -93 -94 173 -130 91 -30 1 -102 54 105 -43 18 -254 -18 122 133 -222 -56 189 -47 -95 -36
6211 -36 7 -66 -127 -55 265 49 75 4 10 -44 44 87 -7 79 -45 108 103 32 -228 12 -99 -31 18 -181 114 115 -44
6238 -44 -188 -53 -56 -94 56 -126 -296 24 -394 52 227 -143 -51 -29 108 -10 -170 251 25 -172 -170 65 282
6261 282 99 -78 164 130 -31 -52 -255 96 109 -210 -83 -169 5 78 -192 41 281 95 107 10 -238 11
6283 11 -134 152 154 137 182 -232 80 -27 -355 -37 124 -65 -31 -177 85 139 -171 94 -257 156 126 -42 -116
6306 -116 -35 -41 -281 82 187 -228 -139 66 284 -134 -71 149 -167 -201 88 138 -168 128 79 155 288 -2 -36
6329 -36 -121 -66 190 -204 145 -138 -268 -127 41 123 -20 104 232 329 -349 272 204 79 67 165 50 -7 217
6352 217 -103 102 -184 -205 276 172 163 -301 -28 -111 -279 -60 -56 170 -114 -66 -191 28 -138 78 283 83
6374 83 97 -139 92 86 124 99 -209 -73 -170 181 -123 -227 -73 -86 116 -141 61 22 -123 -43 -80 34 -191 -17
6398 -17 -11 -118 -16 -84 289 -8 5 42 191 43 149 -57 126 -127 184 -73 138 -204 -95 -191 137 0
6420 0 134 76 18 8 -221 263 237 129 -47 -10 -274 -58 -239 -145 68 41 -2 126 27 78 65 -34 84 -36 329
6445 329 84 -18 -281 -157 85 85 -58 -92 8 15 267 60 -87 -147 102 -282 189 15 253 100 72 -88
6467 -88 54 26 112 98 301 23 -4 -42 -113 11 -142 231 -84 154 130 -26 44 -40 74 116 273 -71 -144 122
6491 122 193 -106 138 -88 21 -22 35 -228 -56 290 -8 254 137 84 -17 20 -105 19 14 -64 -273 -138 -2
6514 -2 17 182 37 25 -91 -77 172 65 124 143 -20 -181 -72 72 -9 90 -211 45 -130 -134 82 35 14 -215
6538 -215 42 -5 -167 -75 299 -87 83 -101 2 60 -186 -155 242 7 107 44 -31 -37 -138 109 72 47 -141
6561 -141 -10 187 150 77 366 -36 70 -99 38 -78 37 -282 57 -4 -385 74 -199 144 49 29 -143 48
6583 48 63 -332 -1 204 -9 30 108 162 133 11 170 45 25 -44 14 -12 101 17 85 137 107 -34 128 -83 84
6608 84 164 -173 115 -225 -20 190 -47 -7 110 -137 -57 -20 -18 42 -10 -300 -84 -11 258 -22 195 221 -329 172
6632 172 -120 243 -199 -171 -53 -222 38 153 -86 -63 113 124 44 31 -197 39 112 59 -166 232 101 -57
6654 -57 2 -138 -18 91 -7 44 5 81 102 86 -56 -155 -175 69 2 60 -154 -80 251 82 -49 -150 -27 170
6678 170 13 -67 -126 24 -14 -90 9 38 224 198 -110 30 103 54 -24 -23 40 -177 -116 76 -142 103 105 135 51 -61
6704 -61 -153 -48 -257 161 -130 216 27 -114 186 137 126 -123 155 74 -322 -23 100 179 125 -177 -130 2 170
6727 170 -207 -15 -79 76 -55 -259 -148 -197 193 -98 106 133 146 -278 82 -23 -12 78 -1 23 15 91 7 -57
6751 -57 173 24 82 -92 131 -22 138 -133 -225 -243 113 -294 -113 109 -121 -47 178 131 -43 -152 -28 -231
6773 -231 -29 68 -41 136 50 -42 104 -41 -60 12 11 259 -26 -92 -205 181 -53 -43 59 -85 210 98 184
6796 184 198 54 68 21 -151 -18 33 -31 8 -32 47 77 216 50 -158 -243 61 92 24 -88 -171 155 -56 -156
6820 -156 241 -11 196 157 61 146 -23 -105 -158 -243 40 -76 -284 -47 64 93 165 223 95 118 163 149 -71 45
6844 45 -54 87 82 120 -112 -214 182 60 8 -96 91 144 58 -194 -157 -79 184 -115 28 43 156 -90 23 130
6868 130 142 -49 -31 -25 -110 71 162 -53 -8 -16 21 0 -119 81 -142 42 -390 -220 -48 -34 -311 -216 144 -17
6892 -17 -14 -37 -214 -99 14 17 -196 163 83 -41 -157 -107 28 51 -93 77 -14 -31 65 -70 81 7 35 -217 -75
6917 -75 -309 -6 114 -85 -115 -64 -15 -51 -194 -151 -87 27 -98 47 278 218 -165 122 30 261 27 -106 -149
6940 -149 -116 28 -113 -21 -97 -3 -215 348 89 0 237 -102 139 21 -172 -97 -21 -151 6 -138 118 -144
6962 -144 106 324 72 16 -118 60 -94 -174 39 -60 39 3 35 128 -160 239 -23 -155 -108 -39 194 -132 135
6985 135 -45 85 -180 -59 129 -66 -246 126 110 116 86 -202 180 43 104 80 86 -11 -13 -6 153 0 -53 -137 -19
7010 -19 54 -164 -47 -109 -71 65 -406 -136 65 -64 -22 -113 -59 307 -75 322 -160 -55 -106 -109 2 49 67 -82
7034 -82 -56 65 -8 -239 78 14 245 -10 -27 -23 -34 -100 -51 170 25 47 67 12 105 -182 -53 -11 103 7 -163
7059 -163 -142 -27 43 74 -56 18 174 177 183 -68 59 33 -184 33 83 -87 3 -47 134 94 -114 -105 -128 17 -50 117
7085 117 -56 261 -24 -9 -52 58 18 -166 -3 -97 44 134 64 -57 -214 -23 172 151 -147 -162 198 -150 42
7108 42 -197 -49 211 21 -48 -119 74 -22 41 49 -160 -65 -62 33 -286 -52 -18 10 -114 29 -99 52 -5 87 14
7133 14 85 -7 28 154 92 44 -196 -238 -264 106 -161 15 -32 -218 -151 93 -149 -3 2 299 -38 -44 162 16 -16
7158 -16 94 201 98 98 -147 89 -58 -2 130 22 49 -11 -22 -184 -232 -8 -155 -110 -165 5 -2 34 -17 73 -185
7183 -185 26 -194 -67 -50 53 166 162 -7 235 -58 -5 19 -33 -1 99 -28 7 -43 -21 -76 143 22 -142 72
7207 72 -137 62 82 -51 -65 -211 105 41 11 6 -68 16 24 135 140 -5 -12 -296 96 98 -46 184 39 18 51 -82
7233 -82 376 -163 -54 57 114 138 -5 -130 120 -176 -270 103 -21 -39 67 154 205 -150 -42 -10 -261 49 10
7256 10 -1 23 281 11 90 80 -9 -92 -179 74 99 70 -111 8 -452 -316 59 -56 -58 124 37 19 -144 104 -77
7281 -77 64 69 265 -122 -68 -242 -237 181 85 -38 -11 -149 -26 0 160 186 209 153 -41 5 150 62 42 -99 169
7306 169 -61 56 79 307 113 162 74 -140 64 66 127 2 -104 266 108 -5 121 160 -117 -8 180 140 256
7329 256 -21 -103 29 65 -82 9 76 64 178 -23 -183 106 -26 -122 254 204 -142 84 -91 -80 77 100 192
7352 192 -81 -70 -169 -54 229 42 -162 165 233 77 -53 -72 140 51 184 26 71 -251 -128 196 141 44 217
7375 217 41 64 87 33 -38 -153 27 -367 199 63 -4 -109 -142 -114 122 216 20 62 13 108 -9 -157 84 119
7399 119 -194 77 15 -34 191 47 -72 -25 -47 0 -77 194 -11 -21 128 321 71 -275 -103 -310 -96 88
7421 88 191 -155 -75 45 46 88 -13 74 42 -125 110 123 -355 -29 210 188 108 -48 -257 -60 169 82 146 168
7445 168 -165 -62 42 -179 -14 -10 -78 82 76 147 63 -11 -53 -14 124 -19 147 203 171 18 167 114 -59 70
7469 70 -19 51 -74 164 -3 -48 -54 -31 -26 -25 50 -287 -229 -31 47 51 256 -164 -95 91 189 -9 -243 -161 55 -92
7495 -92 144 19 92 75 -22 -381 -62 -55 -467 117 -80 21 39 -140 98 -165 -2 239 57 101 113 130 220 42
7519 42 169 20 69 -51 48 36 18 -100 -37 -160 121 322 10 164 61 110 -14 44 -117 244 -126 25 -51
7542 -51 -45 -99 92 -46 -216 132 49 -69 18 233 -189 34 134 126 -12 107 139 -148 17 -11 -75 109 -168 -38
7566 -38 311 67 119 196 -221 153 79 31 -92 -81 -40 75 16 253 -171 -106 104 -81 -84 -82 -76 -134 233 75 191
7591 191 -97 -217 253 44 -252 -140 151 42 -262 215 169 -192 23 -5 -108 -68 67 45 98 -56 61 -84
7613 -84 -83 -18 -107 -15 -79 -105 -107 -85 16 -67 202 24 -46 -72 117 109 -69 19 183 -121 39 -202 -169 35 -125 209
7639 209 82 5 -140 -32 -11 -2 202 147 -77 144 -76 78 -103 -60 84 56 -41 71 -47 143 -18 151 57
7662 57 49 -105 108 -1 -87 -68 149 104 -216 118 7 -49 48 162 7 -172 -84 60 99 76 36 187 -304 -77
7686 -77 157 38 189 78 133 147 -114 79 94 16 37 -50 129 -63 -45 81 -139 39 -122 -83 115 112 -211 115
7710 115 89 -67 173 -181 215 -133 -6 315 -206 -100 156 29 156 166 -24 226 178 34 25 63 16 1 -134
7733 -134 -2 108 -98 -128 -98 -244 -174 -90 150 75 -218 42 -168 -154 94 -34 -158 78 151 -87 175 -43
7755 -43 164 11 -198 44 -61 51 11 -4 28 -79 -20 16 -24 159 202 -9 -71 -317 -13 144 77 -80 161
7778 161 146 -170 -171 17 107 42 152 -96 185 -29 95 382 81 -88 37 50 -182 -100 -9 -2 31 -112 -19 -109
7802 -109 75 162 135 -53 196 186 -33 -150 -45 -78 61 -12 43 -26 -250 57 -90 -88 -38 119 -91 -107 -83 -193
7826 -193 80 -160 -89 191 134 -144 210 -105 41 -32 95 33 141 -83 -132 30 -102 76 265 115 -231 7
7848 7 285 89 -103 -83 -253 -4 257 -64 -84 180 41 122 13 -1 67 -121 11 -76 -60 -26 -112 -41 -146 67
7872 67 118 47 -32 169 -51 -6 58 -83 -255 216 -159 -165 44 102 243 -103 60 -142 192 -89 12 -134 -163
7895 -163 78 95 148 124 -168 12 57 -33 -98 174 241 -96 -12 122 325 69 -43 24 57 -33 -26 -137 -268 99
7919 99 108 102 79 75 12 -143 -136 -28 -49 -83 -226 -56 8 18 -102 -61 34 -82 106 -107 7 86 181 -170 -130 -141 -104
7946 -104 24 -132 76 63 80 -34 -8 -107 -249 -37 198 75 -128 115 -175 -34 99 225 -17 220 -16
7967 -16 90 125 -79 -99 -135 -48 -181 70 -19 18 125 17 -30 -90 20 0 -85 -89 13 -7 -143 -28 63 -124 -6
7992 -6 -127 287 14 -55 332 100 -117 150 132 -45 26 -24 -117 -156 -165 -106 -86 43 55 -167 -129 8 108 -186 162
8017 162 164 246 177 79 -28 135 155 338 122 86 98 -48 -94 7 200 -34 -266 -40 60 183 -267 -38 -79
8040 -79 28 94 102 -89 60 -63 -133 -30 -27 101 -49 166 -173 -202 -166 -331 -23 144 -179 80 -121 -13 110
8063 110 131 -137 -78 130 196 -75 70 -61 110 15 44 23 -150 -156 -7 149 21 -207 71 -85 -2 18 -110
8086 -110 -51 26 115 -15 -166 219 127 -148 262 69 184 -265 -135 66 -104 -191 -122 -317 99 -225 -63 177
8108 177 -88 28 -50 -167 -85 62 -47 119 -140 -75 -102 -110 -227 287 175 -53 -25 -73 73 24 82 28 -189 -101
8132 -101 174 28 -11 -59 49 -301 24 26 -4 236 -83 31 -123 -180 -95 112 82 45 -62 65 89 173 156 -104
8156 -104 -62 -259 -171 32 -34 211 266 73 -103 51 -46 62 109 25 -160 -38 36 20 -248 -149 -102 4 17 -89
8180 -89 -5 35 -86 -150 -78 -89 -1 216 -143 -16 165
8191A65
##END NTUPLES=NMR FID
##END=
