##TITLE=1H_Pr 3Et(H
 D2O
 8 sc, 
 11.3.2024
##JCAMPDX= 6.0         $$ Bruker NMR JCAMP-DX V2.0
##DATA TYPE= NMR FID
##DATA CLASS= NTUPLES
##ORIGIN= UXNMR, Bruker Analytische Messtechnik GmbH
##OWNER= root
$$ XWIN-NMR		Version 3.5
$$ Mon Mar 11 14:32:02 2024 Russian Standard Time (UT+4h)  she@DPX200
##.OBSERVE FREQUENCY= 200.1313
##.OBSERVE NUCLEUS= ^1H
##.DELAY= (6, 6)
##.ACQUISITION MODE= SIMULTANEOUS
##.ACQUISITION SCHEME= undefined
##.AVERAGES= 8
##.DIGITISER RES= 18
##SPECTROMETER/DATA SYSTEM= spect
##.PULSE SEQUENCE= zg30
##.SOLVENT NAME= D2O
##.SHIFT REFERENCE= (INTERNAL, D2O, 0, 15.7039)
##AUDIT TRAIL= $$ (NUMBER, WHEN, WHO, WHERE, WHAT)
$$ ##TITLE= Audit trail, XWIN-NMR		Version 3.5
$$ ##JCAMPDX= 5.01
$$ ##ORIGIN= Bruker BioSpin GmbH
$$ ##OWNER= she
$$ F:/spectra/data/she/nmr/H-F/1/audita.txt
$$ ##AUDIT TRAIL=  $$ (NUMBER, WHEN, WHO, WHERE, WHAT)
(   1,<2024-03-11 14:30:51.17 +0400>,<she>,<DPX200>,
      <created by zg, POWCHK disabled, PULCHK disabled
       configuration hash MD5:
       00 E9 B6 7A A2 85 ED C7 34 08 36 98 17 FE 4E 26
       data hash MD5: 16K
       61 56 DC 7C 44 5C C7 7A F1 1B 2C 8F 60 D9 7A E5>)
$$ ##END=
$$ 
$$ hash MD5
$$ AA 84 42 17 21 E1 67 98 C2 CF F0 05 39 A7 DA BC
##$RELAX= 
##$RELAX= 
##$RELAX= 
##$RELAX= 
##$RELAX= 
##$RELAX= 
$$ Bruker specific parameters
$$ --------------------------
##$DU= <F:/spectra>
##$EXPNO= 1
##$NAME= <H-F>
##$PROCNO= 1
##$TYPE= <nmr>
##$USER= <she>
##$AMP= (0..31)
100 100 100 100 100 100 100 100 100 100 100 100 100 100 100 100 100 100 
100 100 100 100 100 100 100 100 100 100 100 100 100 100 
##$AQSEQ= 0
##$AQ_mod= 1
##$AUNM= <au_zg>
##$AUTOPOS= <>
##$BF1= 200.13
##$BF2= 200.13
##$BF3= 200.13
##$BF4= 200.13
##$BF5= 200.13
##$BF6= 200.13
##$BF7= 200.13
##$BF8= 200.13
##$BYTORDA= 1
##$CFDGTYP= 0
##$CFRGTYP= 5
##$CHEMSTR= <none>
##$CNST= (0..31)
1 1 145 1 1 1 1 1 1 1 1 1 1 1 1 1 1 1 1 1 1 1 1 1 1 1 1 1 1 1 1 1 
##$CPDPRG= <>
##$CPDPRG1= <>
##$CPDPRG2= <>
##$CPDPRG3= <>
##$CPDPRG4= <mlev>
##$CPDPRG5= <mlev>
##$CPDPRG6= <mlev>
##$CPDPRG7= <mlev>
##$CPDPRG8= <mlev>
##$CPDPRGB= <>
##$CPDPRGT= <>
##$D= (0..31)
0 1.2 0 0 0 0 0 0 0 0.06 0 0.03 0 0 0 0 0.0002 0 0 0 0 0 0 0 0 0 0 0 0 
0 0 0 
##$DATE= 1710153050
##$DBL= (0..7)
120 120 120 120 120 120 120 120 
##$DBP= (0..7)
150 150 150 150 150 150 150 150 
##$DBP07= 0
##$DBPNAM0= <>
##$DBPNAM1= <>
##$DBPNAM2= <>
##$DBPNAM3= <>
##$DBPNAM4= <>
##$DBPNAM5= <>
##$DBPNAM6= <>
##$DBPNAM7= <>
##$DBPOAL= (0..7)
0.5 0.5 0.5 0.5 0.5 0.5 0.5 0.5 
##$DBPOFFS= (0..7)
0 0 0 0 0 0 0 0 
##$DE= 6
##$DECBNUC= <off>
##$DECIM= 32
##$DECNUC= <off>
##$DECSTAT= 4
##$DIGMOD= 1
##$DIGTYP= 9
##$DL= (0..7)
0 120 120 120 120 120 120 120 
##$DP= (0..7)
150 150 150 150 150 150 150 150 
##$DP07= 0
##$DPNAME0= <>
##$DPNAME1= <>
##$DPNAME2= <>
##$DPNAME3= <>
##$DPNAME4= <>
##$DPNAME5= <>
##$DPNAME6= <>
##$DPNAME7= <>
##$DPOAL= (0..7)
0.5 0.5 0.5 0.5 0.5 0.5 0.5 0.5 
##$DPOFFS= (0..7)
0 0 0 0 0 0 0 0 
##$DQDMODE= 0
##$DR= 18
##$DS= 0
##$DSLIST= <SSSSSSSSSSSSSSS>
##$DSPFIRM= 0
$$ [...]
##$SUBNAM2= <"">
##$SUBNAM3= <"">
##$SUBNAM4= <"">
##$SUBNAM5= <"">
##$SUBNAM6= <"">
##$SUBNAM7= <"">
##$SUBNAM8= <"">
##$SUBNAM9= <"">
##$SW= 18.0517328524113
##$SWIBOX= (0..15)
0 0 2 0 0 0 0 0 0 0 0 0 0 0 0 0 
##$SW_h= 3612.71676300578
##$TD= 16384
##$TD0= 1
##$TE= 0
##$TE2= 300
##$TE3= 300
##$TEG= 300
##$TL= (0..7)
0 120 120 120 120 120 120 120 
##$TP= (0..7)
150 150 150 150 150 150 150 150 
##$TP07= 0
##$TPNAME0= <>
##$TPNAME1= <>
##$TPNAME2= <>
##$TPNAME3= <>
##$TPNAME4= <>
##$TPNAME5= <>
##$TPNAME6= <>
##$TPNAME7= <>
##$TPOAL= (0..7)
0.5 0.5 0.5 0.5 0.5 0.5 0.5 0.5 
##$TPOFFS= (0..7)
0 0 0 0 0 0 0 0 
##$TUNHIN= 0
##$TUNHOUT= 0
##$TUNXOUT= 0
##$USERA1= <user>
##$USERA2= <user>
##$USERA3= <user>
##$USERA4= <user>
##$USERA5= <user>
##$V9= 5
##$VALIST= <valist>
##$VCLIST= <CCCCCCCCCCCCCCC>
##$VD= 0
##$VDLIST= <DDDDDDDDDDDDDDD>
##$VPLIST= <PPPPPPPPPPPPPPP>
##$VTLIST= <TTTTTTTTTTTTTTT>
##$WBST= 1024
##$WBSW= 4
##$XGAIN= (0..3)
0 0 0 0 
##$XL= 0
##$YL= 0
##$YMAX_a= 760356
##$YMIN_a= -767453
##$ZGOPTNS= <>
##$ZL1= 120
##$ZL2= 120
##$ZL3= 120
##$ZL4= 120
##$ABSF1= 10
##$ABSF2= 0
##$ABSG= 5
##$ABSL= 3
##$ALPHA= 0
##$AQORDER= 0
##$ASSFAC= 0
##$ASSFACI= 0
##$ASSFACX= 0
##$ASSWID= 0
##$AUNMP= <proc_1d>
##$AZFE= 0.1
##$AZFW= 0.1
##$BCFW= 1
##$BC_mod= 2
##$BYTORDP= 1
##$COROFFS= 0
##$CY= 11.3945322036743
##$DATMOD= 1
##$DC= 2
##$DFILT= <>
##$DTYPP= 0
##$F1P= 15.7292609196834
##$F2P= 12.9074282941183
##$FCOR= 0.5
##$FTSIZE= 0
##$FT_mod= 4
##$GAMMA= 1
##$GB= 0.15
##$INTBC= 1
##$INTSCL= 1
##$ISEN= 128
##$LB= 0.24
##$LEV0= 0
##$LPBIN= 0
##$MAXI= 10000
##$MC2= 0
##$MEAN= 0
##$ME_mod= 0
##$MI= 1.114404
##$NCOEF= 0
##$NC_proc= 0
##$NLEV= 6
##$NOISF1= 3.799351
##$NOISF2= 2.8
##$NSP= 1
##$NTH_PI= 0
##$NZP= 0
##$OFFSET= 15.70392
##$PC= 1
##$PHC0= -25303.96
##$PHC1= 9.38731
##$PH_mod= 1
##$PKNL= yes
##$PPARMOD= 0
##$PSCAL= 0
##$PSIGN= 0
##$REVERSE= no
##$SF= 200.130013532006
##$SI= 16384
##$SIGF1= 3
##$SIGF2= 2
##$SINO= 400
##$SIOLD= 16384
##$SREGLST= <1H.CDCl3>
##$SSB= 0
##$STSI= 0
##$STSR= 0
##$SW_p= 3612.71676300578
##$SYMM= 0
##$S_DEV= 0
##$TDeff= 0
##$TDoff= 0
##$TI= <>
##$TILT= no
##$TM1= 0
##$TM2= 0
##$TOPLEV= 0
##$USERP1= <user>
##$USERP2= <user>
##$USERP3= <user>
##$USERP4= <user>
##$USERP5= <user>
##$WDW= 1
##$XDIM= 8192
##$YMAX_p= 0
##$YMIN_p= 0
$$ End of Bruker specific parameters
$$ ---------------------------------
##NTUPLES= NMR FID
##VAR_NAME=  TIME,          FID/REAL,        FID/IMAG
##SYMBOL=    X,             R,               I
##VAR_TYPE=  INDEPENDENT,   DEPENDENT,       DEPENDENT
##VAR_FORM=  AFFN,          ASDF,            ASDF
##VAR_DIM=   8192,          8192,            8192
##UNITS=     SECONDS,       ARBITRARY UNITS, ARBITRARY UNITS
##FACTOR=    0.0002768,     1,               1
##FIRST=     0,             0,               0
##LAST=      2.2672688,     0,               0
##MIN=       0,             -767453,         0
##MAX=       2.2672688,     760356,          0
$$ Real data points
##PAGE= N=1
##DATA TABLE= (X++(R..R)), XYDATA
$$ [...]
3199d156n106j464K633N633O668M775J601k223m857o137n155k234J857M763O186
3214B784N069K062j538m770o508n400k511J758M618O430M948K777k58m229o189
3229i57n448l114O28L918O172N740L214o03m134n919n858l452K0L332N589O086
3245E214L929O17l312n889n909m022k60L094O034N869L942O71k709n185o039m590
3261h545j221K084N299O078M602J233k394n035n933m546j603K008M933N930M888
3276G778K237j369m241o374n315k329J656M491N783M722K635j550m131n712n337
3291g056k819O15L815O148N700L067o92l729n669n212k834J38L546N348N496L369
3307I231J64l112n564o047l957l48L163N277N824L535L34k327m791n601m115r29
$$ plain form
3199 -4156 -9262 -10726 -8093 -2460 4208 8983 10584 8361 3504 -2633 -7788 -10022 -8165 -3402 2784
3214 2784 7853 9915 8377 3607 -2901 -8301 -10812 -9054 -4436 1994 6942 9719 9461 5232 -957
3229 -957 -6405 -9519 -8891 -4973 1199 6939 10153 9550 5416 -503 -6361 -9813 -9793 -6461 -872 5214
3245 5214 9143 9760 6448 559 -5350 -9372 -9632 -6538 -504 5365 9307 9978 7269 2084 -3955 -8545
3261 -8545 -9766 -7682 -2383 3695 8297 9530 7136 2101 -3832 -8378 -9981 -7973 -3040 2890 7778
3276 7778 10015 8646 4405 -1969 -7284 -9613 -7957 -3466 2317 7039 9674 8124 3993 -1719 -7056
3291 -7056 -9875 -9260 -5445 703 6403 9470 8778 5049 -620 -5832 -8666 -8528 -4982 366 5862 9231
3307 9231 9395 6283 719 -5328 -9285 -9633 -6470 -1193 4631 8166 8500 6173 1382 -4219 -8334 -9263
3323i263K439N182N812M625J276k586m993n903m306j335K077M309N321M618J618
3338H891j397m365o079m826j985J484M772N827M746K260j267m097n103m863k452
3353h454L78L807N590N244K715q20l930n618n216l091N65L750N105N040L024M82
3369H571l294m897n330l564k82L571N457M920L551K03k816n015n357l681j130
3384i093K661M607N272M198J239k344n277n440l770p93K199M400N351M327J480
3399I017j563m421n216m521k095J184M385N785M390J603j707l936m852m614k370
3414h931J079L670N167M963K758n85l701n391m900k604J041L723M688M283K832
3429H092O9k916n174n291l218j32K915M935N377L382J6l062m881m367l022n62
$$ plain form
3323 -9263 -6824 -1642 4170 8795 10071 7485 2492 -3411 -7717 -9052 -6975 -2666 2655 7273 8891
3338 8891 7494 3129 -2950 -7776 -9761 -8277 -3505 2322 7068 9328 8061 3964 -1139 -6002 -8454
3353 -8454 -8076 -4269 1321 6565 9280 8460 4530 -1088 -6304 -9395 -8830 -5080 25 5065 8089 8571
3369 8571 5277 380 -4950 -8514 -8796 -5225 232 5152 8703 8906 6090 1075 -4282 -7963 -9093
3384 -9093 -6432 -1825 3447 7645 8884 6540 1263 -4177 -7947 -8740 -6541 -2141 3210 7537 9017
3399 9017 7454 3033 -2183 -6704 -8799 -7615 -3230 2555 6945 8548 6841 2905 -1947 -6561 -8931
3414 -8931 -7852 -4182 985 5948 8706 8121 4420 -971 -5871 -8475 -7434 -3711 977 5260 8092
3429 8092 8161 5245 71 -5220 -8438 -8570 -5655 -720 4657 8039 8055 4993 112 -4255 -7277 -7839
3445g839J984M509N346L903J054k544m921n136l652j153K152M621M735L644R81
3460G684j525l712n060m429j887J847M299N432M305J424j341m007m695m249j999
3475g913J113L572M493M562K398n91l785n421m611k068P19L374M906M111K932
3490G791k78k870m796m548k922j7K810N147M911L081n73k958m625m091l260n35
3506g733K097M308M771L667M17k158m176n055l453p64K348M535M651L227J103
3521G785j471l776m677m231j750J765M035M784L820J347j521l705m876l582j597
3536g650J111L261M394M200K621o01l579n196l954j787P95L020M523M142J951
3551G251k84k924m479m282k612l33K680N031M554K593j87k920m091m044k661j73
$$ plain form
3445 -7839 -5855 -1346 4000 7903 8957 6413 1492 -3644 -7296 -8449 -6297 -1676 3059 6703 7684
3460 7684 6159 2447 -2613 -7042 -8929 -7082 -2783 2649 6954 8378 7037 3030 -1665 -5914 -7913
3475 -7913 -6800 -3228 1265 5827 8225 7634 3849 -1572 -6183 -8251 -7532 -4158 748 4859 7791
3490 7791 7513 4643 -153 -4701 -7623 -7640 -4830 317 5228 8309 7736 4778 153 -3938 -7198 -7733
3506 -7733 -5636 -1328 3443 7110 7527 5369 1193 -3862 -7315 -8079 -5731 -1196 3455 6682 7785
3521 7785 6314 2538 -2139 -6370 -8120 -6355 -2320 2464 6284 7631 6110 2405 -2471 -6053 -7650
3536 -7650 -6539 -3278 1116 5316 7937 7336 3757 -1439 -5393 -7180 -6385 -3365 1158 5300 7251
3551 7251 6967 4043 -436 -4718 -7330 -7663 -4983 48 4602 7195 7008 4088 -3 -4047 -6708 -6881
3567f881K024M199M550L062O39k167l970n009l488o09K410M337L958K914O87j271
3583E385l727m409l680j360J824L945M542M044J190j596l964m367l078j643J066
3598e828K893M371L878J926p58l322m950l641k116R41L224M391L987J843n83k713
3614C543l889l910k334r4K777M463M191K399l18k777m194m283k356M1K178L745
3630h18M131L064N82j925m327m525k958l96K543L977L777L118P86j705l964l905
3646b545l273j328J552L633M369L703Q34j697l758m160k884q95Q91K927M254L681
3662E304J772j008l086m388l944j709J112L098M428L377J406o26k637l628l864
3677d393k353Q6K886M155L926K505l85k552l941m118j976K43K018L541M146K382
$$ plain form
3567 -6881 -4857 -658 3892 6954 7593 5426 1456 -3553 -7041 -7650 -5240 -903 3055 5969 6656 5385
3583 5385 1658 -2751 -6431 -7791 -5967 -2022 2520 6564 7754 6158 2194 -2173 -5251 -6894 -5828
3598 -5828 -2935 1436 5314 7240 6482 3160 -1790 -5431 -7547 -6606 -3382 1009 4996 6839 6256 3543
3614 3543 -346 -4256 -6590 -6684 -3907 556 4747 7146 6828 4051 -143 -4426 -6782 -6741 -4563 -818
3630 -818 3313 6377 6959 5034 707 -3818 -6776 -7172 -4629 -652 3125 6243 7029 5324 1360 -2545
3646 -2545 -5818 -7146 -5594 -1961 2408 6111 6945 5248 1490 -2670 -5554 -6449 -5558 -2631 1623 5304
3662 5304 7076 6068 2982 -1406 -5350 -7059 -5947 -2849 1579 4956 6362 5736 3099 -529 -4393
3677 -4393 -6746 -6660 -3774 381 4307 6812 6427 3875 -66 -4184 -6160 -5917 -3899 -358 3788 6170
3693F170L99k077l816m263k769l80K158L674M110K710N34j965l334m073k636p37
3709f295J187L645L949L345J092j727l377l880l310j237J211L270L996L199J141
3724F209q14k927m133l605j605J057L149L916L327J797o35k772l937l285j785
3739f043L05K416L823L538K325j98k664l878l892j931K23K335L478L645K373L08
3755F163k186l596l657k592m06K155L356M166K576K42k029l307l685k744o40J455
3771d729L252M214K723O43j517l316l991k689p11J247L160L729K935J333q85l157
3787B241l777l245j666J057L100L542L225J611p80k728l756l326j865R14K507
3802b946L582L505J902l03k421l627l530j914J99K286L497L332K105Q8k144l461
$$ plain form
3693 6170 6569 4492 676 -3587 -6356 -6736 -4578 -904 3206 5916 6450 4485 1151 -2922 -5558 -6295
3709 -6295 -5108 -1463 2486 5831 6923 5196 1819 -2061 -5371 -6608 -5397 -2127 1869 5068 6209
3724 6209 5395 2468 -1665 -5270 -6875 -5818 -2669 1247 4574 6371 5736 2964 -973 -4258 -6043
3739 -6043 -5738 -3322 501 4039 6364 6166 3502 -376 -4268 -6199 -5976 -3641 -163 3482 5855 6163
3755 6163 3977 381 -3276 -5868 -6274 -4119 -763 3403 5979 6221 4192 885 -2800 -5544 -6184 -4729
3771 -4729 -1477 2737 5460 6103 4586 1270 -2721 -5410 -6121 -4874 -1714 2015 4950 6283 5398 2241
3787 2241 -1536 -4781 -6447 -5390 -2290 1252 4477 6088 5308 2580 -1176 -4502 -6367 -5453 -2946
3802 -2946 636 4141 6043 5740 3319 -308 -3838 -5752 -5553 -3267 230 3562 5667 5755 3611 150
3818A50l426k483q1K026L323L725J953O97j805l266l737k377n24J614L333L563
3834B685K644P64j580l225l590k787p65J203K935L620K586J325j029k919l640
3849a773l068j130J088K730L715K844J602p68k747l725k999j466M83K585L401
3864G72L280J686m47k473l714k985j951M62K361L487L078J910J12k088l379l335
3880c224k076j31J725L518L377K014L78k010l131l246k372l69J608K996L432K588
3896E077O90j560l234l378k428n43J373K834L064K837R42j233k857l452k662j125
3912e655R57K699L403L074R90q90k580l333k848j310O39K444L237L048J822o71
3928E026k198l483l002j872M80K438L121K865J634L1j825l199l222k097k62K137
$$ plain form
3818 150 -3276 -5759 -5840 -3814 -491 3234 5187 5884 4079 813 -2924 -5301 -5825 -4211 -878 2685
3834 2685 5329 6093 4513 1288 -2302 -5089 -5854 -4651 -1716 1904 4490 5815 4786 1867 -1773
3849 -1773 -4841 -5971 -4883 -2153 1562 4406 6008 5240 2493 -1232 -4231 -5697 -5214 -2629 772
3864 772 4052 5738 5291 2818 -896 -3881 -5832 -5370 -3009 478 3556 5466 5578 3490 111 -3224
3880 -3224 -5300 -5431 -3706 -188 3189 5203 5581 3571 440 -2806 -5178 -5547 -3939 -943 2489 5077
3896 5077 5767 4207 973 -2405 -4833 -5376 -4003 -1169 1895 4732 5674 4441 1584 -1868 -4530 -5655
3912 -5655 -4698 -1999 1404 4478 5468 4578 1998 -1335 -4183 -5493 -4854 -2410 827 3875 5697 5026
3928 5026 2828 -655 -3657 -5529 -5049 -2611 510 3375 5009 5040 3215 16 -3206 -5303 -5565 -3428
3944c428L397L194J940j59j613l217l163j790l29J690K899K912K454P00j520k997
3960I70l416k325o31J449K931K949K635O73j225k617l071k511j195Q76K884L376
3976A752K762Q73j206k366l047k837j136P92K339L094K650J408l98k178l084l241
3992c823j810R20K109L194K772J675l31j995k915k929j711j17J803L200K802K392
4008E236j78j819l113l064j748j50J525K544L108K244N98j560k727l403j985o25
4024e117J649K783L017K156N16j278k485k884k579q83P82K617L433K687O91r95
4040D110k613l008k573q11R68K228K728K661J233m54k083l303k746j329O34K182
4056b176K863K739J304m95j982k541k741j663J18J623K799L240J660N7k079k802
$$ plain form
3944 -3428 -31 3163 5103 4944 3331 114 -3049 -4839 -5168 -3478 -579 2333 4787 5487 3967 970
3960 970 -2446 -4771 -5402 -3953 -1022 1927 4562 5235 4010 1393 -1678 -4189 -5384 -4508 -1624 1752
3976 1752 4514 5387 4181 1815 -1232 -4069 -5205 -4413 -2074 1020 3670 5078 4680 2502 -582 -3823
3992 -3823 -5633 -4713 -2604 590 3362 5037 4706 2711 -204 -3133 -4844 -4961 -3158 42 2844 5236
4008 5236 5058 3239 126 -2938 -4686 -4836 -3311 -767 2341 4585 5183 3623 896 -2507 -4492 -5117
4024 -5117 -3468 -685 2332 4488 5004 3726 1241 -1643 -4222 -5105 -4323 -1706 1727 4414 5105 4110
4040 4110 1497 -1511 -4084 -4895 -3927 -1699 1029 3690 4923 4469 2386 -917 -3663 -4992 -4358 -2176
4056 -2176 687 3426 4730 4235 2253 -288 -3029 -4692 -4574 -2951 -152 3088 4748 4805 2726 -76
4072g6k882j606j31J690K634K802J959K58j289k748l045k184l38J475K700K844
4088B063K307K89j329k361k616k265o72Q32K327L063K220Q37p28k629k844k265
4104c771r52R24K421K562K207J335o54k264k561k790j221N86K225K877K560J249
4120D733o89j989k654k376j392L32J350L026K524J696l06j570k876k668j540n5
4136d454J768K836K413J610L12j496k489k847j838j93J274K707K559J770N25j218
4152C239k324k715k003o03J061K221K787K143O82j036k093k781k299n91P28K237
4168a347K428K410Q87o21k019k564k753r59O68K072K607K523R03n53j815k332
4184d65k548j245L40J410K715K707J389k56j657k537k357j604J43J338K624K402
$$ plain form
4072 -76 -2958 -4564 -4695 -3005 -371 2431 4390 4648 3359 611 -2434 -4618 -4956 -3481 -781 2063
4088 2063 4370 4659 3330 969 -1647 -3912 -4584 -3752 -1425 1638 3858 4695 3967 1338 -1506 -3771
4104 -3771 -4723 -3799 -1378 1184 3391 4726 4072 1808 -753 -3543 -4764 -4178 -1953 924 3484 4733
4120 4733 4044 2055 -599 -2975 -4367 -4035 -2685 341 2865 4561 4255 2685 -191 -2859 -4399 -4454
4136 -4454 -2686 150 2563 4173 4485 2989 500 -2347 -4185 -4378 -3104 -397 2162 3932 4457 3239
4152 3239 915 -1800 -3803 -4406 -3345 -1124 1663 3806 4488 3452 1359 -1422 -3721 -4312 -3584 -1347
4168 -1347 1081 3491 4378 3757 1738 -826 -3579 -4538 -3870 -1798 809 3332 4235 3682 1867 -465
4184 -465 -3013 -4258 -3918 -2508 207 2914 4303 4047 2390 -147 -2504 -4108 -3965 -2627 -3 2399
4200B399J595J69j410k524k613j679j23J313K146K587J746M10j000k362k243j909
4216c498n33P82K155K981J808O87j024k378k653j813o74P46K185K369K087Q03
4232D030p68j805k408k265r62N22K023K501K179J022n51j584k381k206j168J41
4248c680J529K711K094J239j56j358k822k256j460N19J255K332K223J549J23j579
4264B263j883k466j577j08J138K350K456J511J98j178k098k382j453p77R76K176
4280h54K132K194P24j268k034k486j824m82Q16J898K697J494R41p83j655k506
4296i96j843r56M37J877K346K036P59l54j667k256k261r20N10J440K402K031J071
4313C656p3j425k131k452j119J10J234K336J964J459M5j381k012k200j722k1J185
$$ plain form
4200 2399 3994 4163 2753 229 -2384 -4063 -4186 -2873 -727 1860 3606 4016 3016 654 -1589 -3498
4216 -3498 -4031 -3249 -1094 1887 3695 4382 3358 980 -1673 -3486 -4160 -3414 -1229 1140 3227 4030
4232 4030 3262 1457 -951 -3216 -4178 -3656 -1633 868 3047 4069 3518 1934 -447 -2653 -3821 -3680
4248 -3680 -2151 560 2654 3893 3737 2379 -443 -2699 -4159 -3640 -2385 -53 2170 3719 3842 2263
4264 2263 380 -2086 -3663 -3771 -2633 -283 2173 3684 3882 2704 606 -1776 -3229 -4006 -3030 -854
4280 -854 1278 3472 4196 2928 894 -1592 -3416 -3898 -3082 -1184 1513 3007 3948 3165 1510 -996
4296 -996 -2839 -3795 -3358 -1481 865 2901 3660 3306 1639 -617 -2878 -3798 -3288 -1848 554 2585 3656
4313 3656 3583 2158 27 -2425 -3544 -3434 -2200 136 2100 3559 3604 2223 211 -1989 -3711 -3732 -2547
4330b547K131K464J447P6j022k074k215j514l81Q33K159K175J884M03p63k124
4346I32k490j538p03P52K014K277J435Q91n92j894k064j953q44O14J732K112J969
4363B650J078m48j574k115k166j146N19J412K109J866J450j37j617k315j970j325
4379c729L94J367K077K142J276J01j283k127k156j440n6R84K336K104J444J29
4395C563j167k143j869j722l34R03J970K330J640L55n82j991k336j629o33R68
4411b677J850K126J853N92q69j588k151j792p04J10J907K044J819Q75n12j401
4427A482k145j878r12M15J528J876K198O66j84j042k098k112j093J02J293J957
4443E3K189R69R8j428j996j766j423j17J131J872K213J279K08r92j848k193j240
$$ plain form
4330 -2547 -416 2048 3495 3571 2549 475 -1740 -3254 -3635 -2802 -643 1532 3416 3819 3056 932
4346 932 -1558 -3096 -3799 -3047 -1033 1244 2679 3570 2978 1084 -980 -2933 -3777 -3163 -1431 681 2650
4363 2650 3728 3280 1706 -409 -2575 -3721 -3202 -1790 319 2185 3635 3498 1881 -434 -2404 -3729
4379 -3729 -3335 -1968 109 2251 3527 3628 2345 218 -1938 -3378 -3434 -2450 -114 1990 3434 3563
4395 3563 2396 253 -1616 -3338 -3672 -2769 -799 1531 3171 3526 2944 953 -1383 -3012 -3645 -2677
4411 -2677 -827 1299 3152 3744 2875 1287 -864 -2656 -3360 -3250 -1343 701 2520 3395 2883 1482
4427 1482 -663 -2541 -3453 -3038 -1510 366 2564 3230 3046 2004 -94 -2206 -3299 -3197 -1904 53
4443 53 2242 3211 3309 1881 -115 -1881 -3304 -3421 -2290 -418 1795 3074 3282 2290 442 -1751 -2991
4460b991l10Q92J727K047J536O31q74k094j986j406o02P69J623K102J687O24o12
4477B763j625j792j858p91N86J422K126J814Q17n23j503j993j875q32K38J567
4493a459J793J957P38M7j383j930k065j015Q0J303J982K142R24J53j218k098j493
4510a542j421k09J056J879J893J598j58r60j825j943j215l55R57J577J843J625
4526B800P24r83j732k080j558j94N65J631J896J683N62o83j705j948j633n95M16
4543b834J397K026J662P82m22j469j859j369q03O2J295J937J991O49k54j083k065
4560c57j591j142K23J346J641J694R59K06j011j792j907j360j17J338J533J997
4576A660J440J84j064j801j846j377r1Q47J502J931J134L96n47j735k073j228
$$ plain form
4460 -2991 -3301 -2409 -682 1365 2901 3532 2658 564 -1422 -2828 -3430 -2661 -1038 1064 2751 3375 2763
4477 2763 1138 -654 -2512 -3303 -2717 -1295 831 2645 3462 2939 1436 -557 -2432 -3264 -3026 -1459
4493 -1459 334 2291 3029 3076 1693 -237 -2302 -3317 -3237 -1934 48 2190 3114 3267 2049 -49 -1542
4510 -1542 -2963 -3172 -2116 -237 1656 3254 3096 2136 311 -1632 -2847 -3202 -2245 -668 1175 2800
4526 2800 3524 2541 809 -1271 -2829 -3023 -2458 -827 1069 2752 3314 2631 926 -1022 -2655 -3250 -2834
4543 -2834 -1437 589 2251 3033 2611 1142 -717 -2086 -2889 -2827 -1532 405 2396 3045 2791 1708 -357
4560 -357 -1948 -3090 -2867 -1521 120 1814 2773 2979 1968 176 -1731 -3091 -3208 -1870 -337 1660
4576 1660 3100 3284 2220 419 -1427 -2804 -2895 -2048 -546 1385 2519 2915 2368 633 -1440 -2668
4592b668n62P41J772J844J492L16m96j322j850j622o68M88J683J603J586Q05o91
4609B451j234j893j642p41M26J447J557J490Q54J76j170j865j871q84P0J091J908
4626A70J697J084q0j150j614j562j041j30M87J813J780J170L34j005j863j502
4642a412j404p1P06J803J697J152M19p29j314j849j479m04N49J503J846J504L54
4659B871m86j539j775j534l80K94J359J758J497Q73m05j355j953j117j003N65
4675b330J171J378J783P52o6j143j595j868r34K40Q52J942J624R38p5j346j092
4692B31j649j372J01J040J400J806R15L79q10j686j650j298p0O95J641J593J054
4709B320L85r33j049j583j544m86M00J731J439J708N04o23j336j700j338m97M95
$$ plain form
4592 -2668 -3230 -2489 -717 1127 2619 2935 2439 1117 -733 -2355 -3023 -2535 -852 751 2337 3142 2451
4609 2451 1217 -676 -2318 -3059 -2633 -1186 371 1861 2715 2891 1721 -144 -2015 -2899 -2829 -1738 170
4626 170 1867 2951 2871 1721 107 -1455 -2496 -2626 -2139 -326 1454 2624 2958 1953 90 -1412
4642 -1412 -2816 -2887 -2181 -378 1319 2471 2890 2161 847 -1002 -2481 -2885 -2336 -833 1013 2517 2871
4659 2871 2385 846 -929 -2463 -2843 -2549 -1190 568 2065 2938 2533 1178 -775 -1892 -2895 -2330
4675 -2330 -1159 219 2002 2754 2688 1545 -50 -1918 -2852 -2612 -1760 182 1806 2744 2669 1323 231
4692 231 -1418 -2790 -2689 -1649 -249 1557 2472 2851 2041 355 -1295 -2593 -2663 -1968 -327 1266 2320
4709 2320 2705 1772 723 -860 -2404 -2890 -2490 -759 680 2388 2892 2269 933 -767 -2105 -2602 -2107
4726b107J245J379J605Q54n72j405j647j499p21L69J314J665J523N91k82j069
4742A243j505j461n46k37J023J658J730M77L51j177j665j525r12J3Q74J418J367
4759A126J207K09o25j582j687j173O4N58J727J354J143L39m24j687j620j127l07
4776b505L53J414J555J275N57n53j361j472j276m16K25J271J535J409P45l11j296
4793A149j404j583o48K34J047J498J437P97l45p65j501j664m88l39J111J582J418
4810A536Q77k13p43j480j619p60n5R23J525J474P70L03p66j566j509j087K9N78
4828a783J281J464J227K5n49j007j727j117l22N11J238J718R24M85l80j125j686
4845h23j122m07M72Q41J742J234L52k69j044j318j556m81J36J120J448J539O91
$$ plain form
4726 -2107 -862 517 2122 2976 2404 999 -648 -2147 -2868 -2499 -1185 480 2003 2594 2312 1243
4742 1243 -262 -1723 -2269 -2506 -1483 175 1905 2382 2733 1556 -109 -1634 -2546 -2533 -1659 -241 1126
4759 1126 2333 2542 1917 335 -1352 -2525 -2461 -1903 -176 1178 2321 2660 2236 549 -1071 -2198 -2505
4776 -2505 -2152 -738 817 2092 2649 2096 735 -737 -2013 -2429 -2204 -933 602 2011 2756 2445 1149
4793 1149 -255 -1838 -2486 -2252 -1205 293 1730 2527 2182 1417 -84 -1748 -2236 -2575 -1464 118 1536
4810 1536 2413 2200 1457 -23 -1642 -2402 -2457 -1534 -9 1465 2235 2538 1772 206 -1303 -2390 -2361 -1783
4828 -1783 -502 962 2189 2214 1665 658 -1069 -2186 -2508 -1997 -759 959 1883 2368 1988 863 -823
4845 -823 -1945 -2352 -1880 -1039 703 1937 2289 2020 976 -342 -1898 -2379 -2243 -1123 325 1864 2555
4862B555l48r15j367j481o59n9R99J480J304P28L9p57j594j480q71P8P48J370
4880b30J347J006L86r18j387j248j206j58O63J323J542R64K78p80r33j706q88
4897a945l94L96J267J476J061M68n98j034j323j192l90J95J166J349J323M46n
4914B266j279j514j344m62L44Q67J476J108O79j31j000j197j296p82P8P71J479
4931F3J274P58K6o22j362j397j085J09R38R36J363J184J82o80j315j474q81l26
4949b309P69J027J586P54M14l87j330j125j349n50P50J008J528J100K33j80j283
4966F56j200j175n53J91J137J575P42P34m8r98j421j420n27L57Q84J127J395P23
4984B179J7j171j162r97q95O3O28J349J414O56M3p94j224j273q33j84R19J052
$$ plain form
4862 2555 2207 1292 -75 -1556 -2215 -2274 -1275 205 1509 2237 2276 1519 -75 -1555 -2426 -2348 -1600 -230
4880 -230 1117 2123 2509 1591 204 -1044 -2250 -2408 -1745 -422 1120 2084 2362 1582 649 -1057 -1945
4897 -1945 -2339 -1943 -676 800 1861 2329 1731 697 -626 -1818 -2208 -2013 -847 502 1825 2271 2266
4914 2266 987 -527 -1871 -2333 -1989 -1122 354 1462 2141 2010 1010 -187 -1483 -2265 -2187 -1416 63
4931 63 1337 2095 2121 1499 137 -1260 -2345 -2236 -1298 -362 1001 2185 2367 1687 372 -1102 -1983 -2309
4949 -2309 -1540 -513 1073 1827 2241 1854 524 -601 -1950 -2500 -1750 -742 786 1886 2119 1939 656
4966 656 -544 -1719 -2272 -2081 -944 631 1373 2107 2059 1061 -360 -1780 -2307 -1950 -1066 61 1456 2179
4984 2179 2196 1025 -137 -1134 -2029 -1966 -1338 11 1425 2081 2124 1330 106 -1167 -2000 -2184 -1265 -213
5002b13J228P29M65m93j356j426q31m5L53J246J349J015J10m01j203j163j129
5019a765k23L31R16J283J262M63l72j096j299r69o32M94P36J281J333M30l58p62
5037A053j310j148o55K24P29J288J024Q65J6j002j323j150n71k36O44J401J168
5054A017O96L15o88j121j170j035j00P28R91J435Q61K65n68j103j263j046l77
5071b163N25J093J313R49M56m75j126j359q86l34M16R12J263J078K18kj082j280
5089d84j052m50K34Q47J295R86O60k39r88r54j318o40J6R07J234J217Q94o9q78
5108A218j391j040m87k69R07J015J268Q37j56n84j115j401p04q3M83J226J183
5125I07R28J36l31j148j106j032n79O83J085J390R70J38l34j006j244j096k34
$$ plain form
5002 -213 1015 1744 2209 1716 360 -1066 -1897 -1942 -1589 -343 1006 2021 2131 1730 527 -636 -1765
5019 -1765 -1988 -1657 -741 542 1804 2267 1895 799 -500 -1469 -2101 -1607 -871 410 1743 2173 1815 1053
5037 1053 -257 -1405 -2060 -1836 -1107 181 1205 2070 2086 1084 -239 -1389 -1960 -2196 -1552 -151 1017
5054 1017 1713 2028 1340 219 -951 -1986 -2086 -1358 -367 1068 1929 2194 1626 523 -740 -1786 -2163
5071 -2163 -1638 -545 768 1717 2173 1698 572 -787 -1673 -2007 -1591 -679 584 1662 1880 1878 796 -484
5089 -484 -1536 -1986 -1752 -905 390 1376 2036 1797 809 -145 -1463 -2103 -2087 -1180 54 1271 2165 2096 1218
5108 1218 -173 -1213 -1700 -1969 -1062 -47 1221 2058 1902 1318 203 -1198 -1902 -1985 -1502 -276 907
5125 907 1835 1971 1640 492 -614 -1646 -2225 -1542 -457 933 1903 2041 1707 701 -543 -1639 -1873
5142a873L25Q58J136J069M23j22j233r78j082o33K62J029J337Q83N23j6p96j370
5160b58j059q48K12Q29J333R15O45J18q78r11j255o81O5N61J017J184P60K31n83
5179A397j046j160q10k10M65J260R47J069O0o19p26j339q39n65M02J306J246R65
5197A803Q5l75q47j338p64m16J89J142J172P98N23k43q78j217j056m01k4R52J188
5216B93R01M32J56q97j127j052n10j72J161Q74J295O99n2o56j471q48q09nN37
5235a251R68J259P44J74n86j023j256p61j32M53J089J145O03L40l35r32j136r26
5253a563l54O50P25J177R74M59n63p72j444p55l64J78P83J285J106L36j62q22
5271H74j268r05n85J20J099R32J032O07l40n11j226r77n11k16R46J093J043P20
$$ plain form
5142 -1873 -1548 -690 446 1515 1938 1816 583 -395 -1477 -2110 -1848 -819 518 1401 1924 1908 1112 -258
5160 -258 -1317 -2165 -1953 -1124 209 1124 1769 1887 1009 98 -1157 -1838 -1773 -1212 -195 989 1749 1980 1397
5179 1397 351 -809 -1619 -1829 -1364 -104 843 1912 1972 1353 627 -712 -1551 -2116 -1714 -408 838 1803
5197 1803 1888 1513 666 -672 -1436 -1852 -1663 -521 651 1449 1972 1729 851 -366 -1422 -1823 -1847 -895 293
5216 293 1194 1626 1782 885 -242 -1294 -1804 -1976 -815 59 1354 2053 2001 1345 -126 -974 -1783 -1788 -1251
5235 -1251 -283 976 1720 1894 1308 285 -971 -1732 -1864 -1411 -322 823 1426 1766 1431 499 -637 -1563
5253 -1563 -1917 -1267 -542 635 1609 2068 1505 733 -711 -1466 -1830 -1652 -869 416 1522 1858 1696 874
5271 874 -394 -1299 -1884 -1764 -665 267 1299 1906 1566 1055 -171 -1148 -1659 -1875 -929 164 1207 1927
5289A927j62p12j268q47o71j6N73R00J339Q42k02k74j002j119j051k60P24R17
5307c62J229R65k0k61j108j188n31p03M62R48J223Q49M11n71o09j477p59l21J78
5326a645R39J172Q11M96l1r24j134j065l36O9Q71J166P96N16j26o15j106j272
5344a418k77j00O91J243Q45P44J45p09j130j111n82j46O17J104J077O76K4l57
5362A336r21j205r54oN08Q94J116Q35L03m22j087q58j046k37K27R10J246P91M23
5381A853l90q71j089j038j69P9P91J168J084K38P8q71j100j173l61N2P11J298
5399B90R73M00o5q83q33j121l67J3O22J209R30N80K94j000j111j018p03k3N65
5418a248J074J049Q71J03n25j185j018q38pN77Q01J147Q20J86n31q22j317p08
$$ plain form
5289 1927 1765 1053 -215 -1062 -1733 -1749 -1176 -276 1063 1905 1703 1429 427 -692 -1743 -2003 -1279 -362
5307 -362 867 1832 1812 1551 443 -745 -1276 -1979 -1517 -569 654 1503 1914 1343 734 -743 -1502 -1823 -1645
5326 -1645 -706 466 1277 1773 1742 818 -316 -1381 -1717 -1648 -777 389 1185 1701 1575 960 -146 -1418
5344 -1418 -1695 -1795 -1104 139 984 1728 1873 1164 34 -1077 -1659 -1805 -1188 -84 993 1669 1693 1336
5362 1336 415 -790 -1744 -1750 -1242 -348 768 1603 1906 1484 397 -461 -1507 -1744 -1517 -607 639 1430 1853
5381 1853 1463 592 -497 -1535 -1704 -1625 -834 334 1418 1656 1734 863 -237 -1410 -1771 -1719 -1008 290
5399 290 1263 1663 1598 715 -118 -1239 -1606 -1593 -971 238 1168 1748 2042 1042 -69 -1087 -1790 -1813 -1248
5418 -1248 -174 875 1746 1849 1324 139 -879 -1717 -1724 -1147 -346 801 1621 1807 1276 454 -863 -1571
5436a571k99M59R53J035Q79K57j79p44j268r17m29M33P55J081Q28M46p5q00j161
5455c17j044m32K32P39J121P98P48k77p67r01j059n80K64L32J117J129Q12k22
5473A693n69j069j014q67K1N84J163J078O04J1k97j191r20q06j38M40R39J080
5491G42P20L15o09p13j108o14m09L62Q96J139O57O70p82p73j287o81j69Q7Q44
5510g13J189P33L92o1o49j328r18l40R3P53J077J192L15k62o81q13j039q35J78
5529a717Q55Q81R06P74j7n88j192p77q56K0M72J252R50M55M08m34j330q72p50
5548a560j66M21J021R72O80L88n95r48q84q14m4K23P54R87J035K12k36p98j152
5567e04p09n57K77P89J145R04L15k31q02q97j036l84J96R90P74J107L14k22o11
$$ plain form
5436 -1571 -1870 -1411 -458 577 1456 1713 1534 790 -478 -1395 -1824 -1391 -636 445 1273 1719 1644 844 -317
5455 -317 -1361 -1793 -1561 -822 299 1097 1845 1568 801 -100 -1159 -1739 -1475 -1143 -26 1103 1915 1693
5473 1693 1124 55 -959 -1826 -1805 -1221 -58 1020 1624 1635 1338 147 -773 -1579 -1717 -1277 -338 742
5491 742 1462 1777 1168 455 -653 -1267 -1676 -1314 -418 721 1378 2048 1266 493 -794 -1475 -1644 -1557 -713
5510 -713 476 1209 1601 1540 891 -437 -1355 -1695 -1602 -849 228 1420 1735 1473 792 -21 -1060 -1895 -1717
5529 -1717 -862 19 925 1699 1682 1094 -98 -875 -1731 -1711 -1239 13 963 1418 1826 1392 62 -810 -1560
5548 -1560 -1726 -1305 -284 688 1368 1756 1161 213 -671 -1485 -1529 -1306 -552 435 1470 1682 1446 648 -504
5567 -504 -1213 -1770 -1493 -704 441 1345 1660 1429 627 -270 -1306 -1690 -1494 -504 270 1377 1691 1469 858
5586H58q88j164l28k52R49J079R20N03P9o67j129r11p97K60L37J085J084N70q9
5605A499n76q62j114p76K80M38P97J061Q97Q5m31r49j021p32j91L50P25R67J026
5624A473K43l83q94r99p00n33M46P98J059P71L18M4r20j084r50n27K39Q03J051
5643B55J085L41k98o70r93p07o43k5Q43R61P66N68k4m08r70j026p10pP08J031
5663G7R57N04J94m90j209q53p16j69M71Q71J212P41K26o21r81r14q62j85L26P71
5683f50J161R31J86l46q46r78r32l07N05P05R05J032M04m05p55j153o55n50M55
5702a293M77J082R17M13mo86j091j075l84L1O89P27J243O89j2q22r23j095o15
5721a732Q1O53J019P67O55L18o19j057r45n91k10M40R69J004Q00R0m31r14r21
$$ plain form
5586 858 -30 -1194 -1522 -1774 -825 254 1174 1677 1756 1089 -40 -951 -1748 -1488 -1151 -66 1018 1588 1499
5605 1499 923 61 -1053 -1829 -1549 -1111 -314 747 1644 1729 1298 349 -672 -1404 -1595 -1245 -520 447 1473
5624 1473 1716 1333 439 -560 -1260 -1793 -1347 -549 510 1281 1599 1643 723 -361 -1311 -1838 -1599 -796 255
5643 255 1340 1681 1383 713 -280 -987 -1630 -1655 -812 149 915 1483 1459 1051 81 -945 -1655 -1662 -954 77
5663 77 1034 1538 1732 1242 33 -820 -1536 -1705 -1234 -363 849 1590 1816 1195 214 -700 -1562 -1747 -1421 -650
5683 -650 511 1442 1628 1282 436 -542 -1474 -1781 -1276 -571 334 1366 1770 1365 610 -543 -1198 -1748 -1293
5702 -1293 -816 266 1183 1596 1592 906 -185 -1260 -1644 -1613 -924 -197 1046 1735 1723 901 -22 -1117 -1732
5721 -1732 -1651 -998 21 788 1443 1761 1142 85 -860 -1451 -1661 -1221 -252 752 1552 1642 1211 297 -624
5740f24q48k60N38O98J085P14J31k00q28r58p66l69L72Q71J044P35J95j79o97
5759F54j103q52k48R6P60R24J038N01j43o50j402q58m83K78O21Q12J051O10l5
5778A571m88j245p76p15J09O51Q73J028P97k83m45r22r30o21l27O18R67J045N73
5797A480K43o13p32j009q92j03L51R91Q43R39J12k35j021j018n71m67K05P76J180
5816D59P70N18l99q69j009q18k60l6J011J109O20M71r6n26r70j104m27j03Q69
5835g90J000Q45Q24l61q05o23j244n72L59O10R45P95O13L2p50r69r61m13q9L93
5855a161J281R21N69L7m73j034p61q20k43L64R30J016O35L98m01p41j238o98j35
5874a554K02R03J047O31L29k7j037j084o95l99K38P22J147P26O23l90l81j298
$$ plain form
5740 -624 -1472 -1732 -1194 -496 589 1303 1434 1234 406 -552 -1318 -1687 -1315 -444 600 1335 1530 1351 654
5759 654 -449 -1301 -1549 -1453 -693 231 1269 1770 1627 977 -425 -1283 -1766 -1488 -867 -55 996 1606 1571
5778 1571 1083 -162 -938 -1653 -1544 -893 -20 1008 1805 1522 1077 155 -775 -1396 -1723 -1105 -138 907 1480
5797 1480 1723 1110 378 -631 -1523 -1626 -1275 -284 559 1498 1610 1375 354 -664 -1235 -1702 -1497 -721 459
5816 459 1229 1747 1348 479 -530 -1348 -1608 -1644 -633 476 1096 1567 1471 945 -25 -1129 -1556 -1659 -790
5835 -790 210 1055 1879 1518 713 90 -1154 -1726 -1367 -757 188 983 1596 1628 878 -91 -1052 -1465 -1554 -1161
5855 -1161 120 1041 1610 1647 1174 140 -621 -1441 -1684 -1320 -390 626 1261 1659 1258 517 -721 -1419 -1554
5874 -1554 -1352 -449 598 1229 1558 1531 494 -590 -1285 -1684 -1446 -724 423 1149 1772 1382 1001 -297
5892b97o76o85J81O83R52J119K10Q0p48r67q79n58nQ03P54R10P18R4p45q87j060
5913a003n76j36N76Q49J379L94J07p23p92q52p10k5L90R17Q71P73O7k37j083q40
5933f54o17k84K38P65J069O64O01k87q62j147q76k65K93Q18Q85P19N62k56p88
5952E78j048o61m41K27O23Q75R32O28j87o61r80q74p31J83Q21O38J074O92q3p85
5972H20p18j128n53J03L70J239P51N28J37m15r82q95p75oK97J156Q15N79L58o11
5992A070p86r37p40l43O16P71R95O67L82k13r71r60q39k27J87O26J167Q66M44
6011A775l76j009q71p84j39J3P63R09J006J08J83p24j076r18o62K12P43P62J208
6030A123N99l84m90q24r39q34L92L06J122J056M10l01k23r77j058n06l3L81J107
$$ plain form
5892 -297 -973 -1658 -1477 -794 158 1277 1487 1567 819 -148 -1027 -1585 -1590 -787 -33 877 1595 1689 944 57 -1003
5913 -1003 -1579 -1715 -1139 -290 1089 1483 1590 867 75 -777 -1487 -1512 -1122 -205 666 1439 1506 1269 186 -654
5933 -654 -1271 -1555 -1317 -552 517 1181 1782 1495 633 -514 -1390 -1655 -1362 -544 341 1060 1622 1366 578
5952 578 -470 -1131 -1572 -1345 -722 153 1085 1713 1526 865 -115 -989 -1720 -1537 -716 -78 996 1688 1605 820
5972 820 102 -1026 -1579 -1476 -1106 133 884 1412 1549 1134 152 -743 -1518 -1524 -1227 -71 744 1323 1681 1070
5992 1070 284 -653 -1393 -1736 -1120 -349 646 1313 1695 1482 511 -449 -1288 -1515 -1328 -702 465 1331 1775
6011 1775 1399 390 -481 -1265 -1404 -1391 -628 281 1287 1395 1578 854 -222 -1140 -1802 -1590 -847 -85 1123
6030 1123 1722 1338 848 24 -915 -1749 -1357 -1051 71 1127 1537 1236 1013 36 -1022 -1528 -1561 -1180 -73
6049g3Q85Q31M3o86o70j096p77j52M41P58J092P61K95j02j254j057o94k89M93
6068a251P98J024P70L31k12q41r71r31k31J48Q40P42J249K69k53q30j028q94m55
6087a726K03O62Q87Q95P10j51o75q00r20o32l7N25J049R42O13J36o80j062r67
6106a028m06k68M50R59R68O69K14o02q28j005o11k24L21J261Q64O19L87l15j090
6125C35r00q58l46M50P09J379P36J16j99p93j111p55m36K22P22J159O64M88n3
6144A529n93j119j129j70R6P30Q64Q86M97p8p65j014r59l25N5N20J048Q79O62
6163A614o3o04r04r68p07j84P18J082J087N82mn40r26q08r08o0N07J034R25M68
6183A341M11n48r31q37r32n2K65Q72R00J016R2p7j103p00j062m47N11P44R79Q72
$$ plain form
6049 -73 812 1643 1686 1000 330 -766 -1543 -1695 -1254 -496 596 1357 1652 1550 296 -761 -1455 -1744 -1251
6068 -1251 -453 571 1341 1672 1460 619 -352 -1283 -1514 -1366 -526 216 1465 1734 1481 651 -377 -1271 -1726
6087 -1726 -1523 -861 26 921 1631 1480 805 5 -915 -1547 -1584 -1059 -10 932 1545 1681 1001 -61 -1028
6106 -1028 -1434 -1702 -1252 -293 675 1344 1558 956 128 -877 -1488 -1712 -1391 -130 734 1353 1740 1425 335
6125 335 -565 -1423 -1769 -1319 -610 769 1505 1621 1422 629 -482 -1237 -1673 -1451 -729 430 1094 1582 1529
6144 1529 936 -183 -1312 -1482 -1386 -656 208 1094 1591 1513 748 -266 -1225 -1550 -1495 -975 73 952 1614
6163 1614 1551 947 43 -925 -1632 -1816 -1098 -16 1071 1653 1649 1109 183 -625 -1533 -1593 -1086 -52 873 1341
6183 1341 1752 1204 273 -564 -1496 -1548 -1283 -411 489 1505 1597 1520 417 -283 -1345 -1792 -1281 -537 442 1314
6203A314J10J6p15j105q36o19K50Q91J075Q14L09m7p47j042o51o72K91M30Q19
6222a15J260N36j18n71r54j190n65M3O43R73R91P28q4n75q42r70p97j84P11R42
6242a38R73O73K25o29p41j199n52k23N59P11R35Q35K12m65n97j212p48j49K57
6261a273Q94J097P65L08m54r07q67r04k79J98Q23Q86R26M46l01o64r18r72n62
6280a758M70O02R41O88P90k75n33j202q92m69O6Q66P84R42O22o1q07o58q69p31
6300a484k56O68J029Q45O87j6l05q85j012p42j38M91R35Q56N33M31k59r53j096
6319f71q53j01M36O95J235N09M70m93p90j017m96m75J01R34J076N51M95p4r06
6338F26j063p39o04N05P09P27R04O82m44l93j039q09o65K49L46J034R76L80J9
$$ plain form
6203 1314 1424 1440 725 -380 -1216 -1835 -1585 -694 381 1195 1504 1457 710 -332 -983 -1655 -1364 -934 -115
6222 -115 1145 1681 1563 992 38 -1152 -1717 -1674 -1031 -58 933 1661 1577 1002 160 -810 -1607 -1791 -1080 -138
6242 -138 835 1508 1733 1104 363 -836 -1388 -1611 -1052 -341 594 1429 1641 1176 579 -633 -1381 -1530 -1273
6261 -1273 -379 718 1483 1791 1337 430 -437 -1341 -1620 -1422 -599 287 1213 1659 1358 694 -224 -1196 -1758
6280 -1758 -1288 -686 255 943 1733 1458 925 -277 -1169 -1638 -1572 -706 78 1020 1642 1581 774 116 -753 -1484
6300 -1484 -1740 -1072 -43 802 1489 1473 1168 283 -729 -1471 -1609 -1118 -183 673 1206 1637 1378 425 -671
6319 -671 -1524 -1625 -1189 -494 741 1250 1720 1227 437 -580 -1076 -1551 -1450 -516 560 1111 1606 1532 626
6338 626 -437 -1176 -1780 -1275 -566 161 1065 1747 1303 910 -129 -938 -1603 -1354 -1008 26 1002 1382 1401
6357A401n18r07r85n37jN89R77J044L91O0m95q49q11p22j80M76J036P37P05K33
6377A644m13p18j230n68k62L95P53R70J038Q2n18o97r71q93m31N82P66J027P85
6396A341N1M4o36j027r88n51K31N92J107R70N41k55o13j143o52o02K06N07J114
6415B37R84K91j57m41r85q74n29n3N80P98J045M99K74n81r92p82q73j04O35Q46
6435a82R66Q16K6n13p67r58p71k77N73P37J067O49L50j80j250j183m26k47J58
6454a412R78O75J078L76l16p00j141q92q5Q6O69R79Q23L88p3o09j137q44n44L98
6474a303N23R87P44O73q8o27j081o30p58J67L08Q02J177O28q6m10j064q52o56
6493a546n8O00P75J208L94K33o93o17q88o66m09N63O43J216P40J86m93p38j114
$$ plain form
6357 1401 883 -24 -1009 -1546 -1547 -958 19 1063 1454 1514 1019 170 -641 -1363 -1543 -1067 -31 706 1411 1644
6377 1644 1231 513 -717 -1285 -1547 -1152 -399 571 1609 1691 1173 476 -495 -1388 -1819 -1237 -471 556 1341
6396 1341 1392 1436 800 -227 -1215 -1766 -1535 -943 164 1134 1675 1420 807 -336 -988 -1590 -1384 -877 237
6415 237 1221 1512 1355 914 -71 -945 -1474 -1527 -947 -149 896 1395 1669 1088 96 -686 -1559 -1663 -1028 -182
6435 -182 784 1600 1626 1113 346 -612 -1383 -1660 -1087 -350 717 1366 1716 1536 286 -897 -1323 -1570 -1412
6454 -1412 -434 241 1319 1695 1379 679 -462 -1354 -1439 -1353 -684 295 1118 1506 1433 824 -313 -1157 -1701 -1303
6474 -1303 -780 207 951 1624 1536 909 -172 -802 -1560 -1393 -1085 -283 894 1522 1436 1026 -38 -890 -1546
6493 -1546 -1604 -1004 -229 979 1373 1606 913 296 -592 -1258 -1667 -1104 -461 755 1495 1681 1188 450 -664
6512f64o63j79J60R71R77P36J22r0j010p82r69k60L21N29J159Q17L37k05n30q31
6532e4j300j38n3Q83R62P37M48j9m35j303o06o38J85M95R87R24M04l5n03r30j065
6553a054n06j1O83R47P86M98J11o05q35r58m98k03N87P75Q46Q83J37l50q79j108
6573g54q55J02L59Q40J052O06K18l89n41j163p76l53M64O71R68P50L41j90q39
6592E11p97p53m99J8J006P19P75O56l77o14r39r71k16K61N30P93Q12N62j30o95
6612F52q08o74m95k66O19R28Q76P23j83m88p76r80m48p6K51R12Q45Q47N6n18o01
6633C96j099o62k57O23Q35O16Q31L32m14q01r59p93l1P3P55R78O80L37J6p60q86
6654a90j042k73J75P22R15R11J48K3r79o35p98m81J91Q06P98P57K49J96p71q32
$$ plain form
6512 -664 -1327 -1506 -1346 -375 602 1338 1460 1370 360 -422 -1391 -1651 -1330 -801 358 1175 1512 1307 777 -54
6532 -54 -1354 -1492 -1545 -662 300 1037 1485 1466 1031 -272 -878 -1516 -1331 -836 151 1075 1479 1444 941 11 -1054
6553 -1054 -1560 -1571 -888 59 845 1343 1454 849 14 -944 -1442 -1645 -1058 -283 563 1446 1583 1233 354 -754
6573 -754 -1609 -1507 -1148 -308 744 1350 1568 1179 638 -525 -1301 -1654 -1190 -519 449 1199 1540 1350 511
6592 511 -286 -1039 -1538 -1520 -514 205 980 1636 1259 645 -294 -1265 -1481 -1220 -690 103 915 1477 1347 652
6612 652 -156 -830 -1325 -1591 -972 -44 832 1555 1372 884 108 -872 -1320 -1396 -1145 -233 612 1459 1515 997 396
6633 396 -703 -1365 -1622 -999 -164 452 1283 1615 1201 400 -559 -1352 -1383 -1310 -555 423 1103 1440 1456 696 -190
6654 -190 -1232 -1505 -1330 -608 307 1218 1366 1389 410 -225 -1023 -1504 -1313 -507 291 1048 1297 1493 722 -110
6674a10o87p35J77O14Q52Q67L33j19k02q43j068m29k06N66O96J188L21L98m27
6693A186j009r21m39k69K16J060R35M71L36n19o75r43p24k10M02P33Q49P47L77
6712A603l11o80r67p09n19K88J041O03N98N33j16o26r17j053n68M22O52Q35Q82
6731I91L53l1o67r24n91p18L57L90J012Q66K73P7o28m32j218n32j23Q44M69Q56
6751F24Q33P8m81j012n54p53j78N08P81P79P46R5k92q04r39o87k4P4Q31Q93P58
6772A276L30m53q30q14p65j16K59N80Q82P19M49m27p04q60n61n12K95O62O68J034
6792A112K68K0q14q50p07l34K06M31J034N40N51Pp55r16p27m50j2M16P82Q04O51
6813A257J28l77q84q08n94K6L48Q93O82N72J57l07r70p64o75k78O31P71P87O41
$$ plain form
6674 -110 -797 -1532 -1355 -741 111 978 1311 1192 990 147 -921 -1350 -1556 -990 -294 894 1215 1613 1186
6693 1186 177 -744 -1183 -1452 -1236 -176 759 1230 1566 1047 372 -571 -1295 -1505 -1103 -370 479 1226 1603
6712 1603 1292 612 -355 -1064 -1583 -1295 -254 349 947 1480 1364 738 -179 -1232 -1800 -1378 -726 109 991
6731 991 1344 1313 646 -278 -869 -1587 -1230 -840 172 1038 1311 1388 760 328 -890 -1422 -1545 -701 -232 624
6751 624 1457 1535 1054 42 -512 -1265 -1443 -935 -154 625 1371 1466 1174 370 -569 -1256 -1280 -1206 -375 518 1276
6772 1276 1606 1153 323 -491 -1256 -1372 -1113 -533 349 1068 1517 1090 386 -474 -1035 -1547 -1252 -590 78 1112
6792 1112 1380 1400 586 -264 -971 -1305 -1099 -668 366 906 1457 1464 709 -207 -934 -1384 -1396 -980 -198 606 1257
6813 1257 1385 1008 124 -684 -1278 -1252 -904 -11 671 1243 1400 1093 123 -641 -1316 -1594 -963 -192 595 1236
6833A236Q3k55p69p43q63k6K01O65Q32O96L01j57o12j029p07k28K4P01R83P30
6853A063L63j96n86p41j006l83J50N71J108M04N90k7m97j030p59l28J20M01Q79
6872I6P56M62m4p62o49o47o78K91M62O88Q06N65R0l60q93q07n09l18K43J017Q18
6893F27M65J28k75m65r84n79m27M46N73R75N73L64l98p29n97q16l71M56P46O22
6913C34P10M61k12p19q85o87k52j4P27R05O05M20j82n54r51o51m70Q3O54P73Q44
6934I39L92j83l31p65p29p10J29O23O99O78N57Pm91p18o75o37k9L53Q97Q48L32
6955A186N6l23o55q80m52j30L17N39P96N38L46j97o70j025n86m5P7O71Q55O90
6975A108M15m75o76o31p71j78K08N63N01R42K70k02m39p93p20m27K05M73R59N96
$$ plain form
6833 1236 1319 1064 295 -448 -1311 -1337 -1136 -471 361 1057 1358 1201 589 -440 -1147 -1375 -1351 -650 333 1063
6853 1063 1426 1230 644 -97 -1103 -1486 -1336 -765 343 747 1337 1310 813 -217 -976 -1304 -1184 -783 96
6872 96 852 1314 1270 508 -141 -788 -1466 -1175 -713 -25 781 1346 1436 1076 183 -624 -1133 -1451 -1208 -191 627
6893 627 1092 1220 945 480 -504 -1083 -1510 -1064 -491 484 1057 1421 1023 294 -303 -1119 -1490 -1034 -288 334
6913 334 1044 1505 1293 574 -311 -998 -1250 -1264 -537 368 973 1393 1211 657 -294 -945 -1415 -1332 -678 95 939
6934 939 1331 1148 817 52 -677 -1387 -1258 -635 64 742 1299 1306 815 97 -578 -1215 -1244 -891 6 854 1186
6955 1186 1242 919 264 -616 -1068 -1198 -881 -342 454 992 1338 1141 471 -554 -1140 -1185 -1108 -437 418 1108
6975 1108 1523 1048 372 -259 -1030 -1208 -1000 -437 64 1006 1276 1074 635 -158 -878 -1305 -1100 -627 332 928
6995I28L57j10m83p79p37m72J1M27Q71O57O10J05q05o09o24m37j79N93N81O19
7015E24P79J82n02q63q27o27K45J90O74P83M00J08k22m66r79n95j53M45M51Q41
7035C88Q35J13j79p66r73l47n50L69N95Q03O87J89p5o89n42q30k00L5M28R66P07
7056I64M50k51n71p66q20l08J79P32O13O30O26l68m59o82p89k24j82M34J034J42
7076C84O91L4l31o85r04n00K69K60N62P29O06J08m59m46p28o66k12L12R05N40
7096D69N47K64m00m61q79o39J6O1P85P10O83L1j43n05r34m18n24J92Q68Q26L85
7117I34J72J8n35q61o08l50J51M64Q02N90M03ro69o61p43l34Q2N16N57Q05M84
7138A208q0m06p22p72k85k21O61P30M74N94P5r4j026q63l30r1N52N73Q29K01K21
$$ plain form
6995 928 1285 1175 692 -87 -824 -1296 -1285 -858 13 670 1280 1385 580 -29 -653 -1090 -1269 -676 -95 524
7015 524 1303 1485 983 120 -707 -1334 -1089 -899 -225 558 958 1066 844 378 -601 -1196 -1349 -904 -453 388
7035 388 1223 1336 1157 391 -582 -929 -1479 -1110 -515 288 975 1164 1089 400 -142 -972 -1172 -1137 -709 257 964
7056 964 1414 1163 592 -174 -994 -1302 -1123 -391 222 852 1478 1110 651 -31 -820 -1044 -1226 -792 242 384
7076 384 1075 1109 778 93 -811 -1311 -1042 -782 -220 509 1115 1223 764 318 -410 -1076 -1288 -976 -71 469
7096 469 1016 1280 880 419 -460 -1099 -1083 -1022 -237 473 1156 1187 1044 539 -395 -813 -1337 -1145 -277 549 934
7117 934 1106 1124 589 -272 -880 -1230 -1079 -615 187 777 1180 1171 502 -159 -902 -1236 -1154 -638 -81 724 1208
7138 1208 1128 722 0 -772 -1057 -1278 -617 113 587 1181 1256 1162 136 -727 -1057 -1148 -596 -23 806 1007 1228
7159A228m42m77p73m27j85L3O86Q62M31J13j59n82n82q90J41N0L36J003O48K58
7179A272j42o50p20n79l97J04N28Q35P37P0rn98p16n67j51j86O18N58P84M33j84
7200A040m85o15o92m67l1M88P22P86K34N5j27r78l32r16K78J87P34N71N50L04
7220A306n17o26q28l83n2J76Q47P32K48J68q9q20m62o39l04K59O65P77M03K41
7240A102j45n09r42n17j54K75N86O06O93J94k49k91q05o69k65Q6M06Q49O61J50
7260A062q6m94n08p51l28J8M01O69Q63K35q0l70o71o10m15K9K68N44P60O25k2
7281A139m99o07o04m70LK59P06N95N02j42l5o09o08m97k70M84L65O81M97M00o31
7302F59k69o99o10k09K83J98Q27O18L06j78n86o36o52q9K00L32P24O44L04n6o03
$$ plain form
7159 1228 786 309 -464 -891 -1076 -1043 -357 505 936 1049 890 308 -274 -1164 -1023 -973 -637 366 1014 1272
7179 1272 1130 480 -240 -819 -1216 -1112 -584 251 988 1058 1049 451 -265 -832 -983 -1169 -551 7 791 1224 1040
7200 1040 555 -60 -752 -1219 -1250 -762 -40 746 980 1035 908 -70 -402 -1318 -1040 -853 -119 452 1002 1306
7220 1306 789 163 -665 -1048 -1100 -924 -77 655 903 1071 982 162 -300 -939 -1243 -984 -319 458 861 1102
7240 1102 957 448 -494 -1011 -1165 -890 -304 302 995 1189 940 649 -156 -825 -1090 -1004 -598 251 912 1062
7260 1062 976 482 -26 -777 -1105 -1087 -686 -17 846 1081 1001 631 -40 -650 -1065 -1036 -768 -224 536 1161 1139
7281 1139 640 33 -571 -1041 -1038 -779 -73 522 1024 882 847 238 -370 -867 -1137 -653 -288 393 890 1290 659
7302 659 390 -309 -919 -1128 -845 -647 180 798 1104 926 340 -296 -948 -1037 -837 -505 219 863 1167 1111 508
7323E08o84p16o3j71N23N83Q33L30k18m02n59n60n23M3L45P48O81L45O3l72n10
7344B24q86l45M5K71P94K67N61J51k18q12m52n26J54J32L87P31N27J46m47l84
7364C20n85o32j20J19L90P93M50K49n8m21q10m73l74J63O26P32M31K71q3p85o40
7385d37k66k25J68K49N43P76K33k4n21n14o90k67J5J86P80Q04K19M6n26n75n95
7406f21j82k29L08N61P61L71P5m34m69p25k98l3J27Q11N24K22K23l52m27n03q08
7427a098J01L44M59P32K57K32l15m51p03p05O5J86N89N83L48L80j59n06o89k82
7447f32n37K96P13L48O21J12j02n42n39l43l73K06K18O44O97K9J8k46o50o18k01
7468h81j26M45O19O29K90J3n25l75o98k75k0J59P32M42M91K56p15l19n93n36L2
$$ plain form
7323 508 -176 -892 -955 -1126 -603 -20 813 1143 925 523 -36 -596 -1119 -1076 -731 17 698 1043 1106 734 224
7344 224 -662 -1007 -962 -691 103 370 931 1082 864 52 -400 -926 -772 -640 -253 478 1005 1151 704 320
7364 320 -265 -897 -1017 -898 -508 285 735 984 926 505 -305 -778 -1152 -989 -363 369 800 1071 988 203 -437
7385 -437 -703 -928 -760 -511 32 808 1041 1017 496 -18 -708 -975 -960 -774 6 810 1029 1075 549 -26 -621
7406 -621 -803 -1032 -724 -163 598 969 1044 610 141 -584 -882 -915 -788 23 547 769 992 640 213 -290 -1098
7427 -1098 -997 -653 -194 538 795 1027 712 261 -442 -1147 -1082 -896 -307 276 624 1004 845 339 -350 -632
7447 -632 -1169 -873 -160 188 809 921 819 277 -262 -605 -978 -772 -554 90 787 816 834 588 -62 -680 -881
7468 -881 -1007 -562 57 686 976 989 464 89 -609 -884 -904 -745 -13 429 920 1176 461 142 -451 -987 -955
7489i55J37P58L05P58K6m17m62o56n00K8K54N17P34L44L14l15n95o42n80J05J05
7510g37N03J91R06J69k00l90o13m51l80K64M15L51N97L14j56k53n69o09l27J03
7530h72L83N07M90L56N5l77m55p82m31K98K03O90N31L38n8k63n14m97m63j67J88
7551h40Q75M35J95J67l54k42m03o08k96L19O08O67L35J77l45n13l21q16J36J13
7571g11N54M99K68L82o0o97m71l85l92J05O96L04L48L49Pj16q59l64k17p6O01
7592b35M98L25J57J87n33m93k75l38k19L81P08K04O51j65m71m12o13k76nM06M65
7613e3N13M48l5j88p94m59k95j66L91M06N78K93L03k49m32m77p18r7L43N10N96
7634D18L09R7K7o36o29k51m99M61O05J43O36l5J27k31r24m27j24J46K19P14O55
$$ plain form
7489 -955 -818 -60 245 1003 1029 612 150 -506 -1006 -978 -724 -207 527 871 1185 870 275 -367 -947 -842 -737
7510 -737 -234 -43 863 1032 832 442 -171 -622 -1002 -738 -323 28 625 939 783 530 -39 -648 -975 -872
7530 -872 -489 18 508 864 919 542 87 -695 -1126 -828 -625 65 596 934 876 613 99 -398 -861 -1028 -840
7551 -840 35 470 665 832 478 236 -167 -775 -1071 -752 -144 523 858 1035 690 177 -144 -960 -824 -711
7571 -711 -157 342 610 992 932 235 -236 -621 -1013 -908 -212 92 440 789 796 680 -179 -543 -760 -836 -235
7592 -235 263 588 745 932 399 -94 -369 -707 -926 -545 163 367 1018 853 382 -30 -643 -919 -924 -518 -53
7613 -53 460 908 873 685 -109 -568 -863 -1029 -638 -232 346 639 942 693 261 -216 -934 -1031 -688 -178 418
7634 418 727 824 851 215 -414 -665 -1164 -703 -98 45 681 646 773 542 -382 -809 -933 -787 -568 146 801
7655H01Mj4m07o35m05l3j82O15L33M18L16n1k23p60l15m35Q5M59O90K78J60J84
7677H83k95n53l47m63m0J74O95L57M76M4l61m06m62n05l4Q7M80N94N24O7k94n06
7699A15m00m80j14K93L91M32M16J83l09k72o02l59k63L45M20M97M73qK0j93j048
7720d63j73l21L23K37N53L64L96j7n37m48o35l0l4J95P09M46K60n8l09k55o51
7741d48k54K8J45M78N34L78J82m84o35m38j68j11J88O23L13M54n5j29l56n73l41
7762f69l68N25K73O32K86J59m5n89n04l31m4J92J08N93L11L75k11n46j99o21j28
7783h01L21Q9M73O79rj6l75n29n09j37j9M68M67M94L30k04l07n76j86l84J4K56
7805d61N33L66P04l88k04n55m97m15K00K68N37L24L90r0p1n10m68l60k44J72Q29
$$ plain form
7655 801 805 791 384 -251 -656 -689 -871 -256 77 495 811 760 537 -223 -538 -973 -888 -429 261 539 699 883
7677 883 588 35 -312 -775 -815 -641 54 411 887 931 570 164 -298 -803 -837 -750 -270 324 848 915 621 115
7699 115 -285 -765 -879 -586 -195 237 653 836 527 255 -347 -706 -969 -624 -204 293 766 758 778 585 -463
7720 -463 -636 -957 -634 -397 156 520 916 899 362 -86 -721 -751 -785 -590 119 565 825 767 458 203 -448
7741 -448 -702 -674 -529 -51 483 861 1043 559 -76 -514 -682 -793 -605 18 331 785 730 601 245 -328 -669
7762 -669 -1037 -512 -239 393 679 838 793 204 -300 -631 -675 -483 -375 218 529 904 693 147 -52 -673 -801
7783 -801 -480 -391 82 761 752 736 361 -168 -677 -814 -833 -365 102 596 926 722 415 -161 -347 -731 -717 -461
7805 -461 72 438 1142 754 550 -5 -502 -917 -717 -449 88 412 802 712 641 131 -337 -697 -941 -769 60
7826F0L60K21K07m12l46n72l14N1j6N47M56N02l3o5l27n30m98l77L69L66P11L25
7848F85J0p5j92o81m14k43L04O27K24K34L49j03m60m67j41l81l3N16K30O87NJ33
7870H14m05m23m26l02M8L97N03L49J53n0j67m43n14l76J43K30M18N20L12j35k18
7891D28l88m61k36k04L48K04N71O43q2m52j17m74n64K53O9L85L98L80K20m71l2
7912D18n75n64L3J34J86P34J62J92p2m53l73n50o6J05N36L01L54L48l2l57p08
7933b47k03j36j20M78K53L91L22J4m07n14l96j50MK85N18J65M45J76m21m04n10
7954d57m71J69L20K24N61L98q9j56l90l17o14J58J55M92J15M03J71k32m55k88
7974c03l94j78L32K38Q13p6J25J29n66l24l66p0j5N24L54L66J85j88l29l01l75
$$ plain form
7826 60 420 641 848 436 90 -482 -796 -745 -761 -214 242 744 711 646 319 -211 -709 -1086 -717 -351 360 685
7848 685 695 620 428 -253 -667 -910 -606 21 245 479 828 725 265 -202 -343 -724 -757 -241 -11 676 681 814
7870 814 409 -14 -440 -742 -694 -297 206 555 708 658 491 48 -466 -842 -699 -469 -51 469 781 646 428
7891 428 40 -421 -657 -861 -513 -309 262 905 823 371 254 -220 -784 -531 -462 -77 321 701 921 450 418
7912 418 -157 -721 -688 -554 -368 366 528 720 648 195 -178 -728 -794 -689 -153 148 502 850 818 461 -247
7933 -247 -450 -586 -706 -228 25 416 738 752 345 -169 -565 -715 -711 -426 92 257 702 878 457 53 -457
7954 -457 -928 -759 -439 -215 346 744 655 499 109 -208 -822 -664 -509 -17 98 501 672 440 -15 -303
7974 -303 -697 -875 -543 -305 508 432 557 686 120 -204 -570 -640 -655 -131 223 589 774 586 257 -44 -419
7995d19j17k34M61O08J41K44k37p5m99k80m15K26J17O90K87J39L6k34l89m82m2
8016d74j85J78N61J81L91J94l31n43m25j97j27K51O11K00K85K40j44n15l89m81
8036g19j28L20L61K28N04K03k71l29n04j38o0l3M42K32M93J18j38m37k98k52m28
8057h34M40J60M07K59R3J16l12l13m89P3r5P4M80M41J53J76o59j53m17k95O3L6
8079e96P62K39J51r6l39j05l36l13j9O3N77M50J76Qj7n01n29k80kK31O92K62N0
8102E28K02k42l49l84p5l59K14K52N96N4K93k46k75l70n61N9L45J70Q8M30J87
8123E57J05n21l53k23k81L11r6P04K40J98n6k12m19l92q7j08L27M80K79k3K14
8144F44l46k68n95J7J0K32L41M10Q2K58l11l34n54j83J15rL97L75M30o7k33k76
$$ plain form
7995 -419 -536 -770 -309 299 440 684 447 372 -127 -407 -822 -596 -479 211 498 637 673 439 50 -432 -474
8016 -474 -659 -481 80 261 652 846 515 -28 -453 -650 -777 -526 85 285 570 810 666 151 -238 -719
8036 -719 -847 -527 -166 62 566 769 498 169 -335 -473 -533 -566 -124 108 601 719 581 144 -154 -406 -834
8057 -834 -394 -234 173 432 525 641 329 16 -473 -400 -495 -421 59 500 653 829 170 17 -400 -695 -632 -596
8079 -596 166 405 556 460 121 16 -320 -633 -652 -589 -12 438 614 622 605 104 -425 -705 -707 -476 216 478 528
8102 528 730 488 139 -245 -320 -679 -465 -213 383 437 730 484 209 -161 -722 -663 -318 -148 -60 370 557
8123 557 662 141 -212 -435 -716 -405 -501 203 443 641 585 373 -46 -438 -525 -633 -306 174 453 430 644
8144 644 298 30 -565 -548 -538 -306 35 445 527 785 474 140 -414 -597 -482 -491 -94 281 711 644 411 135
8166A35m39k29k62L92L23L01K57r6K99n30o37k18K41J42K80P6L45L22j48m94k66
8187b06j59l61L72K16
$$ plain form
8166 135 -304 -533 -795 -403 -80 221 478 382 681 151 -486 -704 -463 -321 -41 35 380 702 554 60 -206
8187 -206 -365 -726 -354 -138
8191a38
$$ Imaginary data points
##PAGE= N=2
##DATA TABLE= (X++(I..I)), XYDATA
0@%%%%%%QqQj6J6k4L2m0N2o1P6r8J20j46J73k07K48k90L45m04M70n47O31p23Q26
31D41r46J077j220J379j553J748j962K192k448K727l033L369l732M128m563N041
47B645n559O127o752P437q195R033r964J1005j2172J3499j5016J6768j8827K1281
61A1310k4268K7992l2796L9261m8475O2790q8287J47593n44274l18299Q04093
72C6640K69240O856j91980L7546j4366r6996k07097l9695L7925Q9242J25488L41234
84C94037L50163J6156n01926o04096k47515J91508K25566K3580n4311J36258K52000
95A81420J17247j37192k29957j95921j43827o5407J77220M44478M38470P4100
105F60631k84413k91257m2824M8133j26243k61704r1374K16460L27860J75745
$$ plain form
0 0 0 0 0 0 0 0 8 0 8 -8 8 -16 16 -24 28 -33 43 -55 65 -81 92 -115 133 -157 188 -216 254 -293 338 -385 441
31 441 -505 572 -648 731 -822 926 -1036 1156 -1292 1435 -1598 1771 -1961 2167 -2396 2645
47 2645 -2914 3213 -3539 3898 -4297 4736 -5228 5777 -6395 7104 -7912 8856 -9971 11310
61 11310 -12958 15034 -17762 21499 -26976 35814 -52473 95120 -449154 -767453 36640
72 36640 305880 312736 120756 158302 143936 46940 -160157 -199852 -161927 -72685 52803 394037
84 394037 744200 760356 258430 -345666 -593181 -401673 -176107 -152527 -206838 -70580 181420
95 181420 298667 161475 -68482 -264403 -408230 -473637 -296417 148061 586531 660631
105 660631 376218 84961 42137 90270 -35973 -297677 -389051 -172591 155269 331014
115C31014k3683j37490k24529l06200k31348N8887L28286L02721O3831m8469P7343
126A90363J76804N671k83708l45735j05615J68472K47121J83326J20275M2681
136C99655j22574k80282k55606o8640N5350R471l9624R2386K93331K81785O465
147C71717k64358k82558j10298L7449Q9770J34455J94425J70765L1616r4736j00809
158A77438p0691j36541k35501j67057R5440L11198K62849K9747j38756j42570
168a4444r7709j02000r1417J1382J39438J73096J26441J03803J06107J9273j73779
179B00191k97126j96290M1968J84941J44652N2106L2274L7153l6710j58594j99160
190a94595j20461j4929M8067J06877J90753K18984J01627r6127k00358j42368
$$ plain form
115 331014 307331 169841 -54688 -360888 -592236 -533349 -205063 97658 161489 113020 190363
126 190363 367167 372838 89130 -256605 -362220 -193748 53373 236699 356974 399655
136 399655 277081 -3201 -258807 -327447 -272097 -262626 -302250 -209864 83467 365252 371717
147 371717 107359 -175199 -285497 -248048 -158278 -23823 170602 341367 372983 278247 177438
158 177438 106747 -29794 -265295 -432352 -336912 -25714 237135 266882 128126 -14444
168 -14444 -112153 -214153 -305570 -294188 -154750 18346 144787 248590 354697 373970 200191
179 200191 -96935 -293225 -251257 -66316 78336 130442 162716 199869 163159 4565 -194595
190 -194595 -315056 -329985 -281918 -175041 15712 234696 336323 240196 39838 -102530
200a02530l0502J3354J2047O1223J49596J64927N7347q1975j50456j51851j42800
211b01620j11875p853J37074K06147J37700J2994n5516o3721q3757j21143r6133
222b47703K0849J46655J78369J22883N6178O239o5184j57244j90986j10855K4282
233b16517J07484J10436Q6746O8354K1962p3067j57231j52994o6602K5296P7155
244a68978J13126J49388J43205N2348p8402j54344j33794o4377m230M1803R3074
255a1181J27124R9285J1158p7669j23025j29797j15941o8647K7463J33845J75988
266D8603J22066K0512n5950q6302r3716q4783m2979L2630J03710J31326J09883
277B05000N7438j6109j01962j66212j58561p0081M2079J07208J09491P8949M2770
$$ plain form
200 -102530 -133032 -119678 -107631 -46408 103188 268115 325462 243487 93031 -58820 -201620
211 -201620 -313495 -321348 -184274 21873 159573 172567 117051 53330 -30427 -151570 -247703
222 -247703 -226854 -80199 98170 221053 277231 283470 218286 61042 -129944 -240799 -216517
233 -216517 -109033 1403 88149 156503 178465 105398 -51833 -204827 -271429 -246133 -168978
244 -168978 -55852 93536 236741 289089 210687 56343 -77451 -141828 -146058 -104255 -11181
255 -11181 115943 215228 226386 148717 25692 -104105 -220046 -288693 -261230 -127385 48603
266 48603 170669 191181 135231 48929 -44787 -129570 -172549 -139919 -36209 95117 205000
277 205000 262438 246329 144367 -21845 -180406 -250487 -208408 -101200 8291 87240 130010
288A30010j694n9715j08558j14788o7511J0341Q8699J44044J51988R5456q617
299B59655j03408j38059j07990m9456M20L8371P5500R9790Q5219K1838o3753j29832
311a1705j43554r6884p877Q5645J40641J33169P5670O271m3775p1527q6410q3690
323a04026m7711K2199R7097J34817J08269K6531o8646j33324j40383r2050j8422
334b15649M4645Q0270R1587Q4839N7417L892o4107j15957j14821n3505L9614J15503
346d6272J39503J03786L0818m1944q8389j01765q9236n9244j4493M2464R5824
357b8948J14929P8607l287q8143j31895j12289m4945L3698Q8509J08298R4920
368A09454O0371J4768l5176q2429j08679r3208l1651N2211J14934J20638O6508
$$ plain form
288 130010 128316 68601 -39957 -154745 -222256 -211915 -123216 20828 172816 268272 259655
299 259655 156247 18188 -89802 -139258 -138838 -100467 -24967 74823 160042 181880 118127 -11705
311 -11705 -155259 -252143 -260020 -174375 -33734 99435 175105 181376 137601 66074 -20336 -104026
323 -104026 -151737 -129538 -32441 102376 210645 237176 168530 35206 -105177 -197227 -215649
334 -215649 -171004 -90734 853 85692 143109 147001 82894 -33063 -147884 -201389 -161775 -46272
346 -46272 93231 197017 227835 185891 97502 -4263 -93499 -152743 -167236 -124772 -28948
357 -28948 85981 164588 161301 73158 -58737 -171026 -215971 -182273 -93764 14534 109454
368 109454 169825 184593 149417 66988 -41691 -134899 -166550 -114339 595 121233 187741
379A87741j5378q3031j10339r8081n9433j1788L5290P5622J02085R8709N6034
390A77431j9097r3811j24036r0624j2550O4724J05611J00785O2687J1547l8231
401A44436p6134r6315r2656o2458m895O7444J20485J16614N0335l9438j00165
412B7253j05252o6209j3996L2775O9065R1212Q9758O0400Q860n1909j05186j23613
424h6842q6216p05Q5627J19648Q6027K1174l1469n9872p4489p9461o2037j5978
436a84593M4964R6309J17828R6548L2544n5339j20492j17478n1125K5229O4306
447e1299O5810N9865N4404K9961k5777q7836j16696r6605l9799L2670R9424J28339
459E2461R1694P895o5199q3058n7311l3783k6138l547N3844J10416J12691N0361
$$ plain form
379 187741 172363 89332 -21007 -119088 -178521 -190309 -155019 -79397 22688 121397 177431
390 177431 158334 64523 -59513 -150137 -162687 -97963 7648 108433 171120 182667 144436
401 144436 68302 -28013 -120669 -183127 -188022 -120578 -93 116521 166856 127418 27253
412 27253 -77999 -144208 -158204 -125429 -56364 34848 124606 185006 193866 141957 36771 -86842
424 -86842 -173058 -173763 -88136 31512 117539 138713 107244 47372 -27117 -106578 -168615 -184593
436 -184593 -139629 -43320 74508 171056 203600 148261 27769 -89709 -140834 -115605 -51299
447 -51299 14511 74376 128780 158741 132964 45128 -71568 -168173 -207972 -175302 -75878 52461
459 52461 144155 152050 86851 3793 -53518 -87301 -113439 -116986 -63142 47274 159965 210326
471B10326l2434r2594j15608j00294m4878L2971R0226Q8286M4094Q021j569j9306
483F7241o8245j09878q5101P189R7877J27356R7016M4089j0522o4239r7147q2674
495g7038k9648J5310K8827L9630P0414Q9126M1707o1406j37605j24360m6158K5267
507a65934N8270P5619Q6049O7866J4056l9956o0020n7345n8811n1894M448R4772
519c2880J40909Q9026j7101q4390q4528o2706n7008m4690M965O8398R2351O7512
531G9858L1184L04m3572r9897j11869m0860O6016J16163Q4705L2994J7545J3281
543A45852k9034r3367j10578n7633J4341N4985O9886P9852O4669k429q9167j17419
555g0042o5764P84K1798J9210N0173J02442J02289K2719p0917j01146p3066l8577
$$ plain form
471 210326 177892 85298 -30310 -130604 -175482 -142511 -52285 36001 80095 88116 86547 67241
483 67241 -1004 -110882 -195983 -188794 -90917 36439 133455 177544 167022 102783 5636 -77038
495 -77038 -106686 -91376 -62549 -22919 47495 136621 178328 116922 -20683 -145043 -191201 -165934
507 -165934 -107664 -32045 54004 121870 135926 95970 35950 -21395 -80206 -132100 -127652 -32880
519 -32880 108029 197055 179954 95564 11036 -51670 -108678 -153368 -148403 -80005 12346 79858
531 79858 111042 111346 67774 -32123 -143992 -184852 -118836 -2673 82032 115026 132571 145852
543 145852 116818 23451 -87127 -144760 -130419 -75434 -5548 74304 138973 136544 47377 -70042
555 -70042 -135806 -135022 -113224 -94014 -43841 58601 160890 183609 112692 11546 -61520 -100097
567a00097j2708L0674Q6337R9088M3157k9102n5644m7154n7271q4592o5342K6211
579a66443J17037J21273N0245j4225l1750l9660o6272p6105k7495M9062Q4263
590g0O5561M3615L9480J0526o6041j31354j07950j2555O1590O2790L7522M2735
602D5849N4304J4830o2481j02876p0611j3238J9046M0506Q1207J09586O8590k9342
614A55370r5046p8360l0076j8704l1390p83P2570J10876O1628k5817p3714p1689
626b5135o3795n9019j8113N9072J07425P9655J7819o891J612j9081p9888j05914
638a12253l9422O6203J11776P4655K0559k809k1571o4443r5177o8219k326L6790
650i6237L5934M2624P5740P9387L640r8652j25070n4564K9381N3343M0326M6261
$$ plain form
567 -100097 -112805 -82131 4206 103294 146451 117349 61705 14551 -42720 -127312 -192654 -166443
579 -166443 -49406 71867 122112 107887 76137 36477 -29795 -105900 -133395 -84333 -70
590 -70 65491 109106 148586 159112 93071 -38283 -146233 -158788 -97198 -34408 3114 45849
602 45849 100153 114983 52502 -50374 -120985 -134223 -115177 -74671 6536 116122 184712 155370
614 155370 60324 -18036 -48112 -66816 -98206 -98989 -26419 84457 146085 120268 46554 -25135
626 -25135 -88930 -147949 -166062 -106990 435 80090 97909 91018 92630 73549 -6339 -112253
638 -112253 -151675 -85472 26304 100959 121518 118709 97138 32695 -62482 -130701 -133027 -96237
650 -96237 -60303 -17679 58061 137448 141088 42436 -82634 -137198 -107817 -54474 -14148 32113
662C2113O5559M7938j3744o5320p0790n6539n1850k9984L9212J13238J09862J9563
674A39258o8848p9259l6925j7489l3701k8582K8897Q8066R1738M9058M334l0613
686A05934p0844r9746p1475J5900Q8440Q1210K2924o795R270J0534m1856r9463
698e5967r0678j7646N4401Q1143P6939O0887K1697m2519q7749o9624j0927K1829
710e8214J1339Q594M9910R1132O4662k6663j01771j03936n5041o698K6330N6005
722d4351P2597N1445K899k9970k9046k6513m9781o5427k2271O6087J21232R1587
734A38488J1762m6022n9323n4081m9954l2860M643L8554M6600L9845L9179K8588
746A05419j9079q6746j10084n4370L5427Q4418P0891L7614K1796J2156j5357m9595
$$ plain form
662 32113 97672 145610 131866 66546 -4244 -60783 -112633 -142617 -103405 9833 119695 139258
674 139258 70410 -8849 -45774 -63263 -96964 -125546 -96649 -8583 83155 132213 136547 105934
686 105934 35090 -64656 -136131 -120231 -31791 49419 72343 65548 74818 85352 43496 -55967
698 -55967 -146645 -164291 -109890 -28747 48192 109079 130776 88257 508 -69116 -80043 -58214
710 -58214 -46875 -38281 11629 102761 167423 140760 38989 -64947 -119988 -126686 -100356 -44351
722 -44351 28246 79691 82590 52620 23574 -2939 -52720 -118147 -140418 -74331 46901 138488
734 138488 150250 104228 44905 -9176 -59130 -91990 -87347 -48793 -2193 37652 76831 105419
746 105419 86340 -406 -110490 -164860 -129433 -45015 25876 63490 85286 97442 82085 32490
758C2490o1415m4506j7738J1758N1202Q5553P6679Q641p0894r8418o1206j1176
770i9030Q494J0553K8113N7897O5880L4782j3432n1048o8864o5334l0734L1770
782i0953Q5314Q6325L6828j5853l3661l0172l8147n6933n2613p418M8623P6586
794G926O5724L0526j3191n6015p8613o0249q984L7473N0544M1157L7916M1368
806I5582K3524k5771p4077q2011m4271Q302M7040O3381N8473L0358j4188n0110
818C6232n7752m2805k5975j2337J2273N2363P9652O5776J2514m2572o6876n9137
830d8644l3668j777L1790N4881N4590L2778M419j9272m2361o2214o4485l2608
842a26571K1923O5829P2624M5987P982k3620m4686n2527m1571j3998J8799M2706
$$ plain form
758 32490 -28925 -73431 -91169 -79411 -28209 57344 134023 142664 71770 -26648 -87854 -99030
770 -99030 -90536 -79983 -51870 6027 71907 106689 93257 42209 -26655 -91989 -122723 -90953
782 -90953 -5639 80686 117514 101661 68000 37828 -319 -57252 -109865 -117283 -68660 7926
794 7926 73650 104176 90985 34970 -43643 -103892 -112876 -75403 -24859 16298 54214 95582
806 95582 119106 93335 19258 -62753 -107024 -98722 -51682 11699 70172 100530 86342 36232
818 36232 -21520 -64325 -90300 -102637 -90364 -38001 41651 107427 119941 77369 10493 -48644
830 -48644 -82312 -84089 -52299 2582 57172 89950 94369 75097 32736 -29478 -93963 -126571
842 -126571 -104648 -38819 33805 79792 87774 64154 19468 -33059 -74630 -88628 -69829 -27123
854b7123N4777N3454L4444m808n0602p6357o4030k2787J9601M4918N1158M3078
866E5723K2788p058l7375n3089n0530l0752P20L6804O5298O8523M0392o174m4878
879F0392n8798m9537k7186K50K7507M6843N0978L4426L675k9437n5210o2191m5852
892a04140q258L4264O1326O0862L7625M430k4251m3190m8785l8127j2663J9600
904f1307M6365N7729M7559J6574k3124n5766o5222m8274j3720K1309M4251N0284
916A6658M1109J9255j0344l7134n2498m8156k3849J2739M6252O3068N4874K3721
928A05695j5284m4677n4658m5581k3837L651K9855M7036M8333L0519j896l6147
940D3009n7009n5869l1489O310M0502N7272N1921K9212L60k5998m3608m8204l5753
$$ plain form
854 -27123 27654 81108 115552 110744 60142 -16215 -80245 -103032 -83431 -38513 12645 55723
866 55723 78511 71453 34078 -19011 -69541 -100293 -99573 -62769 2529 71052 111444 105270 60392
879 60392 1594 -47943 -75129 -74879 -47372 -529 50449 84875 88550 59113 3903 -58288 -104140
892 -104140 -112398 -78134 -16808 44054 81679 86109 61858 18668 -30117 -68244 -80907 -61307
904 -61307 -14942 42787 90346 106920 83796 28030 -37192 -85466 -99186 -77877 -33626 16658
916 16658 57767 77022 66678 29544 -22954 -71110 -94959 -82220 -35968 27100 81974 105695
928 105695 90411 45734 -8924 -54505 -78342 -74691 -44836 2200 50533 81052 79156 43009
940 43009 -14000 -69869 -101358 -95048 -54546 2726 54647 83859 84219 58221 14613 -33591 -69344
953f9344q260K4868M9271N4679L7471L171l2929n5165n5856l5022m473K3987M2624
966b4978M8297L9617J6701j4751m1955n2588m1409j3206K1472M8319N6529M2316
978H4364J0437k2503m3906m8855m0535k1086O172L4004N1484M6895K2352j1442
990F7381l9489n2161m6113k0536J4430M3302N3282M2703K0582l938k7507m5854
1002F082m9448l2819l70L2454M9388M7114K7434l148l4584n3187m9372k4641N093
1015h0004K7259M0497M5014L7783J3379k1719m8170n1581l3132m667K5014M6330
1027c997N1515L4258Q07k9138m2329m1437l2856j7967P572L8347N5883M5727J3317
1040G9702k1301m1912m7391l7571j2415K0636M5141M6850L1276J2267m717k4885
$$ plain form
953 -69344 -77604 -52736 -3465 51214 88685 91856 58927 3762 -52094 -87116 -91589 -67602 -24978
966 -24978 23319 62936 79637 64886 22931 -29657 -71066 -84272 -62800 -14481 42048 84364
978 84364 94801 72298 28392 -20463 -60998 -82084 -75912 -41908 9576 56471 78823 67381
990 67381 27892 -24269 -70382 -90918 -76488 -33186 20096 62799 83381 79443 51936 6082
1002 6082 -43366 -76185 -76555 -44101 5287 52401 79835 76687 42103 -11084 -60456 -85097 -80004
1015 -80004 -52745 -12248 32766 70549 83928 62209 14039 -37542 -70674 -75341 -50327 -3997
1027 -3997 47518 81776 82583 53445 11116 -30321 -63177 -81144 -73572 -35225 20658 66385 79702
1040 79702 58401 16489 -30902 -68473 -80888 -60252 -15111 31739 63015 75282 70565 45680
1052D5680m7143n3765l1027J0711M3960N1468L7688J4859j1241l5231m7694l9239
1064f0974j4829R536K4244L5843M5972M0984R663l4600o0170n0034j8138J2141
1076f0362K9547L8070L8562K4511k463k6542l7287l7900l4562j9224J4486N2908
1088b0256O4863L6509p855l6216l8234l0215k2462r323J4557L6664M2981L2434
1100F3447J4417p167l5632n9054n3698j3785L3259N1863L7471J5568M361l074
1112D7976k0292m0853m2585k1151R058L2757M7733M9617K9418j3002n0987n5417
1124b7728k7464K079J1421J1602K3723M0184L6497M889l3256n1307m5962k6421
1136h1743J583L4798N5742M6221J1703j8126k3388j8481k3384l4767k3886J4667
$$ plain form
1052 45680 -1463 -55228 -86255 -75544 -31584 19884 57572 72431 61190 25959 -21735 -60974
1064 -60974 -75803 -66267 -42023 -6180 39792 80776 90439 55839 -4331 -54365 -72503 -60362
1076 -60362 -30815 7255 45817 70328 67865 41323 4036 -33864 -68426 -87650 -73164 -20256
1088 -20256 44607 81116 73261 37045 -1189 -31404 -53866 -63189 -48632 -11968 31013 63447
1100 63447 77864 70697 35065 -23989 -77687 -91472 -58213 -6350 31121 46689 51050 47976
1112 47976 27684 -13169 -55754 -76905 -67847 -35090 12643 62260 91678 78676 27689 -27728
1124 -27728 -55192 -53113 -41692 -30090 -6367 33817 70314 75203 41947 -9360 -55322 -81743
1136 -81743 -80160 -45362 10380 56601 68304 50178 26790 8309 -15075 -49842 -73728 -59061
1148e9061N2287N7382K9847m688k9500m3572m6079k8909M099L0062L2776K2265
1160A6909J9535K1585N914l1732o0682m9465n418L4888M6704L8137K5446Q154
1172F9975j6169l5657l7186k3092j0840l433J3588M2246N6581L0480k0545n4962
1184A0986m8966k1904p96R135K2202L6560L7213J8788m095j8490l0425m2361l9267
1197g1420o332M0366O1081L9520O82j9701k0495k2456l2076l1473q436K2460L9084
1210i196L8012K9508J3181j6769m8859n4292k3552J7060L3900K5512J7883K2928
1222D5316K0944n205l9113n1206l3945n897J6063L2905M4537L7431O250k9209
1234C8871m0163k6208j1796j0346n526J9335M8085M9200J7642k0966l7753l7172
$$ plain form
1148 -59061 -6774 50608 80455 75767 46267 2695 -43384 -72293 -68194 -38132 -5356 16909
1160 16909 36444 58029 63943 32211 -28471 -77936 -83354 -48466 -1762 36375 61821 69975
1172 69975 53806 18149 -19037 -42129 -52969 -56402 -42814 -568 56013 86493 65948 10986
1184 10986 -37980 -59884 -60680 -51545 -29343 7217 44430 63218 59123 40633 10208 -32153 -71420
1197 -71420 -77752 -37386 23695 63215 63897 44196 23701 1245 -30831 -62304 -70740 -48280 -9196
1210 -9196 28816 58324 71505 54736 5877 -48415 -71967 -54907 -21007 4505 22388 45316
1222 45316 66260 61055 21942 -29264 -63209 -69106 -53043 -20138 24399 61830 68080 38871
1234 38871 -1292 -27500 -39296 -49642 -55168 -35833 12252 61452 79094 58128 20375 -16797
1246a6797k9553j6260Q318L4610M1171K3715L666n078j1248k9146m5496l5066
1258g7164L986M1732M8356K9622R315l605j7961l4565l7706j8951O881K1809K6031
1271b220L0220L1167J3023k3545n1452m5705j5261J0887J9879K3019L0261K9901
1283E0174J0462j8706l6039l3726k2280r296R813L5073M8067L3004j657k6521
1295C8368l0499k4667k2161j7661K506L0247M3589L1486O630j3615k6445l5663
1307a7885l4213j5013J6063L6321L4157K0959J0749J280j6610l7762m1961j9882
1319f3797J1979L1730L3579K6309J5526k120k5183l8219l1909j3003L972J6041
1331c5095K7657L7226L0009K778k8578m1087l0727j1885K559J5143K8495L4714
$$ plain form
1246 -16797 -46350 -62610 -54292 -19682 21489 45204 48870 43792 32544 3398 -42098 -77164
1258 -77164 -73178 -31446 16910 46532 55847 52242 34281 -284 -37990 -56941 -50060 -28251 -2220
1271 -2220 28000 59167 72190 48645 -2807 -48512 -63773 -52886 -33007 -9988 20273 50174
1283 50174 60636 41930 5891 -27835 -50115 -59411 -49598 -14525 33542 66546 64889 38368
1295 38368 7869 -16798 -38959 -56620 -54114 -23867 19722 51208 57838 44223 17778 -17885
1307 -17885 -52098 -67111 -51048 -14727 19430 40389 51138 52418 35808 -1954 -43915 -63797
1319 -63797 -51818 -20088 13491 39800 55326 53206 28023 -10196 -42105 -55108 -51136 -35095
1331 -35095 -7438 29788 59797 62575 33997 -7090 -37817 -49702 -47143 -32000 -3505 31209
1343C1209K4542J498j9259l0124l1908k7197j1050J5643L8368M0029K0256l299
1355D8708j7172k3010k7139k6635j2598J1338L1795L6907K6877J0353r903k9759
1367A9762l9114k9769n927J6834K6271K5301K1630J5231q50k3780l8746l4322
1379d7479j3727J0545K6985L4465L0384J4792q234k5892l0060k3475j2825j654
1391d6175J4588L1487L7289K2759m066k7280l5309l0212j6013J462J9471L0184
1403a815K9401J7447J919j2980k5439l2676k7279o060K0546L6660L3846J8360
1415E1930m55j6080k6280k9853k3041p224J0950K5062L0707K6749J1871j0939
1427D3397l1529l6780k4926l186J5605K5578K7850K3282J1825n488k2817l1794
$$ plain form
1343 31209 55751 57249 37990 7866 -24042 -51239 -62289 -46646 -8278 31751 52007 48708
1355 48708 31536 8526 -18613 -45248 -57846 -46508 -14713 22194 49071 59424 49521 19762
1367 19762 -19352 -49121 -55048 -38214 -11943 13358 34988 50219 49369 25589 -13157 -47479
1379 -47479 -61206 -50661 -23676 10789 41173 55965 47731 21839 -8221 -31696 -44521 -46175
1391 -46175 -31587 -100 37189 59948 55882 28602 -6707 -36919 -52932 -51470 -31999 -1815
1403 -1815 27586 45033 46952 33972 8533 -24143 -51422 -57482 -36936 -276 33570 51930
1415 51930 51475 35395 9115 -20738 -43779 -51003 -40053 -14991 15716 42465 54336 43397
1427 43397 11868 -24912 -49838 -53024 -37419 -11841 16009 39291 51116 45628 22811 -8983
1439h983k8465j4595N476K4694L5047K9520J0722j1691k5998k8695k2769j2430
1451d8167J854J8080K9972L0749J9121j360k1049l2272l0788j6697M170K2760
1463b3627L0033K5413J3694n92j4543k5617l0201k2696m817J6097L1274L2228
1475B6646K1000J455j7836k8772k8339j7363k078J3052K3624K7581K3383R838
1487E2191j0567k7739l3570k4763o798J3218K6630K9540K1746O086j0074k2423
1499A3477k6835k3360j2230N407K2826L2522K8285J1952q767k4663k9870k4291
1511c5547j0524O519K0246K6858K3956J4060j647j8618k9325k9693j7070L531
1523d7254K1715L0569K6685J3768k407j7709k5738k5898j6295j514J4672K6319
$$ plain form
1439 -8983 -37448 -52043 -46567 -21873 13174 42694 53416 41725 15727 -12968 -35737 -48167
1451 -48167 -46313 -28233 1739 32488 51609 50249 29200 -3072 -33860 -50557 -46387 -23627
1463 -23627 6406 31819 45513 44921 30378 4761 -25440 -48136 -52953 -36856 -5582 26646
1475 26646 47646 49101 31265 2493 -25846 -43209 -45287 -32235 -8611 18970 42353 52191
1487 52191 41624 13885 -19685 -44448 -51246 -38028 -11398 18142 39888 45974 35900 13477
1499 13477 -13358 -36718 -48948 -43541 -20715 11807 40092 52044 43277 18614 -11256 -35547
1511 -35547 -46071 -39552 -19306 7552 31508 45568 43921 25303 -4022 -33715 -50785 -47254
1523 -47254 -25539 5030 31715 45483 43076 25367 -371 -26269 -42564 -44078 -29406 -3087
1535c087K8807K0537K874j7489k9825k9141j7199o66J4745K4785K5920J9453N267
1548D4981j1828k3600k7891k2208p697J1512K6696L0813K1707M061j2500k3516
1560A0530k5587k0763r006P053K1414K8099K3998J0731o697k1958l0024k5232
1572c7442j0076R287K2888K5986K1164J1017l026j7427k7040k6568j4413L171
1584d2479J9465K7469K6159J4663l164j9876k7476k3426j2372J280J3561K4011
1596b185K6870J8954J607j6860k7166k6068j6557j716J4080K5734K6444J6593
1608C9730J412j2747k1214k4922k0738p661J1590K6534K8737J8753L352j1003
1620C1823k1234k5929k0923o764J0044K1539K4677K0169R970n718k1848k9417
$$ plain form
1535 -3087 25720 46257 49131 31642 1817 -27324 -44523 -45189 -30444 -5659 20261 39714 44981
1548 44981 33153 9553 -18338 -40546 -48243 -36731 -10035 20778 42485 46546 34046 10530
1560 10530 -15057 -35820 -44826 -37773 -16359 11740 35738 46469 39772 17814 -12210 -37442
1572 -37442 -47518 -38231 -15343 10643 31807 42824 39798 22371 -4669 -31237 -45650 -42479
1584 -42479 -23014 4455 30614 45277 42113 22237 -5239 -28665 -41037 -39757 -26196 -2185
1596 -2185 24685 43639 45246 28386 1220 -24848 -41405 -43121 -29041 -3307 23137 39730
1608 39730 41142 28395 7181 -17741 -38479 -46140 -34550 -8016 20721 39474 42826 31823
1620 31823 10589 -15340 -36263 -43027 -32983 -11444 13233 33402 43372 37654 15806 -13611
1632a3611k3774o878J0067J9954K3230K0655J2150l293j9399k7317k2811j0227
1644d1254L852J6612K6055K6022J3275n772k0486k4219j9671j2325j394J2939
1656b6366K5483K7546J5406k553j6730k3241k3195j6143j404J5848K6036K3347
1668B4034J2695J369r525j9690k6716k2089m400J5552K5798K3285J4337L636r058
1681B9228k0982k5814j8841l713J0262J8321K2759K1901J1865q031k5266k8635
1693a6946j7438k521Q422J5773K1015K1331J1053o048j9450k3815k0324j1916
1705d0864J635J8429K9254K4824P567r948j7163j7930j7177j3738k649J4656K5985
1718B881K4198J2592j510j3871k4277k6343j5608L986J9107K1730J5907J0024
$$ plain form
1632 -13611 -37385 -44263 -34196 -14242 8988 29643 41793 38500 19101 -8216 -31027 -41254
1644 -41254 -37402 -20790 5265 31287 44562 38790 18304 -5915 -25586 -37911 -39305 -26366
1656 -26366 -883 26663 42069 39516 22786 -455 -23650 -39793 -41197 -25349 687 24034
1668 24034 36729 38098 28573 8883 -17833 -39922 -44322 -28770 -2972 20313 34650 38286 29228
1681 29228 8246 -17568 -36409 -40122 -29860 -11539 11220 33121 44986 36955 11689 -16946
1693 -16946 -34384 -36905 -28483 -12710 8305 29636 40689 34641 15191 -8624 -28948 -40864
1705 -40864 -39229 -20800 8454 33278 40845 30897 13734 -4196 -21373 -35111 -37760 -23104 2881
1718 2881 27079 39671 38161 24290 13 -26330 -41938 -37952 -18845 2885 18792 28816
1730B8816N208n674k0394k8115j9981r29J5522K2977K2855J6399L508j3053k3844
1743C295k1444j1136k305M344J2913K2810K4865J0971j1704k6250k5368j4796
1755c3805l245P686J8313K3169J7746M778o455j3114j7459k1001j6734J118K2232
1768a6771L0784K0706K836r958j5292j8144j8563j1521K119J4597K0258J8828
1780A9879J4199M347j2870k7903k7956j0873R794J9283J7587J3316J1180M648
1792C4631q752k1223k3616j4998k907R150K0528K6511J9158n42j8831k3218j5790
1805a9899o534k394K811J3769K4046K1769O996j0270k0628k2693j8736o843J0577
1818b8029K3040K2557J0597p54n515q818j6889k2006j5186M419K1845K6111J8343
$$ plain form
1730 28816 34024 28350 7956 -20159 -40140 -41069 -25547 -2570 20285 36684 40192 27139 3295
1743 3295 -18149 -29285 -31590 -27246 -14333 8477 33342 44313 32609 6359 -19009 -33805
1755 -33805 -37050 -29364 -11051 12118 29864 34642 28187 15073 -2386 -23387 -40121 -39003 -16771
1768 -16771 14013 34719 37555 27597 12305 -5839 -24402 -35923 -33804 -19207 1051 19879
1780 19879 34078 38425 25555 -2348 -30304 -41177 -31383 -12100 5487 18803 29983 34631
1792 34631 25879 4656 -18960 -33958 -36865 -27715 -7187 19324 38482 37940 19109 -4109 -19899
1805 -19899 -26433 -28827 -26016 -12247 11799 33568 40564 30294 9666 -13027 -31763 -38606 -28029
1818 -28029 -4989 17568 28165 27411 21896 13078 -3811 -25817 -41003 -36584 -14739 11372 29715
1831B9715O563n785j6739k2533j7915m418P276J1930J3720J5935J5810M399j4966
1844B2992k8228k4647q717O957J5777J8330J7773J1146j391j2943j7544j5412
1856a5907j1491n489O741K1451K7703J6731k747j7944k0539j6102r918l169P168
1869b3512J6983J9475J3931M234o052j5552k2734k0236n884J3455K3259K0448
1881A7815J0152J574m812j1966j9004j8361q519N190J5859K0072J8071R152n194
1894C0029j9639k3700j5739k657O827J1453J5090J7657J2922M83j4497k1513j9203
1907b2487r287K135J3914K1236J9419Q382m901j4062j5902j5107j2170m318Q933
1920b4215K0550K2326J3045q92j2135j8199j8412j1847k78J1563J7828J6818J1148
$$ plain form
1831 29715 36278 30493 13754 -8779 -26694 -31112 -23836 -11906 1814 17749 33559 37958 22992
1844 22992 -5236 -29883 -38600 -31643 -15866 2464 20237 31383 29992 17049 -495 -15907
1856 -15907 -27398 -32887 -26146 -4695 23008 39739 36992 19048 -1491 -17593 -27511 -30680 -23512
1869 -23512 -6529 12946 26877 31111 25059 9507 -13227 -33463 -39347 -25892 -2633 17815
1881 17815 27967 29541 24729 12763 -6241 -24602 -33121 -27931 -12072 8000 26071 35223 30029
1894 30029 10390 -13310 -29049 -31706 -24879 -13426 1664 19321 32243 32726 18229 -3284 -22487
1907 -22487 -31774 -29639 -15725 5511 24930 33312 28411 14349 -1553 -16660 -28830 -33148 -24215
1920 -24215 -3665 18661 31706 30814 18679 480 -17932 -29779 -30057 -18494 -666 16152 27300
1933B7300L945n932j6174k2034j7426l555J0707J8304J7908J2381L484o876j5939
1946F093j8884j3753l878N481J3895J9277J8409Q135n991j7881k0118j4163m977
1959b8355M517J2666J7659J6057P467l987j3898j8056j6737r575J458J4404K0380
1972D000J7648Q097l274j1338j6035j6190j0549P5J1583J8204J7464J0130k7j0620
1986A9168j8180j8999j1891m2J0584J6206J6290J1972K914p798j6860j8531j2458
1999b7625j422R288J5899J7953J3518L846p871j6522j7557j3385m634N504J3902
2012i106J8485J4671M763p014j5539j7011j3675n527M540J4186J8585J5713O779
2025B9850l801j2927j7504j5495p659L192J3566J7383J4555O456k750j1229j7330
$$ plain form
1933 27300 31245 25313 9139 -12895 -30321 -33876 -23169 -4865 13043 25424 28908 22032 6093
1946 6093 -12791 -26544 -30422 -24941 -11046 8231 26640 34775 28784 10903 -9215 -23378 -28355
1959 -28355 -23838 -11172 6487 22544 30011 26024 12126 -5930 -22667 -32242 -30784 -16380 4000
1972 4000 21648 29745 26471 15133 -902 -17092 -27641 -27566 -15983 2221 19685 29815 29788 19168
1986 19168 988 -18011 -29902 -29944 -19360 -3154 13136 25108 28022 20224 3364 -15167 -27625
1999 -27625 -29047 -19759 -3860 14093 27611 31457 23586 7064 -10493 -23878 -28512 -23008 -9106
2012 -9106 9379 24050 28813 21799 6260 -10751 -24426 -29953 -25413 -11227 7358 23071 29850
2025 29850 26049 13122 -4382 -19877 -27536 -24344 -10778 6605 21160 27616 24866 13637 -3693
2038c693j6604r864J253J1961J7461J6339R812m94j0565j6301j5966r183Q37R849
2052a5158J5503J6235J1215J824r265j7345j7857j1773j461Q351J5235J5942J1607
2065B3053K483p688j4284j5875j1957m015O509J5490J8466J3758L740o761j4219
2078H700j6616j2847n005M447J2706J6042J3349N294l988j2914j7094j5262o623
2091b9811M532J3577J7042J4129O771k517j0582j5190j4593q020J746J0795J5706
2104C585J5409Q739j706j1790j6922j5615q556J100R391J4600J4657J0415J158
2117B4465q379j4823j5451j0500o82Q777J5942J6365J0605R24q542j3978j5143
2130a0420j1280l850N457J3591J6061J2184L421o760j3746j6420j2173l225P045
$$ plain form
2038 -3693 -20297 -30161 -28908 -16947 514 16853 26665 26171 15606 -695 -16661 -25844 -25007 -15158
2052 -15158 345 16580 27795 29619 20354 3009 -14848 -26621 -28082 -19731 -4496 11446 23053
2065 23053 25536 17848 3564 -12311 -24268 -28283 -21774 -6284 12182 25940 29680 22919 8700
2078 8700 -7916 -20763 -25768 -21321 -8615 7427 20776 26070 22082 9168 -7926 -23188 -29811
2091 -29811 -25279 -11702 5340 19469 26240 23723 13141 -2049 -16642 -24662 -22916 -12121 3585
2104 3585 18994 27733 26027 14237 -2685 -18300 -26856 -25756 -16365 -1765 12892 23307 24465
2117 24465 16086 1263 -14188 -24688 -25370 -16593 -651 15714 26319 27243 18701 4723 -10420
2130 -10420 -21700 -25550 -20093 -6502 9559 21743 25164 18404 4658 -11762 -23935 -27160 -20115
2143b0115J3678J5035J1976N093k955j1614j5818j3981o613M110J2466J5937J2978
2156B0177N660m529j2522j5199j2871o258J840R540J4663J5232R379p19j0909
2169A3484j5511j4408p173J771J0349J4735J3782P521j071q334j3222j4893j1094
2182b4064k822Q589J5624J5661R370K90q122j3287j3854r611j408P456J2745J4097
2196A0664J1381M414n054j4156j6904j2440k410P219J2492J3193J0358L588m416
2209A7929j1556j4629j1788n076L017J1730J6244J4794N750n198j2659j4076j0465
2222a5983m970J869R016J3947J3044P043j988j0065j4577j4570q899J723J1577
2235a2833J5627J2244N611j201o970j1450j3103r849j019Q880J4601J4152R334
$$ plain form
2143 -20115 -6437 8598 20574 25667 22712 11098 -4720 -18701 -25314 -21204 -8738 7199 20177
2156 20177 25837 21308 8786 -6413 -19284 -25542 -23702 -14162 501 15733 25112 24393 13484
2169 13484 -2027 -16435 -23608 -21837 -11488 3247 17029 24550 23479 15145 1923 -12970 -24064
2182 -24064 -26886 -18297 -2673 12988 22358 22648 14526 1239 -12615 -22226 -23634 -16178 -3433 10664
2196 10664 22045 26459 21405 7249 -9655 -22095 -24505 -17286 -4794 8399 18757 22345 17929
2209 17929 6373 -8256 -20044 -25120 -22103 -10373 5871 20665 26415 21217 8558 -5518 -15983
2222 -15983 -20953 -19084 -10068 3879 16923 23966 21978 11913 -2664 -17234 -26133 -24410 -12833
2235 -12833 2794 15038 20649 19448 12478 1028 -12075 -21924 -22943 -14063 538 14690 24024
2248B4024M82q313j4827j4895q330N41O936J0325J1784J0481M736n418j3756j5650
2262a1880j0552j270O852J2751J4340J0781K592o418j1132j1841r726n761J366
2275a9898J0630J6147J3434L882o459j2192j3188j0596m902L054J0801J3293J1214
2288A5220N576o10p795j3517j4534q240L148J2293J4381J0238M875j380p497j2754
2302e96j3317q146K16P718J2229J3093J0279J143r241j5181j3003n454J831O343
2316a2086J0102J2085J0269L010o583j2717j3912r633k881N583J3015J4627Q821
2329A9700J77p058r907j0301r428n224K644J1699J5488J1661L340m747j0648j3286
2343e890j1369l682M869J0905J0952Q497N098l49p904j4580j4400o298M071J0693
$$ plain form
2248 24024 24506 16193 1366 -13529 -21859 -21318 -14382 -4057 7727 18208 22944 17526 3770 -11880
2262 -11880 -22432 -23702 -16850 -4099 10241 21022 23614 17196 6064 -5777 -15503 -21264 -19898
2275 -19898 -9268 6879 20313 24195 17736 5544 -7644 -18240 -23142 -20088 -9287 4006 15220
2288 15220 20796 20186 12391 -1126 -15660 -23900 -20752 -8459 5922 16160 21035 19655 12158 -596
2302 -596 -13913 -22059 -21843 -14125 -1896 11197 21476 22619 13378 -1803 -14806 -20260 -18429 -12086
2316 -12086 -1984 10101 20370 23380 16797 4080 -9832 -19465 -22346 -16763 -3748 10879 19700
2329 19700 19877 12819 2912 -7389 -16817 -22041 -19397 -7698 7790 19451 22791 18044 7396 -5890
2343 -5890 -17259 -20941 -16072 -5167 5785 14282 19380 19031 11127 -3453 -17853 -24151 -20080 -9387
2357i387J3015J0473N960j309q994j2195j0483n618Q39N934J1372J3840R769m20
2371B2796j0457j4346j1505n609M24N798J0765J1985Q194Q94o091j0519j1838
2384i509j0005l132P144J4055J3997P315l31o001q703j0866r927m344M206J0879
2398e222J2277R685L802l884j1439j4042j0531j697O272R331J0165Q609N983n12
2412A8797r036j3554j1704m577L196R421J2265J1269M806l505j0174j1520q586
2425a2902n278l89N918J1789J3341Q029j287r385j1868j0290o218O76P674J1693
2439A503J0642N927K95n193r559j2746j0169j992P218J3148J1439O426K83n365
2453A1857r625j1337q016j885M974R587J1206R933M515m094j1555j3489q886r45
$$ plain form
2357 -9387 3628 14101 20061 18752 9758 -2437 -12920 -18538 -17699 -11765 -393 13447 23216 22796
2371 22796 12339 -2007 -13512 -19121 -18697 -12899 -2134 9851 18045 18939 12848 2329 -9509
2384 -9509 -19514 -22646 -15502 -1447 12550 19865 19534 13533 4830 -6036 -15963 -20307 -16101 -5222
2398 -5222 7055 16740 20542 16658 5219 -8823 -19354 -21051 -14779 -5448 4717 13326 19309 18797
2412 18797 9761 -3793 -15497 -20074 -16878 -7457 4808 16077 20883 17378 7204 -4316 -12902
2425 -12902 -18180 -18569 -12651 -862 12479 20508 19221 9836 -2032 -12322 -18540 -17864 -10190 1503
2439 1503 12145 18072 18367 13174 3615 -9131 -19300 -21292 -14074 -926 10513 16939 17222 11857
2453 11857 2232 -9105 -17121 -19006 -14032 -4445 6761 16694 21209 17115 5560 -7929 -16815 -17760
2467a7760M725Q246J0289Q852M177k855r214j1968r835m708J955R186J3376J1109
2481A5575M008l943q965r629q586m951J00P099J1852J1315N917j727q149j1564
2495a648j1419o367J287P967J1008R157N402O13m623j0046j1722q061l06P564
2509a1194J1400J1151O890P61o238j0606j0745o897j262M168Q382J0467R268L214
2523A8759n093j1276j1696p603j556M726R086J0898Q779L190l338q231j0485r138
2537a2978m687K616Q949J2003R542K747l761q411j0362r116m744J503P754J0611
2551A666R886N408o32p068j1379j0140n202J784Q068J0444R114N191k6o012j0572
2566E30j0655o990m23N973J0068J0522P171K02o573j0015r658o041o91M734R521
$$ plain form
2467 -17760 -13035 -4789 5500 14352 18529 15674 6460 -5508 -15343 -20051 -18096 -8910 4466 15575
2481 15575 19583 15640 6675 -2954 -11540 -16491 -16391 -9292 2560 13875 19792 18065 9916 -1648
2495 -1648 -13067 -19434 -18147 -10180 828 9985 15387 16000 11377 1331 -10391 -18452 -18758 -11194
2509 -11194 206 11357 18247 19008 12770 2164 -8581 -15478 -16740 -12572 -4190 6277 15545 18759
2523 18759 13666 2390 -9306 -16909 -18465 -13739 -4653 6245 15024 18214 14876 6645 -3840 -12978
2537 -12978 -17665 -15049 -6100 5903 15445 18192 14431 6020 -4342 -13458 -18202 -16699 -8945 1666
2551 1666 11552 16960 16328 9260 -2119 -12259 -17461 -15677 -7609 2835 11949 17140 17114 11102 530
2566 530 -10125 -17115 -17538 -11565 -1497 9025 16196 16398 9825 -190 -9848 -15889 -16580 -11846 -2325
2581b325J0488Q262K318n013r957j0689p696j923M287R058J0060P457J918m251
2595A1994p922j0330q500l652L041R235J1257Q759L274k877p931r905q583l792
2609a5932K479P502R911Q510M755j698p399j0828j0087m948J587P486R707R101
2623A0146N039m24o327r479r368n449L94O335R835J0209O231Q4o258j0171r536
2638h739o085j055M789Q797R679O684J434m831q989j0219o951j504M607R448J0431
2653G496P159K031l670q370r280p953l074L307Q301R997P667K691l493q099j0267
2668e557q032l448K638P736R591Q550M375j706p281r561q680m159K169P072R597
2683C304Q459M420j383o490r840r038n168K3O181R370R257N572j77o062r027q785
$$ plain form
2581 -2325 8163 16425 18743 13730 3773 -6916 -14612 -16535 -12248 -3190 6870 14327 16245 11994
2595 11994 4072 -6258 -14758 -18410 -15369 -6134 5123 13882 17156 14279 6348 -3557 -12140 -15932
2609 -15932 -13453 -5951 3960 12470 17225 15527 8128 -2700 -12787 -17735 -16148 -8662 1045 10146
2623 10146 15185 14761 8434 -1045 -10413 -15862 -15468 -9133 702 10911 17142 17226 10968 797 -8739
2638 -8739 -14824 -15879 -11090 -2293 7386 14070 15504 10673 1684 -8535 -15486 -16990 -12383 -2935 7496
2653 7496 14655 16686 13016 4646 -4634 -12587 -15661 -12354 -4053 5944 13611 16302 12809 4710 -5557
2668 -5557 -13589 -17037 -14399 -6663 2928 11478 15853 14147 6866 -2695 -11375 -15534 -13365 -6293 3304
2683 3304 11763 16183 14800 8310 -1530 -10568 -15736 -15713 -9532 -162 9095 14667 14490 8428 -599 -9384
2699i384n585O2N541R146R242O009R71m663q852r484p003j329M699Q399R059O336
2715A3164J279l968p939r491p075k101L787Q080R587P769L087l160q005r407p286
2730a1679k639K501O983R200P491L531k286p420r641q041m194J846P118R645P991
2745A0406L900j243o185q312p867m810O47N940R294Q761M626m60n756r141q733
2760h933n586J01N349Q175P928N544J043m298q230r462o082l81N187Q389Q881
2775G625O131J498m270p937q610o224k017K924O980R035P393K114l809q188q956
2790f311o281k194K647P291Q786P565K773k243o071q600p787l838J759P453R185
2805D134P244K686j869o057q222p876m490O18N904Q413Q135M829j65n692q865
$$ plain form
2699 -9384 -14969 -14907 -9366 -220 9022 15031 16002 11339 2487 -6997 -14000 -15329 -10630 -2231 6828 13164
2715 13164 14443 10475 2536 -6955 -14030 -16131 -12344 -4264 5323 13092 16179 13019 5014 -4393 -11679
2730 -11679 -14318 -11817 -4834 4366 11857 15388 13102 5682 -3959 -12000 -16194 -14348 -7230 2415 10406
2745 10406 14306 13063 6878 -1434 -9301 -14111 -13464 -7524 1770 10531 15157 14697 8941 -200 -8933
2760 -8933 -14519 -14418 -9069 -894 7034 12578 13621 9323 1093 -8369 -14451 -14832 -9645 -1256 7625
2775 7625 13756 15254 10984 3047 -5563 -11787 -13804 -10880 -3900 5135 12528 14642 10833 2645 -6311
2790 -6311 -12592 -14786 -12139 -4848 3938 11503 14276 12033 5962 -2638 -10425 -14263 -12504 -5051 4134
2805 4134 11378 14064 12195 6138 -2084 -9960 -14450 -13832 -7928 485 8620 13449 13284 7592 -1273
2820a273q426m064J388N554P704P188N325R50m386q379r057n790p16M290Q012
2835a680Q568N952L07m633p693p448n112k027K840P185R335P307K145m011p419
2850C616q353o573k148L254P116P895N747K161k028n827q473p850l904K351P428
2865e588R005P115K622j710n740p833o891l229J164N281P499P595M792k94o271
2880G517r381q365l396J318N088P228P123M630M49m717p283p409n512n74M412
2895h872Q549Q919N116l55m936p044o823n261j880L005O743P903O203J528l307
2910I488o981q749o417j460M375P253P441N258K174j607n441p966p240l155K284
2925a0743O677Q307O511K807k873o667q080o002k215R02M694P038P545N101m65
$$ plain form
2820 -1273 -9699 -13763 -12375 -6821 883 8071 13396 14346 9960 1581 -7476 -13266 -13982 -9692 -1680
2835 -1680 6888 12840 13147 8514 821 -6627 -11739 -13766 -10926 -3741 5594 12901 15046 11035 3616
2850 3616 -4737 -11310 -13458 -10204 -3088 4807 10554 12715 10687 4860 -3613 -11463 -15367 -13016 -5588
2865 -5588 3417 10532 13154 11444 5704 -2129 -9020 -12249 -11085 -5804 1695 9290 14082 13788 7517
2880 7517 -1864 -10229 -13625 -12307 -7219 9 7132 11762 12211 7494 211 -7198 -12710 -13284 -8872
2895 -8872 -323 8596 13712 13357 8421 1377 -5446 -10707 -12587 -9582 -2839 5064 11267 12795 9488
2910 9488 2507 -6242 -12659 -14119 -9744 -2491 4950 10208 12382 10775 5334 -2632 -9872 -13027 -10743
2925 -10743 -4066 4241 10752 13559 10686 4019 -4061 -10063 -12278 -11376 -6682 356 7901 13002 12537
2940A2537o149q329p025l337J381N170P609P117L559j079m065o749p194n535j343
2955a3432M307Q444Q146M457m08m493o948o796m713o00L917O453P344N451K421
2970A3550k871p267q536o308j056M333O306O871M700J833k361o190p280o205k459
2985a2940J979O003Q201P166K892k583o739p377n139k236J381M570P269O701L471
3000A2619j107n768p617p186m049R55N602P934O485K861r72l870n863o580m971
3015a1527m76N031P683P360M600k70m460p292p156m406j58L781N597O274N006
3030I587K088l136p061q039n033o67L783O718O901N384J456k960n689o908m972
3045h548k532J641N610P543O672J894k975o544o982n269k230J538N057P264O099
$$ plain form
2940 12537 6388 -1941 -8966 -12303 -10922 -5752 1857 8974 12533 11454 7389 640 -6554 -12089 -13432
2955 -13432 -9125 -681 7465 11922 11514 7021 73 -6723 -11436 -12036 -8119 -1666 5678 11129 13550
2970 13550 10679 3412 -5124 -11432 -12488 -8155 -1849 5022 9722 11555 9194 3004 -4276 -10481 -12940
2985 -12940 -10961 -4958 3243 10409 13301 10718 3979 -3398 -8537 -10773 -9392 -4822 2447 9148 12619
3000 12619 11512 5744 -1873 -9059 -13108 -12153 -6551 1383 7868 10729 9757 5887 24 -6556 -11527
3015 -11527 -12003 -6972 711 8071 12671 12401 7941 649 -6507 -10913 -11071 -7290 -1693 4581 9587
3030 9587 11675 8539 1478 -6561 -11594 -12261 -8478 -1760 5141 10525 11981 9021 3332 -3576 -8548
3045 -8548 -11080 -9439 -3829 3714 10386 12280 9305 2761 -4221 -9490 -11720 -10182 -5125 2139 8238
3060H238K816j024m456o949o576l571J235N721P341N928K808j266m122o601o736
3075g214m139J31M088O924O540M223J40m317o967o545l827O23M006N658O489M757
3091A0570J413l712o312p068n021p40L076N921O896M485J121l339n540o467n084
3106i801j904K399N803P166N986J899k577n469o573n509j759J725N245O619N294
3121H544K456j511m650p260o402l161J581N267O601N717K891o50m319o252n772
3136f920l371M14M455O464O356L807k22m411o581o302m076K50L262O048O129M043
3152I345O89l310o147o316m555n80L444O221O719M470Q43k879n648o184m833j533
3168a0254K472N470O338N000J835k653n919o312n111j925K112N081O433N234K585
$$ plain form
3060 8238 11054 10030 5574 -1375 -7951 -11522 -10287 -4566 2775 8703 11511 10245 6123 -478 -7214
3075 -7214 -11353 -11222 -7134 -210 6330 10553 10693 6376 -591 -7136 -10963 -10340 -6334 -676 5813 10570
3091 10570 11983 8271 1959 -5109 -10130 -10870 -7794 -1873 5023 9508 10629 7290 1750 -4717 -9801
3106 -9801 -11705 -9306 -3503 3663 9649 11548 8971 3502 -3071 -8580 -10339 -8614 -3369 3250 8544
3121 8544 11000 9489 4839 -2421 -8823 -11984 -10403 -5136 1465 7182 10073 9423 5104 -1148 -6920
3136 -6920 -10291 -9877 -5422 1042 7398 11205 10983 6572 -9 -6311 -10387 -10137 -6875 -827 5302 9345
3152 9345 10034 6724 577 -5739 -10294 -10874 -7430 -1209 5510 9980 10823 7944 2296 -3888 -8721 -10254
3168 -10254 -7782 -2312 4026 9026 10861 8208 2289 -4023 -9134 -11059 -8947 -3866 2567 7801 10386
3183A0386j174m926o340n534k764J643M797O430N434K658r82m581o454n686l286
3198a0379M55M054O321N973L516n28m333n789n712l377J89L948O003N901L798
3213A0040L04l558n811o086m380m66L279N828N785M112L09k671n464o069m384
3228i232j190K677N517O140M946J782k302n458o387m807j156J876N074N886M440
3243G806K156j516n031o398n108k249J349M641O240N402K514j352m073n876n050
3258f545k869R55L743O259N666K904n06l975o313n615l452K52L974N390N559L316
3274H743p4k982n470n756l869l41L367N832N981L517R59k948n347n741m021j171
3290i321K587N007N667M359J184k505n289n981m553r29K118M703O127M488J803
$$ plain form
3183 10386 9212 4286 -2054 -7588 -10352 -8709 -3912 2518 7952 10610 9628 5047 -1407 -7093 -10379
3198 -10379 -9924 -5870 451 6424 9940 9412 5079 -710 -6422 -9799 -9610 -5662 341 6242 10040
3213 10040 10344 6786 975 -5111 -9491 -9957 -6678 -850 4935 9047 9356 6685 1221 -4848 -9232
3228 -9232 -10422 -7745 -2228 3912 8858 10640 8338 2880 -3507 -8314 -9470 -7594 -2520 3366 7806
3243 7806 9962 8446 3415 -2983 -8091 -10340 -8991 -4350 1890 7292 9806 8454 4381 -1495 -6545
3258 -6545 -9414 -8459 -4716 1543 7209 10113 9607 5632 -681 -6296 -9748 -9496 -5522 -132 5427 8743
3274 8743 8669 5687 217 -5539 -9408 -9749 -6382 -550 5431 8948 9907 6959 1612 -4129 -8150 -9321
3290 -9321 -6734 -1727 3940 8299 9483 6978 1689 -4292 -8845 -9774 -7656 -2953 3174 7662 9465
3305I465j496m393n836m641k365J521M497O006M978J948j625m474n866m631k481
3320i393Q05L564N717N231L145m67l690n856n263l081O63M162N523M961K892K63
3336I176l123n409n743l672l33K978N400N438L594K54l152n030n352l451k39K433
3352f231M760N488M236J377k424m874n800m297j354K380M957N278L978J295j997
3367F772m190n515m485k274J828M356N547N079J954j366m294n297m446k027J209
3382g149L984M719M889K545o43l633n706n395k790R32L772N020M760K881m33l127
3398D626m951m873l027O7K690N204N556L607J50l256n151n123l204o41K525M538
3414a263N190L665R54k462m738n137m181j055K404M953N382L768Q75j642m143
$$ plain form
3305 9465 7969 3576 -2260 -6901 -9266 -7745 -3248 2758 7736 9684 8059 3585 -2281 -6912 -9393
3320 -9393 -8588 -5024 693 5924 9069 8602 4912 -944 -6207 -9288 -8625 -4463 1060 6021 8913 9176
3336 9176 6053 644 -5099 -8771 -9104 -6126 -726 4712 8306 8560 5408 378 -4974 -8425 -8664 -6231
3352 -6231 -1471 4017 8253 9630 7206 2332 -3468 -7765 -9119 -6739 -1782 3496 7474 8769 6772
3367 6772 2582 -2933 -7418 -9692 -7864 -3508 2039 7118 9072 7706 3412 -1885 -6331 -8358 -7149
3382 -7149 -3165 1554 6443 8988 8345 4712 -994 -6389 -9179 -8247 -4475 545 5305 8186 7753 4626
3398 4626 -325 -5198 -8225 -8158 -5468 -264 5292 8899 9049 5793 642 -4481 -7685 -8326 -5801 -1263
3414 -1263 3927 7592 8546 6084 1346 -3791 -7972 -9027 -6623 -1670 3712 7480 8355 6713 2570
3429B570m904m298j848J461M476N440L905K037j767m234n528m104j711J253L481
3444c771M943M407K753q29l473n523m407k414R91L524N008M714K418n96l442m569
3460b66m579k926m84L094M944M921L325k5l229m795m801k793k43K672M353N045
3476D213L197M81j815m273n286l937p60K382M743M669L272P69j680m045n064l825
3492f959j292J679L704N245M221J714j296m408m966l725j322J325L303M578M232
3507F033K212j025l546n021m804k142Q16L515M955M380K011q34l029l857m275
3522d611k747j69K888M854M879K912k66l056m284m763k954JK721L984M209K903
3538F501Q19j860m409m992l466q71K996M264M567L170Q08j888l912m323l457j158
$$ plain form
3429 2570 -2334 -6632 -8480 -7019 -2543 2897 6802 8839 7072 2838 -2690 -6794 -8505 -7252 -3771
3444 -3771 1172 5579 8332 7503 4030 -1493 -5900 -8314 -7323 -3799 1209 5923 8341 7745 4303 -266
3460 -266 -4845 -7771 -8255 -5161 -217 4704 8029 8004 4775 -20 -4821 -7614 -7857 -5185 -832 4213
3476 4213 7410 7891 6076 1803 -3483 -7420 -8180 -5798 -1055 3614 6886 7655 5975 1930 -3134 -6959
3492 -6959 -8251 -6572 -2868 2377 6598 8312 7016 2608 -2358 -6083 -7405 -6080 -2777 1801 6033
3507 6033 8245 7220 3674 -1347 -6151 -8293 -7477 -3962 993 5373 7384 6550 3521 -336 -4611
3522 -4611 -7358 -7527 -4639 215 5094 8006 7740 4684 400 -4363 -7317 -7316 -4595 -611 3598 6501
3538 6501 7320 5460 1051 -3941 -7407 -8278 -5282 -1018 3549 6719 7527 5639 1727 -2596 -6053 -7211
3554g211J390L425M835M057J689k078m077m880l453j210J134L247M583L978J940
3569G369q73l381m075m486k223J230L285M866M067J456q29k943l919m184k511
3584g151mK762M275M535K601j8l025m391m278k575M02K913L836L951K762O90j776
3601E509m309m833l198m57K470L950M345K992M02k150l752m061l002q92J167L714
3617b105M661L731J289j917l781m246l227j205J360L280M558L199J232r10l082
3632B837m412l926k178J075L458M448L941J554j040k491m214l399k195M44K434
3647c664M167L971K555o7k856m489m257k013J17K400L838L941K494L74k256l808
3663D47m206k656m94K052M167M399K780L99k036l618m145k797q47J443L500M203
$$ plain form
3554 -7211 -5821 -2396 2439 6496 8185 6107 2030 -2850 -6303 -7513 -6379 -3132 1451 5429 7369
3569 7369 6496 3115 -960 -5446 -7669 -6439 -3154 1712 5779 7235 6406 3463 -456 -4640 -7151
3584 -7151 -7155 -4393 -118 4417 7018 7000 3975 -416 -4694 -7269 -6867 -3954 -118 3833 6595 7285 5509
3601 5509 1200 -3633 -6831 -7288 -4818 -868 3477 6469 6871 4721 969 -3092 -6094 -6986 -5819 -2105
3617 -2105 2556 6287 7576 5659 1878 -2368 -5595 -6800 -5440 -2160 2398 5597 6829 5919 2837
3632 2837 -1575 -5501 -7679 -6604 -3146 1302 5243 6797 5757 3266 -948 -4347 -6542 -6098 -3664
3647 -3664 503 4474 7029 6962 4106 -383 -4640 -6653 -6536 -4136 -298 3643 6137 6511 4255 447
3663 447 -3759 -6415 -6909 -4857 -690 3709 6489 6888 4852 1234 -2911 -5708 -6555 -5112 -1612 2591
3679B591L173R46j494l682m432l112j033J678L392M040L077J408q35l140l881
3694a304l654j752Q20L343L916L676J826j174k795m212l232j916N24K423L673
3709A62L845K316k92k328l973l893k183N41K128L982L749K275l4k277l513l977
3725c472k795l75K295L733M165K352J59j911l571l574k800p10J722L786L620K825
3741E449R82j249l292m235l130r74J461L275L812K883J318j086l146l745l421
3756e098j521J127K986L956L296J702j027k752l902l127j636O59K499L754L186
3771D102K084m47k453l962l347k168M49K223L713L687J942p7k064l470l676k379
3787e843k69K222L552L652K612J26j898l504l435k642n72J619L217L709K533Q45
$$ plain form
3679 2591 5764 6710 5216 1534 -2898 -6010 -7043 -5365 -1973 2067 5144 6552 5717 2577 -1304
3694 -1304 -4958 -6710 -5890 -2547 1369 5045 6871 5697 2902 -1310 -4542 -6458 -5934 -3511 162
3709 162 4007 6323 6031 3703 -270 -4163 -6346 -5805 -3677 305 4054 6329 6295 4018 505 -3472
3725 -3472 -6267 -6642 -4347 -614 3551 5903 6062 4151 580 -2994 -5794 -6504 -4782 -996 2624 5449
3741 5449 6431 5182 1890 -2345 -5475 -6449 -4988 -1713 2099 4982 6300 5214 2068 -1677 -5098
3756 -5098 -6619 -5492 -2506 1450 4746 6448 5421 2669 -1233 -4360 -5996 -5337 -2838 916 4102
3771 4102 6186 5739 3286 -676 -4023 -6191 -5742 -3519 194 3881 5823 5746 3682 212 -3464 -5843
3787 -5843 -6112 -3890 -338 3314 5926 6052 4154 650 -2785 -5427 -5999 -4380 -1163 2546 5079 5924
3803E924j538l171l915k774o56J585L282L600K631J215j238l002l633k954j313
3818e957Q72L004L574L238J170q36k941l540l212j279M71K541L699L425J786m80
3834E535k599l660l013k039L56K305L433L689J692l01k009l518l476k150M3K126
3850c586L190L703K144J74j964l204l370k289k63J517L135L629K389P07j500l292
3866A120l639k486q10J403L033L377K853P92j296k814l515k771j017R23K951L696
$$ plain form
3803 5924 4386 1215 -2700 -5474 -6130 -4545 -1263 2337 4968 6183 4945 1943 -1690 -4644 -5957
3818 -5957 -5085 -2081 1493 4731 5901 5065 2124 -1416 -4628 -5907 -5436 -2895 804 4229 6015 5535
3834 5535 2936 -724 -3737 -5776 -5420 -3115 318 4007 5699 5398 3389 -129 -3605 -5755 -5712 -3586
3850 -3586 -396 3307 5451 5625 3661 457 -2913 -5202 -5465 -3948 -813 2816 5205 5912 4412 1120
3866 1120 -2519 -5005 -5815 -4412 -1379 1998 4851 5643 4347 1533 -1982 -4753 -5770 -4847 -1896 1800
$$ [...]
8191F13
##END NTUPLES=NMR FID
##END=
