##TITLE=1H_Pr 3Et-l
 CDCl3
 8 sc, 
 14.3.2024
##JCAMPDX= 6.0         $$ Bruker NMR JCAMP-DX V2.0
##DATA TYPE= NMR FID
##DATA CLASS= NTUPLES
##ORIGIN= UXNMR, Bruker Analytische Messtechnik GmbH
##OWNER= root
$$ XWIN-NMR		Version 3.5
$$ Thu Mar 14 14:49:49 2024 Russian Standard Time (UT+4h)  she@DPX200
##.OBSERVE FREQUENCY= 200.1313
##.OBSERVE NUCLEUS= ^1H
##.DELAY= (6, 6)
##.ACQUISITION MODE= SIMULTANEOUS
##.ACQUISITION SCHEME= undefined
##.AVERAGES= 8
##.DIGITISER RES= 18
##SPECTROMETER/DATA SYSTEM= spect
##.PULSE SEQUENCE= zg30
##.SOLVENT NAME= CDCl3
##.SHIFT REFERENCE= (INTERNAL, CDCl3, 0, 15.7039)
##AUDIT TRAIL= $$ (NUMBER, WHEN, WHO, WHERE, WHAT)
$$ ##TITLE= Audit trail, XWIN-NMR		Version 3.5
$$ ##JCAMPDX= 5.01
$$ ##ORIGIN= Bruker BioSpin GmbH
$$ ##OWNER= she
$$ F:/spectra/data/she/nmr/H-F/1/audita.txt
$$ ##AUDIT TRAIL=  $$ (NUMBER, WHEN, WHO, WHERE, WHAT)
(   1,<2024-03-14 14:48:21.00 +0400>,<she>,<DPX200>,
      <created by zg, POWCHK disabled, PULCHK disabled
       configuration hash MD5:
       00 E9 B6 7A A2 85 ED C7 34 08 36 98 17 FE 4E 26
       data hash MD5: 16K
       B2 9B E3 50 9B 8D 6C 03 27 6E 29 06 F3 0D 41 E0>)
$$ ##END=
$$ 
$$ hash MD5
$$ BB B8 F2 54 B7 A9 64 1F 9D 05 62 AF 40 6A 13 E8
##$RELAX= 
##$RELAX= 
##$RELAX= 
##$RELAX= 
##$RELAX= 
##$RELAX= 
$$ Bruker specific parameters
$$ --------------------------
##$DU= <F:/spectra>
##$EXPNO= 1
##$NAME= <H-F>
##$PROCNO= 1
##$TYPE= <nmr>
##$USER= <she>
##$AMP= (0..31)
100 100 100 100 100 100 100 100 100 100 100 100 100 100 100 100 100 100 
100 100 100 100 100 100 100 100 100 100 100 100 100 100 
##$AQSEQ= 0
##$AQ_mod= 1
##$AUNM= <au_zg>
##$AUTOPOS= <>
##$BF1= 200.13
##$BF2= 200.13
##$BF3= 200.13
##$BF4= 200.13
##$BF5= 200.13
##$BF6= 200.13
##$BF7= 200.13
##$BF8= 200.13
##$BYTORDA= 1
##$CFDGTYP= 0
##$CFRGTYP= 5
##$CHEMSTR= <none>
##$CNST= (0..31)
1 1 145 1 1 1 1 1 1 1 1 1 1 1 1 1 1 1 1 1 1 1 1 1 1 1 1 1 1 1 1 1 
##$CPDPRG= <>
##$CPDPRG1= <>
##$CPDPRG2= <>
##$CPDPRG3= <>
##$CPDPRG4= <mlev>
##$CPDPRG5= <mlev>
##$CPDPRG6= <mlev>
##$CPDPRG7= <mlev>
##$CPDPRG8= <mlev>
##$CPDPRGB= <>
##$CPDPRGT= <>
##$D= (0..31)
0 1.2 0 0 0 0 0 0 0 0.06 0 0.03 0 0 0 0 0.0002 0 0 0 0 0 0 0 0 0 0 0 0 
0 0 0 
##$DATE= 1710413300
##$DBL= (0..7)
120 120 120 120 120 120 120 120 
##$DBP= (0..7)
150 150 150 150 150 150 150 150 
##$DBP07= 0
##$DBPNAM0= <>
##$DBPNAM1= <>
##$DBPNAM2= <>
##$DBPNAM3= <>
##$DBPNAM4= <>
##$DBPNAM5= <>
##$DBPNAM6= <>
##$DBPNAM7= <>
##$DBPOAL= (0..7)
0.5 0.5 0.5 0.5 0.5 0.5 0.5 0.5 
##$DBPOFFS= (0..7)
0 0 0 0 0 0 0 0 
##$DE= 6
##$DECBNUC= <off>
##$DECIM= 32
##$DECNUC= <off>
##$DECSTAT= 4
##$DIGMOD= 1
##$DIGTYP= 9
##$DL= (0..7)
0 120 120 120 120 120 120 120 
##$DP= (0..7)
150 150 150 150 150 150 150 150 
##$DP07= 0
##$DPNAME0= <>
##$DPNAME1= <>
##$DPNAME2= <>
##$DPNAME3= <>
##$DPNAME4= <>
##$DPNAME5= <>
##$DPNAME6= <>
##$DPNAME7= <>
##$DPOAL= (0..7)
0.5 0.5 0.5 0.5 0.5 0.5 0.5 0.5 
##$DPOFFS= (0..7)
0 0 0 0 0 0 0 0 
##$DQDMODE= 0
##$DR= 18
##$DS= 0
##$DSLIST= <SSSSSSSSSSSSSSS>
$$ [...]
##$SUBNAM2= <"">
##$SUBNAM3= <"">
##$SUBNAM4= <"">
##$SUBNAM5= <"">
##$SUBNAM6= <"">
##$SUBNAM7= <"">
##$SUBNAM8= <"">
##$SUBNAM9= <"">
##$SW= 18.0517328524113
##$SWIBOX= (0..15)
0 0 2 0 0 0 0 0 0 0 0 0 0 0 0 0 
##$SW_h= 3612.71676300578
##$TD= 16384
##$TD0= 1
##$TE= 0
##$TE2= 300
##$TE3= 300
##$TEG= 300
##$TL= (0..7)
0 120 120 120 120 120 120 120 
##$TP= (0..7)
150 150 150 150 150 150 150 150 
##$TP07= 0
##$TPNAME0= <>
##$TPNAME1= <>
##$TPNAME2= <>
##$TPNAME3= <>
##$TPNAME4= <>
##$TPNAME5= <>
##$TPNAME6= <>
##$TPNAME7= <>
##$TPOAL= (0..7)
0.5 0.5 0.5 0.5 0.5 0.5 0.5 0.5 
##$TPOFFS= (0..7)
0 0 0 0 0 0 0 0 
##$TUNHIN= 0
##$TUNHOUT= 0
##$TUNXOUT= 0
##$USERA1= <user>
##$USERA2= <user>
##$USERA3= <user>
##$USERA4= <user>
##$USERA5= <user>
##$V9= 5
##$VALIST= <valist>
##$VCLIST= <CCCCCCCCCCCCCCC>
##$VD= 0
##$VDLIST= <DDDDDDDDDDDDDDD>
##$VPLIST= <PPPPPPPPPPPPPPP>
##$VTLIST= <TTTTTTTTTTTTTTT>
##$WBST= 1024
##$WBSW= 4
##$XGAIN= (0..3)
0 0 0 0 
##$XL= 0
##$YL= 0
##$YMAX_a= 621464
##$YMIN_a= -627065
##$ZGOPTNS= <>
##$ZL1= 120
##$ZL2= 120
##$ZL3= 120
##$ZL4= 120
##$ABSF1= 10
##$ABSF2= 0
##$ABSG= 5
##$ABSL= 3
##$ALPHA= 0
##$AQORDER= 0
##$ASSFAC= 0
##$ASSFACI= 0
##$ASSFACX= 0
##$ASSWID= 0
##$AUNMP= <proc_1d>
##$AZFE= 0.1
##$AZFW= 0.1
##$BCFW= 1
##$BC_mod= 2
##$BYTORDP= 1
##$COROFFS= 0
##$CY= 11.3945322036743
##$DATMOD= 1
##$DC= 2
##$DFILT= <>
##$DTYPP= 0
##$F1P= 15.7292609196834
##$F2P= 12.9074282941183
##$FCOR= 0.5
##$FTSIZE= 0
##$FT_mod= 4
##$GAMMA= 1
##$GB= 0.15
##$INTBC= 1
##$INTSCL= 1
##$ISEN= 128
##$LB= 0.24
##$LEV0= 0
##$LPBIN= 0
##$MAXI= 10000
##$MC2= 0
##$MEAN= 0
##$ME_mod= 0
##$MI= 1.114404
##$NCOEF= 0
##$NC_proc= 0
##$NLEV= 6
##$NOISF1= 3.799351
##$NOISF2= 2.8
##$NSP= 1
##$NTH_PI= 0
##$NZP= 0
##$OFFSET= 15.70392
##$PC= 1
##$PHC0= -25302.21
##$PHC1= 11.38731
##$PH_mod= 1
##$PKNL= yes
##$PPARMOD= 0
##$PSCAL= 0
##$PSIGN= 0
##$REVERSE= no
##$SF= 200.130013532006
##$SI= 16384
##$SIGF1= 3
##$SIGF2= 2
##$SINO= 400
##$SIOLD= 16384
##$SREGLST= <1H.CDCl3>
##$SSB= 0
##$STSI= 0
##$STSR= 0
##$SW_p= 3612.71676300578
##$SYMM= 0
##$S_DEV= 0
##$TDeff= 0
##$TDoff= 0
##$TI= <>
##$TILT= no
##$TM1= 0
##$TM2= 0
##$TOPLEV= 0
##$USERP1= <user>
##$USERP2= <user>
##$USERP3= <user>
##$USERP4= <user>
##$USERP5= <user>
##$WDW= 1
##$XDIM= 8192
##$YMAX_p= 0
##$YMIN_p= 0
$$ End of Bruker specific parameters
$$ ---------------------------------
##NTUPLES= NMR FID
##VAR_NAME=  TIME,          FID/REAL,        FID/IMAG
##SYMBOL=    X,             R,               I
##VAR_TYPE=  INDEPENDENT,   DEPENDENT,       DEPENDENT
##VAR_FORM=  AFFN,          ASDF,            ASDF
##VAR_DIM=   8192,          8192,            8192
##UNITS=     SECONDS,       ARBITRARY UNITS, ARBITRARY UNITS
##FACTOR=    0.0002768,     1,               1
##FIRST=     0,             0,               0
##LAST=      2.2672688,     0,               0
##MIN=       0,             -627065,         0
##MAX=       2.2672688,     621464,          0
$$ Real data points
##PAGE= N=1
##DATA TABLE= (X++(R..R)), XYDATA
$$ plain form
0 0 0 0 0 0 0 0 0 0 0 0 0 0 0 0 0 0 0 -1 0 0 8 -8 8 -8 8 -8 12 -12 13 -17 19 -20 22 -27 29 -32 33 -39 44 -47 52 -58
42 -58 61 -68 77 -82 91 -100 111 -122 133 -147 165 -181 202 -229 256 -292 335 -391 461 -557 690
63 690 -885 1186 -1701 2692 -5014 12776 -90641 -627065 -541359 32916 316193 105375 -131544
76 -131544 -30930 152180 98756 -26999 60263 200266 4778 -431741 -498339 23972 540377
87 540377 435855 -104895 -374338 -108579 213954 155053 -100005 -165453 -45882 -20214 -94063
98 -94063 20642 308986 344677 -49161 -442374 -327926 153892 368498 80492 -261361
108 -261361 -214152 87990 216158 85766 -15446 11223 -38067 -206905 -222571 71906 360851
119 360851 228120 -188048 -340447 -40737 293875 225078 -112215 -254176 -95931 65793
$$ packed form
0@%%%%%%%%%%%%%%%%%jJ%Qj6J6j6J6j6K0k4K5l0L6l9M2m9N6o1O5p2Q3r1R9j10
42e8J19j29J45j59J73j91K11k33K55k80L12l46L83m31M85n48O27p26Q52j018J247
63F90j575K071k887M393p706J7790j03417n36424Q5706N74275K83277k10818k36919
76a31544J00614J83110n3424j25755Q7262J40003j95488m36519o6598N22311N16405
87E40377j04522n40750k69443K65759L22533n8901k55058o5448J19571K5668p3849
98i4063J14705K88344L5691l93838l93213J14448M81818K14606k88006l41853
108b61361M7209L02142J28168j30392j01212K6669m9290j68838j5666K94477K88945
119C60851j32731m16168j52399K99710L34612o8797l37293j41961J58245J61724
$$ plain form
129 65793 59537 31273 108074 127806 -69971 -265840 -144229 186052 289311 3441 -294447
140 -294447 -201148 136126 271074 87729 -119061 -110790 -12436 -22301 -56038 43925 168072
151 168072 84812 -161729 -229965 24137 272074 171893 -146899 -273147 -69426 163661
161 163661 146534 -5991 -51799 1855 -8754 -84957 -45521 121485 162382 -38838 -233883
172 -233883 -139901 149770 255904 45042 -186977 -160678 28536 110698 31146 -26716 14481
183 14481 18967 -66687 -93812 39526 178601 95908 -138963 -212161 -20898 184066 148651
194 148651 -51520 -140301 -44527 52489 37316 -5376 16858 40553 -34128 -119608 -50222 120067
206 120067 163511 -20 -169605 -121957 68474 146522 42863 -76653 -69919 4736 18901
$$ packed form
129F5793o256k8264P6801J9732j97777j95869J21611L30281J03259k85870k97888
140b94447R3299L37274J34948j83345k06790Q271R8354r865l3737R9963J24147
151A68072q3260k46541o8236K54102K47937j00181l18792j26248K03721K33087
161A63661j7127j52525m5808N3654j0609p6203L9436J67006M0897k01220j95045
172b33883R3982K89671J06134k10862k32019K6299J89214Q2162p9552n7862M1197
183A4481M486q5654k7125J33338J39075q2693k34871p3198J91263K04964l5415
194A48651k00171q8781R5774R7016j5173m2692K2234K3695p4681q5480O9386J70289
206A20067M3444j63531j69585M7648J90431P8048j03659j19516O734P4655J4165
$$ plain form
217 18901 -6014 22861 67451 19977 -95821 -118902 19605 149646 91778 -77383 -139931
228 -139931 -28465 97296 81036 -15017 -47501 -13890 -1941 -25420 -7215 65196 75740
239 75740 -28143 -118784 -65256 76162 122657 11125 -102456 -77432 25985 69161 23870
250 23870 -17648 -4110 1487 -32585 -38133 24535 83636 41192 -69510 -97850 -488 93468
262 93468 67840 -34829 -79056 -24487 31876 26324 1540 4545 13768 -14434 -50942 -19927
274 -19927 55610 70442 -4834 -78978 -53718 38247 73155 19367 -40018 -38547 1052 14120
286 14120 -504 5238 22728 6104 -35601 -44498 8794 61234 36429 -33377 -58016 -12345
298 -12345 42280 38339 -5293 -22541 -8686 664 -3218 -787 18345 21810 -12479 -40926 -20688
$$ packed form
217A8901k4915K8875M4590m7474j15798k3081J38507J30041n7868j69161o2548
228a39931J11466J25761j6260r6053l2484L3611J1949k3479J8205P2411J0544
239G5740j03883r0641N3528J41418M6495j11532j13581K5024J03417M3176m5291
250B3870m1518J3538N597l4072n548O2668N9101m2444j10702k8340R7362R3956
262I3468k5628j02669m4227N4569N6363n552k4784L005R223k8202l6508L1015
274a9927P5537J4832p5276p4144K5260R1965L4908n3788n9385J471L9599J3068
286A4120j4624N742J7490j6624m1705q897N3292N2440k4805o9806k4639M5671
298a2345N4625l941m3632j7248J3855R350l882K431J9132L465l4289k8447K0238
$$ plain form
311 -20688 26538 43141 4854 -37129 -28533 8776 25576 12246 -6326 -5739 -757 -7242 -6843
324 -6843 9722 22304 9413 -21443 -29082 1028 26546 18006 -10190 -23630 -8003 9928 8526
337 8526 1168 -531 392 -2724 -9380 -2308 14617 15015 -2257 -16173 -10969 8960 15575 2020
351 2020 -9636 -9080 -1081 4293 736 -800 1972 -1415 -4803 -3643 1660 8139 4581 -4276 -4930
366 -4930 -9 5216 5725 -1238 -3679 -1166 -193 1805 741 -2724 -1740 -1175 -278 1158 -1622 -2148 87
383 87 801 1783 864 -1027 1697 1392 -1295 800 3069 3198 -473 -6678 -3797 4898 5887 -386 -8256
400 -8256 -7611 2909 6290 712 -2753 -2345 629 549 -2068 2988 8297 3139 -6363 -9708 879 13316
416 13316 7756 -7567 -11763 -3727 6816 5976 -2596 -3384 -333 -2336 -4522 -1638 7979 11284 -2691
$$ packed form
311b0688M7226J6603l8287m1983Q596L7309J6800j3330j8572N87M982o485L99
324f843J6565J2582j2891l0856p639L0110K5518q540k8196j3440J5627J7931j402
337H526p358j699R23l116o656P072J6925L98j7272j3916N204J9929O615j3555
351B020j1656N56P999N374l557j536K772l387l388J160N303O479l558q857o54
366d930M921N225N09o963k441K513R73J998j064l465R84N65Q97J436k780n26K235
383H7P14R82r19j891K724l05k687K095K269J29l671o205K881Q695R89o273p870
400h256O45J0520L381n578l465M08K974q0k617N056N309n158r502l345J0587J2437
416A3316n560j5323m196Q036J0543q40q572p88L051k003k186K884R617L305j3975
$$ plain form
431 -2691 -14436 -6566 10025 16414 2889 -12554 -8718 3186 6747 2149 -2737 215 715 -7633
445 -7633 -8773 3803 13387 7024 -11381 -17197 831 16521 11592 -4279 -11794 -2219 6662 2629
459 2629 -391 3013 3524 -3459 -12198 -6407 11343 14199 -2009 -17155 -12518 7600 15673 3040
473 3040 -7715 -6237 883 3593 -16 2363 8435 2658 -9281 -11420 1500 16054 9600 -10690
487 -10690 -16044 -3506 9661 9189 -2908 -6806 -1334 -135 -2048 -301 6611 9413 -1996 -12794
501 -12794 -5395 9661 14044 2296 -12318 -9750 3315 7165 2069 -3428 -2788 275 -3532 -5069
515 -5069 3003 8611 4092 -6782 -11016 563 12327 8224 -3078 -8624 -2789 5321 3493 -783
529 -783 -177 -401 -2286 -4580 -3074 4757 6673 -1770 -8008 -5760 3779 8807 1931 -4308 -2897 718
$$ packed form
431b691j1745P870J6591O389j3525j5443L836J1904L561m598m886K952N00q348
445g633j140J2576R584o363j8405n816J8028J5690m929j5871p515R575Q881m033
459B629l020L404N11o983q739N791J7750K856j6208j5146M637K0118Q073j2633
473C040j0755J478P120K710l609K379O072n777j1939k139J2920J4554o454k0290
487a0690n354J2538J3167m72j2097l898N472J199j913J747O912K802j1409j0798
501a2794P399J5056M383j1748j4614K568J3065L850n096n497O40L063l807j537
515e069Q072N608m519j0874m234J1579J1764m103j1302n546N835Q110j828m276
529g83O06k24j885k294J506P831J916q443o238K248R539N028o876o239J411L615
$$ plain form
545 718 3543 2153 -344 1430 617 -2685 -2589 -78 3281 2462 -4031 -4960 -840 2291 3077 -599 -3485
562 -3485 -406 1717 1581 1434 -332 105 1261 243 973 532 -755 -68 -760 -1328 422 -88 -784 -1420
580 -1420 -2714 -225 2897 1730 -671 -3553 -1738 4248 5145 883 -2697 -3092 1119 3868 914 -240
596 -240 -447 -1673 -2602 -2822 1452 5916 1188 -6601 -7322 -37 8660 6715 -3314 -6472 -1674 3635
612 3635 4487 1048 713 1727 -3463 -6588 -1192 7419 9010 -2953 -14384 -7919 6790 11775 2748
627 2748 -8913 -7409 1522 3534 2080 3173 4303 953 -8623 -9157 5736 16012 7246 -11449
641 -11449 -17959 -1484 14602 9465 -4456 -10165 -4134 2273 -397 -338 7236 7654 -4641 -15431
655 -15431 -6474 15511 20388 -847 -19080 -13280 7690 16572 3332 -8634 -5358 -207 -2414
$$ packed form
545G18K825j390k497J774q13l302R6K511L359q19o493r29M120L131P86l676k886
562c485L079K123j36j47j766M37J156j018P30m41j287O87o92n68J750n10o96o36
580a420j294K489L122j167k401k882J815N986Q97m262l580l95M211K749k954j154
596b40k07j226r29k20M274M464m728p789p21P285Q697j945j0029l158M798N309
612C635Q52l439l35J014n190l125N396Q611J591j1963j1431O465J4709M985r027
627B748j1661J504Q931K012j454J093J130l350r576n34J4893J0276q766j8695
641a1449o510J6475J6086n137j3921n709O031O407k670N9P574M18j2295j0790
655a5431Q957K1985M877k1235j8233N800K0970Q882j3240j1966L276N151k207
$$ plain form
668 -2414 -4786 3277 14081 5315 -16281 -19010 2929 24023 16383 -11914 -21982 -3780 14003
681 14003 11952 -1058 -5330 492 -2628 -9640 -2729 13592 16417 -5089 -26487 -14478 16229
694 16229 25315 3914 -19304 -16043 5299 12411 4043 -140 2577 1148 -10243 -12720 6904 23970
708 23970 10159 -19261 -27280 -1624 24931 16826 -8897 -18369 -6065 6610 4118 172 7348
721 7348 8472 -7635 -20249 -6864 21842 27295 -3543 -29724 -18312 13148 24817 5138 -14741
734 -14741 -10462 221 -692 -2936 5835 15979 4447 -21729 -23359 7504 32533 18693 -18592
747 -18592 -29982 -3024 21219 15525 -3618 -9655 -2089 -1905 -9583 -1892 17128 18165 -8347 -31779
761 -31779 -15688 23195 32269 2178 -26495 -20080 8276 18364 5258 -3302 343 -491 -10931
$$ packed form
668b414k372Q063J0804q766k1596k729K1939K1094p640k8297j0068J8202J7783
681A4003k051j3010m272N822l120p012O911J6321K825k1506k1398J2009L0707
694A6229R086k1401k3218L261K1342P112q368m183K717j429j1391k477J9624J7066
708B3970j3811k9420q019K5656K6555q105k5723r472J2304J2675k492l946P176
721G348J124j6107j2614J3385K8706N453l0838k6181J1412L1460J1669j9679j9879
734a4741M279J0683r13k244Q771J0144j1532k6176j630L0863K5029j3840l7285
747a8592j1390K6958K4243n694j9143o037P566J84p678P691J9020J037k6512k3432
761c1779J6091L8883R074l0091k8673O415K8356J0088j3106q560L645q34j0440
$$ plain form
774 -10931 -13030 8650 27572 10512 -24808 -32026 -27 31440 21646 -12177 -24352 -7169 10228
787 10228 9123 1171 4800 6494 -8581 -20443 -5776 23409 28085 -4649 -33638 -20392 15021
800 15021 28116 6665 -17164 -14321 -11 2730 573 6423 13056 2579 -20263 -21201 8899
813 8899 31967 17018 -18930 -30515 -3790 22053 16735 -3180 -11274 -5119 -1819 -6321 228
826 228 16274 14794 -9888 -28572 -12439 23010 30206 653 -25307 -18228 7918 18086 5541
839 5541 -3771 -1050 -1809 -10071 -9998 8348 23485 7444 -22947 -26719 1755 27887 18479 -11385
853 -11385 -21461 -5332 9737 8251 1078 2820 4884 -6797 -16622 -4141 18973 21957 -4546
866 -4546 -28232 -16598 13324 23128 4991 -14998 -12249 1429 4022 634 4371 9168 1989 -14462
$$ packed form
774a0931k099K1680J8922j7060l5320p218L1999L1467r794l3823j2175J7183J7397
787A0228j105p952L629J694j5075j1862J4667K9185M676l2734k8989J3246L5413
800A5021J3095k1451k3829K843J4310K741k157N850O633j0477k2842r38L0100
813H899K3068j4949l5948j1585K6725K5843n318j9915q094O155L300m502O549
826B28J6046j480k4682j8684J6133L5449P196k9553k5960P079K6146J0168j2545
839E541r312K721p59q262P3J8346J5137j6041l0391l772K8474K6132r408k9864
853a1385j0076J6129J5069j486p173J742K064j1681r825J2481K3114K984k6503
866d546k3686J1634K9922R804j8137j9989K749J3678K593l388L737M797p179j6451
$$ plain form
880 -14462 -16127 6775 24824 12468 -14914 -23761 -3282 17699 12829 -3694 -9808 -4142 -183
893 -183 -3087 -450 10750 10477 -6546 -19411 -8607 15920 21970 423 -18200 -12969 5658 13498
907 13498 4138 -4181 -1892 -1473 -6061 -5602 4870 14348 4869 -15064 -17082 2029 18090 12419
921 12419 -7627 -14688 -2758 7154 6372 998 337 1945 -4034 -9752 -1665 11498 11984 -3484 -17506
936 -17506 -9700 9227 14091 2309 -9463 -7726 1856 3658 690 2539 4725 530 -7531 -8419
950 -8419 4217 13877 5789 -9217 -13052 -1621 10231 7085 -3335 -6027 -2372 528 -297 -49
964 -49 5041 5211 -3473 -8880 -3207 8221 11095 -232 -9657 -6320 3140 6919 2131 -3352 -2092
979 -2092 -465 -2519 -1865 2229 5405 1779 -6590 -7026 1738 8046 5556 -3169 -6451 -634 3928 2717
$$ packed form
880a4462j665K2902J8049j2356k7382q847K0479K0981m870j6523o114N666L959
893a83k904K637J1200k73j7023j2865J0804K4527O050k1547j8623N231J8627P840
907A3498r360q319K289M19m588M59J0472R478r479j9933k018J9111J6061n671
921A2419k0046p061J1930R912p82n374o61J608n979n718Q087J3163M86j5468j4022
936a7506P806J8927M864j1782j1772J737R582J802k968J849K186m195q061q88
950h419J2636R660q088j5006l835J1431J1852l146j0420k692L655K900q25K48
964d9N090J70q684n407N673J1428K874j1327r425L337R460L779m788n483J260
979b092J627k054O54M094L176l626q369m36Q764O308k490q725l282N817M562j211
$$ plain form
995 2717 510 -559 -6 -1064 -3723 -829 3920 3355 -1552 -6201 -3642 3476 4930 551 -2821 -2595
1011 -2595 924 2174 450 902 1532 -70 -1551 -2230 581 3862 1086 -2889 -3172 -1271 2143 1667
1027 1667 -1450 -1497 -667 91 602 78 603 1753 -219 -951 73 814 1749 559 -1248 -517 -339 52
1045 52 420 -825 -501 11 -655 -74 -191 -541 521 762 354 327 -626 -125 1449 886 319 -447 -938 173
1065 173 73 -614 215 35 -856 -1593 -1816 393 2514 749 -1664 -2160 -311 2839 2113 -460 -562 -386
1083 -386 -155 117 79 1744 1629 -1982 -3512 -1611 2275 3559 -790 -4210 -2578 566 2731 1452
1099 1452 -724 -134 29 -1325 -151 2125 3964 1498 -3883 -4438 1041 4533 2659 -2381 -4997 -1453
1115 -1453 1469 1003 394 97 -15 -1394 -3543 -140 5122 4404 -1092 -5674 -3212 4073 5604 729
$$ packed form
995B717k207j069N53j058k659K894M749n65m907m649K559P118J454m379l372K26
1011b595L519J250j724M52O30j602j481o79K811L281k776l975k83J901L414m76
1027A667l117m7Q30P58N11n24N25J150j972p32J024P41R35j190j807P31J78L91
1045E2L68j245L24N12o66N81j17l50J062K41m08k7r53N01J574n63n67p66m91J111
1065A73j00o87Q29j80q91p37k23K209K121j765k413m96J849L150p26k573j02J76
1083c86K31K72l8J665j15l611j530J901L886J284m349l420J632L144K165j279
1099A452k176N90J63j354J174K276J839k466n381n55N479L492j874n040k616L544
1115a453K922m66o09k97j12j379k149L403N262p18n496m582K462P285J531m875
$$ plain form
1131 729 -3224 -3234 -102 1113 -363 872 2078 -871 -4467 -4116 2069 7284 2860 -4904 -5839 -178
1147 -178 5924 4402 -1306 -2620 -508 58 -298 215 2851 2964 -3008 -6649 -2270 4772 6656 -427
1163 -427 -7332 -4048 2787 4838 1983 -1653 -873 437 -1535 -1343 2609 4932 1874 -5449 -6702 1147
1179 1147 6810 3932 -3366 -6591 -1583 3418 2238 -134 -231 146 -1007 -2844 -314 5517 5070 -1614
1195 -1614 -6506 -3738 4437 6534 435 -4820 -3853 134 1990 319 221 1542 -588 -3712 -3071 1964
1211 1964 6834 3121 -4773 -5840 399 5788 4416 -1714 -3588 -824 331 -20 142 1782 2029 -2602
1227 -2602 -5987 -1541 4682 5546 -465 -6448 -3497 3349 4578 1629 -1510 -1423 507 -448 -858 2044
1243 2044 3420 481 -4407 -5287 1201 6122 2483 -3535 -5270 -1200 3639 2439 -290 -389 19 -283
$$ packed form
1131G29l953j0L132J215j476J235J206k949l596L51O185N215m424p764r35N661
1147a78O102j522n708j314K112N66l56N13K636J13n972l641M379P042J884p083
1163d27o905L284O835K051k855l636P80J310j972J92L952K323l058p323j253P849
1179A147N663k878p298l225N008N001j180k372r7L77j153j837K530N831m47o684
1195a614m892K768Q175K097o099n255R67L987J856j671r8J321k130l124O41N035
1211A964M870l713p894j067O239N389j372o130j874K764J155l51J62J640K47m631
1227b602l385M446O223Q64o011n983K951O846J229k949l139Q7J930r55m10K902
1243B044J376k939m888q80O488M921l639o018j735M070M839j200k729r9M08l02
$$ plain form
1259 -283 -1430 -176 4049 3745 -1750 -5039 -2693 3355 5311 -36 -4437 -3058 168 1977 609
1274 609 -592 461 -364 -2209 -1483 1711 4525 2134 -3550 -3957 725 4314 3012 -1534 -3318 -693
1290 -693 527 384 415 211 285 -1301 -3172 -651 3079 2868 -251 -3541 -1895 2475 3265 893 -1239
1307 -1239 -1675 175 655 -323 684 1141 -436 -2162 -2509 439 2966 934 -2160 -2720 -608 2078
1323 2078 2020 -275 -522 -86 79 149 216 1090 1232 -849 -1956 -833 980 1825 -196 -2420 -1418 148
1341 148 1113 643 -467 -478 126 -145 475 904 833 803 -513 -1050 514 1248 569 -436 -1645 -672 504
1360 504 206 49 -817 -853 197 9 320 575 62 162 239 -89 706 814 197 -160 -704 -131 894 -3
1380 -3 -528 -979 -787 208 409 -584 -432 -302 -61 544 191 359 597 -102 -96 -55 314 1332 357 -1186 -985
$$ packed form
1259b83j147J254M225l04n495l289K346O048J956n347m401J379L226J809j368
1274F09j201J053q25j845P26L194K814k391n684m07M682L589j302m546j784K625
1290f93J220j43L1k04P4j586j871K521L730k11l119l290J646M370P90k372k132
1307a239m36J850M80r78J007M57j577j726l47K948K527k032l094n60K112K686
1323B078n8k295k47M36J65P0O7Q74J42k081j107J123J813Q45k021k224J002J566
1341A48R65m70j110j1O04k71O20M29p1l0j316n37J564P34o79j005j209R73J176
1360E04k98j57q66l6J050j88L11K55n13J00P7l28P95J08o17l57n44N73J025q97
1380cn25m51J92R95K01r93J52J30K41O05l53J68K38o99OM1L69J018r75j543K01
$$ plain form
1401 -985 -99 874 526 -1366 -1280 -180 -20 310 76 -3 527 -287 -856 471 1605 1332 -304 -1843 -347
1420 -347 1656 1448 23 -1784 -1213 558 218 -555 139 100 -238 -1229 -1345 1341 2386 394 -1641 -1902
1438 -1902 762 2890 1217 -1356 -1078 5 759 21 -665 696 687 -1518 -2199 -850 2098 2615 -1213
1455 -1213 -2979 -813 2021 2811 306 -1621 -351 687 285 -24 457 1500 461 -2684 -2210 1010
1471 1010 2880 1159 -2762 -3406 250 2363 1363 -627 -1211 374 408 -707 449 2299 1863 -1044
1487 -1044 -3213 -979 3121 2814 -845 -3398 -2233 1376 2000 -281 -974 29 -139 -844 -1029 1578
1503 1578 3284 333 -2881 -2535 1167 4177 1754 -2402 -2568 -275 1107 729 -589 226 443 -1594
1519 -1594 -2155 -224 2849 2756 -1392 -3927 -850 2951 3352 244 -2447 -1045 858 303 108 450 1095
$$ packed form
1401i85Q86R73l48j892Q6J100J60L30k34p9N30q14n69J327J134k73j636j539J496
1420c47K003k08j425j807N71J771l40p73O94l9l38r91j16K686J045j992k035k61
1438a902K664K128j673k573K78J083P54p38o86J361rk205o81J349K948N17l828
1455a213j766K166K834P90k505j927J270J038m02l09M81J043j039l145M74L220
1471A010J870j721l921o44L656K113j000j990n84J585L4j115J156J850m36k907
1487a044k169K234M100l07l659k553J165L609O24k281o93J003j68p05j85K607
1503A578J706k951l214L46L702L010k423m156j66K293J382l78j318Q15K17k037
1519a594n61J931L073r3m148k535L077L801M01l108k691J402J903n55j95L42O45
$$ plain form
1536 1095 -160 -2949 -2353 1754 3340 885 -3263 -3631 746 3501 1466 -1024 -1462 5 1022 -333
1552 -333 144 2061 1241 -1433 -3224 -984 3316 2882 -1516 -3478 -2123 1427 2408 -91 -1004 -115 -148
1569 -148 -638 -402 1273 3039 565 -2823 -2326 1146 3536 1682 -2455 -2766 -177 1246 794 -432
1585 -432 -357 317 -1176 -1760 195 2438 2374 -978 -3391 -727 2812 2763 186 -1998 -1261 566 435 -94
1603 -94 518 363 -431 -2079 -1853 1388 2697 332 -2223 -2603 318 2669 1349 -646 -810 57 537
1620 537 -12 219 1674 494 -1367 -2216 -687 2118 1937 -1049 -2421 -1216 890 1503 184 -647 221
1637 221 -48 -421 -19 962 1873 244 -2088 -1372 702 1830 874 -1462 -1891 -79 614 130 -125 -307
1655 -307 171 -475 -1208 361 1607 1179 -171 -1449 -296 1542 1229 71 -811 -833 294 -53 -339 237
$$ packed form
1536A095j255k789N96M107J586k455m148l68M377K755k035k490m38J467J017j355
1552c33M77J917q20k674j791K240M300m34m398j962J355L550R81k499r13Q89l3
1569a48m90K36J675J766k474l388M97L472K390j854m137l11K589J423m52j226
1585d32P5O74j493n84J955K243o4l352k413K664L539m9k577k184P37J827j31n29
1603i4O12j55p94j648K26L241J309k365k555l80K921K351j320j995j64Q67M80
1620E37n49K31J455j180j861q49J529K805j81k986j372J205K106O13j319q31Q68
1637B21k69l73M02R81R11j629k332P16K074J128r56k336m29J812O93m84k55j82
1655c07M78o46p33J569J246m28j350j278J153J838l13j158q82k2J127l47k86N76
$$ plain form
1673 237 115 -269 -971 -880 593 1292 208 -608 -820 202 1283 496 -175 178 -87 -121 -215 -2 523 260
1693 260 -827 -818 -427 255 432 -493 -645 -103 58 255 266 78 467 63 -262 198 328 414 339 -549 -392
1714 -392 -109 -224 -126 -127 -188 38 -548 -443 329 265 118 66 -334 311 401 149 542 269 24 -118 -307 57
1736 57 615 16 -616 -689 -385 162 -70 -399 129 -64 -438 -186 -29 1117 1092 -215 -870 -210 681 1213
1756 1213 54 -847 -449 -274 -163 55 1 296 -162 -1258 -762 610 1221 868 -803 -1201 509 968
1774 968 781 -63 -568 173 1 -356 277 827 361 -751 -1830 -640 1341 1323 -291 -1579 -858 672
1792 672 1059 161 281 234 -141 -380 -547 881 1676 -14 -1829 -1663 152 1904 824 -1334 -1306 -573
1810 -573 522 480 -166 663 434 -872 -1232 270 2073 2059 -820 -2187 -627 1466 1817 262 -1370
$$ packed form
1673B37j22l84p02R1J473O99j084q16k12J022J081p87o71L53k65l4r4K13N25k63
1693B60j087RL91O82J77r25j52N42J61J97J1j88L89m04l25M60J30Q6p5q88J57
1714c92K83j15R8jo1K26n86J05P72o4j47n2m00O45R0k52L93k73k45j42j89L64
1736E7N58n99o32p3L04N47k32l29N28j93l74K52J57J146k5j307o55O60Q91N32
1756A213j159r01L98J75J11K18n4K95m58j096M96J372O11l53j671l98J710M59
1774I68j87q44n05P41j72l57O33N50m66j112j079J190J981j8j614j288P21J530
1792F72L87q98J20m7l75k39j67J428P95j690j815J66J815J752j080k158K8P33
1810e73J095m2o46Q29k29j306l60J502J803j4k879j367J560K093L51j555j632
$$ plain form
1827 -1370 -784 -122 -354 -46 508 981 -289 -1948 -1562 1298 2534 1159 -1594 -2065 562 2141 1046
1844 1046 -107 -765 -243 -234 -1044 123 1744 861 -1402 -2950 -879 2544 2293 -628 -2408 -1308 1057
1861 1057 1531 358 32 369 -349 -992 -723 1013 2488 126 -2772 -2262 348 2661 1397 -1659 -1921
1878 -1921 -370 592 626 104 605 642 -1115 -1585 395 2393 2332 -874 -3115 -1088 1766 2040 -21 -1790
1896 -1790 -1148 88 -179 -101 887 940 -184 -2080 -1705 1705 3125 878 -1842 -2416 306 2256 1325
1913 1325 -449 -868 -533 -204 -757 127 1814 872 -1636 -2595 -603 2455 2535 -635 -2355 -1095 990
1930 990 1772 462 -225 319 -289 -1124 -703 1056 2090 68 -2718 -2283 589 2570 996 -1461 -1781
1947 -1781 -38 866 805 450 430 595 -681 -1652 255 2157 1934 -906 -3019 -1200 1765 1732 -159 -1623
$$ packed form
1827a370N86O62k32L08N54M73j270j659L86K860J236j375k753m71K627J579j095
1844A046j153o58N22Rq10J167J621q83k263j548K071L423k51k921j780J100K365
1861A057M74j173l26L37p18o43K69J736J475k362k898N10K610K313j264l056k62
1878a921J551R62L4n22N01L7j757m70J980J998o1l206k241K027K854K74k061j769
1896a790O42J236k67P8R88N3j124j896L75L410J420k247k720n74K722J950r31
1913A325j774m19L35L29n53Q84J687r42k508r59J992L058Q0l170j720J260K085
1930I90P82j310o87N44o08q35M21J759J034k022k786M35K872J981j574k457l20
1947a781J743R04o1l55k0J65j276r71J907J902k23k840k113J819K965l3j891j464
$$ plain form
1965 -1623 -1100 274 110 -127 624 928 -106 -1392 -1335 1307 2709 711 -1757 -2010 170 2063 853
1982 853 -894 -928 -591 -337 -484 -76 1094 669 -1106 -1871 -316 2010 2149 -551 -1802 -557 1131
1999 1131 1299 378 -554 25 -106 -817 -244 496 1213 112 -1926 -1509 750 1696 1054 -1110 -1660 325
2017 325 1077 481 347 -14 269 -431 -893 178 1517 988 -793 -1847 -832 1171 1127 -99 -1245 -820
2035 -820 254 280 112 462 510 -79 -660 -581 804 1579 138 -1273 -1155 -9 1221 675 -638 -696 -287
2054 -287 -110 43 -51 209 457 -574 -820 -125 1156 1229 -106 -1107 -420 668 696 281 -559 -322 -178
2073 -178 -511 -97 302 429 -159 -1054 -931 618 756 551 -352 -676 373 796 428 197 -113 -32 13 -207
2093 -207 -29 602 121 -498 -801 -542 606 389 -295 -310 -345 137 670 93 147 176 2 -69 16 160 440 153
$$ packed form
1965a623N23J374j64k37P51L04j034j286N7K642J402j998k468k53K180J893j210
1982H53j747l4L37K54j47M08J170m25j775p65J555K326J39k700j251J245J688
1999A131J68r21r32N79j31p11N73P40P17j101k038M17K259R46o42k164n50J985
2017C25P52n96j34l61K83p00m62J071J339n29j781j054J015K003m4j226j146M25
2035h20J074K6j68L50M8n89n81P9J385P75j441j411J18J146J230n46j313n8M09
2054b87J77J53r4K60K48j031k46O95J281P3j335j001O87J088K8m15q40K37J44
2073a78l33M14L99J27n88q95J23J549J38k05r03l24J049M23l68k31l10Q1M5k20
2093b07J78O31m81o19l03K59J148k17o84j5l5M82N33n77N4K9j74p1Q5J44K80k87
$$ plain form
2115 153 -612 -298 -168 368 207 -510 -398 -113 -162 507 -134 -197 210 -4 72 197 287 369 151 -332 34 262
2137 262 120 66 -456 -505 -50 -112 84 -118 -440 66 177 -119 142 -68 -58 272 115 141 351 -49 113 -258
2159 -258 -214 271 364 -171 -296 -516 -76 415 -70 -328 -9 -165 235 126 116 453 150 -163 -149 154 517
2180 517 480 -419 -532 -51 171 499 -302 -633 -54 -83 -175 182 -4 344 173 -404 19 429 640 355 -324
2201 -324 -541 481 540 63 -151 -417 -226 -33 -342 -126 225 16 -318 -725 -23 957 427 -328 -467 -124
2221 -124 868 539 102 -131 -140 -29 -155 -204 331 428 -648 -977 -655 191 794 2 -865 -439 100 661 387
2242 387 -152 133 191 -305 -81 252 858 509 -769 -1031 66 766 729 -421 -1089 -312 324 266 80 210
2262 210 286 162 -575 -230 1017 1019 1 -831 -998 473 1037 107 -648 -812 -140 144 -97 -51 383 80
$$ packed form
2115A53p65L14J30N36j61p17J12K85m9O69o41o3M07k14P6J25R0Q2k18m83L66K28
2137B62j42n4n22m9M55o2J96k02l22N06J11k96K61k10J0L30j57K6K10m00J62l71
2159b58M4M85R3n35j25k20M40M91m85k58L19j56M00j09j0L37l03l13J4L03L63
2180E17l7q99j13M81K22L28q01l31N79k9r2L57j86L48j71n77M23M10K11k85o79
2201c24k17J022N9m77k14k66J91J93l09K16L51k09l34m07P02R80n30p55j39L43
2221a24R92l29m37k33rJ11j26m9N35R7j076l29L22Q46O03p92q67M26N39N61k74
2242C87n39K85N8m96K24L33O06l49j278k62J097P00l7j150o68P77O36n8j86J30
2262B10P6j24p37L45J247Kj018q32j67J471N64r30p55j64O72K84k41M6M34l03
$$ plain form
2282 80 -487 -529 20 1223 862 -601 -903 -231 852 976 -239 -456 -346 -1 25 -16 200 539 -249 -1180
2302 -1180 -527 470 1307 294 -1138 -753 412 774 735 -295 -274 177 -305 -174 290 576 302 -938 -1345
2321 -1345 -110 902 830 -295 -1272 -374 588 428 161 -30 173 86 -297 -199 912 955 -38 -1056 -1016 493
2341 493 1093 8 -805 -772 -350 608 -34 -35 302 117 -530 -525 49 1036 936 -524 -946 -272 714 791 -156
2362 -156 -810 -287 -75 99 -42 -40 404 -158 -966 -221 567 1005 242 -971 -620 502 884 486 -157 -365
2382 -365 113 -14 -303 126 412 61 -846 -1046 -10 976 615 -325 -829 -382 603 565 49 -4 -179 127
2402 127 -309 -342 549 733 -121 -808 -711 116 944 -34 -752 -570 -42 344 253 -182 43 161 -218 -217 211 933
2424 933 679 -720 -782 51 642 490 -303 -949 -309 73 -98 -3 -14 67 -192 -528 -139 557 737 218 -452
$$ packed form
2282H0n67m2N49J203l61j463l02O72J083J24j215k17J10L45K6m1K16L39p88r31
2302a180O53R97Q37j013j432L85J165L62l9j030K1M51m82J31M64K86k74j240m07
2321a345J235J012p2j125r77Q98R62j60k67j91K03q7l83R8J111M3r93j018M0J509
2341D93O00j085q13L3M22R58o42jL37j85o47NN74R87j00j460m22O74R86P7r47
2362a56o54N23K12J74j41KM44n62q08P45P88M38p63j213L51J122L82l98o43k08
2382c65M78j27k89M29K86l51r07k00J036R86l61r40n04M47R85l8n16n3j75L06
2402A27m36l3Q91J84q54o87R7Q27Q28r78p18J82N28L86r1m35K25J18l79JM28P22
2424I33k54j399o2Q33N91j52p93o46O40L82j71R5j1Q1k59l36L89O96J80n19o70
$$ plain form
2445 -452 -536 395 648 324 -259 -233 -90 185 -236 68 214 -86 -472 -628 -152 882 369 -141 -321 -211
2465 -211 586 504 149 -64 89 2 -57 -86 300 532 -207 -579 -326 176 527 70 -535 -149 -114 246 309 -76
2487 -76 126 300 -93 -126 288 460 228 -375 -695 -85 264 243 -115 -532 -347 182 -118 -51 -19 143 113 -93
2509 -93 -117 401 519 213 -147 -266 196 513 16 -215 -233 -143 83 6 -25 56 0 -270 -107 -56 556 346 -160
2532 -160 -138 -127 259 369 7 -138 -76 -120 -117 -37 -79 123 -146 -443 -2 -11 159 282 -365 -42 136 154 129 -27
2556 -27 114 242 54 -25 193 -65 143 -136 -240 -97 63 -46 -84 -176 -175 152 -12 46 122 19 137 97 -15
2579 -15 300 256 -53 137 -238 91 112 -79 -177 -30 -231 96 -151 -257 65 -39 -107 34 32 206 283 -6 84
2602 84 91 171 288 -136 -194 108 -56 -120 -11 -226 -57 -110 -354 -107 33 -45 163 25 -131 189 -66 27 115
$$ packed form
2445d52q4R31K53l24n83K6J43K75m21L04J46l00l86j56M76J034n13n10j80J10
2465b11P97q2l55k13J53q7n9k9L86K32p39l72K53N02L51m57o05L86L5L60O3l85
2487g6K02J74l93l3M14J72k32o03l20O10L49k1l58m17J85N29l00O7L2J62l0k06
2509i3k4N18J18l06l60j19M62L17m97k31j8R0K26p7l1Q1n6k70J63N1O12k10n06
2532a60K2J1L86J10l62j45O2m4LQ0m2K02k69k97M41rJ70J23o47L23J78J8k5j56
2556b7J41J28j88p9K18k58K08k79j04J43J60j09l8r2JL27j64N8P6j03J18m0j12
2579a5L15m4l09J90l75L29K1j91r8J47k01L27k47j06L22j04o8J41kJ74P7k89R0
2602H4PQ0J17m24n8L02j64o4J09k15J69n3k44K47J40p8K08j38j56L20k55R3Q8
$$ plain form
2625 115 190 -164 79 25 79 42 -160 -40 -219 -165 94 -74 28 69 57 -52 103 -114 146 128 159 282 -139
2648 -139 -34 159 38 74 44 -176 -161 -114 -249 -70 -71 -98 54 -84 -26 -1 111 89 63 -22 130 92 58 137 -169
2673 -169 -95 -6 -81 59 -70 -184 -143 -121 -236 99 40 58 32 -59 44 201 27 334 37 1 253 -34 -168
2696 -168 33 -153 -37 -61 -57 -53 55 20 15 -58 -92 97 13 50 125 60 102 41 67 271 -23 -168 -60 -89 15 61
2722 61 -58 -118 -48 -277 -147 -129 -255 -2 -157 -5 204 180 230 105 -62 56 206 -163 133 85 6 92 -152
2745 -152 -17 262 -175 27 -128 -184 148 -45 128 24 203 189 204 143 22 30 -89 89 74 -167 64 -78
2767 -78 -82 -41 -86 -393 46 2 -47 115 -208 5 73 -50 182 127 114 218 69 2 2 -114 132 -112 -6 -136
2791 -136 4 -200 6 -227 -36 -152 64 78 61 -53 308 145 -68 191 101 91 14 -170 -98 107 -148 -20
$$ packed form
2625A15P5l54K43n4N4l7k02J20j79N4K59j68J02M1j2j09J55k17K60j8L1J23m21
2648a39J05J93j21L6l0k20J5M7j35J79jk7J52j38N8K5J12k2k6q5J52l8l4P9l06
2673a69P4Q9p5J40j29j14M1K2j15L35n9J8k6r1J03J57j74L07k97l6K52k87j34
2696a68K01j86J16k4MMJ08l5np3l4J89q4L7P5o5M2o1K6K04k94j45J08k9J04M6
2722F1j19o0P0k29J30J8j26K53j55J52K09k4N0j25j67J18J50l69K96m8p9Q6k44
2745a52J35K79m37K02j55n6L32j93J73j04J79j4J5o1j21Qj19J78j5k41K31j42
2767g8mM1m5l07M39m4m9J62l23K13O8j23K32n5j3J04j49o7%j16K46k44J06j30
2791a36J40k04K06k33J91j16K16J4j7j14L61j63k13K59r0j0p7j84P2K05k55J28
$$ plain form
2813 -20 -280 -72 132 -138 -88 132 -137 155 85 -127 80 184 197 216 -6 -2 162 -171 -76 -126 -198 70 -66
2836 -66 -129 175 -72 -206 -90 -103 133 497 94 111 233 131 281 132 -124 -18 104 -103 -16 -45 -33 -88 -286
2859 -286 -167 197 -22 -6 -243 -190 67 200 39 156 -92 -115 129 -35 121 326 55 -31 -158 -113 141 147
2881 147 -126 -80 -256 -86 -21 -66 143 198 26 -90 43 368 313 -113 -79 -179 102 230 18 -410 -64 -207
2903 -207 -170 42 -149 4 182 -239 -108 22 353 288 11 -41 87 173 181 147 -180 -130 -152 -248 -208 50 -9 -18 -422
2928 -422 -20 183 292 111 -147 -18 73 254 9 93 49 -98 40 -171 19 314 37 -317 -248 -212 250 193
2950 193 -243 -328 -132 -6 190 111 273 103 -276 -274 14 -36 450 38 -415 -138 -16 239 -35 -341 -369 -207
2972 -207 -136 74 47 129 128 -174 -137 172 368 168 -26 -76 15 140 168 33 -115 -239 -15 -125 -33 128 15
$$ packed form
2813b0k60K08K04k70N0K20k69K92p0k12K07J04J3J9k22MJ64l33R5n0p2K68j36
2836f6o3L04k47j34J16j3K36L64m03J7J22j02J50j49k56J06J22k07Q7k9J2n5j98
2859b86J19L64k19J6k37N3K57J33j61J17k48k3K44j64J56K05k71q6j27M5K54O
2881A47k73M6j76J70O5m5K09N5j72j16J33L25n5m26L4j00K81J28k12m28L46j43
2903b07L7K12j91J53J78m21J31J30L31o5k77n2J28Q6Ql4l27N0k2r6M0K58n9rm04
2928d22M02K03J09j81k58J29R1J81k45Q4m4j47J38k11J90K95k77l54O9L6M62n7
2950A93m36q5J96J26J96p9J62j70l79KK88n0M86m12m53K77J22K55k74l06k8J62
2972b07P1K10k7Q2jl02L7L09J96k00j94n0R1J25K8j35j48j24K24j10R2J61j13
$$ plain form
2995 15 -38 -317 -188 360 303 -23 6 -202 136 305 133 -4 229 16 -184 -48 25 344 -117 -340 -268 7
3017 7 230 361 -106 -285 15 93 395 253 85 339 51 -230 -45 109 258 -121 -441 -299 105 184 12
3038 12 -355 -213 12 -92 50 112 47 153 -88 -283 190 319 322 21 -427 -3 348 102 -7 -173 -226 215
3060 215 -153 7 106 275 -98 -285 -218 279 368 68 -173 -21 107 332 -60 -5 -16 -66 -212 -178 -105 164 34
3083 34 -447 -95 -5 257 395 -47 24 23 120 151 59 9 201 -89 -310 -9 111 245 -79 -383 -262 249 41
3106 41 -53 -68 -111 110 109 -4 74 81 -26 -61 -177 92 122 89 -79 -352 -182 137 130 -53 -219 -220 -51 -88 15 44
3132 44 70 -50 -65 -17 163 197 58 -313 -124 181 13 31 -58 -84 -51 -147 -25 20 95 63 -213 -161 140 184 87
3157 87 112 -315 -39 163 24 126 124 -128 35 -68 -140 156 9 -53 -401 -264 239 219 -167 -153 -172 -13 62
$$ packed form
2995A5n3k79J29N48n7l26K9k08L38J69j72j37K33k13k00J36P3L19m61k23P2K75
3017GK23J31m67j79L00P8L02j42j68K54k88k81J85J54J49l79l20J42M04P9j72
3038A2l67J42K25j04J42O2o5J06k41j95M73J29Ll01m48M24L51k46j09j66n3M41
3060B15l68J60R9J69l73j87O7M97Q9l00k41J52J28K25l92N5j1n0j46L4P3K69j30
3083C4m81L52R0K62J38m42P1jR7L1r2n0J92k90k21L01J20J34l24l04J21N11k08
3106D1r4j5m3K21jj13P8Pj07l5j16K69L0l3j68k73J70L19pj83j66jJ69l7J03K9
3132D4K6j20j5M8J80L4j39l71J89L05j68J8q9k6L3r6J22M5P5l2k76N2L01M4r7
3157H7K5m27K76K02j39J02kk52J63j03p2K96j47o2l48J37N03k0l86J4j9J59P5
$$ plain form
3180 62 25 250 59 65 -56 138 48 167 99 -83 -188 -39 103 130 -144 -144 -29 117 -76 61 293 122 -106
3203 -106 43 166 89 333 -132 -97 -152 -22 -26 88 -198 -13 -110 -152 -95 -54 132 15 -14 88 268 300 110 117
3227 117 -26 0 287 -110 22 2 -210 123 -80 63 138 -66 -222 -92 -56 37 145 0 -63 -27 184 155 128
3250 128 76 248 -74 -112 97 -6 13 -20 -194 -26 -77 27 73 -106 -32 41 12 162 129 -41 226 123 10
3273 10 52 -35 86 79 -262 -13 62 -109 116 -132 -248 -71 -26 -156 -17 -46 7 150 7 247 271 89 78 -62
3297 -62 -38 85 -16 -69 86 -213 -89 -150 -201 145 -149 -82 -70 -205 -44 149 -16 13 186 -19 236 -18 98
3320 98 8 -57 -79 90 -14 22 -18 -258 -143 -67 -150 -14 -94 36 47 37 -54 81 39 -84 90 49 -16 91 -85
3345 -85 53 -212 -92 -3 8 -38 -48 -149 -61 -70 140 6 220 158 -35 65 50 -10 -84 205 -66 -15 108 -27
$$ packed form
3180F2l7K25j91Oj21J94r0J19o8j82j05J49J42K7k74%J15J46j93J37K32j71k28
3203a06J49J23p7K44m65L5n5J30mJ14k86J85r7m2N7M1J86j17k9J02J80L2j90P
3227A17j43K6K87l97J32k0k12L33k03J43P5k04j56J30L6R3J08j45o3L6K11k9k7
3250A28n2J72l22l8K09j03J9l3j74J68n1J04M6j79P4P3k9J50l3j70K67j03j13
3273A0M2q7J21pl41K49P5j71K25k48j16J77M5j30J39k9N3J43j43K40K4j82j1j40
3297f2K4J23j01n3J55k99J24o1n1L46k94O7J2j35J61J93j65K9J73k05K55k54J16
3320I8r0o5k2J69j04L6m0k40J15P6q3J36q0J30J1j0r1J35m2j23J74m1o5J07j76
3345h5J38k65J20Q9J1m6j0j01Q8rK10j34K14o2j93J00j5o0p4K89k71N1J23j35
$$ plain form
3369 -27 -115 -65 -95 -70 23 -24 126 -23 -30 76 31 -74 39 -114 65 84 27 43 148 -189 58 -75 -2 64 -213
3394 -213 -27 -154 -10 -37 -22 -91 35 -52 158 -16 108 -3 21 75 -11 102 138 -37 98 46 58 -198 -24
3417 -24 -184 -174 -83 -42 -176 101 110 37 0 71 21 -66 -70 130 106 90 -75 74 -181 3 -36 -122 -118 44 -94 -80 -35
3444 -35 99 10 57 143 25 35 13 12 51 180 -8 -51 12 7 -56 -95 -84 -84 117 -100 -27 41 63 134 22 -7 -28 138
3472 138 133 70 137 50 93 20 -94 76 -317 23 -23 57 -41 -166 65 -34 -10 -103 28 29 152 -25 -14 232 -39
3497 -39 61 36 -47 -48 -10 198 -59 -72 -55 141 -133 5 -8 -86 -4 33 36 17 190 -66 156 82 81 242 -110 63
3523 63 72 -20 -116 2 -207 -20 -57 -105 40 3 -175 182 37 101 17 -29 6 -28 73 -8 70 -115 -106 -10 -71 3 -56
3550 -56 -66 110 -162 10 -196 -152 124 -53 56 224 -25 134 239 90 -39 -64 -13 -60 -155 126 8 -26 -126
$$ packed form
3369b7q8N0l0K5R3m7J50j49pJ06m5j05J13j53J79J9n7J6J05l37K47j33P3O6k77
3394b13J86j27J44k7J5o9J26q7K10j74J24j11K4N4q6J13L6j75J35n2J2k56J74
3417b4j60J0R1M1j34K77Rp3l7P1n0q7mK00k4j6j65J49k55J84l9q6MJ62j38J4M5
3444c5J34q9M7Q6j18J0k2jL9J29j88m3O3no3l9J1%K01k17P3O8K2P1j12k9k1J66
3472A38no3O7q7M3p3j14J70l93L40m6Q0r8j25K31r9K4r3J31JJ23j77J1K46k71
3497c9J00k5q3jL8K08k57j3J7J96k74J38j3p8Q2L7Lj9J73k56K22p4jJ61l52J73
3523F3Rr2r6J18k09J87l7m8J45l7j78L57j45O4q4m6L5l4J01q1P8j85RR6o1P4n9
3550e6j0J76k72J72k06M4K76j77J09J68k49J59J05j49j29k5N1m7r5K81j18l4j00
$$ plain form
3573 -126 11 -80 -59 49 -85 38 -86 44 88 7 23 44 -49 87 50 73 12 -102 -52 -68 101 -74 30 -190
3597 -190 -121 4 -25 151 58 19 -59 0 133 126 28 -32 91 -229 -51 169 -3 -114 -82 -98 -93 -80 31 88 59 33
3623 33 -57 84 170 60 44 52 89 8 70 -16 9 6 -135 -5 -51 -14 32 -54 -21 151 -24 158 120 127 35 56 -186 155
3651 155 11 301 -128 79 -70 43 -158 15 42 -195 -9 -108 22 -142 -16 -104 39 88 117 13 -101 143
3673 143 -145 -201 184 51 -149 -106 -177 -104 47 -133 49 83 -155 -3 -109 -289 129 49 26 127 99 -2 -97
3696 -97 -36 -17 -2 144 -110 21 -8 53 -144 -162 -10 -112 -15 77 -124 -71 -3 74 -61 34 62 154 -77 46 150
3721 150 -63 -1 -25 -84 137 61 -192 -118 -131 -54 -65 -75 -60 169 -56 7 187 129 280 31 -32 76 -79 100
3745 100 81 -77 -96 -91 78 -117 -126 -72 -5 -88 20 63 22 118 146 -65 -2 -3 228 148 36 8 -59 6 4 112 3
$$ packed form
3573a26J37r1K1J08j34J23j24J30M4q1J6K1r3J36l7K3o1j14N0j6J69j75J04k20
3597a90O9J25k9J76r3l9p8N9J33pr8o0J23l20J78K20j72j11L2j6NJ3J11N7k9k6
3623C3r0J41Q6j10j6QL7q1O2q6K5lj41J30m6L7M6q6L3J72j75J82l8Pr2K1k42L41
3651A55j44K90m29K07j49J13k01J73K7k37J86r9J30j64J26q8J43M9K9j04j14K44
3673A43k88n6L85j33k00M3p1P3J51j80J82L4k38J52j06j80M18q0k3J01k8j01r5
3696i7O1J9J5J46k54J31k9O1j97j8J52j02R7R2k01N3O8P7j35R5K8R2k31J23J04
3721A50k13O2k4n9K21p6k53P4j3P7j1j0J5K29k25O3J80n8J51k49o3J08j55J79
3745A00j9j58j9NJ69j95rN4O7q3J08M3m1R6K8k11O3jK31q0j12k8o7O5kJ08j09
$$ plain form
3772 3 105 19 -118 -30 0 18 -200 5 -106 -72 -64 7 121 -52 39 157 -48 30 -173 19 -95 -41 -55 -76 109
3797 109 24 -173 -32 250 -154 -208 -108 36 -175 134 70 153 109 41 -20 -4 40 60 14 -287 36 -10 -172 -12
3821 -12 43 -67 40 -33 224 42 35 2 -49 -59 85 191 -20 86 -54 -36 -48 -149 -199 -45 -92 19 -29 -22 -27 53
3847 53 37 -201 102 198 -3 -7 101 99 20 138 8 -62 25 60 -138 -56 -34 -4 51 -42 -164 -33 50 -98 -57 -165
3873 -165 17 95 134 67 9 111 -89 -1 57 -29 148 -54 -182 -39 -2 36 -17 -103 87 55 -16 82 121 57 19 15
3899 15 -37 -164 -58 -71 163 62 157 -54 49 55 146 96 -46 34 56 44 47 -131 49 58 -120 -86 21 4 -86 -160
3925 -160 -15 -68 -50 -100 -198 -158 -103 55 57 -223 -59 7 -92 36 35 -38 -49 73 -96 159 -62 102 160 15 99
3950 99 38 4 63 98 -118 -88 -86 -58 -63 102 -55 36 -84 80 299 -113 -79 -14 18 54 76 116 0 -132 -138 -22 -47
$$ packed form
3772CJ02q6j37Q8L0J8k18K05j11L4QP1J14j73R1J18k05P8k03J92j14N4j4k1J85
3797A09q5j97J41K82m04n4J00J44k11L09o4Q3m4o8o1J6M4K0m6l01L23m6j62J60
3821a2N5j10J07p3K57j82pl3n1j0J44J06k11J06j40J8j2j01n0J54m7J11m8PnQ0
3847E3j6k38L03R6k01mJ08kp9J18j30p0Q7L5j98Q2K2L0N5r3j22J31Q3j48M1j08
3873a65J82P8L9o7n8J02k00Q8N8q6J77k02j28J43L7L8n3q6J90l2p1R8L9o4l8m
3899A5n2j27J06j3K34j01R5k11J03OR1n0j42Q0K2j2Lj78J80Rj78L4J07j7r0p4
3925a60J45n3J8n0r8M0N5J58Kk80J64O6r9J28jp3j1J22j69K55k21J64N8j45Q4
3950I9o1l4N9L5k16L0KK8nJ65j57R1j20J64K19m12L4O5L2L6K2M0j16j32oJ16k5
$$ plain form
3977 -47 -9 -49 -25 188 -32 -68 -38 61 10 -45 -150 -5 10 -82 23 -5 -89 34 -96 -53 87 -59 24 -119 38
4002 38 -87 58 -105 -50 193 157 60 -114 -8 -123 -116 13 -71 -42 -72 57 -111 -9 125 -139 8 -9 -73 -102
4026 -102 177 49 15 84 150 -27 -1 -90 100 118 15 -36 -78 69 -241 -133 -148 49 -33 -43 60 -119 -151 46
4050 46 19 -9 -47 -2 -138 78 46 111 213 -28 132 195 -71 -115 6 93 52 40 -59 29 107 27 64 32 -85 97
4076 97 167 75 -1 -55 12 23 -65 -99 -80 -118 -23 46 96 -57 -9 -60 -1 -32 16 6 -45 91 51 118 13 -185 -29 -129
4104 -129 -78 40 156 77 41 58 44 14 -115 -48 156 -66 181 90 166 143 -22 20 55 -74 34 13 -39 60 65 106
4130 106 -129 -92 -64 -52 -2 -27 86 -64 -17 -41 116 65 51 88 -38 48 -182 30 -15 155 -23 223 72 15
4154 15 -11 -3 -34 32 50 57 143 137 10 -137 142 74 41 10 -65 13 -63 -96 46 -164 -118 61 -143 12 23 10 88 -52
$$ packed form
3977d7L8m0K4K13k20l6L0R9n1n5j05J45J5r2J05k8q4J23j30M3J40j46Q3j43J57
4002C8j25J45j63N5K43l6r7j74J06j15PJ29q4K9l0J29j68J02J34k64J47j7o4k9
4026a02K79j28l4O9O6j77K6q9J90J8j03n1m2J47l10J08j5J97q2j0J03j79l2J97
4050D6k7k8l8M5j36K16l2O5J02k41J60O3k66m4J21Q7m1j2r9Q8P8q0L7l2j17J82
4076I7P0r2p6n4O7J1q8l4J9l8R5O9N0j53M8n1N9l1M8j0n1J36m0O7j05j98J56j00
4104a29N1J18J16p9l6J7j4l0j29O7K04k22K47r1P6k3j65M2L5j29J08k1n2R9NM1
4130A06k35L7K8J2N0k5J13j50M7k4J57n1j4L7j26Q6k30K12m5J70j78K46j51n7
4154A5k6Ql1O6J8PQ6oj27j47K79o8l3l1p5P8p6l3J42k10M6J79k04J55J1j3P8j40
$$ plain form
4182 -52 -115 -42 22 58 152 -13 -92 40 -74 53 5 -120 52 -101 61 32 46 62 15 85 -27 4 -68 31 -78
4207 -78 -13 104 -89 -174 23 153 67 8 -17 192 -1 -19 -30 -12 -54 165 -72 -123 72 91 -27 21 -53 202 -22
4232 -22 -44 159 -88 -62 91 -34 -33 -8 -89 -93 -75 7 170 147 20 -62 16 167 -10 -17 35 57 26 -16 -127 54 -38
4259 -38 83 -16 133 -159 -41 -53 -193 -101 66 93 1 18 -8 161 -77 153 -4 -64 49 59 49 89 -61 -111
4283 -111 74 26 -11 -103 73 35 -20 -85 61 169 -9 109 57 89 251 -112 70 80 23 116 -58 -28 -180 -77
4307 -77 -29 65 12 -139 35 -96 -34 -39 47 -10 -23 19 -70 -21 57 145 79 20 4 -54 -110 -50 -64 12 -49 -99 77 -29
4335 -29 265 29 -116 -129 4 108 197 0 -109 69 19 -26 -12 -169 -47 15 63 56 -46 -44 -44 -32 -129 157 -42
4360 -42 10 -4 -55 -32 145 17 -72 -12 -3 2 -15 -55 96 -95 93 70 93 147 -70 -59 -48 168 -115 -38 68 21 110
$$ packed form
4182e2o3P3O4L6R4j65p9J32j14J27m8j25J72j53J62k9J4J6m7P0j12L1p2R9j09
4207g8O5J17j93q5J97J30q6n9k5K09j93j8j1J8m2K19k37n1J95J9j18M8p4K55k24
4232b2k2K03k47K6J53j25JK5q1mJ8Q2J63k3j27q2P8J51j77pN2K2l1m2j11J81r2
4259c8J21r9J49k92J18j2j40R2J67K7r2J7k6J69k38K30j57o0J13J0j0M0j50n0
4283a11J85m8l7r2J76l8n5o5J46J08j78J18n2L2J62l63J82J0n7R3j74L0j52J03
4307g7M8R4n3j51J74j31O2nQ6n7j3M2q9M9P8Q8o6n9j6n8n6O0j4P6o1n0J76j06
4335b9K94k36j45j3J33J04Q9j97j09J78n0m5J4j57J22O2M8pj02K%J2r7K86j99
4360d2N2j4n1K3J77j28q9O0RNj7m0J51j91J88k3K3N4k17J1J1K16k83P7J06m7Q9
$$ plain form
4387 110 40 178 107 65 97 154 0 -107 -43 86 9 -57 -84 -75 79 7 4 70 49 191 -24 -141 -161 -85 205 5
4413 5 112 55 162 55 163 -26 44 -43 18 -113 9 -35 -19 -36 -76 37 -50 18 70 -68 -21 -5 -154 -60 -13 -72
4439 -72 189 -231 84 -101 -19 44 -64 -136 -207 -92 -24 -43 51 44 59 -4 65 -176 -34 26 18 -145 110 -4 -20 -138
4465 -138 78 27 -169 -191 -96 -8 -113 80 31 128 111 92 -111 -28 13 -7 87 97 87 -68 -14 -43 52 79 84 -56 36
4492 36 -48 197 110 77 231 133 -23 139 34 -6 51 199 -3 71 -27 -34 37 -203 110 -36 -238 45 78 -8 24
4517 24 -11 -6 50 27 3 67 -32 -24 61 -149 -29 -6 -198 -22 -26 93 -17 109 -6 -119 188 -110 49 -150 36
4542 36 212 20 -3 -25 44 1 -50 119 30 -47 -52 22 15 -3 -50 83 140 -141 -74 35 -86 81 -109 62 -92 17
4568 17 1 75 79 -89 175 101 51 -6 -33 -34 87 -26 -33 -67 -48 106 81 182 4 121 42 72 -161 114 -119 -51
$$ packed form
4387A10p0J38p1m2L2N7j54j07O4J29p7o6k7RJ54p2lO6k1J42k15j17k0P6K90k00
4413EJ07n7J07j07J08j89P0q7O1j31J22m4J6j7m0J13q7O8N2j38M7J6j49R4M7n9
4439g2K61m20L15j85Q2O3j08p2p1J15O8j9R4pJ5o3O9k41J42O0qj63K55j14j6j18
4465a38K16n1j96k2R5Q8j05J93m9R7j7j9k03Q3M1k0R4J0j0j55N4k9R5K7Nj40R2
4492C6q4K45q7l3J54r8j56J62j05m0N7J48k02P4r8pP1k40L13j46k02K83L3q6L2
4517B4l5NN6k3k4O4r9QQ5k10J20K3j92J76mJ19j10J26j15j13L07k98J59j99J86
4542C6J76j92k3k2O9m3n1J69q9p7nP4pj8m7J33N7k81O7J09j21J67j90J71j54J09
4568A7j6P4Mj68K64p4n0n7k7jJ21j13pl4J9J54k5J01j78J17p9L0k33K75k33O8
$$ plain form
4594 -51 60 -116 -22 16 48 -37 60 -95 -107 19 16 51 54 22 58 -109 74 -7 3 23 24 -51 25 -130 36 95 -102
4621 -102 53 104 -49 -105 -167 -69 37 -3 -28 23 152 -140 -84 -28 22 230 -34 48 51 -181 -69 161 29 -79
4645 -79 12 79 44 17 -39 12 -44 12 -4 -45 177 92 131 -15 101 21 141 -38 -81 29 -15 49 147 -89 -101 -13 55
4672 55 142 68 -77 145 45 -55 -32 -65 -33 -126 15 70 71 176 52 -42 -95 -36 2 71 -21 46 80 20 -132 -10
4698 -10 -127 86 -104 7 108 -113 -58 192 -78 -20 -84 -132 -19 4 37 -64 -24 -38 19 -94 -62 7 -17 116
4722 116 36 49 92 -164 81 51 -27 92 13 -72 -15 90 38 -124 49 -28 45 -113 9 231 257 78 164 155 90
4747 90 -32 -94 -22 -81 -70 -109 -29 -97 -95 -63 37 -153 -32 -160 -91 110 68 81 -63 -66 -22 -39 45 -118 -165 -44 5
4774 5 -37 -32 -49 71 132 -22 206 -177 58 76 -112 52 58 -41 38 -122 3 160 94 86 -20 -84 117 84 14 -110
$$ packed form
4594e1J11j76R4L8L2q5R7j55j2J26lL5Ll2L6j67J83q1J0K0Jp5P6j55J66N9j97
4621a02J55N1j53n6o2R8J06m0k5N1J29k92N6N6N0K08k64Q2Lk32J12K30j32j08
4645g9R1O7l5k7n6N1n6N6j6m1K22q5L9j46J16q0J20j79m3J10m4O4R8k36j2Q8O8
4672E5Q7p4j45K22j00j00K3l3L2r3J41N5JJ05j24r4n3N9L8O9r2O7L4o0j52J22
4698a0j17K13j90J11J01k21N5K50k70N8o4m8J13K3L3j01M0j4N7j13L2O9k4J33
4722A16q0J3M3k56K45l0p8J19p9q5N7J05n2j62J73p7P3j58J22K22K6j79Q6ro5
4747I0j22o2P2n9J1l9Q0o8KL2J00j90J21j28O9K01m2J3j44lM4j7Q4j63m7J21M9
4774Em2Nj7J20O1j54K28l83K35J8j88J64Or9P9j60J25J57o6qj06o4K01l3p0j24
$$ plain form
4800 -110 209 -34 8 -255 81 25 186 56 123 12 -20 160 26 268 40 68 -126 47 -76 -2 -196 -10
4822 -10 85 22 -4 -88 -10 -35 25 -92 32 -10 4 169 -38 -26 -17 10 98 -22 -76 56 -20 -75 -72 42 -56 138 89
4849 89 -64 7 -49 255 27 219 -118 72 116 -63 -76 -100 -71 -77 58 -90 119 209 -132 -91 196 -142 26 -25
4873 -25 -72 68 168 46 -11 33 118 -95 -144 95 30 11 -75 -177 79 -28 20 127 -103 -183 24 72 203 -27
4897 -27 87 -128 42 31 -43 195 -66 109 56 -9 48 -166 42 -66 124 -114 113 82 -46 -108 -12 57 -72
4920 -72 19 56 102 -21 206 -88 91 -5 -9 52 100 7 -16 -41 12 -33 11 38 166 -60 -139 207 -41 117 68 77 101
4947 101 87 145 -45 5 -75 -103 -121 -123 97 100 -5 -60 31 31 -51 106 -47 -17 0 -4 -7 -116 239 -11 -66 -41 -179 10
4975 10 17 63 55 -206 33 -56 -163 53 94 5 -56 -4 122 60 -34 -92 -77 81 123 153 82 -133 -1 -31 115 86 112
$$ packed form
4800a10L19k43M2k63L36n6J61j30O7j11l2J80j34K42k28K8j94J73j23P4j94J86
4822a0R5o3k6q4P8k5O0j17J24m2J4J65k07J2RK7Q8j20n4J32p6n5LJ14r8J94m9
4849H9j53P1n6L04k28J92l37J90M4j79j3k4K9oJ35j48K09R0l41M1K87l38J68n1
4873b5m7J40J00j22n7M4Q5k13m9K39o5j9q6j02K56j07M8J07k30q0K07M8J31k30
4897b7J14k15J70j1p4K38k61J75n3o5N7k14K08j08J90k38K27l1j28o2R6O9j29
4920g2R1L7M6j23K27k94J79r6mO1M8r3k3k5N3m5M4K7J28k26p9L46k48J58m9RK4
4947A01j4N8j90N0q0k8j8kK20Lj05n5R1%q2J57j53L0J7mlj09L55k50n5K5j38J89
4975A0PM6qk61K39q9j07K16M1q9o1N2J26o2r4n8J5J58M2L0p1k15J32l0J46k9K6
$$ plain form
5002 112 -144 -79 10 88 -31 -81 132 -84 140 101 19 62 6 25 56 -12 57 -160 -148 -22 141 -133 59 10 203
5027 203 103 -47 -108 -193 114 101 4 -22 163 35 103 -5 -35 -43 5 39 95 53 40 9 122 -145 -57 141 39
5052 39 -25 -59 82 7 -73 -99 42 -61 60 -98 -92 -292 -53 -9 17 34 0 101 -125 79 -39 -54 -40 71 41
5077 41 -61 -60 48 -65 36 13 -9 -62 -40 49 -9 -27 13 29 -23 -107 -64 -65 212 102 102 -63 35 109 33 -61 -26 10
5105 10 -30 -5 29 29 -92 -89 13 73 51 55 18 27 -45 182 -119 -31 -94 -25 -16 82 112 27 184 -47 46 155 60 6 10 -108
5135 -108 -86 20 -205 -15 118 112 -17 111 -8 67 3 32 -93 -7 119 -25 96 43 46 -3 -3 -54 70 -97 30
5160 30 -19 83 126 44 -98 127 -1 -6 32 -138 -163 8 -27 -44 -42 158 113 26 -77 -3 -97 -96 69 2 -78 -43 43
5187 43 -121 -66 -11 -14 91 -38 -2 -78 36 -89 -166 71 -113 38 113 142 1 29 13 139 38 -7 -62 52 3
$$ packed form
5002A12k56O5Q9P8j19n0K13k16K24l9q2M3n6J9L1o8O9k17J2J26J63k74J92m9J93
5027B03j00j50o1q5L07j3r7k6J85j28O8j08l0qM8L4N6m2j3l1J13k67Q8J98j02
5052C9o4l4J41p5q0k6J41j03J21j58Ok00K39M4K6J7l4J01k26K04j18j5J4J11l0
5077D1j02JJ08j13J01k3k2n3K2Q9n8j8M0J6n2q4M3jK77j10%j65R8P4p6r4L5L6
5105A0m0K5L4%j21LJ02O0k2Ml7Rp2K27l01Q8o3O9RR8L0q5J57k31R3J09r5n4Mj18
5135a08K2J06k25J90J33oj29J28j19P5o4K9j25Q6J26j44J21n3Lm9%n1J24j67J27
5160C0m9J02M3q2j42K25j28nL8j70k5J71l5j7KK00m5q7j03P4r4JJ65o7q0L5Q6
5187D3j64N5N5lJ05j29L6p6J14j25p7K37j84J51P5K9j41K8j6J26j01m5n5J14m9
$$ plain form
5212 3 -34 133 -24 71 33 15 13 24 29 -11 139 2 25 27 110 -11 -68 87 66 -46 -116 21 -115 8 96 -56 -126
5239 -126 -85 36 -1 58 92 -92 -67 -274 18 -119 -17 -21 -17 43 -47 -62 -15 63 -31 -83 -260 212 -125 107 59 27
5265 27 -68 -88 -40 89 28 -35 73 -48 18 67 -127 156 -67 -202 133 -1 -100 7 -20 -11 -15 15 58 -96 -18 23
5291 23 103 -225 40 77 8 -69 44 -65 -39 13 -8 73 -12 105 83 -242 19 185 -71 72 -15 -76 -92 -27 139
5316 139 58 -212 51 -50 134 -93 198 116 79 160 16 41 90 9 40 -10 43 92 61 -82 6 -32 81 89 110 11
5342 11 20 -32 -128 -31 -134 -46 90 101 -31 -146 -30 12 -56 -121 66 84 -56 -118 69 126 40 50 114 -34 132 2
5368 2 56 -135 148 102 -68 -137 -11 -39 18 -12 64 25 17 -155 -24 16 76 49 -69 48 159 -12 -60 -58 -27 -33 -67
5395 -67 138 48 -103 -35 30 13 127 -91 -16 50 67 -175 -5 7 -67 12 54 118 -13 17 -101 152 130 144 100 13
$$ packed form
5212Cl7J67j57R5l8j8kJ1Nm0J50j37K3KQ3j21n7J55k1j12p0J37j36J23Q8j52p0
5239a26M1J21l7N9L4j84K5k07K92j37J02mMO0r0j5M7P8r4n2j77M72l37K32m8l2
5265B7r5k0M8J29o1o3J08j21O6M9j94K83k23j35L35j34r9J07k7RmL0M3j54P8M1
5291B3Q0l28K65L7o9p7J13j09K6N2k1Q1q5J17k2l25K61J66k56J43q7o1j6O5J66
5316A39q1k70K63j01J84k27K91q2l7Q1j44K5M9q1L1n0N3M9l1j43Q8l8J13QK1r9
5342A1Rn2r6R7j03Q8J36J1j32j15J16M2o8o5J87J8j40o2J87N7q6J0O4j48J66j30
5368BN4j91K83m6j70o9J26k8N7l0P6l9qj72J31M0O0k7j18J17J11j71m8KL1ol4
5395f7K05r0j51O8O5j7J14k18P5O6J7k42J70J2p4P9M2O4j31L0j18K53k2J4m4q7
$$ plain form
5421 13 -72 -33 94 -38 -91 -45 -43 -92 27 140 51 -39 165 25 86 -56 33 -73 -113 74 13 -62 74 29 98 34
5447 34 113 36 166 91 99 32 48 -47 -8 42 16 -65 -24 -72 88 135 -76 50 141 -124 -106 57 3 -132 204 -45
5473 -45 -41 -27 -121 -53 -98 70 45 -40 45 109 -40 31 167 -2 -40 45 -27 111 -52 -49 -81 -108 -102 6 64 -115 77
5500 77 -62 -142 -98 -17 -30 -61 41 181 -48 -3 -137 -109 -50 -68 -48 36 -65 124 35 19 24 119 -62 83 9 -4
5526 -4 0 27 -51 3 124 150 60 -95 -97 205 -43 -24 -25 -70 222 -13 2 151 220 16 42 -124 42 191 89 115
5552 115 187 76 144 -99 117 -48 74 70 -73 40 -102 -201 74 -46 57 62 -162 -146 81 -43 -14 67 116 -40
5576 -40 -62 -48 -164 21 48 -68 -10 52 -43 17 -38 11 114 117 20 46 -97 10 -40 -65 -37 175 123 -109 -82 35
5602 35 -80 -67 -115 -126 -27 13 -62 -98 -4 47 98 -48 72 0 92 101 -46 129 38 61 65 47 42 -28 3 28 36 93 -10
$$ packed form
5421A3q5L9J27j32n3M6Km9J19J13q9r0K04j40O1j42Q9j06m0J87o1p5J36m5O9o4
5447C4P9p7J30p5Qo7J6r5L9N0k6q1M1m8J60M7k11J26R1k65J8J63n4j35L36k49
5473d5MJ4r4O8m5J68k5q5Q5O4j49P1J36j69l8Q5p2J38j63Ll2k7OJ08N8j79J92
5500G7j39q0M4Q1j3l1J02J40k29M5j34K8N9j8K0Q4j01J89q9j6NR5j81J45p4j3
5526dMK7p8N4J21K6r0j55kL02k48J9jm5K92k35J5J49O9k04K6j66J66J49j02K6
5552A15P2j11O8k43K16j65J22mj43J13j42r9K75j20J03Nk24J6K27j24K9Q1M9j56
5576d0k2J4j16J85K7j16N8O2r5O0n5M9J03Lr7K6j43J07n0k5K8K12n2k32K7J17
5602C5j15J3m8j1R9M0p5l6R4N1N1j46J20p2R2Rj47J75r1K3Mj8np0L1K5QN7j03
$$ plain form
5631 -10 103 94 24 21 -25 -105 -20 13 -34 -100 -35 -128 -76 -24 -208 23 34 -101 -31 -107 -35 19 -71 51 -74 -11 23 31 206
5660 206 63 25 -70 -40 -89 -67 -31 -45 -43 62 14 53 81 203 -120 -180 77 -192 41 2 -65 -103 -24 -108 105 135
5686 135 5 49 -46 54 -106 -112 -112 -85 124 187 -12 -3 76 -46 -125 -46 -57 -30 36 -59 86 58 23 -55 58 37 -130
5713 -130 -117 -14 3 -66 81 19 4 -86 -17 -67 -5 -61 -159 -183 -156 64 122 -94 -46 46 14 -52 78 -16 54 25 -180
5740 -180 -26 1 166 29 -151 -48 -20 -9 33 -22 -179 -24 -58 31 24 -241 -46 -41 -96 39 32 55 134 33 74 32
5766 32 107 10 -33 124 23 21 -105 41 91 -94 76 131 -18 233 -122 -59 177 -21 90 187 126 133 35 101 -9
5791 -9 45 89 -56 -94 -36 70 79 30 -23 -67 12 -102 -26 -68 34 -6 -66 111 70 217 -45 91 -100 103 82 43
5817 43 180 74 -126 -161 -72 -85 -69 -175 100 111 -146 52 -25 -36 3 -1 42 -52 -39 40 -47 105 35 42 -16 29 12
$$ packed form
5631a0J13rp0lm6q0Q5L3m7o6O5r3N2N2j84K31J1j35P0p6P2N4r0J22j25O3L4QJ75
5660B06j43l8r5L0m9K2L6j4KJ05m8L9K8J22l23o0K57k69K33l9o7l8P9q4K13L0
5686A35j30M4r5J00j60o%K7K09O3j99RP9j22p9P9j1K7O6r5J45k8l5p8J13k1j67
5713a30J3J03J7o9J47o2j5r0O9n0O2n6r8k4K7K20N8k16M8R2l2o6J30r4P0k9k05
5740a80J54K7J65j37j80J03K8J1M2n5j57J55l4Q9pk65J95Nn5J35pK3P9j01M1m2
5766C2P5r7m3J57j01kj26J46N0j85J70N5j49K51l55O3K36j98J11R7o1Pr8O6j10
5791iN4M4j45l8N8J06Rm9n3m4P9j14P6m2J02m0o0J77m1J47k62J36j91K03k1l9
5817D3J37j06k00l5Q9j3J6j06K75J1k57J98p7j1L9mM3r4J3P9q7J52p0Pn8M5j7
$$ plain form
5844 12 1 -106 35 102 -38 -138 -59 98 117 195 -73 -113 104 15 -218 -65 -111 -113 -9 -98 -64 -117 -154 -33 -100
5869 -100 -146 32 -14 26 50 135 26 121 121 68 134 20 -107 20 109 53 -18 97 41 76 45 -59 196 20 -163
5894 -163 36 69 49 123 76 94 10 41 -93 12 2 30 -135 -81 18 -77 -50 -108 -46 61 59 102 -45 3 5 -69 8 -46
5922 -46 6 -103 76 90 -66 38 -31 -19 -65 86 38 -26 -168 -91 -12 -43 -144 -185 101 31 72 59 -95 103 65
5947 65 -84 87 16 -127 -77 -67 97 166 -83 67 -72 27 78 28 160 173 89 49 79 -113 112 -34 21 -51 -195
5972 -195 39 -91 179 -21 91 -30 109 -72 126 6 -323 -1 -127 -38 -36 -23 -81 136 -58 -114 -48 -66 53
5995 53 167 74 -57 169 64 81 17 -16 2 -62 85 -157 43 -3 -6 -37 -34 3 101 -50 -10 11 -151 144 -80 185
6021 185 -45 40 121 -80 -98 45 -6 -15 -82 -118 20 -33 158 86 85 32 -13 87 -94 -42 -18 -52 -55 -83 -20 36 -14 68
$$ packed form
5844A2j1j07J41O7j40j00P9J57J9P8k68m0K17q9k33J53m6kJ04q9L4n3l7J21o7
5869a00m6J78m6M0K4Q5j09R5%n3O6j14j27J27Q9n6p1J15n6L5l1j04K55j76j83
5894a63J99L3k0P4m7J8q4L1j34J05j0K8j65N4R9r5K7n8O2J07kM3j47M8Kp4P7n4
5922d6N2j09J79J4j56J04o9J2m6J51m8o4j42P7P9l1j01m1K86p0M1j3j54J98l8
5947F5j49J71p1j43N0J0J64O9k49J50j39R9N1n0J32J3q4m0L0j92K25j46N5p2j44
5972a95K34j30K70k00J12j21J39j81J98j20l29L22j26Q9KJ3n8K17j94n6O6j8J19
5995E3J14r3j31K26j05J7o4l3J8o4J47k42K00m6ll1LL7R8j51M0K1j62K95k24K65
6021A85k30Q5Q1k01j8J43n1ro7l6J38n3J91p2jn3m5J00j81N2K4l4lk8O3N6n0Q2
$$ plain form
6049 68 -84 -23 112 64 23 -113 70 36 101 51 33 -83 -35 7 -82 20 53 -2 20 118 -8 107 -79 -22 -209
6074 -209 -28 -5 -8 -105 87 178 57 56 64 -7 4 91 -8 -117 23 -121 26 -80 -43 70 -82 -95 -126 -146 97 53
6100 53 -45 -74 -2 -52 -87 96 -10 -116 -12 119 46 -55 138 28 -136 -105 -136 -63 -128 58 -28 -4 -125 -125 -85
6125 -85 94 83 43 -103 82 65 -68 -79 -39 -21 75 -70 -65 83 -89 143 62 50 0 -21 101 -83 -217 1 4
6150 4 76 -7 145 -10 6 51 7 -23 -23 29 -73 -5 -28 81 -169 8 52 -107 -118 91 54 -11 72 86 43 -41 122
6177 122 12 21 -52 -7 -76 46 -76 -21 61 -71 -130 33 -21 69 114 102 64 63 90 -176 66 254 -128 33 -19 -25
6203 -25 -27 -19 41 -46 -45 61 148 -6 -80 99 -26 -29 -2 -6 129 -107 123 -46 5 176 -102 -108 9 47 142 18 136
6230 136 -3 67 -121 -176 51 169 -48 -128 -150 7 31 12 62 -196 -137 77 74 -68 10 2 102 -51 49 139 -32
$$ packed form
6049F8j52O1J35m8m1j36J83l4O5n0j8j16M8M2q9J02L3n5K2R8j26J15j86N7j87
6074b09J81K3lr7J92R1j21jQp1J1Q7r9j09J40j44J47j06L7J13j52j3l1k0K43m4
6100E3r8k9P2n0l5J83j06j06J04J31p3j01J93j10j64L1l1P3o5J86q6K4j21%M0
6125h5J79j1m0j46J85j7j33j1M0J8R6j45NJ48j72K32q1j2n0k1J22j84j34K18L
6150DP2q3J52j55J6M5m4l0%N2j02O8k3J09k50J77M4j59j1K09l7o5Q3J4m3q4J63
6177A22j10Rp3M5o9J22j22N5Q2j32n9J63n4R0M5j2l8jK7k66K42J88l82J61n2o
6203b5kQO0q7JJ06Q7j54p4J79j25lK7mJ35k36K30j69N1J71k78oJ17L8R5j24J18
6230A36j39P0j88n5K27J18k17q0k2J57K4j9N0k58N9K14lj42P8qJ00j53J00R0j71
$$ plain form
6255 -32 69 200 30 22 187 146 3 54 5 -50 16 -133 85 -36 -54 94 16 26 -22 130 -96 -44 -84 -2 4 -63
6281 -63 -47 0 -153 -116 -34 17 115 -52 56 -30 44 -59 57 -4 66 20 41 112 30 -20 -134 46 -80 -69 -88 18
6307 18 47 -63 127 -7 -66 25 -11 74 -73 77 9 -150 22 -4 -36 103 -8 -71 41 -61 -67 2 37 -10 66
6332 66 -46 -211 -108 -112 59 -14 54 66 -52 -27 -99 50 10 -19 -13 -37 30 54 135 -57 -86 103 125 3 -12 -65 -78
6359 -78 123 -75 -175 -16 167 108 30 -25 93 -88 0 33 55 110 18 -19 -12 43 140 167 -17 24 -17 53 -5 -140
6385 -140 -32 -2 -82 -67 -25 59 13 -12 -53 0 66 -63 34 -108 65 27 -45 229 -51 118 -12 92 12 7 -22 -118
6411 -118 -37 -37 123 28 -44 -82 62 182 47 61 5 -73 202 20 -15 40 71 48 51 82 -71 -5 170 -5 -117 -22
6437 -22 52 -128 -7 18 55 151 -95 20 85 -76 -79 -90 -185 49 -69 63 82 -40 150 29 -36 -47 39 -32 94
$$ packed form
6255c2J01J31j70qJ65m1j43N1m9n5O6j49K18j21j8J48p8J0m8J52k26N2m0Q2Oo7
6281f3J6M7j53L7Q2N1R8j67J08q6P4j03J16o1P0m6K1P1q2n0j14J80j26J1j9J06
6307A8K9j10J90j34n9R1l6Q5j47J50o8j59J72k6l2J39j11o3J12j02oO9L5m7P6
6332F6j12j65J03mJ71p3O8J2j18K5p2J49m0k9Ok4O7K4Q1j92k9J89K2j22j5n3j3
6359g8K01j98j00J59J83n9p8n5J18j81Q8L3K2N5r2l7PN5R7K7j84M1m1P0n8j35
6385a40J08L0q0J5M2Q4m6k5m1N3O6j29R7j42J73l8p2K74k80J69j30J04q0nk9r6
6411a18Q1%J60r5p2l8J44J20j35J4n6p8K75j82l5N5L1k3LL1j53O6J75j75j12R5
6437b2P4j80J21K5L7R6k46J15O5j61lj1r5K34j18J32J9j22J90j21o5j1Q6p1J26
$$ plain form
6462 94 108 82 23 106 52 -35 -40 247 -94 -118 50 -16 -15 55 100 179 66 15 -88 -149 84 55 40 33 32 97 -29 -84 64
6491 64 64 -64 -176 27 -67 -47 -17 11 61 45 49 -11 20 -36 150 58 211 -30 161 42 -81 3 -55 -51 -84 42 -93
6518 -93 -38 -100 -51 111 -1 41 -69 -177 18 93 158 19 104 -103 -46 101 25 41 -50 30 100 34 -180 -49 75
6543 75 197 -79 6 52 35 173 -38 48 -78 -73 66 48 -64 106 -30 108 86 119 -133 -27 56 -132 -24 -62
6567 -62 -28 48 117 -101 -11 -107 16 -126 -55 -60 49 -129 34 185 143 20 52 -24 25 -97 -80 -23 -108 76 20 -163
6593 -163 -23 -94 -113 33 118 55 -16 -112 -118 -88 50 45 43 134 -21 132 70 12 -24 -9 -68 48 -123 22 111 48 55 28
6621 28 120 108 -77 109 48 59 -82 30 -12 10 -126 33 -21 92 -48 25 -69 89 -1 -26 131 148 -116 14
6645 14 75 -210 73 44 65 -94 -25 -88 -77 28 12 112 -15 -23 3 27 -24 -98 56 91 -159 -38 -50 -28 16 -25
$$ packed form
6462I4J4k6n9Q3n4q7nK87l41k4J68o6JP0M5P9j13n1j03o1K33k9j5pjO5j26n5J48
6491F4%j28j12K03r4K0L0K8N0j6Mo0L1n6J86r2J53k41J91j19j23Q4n8Ml3J26j35
6518i3N5o2M9J62j12M2j10j08J95P5O5j39Q5k07N7J47p6J6r1Q0P0o6k14J31J24
6543G5J22k76Q5M6j7J38k11Q6j26NJ39j8j12J70j36J38k2L3k52J06Q3j88J08l8
6567f2L4P6O9k18R0r6J23j42P1nJ09j78J63J51m2j23L2p6M9j22J7N7q5J84n6j83
6593a63J40p1j9J46Q5o3p1r6oL0J38nkR1j55J53o2n8l6J5n9J16j71J45Q9o3Pk7
6621B8R2j2j85J86o1J1j41J12m2K2j36J59n4J13j40P3r4J58r0k5J57J7k64J30
6645A4O1k85K83k9K1j59O9o3J1J05j6J00j27qK6K4n1p4J54L5k50J21j2K2M4m1
$$ plain form
6671 -25 -151 132 58 -14 133 53 124 94 -112 -38 -52 -25 -145 -9 120 -127 -58 3 -89 57 -13 136 -67 2 11
6696 11 6 94 78 -194 33 100 27 23 -26 107 -15 42 78 131 -2 57 54 -44 -62 82 186 -6 122 -3 32 -97
6722 -97 -66 -35 -110 75 256 49 39 -13 -11 81 48 -163 47 -161 -13 -118 11 -89 101 -72 7 180 32 47
6746 47 -19 -159 -20 27 175 -58 16 -75 82 -250 46 23 37 158 19 -162 4 -175 -9 -58 57 158 -145
6769 -145 -60 74 -94 -25 -23 1 135 -100 51 -26 5 64 1 -73 -78 111 54 36 26 -39 141 36 63 -84 -99 -167
6795 -167 93 14 -42 39 -42 214 -6 -95 18 164 -23 24 -1 71 -115 -14 25 -21 -54 47 -56 56 72 43
6819 43 -16 -52 31 2 -14 -74 -87 158 203 2 127 -38 26 -72 60 60 -160 26 98 70 4 99 105 -143 18 -38 66
6846 66 -117 32 -96 38 97 -183 -109 -117 -64 28 108 99 18 -5 76 -153 65 -133 -20 198 -15 1 -65 15 -13 -34
$$ packed form
6671b5j26K83p4p2J47q0P1l0k06P4j4K7j20J36J29k47O9O1r2J46p0J49k03O9R
6696A1nQ8j6k72K27O7p3mm9J33j22N7L6N3j33N9lr8j8J44J04j92J28j25L5j29
6722i7L1L1p5J85J81k07j0n2KR2l3k11K10k08J48j05J29j00J90j73P9J73j48J5
6746D7o6j40J39M7J48k33P4r1J57l32K96k3J4J21j39j81J66j79J66m9J15J01l03
6769a45Q5J34j68O9KK4J34k35J51p7L1N9o3p4nJ89n7j8j0o5J80j05K7j47j5o8
6795a67K60p9n6Q1q1K56k20q9J13J46j87M7k5P2j86J01L9m6l3J01j03J12J6k9
6819D3n9l6Q3k9j6o0j3K45M5k01J25j65O4r8J32%k20J86P2k8o6R5Ok48J61n6J04
6846F6j83J49j28J34N9k80P4qN3R2Q0rq1k3Q1k29K18j98J13K18k13J6o6Q0k8k1
$$ plain form
6872 -34 145 -15 -28 32 -38 -13 -82 0 28 -96 -64 10 114 -109 -70 34 88 58 24 -105 -50 -88 -60 -99 148 29
6898 29 54 -109 -23 -71 57 18 -80 -10 -55 -55 194 -116 52 -42 -2 145 43 -97 25 -72 -74 -19 -101 -25 -34 77 38
6925 38 118 67 120 -26 39 -172 -36 -20 -18 -88 -2 70 -102 -5 -22 17 -26 -28 27 -68 8 -147 216 -114 22 -33 -107
6952 -107 82 9 -108 19 129 62 -129 -73 22 17 -15 126 81 -13 72 -77 -84 62 132 -7 110 28 -95 43 68
6977 68 -94 76 -91 -86 116 -184 2 4 -52 -145 -42 108 -93 -49 -41 218 -104 -37 33 -12 -3 -1 -2 -260 -58 -10 -111
7004 -111 49 -28 -148 -130 -68 94 44 172 15 89 93 -137 -67 -113 66 -167 -108 -108 -57 -26 90 -122 55 -41 -12
7029 -12 -4 -58 0 -11 -30 -58 72 -64 -3 190 -151 4 105 76 30 82 -5 100 66 -49 17 -77 76 -57 69
7054 69 -54 27 -19 -120 -11 -8 36 -69 -81 10 -17 37 -53 -1 90 14 -127 -12 73 -144 28 69 -42 -99 25 12
$$ packed form
6872c4J79j60j3O0p0K5o9Q2K8j24L2P4J04k23L9J04N4l0l4j29N5l8K8l9K47j19
6898B9K5j63Q6m8J28l9r8P0m5%K49l10J68r4M0J47j02j40J22r7kN5q2P6rJ11l9
6925C8Q0n1N3j46O5k11J36J6Kp0Q6P2j72R7j7L9m3kN5r5P6j55L63l30J36n5p4
6952a07J89p3j17J27J10o7j91N6R5nl2J41m5r4Q5j49pJ46P0j39J17q2j23J38K5
6977F8j62J70j67NK02l00J86Kn6r3J03J50k01M4QK59l22O7P0m5RKjk58K02M8j01
7004a11J60p7j20J8O2J62n0J28j57P4Mk30P0m6J79k33N9%N1L1J16k12J77r6K9
7029a2Qn4N8j1j9k8J30j36O1J93l41J55J01k9m6N2q7J05l4j15O6r4J53j33J26
7054F9j23Q1m6j01J09LM4j05j2R1k7N4r0N2R1p6j41J15Q5k17J72M1j11n7J24j3
$$ plain form
7080 12 14 -87 -37 2 -56 -156 6 -87 50 -19 -30 28 55 -24 -25 107 -198 -9 63 -117 -25 136 -37 34 -46 -123
7106 -123 33 -121 92 -53 37 120 73 -51 181 -2 179 -16 24 30 45 117 201 -242 -67 175 46 -20 13 37
7130 37 -85 51 -16 -13 -47 -85 90 -42 -69 80 141 9 -94 91 -33 -122 37 126 -32 142 -254 8 144
7153 144 -12 -98 78 29 1 103 140 -68 -19 -79 -21 76 60 92 74 -42 107 108 -4 21 100 -74 -136 1 -24 -137
7179 -137 126 -31 -19 -18 -88 17 6 -37 -25 -16 150 -144 113 -110 47 145 -82 126 -68 -31 80 98 151 52 -1
7204 -1 -50 -18 -176 -14 -38 17 113 4 90 206 -57 -94 15 173 91 -77 2 165 -2 196 -99 30 10 11 23
7229 23 -18 -2 84 54 68 -3 126 154 -151 -45 -57 -74 23 172 80 39 16 22 -147 198 -11 99 75 -157 -69 -193
7255 -193 137 -11 146 251 -13 -1 203 -175 48 40 -13 -141 6 99 42 -31 -88 -160 -276 62 -89 -53 -83 140
$$ packed form
7080A2Kj01N0L9n8j00J62r3J37o9j1N8K7p9jJ32l05J89P2j80R2J61j73P1q0p7
7106a23J56j54K13j45R0Q3m7j24K32j83J81j95M0OJ5P2Q4m43J75K42j29o6L3K4
7130C7j22J36o7Ll4l8J75j32k7J49O1j32j03J85j24q9J59Q9j58J74l96K62J36
7153A44j56q6J76m9k8J02L7k08M9o0N8R7j6L2j8j16J49Jj12K5P9j74o2J37k5j13
7179a37K63j57J2Jp0J05j1m3J2RJ66k94K57k23J57R8k27K08j94L7J11J8N3r9n3
7204am9L2j58J62k4N5R6j09Q6J16k63l7J09J58q2j68P9J63j67J98k95J29k0JJ2
7229B3m1J6Q6l0J4p1J29K8l05J06j2j7R7J49r2m1k3Oj69L45k09J10k4k32Q8j24
7255a93L30j48J57J05k64J2K04l78K23qn3j28J47R3n7p3n7p2j16L38j51L6l0K23
$$ plain form
7279 140 30 -91 16 14 -190 91 162 85 16 -133 -45 -91 16 18 -136 -131 114 32 -31 116 50 111 34 0 14 -38
7305 -38 119 26 186 88 -38 130 30 -111 186 34 -33 126 -37 60 141 32 31 82 132 -119 -33 -121 -81 -18 -16
7330 -16 125 53 -48 13 -158 -77 161 -95 84 -36 121 42 -26 78 137 -200 -95 32 27 -97 46 103 -76
7353 -76 39 36 20 115 -111 25 4 -78 30 -97 41 -52 -94 -55 58 -136 -97 -38 -86 -87 -34 4 150 -28 -52 -59 -113
7380 -113 164 -6 -94 -65 0 179 19 85 118 23 -165 213 50 81 -92 -48 -94 -16 -57 -87 -62 -101 85 -168 -116
7405 -116 76 199 -54 -150 2 18 73 83 -65 38 -62 29 -60 -23 13 -20 -83 -21 67 15 43 65 112 -161 95
7430 95 105 52 110 -53 158 -39 268 71 103 -166 -61 -109 9 -152 -42 97 46 -85 -61 173 26 65 -61
7453 -61 -37 -12 -52 -46 44 -13 -37 209 -40 -9 90 -98 -134 -126 1 -62 22 -119 -16 -71 102 199 -57 -168 103 -146
$$ packed form
7279A40j10j21J07kk04K81P1p7o9j49Q8m6J07Kj54NK45q2o3J47o6O1p7l4J4n2
7305c8J57r3J60r8j26J68j00j41K97j52o7J59j63R7Q1j09jN1N0k51Q6q8M0O3K
7330a6J41p2j01O1j71Q1K38k56J79j20J57p9o8J04N9l37J05J27nj24J43N7j79
7353g6J15lj6R5k26J36k1q2J08j27J38r3m2L9J13j94L9N9m8jN3L8J46j78k4pn4
7380a13K77j70q8K9O5J79j60O6L3r5j88L78j63L1j73M4m6P8m1l0K5l9J86k53N2
7405a16J92J23k53r6J52J6N5J0j48J03j00R1q9L7L6l3o3O2Q8n2K8K2M7k73K56
7430I5J0n3N8j63K11j97L07j97L2k69J05m8J18j61J10J39n1j31K4K34j47L9j26
7453f1K4K5m0OR0n7k4K46k49L1R9j88l6QJ27o3Q4j41J03n5J73R7k56j11K71k49
$$ plain form
7479 -146 -91 31 -220 57 60 -29 -48 -28 87 87 26 83 -173 -14 112 28 -1 49 32 -23 146 -40 -12 -1 14 109
7505 109 -50 -53 65 125 39 78 22 158 -4 -3 -29 -49 -69 14 -14 -1 -25 52 -47 34 -32 -36 81 -3 -1 94 -189 290
7533 290 -55 -39 -143 -212 18 1 19 -162 5 -62 159 -22 19 17 -75 -75 4 92 43 -125 -99 85 -49 80 21
7558 21 7 75 -49 80 12 69 -108 96 -104 127 -127 -104 -89 -11 -21 -107 -33 23 -69 176 -26 -134 80 -28
7582 -28 278 -172 -107 129 134 -32 -129 -30 135 -20 -141 -4 -9 -163 2 30 24 122 -97 -52 -4 -27 -36 39 145 67
7608 67 -14 -19 97 -54 -66 70 13 54 -5 -98 51 0 -94 -56 -168 -141 6 -32 84 -76 -65 121 -11 44 254
7633 254 -43 -77 -14 -40 -129 -55 -13 35 105 -216 60 77 66 -153 180 74 78 -8 -106 88 -38 -21 5 -99 47
7658 47 -40 62 -72 -84 14 67 24 22 -24 -40 -2 -22 -121 71 -75 -193 34 64 4 60 -77 -27 -109 14 134 -105
$$ packed form
7479a46N5J22k51K77Lq9j9K0J15%o1N7k56J59J26q4k9N0j7n5J69j86K8J1J5R5
7505A09j59lJ18O0q6L9n6J36j62Jk6k0k0Q3k8J3k4P7r9Q1o6mJ17q4KR5k83M79
7533B90l45J6j04o9K30j7J8j81J67o7K21j81M1kr2%P9Q8m9j68K6J84j34J29n9
7558B1j4O8j24J29o8N7j77K04k00K31k54K3J5P8j0q6P4N6r2K45k02j08K14j08
7582b8L06m50O5K36Nj66r7R9J65j55j21J37nj54J65K8oR8k19M5M8k3rP5J06p8
7608F7q1nJ16j51j2J36n7M1n9r3J49n1r4L8j12K7J47l8J16j60J1J86j32N5K10
7633B54k97l4O3k6q9P4M2M8P0l21K76J7j1k19L33j06Mq6r8J94j26J7K6j04J46
7658D7q7J02j34j2R8N3m3km6j6L8k0r9J92j46j18K27L0o0N6j37N0q2J23J20k39
$$ plain form
7684 -105 34 97 -39 -88 5 -132 120 72 -144 23 -76 -95 -24 -107 9 -31 126 -46 84 -71 -54 -174 109
7707 109 -61 55 84 59 31 -76 157 33 -70 65 66 -113 27 120 64 24 111 94 -23 -166 -133 55 216 34
7731 34 17 -9 -68 112 2 24 -121 -87 -265 -29 55 71 -31 -167 -144 109 -9 -115 -9 21 33 152 82 45
7755 45 1 2 52 -20 -65 -219 6 -68 -142 28 74 123 129 1 13 57 -23 28 73 110 -7 41 81 -4 81 -78 50 30
7783 30 -100 -30 44 -85 78 26 -8 -103 -39 51 -104 -33 31 14 -36 -117 -11 99 20 9 16 42 43 -59 -43 -46 67 1
7811 1 198 -33 -45 54 -257 105 -4 -72 39 -60 -19 8 94 -42 4 75 8 50 0 19 -83 -25 -112 -42 -14 12 123
7838 123 54 86 -18 -73 -64 -45 67 31 96 156 118 154 32 58 -122 119 4 -69 -36 -80 -94 -25 63 -7 101 -69
7864 -69 -87 22 -85 47 -24 -30 56 3 27 -140 -137 60 111 1 55 78 -137 146 196 109 -37 75 -118 37 -69
$$ packed form
7684a05J39O3j36m9R3j37K52m8k16J67r9j9P1q3J16m0J57j72J30j55J7j20K83
7707A09j70J16K9k5k8j07K33j24j03J35Jj79J40R3n6m0Q7j7j17j43L3J88J61j82
7731C4j7k6n9J80j10K2j45L4j78K36Q4J6j02j36K3K53j18j06J06L0J2J19p0l7
7755D5m4JN0p2m5j54K25p4p4J70M6M9Oj28J2M4q0N1M5L7j17M8M0q5Q5j59J28k0
7783C0j30P0P4j29J63n2l4r5O4R0j55P1O4j7n0q1J06J10p9j1PK6Jj02J6lJ13o6
7811AJ97k31j2R9l11L62j09o8J11r9M1K7Q6j36M6P1o7M2n0J9j02N8q7P0K8K6J11
7838A23o9L2j04n5RJ9J12l6O5O0l8L6j22K6j80K41j15p3L3m4j4O9Q8p0J08j70
7864f9j8J09j07J32p1oQ6n3K4j67LJ97N1j10N4K3k15K83N0q7j46J12j93J55j06
$$ plain form
7889 -69 -75 38 -18 64 -54 118 99 45 -13 -52 -28 -16 55 51 -38 70 -54 125 -178 38 -6 84 18 -141 -142 52 53
7916 53 -104 -187 166 -39 -32 -51 -119 -83 -76 -63 117 91 -99 -41 -122 61 16 46 6 -30 -194 105 -18 48 23 48 73
7943 73 132 -16 -124 113 -16 37 36 6 102 21 17 11 25 -82 -189 62 0 93 0 -151 86 121 -26 5 65 120 -107
7970 -107 58 123 10 82 60 -15 33 1 -9 136 -201 51 -14 -23 -38 8 36 -217 -13 31 15 104 -36 97 98 70
7996 70 15 15 -54 -142 -41 124 13 -65 71 -19 13 9 30 36 135 -44 47 91 -130 71 -76 146 -253 20 55 -101
8022 -101 86 22 -81 -52 -148 69 -51 10 32 -53 10 14 22 -200 83 -101 -58 106 -44 -165 41 45 7 89 28 -83
8048 -83 -195 107 59 93 -107 -26 56 70 100 140 -48 27 6 52 9 4 -4 79 -56 -118 -84 -92 10 174 48 -81 8
8075 8 -1 91 -122 -20 -71 4 -42 -31 -122 -168 57 133 83 -32 -57 109 8 8 128 -18 75 -15 -6 45 23 5 -115 -35
$$ packed form
7889f9oJ13n6Q2j18J72j9n4n8l9K4J2P1mq9J08j24J79l03K16m4R0o6j59jJ94J
7916E3j57q3L53k05Pj9o8L6PJ3J80k6j90N8q1J83m5L0m0l6j64K99j23O6k5K5K5
7943G3N9j48j08K37j29N3jl0R6q1moJ4j07j07K51o2R3r3j51K37L5j47L1O0N5k27
7970a07J65O5j13P2k2p5M8l2j0J45l37K52o5rj5M6K8k53K04M4j6Q9j40J33Jk8
7996G0n5%o9q8J01J65j11p8J36r0L2mK1OR9j79R1M4k21K01j47K22l99K73L5j56
8022a01J87o4j03K9r6K17j20O1K2q5O3MQk22K83j84M3J64j50j21K06Ml8Q2o1j11
8048h3j12L02m8L4k00Q1Q2J4L0M0j88P5k1M6m3nqQ3j35o2L4qJ02J64j26j29Q9
8075HrR2k13J02n1P5m6J1r1m6K25P6n0j15k5J66j01%J20j46R3r0RN1k2j8j20Q0
$$ plain form
8103 -35 -98 58 -76 -46 -176 -190 111 -7 102 -48 -135 -181 -46 -58 65 8 41 -82 -22 -12 -5 14 16 31 -129 23
8129 23 173 -60 -60 -219 -40 -22 111 -6 90 85 -26 218 158 -34 -69 3 -88 113 -55 13 33 13 98 100 26 -171
8155 -171 0 -84 -26 -119 -54 126 36 2 -26 73 -55 -15 -59 -2 212 145 22 -57 72 47 87 31 83 98 40 7 42
8182 42 144 -135 190 -23 -13 -30 -29 160 65
$$ packed form
8103c5o3J56j34L0j30j4L01j18J09j50q7m6J35j2J23n7L3j23O0J0PJ9KJ5j60J52
8129B3J50k33%j59J79J8J33j17R6nj11K44o0j92l5P2r1K01j68O8K0k0Q5Kp4j97
8155a71J71q4N8r3O5J80r0l4k8R9j28M0m4N7K14o7j23p9J29k5M0n6N2J5n8l3L5
8182D2J02k79L25k13J0j7JJ89r5
8191F5
$$ Imaginary data points
##PAGE= N=2
##DATA TABLE= (X++(I..I)), XYDATA
$$ plain form
0 0 0 0 0 0 0 0 0 0 0 -8 8 -8 16 -16 24 -25 32 -40 56 -64 72 -89 104 -127 150 -172 200 -232 265 -305 350
31 350 -398 453 -512 579 -654 734 -820 918 -1023 1138 -1267 1404 -1554 1718 -1899 2095
47 2095 -2310 2546 -2805 3089 -3403 3751 -4142 4575 -5068 5626 -6267 7015 -7899 8958
61 8958 -10258 11905 -14056 17003 -21318 28246 -41237 74076 -341850 -436791 364990 457755
73 457755 133468 -189781 -29313 144564 87171 -95331 -31651 53058 -92981 -373786 -238921
84 -238921 298492 621464 260135 -328157 -460022 -46070 272470 128485 -172436 -181668
94 -181668 9147 87229 20170 80664 239175 152392 -236548 -456022 -167401 320043 388872
105 388872 -13577 -318102 -152719 186740 243293 15357 -130102 -80479 -60673 -134445 -76441
$$ packed form
0@%%%%%%%%%qJ6j6K4l2M0m9N7p2R6j20J36j61J93k31K77l22L72m32M97n70O55
31C50p48Q51r65J091j233J388j554J738j941K161k405K671k958L272l617L994
47B095m405M856n351N894o492P154p893Q717r643J0694j1893J3282j4914J6857
61H958j9216K2163k5961L1059l8321M9564o9483J15313m15926r4941Q01781R2765
73D57755l24287l23249J60468J73877n7393j82502O3680Q4709j46039k80805J34865
84b38921N37413L22972l61329n88292j31865M13952L18540j43985l00921r232
94a81668J90815P8082o7059O0494J58511q6783l88940k19474K88621M87444O8829
105C88872m02449l04525J65383L39459N6553k27936j45459M9623J9806p3772N8004
$$ plain form
116 -76441 183773 333085 86652 -298724 -311003 70958 334232 144024 -217346 -267747
126 -267747 -5033 177074 116432 18042 32993 26872 -125684 -223009 -35197 246591 230403
137 230403 -100176 -312902 -108459 235081 264056 -14105 -213059 -130714 33106 48319
147 48319 1623 59390 123113 11431 -181928 -163427 106060 268324 72340 -233296 -249005
158 -249005 33390 238442 133464 -75193 -110160 -17285 7345 -41361 -4306 117177 104214
169 104214 -94332 -209653 -43589 215673 218721 -54797 -244143 -124628 103665 149157
179 149157 16633 -65763 -18231 8886 -47668 -49609 66951 143863 20221 -177974 -165629
190 -165629 68164 220418 101259 -119895 -159583 -7055 98981 52447 -19462 -11991 11279
$$ packed form
116g6441K60214J49312k46433l85376j2279L81961K63274j90208l61370n0401
126b67747K62714J82107o0642r8390J4951o121j52556r7325J87812K81788j6188
137B30403l30579k12726K04443L43540K8975k78161j98954Q2345J63820J5213
147D8319m6696N7767O3723j11682j93359J8501K69487J62264j95984l05636j5709
158b49005K82395K05052j04978k08657l4967R2875K4630m8706L7055J21483j2963
169A04214j98546j15321J66064K59262L048k73518j89346J19515K28293M5492
179A49157j32524q2396M7532K7117n6554j941J16560P6912j23642j98195J2345
190a65629K33793J52254j19159k21154l9688J52528J06036m6534p1909P471K3270
$$ plain form
201 11279 -38005 -83696 1589 134039 111091 -71443 -185059 -69617 127665 149695 -4994
212 -4994 -116706 -67042 37016 51872 7142 10922 34673 -13208 -92990 -70722 68286 146734
224 146734 36760 -125730 -129761 20627 126935 64480 -55463 -72358 -8785 19910 1471
235 1471 9317 53568 40612 -56125 -104856 -16219 108006 102869 -34470 -123599 -52947 64967
247 64967 81000 5198 -45681 -22942 743 -17210 -14811 37518 65714 5749 -84182 -73172
259 -73172 40476 106168 39882 -67266 -81766 653 58768 32036 -10692 -13133 -1207 -16746
271 -16746 -35026 750 59137 46287 -35428 -81754 -26273 64945 72248 -5861 -59600 -34016
283 -34016 18862 30449 5050 -1062 10708 -4644 -33976 -25874 25445 56300 12735 -53624
$$ packed form
201A1279m9284m5691Q5285J32450k2948j82534j13616J15442J97282K2030j54689
212d994j11712M9664J04058J4856m4730L780K3751m7881p9782K2268J39008P8448
224A46734j09974j62490m031J50388J06308o2455j19943j6895O3573K8695j8439
235A471P846M4251j2956r6737m8731Q8637J24225n137j37339q9129P0652J17914
247F4967J6033p5802n0879K2739K3685j7953K399N2329K8196n9965q9931J1010
259g3172J13648O5692o6286j07148j4500Q2419N8115k6732m2728k441J1926j5539
271a6746j8280L5776N8387j2850q1715m6326N5481R1218P303p8109n3739K5584
283c4016N2878J1587k5399o112J1770j5352k9332Q102N1319L0855m3565o6359
$$ plain form
295 -53624 -53334 9417 54314 30427 -22820 -33326 -4528 11416 6437 4456 13535 10854 -18406
308 -18406 -33568 -2537 37476 34291 -12540 -45691 -20929 22339 28692 3397 -17188 -12301 543
321 543 -824 -413 12271 16464 -465 -23203 -19648 14004 31599 10290 -19321 -23580 -753 17326
335 17326 9087 -4527 -6181 -3359 -3575 -5660 851 13499 9149 -9515 -16100 -3813 14698 16233
349 16233 -2012 -12439 -5998 4580 8002 1767 -2756 -264 -2095 -5146 -1840 2711 5199 544
363 544 -7875 -5568 2255 5874 4052 -2387 -4091 1088 2930 2990 1920 -1558 -970 943 343 635 -1324
380 -1324 -3034 -88 541 -358 -756 -2505 -377 1304 -1213 511 3023 1973 -759 -4121 -336 7616
396 7616 5830 -2473 -7548 -4126 5635 7097 -1828 -5811 -3235 -37 489 -1709 1168 5198 -953
$$ packed form
295e3624K90O2751M4897k3887n3247j0506K8798J5944m979j981R079k681k9260
308a8406j5162L1031M0013l185m6831l3151K4762M3268O353k5295k0585M887J2844
321E43j367M11J2684M193j6929k2738L555L3652J7595k1309k9611m259K2827J8079
335A7326q239j3614j654K822k16k085O511J2648m350j8664o585J2287J8511J535
349A6233j8245j0427O441J0578L422o235m523K492j831l051L306M551K488m655
363E44q419K307P823L619j822o439j704N179J842O0j070l478N88J913o00K92j959
380a324j710K946O29q99l98j749K128J681k517J724K512j050k732l362L785P952
396G616j786q303n075L422R761J462q925l983K576L198N26k198K877M030o151
$$ plain form
411 -953 -7721 -5798 5071 13805 4953 -10125 -9598 2480 10405 6516 -4405 -5678 -301 -834 -2597
426 -2597 170 5675 5314 -7586 -14866 -1901 13401 12704 -2990 -15031 -5925 9178 9839 1696
440 1696 -3781 -1366 1076 -4368 -4331 6707 10951 42 -14782 -14265 5698 17354 5335 -11306
454 -11306 -13318 95 10200 4278 -1607 1163 2019 -3084 -7068 29 13622 10944 -8014 -17397
468 -17397 -6410 12592 14985 -3038 -13611 -6713 2873 4889 632 -124 4307 -210 -9066 -5824
482 -5824 7733 16040 5172 -13924 -13520 3808 13754 7265 -6651 -9872 -1033 2058 -941 146
496 146 3788 3537 -5496 -12065 -1170 13120 11407 -2871 -13282 -6032 9302 10252 772 -5137 -3264
511 -3264 837 -1007 -2718 3336 6176 -1100 -9475 -9097 3491 12533 3931 -8122 -8729 234 8349
$$ packed form
411i53o768J923J0869Q734q852j5078N27J2078P925l889j0921j273N377n33j763
426b597K767N505l61j2900p280J2965J5302o97j5694j2041R106J5103O61q143
440A696n477K415K442n444L7J1038M244j0909j4824N17J9963J1656j2019j6641
454a1306k012J3413J0105n922n885K770Q56n103l984P097J3593k678j8958r383
468a7397J0987J9002K393j8023j0573O898R586K016m257p56M431m517q856L242
482e824J3557Q307j0868j9096M04J7328R946o489j3916l221Q839L091k999J087
496A46L642k51r033o569J0895J4290j713j4278j0411P250J5334R50r480n909J873
511c264M101j844j711O054K840p276q375L78J2588R042q602j2053o07Q963Q115
$$ plain form
526 8349 5088 -1692 -942 490 -944 -1565 99 5102 4904 -4648 -8907 -3009 5313 7002 -1593 -7671
542 -7671 -3453 2075 3574 1747 -1346 294 1209 -1529 -442 2692 3853 1808 -3714 -4146 1372 3480
558 3480 1459 -2431 -4700 -917 1812 539 -487 -1413 -950 989 536 546 1247 -16 687 1030 151
575 151 1352 941 -916 -763 -1465 -8 1995 -202 -2943 -3629 -1388 3798 3259 -2125 -4023 -1688 2343
592 2343 4712 1043 -1051 -9 -310 -470 417 2499 4522 -735 -7694 -5065 2942 7671 2952 -7649
608 -7649 -7967 218 5147 3922 -583 -1728 447 -2004 -3212 3065 8686 5783 -5610 -12692 -2456
623 -2456 11567 10293 -2370 -12005 -7090 4239 5301 477 -79 -7 -2183 -6881 -4343 9198 14625
638 14625 1093 -14419 -12886 6156 18423 6822 -9787 -11262 -1565 5601 2316 -1026 3522
$$ packed form
526H349l261o780P50J432j434o21J664N003j98r552m259N898Q322J689q595o078
542g671M218N528J499j827l093J640R15k738J087L134J161k045n522m32N518K108
558C480k021l890k269L783K729j273j026r26M63J939m53J0P01j263P03L43q79
575A51J201m11j857J53p02J457K003k197k741o86K241N186n39n384j898K335M031
592B343K369l669k094J042l01j60Q87K082K023n257o959K629Q007M729m719j0601
608g649l18Q185M929j225m505j145K175k451j208O277N621k903j1393p082J0236
623b456J4023j274j2663r635M915J1329J062m824n56P2k176m698K538J3541N427
638A4625j3532j5512J533J9042J2267j1601j6609j475R697P166l285l342M548
$$ plain form
651 3522 2260 -8393 -12381 -357 16987 14645 -9028 -21072 -6276 15151 17736 -214 -12629
664 -12629 -5283 3481 1783 -741 3640 9050 -918 -17943 -13334 10332 22863 6762 -20194 -21496
678 -21496 3752 19665 10096 -6374 -9040 -88 1457 -3882 2462 13485 9132 -11250 -23346
691 -23346 -5047 23014 21066 -7112 -25209 -12742 11912 15609 740 -5879 -2064 -1041 -6405
704 -6405 -5171 11450 20588 1281 -23245 -19665 10031 28742 10800 -18275 -20417 -748 12089
717 12089 6479 -2451 1008 1997 -9919 -14996 2062 23702 18458 -13895 -30688 -7367 23924
730 23924 24885 -2419 -20820 -9885 6217 5345 159 4201 8194 -3410 -21764 -14720 16643 30268
744 30268 5530 -28055 -26843 7947 28529 12454 -11092 -13609 -672 3698 -2344 2697 15053
$$ packed form
651C522j262j0653l988J2024J7344k342k3673j2044J4796K1427K585j7950j2415
664a2629P346Q764j698k524M381N410r968j7025M609K3666J2531j6101k6956j302
678b1496K5248J5913r569j6470k666Q952J545n339O344J1023m353k0382j2096
691b3346J8299K8061j948k8178j8097J2467K4654L697j4869o619L815J023n364
704f405J234J6621R138j9307k4526L580K9696J8711j7942k9075k142J9669J2837
717A2089n610q930L459R89j1916n077J7058K1640n244l2353j6793K3321L1291
730B3924R61k7304j8401J0935J6102q72n186M042L993j1604j8354P044L1363J3625
744C0268k4738l3585J212L4790K0582j6075k3546k517J2937M370o042N041J2356
$$ plain form
757 15053 8798 -15710 -27570 -3617 29708 25421 -11868 -32886 -13754 17714 21873 557 -10700
770 -10700 -4024 -397 -5470 -3832 13118 22370 -197 -28850 -22505 13664 34511 12012 -24287
783 -24287 -26644 177 17513 10250 -3059 -3028 412 -8769 -13506 4071 25088 18117 -15373 -33209
797 -33209 -7896 27077 27606 -2936 -24629 -13650 7303 9143 1981 2787 4678 -4982 -19195 -11999
811 -11999 17276 29184 4107 -27668 -25854 8070 29702 13385 -11678 -15446 -2756 4321 965
824 965 3298 12234 5486 -16468 -24069 -1233 27845 22768 -12651 -30784 -11361 17298 21110 1101
838 1101 -10537 -4504 -534 -4163 -1551 11867 17972 -1699 -26074 -18592 13264 29519 9059
851 9059 -21915 -23281 1382 16054 8597 -2969 -3099 402 -6214 -10414 3814 20503 14299 -12678
$$ packed form
757A5053o255k4508j1860K3953L3325m287l7289k1018J9132L1468M159k1316j1257
770a0700O676L627n073J638J6950R252k2567k8653O345L6169K0847k2499l6299
783b4287k357K6821J7336p263j3309L1L440r181m737J7577K1017o971l3490j7836
797c3209K5313L4973N29l0542k1693J0979K0953J840p162Q06J891r660j4213P196
811a1999K9275J1908k5077l1775J814L3924K1632j6317k5063l768J2690P077l356
824I65K333Q936o748k1954p601K2836K9078n077l5419j8133J9423K8659L812k0009
838A101j1638O033L970l629K612J3418O105j9671k4375P482L1856J6255k0460
851I059l0974j366K4663J4672p457j1566j30L501o616m200J4228J6689o204k6977
$$ plain form
865 -12678 -27123 -6191 22980 22188 -3795 -20845 -11402 6938 8679 833 653 3031 -3473 -13345
879 -13345 -9074 12777 22930 3068 -21287 -19427 6441 23334 10525 -10378 -12502 -1882 4141
892 4141 1508 1196 7195 3910 -11211 -16482 -807 19013 16412 -8379 -21772 -7719 12803 15518
906 15518 1216 -8430 -3896 551 -1831 -546 7213 10234 -1439 -16948 -12100 8991 18704 5337
920 5337 -14341 -15580 1619 11607 5927 -2109 -2964 -350 -2491 -5099 2845 12473 7491 -8345 -15953
935 -15953 -3198 14423 12844 -3871 -13272 -6989 4612 6025 175 -317 1497 -2057 -6597 -4007
949 -4007 7274 12912 1185 -12376 -9894 4253 13268 5575 -6901 -7500 -759 2691 1168 -246
963 -246 2366 1824 -5739 -7969 362 9264 7920 -4359 -11078 -2992 7308 8060 775 -5013 -2489
$$ packed form
865a2678j4445K0932K9171p92k5983j7050R443J8340J741p846j80K378o504r872
879a3345M271K1851J0153j9862k4355J860K5868J6893j2809k0903k124J0620O023
892D141k633l12N999l285j5121n271J5675J9820k601k4791j3393J4053K0522K715
906A5518j4302r646M534M447k382J285P759L021j1673j5509M848K1091R713j3367
920E337j9678j239J7199R988n680q036q55K614k141k608P944R628m982j5836p608
935a5953J2755J7621j579j6715r401O283J1601J413n850m92J814l554m540K590
949d007J1281N638j1727j3561K482J4147R015p693j2476n99O741L450j523j414
963b46K612n42p563k230Q331Q902j344j2279o719Q086J0300P52p285n788K524
$$ plain form
978 -2489 1200 -276 -21 2781 3348 -1110 -7361 -5289 4250 7803 1769 -6089 -6921 851 5740 2598
994 2598 -945 -1261 -327 -178 -1369 1030 4747 2116 -3102 -5493 -1502 5057 4384 -2092 -4665 -2506
1010 -2506 1231 2601 -13 -574 632 -412 -1218 -467 2010 3915 751 -3207 -1939 1143 3067 1719
1026 1719 -2130 -2266 -286 -57 183 -343 -447 371 -1052 -1612 300 1204 1292 440 -1221 -9 1205 788
1044 788 948 -99 -471 367 -237 -428 -50 -750 -202 243 -803 -658 -628 -43 1129 568 -344 -305 -230 865
1064 865 1424 105 441 634 -524 -851 -628 750 2006 -492 -2883 -1942 78 2347 1071 -1833 -1418
1081 -1418 -77 347 952 773 1342 1287 -1752 -2281 818 3347 2907 -1678 -4553 -1377 2250 2436 104
1098 104 -2626 -1486 -56 -1022 5 2260 2229 -329 -3798 -2620 3463 5479 1450 -3277 -4190 438
$$ packed form
978b489L689j476K55K802N67m458o251K072R539L553o034p858q32P772M889l142
994B598l543l16R34J49j191K399L717k631n218k391L991O559o73o476k573K159
1010b506L737J370k614n61J206j044q06P51K477J905l164l958J268L082J924j348
1026A719l849j36J980K29K40n26j04Q18j423n60J912R04Q8q52j661J212J214m17
1044G88J60j047l72Q38o04j91L78p00N48M45j046J45L0N85J172n61r12L9P5J095
1064H65N59j319L36J93j158l27K23J378J256k498k391R41K020K269j276k904M15
1081a418J341M24O05j79N69n5l039n29L099K529m40m585k875L176L627J86k332
1098A04k730J140J430r66J027K255l1k558l469J178O083K016m029m727r13M628
$$ plain form
1114 438 3506 1246 -736 -1188 -1096 -1663 -2245 440 4310 1998 -3689 -5433 -801 5806 5272 -1414 -4478
1131 -4478 -2138 2124 3132 674 132 1095 -1672 -3759 -1842 3263 5453 -75 -7098 -5114 2228
1146 2228 6399 2905 -3573 -3855 323 1798 1081 1107 2211 1590 -3094 -4888 619 6275 4535 -3299
1162 -3299 -8087 -2547 4773 4610 -510 -3701 -2315 587 -225 -186 2974 3584 -506 -5279 -3974 4191
1178 4191 7708 1561 -5516 -6014 534 5317 2092 -1989 -1954 -1162 -1053 -1669 534 4700 2597 -3993
1194 -3993 -5900 -703 6415 6302 -1468 -5822 -2221 2526 3485 740 -1147 200 -1052 -3481 -1555
1209 -1555 3135 4874 28 -6703 -4997 2808 6498 2668 -3584 -4000 576 2508 1296 925 1203 730
1225 730 -2623 -4199 604 5645 3551 -3346 -7134 -2227 4987 4357 -963 -3443 -2099 1076 999 -58
$$ packed form
1114D38L068k260j982m52R2n67n82K685L870k312n687j744M632O607n34o686l064
1131d478K340M262J008k458n42R63k767k087J917N105K190n528p023J984P342
1146B228M171l494o478k82M178J475p17K6J104o21m684j794N507N656j740p834
1162c299m788N540P320j63n120l191J386K902q12L9L160O10m090m773J305Q165
1178D191L517o147p077m98O548M783l225m081L5P92J09o16K203M166k103o590
1194c993j907N197P118j13p770m354L601M747R59k745j887J347j252k429J926
1209a555M690J739m846o731J706P805L690l830o252m16M576J932j212l71K78m73
1225G30l353j576M803N041k094o897l788M907P214o30n320k480J344L175p7j057
$$ plain form
1241 -58 2030 2698 -824 -4064 -2714 3576 6195 607 -5256 -4588 648 4543 1722 -2546 -2017 -605
1257 -605 -334 -633 445 3274 2003 -3007 -4159 210 4924 4783 -1362 -5133 -1543 2349 2771 282
1273 282 -1669 -765 -508 -2023 -873 2208 2894 -123 -4416 -3195 2580 4756 1718 -2479 -3134 465
1289 465 2426 1094 364 125 -277 -1156 -2076 261 3094 1405 -2394 -4119 -1499 3210 2868 -722 -2162
1306 -2162 -1322 903 1745 350 797 1152 -620 -1715 -840 1347 2710 33 -2932 -2421 92 2222
1322 2222 1125 -1731 -1646 -203 48 382 640 699 719 -940 -1274 587 2001 1718 -540 -2340 -832 1097
1340 1097 1087 203 -1381 -1281 -8 -70 -2 569 159 -88 -711 -725 1094 1598 544 -244 -1046 54 1296
1359 1296 592 -141 -758 -805 189 237 -308 -113 -557 -609 4 -320 153 751 -125 -362 92 264 1254 337 -268
$$ packed form
1241e8K088O68l522l240J350O290K619n588n863O68N236L895k821m268N29J412
1257f05K71k99J078K829j271n010j152M369M714j41o145l771L590L892M22k489
1273B82j951R04K57j515J150L081O86l017m293J221N775K176l038m197o55L599
1289D65J961j332p30k39m02q79r20K337K833j689l799j725K620M709l42l590j440
1306b162Q40K225Q42j395M47L55j772j095Q75K187J363k677k965N11K513K130
1322B222j097k856Q5J443K51L34K58N9K0j659l34J861J414k83k258j800J508J929
1340A097j0q84j584J00J273o2O8N71m10k47o23j4J819N04j054p88q02J100J242
1359A296p04p33o17m7R94M8n45J95m44n2O13l24M73N98q76k37M54J72R90r17o05
$$ plain form
1380 -268 -267 -29 647 930 -614 -826 -371 -201 31 -253 -587 155 -334 -608 288 585 1048 294 -986 -266
1400 -266 1120 1279 508 -994 -838 385 431 -31 -445 -597 -159 -595 -1065 223 1284 272 -1029 -1674
1418 -1674 263 2273 1386 -467 -1196 -462 1476 967 -328 -156 -22 -589 -1010 -850 906 1697 -786
1435 -786 -2467 -1442 1193 2822 392 -2142 -895 854 1551 857 -384 611 820 -1306 -1277 452 2173
1452 2173 1521 -2192 -3463 -177 2340 1657 -1230 -2558 -356 1164 503 66 557 1033 34 -2067 -918
1469 -918 2400 2915 83 -3187 -2654 1377 3013 473 -1753 -1714 -36 508 -565 -19 1462 530 -1600
1486 -1600 -2289 565 3888 2418 -1906 -3201 -741 2396 2531 -904 -1471 -415 -410 -713 -562 1059 1995
1503 1995 -954 -3503 -1623 2230 3830 892 -3231 -2084 1237 2317 1172 -630 -388 305 -1140
$$ packed form
1380b68JK38O76K83j544k12M55J70K32k84l34P42m89k74Q96K97M63p54j280P20
1400b66J386J59p71j502J56J223M6m62m14j52M38m36m70J288J061j012j301o45
1418a674J937K010q87j853p29P34J938n09j295J72J34n67m21J60J756P91k483
1435g86j681J025K635J629k430k534J247J749O97o94j241R95K09k126K9J729J721
1452B173o52l713j271L286K517o83k887j328K202J520o61m37M91M76r99k101J149
1469i18L318N15k832l270N33M031J636k540k226L9J678N44j073N46J481r32k130
1486a600o89K854L323j470m324j295K460L137J35l435n67J056Nl03J51J621R36
1503A995k949k549J880L853J600k938m123J147L321J080j145j802K42O93j445
$$ plain form
1518 -1140 -1547 773 2480 1250 -2900 -4047 -14 3565 2283 -1387 -3218 -697 1870 1301 161
1533 161 535 533 -306 -1938 -942 2796 2959 -929 -3827 -2699 1771 3555 280 -2461 -2059 -94 1105
1550 1105 8 103 1663 681 -1790 -2018 909 3723 2256 -2291 -3494 -568 2697 2285 -950 -2080
1566 -2080 -612 -141 -445 -104 889 1645 -742 -3216 -1248 2468 3561 628 -3064 -2216 1451 2406 994
1583 994 -715 -901 -90 -693 -1202 668 1921 617 -2254 -3195 -34 3142 1927 -953 -2430 -640
1599 -640 1818 1300 87 303 357 -416 -1308 -813 1993 2102 -920 -3029 -2067 1142 2774 330 -1822
1616 -1822 -1403 101 764 493 307 1002 474 -1398 -1185 700 2423 1625 -1778 -2558 -206 1476 1290
1633 1290 -455 -1563 -493 -141 -564 107 899 976 -215 -1886 -781 2017 1962 358 -1622 -1500 840
$$ packed form
1518a140m07K320J707j230m150j147M033L579j282l670j831K521K567n69j140
1533A61L74kq39j632R96L738J63l888k898J128M470J784l275k741M02J965J199
1550A105j097R5J560r82k471k28K927K814j467m547j203K926L265m12l235j130
1566b080J468M71l04L41R93P56k387k474J968L716J093k933l692Q48L667R55j412
1583I94j709j86Q11o03n09J870J253j304k871r41L161L176j215k880j477J790
1599f40K458n18j213K16N4p73q92M95K806J09l022k109R62L209J632k444k152
1616a822M19J504O63k71j86O95n28j872K13J885J723p98l403p80K352J682j86
1633A290j745j108J070L52m23O71P92P7j191j671J105K798n5j604j980J22K340
$$ plain form
1650 840 981 314 -332 -646 -337 -615 -929 91 1188 188 -1092 -1624 96 1822 1240 -415 -625 -200
1668 -200 832 884 -6 446 416 -410 -672 -443 655 993 -601 -1413 -693 88 1086 291 -394 -135 139 120
1688 120 389 378 825 541 -597 -414 422 708 445 -552 -734 -58 -53 -110 -113 -413 -88 -141 -440 200 337 314
1710 314 371 -197 -68 627 114 278 239 -120 -52 -137 -297 138 101 -576 -376 -464 -224 318 -279 126 306 -284
1732 -284 1 56 568 936 313 -541 -59 -11 387 205 -327 -339 -143 -547 -502 45 495 388 -755 -862 270
1753 270 1012 998 38 -764 66 677 398 374 228 199 -183 -1004 -384 852 1021 -211 -1542 -1377 632 1293
1773 1293 214 -183 -647 40 655 -13 533 1044 204 -611 -1137 182 1737 847 -1201 -1704 -634 921
1791 921 938 -416 -634 -192 -396 -176 -230 1048 1390 -350 -1658 -498 1209 2104 563 -1492 -1293 343
$$ packed form
1650H40J41o67o46l14L09k78l14J020J097j000j280n32J720J726n82j655k10M25
1668b00J032N2q90M52l0q26k62K29J098L38j594q12P20P81R98p95o85K59K74j9
1688A20K69j1M47k84j138J83Q36K86k63r97j82O76Nn7ll00L25n3k99O40J37k3
1710C14N7n68J29O95n13J64l9l59O8q5j60M35l7o77K00q8K40N42n97M05J80n90
1732b84K85N5N12L68o23q54M82M8L98j82n32j2J96m04M5N47M50j07j143j07J132
1753B70P42j4r60q02Q30O11k79k4j46k9l82q21O20J236J69j232j331J65K009O61
1773A293j079l97m64O87O15o68N46N11q40q15n26J319J555q90k048n03J070J555
1791I21J7j354k18M42k04K20n4J278L42j740j308J160J707Q95j541k055J99J636
$$ plain form
1809 343 1019 545 -464 -152 -86 -1125 -1062 480 1704 796 -1426 -2200 214 2286 1663 -318 -1619 -386
1827 -386 871 297 200 597 281 -750 -2027 -814 1838 1976 -502 -2640 -1813 1066 2298 607 -854
1844 -854 -879 63 452 -74 612 1551 354 -1717 -1961 147 2551 1427 -1956 -2683 -681 1602 1550 -472
1862 -472 -831 -24 -257 -565 48 1472 2001 -538 -2527 -1008 1930 3021 455 -2526 -1865 370 1177
1879 1177 540 -204 -197 -135 -1223 -1463 908 2292 1080 -1691 -2857 203 2713 2065 -443 -2194 -719
1896 -719 957 477 127 565 160 -974 -1970 -1037 1941 2337 -526 -2648 -1821 1328 2746 787 -1174
1913 -1174 -868 -99 340 347 273 1410 169 -2067 -2051 209 2722 1445 -1901 -2781 -520 1732 1621 -226
1931 -226 -972 -44 -112 -479 453 1600 1767 -398 -2553 -1004 1800 2439 179 -2282 -1986 607 1245 290
$$ packed form
1809C43O76m74j009L12O6j039O3J542J224r08k222p74K414K072o23j981j301J233
1827c86J257n74r7L97l16j031j277J213K652J38k478k138Q27K879J232j691j461
1844h54k5R42L89n26O86R39j197k071k44K108K404j124l383p27K002K283n2k022
1862d72l59Q07k33l08O13J424N29k539j989J519K938J091k566k981O61K235Q07
1879A177o37p44PO2j088k40K371J384j212k771j166L060K510o48k508j751J475
1896g19J676m80l50M38m05j134r96R33K978L96k863k122Q27L149J418j959j961
1913a174L06P69M39Pp4J137j241k236J6K260K513j277l346q80K261K252j11j847
1931b26p46R28o8l67R32J147J67k165k155J549K804O39k260k461K96K593O38r55
$$ plain form
1949 290 -282 -469 -192 -759 -1051 948 2236 932 -1535 -2389 219 2641 1767 -757 -1823 -798 853
1966 853 759 -253 146 174 -604 -1499 -881 1600 2213 -461 -2334 -1397 1159 2547 801 -1219 -869 150
1984 150 493 371 109 643 170 -1737 -1725 329 1889 1310 -1461 -2352 -75 1409 1339 53 -1044 -96
2002 -96 226 -164 294 980 990 -297 -1865 -876 1617 1675 -105 -1900 -1652 535 1324 308 -456 -364 3
2021 3 -263 -355 763 1487 569 -1034 -1370 20 1805 1246 -807 -1480 -604 564 574 -252 -243 -4 -635 -657
2041 -657 -176 859 1242 -118 -1518 -614 817 1576 529 -1048 -637 326 277 286 99 -96 155 -925 -815
2060 -815 183 921 543 -840 -1339 -13 1064 794 59 -658 -198 465 270 137 564 59 -288 -965 -463
2079 -463 485 737 -184 -890 -788 324 853 -14 -229 -272 -48 225 143 58 818 194 -372 -391 52 700 522
$$ packed form
1949B90n72j87K77n67k92J999J288j304k467q54K608K422q74k524j066J025J651
1966H53r4j012L99K8p78q95O18K481O13k674j873R37K556J388j746k020L50J019
1984A50L43j22k62N34m73j907J2K054J560n79k771q91K277J484p0j286j097R48
2002i6L22l90M58O86J0j287j568R89K493N8j780j795K48K187P89j016p64R2L67
2021Ck66r2J118P24r18j603l36J390J785n59k053o73Q76J168J0q26RK39o31k2
2041f57M81J035L83j360j400R04J431P59j047j577M11R63m9Rj87j95K51j080J10
2060h15R98P38l78j383m99J326J077k70p35p17M60O63j95j33M27n05l47o77N02
2079d63R48K52r21p06J02J112N29q67k15m3K24K73q2q5P60o24n66j9M43O48j78
$$ plain form
2100 522 -500 -726 -301 -91 378 -291 -474 -32 -80 66 283 186 393 14 -419 -31 425 457 363 -409 -487
2121 -487 220 129 154 -205 -542 30 -20 -369 -106 11 -34 49 -136 189 634 193 137 -149 -160 261 405 122
2143 122 -162 -454 -96 107 -298 -161 48 -198 -94 -11 -18 232 42 56 159 15 269 412 -135 -247 -99
2164 -99 345 334 40 -600 -68 -143 -33 70 -327 -9 -60 -339 -167 364 524 377 -259 -462 487 508 354 -131
2186 -131 -458 -6 277 -101 35 87 -123 -176 -478 -216 504 229 -251 -719 -413 751 844 67 -192 -172 217
2207 217 340 -41 199 305 -214 -599 -566 -57 824 202 -852 -702 -13 627 521 -358 -125 114 75 413
2227 413 -60 365 455 -279 -750 -156 359 729 -263 -1165 -653 392 692 220 -462 -320 263 -249 -97 318
2247 318 504 308 -665 -770 521 1064 470 -722 -879 -147 671 158 -137 -299 -268 -159 -401 -115 779 559
$$ packed form
2100E22j022k26M25K10M69o69j83M42m8J46K17r7K07l79m33L88M56L2r4p72p8
2121d87P07r1K5l59l37N72n0l49K63J17m5Q3j85L25M45m41n6k86j1M21J44k83
2143A22k84k92L58K03m05J37K09k46J04Q3pK50j90J4J03j44K54J43n47j12J48
2164i9M44j1k94o40N32p5J10J03l97L18n1k79J72N31J60j47o36k03R49K1j54m85
2186a31l27M52K83l78J36N2k10n3l02K62P20k75m80m68L06J164R3p77k59K0L89
2207B17J23l81K40J06n19l85L3N09Q81o22j054J50O89O40j06q79K33K39l9L38
2227D13m73M25R0p34m71N94N15L70r92r02N12J045L00m72o82J42N83n12J52M15
2247C18J86j96r73j05J291N43n94j192j57P32Q18n13k95j62L1J09k42K86Q94k20
$$ plain form
2267 559 -360 -723 -448 1090 1239 34 -761 -459 188 633 -63 -291 252 -216 -623 -319 -37 743 142
2286 142 -1108 -833 170 1087 816 -328 -662 242 442 419 125 202 428 -289 -1057 -123 674 743 -305 -1438
2306 -1438 -706 693 696 152 -515 -396 297 46 -295 495 673 144 -633 -877 451 1311 298 -764 -1233
2325 -1233 -204 822 222 -385 -369 -335 -189 -125 -23 744 749 -389 -841 -125 941 1333 -119 -993 -677 182
2345 182 727 103 -448 -22 -278 -619 -373 267 693 142 -841 -965 438 989 794 -463 -777 119 518
2364 518 297 112 -27 148 -377 -927 -296 731 556 -395 -1221 -674 746 869 190 -554 -485 190 286 -27
2384 -27 283 476 2 -508 -631 307 838 251 -666 -947 -211 644 421 -454 -373 40 -229 129 7 616 606
2405 606 -207 -511 -276 689 1086 -44 -847 -674 206 362 202 -497 -265 -101 -339 -180 464 579 413 -588
$$ packed form
2267E59r19l63K75J538J49j205p95L02O47M45o96k28N43m68m07L04K82P80o01
2286A42j250K75J003R17k71j144l34R04K00k3k94P7K26p17p68R34P97O9j048j133
2306a438P32J399Ln44o67J19O93k51l41P90J78n29p77k44J328Q60j013j062m69
2325a233J029J026o00o07J6L4J46O4J02P67Nj138m52P16J066L92j452q74L16Q59
2345A82N45o24n51M26k56l41K46O40M26n51r83j24J403N51j95j257l14Q96L99
2364E18k21j85j39J75n25n50O31J027j75r51q26N47J420J23o79p44O9O75R6l13
2384b7L10J93m74n10j23R38N31n87r17k81P36Q55k23q75Q1M13k69L58j22O09j0
2405F06q13l04K35R65L97j130q03J73Q80J56j60o99K32J64k38J59O44J15j66j001
$$ plain form
2425 -588 -647 479 893 376 -306 -670 -137 593 245 92 -137 -86 -176 -651 -444 631 332 -277 -656 -429
2445 -429 731 825 180 -295 -337 159 513 80 181 296 -16 -354 -241 98 461 98 -696 -804 -77 472
2465 472 283 -349 -241 71 191 91 196 227 334 -80 -508 171 576 586 -32 -925 -493 182 91 76 -215
2486 -215 -367 200 -235 -81 277 416 225 -200 -420 246 622 193 -176 -396 -56 394 -25 -295 -105 -151
2506 -151 -123 -363 -181 271 204 -195 -58 -95 284 571 10 -217 -20 196 323 122 -2 140 -87 -236 -192
2527 -192 -49 305 144 -531 -337 35 207 185 -34 -17 52 90 73 284 -34 259 -46 -267 -100 186 111 -53
2549 -53 -495 -318 181 56 50 2 -296 144 154 -142 99 199 -50 35 -221 85 395 75 -43 -130 -90 129 -143
2572 -143 -209 -133 -141 -166 -185 -146 47 305 -90 14 26 189 346 153 -184 228 18 247 -54 -145 36 -136 -159
$$ packed form
2425e88n9J126M14n17o82l64N33P30l48j53k29N1r0m75K07J075k99o09l79K27
2445d29J160R4o45m75m2M96L54m33J01J15l12l38J13L39L63l63p94j08P27N49
2465D72j89o32J08L12J20j00J05L1J07m14m28O79M05J0o18q93M32O75r1j5k91
2486b15j52N67m35J54L58J39j91m25k20O66L76m29l69k20L40M50m19k70J90m6
2506a51K8k40J82M52o7l99J37l7L79K87n61k27J97K16J27k01j24J42k27j49M4
2527a92J43L54j61o75J94L72J72k2k19J7O9L8j7K11l18K93l05k21J67K86p5j64
2549e3m42J77M99j25om8k98M40J0k96K41J00k49Q5k56L06L10l20j18q7M0K19k72
2572a43o6P6qk5j9L9J93K58l95J04J2J63J57j93l37M12k10K29l01r1J81j72k3
$$ plain form
2595 -159 20 -104 -128 81 -46 30 94 -70 128 44 28 206 204 189 260 -18 106 103 -145 -90 85 -215 -162 -110 -218
2620 -218 -18 -138 -81 31 -146 26 164 -36 65 91 86 313 294 -78 286 -25 68 -9 -68 -73 -93 -274 2 -39
2644 -39 -55 142 -58 -102 262 78 61 150 -90 272 273 -75 64 35 -202 76 -246 -202 -64 -68 -114 -61 -100 111 132
2669 132 5 61 98 -64 231 30 169 127 128 89 -39 -118 54 -46 -113 -49 -158 12 -11 33 94 -46 -89 -37 181
2694 181 76 256 152 54 121 -77 43 125 79 -88 -32 -9 121 -40 -164 135 -184 80 231 -86 207 119
2716 119 67 47 38 240 259 -50 18 35 18 47 -61 -197 -31 -122 -108 -43 -88 -149 66 -141 82 184 68 168 124
2741 124 -102 208 90 -18 199 189 -101 -68 -192 -19 118 -246 -23 86 -171 23 14 13 104 178 99 169 69
2764 69 252 155 -22 90 15 133 36 40 -173 -32 -71 -115 -88 -202 39 -182 -139 161 55 98 270 64 -108 17
$$ packed form
2595a59J79j24k4K09j27P6O4j64J98q4j6J78kj5P1k78J24lk48N5J75l00N3N2j08
2620b18K00j20N7J12j77J72J38k00J01K6nK27j9l72L64l11R3p7n9nk0j81K76m1
2644c9j6J97k00m4L64j84j7Q9k40L62Jl48J39k9k37K78l22M4J38mm6N3l9K11K1
2669A32j27N6L7j62K95k01J39m2Jl9j28p9J72j00o7O4j09J70k3M4O1j40m3N2K18
2694A81j05J80j04r8O7j98J20Q2m6j67N6K3J30j61j24K99l19K64J51l17K93q8
2716A19n2k0rK02J9l09O8J7j7K9j08j36J66r1J4O5m5o1K15k07K23J02j16J00m4
2741A24k26L10j18j08K17j0k90L3j24J73J37l64K23J09k57J94rjR1P4p9P0j00
2764F9J83r7j77J12p5J18r7Mk13J41l9m4K7j14K41k21M3L00j06M3J72k06j72J25
$$ plain form
2788 17 -6 20 231 -81 -74 -28 -113 -32 -150 -102 -26 -134 -74 -176 42 -25 204 -183 116 175 57 223 42 -59
2812 -59 107 -135 -216 25 -192 -104 -28 -108 -53 -135 94 111 -65 -102 31 -25 197 163 -124 75 189 41 -22 -84
2836 -84 -57 7 -257 -198 36 -228 45 -135 -301 -3 49 20 160 -112 178 242 20 107 238 123 -38 -152 108
2859 108 250 0 -181 -347 -92 179 159 -193 16 -38 -105 -25 10 70 106 47 -102 32 51 318 56 -253 -140
2882 -140 -94 -39 -1 -203 6 109 -275 11 52 -16 259 19 -129 124 302 281 144 -70 1 136 -31 -35 129
2905 129 -116 -149 -210 -178 177 97 -110 -95 -205 4 302 72 16 -18 117 -49 81 -49 337 136 -181 -337
2927 -337 -34 380 97 -201 -404 -239 83 -46 -18 -141 -29 -95 -78 42 168 396 -36 -243 -110 151 297
2948 297 322 -165 -100 -5 103 41 62 -103 144 -206 -228 -87 130 382 -146 -423 -24 269 348 95 -356 -350 -52
$$ packed form
2788A7k3K6K11l12PM6q5Q1j18M8P6j08O0j02K18o7K29l87K99N9j18J66j81j01
2812e9J66k42q1K41k17Q8P6q0N5q2K29J7j76l7J33n6K22l4k87J99J14j48o3o2
2836h4K7O4k64N9K34k64K73j80j66K98N2k9J40k72K90O4k22Q7J31j15j61j14K60
2859A08J42k50j81j66K55K71k0l52K09n4o7Q0L5O0L6n9j49J34J9K67k62l09J13
2882a40M6N5L8k02K09J03l84K86M1o8K75k40j48K53J78k1j37k14P1J35j67mJ64
2905A29k45l3o1L2L55q0k07J5j10K09K98k30n6l4J35j66J30j30L86k01l17j56
2927c37L03M14k83k98k03J65L22j29K8j23J12o6J7J20J26K28m32k07J33K61J46
2948B97K5m87O5R5J08o2K1j65K47l50k2J41K17K52n28k77L99K93P9k53m51OK98
$$ plain form
2971 -52 17 -35 75 -136 -29 -308 -183 312 326 -46 -129 -276 -154 457 70 57 -113 -117 216 155 -20 144 33
2994 33 -228 -163 -189 98 339 -335 -320 -297 66 274 21 70 130 97 85 124 176 262 46 -324 -148 145 247 201
3018 201 -359 -450 130 16 23 27 -70 7 112 -102 277 325 268 51 -311 32 362 252 44 -166 -358 172 71
3041 71 -121 4 -99 -45 -140 -155 147 282 -140 -55 -151 -48 606 268 -127 -298 -54 48 47 -111 80 -142 -184
3064 -184 -189 -300 146 260 -54 -410 -134 182 265 150 -236 -77 120 -126 17 144 126 -50 -343 -139 -29
3085 -29 -55 36 -99 -371 48 -90 -99 -40 93 -10 -23 -318 177 330 155 -26 -217 9 226 239 -105 -240 -186
3108 -186 82 166 -217 62 -22 -92 65 3 326 226 -45 -232 -114 10 433 309 -173 -65 -112 118 187 -10
3130 -10 -80 -61 -233 -311 -60 203 266 -116 -185 -32 58 305 169 -50 15 -10 -32 156 79 67 -60 -80 -261 198
$$ packed form
2971e2O9n2J10k11J07k79J25M95J4l72q3j47J22O11l87j3j70mL33o1j75J64j11
2994C3k61O5k6K87K41o74J5K3L63K08k53M9O0l3j2L9N2Q6k16l70J76K93J02m6
3018B01n60r1N80j14PMr7P7J05k14L79M8n7k17l62L43L30j10k08k10j92N30j01
3041G1j92J25j03N4r5j5L02J35m22Q5r6J03O54l38l95j71K44J02jj58J91k22m2
3064a84nj11M46J14l14l56K76L16Q3j15l86J59J97k46J43J27j8j76k93K04J10
3085b9k6R1j35k72M19j38rN9J33j03j3k95M95J53j75j81j91K26K17J3l44j35N4
3108a86K68Q4l83K79q4p0J57o2L23j00k71j87J18J24M23j24m82J08m7K30O9j97
3130a0p0J9j72p8K51K63O3l82o9J53R0K47j36k19O5k5k2J88p7j2j27k0j81M59
$$ plain form
3154 198 139 -31 -186 -346 -154 132 75 -11 -10 -6 173 111 188 362 4 -80 -73 -66 304 138 63 -154 -117 -100 238 36
3180 36 -53 60 28 -154 205 86 496 -107 -210 53 -46 223 168 -39 -213 -142 -183 104 14 -60 44 -205 -258
3203 -258 96 259 82 65 -130 49 183 -24 134 -91 -37 37 25 -12 -14 -28 -77 -122 -315 211 101 -28 -59 -263
3227 -263 80 267 32 25 84 9 115 8 82 60 143 -231 -80 -139 -42 263 -78 -196 39 -148 91 -39 -30 -63
3251 -63 -4 -56 109 98 52 105 22 -30 12 -61 85 -271 -57 41 -114 -11 -124 -135 27 -8 32 116 66 -17 51 -33
$$ packed form
3154A98n9j70j55j60J92K86n7q6JMJ79o2P7J74l58q4PPL70j66p5k17L7J7L38k02
3180C6q9J13l2j82L59j19M10o03j03K63r9K69n5k07j74P1m1K87r0p4J04k49n3
3203b58L54J63j77j7j95J79J34k07J58k25N4P4j2l7kj4m9m5j93N26j10j29l1k04
3227b63L43J87k35pN9p5J06j07P4k2Q3l74J51n9R7L05l41j18K35j87K39j30Rl3
3251f3N9n2J65j1m6N3q3n2M2p3J46l56K14R8j55J03j13j1J62l5M0Q4n0q3O8q4
$$ [...]
8191e7
##END NTUPLES=NMR FID
##END=
