##TITLE=1H_Pr 3D
 CDCl3
 8 sc, 
 15.03.2022
##JCAMPDX= 6.0         $$ Bruker NMR JCAMP-DX V2.0
##DATA TYPE= NMR FID
##DATA CLASS= NTUPLES
##ORIGIN= UXNMR, Bruker Analytische Messtechnik GmbH
##OWNER= root
$$ XWIN-NMR		Version 3.5
$$ Tue Mar 15 11:21:52 2022 Russian Standard Time (UT+4h)  she@DPX200
##.OBSERVE FREQUENCY= 200.131346
##.OBSERVE NUCLEUS= ^1H
##.DELAY= (6, 6)
##.ACQUISITION MODE= SIMULTANEOUS
##.ACQUISITION SCHEME= undefined
##.AVERAGES= 8
##.DIGITISER RES= 18
##SPECTROMETER/DATA SYSTEM= spect
##.PULSE SEQUENCE= zg30
##.SOLVENT NAME= CDCl3
##.SHIFT REFERENCE= (INTERNAL, CDCl3, 0, 15.7039)
##AUDIT TRAIL= $$ (NUMBER, WHEN, WHO, WHERE, WHAT)
$$ ##TITLE= Audit trail, XWIN-NMR		Version 3.5
$$ ##JCAMPDX= 5.01
$$ ##ORIGIN= Bruker BioSpin GmbH
$$ ##OWNER= she
$$ F:/spectra/data/she/nmr/H-F/1/audita.txt
$$ ##AUDIT TRAIL=  $$ (NUMBER, WHEN, WHO, WHERE, WHAT)
(   1,<2022-03-15 11:20:41.82 +0400>,<she>,<DPX200>,
      <created by zg, POWCHK disabled, PULCHK disabled
       configuration hash MD5:
       00 E9 B6 7A A2 85 ED C7 34 08 36 98 17 FE 4E 26
       data hash MD5: 16K
       0E 99 17 EC 15 AE D0 21 D2 2A 68 89 5C 13 96 F0>)
$$ ##END=
$$ 
$$ hash MD5
$$ 84 A5 0C F8 B2 6D 7B 9C F4 D1 CB 1C 83 87 19 3B
##$RELAX= 
##$RELAX= 
##$RELAX= 
##$RELAX= 
##$RELAX= 
##$RELAX= 
$$ Bruker specific parameters
$$ --------------------------
##$DU= <F:/spectra>
##$EXPNO= 1
##$NAME= <H-F>
##$PROCNO= 1
##$TYPE= <nmr>
##$USER= <she>
##$AMP= (0..31)
100 100 100 100 100 100 100 100 100 100 100 100 100 100 100 100 100 100 
100 100 100 100 100 100 100 100 100 100 100 100 100 100 
##$AQSEQ= 0
##$AQ_mod= 1
##$AUNM= <au_zg>
##$AUTOPOS= <>
##$BF1= 200.13
##$BF2= 200.13
##$BF3= 200.13
##$BF4= 200.13
##$BF5= 200.13
##$BF6= 200.13
##$BF7= 200.13
##$BF8= 200.13
##$BYTORDA= 1
##$CFDGTYP= 0
##$CFRGTYP= 5
##$CHEMSTR= <none>
##$CNST= (0..31)
1 1 145 1 1 1 1 1 1 1 1 1 1 1 1 1 1 1 1 1 1 1 1 1 1 1 1 1 1 1 1 1 
##$CPDPRG= <>
##$CPDPRG1= <>
##$CPDPRG2= <>
##$CPDPRG3= <>
##$CPDPRG4= <mlev>
##$CPDPRG5= <mlev>
##$CPDPRG6= <mlev>
##$CPDPRG7= <mlev>
##$CPDPRG8= <mlev>
##$CPDPRGB= <>
##$CPDPRGT= <>
##$D= (0..31)
0 1.2 0 0 0 0 0 0 0 0.06 0 0.03 0 0 0 0 0.0002 0 0 0 0 0 0 0 0 0 0 0 0 
0 0 0 
##$DATE= 1647328841
##$DBL= (0..7)
120 120 120 120 120 120 120 120 
##$DBP= (0..7)
150 150 150 150 150 150 150 150 
##$DBP07= 0
##$DBPNAM0= <>
##$DBPNAM1= <>
##$DBPNAM2= <>
##$DBPNAM3= <>
##$DBPNAM4= <>
##$DBPNAM5= <>
##$DBPNAM6= <>
##$DBPNAM7= <>
##$DBPOAL= (0..7)
0.5 0.5 0.5 0.5 0.5 0.5 0.5 0.5 
##$DBPOFFS= (0..7)
0 0 0 0 0 0 0 0 
##$DE= 6
##$DECBNUC= <off>
##$DECIM= 32
##$DECNUC= <off>
##$DECSTAT= 4
##$DIGMOD= 1
##$DIGTYP= 9
##$DL= (0..7)
0 120 120 120 120 120 120 120 
##$DP= (0..7)
150 150 150 150 150 150 150 150 
##$DP07= 0
##$DPNAME0= <>
##$DPNAME1= <>
##$DPNAME2= <>
##$DPNAME3= <>
##$DPNAME4= <>
##$DPNAME5= <>
##$DPNAME6= <>
##$DPNAME7= <>
##$DPOAL= (0..7)
0.5 0.5 0.5 0.5 0.5 0.5 0.5 0.5 
##$DPOFFS= (0..7)
0 0 0 0 0 0 0 0 
##$DQDMODE= 0
##$DR= 18
##$DS= 0
##$DSLIST= <SSSSSSSSSSSSSSS>
$$ [...]
##$SUBNAM2= <"">
##$SUBNAM3= <"">
##$SUBNAM4= <"">
##$SUBNAM5= <"">
##$SUBNAM6= <"">
##$SUBNAM7= <"">
##$SUBNAM8= <"">
##$SUBNAM9= <"">
##$SW= 18.0517287032376
##$SWIBOX= (0..15)
0 0 2 0 0 0 0 0 0 0 0 0 0 0 0 0 
##$SW_h= 3612.71676300578
##$TD= 16384
##$TD0= 1
##$TE= 0
##$TE2= 300
##$TE3= 300
##$TEG= 300
##$TL= (0..7)
0 120 120 120 120 120 120 120 
##$TP= (0..7)
150 150 150 150 150 150 150 150 
##$TP07= 0
##$TPNAME0= <>
##$TPNAME1= <>
##$TPNAME2= <>
##$TPNAME3= <>
##$TPNAME4= <>
##$TPNAME5= <>
##$TPNAME6= <>
##$TPNAME7= <>
##$TPOAL= (0..7)
0.5 0.5 0.5 0.5 0.5 0.5 0.5 0.5 
##$TPOFFS= (0..7)
0 0 0 0 0 0 0 0 
##$TUNHIN= 0
##$TUNHOUT= 0
##$TUNXOUT= 0
##$USERA1= <user>
##$USERA2= <user>
##$USERA3= <user>
##$USERA4= <user>
##$USERA5= <user>
##$V9= 5
##$VALIST= <valist>
##$VCLIST= <CCCCCCCCCCCCCCC>
##$VD= 0
##$VDLIST= <DDDDDDDDDDDDDDD>
##$VPLIST= <PPPPPPPPPPPPPPP>
##$VTLIST= <TTTTTTTTTTTTTTT>
##$WBST= 1024
##$WBSW= 4
##$XGAIN= (0..3)
0 0 0 0 
##$XL= 0
##$YL= 0
##$YMAX_a= 303719
##$YMIN_a= -390047
##$ZGOPTNS= <>
##$ZL1= 120
##$ZL2= 120
##$ZL3= 120
##$ZL4= 120
##$ABSF1= 10
##$ABSF2= 0
##$ABSG= 5
##$ABSL= 3
##$ALPHA= 0
##$AQORDER= 0
##$ASSFAC= 0
##$ASSFACI= 0
##$ASSFACX= 0
##$ASSWID= 0
##$AUNMP= <proc_1d>
##$AZFE= 0.1
##$AZFW= 0.1
##$BCFW= 1
##$BC_mod= 2
##$BYTORDP= 1
##$COROFFS= 0
##$CY= 11.3945322036743
##$DATMOD= 1
##$DC= 2
##$DFILT= <>
##$DTYPP= 0
##$F1P= 2.36226072786647
##$F2P= -0.459571619588291
##$FCOR= 0.5
##$FTSIZE= 0
##$FT_mod= 4
##$GAMMA= 1
##$GB= 0.15
##$INTBC= 1
##$INTSCL= 1
##$ISEN= 128
##$LB= 0.24
##$LEV0= 0
##$LPBIN= 0
##$MAXI= 10000
##$MC2= 0
##$MEAN= 0
##$ME_mod= 0
##$MI= 1.114404
##$NCOEF= 0
##$NC_proc= 0
##$NLEV= 6
##$NOISF1= 3.799351
##$NOISF2= 2.8
##$NSP= 1
##$NTH_PI= 0
##$NZP= 0
##$OFFSET= 15.70392
##$PC= 1
##$PHC0= -16952.32
##$PHC1= 15.40078
##$PH_mod= 1
##$PKNL= yes
##$PPARMOD= 0
##$PSCAL= 0
##$PSIGN= 0
##$REVERSE= no
##$SF= 200.130013532006
##$SI= 16384
##$SIGF1= 3
##$SIGF2= 2
##$SINO= 400
##$SIOLD= 16384
##$SREGLST= <1H.CDCl3>
##$SSB= 0
##$STSI= 0
##$STSR= 0
##$SW_p= 3612.71676300578
##$SYMM= 0
##$S_DEV= 0
##$TDeff= 0
##$TDoff= 0
##$TI= <>
##$TILT= no
##$TM1= 0
##$TM2= 0
##$TOPLEV= 0
##$USERP1= <user>
##$USERP2= <user>
##$USERP3= <user>
##$USERP4= <user>
##$USERP5= <user>
##$WDW= 1
##$XDIM= 8192
##$YMAX_p= 0
##$YMIN_p= 0
$$ End of Bruker specific parameters
$$ ---------------------------------
##NTUPLES= NMR FID
##VAR_NAME=  TIME,          FID/REAL,        FID/IMAG
##SYMBOL=    X,             R,               I
##VAR_TYPE=  INDEPENDENT,   DEPENDENT,       DEPENDENT
##VAR_FORM=  AFFN,          ASDF,            ASDF
##VAR_DIM=   8192,          8192,            8192
##UNITS=     SECONDS,       ARBITRARY UNITS, ARBITRARY UNITS
##FACTOR=    0.0002768,     1,               1
##FIRST=     0,             0,               0
##LAST=      2.2672688,     0,               0
##MIN=       0,             -390047,         0
##MAX=       2.2672688,     303719,          0
$$ Real data points
##PAGE= N=1
##DATA TABLE= (X++(R..R)), XYDATA
0@%%%%%%%%%%qJ6j6J6k4L2l2M0n6O4p2Q8j05J29j53J77k08K41k81L27l74M24m81
33b56N45o17O96p83Q79r84J096j221J362j512J675j853K049k264K497k752L033
50A590l339L678m056M472m937N462o054O728p508Q423r509J0824j2455J4544j7334
65i471K1259k7228L7515o0041J98733j75306l57121L77349K37582j97615k04595
76a58939J58422R4914p6127o4512K2112j9661N8026R4537o5902j94056L7174K22338
88A08326K8935k03893m8705J40002M0485r5453n263N9786n884j8260K5071m6113
100b0966n6659R4810J07222j04944j30068Q0688J11741o3890o6928O1046K5577
111C7629o1409K55L9576k8107j1328O9116o425j10027K987J25122K5j09232K1955
$$ y = [0, 0, 0, 0, 0, 0, 0, 0, 0, 0, 0, -8, 8, -8, 8, -16, 16, -16, 24, -32, 32, -40, 48, -57, 72, -81, 96, -112, 129, -152, 175, -199, 225, -256, 289, -328, 368, -415, 464, -520, 576, -645, 717, -795, 880, -973, 1076, -1188, 1309, -1443, 1590, -1749, 1929, -2127, 2345, -2592, 2870, -3184, 3544, -3964, 4459, -5050, 5774, -6681, 7863, -9471, 11788, -15440, 22075, -37966, 160767, -14539, -371660, 5689, 243271, 45656, -158939, -517, 94397, 18270, -46242, -24130, -43791, 14235, 108772, 42870, -151186, -114012, 108326, 137261, -66632, -115337, 24665, 65150, -30303, -35566, 24220, 18336, 76, 25147, -20966, -77625, 17185, 124407, 19463, -110605, -29917, 81824, 17934, -48994, 12052, 37629, -23780, -23525, 16051, -12056, -23384, 45732, 39307, -70720, -67733, 57389, 57414, -51818, -29863]
124b9863R3315o3066r4041R8854J07474j11789j02402J16315P9020j28487n6633
135i1303J47769N1903j51182n5759J22957M3276q2465j1663N0922k5070l9619
146d0234M3363K6592m6796n18N1112k9235o5396M4539P8685l9475p1843L6228
158a2978M8804m3623k3728N8904J3100o2587p479N1764p311l7009K9100K9493
170C6450m5040k9194M3095J9876l5951j665L3350j7486l7984K4024L4586k2361
182A700j7725K5599l726l7410K0429N0801k7260n1713L7153M5617n1585m2349
194e0469O7687M8848p0886n4190N9443M5461m3925k7507L4632R843l2234l053
206a6350K1788k818m143J3701j3307l1076J8577M4432j5157m5079J5555L8181
$$ y = [-29863, 63452, 386, -93655, 5199, 112673, 884, -101518, 14797, 93817, -34670, -91303, 56466, 108369, -42813, -98572, 24385, 67661, -14804, -26467, 24455, -615, -40234, 3129, 29721, -17075, -17593, 33519, 4284, -61112, -16573, 62112, 22637, -49206, -12978, 35826, -7797, -31525, 27379, 40479, -22108, -29587, 22177, 14866, -22143, 6957, 36450, -8590, -37784, 5311, 25187, -10764, -12429, 20921, 3435, -34549, -10525, 24061, 1700, -16025, 9574, 5848, -31562, -11133, 39668, 12408, -39305, -2152, 43465, -8120, -50469, 17218, 66066, -4820, -59010, 433, 45894, 1969, -25538, 9094, 18937, -13297, -16350, 5438, 2620, -1523, 12178, -1129, -32205, -13628, 30804, 15647, -29432, -13877, 24304]
218B4304k2086l0704L1672K9681l1839k5630K7396J3924k3228L448K4878j5490
230F326k8451J7490K5726j8252j8704K0672J0379k5101q773K1970O782j3400O36
243b700M149j2987p51K4279J640k7947K384K9130q889l1442J5137L8084j4426
256A5661l7491R987K8199q177j4855J1684N399j6725l494J5426o34j0183P645
269B442M972j6353p833J9283J0647j5496q243J1323q00r935J0210J3159j2558
282H18j2865J3746R543j7054k763K3451J164k7099k433K3977L577j8349j180J1751
296F284l425r085L911L911k293J205J684q123n768J2814R041j3281q721J3176
310A330P491j4134n400J6404O766j4835m423J0212L35n375N888M863r953o077
$$ y = [24304, 2218, -28486, 3186, 32867, 1028, -24602, 2794, 16718, -6510, -3062, 21816, 6326, -22125, -4635, 21091, 2839, -15865, 4807, 15186, -9915, -18688, 3282, 10064, -3336, -2700, 1449, -11538, -12289, 11990, 13630, -14317, -11933, 17197, 8308, -23134, -7997, 30087, 15661, -21830, -11843, 16356, 8179, -6676, 5008, 10407, -6318, -9812, 5614, 4980, -5203, 2442, 7414, -8939, -16772, 2511, 13158, -2338, -10581, 742, -58, -9993, 217, 13376, 818, -12047, 1699, 11242, -5812, -8575, 14876, 16040, -11059, -13492, 10485, 14062, -4287, -5467, 6284, 2859, -6226, -2315, 1596, -697, 508, 2192, -5931, -11699, 1115, 10156, -3125, -11846, 1330, 8821, -5313, -10713, 5691, 12457, -2378, -6801, 3411, 3746, -1629, 4259, 9122, -831, -6908]
324f908R231L988q230m6Q005m321j0195K209R344L52n672j32p4l898L366P750
340D769j802p774J543O485l706m324Q653O494j0256p198P606P104m886l318M148
355C538j196n208J719L582j341j579Q03j716l732J963O011j659o087P22M774j02
371D92l955J255M190p03j824J224l92j691L694M303m474o193L776P006l007o412
387b711J633M574k29m795l473K719N947Q42p671o740N640R918j508r583k171Q596
403I88M565o940m786O166P013l219p079j22N376M769j120o604m032N422O597l138
419C856p405M82O130K93o257k168M250L615k687m732K16L256J811j12j470j565
435b487N62L077J665k367k558K405L544p30l671j185L956L101k593m185k63K467
$$ y = [-6908, 2323, 6311, -1919, -1965, 6040, 1719, -8476, -6267, 3077, 3429, -2243, -2375, -2449, -6347, -2981, 4769, 2967, -4807, -3264, 3221, -485, -4809, 3844, 10338, 82, -7116, 490, 7594, 2708, -610, 3538, 2342, -2866, -1147, 2435, 1094, -485, 318, -1398, -5130, -3167, 2844, 1185, -4902, -4180, 594, 492, -3463, -2208, 1982, 1279, -545, 679, 287, -1404, 2290, 6593, 2119, -4074, -298, 6708, 3701, -2711, -1078, 3496, 3267, -1528, -5001, -2282, 3665, 4507, -3164, -9904, -4264, 5654, 4146, -5437, -7608, 988, 5553, -1387, -6173, -7, 7006, 3787, -3292, -3414, 1962, 6731, 5611, -993, -5025, 397, 6994, 3856, -3549, -3067, 3063, 3356, -2901, -5069, -819, 2796, 109, -4623, -4407, -1151, 660, 548, -922, -2487, -1925, 1152, 2817, 450, -2108, 297, 3841, 3111, -560, -1745, 2211, 5312, 2719, -1466, -1729, 738]
451G38J901k64k941l801J092O392r4r447j339J0922N072j1826j0081J0621J5551
466A2496o834j6781K524J6912K137j4055l562J0557M732n974n482Q97N772L625
480F964l043r452k407J1050P193j0424j1722O898J4101m030j6720Q24J7671L240
494A0143j6927o343J4561R489r883q734N240P465J32m674l448J531N681K775n101
509A907p680K320R843K227j1925p440J1489J1389j2225j4379J0168J6471q221
522C944j7592N276J7151l317j3634K981J0880l690q915O531J0093p916j0241Q660
536B11J0383p738j0293P957Q665p996p172O852L303n707J79M954n931p091J0078
551F54J0822j2639j5139J1087J9204q021k0506L597K0894K142j7775n796J2769
$$ y = [738, 2639, 2375, -566, -4367, -3275, 3117, 3023, -6424, -7763, 3159, 8231, -3595, -13676, -3055, 12496, 5662, -11119, -8595, 8317, 10454, -3601, -7163, 3394, 8126, 2152, -3330, -2433, 3339, 6964, 3921, -5531, -7938, 3112, 10305, -119, -11841, -4943, 9158, 5128, -11592, -10768, 6903, 10143, -6784, -13127, 1434, 10923, 1040, -7694, -2454, 5011, 5143, 469, -2979, -1448, 4233, 7008, 1907, -5773, -3453, 6390, 8617, -3308, -10748, 741, 12130, -95, -14474, -4306, 12165, 3944, -13648, -8372, 8779, 5462, -8172, -5191, 5689, 1999, -6916, -385, 9708, 1792, -8449, 211, 10594, 2856, -7437, 520, 9185, 1189, -5983, 869, 4172, -1535, -1356, 3598, -2333, -9424, 654, 11476, -1163, -16302, -5215, 13989, 5968, -14538, -10941, 9953, 12095, -5680, -11476, 1293]
564A293R508o094r646M03P038N108k054q852m710Q382J1275n193j6953j626J9387
579G266P702j8636j4984J4465J9683r446k1805M787K1689o46j8830k803J5853
592D295M048j0028j475N491j853k375O273K284r918k855J2020L174j1941m311
606g171J0104L877r429l009P167P30n887K340L962o038m567R391O740j0227r025
621a1042R524J1571o571j0892K606R972J571o456m075K673N208J611n141m590
635d031K059O700J360p774n620M843R167j609j1454m223J1436Q713q640j2148
649a1221M137J4603p1j3969k722J3259M922r601n350O313M980k607k259p82n81
664i49L120L111l986o022L041O544j967o868K02M848P54m117o08K397K60j643
$$ y = [1293, 10801, 4707, -4939, -4536, 2502, 7610, 5556, -3296, -8006, 376, 11651, 6458, -10495, -12121, 7266, 14968, -3668, -18652, -4187, 15496, 6050, -15755, -10968, 10721, 10075, -8755, -11558, 4295, 8343, -1685, -3160, 2331, 478, -1897, 4376, 6660, -3258, -6113, 5907, 9081, -2860, -7171, 2933, 6810, -2619, -5628, 1539, 2269, -3618, -1278, 2684, -3354, -7921, 1470, 8210, -2017, -11042, -1518, 10053, 3482, -7410, -4804, 5168, 6739, 283, -3792, -1119, 4089, 5700, 559, -4031, -1972, 4728, 6088, -1686, -7306, -2463, 6704, 5095, -6359, -10582, 854, 9567, 927, -11221, -7084, 7519, 7448, -6521, -9243, 4016, 8938, -663, -6013, 300, 5280, 2673, 414, -368, -949, 2171, 5282, 1296, -4726, -1685, 4859, 2892, -3976, -3774, 1074, 1828, -2289, -2897, -500, -240, -1883]
680a883P70R12j362N00L149o24l890R28N381j118m421J288L139p32k125P23Q54
697A489p13p48L74n52J78M00j601o66J495M59j580p01J416J036j565r32K065R61
715H15j772p56K470J534k183p60K197O58j954K13K244q18k548O46K011r75j368
732c46m91k23R82M02j335j196J116J973j565k501J608L131l43l380n21M246J296
749B853l353q81K329J562j487q45Q13N26l50m75n34j85P15O1j106n44K25O79n51
768e48p58J48k87O9J106j40r02j52Q83J014n47n23J191O66r39l44J267R85j398
787G91n92O93J61l07M39o14j101n2P11J6p09k96Pm48K47P12q02J89N7O40J70j088
809a176P49J981j091j498R45K570k97k720M09K024k04j449K19J89J39m42o52n14
$$ y = [-1883, -1113, -201, -1563, -1063, 2086, 1462, -2428, -1500, 3881, 2763, -1658, -370, 2769, 2037, -88, 635, 1489, 776, 28, 402, -150, 28, 428, -1173, -1839, -344, 115, -1465, -2166, -750, 286, -1279, -2211, -146, 815, -957, -1713, 757, 2291, 108, -652, 1545, 2203, 249, 462, 2706, 1888, -660, -14, 1997, 1022, -346, -837, -1060, -78, 324, -1011, -2207, -1091, 882, -683, -3184, -1576, 1555, 1212, -2168, -2689, 1557, 2853, -500, -1381, 948, 2510, 1023, 178, 991, 1517, 1167, 692, 158, -27, 688, 749, -357, -901, -676, 3, -548, -1306, -1158, -1445, -1376, -270, -410, -1312, -1464, -581, 433, -114, -637, 554, 1220, 281, -63, 1204, 2189, 791, 199, 892, 1053, 746, 1185, 571, -530, -582, 129, 145, -564, -860, -853, -1301, -1054, -342, -1144, -955, -898, -258, -88, -1176, -427, 1554, 463, -1035, -90, 2480, 2183, -537, -128, 1896, 1692, 243, 462, 651, 790, 348, -304, -818]
827h18P83P01j412k033J175K379o85k277j43K523O31k008j64K054L81j130o04
844f47J278O46k04M18r09j330K082J621k169j989P50K097o72k337L73Q96m6p76
862i18n25k69Q10J119l66j900K46K718P70k602p26K193J459j409n78Q62Q1k70
880F95J310p08j921R5K739m61l327K3L045j72l019j29R52N97n7m34q34r63K204
899c65K470k372l008K121M079j140l871J145L538j95k288l27N50N97J352o12l059
916a385q22M517Q66n039j377L929J348l434j676K511M38j085J003k6j947M52L485
933A758K67m106j03N007K90m326P0L334j95k216R12J070k777J77L963q16n553
950c244L46N850j41n928q70M881P13l082r29J262P49N44L10j483j912L333L664
$$ y = [-818, -35, 666, -746, -2779, -1604, 775, 90, -2187, -2330, 193, 824, -1184, -1348, 706, 1087, -43, -647, 631, 1277, 1073, 1491, 582, -748, 1334, 2955, 786, -1203, -453, 1644, 972, -1365, -992, -96, -142, -918, -1443, -1712, -902, 217, -149, -2049, -1803, 915, 1685, -917, -1643, 550, 2009, 600, 22, 884, 965, 695, 2005, 1297, -624, -529, 2210, 1749, -1578, -1555, 1490, 1318, -1701, -1830, -878, -281, -338, -772, -1606, -2569, -365, 2105, -267, -3275, -1154, 2925, 1785, -2086, -941, 2597, 2402, 114, -213, 337, 934, 2286, 1674, -1385, -2207, 2310, 3176, -1863, -3240, 689, 2037, -1397, -3073, -562, -124, -1209, -206, -232, -2179, -1727, 1758, 2025, -2081, -2184, 2823, 3113, -1213, -1143, 2191, 1996, -220, 692, 1762, -1015, -838, 3125, 2309, -3244, -2898, 2952, 2811, -3117, -3987, 894, 1607, -1475, -2404, -1142, -393, 151, 461, -1022, -2934, 399, 4063]
967D063l277m535L125M819j110m471q9L126R27p96k202k053K528L469k631n179
983d286J933O229j784o813J113N822p59m333P65L003j359r89K815k03l886K173
999e59N015k733n715L638O344m112o909N665N133n597m180M918K938n815j194
1014c163N724r13n782J342N741k107n126K130M458k379l240L132K460l175r93
1029a891L760J19l378J242L245j700k687J850K297j577k080N29N04J4R38j076
1045A09l094K042L131k541m175L403M783l933m826M008M656l813k788L999R86
1060A947l280O97M169k756m430M815M531o173m351P474L986q321m352Q105L607
1075E668q019k732P107J029n711m3M445k082l903M219L297n215k175O163J609
$$ y = [4063, 786, -3749, -624, 4195, 3085, -1386, -1475, 1651, 2578, 1782, -420, -2473, 55, 3524, 893, -4286, -2353, 3876, 2092, -4721, -3608, 2214, 1455, -2878, -2113, 890, -469, -1458, 1357, 1154, -2732, -559, 4456, 1723, -3992, -354, 5990, 1878, -5031, 634, 5767, 170, -4010, 908, 3846, -1969, -3163, 2561, 1648, -4134, -2792, 2949, 842, -4284, -2154, 2304, -75, -3315, -183, 2277, -898, -1891, 1869, 1988, -1390, -148, 3097, 1397, -1290, 560, 2857, 1280, -800, -271, 233, 247, 1185, 109, -2985, -943, 2188, -353, -4528, -1125, 3658, -275, -5101, -1093, 3563, -250, -3038, 961, 1947, -1333, -636, 3533, 777, -3653, 1162, 5693, -480, -4831, 2643, 6629, -1692, -6044, 2061, 5668, -2351, -5083, 2024, 3053, -2658, -2701, 1744, -338, -4241, -22, 3275, -1940, -4115, 2048, 3657]
1090C657o371p89P011L53o181L49N182j222l023J904J057k369L7K429j364k579
1106a919J923J626l286j011L310M45l950M62L666r22l286K279L008k622k607L370
1122D86K473l432j292M069K41m426J720M307l143m492M637L182n875k683O299
1137B071J625o883o27O453r59n293J629M244k723k978L814J580m055o92M862L51
1153B419m755O53N291j523m734K144M385k819l366L550J579l775m50L639q38m455
1169c055K233L567l427k916L853J623m185q98M538O4m125R81L696j217l316K837
1185B53K665l098j478L539J93l188O83L449j894l340K614K642l408k326L640J353
1201B299m134m35L963j273l711K158L098k684k363L224K468m113j342M607O19
$$ y = [3657, -2714, -3503, 3508, 3861, -2320, -1971, 3211, 1989, -1034, 870, 1927, -442, -405, 2024, 660, -1919, 4, 1630, -1656, -2667, 643, 1088, -2862, -2400, 1266, 344, -2942, -663, 2345, -277, -2884, 486, 2959, -473, -1765, 2304, 2545, -1881, -161, 4146, 1003, -3489, 1148, 4330, -1545, -4228, 2071, 3696, -3187, -3814, 2639, 1680, -3613, -1984, 2260, -463, -3441, 373, 1953, -2102, -2794, 2068, 2419, -2336, -1683, 3608, 2085, -2649, -505, 3880, 1061, -2305, 1245, 2824, -951, -1401, 2238, 1400, -3055, -822, 2745, -682, -3598, 255, 1878, -2307, -3205, 1333, 1397, -2728, -1747, 1949, 732, -2584, 253, 2918, -180, -1658, 1881, 2074, -1114, -431, 3018, 1124, -2216, 398, 3040, -368, -2694, 946, 2299, -1835, -2270, 1693, 420, -3291, -1133, 1965, -719, -3082, 142, 2610, -1503, -2845, 1762, 2381]
1216B381m270P36M169j275l337J964K790l111j630L560M17m129O9M040q18m465
1232b909J924K953k117k461K187J892k937j037L449j5l154Q16L322j343k591K054
1248C3K509k319j828K853Q88k611J04K501j111k048J143K151k637j748K730Q10
1264A420l295k57L042k13l289J147K639j313k549K217K108k530q66K663J208k978
1280h46M0K750o22k153J435J817k467j353K677Q35l267Q2K607q58k919J563K144
1297A465j702k337J856J557k015p85K496K11k252P71K020n06k376J754K063k061
1313A59j344K462R77k206q41K279l49j952O21J655j322j362J049Q61j534n69J665
1330B49K7j907Q63J364r32r47Q43J512j378m22J376M41j405M45J354j64j750Q97
$$ y = [2381, -1889, -1153, 3016, 1741, -1596, 368, 3158, 47, -1583, 1977, 2394, -1735, -1666, 2374, 1556, -2909, -985, 1968, -149, -2610, -423, 1469, -1468, -2505, 944, 929, -2225, -1409, 1913, 570, -2021, 33, 2542, 223, -1605, 1248, 2136, -475, -371, 2130, 1019, -1029, 114, 2265, -372, -2120, 610, 1420, -1875, -2132, 910, 697, -2592, -1445, 1194, -119, -2668, -451, 1657, -873, -1739, 924, 2132, -846, -806, 1944, 1322, -831, 604, 2421, -46, -1399, 1278, 2113, -1154, -1072, 1535, 677, -2242, -679, 1465, -237, -2574, -718, 839, -1176, -1961, 535, 746, -1506, -735, 1285, 779, -1597, 157, 2220, 159, -1185, 1277, 2254, 48, -793, 1486, 1137, -815, -194, 1461, 139, -1223, -174, 687, -847, -1416, 249, 276, -1631, -768, 596, -336, -1283, -440, 1072, -306, -728, 648, 1089, -316, 129, 1483, 1319, -431, 466]
1348D66Q94j298n58J695j13j966J45J730o58j812O85J481j365j339J623J108j434
1365g16o95J319O76j374n7J755k52j419N64J481l41j125R37P29r30p45J019Lj025
1384a96l9O07m22o98K22O76m01p16M64mJ04k77K65k08p8O18M98p76j07J405j84
1405G53q34J44P48J22r14N54K54k22m92L00j27q45J93J018k87j389j74J139K32
1424A73j085k82O22N89l55m79N55M88j97K12M5m8j04N94O11j087k49O23L31k69
1444F88r03J36P12l77p68O1K95N89r74k54J64P2j84L11J94l18k17N59O39n26l14
1465d15O35M80K01q94j53J458j84j065n5M29M50p46k65L26m95K14r5O7p26j86
1485a019O33O56j264j06R88N88r80o90J358R47j111q15J190R82j045l57J043n0
$$ y = [466, 1360, 62, -496, 1199, 1086, -880, -735, 995, 337, -1475, -790, 691, -674, -2013, -390, 718, -716, -1411, -92, 584, -790, -847, 908, 656, -763, -199, 1282, 941, -184, 753, 1482, 552, -193, 826, 829, -196, -235, 372, -50, -748, -526, 150, -251, -967, -503, -507, -403, -680, -415, -623, -701, -83, 415, -361, -468, 937, 753, -81, 63, 811, 933, 19, 573, 827, 605, 113, 413, 286, -559, -366, 652, 365, -1024, -1198, -59, 173, -912, -1194, -572, 17, -338, -817, -262, 226, 29, 241, 286, 238, 134, 728, 1339, 252, 3, 626, 957, 688, -215, -79, 633, 256, -512, -451, -156, 433, -541, -795, -631, -559, -743, -432, -238, -556, -773, -214, 425, -101, -415, 220, 700, 901, 7, -146, 1312, 1128, 63, 8, 437, 887, 141, -124, 202, -293, -79, -174, -107, -833, -1019, -386, 270, -994, -1100, -112, 476, -504, -1194, 164, 1111, 0, -815, 375, 1357, 312, -45, 998, 948]
1503I48j269L42J399o49j144M48R21r11q95M39P58o27q79O90O66o49l45M30rn26
1523h62J23Q53N22j125M2R08L06l47o06O49K95k70m12NN25l01m74R0R0L19q04
1544d74J72R9m37j96N50N79q80o56R02Q63j115j47J059K79q12m5J162L21j064
1563A60j43R34p4j084K73R36p44o57L56P98p91j112R13N07j039l26Q75M06j152
1582i64q6J062J27p68K94N03n1l62M31N38k42l97L55K37P9m73M3M6l65PL58j97
1604A75m93J06N5k24k43K62J18l17J49K99q50Q69L49p49m1P52L87o97k5L90L96
1625F68r71O39O04l56n01m8N11k01r05N74N11m43j049N88O87q68n10R02K22q38
1645g84r8R36K58j020P08P50q85l17N59Q74n88j38L25q0m29J52K25n7l05L02j58
$$ y = [948, -321, 21, 1420, 771, -373, 75, 996, 85, -810, -371, 387, -240, -1119, -429, 237, -412, -757, -327, -336, -862, -739, 114, 636, -489, -447, 461, 767, 420, -186, 463, 758, 488, 76, 81, 606, 305, -169, -79, 11, 330, -474, -302, -203, -640, -836, -286, 293, -587, -1243, -341, 522, -593, -740, 319, 598, -214, -259, 903, 1224, 160, 17, 951, 877, -207, 66, 1002, 258, -399, -43, 755, -36, -1148, -235, 272, -767, -1093, -218, 188, -964, -1050, 12, 139, -629, -335, 168, 117, -245, 186, 724, 482, 85, 440, 677, 756, 283, 326, 372, 7, 14, 372, 175, -318, -212, -157, -381, -624, -362, -244, -561, -412, -113, -963, -94, 255, -494, -535, 217, 604, -93, -118, 272, 668, -303, 336, 940, 584, 83, 35, 546, 345, -560, 14, 525, 82, -967, -379, 308, -560, -1070, -168, 54, -784, -882, 54, 312, -708, 0, 750, -135, -452, 107, 981, 393, 255, 580, 500, 71, 223, 448, 391, 86, 388, 230]
1666B30n10n8J45K81n46k95N24j82l57J67M40J0m24N47K83o83M93N46k3p75P21
1687E34O35n55p39P87K81q63J43L43M9r10N4Q38o15j005N92R23j070m86O25Q67
1707D28r48j26Q08J46p01l8P55q9r7k07J017n75n2j2K96o7l62K96j10j95l78J96
1729a5m1j60J1R1n24OM48j86n0p1M74l04j06P09j40n34L36Q87l06q19O03N91o66
1752B34j21M41K77p04m13M34L51m85n96O44l11n03K87M78kj180R07J83l09k25
1772f13O49j80j46J88K30L01k47K8L08l8N8p0m8J5Lk71j43n3j5j04j44l05M28
1795a69q3l74j95N51j35l30O08L36n01j15M01N43m01o0K52M4j96L2N64j96m33
1816A43n2M46j07m54J25K46k93o11L45K32k2q20K25K70q7q6J08L31rk76J15L10
$$ y = [230, -280, -338, -193, 88, -458, -753, -229, -411, -768, -601, -161, -151, -575, -28, 255, -428, 65, 611, 588, -187, 534, 1169, 614, -125, 662, 943, 80, 223, 566, 615, -295, -241, 597, -18, -1023, -431, 492, -578, -1064, -439, 428, -520, -646, 162, 308, -393, -431, 324, 235, 138, -69, 948, 373, 321, 309, 605, 538, 176, 472, 362, 167, -211, -15, -56, -216, -205, -114, -638, -632, -184, -370, -420, -491, -17, -321, -427, 282, 142, -392, -56, 831, 525, -294, 309, 900, 234, 113, 554, 831, 127, -286, 148, 499, 14, -582, 62, -249, -752, -465, 13, 11, -1169, -262, -79, -388, -613, 36, -144, -290, -102, 128, 429, 182, 210, 518, 480, 538, 468, 420, 435, 438, 167, 24, -29, -44, -148, -292, -597, -169, -252, -626, -821, -270, -405, -735, -127, 209, -292, -407, -6, 537, 136, 76, 328, 372, 176, 208, 772, 576, 143, 91, 537, 430, -24, 101, 347, 54, -557, -212, 20, -2, -822, -597, -327, -414, -500, -392, -61, -70, -346, -231, 79]
1838G9J43o7l2L20P9n02K99N19n1n76j31M07m6n62Q1nJ03l48j83L11l4n19J58
1861e57N73k48l77L21O38l71l59R3O56k58l88P12K61k06m33M5N93n78j85L70R7
1882C99k10o41M34L86n98m84L03O01p37m62M55O45m24J7o5K47J30k23M00J76j79
1903A70k40P26n5m07n2M32J92m85l76M31j25j77l82L29R6o64Q4J29L73k57m39
1924f97K43M67n92P9Q35o6o86P3N28O49p16n3N89k18l25l96P54L11n54k61P27
1945F91l90n39m5M99j17p73K78K82r5n97K76O30l31m02K82O52l13j75PO06j24
1966C02k45M92n8p1k13K35J06l86J49j48K09m15l71L53J72l06Q2m79M54K3n07
1987f22L29K81k19J4n8P06m04n26P60J54k57j29M72J84n29n07Q63L06q66j60L81
$$ y = [79, 222, 155, 123, 443, 522, 20, 319, 838, 787, 211, 80, 487, 441, -121, -40, -45, 58, -290, -473, -162, -196, -715, -557, 16, -232, -609, -288, 350, -21, -380, -287, 369, 111, -277, 435, 696, 490, 57, 102, 695, 117, -68, 302, 399, 189, -452, -18, 368, -230, -714, -411, 190, -547, -1009, -554, 91, -333, -316, -381, -134, -4, -227, 173, 349, 170, -70, 656, 601, 194, 142, 574, 766, 281, -95, 336, 211, 34, -348, -19, 77, -587, -503, -374, -1, -258, -697, -454, 13, -579, -500, 335, 269, -417, -344, 184, 833, 117, 64, 653, 435, 110, -286, 468, 779, 225, -36, 691, 301, -238, -283, 216, 99, -674, -396, -114, -209, -806, -530, 100, -231, -633, -351, 301, -12, -187, -180, 426, 302, 57, 549, 491, 420, 207, 442, 548, 162, 311, 163, 372, -43, -414, -61, 111, -195, -113, -592, -138, -115, -622, -293, -12, -231, -217, -275, 431, 27, -499, 261, 415, 158, 29, 501, 685, 156, -351, 512, 818, -48, -208, 173]
2008A73M1n00j74N73M4q44J10O33k41m08J45K55N14p41J28M74j01k78J68Q55n23
2029C03k91N24J73n81q2J58M81n55K48q0m90j31L54k25k05p8%j19K74L33l40k28
2051e57K01L42k59k5O71j92k23M3N05J21n48l8P38k28n19K56M91n82r13J109j5
2072C78n00n32O72J2q43J37J046o21o70M33M82k47k44M13N34m77o02Q71O02o90
2092A54r7N72j25m31L2O35k44m57K74r0J3m13L46k48p36M66N03o92J17M50r2n65
2114f28K26P00k47n28M82O18o04j13O50j37o95L48P05r8o52k49J023l99q11L16
2134i3P03p31p41R10M53r26l45Q21Mp54M8R97k21p33N49M28n64%Q23J36n35j23
2156A06N52l56m67N72K09n07k18K12l9n62K63K83j01p87N40M86l68o14O18j1n77
$$ y = [173, 214, -286, -460, 113, 157, -687, -577, 56, -185, -593, -448, -193, 321, -420, -292, 182, 81, -197, -29, 826, 303, 12, 536, 709, 128, 46, 204, 685, 130, 378, 298, -192, -323, 31, -194, -399, -477, -477, -596, -322, 11, -329, -557, -356, -14, -273, -298, 373, 181, -42, 1, 506, 627, 79, 41, 779, 551, 32, 288, 779, 197, -716, 393, 378, -122, -654, 18, 30, -813, -676, 370, -251, -921, -488, -6, -253, -497, -84, 450, -27, -629, 242, 844, 154, 57, 629, 504, 73, 105, 740, 496, 39, 313, 223, 236, -177, 169, -79, -815, -349, 154, -538, -421, 29, -63, -628, -402, 298, 51, -477, 5, 623, 19, -94, 556, 419, -276, 72, 777, 679, 27, -222, 801, 402, -409, -93, 610, -121, -862, 48, 501, -425, -770, 51, 55, -699, -651, 346, 125, -608, -59, 369, -195, -195, 628, 764, 229, 106, 658, 302, -165, 407, 616, 109, -109, 103, 64, -498, -235, 48, -53, -840, -300, 186, -182, -796, -178, -189, -766]
2177g66M07P26j68q79O78O92n61l98P47K60q17j61J055j47r72J04Q71k46j031
2196f06P35L69q35k41K67O64j011J29N62K51q32M43M29j24p83N49P77q69j43N81
2216C12K73o82J58O88k46n30M29J07n39n11O21L22q11j66Q56m37n21L13N37n17
2236c44j70N02J09n08K8Q12m20j62J83P31l15o49O65J22l88m16R69l1r54K05O15
2257E84l70q46M45L83l22n76N35L84j012J5J029j66o07K36K70K75m79K24Q58m40
2277D20n60N60p9j38j7Q11o07m96K87N65r24j70N27K14q83q2P54m82m92M21N70
2298A99n27l23O42K15o58j28Q86qm96J69P22l67o43L30Q23p19m44P84J19q15J76
2319f3M65j28q29J75P91l64n46K82L05n73q8M12K37m73J64M24r5n92P22J99k79
$$ y = [-766, -359, 367, 199, -680, -2, 690, 129, -269, 478, 738, -79, -240, 815, 668, -304, -200, 671, 425, -606, 129, 498, -337, -578, -311, 353, -658, -529, 33, 284, -548, -105, 324, 200, -583, -34, 743, -126, -269, 312, 585, -97, 61, 749, 503, -27, 402, 509, -30, -541, 80, 402, -409, -575, 281, -156, -677, -364, 173, -344, -514, -12, 97, -411, -383, 429, 9, -153, 30, 761, 446, -203, 462, 584, 196, -220, 749, 718, -236, -31, 584, 214, -632, -187, 196, -126, -702, -167, 217, -795, -780, 249, 83, -524, -288, -18, 257, -222, 2, 860, 420, -140, 420, 341, 203, 186, 997, 390, -106, 181, 746, -178, -348, 179, 393, -490, -572, 182, -300, -792, -371, 199, -328, -651, -9, 206, -452, -580, 306, 298, -198, -29, 693, 326, -317, 13, 836, 117, -327, 457, 576, -239, -63, 402, 274, -555, -380, 411, 47, -499, -217, 88, -485, -573, -161, 76, -397, -233, 191, 96, -496, 226, 425, 146]
2340A46j14K85N8k41J1L73m01j72L37J05m86j08N37r2j102N37N37m47l62K53N15
2361A69o47k41Q67L19m51m85R27Op99J43O33J62q73K58Q43o19l71N26M4n43p3
2382b05M69m5m37j72N35j80l16m8L90j88k78L71J44l31K47K2j39M39J51j55l42
2403f8M26J45k67j95M30k39k18n1L70p4n57R2N02k99m12L85M07o76m67P08K56
2424A98o05l02P61J51l88k54Q42r3o23L30P14m64l13K99J86j32p27O88j08j70
2444a0l29J79L17k86j71J48N8J54m66J48j10j4R1R8K01QOj92N39Jl51K17O3J58
2468D57k79l5Q7J71l39l05O18n30j05L8M66Kn75Q0J77j93j72N17J27k28l72M90
2490I7N4k70l6K32J74k20P3J62k6Q9k57K31j84k08N49j32l47q4J00k5j29n4R8
$$ y = [146, 32, 317, 375, 134, 145, 518, 117, -55, 282, 387, -99, -207, 330, 238, -864, -327, 210, -237, -599, -346, 169, -478, -719, 148, 467, 16, -469, 458, 464, -335, -192, 441, 603, -270, -12, 831, 212, -159, 367, 411, -132, -205, 264, 219, -218, -390, 145, -35, -351, -399, -9, -197, -475, -104, 40, -291, -44, -22, -161, 278, 429, 274, -68, 358, 503, 236, 41, 471, 232, 14, -37, 333, 259, -298, -206, 296, -3, -415, -30, 377, -299, -766, -58, 198, -407, -709, 52, 203, -185, -439, 403, 310, -313, 17, 731, 267, -46, 253, 439, 307, -420, 268, 160, -10, -339, -160, 157, -129, -300, -152, -94, 60, -406, -258, -368, -382, -291, -193, 8, 16, 22, -170, 369, 370, 19, 236, 299, 457, 178, 143, 230, 401, 62, -243, 375, -155, -260, -222, 244, 246, -329, -249, -72, -265, -437, 80, 207, -21, -393, 97, 151, -119, -155, 77, 251, 31, 104, 266, 240, 329, 72, 303, 119, -89, 460, 328, -19, -103, -3, -28, -157, -211, -113]
2513a13M9k66o1p0M74k17r1q8L29J58R4k6J73j3n37O45o9kj76K29m23K32K8l80
2537a21J19o7q4k5J74n9j81r6P4M6k56K91J12n5l63L98J2N4J97r2n0K22J48j93
2561B05J10l5m7m7O6nl9j40j69J50j21J17k52l5R0l39K15K50l62l7L25k69L97
2584B8o0L0O6O3P6J25K73m31J21M2k47K78J18l39j03p9Qk09K72r1p7k12J11k69
2608e06l1J21L69k88j56O18J21m84J08M54j7k56K38J6k17O3L6n6j12J93j16L47
2630D45k9o44J44K63l42j88K89k7k82K18K98k92l40N33j57J22j95P3K49k08J33
2651F3Q0J98k12L38l27j11M13k33k59J42J14j46j36j32Q8j30j37L26J09j8m78
2672d48J68L69l56j08M49J18l69j28O61n3l67L47J81k46k25J72L67k36n42L17
$$ y = [-113, -64, -330, -391, -461, 13, -204, -295, -383, -54, 104, 198, 172, 345, 332, -205, 440, 371, 369, 193, 422, -1, 231, 259, -121, -2, -69, -153, -178, -4, -63, -244, -340, -266, -220, -476, -185, -73, -128, -491, -93, -81, -27, 170, 78, 28, 250, 398, 205, 315, 280, 233, 186, 252, 247, 208, 68, -101, 49, -72, 45, -207, -242, -152, -491, -276, -26, -388, -425, -100, -369, 28, -32, -2, 64, 127, 203, 328, 601, 170, 291, 333, 86, 364, 482, 143, 40, -39, -31, -240, 32, -59, -136, -348, -237, -506, -537, -416, -47, -335, -491, 127, 248, -236, -128, 326, 309, 53, 291, 307, 90, 153, 189, 133, 21, 214, 98, 445, 416, -228, -84, 179, -163, -351, -62, -89, -371, -153, 145, -147, -487, 46, -111, 11, -184, -111, 138, -70, 63, 143, 341, 129, 467, 140, 29, 442, 209, -50, 92, 206, 60, -76, -208, -120, -250, -387, -61, 48, 30, -448, -280, 89, -267, -375, 74, 192, -177, -305, 356, 303, -64, 283, 464, 218, -7, 165, 532, 296, -246, 71]
2692G1L12m00j78K40k4j05k09K40j35J9p9N2J15k53j00L47O7R7R2j70K26j81J92
2715B36Q4r2J05r2m20M18J60k72o1J76j45m33J0L54j59k44r2M43m32l9J01P50
2737C56m14k66K00M90l96k78O84n9k73k4M52j58j76L2L22j42n71K97J21l06j64
2758b73K78K88n27k27K08N3k63J57L55l99K36P6L06l94K02K03j41j7J80P0k1j56
2780A94p1l5K63j85Q4j99m14K27J57k78n0L67k0p1k46L13j72m54J97N97k19l99
2802d14N79L03l82k99O22J63m68J15J18M1l96L7N76m13k00j63J80k54k6J93N6
2823c2k08m1J56Qr0k96L91J89m4k34L47j65q1M13k39L59l51O0K35l06M6j67K15
2846A65N1j82k80K72J34j19k60k03K95J30n75K51M62j88m46K36O24m82p4K35L22
$$ y = [71, 383, -17, -195, 45, 21, -84, -293, -53, -188, -169, -248, -196, -81, -334, -434, -87, -20, 77, 169, -1, 225, 44, 236, 320, 228, 333, 241, -179, 239, 399, 127, 66, 242, 97, -336, -326, 28, -131, -375, -467, -24, -456, -495, -394, 356, -58, -324, -124, 366, -30, -308, 376, 317, 44, 20, 472, 314, 138, 170, 492, 350, -221, 76, 197, -109, -273, 5, 293, -234, -461, -253, -200, -463, -306, 49, -350, -114, -38, 268, -126, 76, 279, 138, 121, 301, 371, 350, 194, 123, 88, 351, 166, 250, 51, -363, -136, 21, -257, -307, 60, 40, -31, -277, 36, -136, -590, -393, 204, -15, -414, 165, 468, 86, -213, 409, 572, 104, 219, 337, 378, -18, 19, 595, 182, -18, -181, -1, -255, -281, -88, -32, -240, -281, -125, -117, -207, -503, -112, 77, 33, -201, 146, -19, -100, 313, 74, 433, 82, 142, 377, 71, 117, -50, 165, 216, 34, -246, 26, 160, 41, -219, -422, -127, 3, -572, -321, 141, -47, -493, -257, 367, -115, -189, 46, 368]
2867C68j95l20L73J1Ln9J74J04l21l09N08j40k47r8K41j01m13K82j91O7j58mN08
2890H3k76j2l5L98k88k77O62l4O8l92J30K91j52J12p5N3j9k90J50n6J08l61K59
2913D7j8M2j79k71L96k53k04J28M67k66k17K72K65j48m07N56J56k73j71L68L76
2934F66o02r8L72j79j18l91O75P3n43R0K83K5o03k15M80J11n87L12L65m01j25
2955d10K05K55J42j45l6K04k0Kj36M21m15j08M82j92j6O5m14L77k22m00J11K26
2977b4m4l52P7L91k03j67lK63k27J37K8L79m42j38L70L7N8k36K00J64q4p1K27
3000C40J93m08j79L32k80r4j45J61K4j36p7K63k27j35J84O4l5K82k48M11m14j14
3022b38L96K45m31Q6J04J76o9o0j23K41m04J52L7j17Q1j64P8m2k1r1O8j72J9P6
$$ y = [368, 173, -147, 226, 237, 240, 181, 355, 459, 138, -171, 337, 197, -50, -148, 93, -8, -421, -139, -330, -263, -421, -425, 83, -193, -205, -240, 158, -130, -407, 255, 221, 289, -103, 27, 318, 166, 278, 203, 256, 237, -53, 97, 41, 149, -212, 47, 29, 71, -108, -379, 17, -236, -440, -312, 155, -111, -328, -56, 209, 61, -346, 210, 366, 93, -78, 290, 666, 64, -34, 338, 159, 41, -350, 325, 398, -145, -55, 228, 253, -350, -565, -85, 26, -561, -249, 116, -285, -410, -205, 50, 192, 47, 11, 215, 195, 197, 61, 482, 67, -41, 441, 249, 233, 298, -116, 261, 39, -361, -250, -24, -68, -420, -343, 48, -155, -322, -325, -62, -289, -152, -124, 255, -187, -325, 45, 82, 140, -96, 104, 268, 184, 113, 340, 533, 125, -54, 278, -2, -96, -241, -80, -56, -192, -269, -6, -233, -368, -184, -120, -155, 127, -121, 290, -124, -238, 158, 403, -28, 58, 162, 338, 269, 209, 86, 327, -77, 75, 112, -5, 76, -88, -10, -52, -73, -164, -96, -268, -249, -173]
3046a73K63q4Q4K3l67L47j59JN05m19J82K3j08j6K3J15k35PJ41k25J60m9n2J6
3070Cj29J01k36J24k6j64L00k33O3M9R5K77m78J96K75J18j52k15L15nM3n3j24
3093A44J42j08p6J33r2p5j79R9J40j90l08J97J56k15j20K62k92K15J23K98j82
3114G2k96J64N04j33l89J93K12j30l85K51M01j07j98J98j9l69n6j9N3l3o7K03
3136E0k05j26J48L68n35J29L95l00J05Q9K3j10J83k78N21l01j21K69j65O8k40
3157c3J66j16K0o2K3r6p2J40k75P2k76K71P2j2Q1J69l94J18L31J05r7j34P4K68
3181C43m89nO33m27l29M47R2m19nL20k09j59K73J18l92j26J35J06Nk26K12N1m8
3204i9O1l5n2J27k45J0M25o6j12L93k44j05K52j01n2J56m2K1k23kk3m16K20L13
$$ y = [-173, 90, 6, 90, 113, -254, 93, -66, -65, 440, 21, 203, 226, 118, 102, 125, 240, 5, 12, 153, -72, 88, 39, -13, 3, -126, -25, -261, -137, -163, -327, -27, -260, -197, -148, -53, 224, -254, -58, 217, 335, 183, -32, 283, 278, 321, 268, 144, 286, 178, 102, 235, 143, 68, -111, -12, 128, -62, -370, -173, -17, -232, -352, -90, -382, -167, -44, 254, 72, -224, -60, 444, 311, -78, 115, 327, 197, -188, 63, 464, 357, 159, 357, 338, -31, -87, -106, -53, -86, -153, 50, -155, -281, -133, 235, -300, -171, 224, -76, 29, 118, 141, 31, 214, -64, 457, 156, 35, 304, 139, 207, -33, 133, 17, 37, -25, -2, -98, -170, -30, -305, -233, -509, -238, -166, -178, -97, 72, -322, -204, 127, 232, 135, 1, 75, 343, -146, -151, 482, 55, -274, 173, 265, -154, -159, 161, -48, -207, 66, 184, -208, -334, -199, -93, -88, -314, -102, -51, -99, -38, -73, -125, 2, -243, -233, 192, 126, 14, 407, 163, 58, 310, 209, 157, 313, 271, 292, 69, 67, 44, -372, -152, 161]
3228A61k29j77K09L3J02n14M02j23j78K98K88j70r4Q0M38k25l08K02L64k50m80
3249a71M06J40k83k2l8J57m13J08J19l4k18k1L22l00JO6K40j42j67QM92m12J33
3272b9K05k16J3K9M02k60r9L34K4l53m4R7k17J5M07k79l67j57M25nj17Q4p0m2
3296b20J06J62j37L4k31M46q2k99J84J63J46k09l01N66j05j97K58j46l97M66k14
3317gL3J7k87L47j94j35n7K30k19J48j19M74l66q5J66J22K7p9K60j51l32N03J9
3340C15k33j1J35j5m0q3L5j53j85M45J09o14j1L14k50j69J85L27o4j25K25Pk08
3363f4j26L60J01j69p9K90Km50L55N2j15j21n7M63m66l27L83P7k76N9J35k21j27
3386c21P4L58M9l98J86K37j63l32L44P2M7j42j41L49l71J01K08J43k89J0M7L5
$$ y = [161, -68, -245, -36, -3, 99, -415, -13, -136, -314, -16, 272, 102, 8, 88, 526, 301, -7, 195, 559, 309, -171, 235, 375, 92, 70, 32, 189, -224, -116, 3, -31, -249, -270, 52, -248, -247, -181, 59, -83, -250, -242, 250, -162, -29, 176, -40, -27, 2, 404, 144, 45, 379, 403, 50, 6, 103, -114, -99, 308, 29, -338, -495, -70, -75, -192, -108, -178, -220, -114, 48, -89, -55, -286, 160, 78, -221, -37, 126, 272, 63, -238, 328, 223, 26, 284, 138, -259, 207, -7, 26, 43, -244, 103, -91, -226, -283, -53, -272, -124, -243, 231, -135, -220, -54, 68, 95, 16, 276, 125, -207, 296, 315, 82, 71, 206, 191, 151, 68, 103, -50, -235, 210, 319, -295, -306, 8, -242, -411, -226, 101, 37, -88, 137, 144, -64, -190, 170, 271, 102, 23, 313, 315, -135, 220, 272, 157, 36, -21, 442, -24, -351, 32, 109, -167, -108, 27, -194, -321, -247, 111, 160, -238, -52, 185, 22, -310, 34, 106, 153, 11, -130, 219, -152, -51, 157, 300, 11, 21, 68, 103]
3408A03j74N8L4r1Lk07jJ50o4R6k11L96l08P1J9L06M3l39J49J61L73m96l48Q02
3432E25k77k14K74J7%l21N7L0j4k02J69J45m90JL10J4r7l75M40J26k23k7M08r
3456B67l37j98M12k87J34J30J25Pk38L21m9o5k79J14J83rp5q4j61J41o4J19j61
3479e4j27k9L6J1n1M1n1J06R7O3j15J72J17m8m3J48L7j27k94M49l11j94L40j55
3503A8P9l88K16k7k89J2K33J10J3l06K25O4O6j02L53k75m9j6J74M7m06J52L8M19
3527C61j88j8r2J94j06k01o4M72l95p5j12K18l42j0L18k14J60j22J06O4P0M7k0
3550E1q3K47J3j53K76l18P3M08l57j21J93J7p1j05m7RJ82j10r6J6l37K09k17K22
3574i9J34j01M4j33j29J26L08o5J11k54R4L8O9j27K19j14Q3K8j85L40k19k06L4
$$ y = [103, -71, -13, 21, -70, -67, -274, -275, -125, -189, -93, -304, 92, -216, -145, -126, 180, 223, -116, 33, 194, 567, 71, -277, 525, 248, 34, 308, 325, 325, 4, 61, 91, 77, -125, 44, 189, -301, -300, 10, 24, -73, -448, -8, 118, -105, -132, 276, 267, -70, -268, 144, -143, -9, 121, 246, 253, 15, 336, 287, 222, -57, 57, 240, 231, 156, 72, -89, 52, -12, 107, -54, -181, -210, -174, -163, -214, -173, -224, -118, -21, 42, -73, 99, 216, 168, 125, 273, 310, 183, -111, 338, 27, -167, 173, 18, 97, -291, -75, -102, -391, -379, -146, -36, -23, -329, -104, -40, 26, -76, 277, 2, -47, -63, 111, 158, -248, -96, -58, 361, 173, 155, 63, 257, 151, -50, -114, 358, -37, -112, -224, -6, -348, -358, -40, -254, -94, -216, -110, -46, 24, 71, 51, -32, 215, 228, 75, 351, 33, 106, 514, 157, 36, 229, 246, 175, 70, 23, 32, 214, 104, 8, 24, -313, -104, -321, -99, 35, -66, -22, -155, -284, -158, 150, 85, 196, -58, 36, 74, 143, 16, 235, 121, 204, 232, 47, 387, 168, -38, -4]
3597dJ08jj26L7oj28k2p6M4j8j40M62j62j6J26j55J32k16J94k1J49m7L45k41j50
3622F8J4l9j88O0j80K92J4n8N0k60K09j48N6J19j28k0J01J48J25m32K12M0K5q9
3646iK6K36m01M08j51O7O1j05l40K80J34k04j67L69j55j55J54k48J99j05L7m2
3668a11J09j53O3M05l80k57K57J71k47K81N9K1j70R7j52J73Jj87l5j0m9L66j91
3691F1o2l3j6p1J99l40K12l3k43N4J98J30j59N3p4J50k2K55m24O5J75K2R3JL6
3716B27o4j84M4N9l09L65k69n1j23M25l66k1J06n7P4j9K89k27Jj89K45M9J01k78
3740a72J34J68n8J00q3P9K10n13L08n5j94K58k50q2n0P0J61j3p3j28j5J05l10
3763d03K65K88l75J04K91p3l81L76l21K14J22O0K0k14J06M4K05k97k91N14j50
$$ y = [-4, 104, 103, -23, 14, 8, -120, -142, -218, -174, -192, -332, 130, -32, -48, 78, -77, 55, -161, 33, 12, 161, 114, 459, 218, 68, 82, 43, -145, -85, -265, 27, 41, -17, 33, -227, -18, -166, -110, 9, -119, -139, -38, 110, 235, -197, 15, 55, 80, -9, 17, 253, -148, 260, 109, 176, 237, 132, -208, 72, 206, 2, -165, 204, 49, -106, 48, -200, -1, -106, -69, -111, -2, -155, -92, 313, -67, -324, -67, 104, -143, 138, 197, 218, 48, 145, -7, 166, 167, -20, -55, -65, -114, 252, 61, -1, -34, -50, -121, 78, -262, -50, -83, -326, -272, -74, 56, -103, -50, -124, 26, 4, 259, -165, -100, 75, 97, 190, 191, 227, 163, -21, 23, 82, -227, 138, -131, -182, -305, 120, -246, -267, -161, -218, -144, -163, 126, -101, -100, -289, -44, 5, 106, -172, -38, 130, 72, 172, 89, 168, 378, -135, 173, 118, -76, 182, -68, -150, -200, -130, 31, 18, -55, -183, -198, -93, -403, -138, 150, -225, -121, 170, 97, -284, 92, -229, -15, 107, 167, 187, -27, 79, 123, 328, 31, -260, 254, 104]
3784A04l4l4J0j4j02J72k90k60N21j64j03P7J48k42J77j31L54L0l31k3J57J25
3806A47l2J49j87P5k02P0P0l2J89pj96q1j9J3K29l42J85r0l5j1l3l5J09J89n4
3831F9J07j70J60pKq0p1J88q0j15K67k02M4l35L70j90j41L41j54j59j4K87l15
3854a98K47P5l24K2m6K06l3nkR0R7j76k3K11k09J66J14j24J37k38N0m3o2mJ16
3879D4j11L7J3L3j8L9j42j99R2M9J10j69J38J95N0j76m1J30J77k10K5Q8j92o4
3903a02o6J62mpN8j84K04k12K75m04J02O3M1j64LJ59m0nm1J54q4k37K27L07N3
3928B58l0N4o3J2p0R9r1k01m1K28n0l49M5L6J25j07J51l0n6k8n7J0L36l15Q4J47
3954I7j82j64K23J70Q6j91R3m2j81K57j48K31j85J49p0P0q5j35J75k80J31j19
$$ y = [104, 70, 36, 46, 32, -70, 102, -188, -448, 73, -91, -194, -117, 31, -211, -34, -165, 189, 219, -112, -135, 22, 147, 115, 264, 77, 152, -50, 20, 90, 58, 247, 240, 44, -37, -56, -43, 186, -156, 29, -61, -96, -107, -140, -175, -66, 123, 69, 176, 6, 166, 159, 161, 81, 10, 198, 118, 3, 270, 68, 112, -223, 147, -43, -184, 157, 3, -156, -170, 117, -198, 49, 124, -200, -178, -224, -18, -51, -56, -58, 32, 129, -47, -70, 141, -68, 98, 212, 88, 225, -13, 37, -6, -68, -72, 44, -67, -30, -17, 16, -2, 37, -105, -304, -212, -163, -53, -222, -84, 111, 161, -15, -56, 74, 251, 41, 66, 154, -38, -102, -168, -6, -10, -17, 41, -143, 61, -151, 124, -280, -178, -115, -74, -238, -235, -76, -116, -121, -162, -8, -92, -329, -102, 205, 258, 228, 282, 219, 231, 161, 260, 169, -32, -73, 155, 105, -244, -199, -163, -38, -145, 6, -24, -80, -108, -165, -155, 181, -134, -50, 97, -85, -249, -26, 144, 230, 39, 132, 90, -91, 166, 18, 249, 64, 213, 143, 213, 128, -7, 168, -112, 19, -100]
3976a00l1L3kq8o8J2L75l55P8K58j39m1M07j83j66l5o0L40j92J29N8jn7j86L71
4001C57n5k07k95J80m8p6L3o5l2o5J68l5Q7q8J49j87R7k3K54J68j05m34J33J84
4025I5K10k39J55j56j61K30O2k40NK74k31j3P7k25J25r4k00J54k83M58O1J1k29
4048a54J23L6o1J97j59J37N6j48N5J4N2J54mq3k48L2L7l3k04J70J47l8qj42J5
4073e7J10j83K60k75Q1j51L56p8J12J15k77m9L18j4L5n06J1P6L57k67M6J69j67
4096B2KJ89k58j14Q4O3k73Q5J54M4k34J70q9q4R8M99k81l0J60j01k94K22p3L78
4120C39l02P1Q0k41R5KM1k95J64j21K69j94L29j71M1M2r3l17Q1L46j13R3K12l67
4144iJ44o6j19J98k15J16K56j97J35j81RJ47mk36j0m7K20Q6k97j6m5j37M33k82
$$ y = [-100, -131, -98, -100, -188, -256, -244, 131, -224, -146, 112, -27, -68, 339, 156, -10, -45, -105, 235, 43, 172, 230, 229, 172, -14, 357, 302, 95, -200, -20, -68, -144, -111, -176, -208, -273, -105, -140, -53, -141, 8, -179, -82, -105, 149, 317, 212, -222, -89, 95, 305, 66, 221, 65, -96, 134, 196, -44, -39, 235, 4, -9, 68, -157, -32, -126, -326, -172, -455, 3, 64, 75, -154, -31, 5, -56, 141, -18, 119, 175, 27, 82, 96, 148, 302, 298, 215, -33, -1, 36, 3, -201, -31, 116, 78, 70, -72, -57, 53, -130, 130, -145, -64, -215, 141, 63, 175, 290, 13, -36, 282, 268, 303, -203, -192, -116, 241, -26, 20, 189, 22, 24, 213, -45, -159, -75, -12, -285, -200, -46, -2, -236, -66, -155, -239, -141, 358, 77, 47, 207, 106, -188, 34, -39, 339, 37, 108, 188, -53, 42, 44, 85, -210, -46, -167, 102, -92, 237, 66, 107, 149, 56, -261, -180, 166, 53, 146, 358, -9, 135, 69, -50, 148, -67, 49, 305, 108, 243, 62, 71, 218, 214, -22, -32, -79, 141, 227, -70, -86, -131, -268, 165, -117]
4168a17l2K01q5j61M46j20j92o0M1J24k15J56R8o8k56M50j59k36J97j81K16kr5
4191e0Q0p9P1l3ln3J16k47J9j51K50j27K46J22R0m26L85p2p2N4J97k17J09l06
4215i7R0J01m9j69J52P7k27K87l24J46j13J82oj35N5j95K84l77L12k66J78J63
4237F9j65K68m14K84J69l4o9M9K61k73J25k17J58j13p0q5M0M4r8K29k96k35N21
4260A48j12r3L6k4n1K35j43m3J67k1Jk05J62o3M9K4J38l6k34k29L78R8k94pK17
4285I8j49o9j54L52l00K79M6j46n9P1P5J0j48K53L0k91J53J7J05j70n7n3J09k69
4309b67K46k09K77m9PJ55M7l69R7kk36J99J3mk75K30j00oK73J0kJ29o7j12J45
4334A30j25J87j55o1J80j69%p0K20k69L30l55J59J18k3k31J6J98k84J27j46L27
$$ y = [-117, -149, 52, -33, -194, 252, 132, -60, -120, -79, 45, -170, -14, 84, 16, -240, 210, 51, -185, 12, -169, 47, 45, -50, 30, -49, 22, -11, -14, -67, 49, -198, -179, -330, -80, -207, 39, 161, 251, -175, 210, 138, 66, 120, 317, 100, 209, -97, -7, 94, 45, -124, 28, 105, -122, 165, -159, -13, -126, 56, 50, -85, -30, -225, 59, -318, -6, -272, -94, 69, -96, 172, -242, 42, 211, 177, 108, 157, 418, 145, 270, 53, 211, 98, 28, -57, -17, 27, -71, 158, -138, -373, 148, 36, -57, -21, -45, -96, 139, -4, -47, 120, 99, 100, -105, 57, -6, 43, 67, 205, 169, -65, -294, 84, 182, -112, -119, 98, -51, -120, -274, 78, -222, 57, 103, -43, -102, -31, 44, 54, -94, 159, 189, -102, 51, 68, 173, 3, -54, -107, 2, -267, -21, -230, 47, -2, 5, 160, 207, -162, -65, -67, -303, -104, -91, -95, -370, -140, -240, -246, 27, 37, 35, 164, 97, -15, 130, 5, 192, 37, -24, 156, -13, -13, -83, 137, -132, 198, -157, 2, 120, 97, -134, -118, 80, -204, -77, -223, 104]
4356A04r9n6M9K03k58J93p2k25J53m4J57J85n9j47J26l7j81M3J35k10M2J45k33
4379h6m2J36qp9k78K85K45k92O7j68Q1M4lp0K57n8k72K95J42j15J48k28j27J04
4403b2q2O2l8K94l42O2J32J43m44L9K10L48n01K10m4L5j73kJ66L7L1j30J97l71
4427a83J97o0J27mj19L84j97j81O7r9O5o1j60K86k67J31j76K85l8ql69M71k19
4450a28n0K19J69p9j1J0m4j28K21K5q7P1l16Q8M12k40k58L11R7m20n2J49p8M8
4474g1O0l10L60k29m1J28nq4J95K26l67K15n6J61k51L62l08MJ33r6J2L1r0Q8O3
4499A30J35j93O5m33L48p2J46n3j82J24j56J60k19M86m07R5o8m2J74NJ09l7k32
4522a17oK24J69l7l62J77j36J89l32L68J11k37m6J38r4j67J85j0m2j61K00J84
$$ y = [104, 5, -51, -2, 201, -57, 136, 64, -161, -8, -52, 105, 290, 231, 84, 210, 173, -8, 35, 170, -40, 2, 147, -86, -128, 8, 0, -79, -357, -72, 173, -119, -52, -220, -139, -95, -98, -168, 89, 31, -241, 54, 196, 81, 229, 1, -126, -22, -104, -42, -80, 214, -128, -66, 66, 209, -235, -196, 14, 362, -139, 71, 27, 62, -111, -113, 53, 90, 121, -9, 188, -183, 14, -46, 81, 77, -42, 342, 145, -36, 31, -68, -3, -64, -224, 62, -205, -74, -250, 35, -3, -11, -380, 91, -128, -178, 41, 210, 131, 120, 130, 86, -42, 179, 204, 117, 188, -128, -40, 372, 132, -126, 185, 282, -138, -190, -41, -119, -71, -11, -321, 39, -190, -231, -103, -108, -192, 3, 229, -138, 77, 21, 182, -69, 293, -15, -11, 122, 26, 38, 69, -21, 67, 130, 265, 72, 137, -296, 52, -20, 126, 73, -109, 15, -141, 19, -200, 286, -121, -26, -94, -136, 38, 43, 152, 115, -117, -123, 101, 270, 233, -129, 48, -88, 101, -231, 137, 248, 11, -35, 103, 9, -158, 27, 17, -25, -186, 14, 198]
4544A98j38Mn92O31j28j34K26O2M0p4O8Or3m4q2q5N8J70k65R9o0P9o3j28N2J94
4570Aj42O9J9j20J63l6L14k15J93k90Q1K38r6j40J01j41K23j08j41P5M0r8K59
4593B49l42J18ON6j03k20K37k1l4j93L51rj32o4Q7j95K97R7m05J68J00k4j29J11
4617FJ1K31j49j11J86l02pK27j56l6J57p6k37J55n7Q4m1P3LnQ3J78j24k86J36
4642e7K43j9l40J16K86r8J10k32ML7J59Lk09j8R1j18R6k9Q0J8k07o1J44j0k08
4667b19j5K31j16K03j42J35n2J06k7j65N4n8K36J35j86k44L17q3k8m3%P2k4k23
4691a36j1J07M0k35K41Q0l20L7K78j80J92K2l07J68p7J6Q8l48M75j37l11L48J1
4714D1J15j37J0m8l1J12k88K84k49J14R9om1k06O7J96K7j83J48k4k9r6K75O4k43
$$ y = [198, 60, 64, -528, 103, -25, -159, 67, 129, 169, 95, 163, 169, 76, 32, -50, -135, -77, 93, -172, -73, -133, -54, -117, -245, -193, 1, -141, -72, -53, -173, -10, -46, 268, 53, 246, -44, 37, 275, 179, 39, 140, -1, 222, 114, -27, 48, 88, -10, 249, -93, 25, 31, 87, -16, -236, 1, -20, -54, -247, 104, 95, -37, -101, -14, -209, 88, 185, -220, -52, 48, 24, -105, 6, 17, 248, 99, -12, 174, -128, -135, 92, -64, -100, 57, -19, -256, -101, -158, -74, -115, -42, -39, -44, 39, 217, 93, -193, -57, 186, 167, -173, -57, 229, 131, 241, 9, 13, 50, 209, 212, 3, -15, 76, -42, 54, 25, 105, 123, -84, -145, -1, -11, -219, -234, -3, -119, 84, -58, 77, 25, 131, 104, -61, -7, -65, 171, 306, 120, -124, 193, 110, 82, 39, 39, 111, 87, -136, -147, -40, 0, -235, 6, 86, -234, -197, 81, -99, 93, 115, -192, -24, -101, -85, 3, -345, 130, -7, -318, 30, 41, 156, 19, 29, -19, -50, 62, -226, 58, -191, -77, 22, 16, -25, -231, -164, 32, 59, -124, 24, 0, -29, -125, 150, 214, -29]
4739b9J40J15q2j40L3l3k53J65K15j93L41l02J05o3J2j10R1p0P8k3o6N6J2L8R3
4764A30k23J73j90K00j23Q9j36J74jj9j13M2Jq6o%J42j01O0O3n4o8J62o9j0J1
4790D8P5j97J24j30L6jJ77j14J19j24j95J03J34l0n5J38m1j85J58j75L96k79j04
4813a22J83k52J74K26j67k36J04J45o8k0J39j5l37K90r5R8k00J31K1O3M7o6J9
4836F2k6J01J5k24J06k26K22n1N3j9j31O6J19J41m76K07k1J84r8m6L20l44J13
4859D7N3p2r2O1kR4k7nN2j25K24r8j95J15J06k18l8K59j52j6j64K64j50O2j04
4884a21L56m95K84J17o5j94Q0J2L8k11K57j53R2r0n3Q6nNJ49m5o7lr3N3m0O9J25
4911H8l37M9l4o9K80o3J38j49p3J70l6K63k07m2L4k4J07j49J04k13K51n4R8k52
$$ y = [-29, 111, 226, 144, 4, 37, 4, -249, -84, 131, -62, 279, -23, 82, 19, 31, -79, 12, -58, 20, -3, -69, -13, -1, 37, 130, -93, 80, -110, 90, -33, 56, -80, 94, 93, 74, -39, 3, 4, -82, -88, -88, 54, -47, 13, 76, 22, -46, 116, 47, 37, 48, 123, -74, 50, -80, -44, -45, 132, 18, 137, 13, -182, -79, 55, 25, -30, 108, 67, -118, 40, -135, 261, -18, -122, 61, -191, -17, 209, 42, -194, -90, 55, -13, -33, 106, 91, -246, 44, -51, 47, -153, -22, -1, 62, 109, 43, 62, 36, 137, 152, -72, 34, -192, 30, -21, 32, 13, -118, -52, 67, 208, -268, -61, -82, 102, 4, -42, 278, -66, 47, 100, 28, -64, -3, -5, 89, 62, 57, 109, -16, 208, 110, -85, 30, 136, -82, -120, 139, -13, -29, -193, 71, -79, -17, -121, 235, -260, 24, 141, 76, -118, -38, -26, 12, -199, 58, -95, -3, -93, -146, -60, -65, -60, 89, 44, -23, -26, -119, -66, -106, -37, 88, -249, -200, -234, -303, -23, -86, 52, -97, -170, 0, -36, 227, 20, -22, 12, -12, 95, -54, 50, -163, 88, 34, 132, -120]
4935a20K56q4jl5J86o0k30PJ63k37R0P3pp4N30m39j21Q7l7K6O0k3j17MJ91n2m3
4962gj95K94K3j30L0o6J8j45J21j85L03P0k55j38K35n3Q5r5R3q1J13j30O5Q9K7
4987H6k0p0j68J28j5O9j0j77J14K7J57k29K65m9j27r6q4J97p1J04j20l7k1K44
5011I7k25J21J17j60J3R7J42j39Jn6j5K3M9j21q4l0K66P0r8N8j66Q5j28J40j37
5036h0N7R0l6m49M12j5q3L3N5o4k47M16j1K1r8r4K46K2O6l39K11J21l60J71L1
5061G6l5j45o3O4N2K4J62l25K00n4K05j88j77L2K43j16n9K25l1Qr4J47l35L41
5085A57k79K59l21K27l82J15L75l32J65j07k3k5n8L86j51j40o4J41K0K38k16J18
5107A03j94K34k51J95o6n2J73j87L08l54K06j64J95k29J40N2j14j41k6j6L52k05
$$ y = [-120, 136, 52, 51, 16, 202, 142, -88, -81, 82, -155, -65, 8, 1, -73, 457, 18, -103, -16, -53, -27, 33, 10, -107, -103, 88, 36, -7, -202, 92, 115, -15, 15, -51, -33, -178, -57, -242, 61, 131, -124, -262, -27, -80, 5, -90, 3, -78, 35, -95, -30, 59, 86, 66, -4, -172, -44, -59, 10, 0, -177, -63, -36, 121, -108, 157, 108, -19, -115, -199, -2, -73, 31, -89, -126, -147, 97, -128, -7, 110, -50, -37, 60, 202, 63, 64, 8, -7, 16, 65, -56, -140, -170, 96, 166, 68, 126, -40, 45, -83, 57, -80, -23, 67, 31, -418, -6, -21, -104, -71, -16, -80, -327, 89, 78, 99, 1, -93, 153, 175, 241, -98, 113, 234, -126, 45, 76, 41, -104, -167, -103, -51, -27, 135, -190, 10, -44, 161, -27, -204, -172, 71, -45, -104, 121, 90, 98, 4, 151, -184, 157, -122, 137, -184, 43, -339, -224, 151, -181, -16, -123, -146, -171, -229, 157, 6, -134, -198, -57, -37, 201, -15, 103, -91, 143, -108, 87, 21, -31, 142, -45, 263, -91, 115, -49, 146, -83, 57, 109, -5, -146, -172, -188, 164, -41]
5129d1m9Om5j48K99K30l59Mn9K87j22n1J84K74l49J57q0R3j01L5n0LJ9j10K7o3
5155ik18P6J20j11R7r3J11n5O1j25k14M01k21J15P1J8R7l6j48K46k21M2nk7L4
5180Fo9K23L4k05n3k9J19L2k33K1L7J3J26j77K6J49k7J61j23M7R7k47R0L8p2Q2
5206F6K5o7k62M82k06j20O0J15k67O9J46j83k6J31k11J45K25l48K60j09J12j67
5228a30J60j91N4j73M33rp4jJ8n6p7K19k71J72M2k65J99j56J51Q2o8mj56J11k18
5253b08K1J37L1k42L72j16n1J05J8n9N4r5J03j7m6K36l16m7M08j36l49K76M3l34
5277b12K86n7J42j10J22l71o4L65j52K25m32J88m3J50Oj12R2J7n2j50J4R2J27
5300G1j09K80o1m73M33l4k47K53j54j30L31k63J97P8j62k51N1J89J11j37K05k06
$$ y = [-41, -90, -84, -129, -277, 22, 252, -107, -103, -162, 125, 3, -48, 136, 410, 61, 218, 138, 231, 130, 165, 115, 118, 137, 27, 54, -9, -227, -151, -31, -142, -45, -138, -27, -82, -21, -146, -360, 41, -180, -65, 6, 24, 121, 85, -63, 183, -38, 4, -1, -28, 6, -63, 160, 194, -11, -64, -93, 26, 58, -175, -154, -117, -104, 22, -155, -129, 20, -7, 154, 31, 78, 175, -72, 18, 56, -16, 66, 91, 24, -238, 244, 38, -82, -22, 93, -174, -105, 41, -142, -168, -37, -248, -103, 122, -226, 34, -75, 37, -130, 30, -161, -107, -280, 153, 144, 70, 69, 87, 31, -46, 173, -98, 74, 116, -149, 50, -106, 45, 127, 59, 55, -101, 10, -208, -187, -50, -19, -261, 111, -5, -56, 49, 67, 8, 62, -33, 70, 53, 7, 243, -73, -120, 288, 152, -197, 79, 122, -212, 74, 17, 159, 49, 171, -200, -264, 101, -51, 174, -258, -70, -113, 37, 43, -69, 23, 40, -12, -162, -148, -56, 71, -38, 242, 181, -292, 141, 107, -140, 113, -41, -171, 160, -103, 94, 172, 10, -241, -190, -1, 110, -27, 178, -28]
5322b8k7J81j55J04Q5j62rJ02k36N7m8R3o4J03k17K42n0l7K41p7n9j69j69K58
5346d1N6l17K92j36J07l4mm7L31l65J28M8J44r2j76L7o4K22p4j38J43l4r8M84
5370C72m24J80p7l00Q8N5j3J0K73l29L07k63J9K07j10j00j14M25l20K28N6m8n5
5393F7j04op4K17J1L57l09j62j12J10K16m07J29j30J15J95k77L34m18J40J09K04
5415B05j0k43R0O4k65KL9R6j3n8L25K9k50J60j60K15n5k63J20k24J0J32r4P9L1
5440c8k7K01K4k97J76M6n4j15K9j14M02n46L39r9R0J05j49J03m0k63K53J30m2
5463A14J06l64J90k58R4K23l7n6j95J06J38r3M3P6p9p1J22j62K86l1o8m5k04L3
5487a32L52QJ29j1m36J12K5k5K4k44J98M1l03oJ58J01j10r7L42j82L1K64j95k70
$$ y = [-28, -55, 126, -29, 75, 160, -2, -11, 91, -145, -88, -136, -43, -107, -4, -221, 21, -29, -66, 175, 98, 39, -130, -299, -41, 15, -302, -10, -146, -39, -73, -77, -124, 207, -158, -30, 18, 162, 70, -106, -69, -133, 89, 15, -123, 20, -14, -112, 372, -52, 128, 51, -249, -161, -106, -119, -109, 164, -165, 142, -121, -102, 105, -5, -105, -219, 206, -114, 114, 170, 122, 67, -37, -43, -117, 100, 111, 468, 159, -3, -115, -5, 211, -196, -67, -197, -82, 113, -164, 170, -248, -108, 1, 205, 195, -48, 42, 106, -159, -157, -118, -22, -35, -93, 232, 261, 11, 171, 11, 226, 171, -92, 28, -196, -186, -54, -148, -69, -38, -65, 136, 160, -137, 39, 85, 31, -84, -55, -169, 233, -313, 26, -73, 17, 122, -27, 76, 36, -227, 26, 156, 114, 220, -144, 46, -212, -118, 105, 68, 12, -183, -77, 61, -32, 11, 87, 8, -63, 59, -103, 183, 152, 84, 39, -165, -132, 220, 228, 357, 346, -90, 22, 47, 22, 46, -198, 0, 41, -262, -268, -110, -9, -119, -216, 126, -56, -25, 239, 44, -226]
5511b26L7K82j12j98M07q1k46O8M3L34l07L62l50K80l09o7K43k27J66j77o2J33
5533gk50J72N4k68M76p2k71L52k36K2Q6j16K85m62K66p8M9Q7K77l08J50k15O1
5556E4r5P6l4J73j11p6K02j15O2j35J32j90J4R5M8M4p5j88k4K36k0J4O4r2k1Q
5582D6q9J57j37J12k59K15J12j89K34m6k48rJK06l6k36K7J63P2k52L31m6R2Jk23
5607aJ86k33N7j06K67k06Q2K16p0k52j57J28m4K22l02R8J2P6L77n35K68m3l38
5630b98K04j03K77j33K42k29j90N64m63O2K13j09J56j07jP0j49O8l9j2l55K36
5652i6L02j49J63k72l9k35K44L8lJ29k1j68j81K70j45R9O1j28J61J45k14J27O8
5675A56p6k02K96M8l32Q7Q2R1q8J71j90k74K4o1K50j33j9J97J03l3k03P8LJ74
$$ y = [-226, -189, 93, -19, -217, 190, 109, -137, -69, -26, 308, 1, 363, 13, 293, -16, -83, 160, -67, 99, -78, -140, -7, -257, -85, -31, -299, 177, 105, -166, 186, -50, -28, 58, -58, 227, -235, 31, -47, 2, 89, 366, 58, 208, -7, 54, -41, 35, 1, 174, 63, -13, 189, 74, 136, 1, 133, -57, -43, 52, 100, 144, 69, -119, -143, 93, 73, 87, 151, 59, 38, 46, -43, 114, -23, 89, -170, 45, 157, -32, 202, 156, -92, -101, -100, 106, 70, -166, -139, 24, 96, -156, 175, 129, 221, 222, -1, 185, -48, 9, -97, 170, -36, 46, 262, 192, -60, -217, -89, -133, 89, -213, -115, -103, -27, 350, -185, 83, 40, -298, -94, -197, 80, -53, 189, -40, -230, 334, -129, -67, 146, 37, 193, 86, 85, 155, 6, 74, 35, 23, -332, -96, 206, 57, 220, -52, -91, -326, -82, -44, -47, 82, 61, -107, -288, -18, -163, -64, -3, -131, 30, 175, -39, 88, 156, 80, -122, 174, 222, -110, -23, 59, 150, 62, 233, 43, -231, -207, -268, -18, -151, -170, 27, 130, 97, -106, -28, -25, 149]
5699A49mj24j79K25K3l0l4j39Q5l3n5K36p8j0M5q2J10m1N7k57J3J14Ql7Q8m5n7
5726e2ok7O6k32M07j49R6R6l5l6j53J01p8M1j01L3o1Q1q0j72L39R5j94j43K89
5751A25j49L7ll6K32j72%m2o9LJ67l81O9J55R2k0M9K6k8Q6k22k31K84r4J28l2
5777b6j77J78J89k7j51p7P2Q0l35K22k3j27K78k94K18j53P7Q2q0J55R2r1q9Q0
5801G3Oj76L0J97j77K50k96K08%J38l85n5L67k16r2J04J42k10L4L1P7j2R9j05
5825C2n4J84r7l9k83J55L17O6l03J76j5j91J58j61J75K55k02j58Mk1Jq4j29L39
5849A25k15K20j86J04j51j13L66l31L54j60j22q1K65k2n3j8J30j9k3p4k00l1L51
5872A16m5l1J96l92K22pj38j78K19R2j31K61m59J23J5K64N4k95o1L51j43q0j4
$$ y = [149, 145, 21, -158, 67, 90, 60, 26, -113, -28, -61, -116, 120, 42, 32, 77, -5, 105, 64, 121, -136, -123, -9, -1, -38, 50, 5, -52, -58, -85, -19, -251, 156, 7, 103, 199, 164, 128, -25, 76, -2, 39, -62, -29, -90, -9, -89, -261, 78, 173, -21, -164, 125, -24, 13, 10, -26, 206, 34, 34, -8, -77, -74, 93, -288, -219, -64, 28, 8, 57, 83, 55, 141, -81, -312, -28, -122, 6, -26, -203, -25, 164, 137, -14, -91, -19, 61, -274, -52, -75, -202, 76, -218, 0, -153, -76, 6, -74, 81, 173, 82, -7, 73, 79, -97, -67, 130, -47, 203, -93, 115, 115, 253, -132, -187, 180, -36, -128, -24, 118, -92, -58, -27, 50, 38, 137, 32, -22, 162, 65, 26, -257, -102, 215, 281, -22, 154, 139, -52, 106, -55, 120, 375, 173, 15, 19, -2, -1, -85, -214, 125, -90, 130, -56, 48, -103, -216, 150, -181, 173, 13, -109, -190, 75, 53, 0, -18, 112, 93, 70, -4, -204, -235, 116, 71, 40, 236, -156, 66, 59, -79, -257, -38, 54, -77, 184, -275, -152, -137, 127, 181, -114, -175, 176, 33, -47, -61]
5895f1J44j33J27J01J2m31J57P9o3J30M4p6o4J55k51R8o3NK24k8j26J38k52P6
5919e8m%M4K7J55j55k00%Q0k0J06p7N0k74K55J4J47M9k90N3K7M9m9O1k21L57k62
5946a36J6M3J57l03K50pp9P1J31Pkk74L24j70j51J64n1j27J69j90M4J84k01J0
5970a21J21P4o8J73J09l92p3j25M0M54k75N8J5P9J80r1J4j76n6J1K33Kj00L1l0
5995H7q6J09n9j37L68l36J84k37n9K62j90Lm3R2k13L28j83O5K1L0K12j84r6K30
6019A68j81J52q4J05j18K3kP1k7lJ37k79J59k14N4no1n9J81mK5J1p8K30k56p1
6045a26R8j4m1J35P6n6q7R9j21J17L1o4j80Pj32K77R4o6j05l1O6N5O9o0l50L68
6071E9J9l5O7k69N04k16j92j27J44k65K87N1k37M06m41L08j0j32R2P2j86m0l3
$$ y = [-61, 83, -50, 77, 178, 190, -241, -84, -5, -68, 62, 106, 30, -34, 121, -130, -32, -95, -90, 134, 106, -20, 118, -134, -58, -62, -62, -18, 9, 164, 9, -191, -191, -111, -131, -25, -102, -52, -326, -71, -57, 90, 139, -151, -98, -71, -22, -71, -10, -231, 126, -136, -120, -77, 80, -223, 27, 20, -59, 12, 143, 150, 148, -126, 198, 28, -123, 41, -10, -137, 32, -158, -114, 70, -131, -121, 0, 74, 6, 179, 288, -104, -177, -302, -262, 192, -83, -25, -10, 69, 249, 158, 172, -4, -60, -49, 184, 186, 86, 117, 87, 1, 110, 51, -86, 282, -54, 130, -107, -166, 96, -94, -91, -134, -42, -255, 73, -110, -45, -24, 6, 218, 34, -62, 168, -13, 139, 55, 160, 42, 65, 63, 134, 107, 104, 241, -38, 121, -93, -39, -44, -105, -164, 17, 13, 38, 49, -29, 201, -55, -126, -28, -42, -83, 52, 128, 72, -15, 84, -37, 80, 111, 47, -133, -126, -258, 19, 113, 47, -58, -89, -23, 32, 101, 41, -309, 59, 78, 43, 110, -159, 345, 129, -63, -190, -46, -311, -24, 27, -210, 196, -245, 63, 53, -79, 13, 85, -101, -141, -174]
6094a74L00j33O4J6k07nK92j1p2k7j02J70l04N24j00j37j2k04J95k96M95j84j86
6117i8K90n8k5k39J69j52j06l5M17k78K61k1k65N8L0r9K28r5j29K21l3k94K6N23
6141B96k95j07J62j9j2K02l31J69m8j11J20k12K44j08Kk8r1K43J52j81K1r9L6
6164EQ6j16N5N7k80O9J9O7J23n8J01N9M6j94j65K33j30q6J46k10K07n8j09K33
6188A00N2l54L01J8o7L5M4R1j33k05R8K20l30M0J73P3j01l4m7j3J59j58q7j01
6212b26nL09j3J15l6l28L06j25J48l17J64J18j54L7p7j6J16j90J83J02N2l09J9
6235a27J62j80L20p2J7j63J55q9r5J16L5L9q7j39L78k85j15K31k73J83R6q5j62
6258a40Q7lk41L86r9L9o7Q9mj85R9j10J08m5N9L4J22k72J90o0K1k8J43k95P6J54
$$ y = [-174, 126, -7, 57, 73, -134, -139, 153, 142, 70, 43, -59, 111, -193, 331, 231, 94, 82, -122, 73, -223, 272, 88, -98, 192, 134, 109, -130, 39, -113, -219, -254, 163, -115, 146, 125, -140, -82, -52, -151, 77, -18, -147, 74, 41, -253, -227, 296, 1, -106, 56, 37, 25, 227, -104, 65, 17, -94, 26, -186, 58, -50, -48, -76, -167, 76, 228, 47, 68, -31, 5, 91, -25, 30, 87, -193, -124, -105, -38, 85, 27, 128, 187, 233, 39, -126, 107, -23, -109, 37, -173, 34, -24, -133, 100, 152, -202, 99, 117, 50, 85, 129, 220, 87, -118, -20, 200, -130, -90, 83, 156, 55, 21, -26, -39, 120, -38, -125, -226, -231, 78, 65, 180, 144, -184, 122, -3, 145, -172, -8, 110, -44, -7, -84, -100, 16, -174, 9, 111, 163, -146, -127, 35, -145, 175, 103, 120, -43, 112, 23, -72, 44, 79, 118, 31, -108, 270, -15, -130, 101, -172, 11, 107, 22, -140, -53, -56, -297, 89, -10, 29, -38, 51, 47, -138, -39, -149, -41, -86, -27, 7, 129, -143, 47, -13, 8, -20, 123, -172, -96, 58]
6284E8k15n6J24J90k79M43k59o1K65k43J86n7Q1l81J77L93p3m30M14j32L4l15
6306a36K09m1J7j27K4j14O3j02M6O0J35m1k92K02o6K58j30P3j1J32j61J79m42
6329b65K21j94K33J26j23J11j41O2M3m3L0J57k47J41o9N9j32M3K20l66LJ41p6
6352f6N6j12M2N0J14p6q5K24kj81o4M30l17J41n02L32J42k55K45J43k48Q6J71
6375B68k67J07j57k0j21M07l45J63J87r8p7j14O5K50l87L30r3J5n2L3k23K77j98
6398e0J50K5k34J68j20J93J7j19k92J22J50j18N9J06L2p0J74k39kJ19K2l4j18
6421e9L20k12p0k7O3qP8q1m9j29J92k88L97Mnj32mJ8k59L75k10O1r9K05k09J47
6447A9M5j58K54J48l26j21Q8j60J5R8K68j54P0o0m5j78L34N9j51j72J65K7k9k21
$$ y = [58, -157, -213, -89, 101, -178, 265, 6, -55, 210, -33, 153, 96, 177, -204, -27, 366, 293, -137, 277, 145, 179, -136, 73, 32, 49, -78, -54, -168, -105, -207, -161, -101, 34, -7, -299, -97, -163, 95, -35, 38, 27, 159, -2, 177, -265, -44, -238, -5, 121, -2, 109, -32, 30, 73, 30, 60, 217, -30, 111, 42, 101, -31, 12, 232, -134, -131, 10, -66, -10, -122, -80, -30, 84, 8, -77, 147, 145, -36, -100, 330, 13, 154, -348, -16, 126, -129, 116, 259, 11, 97, 268, 1, 108, -49, -69, -190, 217, -128, 35, 222, 124, 47, -67, -2, 248, -139, 191, 98, 113, 61, 94, -129, 148, -50, 100, 125, -109, 59, -61, 132, 149, 30, -262, -140, 10, -108, -49, 57, 89, 19, 193, -46, -48, 71, 93, 59, -59, 261, 49, -21, -48, 15, 7, 85, 4, -45, -174, 18, -270, 127, 131, 126, -6, -10, 8, -251, 124, -86, -25, -124, 81, -128, 19, 64, -94, 160, 308, -18, -139, -51, -211, -196, -98, 170, 16, 86, 26, -19, -197, 137, 196, 45, -127, 38, 65, 36, -185]
6471a85J44k23J33P7J71j49J24N3Nk23J87N1k79K49%k61J87j9j86J80m4R4j62
6494g6P0k42J22K16j51J13j55N5K62o7j73K17p5L3J3r7J71l18J68m4j7K34l86
6517a27L88k65Pp9P2m2L8Q3r5L0K55k08j60K05o3k28J57l36L32J48r0j39J0J10
6541CJ50m86J58L72n3o9LN8j60K1p6J22j00J28k37J71L9p5L4l5k13K08N7k13M9
6566a44n7O7o9M13k18j1J81o1p1k65k1M32k59L24l41K04q5j17K75Pk31j71K02
6589a6rK10l19K03J15j95j12J8J08J03k82L42k26j53J06L96l79J89k10J60N2p0
6611C1RK0J35j09%%o7k31J80j40J31p0O8M0J79k85L54m41J82k12K02j89M11j19
6635G9j13J51l7Nj11O8k14K00KJ42l41K81J13k65jJ49k30L50k48R6k17J3K07j23
$$ y = [-185, -41, -264, -131, -54, 117, -32, 92, 145, 150, -73, 114, 165, -114, 135, 135, -126, 61, 42, -144, 36, -8, 86, -76, -6, -248, -126, 90, -61, 52, -103, -48, 214, 147, -26, 191, 116, 149, 162, 65, 236, -82, 86, 42, 25, 259, -127, 261, -4, 3, -76, -4, -46, -8, 75, -20, 10, 265, 57, -103, 102, 39, -189, -32, -368, -36, 112, 22, -117, -107, 3, 153, -333, -175, 197, 144, 75, 78, 136, -24, -3, -79, 43, -57, 71, -166, 5, 44, -31, 3, -32, -245, -37, 20, -193, -144, -201, -134, -203, 210, -8, -19, 162, 101, 30, -235, -256, 176, -83, 241, -100, 104, 19, -98, 177, 184, -47, -218, -16, -25, 185, -134, 69, 184, -11, -123, -105, 3, 106, -176, 166, -60, -213, -107, 289, -90, 99, -111, 49, 101, 31, 40, 60, 195, 86, 86, 86, 19, -212, -32, -172, -41, -111, -43, -3, 176, -109, 245, -196, -14, -226, -24, -213, 198, 79, -34, 117, 80, 85, -26, 42, -172, 28, 30, 172, -169, 112, 225, -40, -41, 108, -122, 228, -20, 76, -141, -128, 79, -44]
6659d4j59L04j62l5J21l1J6r9n3K58M9j29J18j67r1L19k95K35l43K82q2j81L8
6682a31K34j24Lj32J57K33k67k28M30j98J10K8k97K93k70L24j85M4o2J78j12L1
6704E9J19r3mj33l8j3K41r4O6l41jJ80J40j50K94j18j20k1o7o6J13R4o5J17j40
6729d1J30j98Q9J2j36J70K4o2J99k03j29P5k09J74L37l93L62n44N09j14j9N6k34
6752a45J05J62n5k3lj77J52M1J59l88O8J45k10J49k3K15J8j57J31k00j32K15J31
6775A78j04l7K8k45P7L08l45J49q6J30k63R7J72j51N5L9j77K81j92j66K36m3J52
6798I3k41L1J27n7j66L12l4j2j7j64J81Q5j3k4J00k95L27k94q4P2QR0rr0L58m01
6824a17N4K64j25r9J21K3j25j14Q1p9J43l63K33J73J90l47no2p2J21J09J87j72
$$ y = [-44, -203, 101, -61, -96, 25, -6, 10, -89, -142, 116, 165, 36, 154, -13, -104, 215, -80, 155, -188, 94, 12, -169, -131, 103, -21, -18, -150, 7, 240, -27, -255, 175, -23, 87, 115, -182, 111, -159, 165, -20, 24, -38, 140, 28, 59, 178, 85, 81, -52, -90, -103, 138, 44, 110, -231, -232, -52, 88, -62, 232, 114, -6, -27, -94, -160, -47, 47, -18, 99, -41, 89, -109, -20, -8, -144, 26, 50, -12, 187, -16, -145, -70, -279, -105, 232, -161, 201, -343, 166, 52, 33, 89, -145, -40, 122, 67, 44, 41, -136, 16, 57, 216, -172, -104, 41, -169, -20, -43, 172, 190, 33, 164, -36, -168, 47, 178, 74, 37, 65, -180, -103, 205, -140, 9, -77, 53, -210, -113, 59, -92, -37, 2, -175, 106, -86, -252, -16, -59, 93, -148, -117, 10, -47, -213, 99, 65, 53, 36, -128, 53, 138, 125, 101, 201, -94, 233, -61, -145, -73, -65, 25, 16, -74, 284, -117, -63, 201, 76, -23, 98, 121, -4, -118, -37, -116, 27, -336, -103, 70, 260, -87, -92, -154, -226, -105, 4, 191, 19]
6847A9j5o3J82o7J89l12O4j24J48p3J04k1j07M8K6k2Q5k90M5K1J18N9k17K79j86
6872a10K25k20j0J32k11J91k6P4J95j95M5k13J12K39j52j89K12q5k8j90L86j90
6894hl4J26j72j6J47oO1M5l14J93N2J9j32K38j98j72Q5R6j20Q9Q6j9j4R8k2p2
6920C6j16k6N1J47j69M3J90Q9j18k41N9K49Kj27QR4n5m5j24J03R9j22q6R2n9j43
6946a69k01R8J88L1%PP3M9j25K4K52J22m64K58m1J63n09M23L4j28J7j93J0P4r0
6971i7J23P0j15K38k90R2J3P8q0j28K59k90j8q5J35K1k9j1j62J32L36j65m0J43
6995A30k73O5k7n7p2J15M21j27O8j03k00LJ19Pl20J95O8J3J23k16n5R8J00o5k5
7020a5J58q7q1O9L1k44J51M1q0R8L9k49J69K5K2k40O5J31nK92k94k5J85J42m47
$$ y = [19, 4, -59, 123, 56, 245, -67, -3, -127, 21, -52, 52, 31, -76, -28, -2, -24, 61, -229, -184, -163, -45, 14, -203, 76, -110, 115, -105, -115, 17, -194, -3, -29, 45, 240, 45, 90, -123, -11, 228, 76, -113, 99, 14, -14, -204, 182, -8, -42, 84, -88, -104, 43, 37, 98, 143, -171, 22, 74, 93, -39, 199, 1, -171, -86, 10, -110, -21, 65, 46, 32, 130, 108, 36, -80, -106, -55, 92, -77, -34, 156, 245, 127, -114, -55, 194, 196, 69, 77, 171, 116, 71, -53, 50, 149, 27, -59, 33, -26, -169, -370, -272, -84, -53, -53, -46, 27, 76, -49, -25, 227, 349, -115, 143, 102, 265, -244, 179, 213, 85, 102, -91, -81, -7, -97, 26, 96, -19, 219, -71, 21, 34, 112, 32, -96, 163, -127, -145, -230, -95, -74, -103, -114, -276, -144, 192, 27, -13, 130, -143, -78, -105, -162, -234, -119, 302, 175, 243, 140, -60, -57, 62, 69, -251, -56, 12, 25, 148, -68, -123, -25, 75, 10, -15, 143, 56, -25, 44, 75, -169, -18, 23, -57, 41, 80, -169, 0, 25, 47, -193, -128, 3, -2, 290, -4, -29, 156, 298, -149]
7045a49J09jJ15L4O9k87J46n4n3J48n8k57K01P1QJ43j81k69K57j09O6p7J57k26
7069a97K98q8j12J65l4J56k76j30M23j85K1q7K27j12j80M2j27J53j25K00k08m
7091a80Q8J35j04K24l50L47l20K32p1rJ05j93j1P6P3j97J60L0L7k14K35j30J78
7114A41j14JJj96M62l43J8K24k03j02j20L17R5k25k0j8O2l7J28j51J92J6l13L62
7138A77l29Q7m1m0M68k92j60L9L5J42j07J56n5P2k89K56l9k5k33J87r6p5K82k35
7162a15L5J41K96l64l6J20j38M3j17J30J10Kj55l7K07j46k7P5p0J23k00J55j28
7185i6R1L2n4m0K4J68j39J38k25l8PL29j65j62L15m32J00K00r3k0J52k18j62L41
7209E3m6J24j06o9J40k8o0M9J3R1j64N9k9K9j36L80l37m2jN7J31q7J83j70rJ59
$$ y = [-149, -40, -41, 74, 108, 177, -110, 36, -18, -71, 77, 19, -238, -37, 34, 42, 185, 4, -265, -8, -117, -51, -128, 29, -197, 101, 13, -99, 66, 32, 188, -88, -218, 205, 20, 41, -46, 181, 69, -111, -69, -196, -43, -168, 32, -176, -180, -92, 43, -61, 163, -187, 160, -160, 72, 1, -8, 97, -96, -107, -31, 42, -155, 5, 35, 72, -142, 93, -37, 141, 27, 28, 29, -167, 295, -48, -30, 194, -9, -111, -231, 86, 181, -44, -64, -82, -20, -57, 71, -80, 112, 128, -185, 177, -152, -65, -106, -146, 322, 30, -130, -91, -56, 86, -21, 135, 80, 152, -137, 119, 80, 55, -178, 9, -87, -162, 120, -115, -80, 61, 357, -7, -43, 77, -61, -18, -135, -5, 105, 107, -48, -85, 122, -24, -51, 24, -46, 77, -123, 32, -96, -5, 27, -27, -67, -43, 125, -14, 124, -101, -139, -132, 197, 32, -130, 185, -247, -147, 53, -40, -60, 92, -126, -288, 53, 7, 131, 25, -44, 96, 68, 8, 57, 70, 161, -3, 56, 27, 56, -80, 300, -37, -79, -80, -23, 108, 21, 204, 34, 25, 184]
7235A84O0q1r1k1m3j95Q4J60j0K03oj68l1J28q9m21M76j39Lr0lJ98o9P6n2p9M
7262a2K01o1J2l22M09l08J5K80k08K9j22k8J86J33k87j22J99j37N2J41k63K29
7284A6L2N1k86J95r9p2J46j22n4P3N8J24j48R9J88j92P3pk84J37O0K94l77M9K07
7309A61q7k21K56j58lj3ML61l64k8l9J62J4j32q3M34l41k8J70k16L49j80kJ79
7333A95j94J2j12J62MM6P4l56L86j05L8k2q2J2l9m2j1K27l4j67j53L28L9l03K82
7358A85Kr6l15L60N8j70j07l7K62k98K05j16j5p0M0L09l15m0L83j69j7N6m67L7
7382c35K48L64n45J97r6J22K71k71J80N2k59m2P3q8J17q0J88j05J33m4k61K89
7404A08k18J23J13k04J88k32J61k01m5M21l03K40r2O0q2p7O6k00L23l9k2R9J50
$$ y = [184, 244, 163, 72, 51, 8, -187, -103, 57, 47, 250, 244, 76, 45, 173, 84, -337, 139, 0, 3, -87, -90, 108, 39, 115, 63, -16, -12, 189, 128, 140, -182, 227, -81, -66, 214, 6, 35, -87, -115, 71, 204, -83, -205, -6, -143, -91, 50, -213, 16, 48, 99, -187, 8, -91, -163, -17, -139, -193, -120, -62, 62, -86, 13, 201, 9, 82, 75, -209, -72, -12, 282, -95, -46, 161, 74, -147, 109, -49, -52, -65, -61, 300, -64, -92, -131, 31, 45, -87, -170, 264, -77, -105, 65, -151, 198, 18, 16, 195, 1, 13, -99, 63, 67, 113, 187, -169, 217, 112, 150, 128, 46, 58, 19, -23, -34, 193, 159, -8, -161, 167, 206, -97, 185, 187, 91, -224, 136, 194, 24, -83, -120, 142, -156, 49, -67, -82, -152, -112, 197, -118, -158, 225, 56, 39, 95, -372, -335, -87, 277, -268, -71, -167, -45, 226, -45, 135, 187, -72, -114, -41, -129, -12, -92, 96, -9, 124, 80, -181, 108, -110, 13, 126, -78, 110, -122, 39, -162, -207, 214, -89, 151, 59, 119, 37, -40, 26, -174, 149, 110, 88, 187, 337]
7427C37m64J33K34m01n9J98j44K2N1K29k78K1O8M7j2o1J4K72j23J02l24L07k8
7450A41P8N8l03J82l64N1J57J36l07K66r0m4Q3P7j05j83M4J67k26R4RJ35K0k39
7474a63K99j76J63k06M0J26J16k67Q9M8l31J68Q3K49J0k73O4l7j22J92m2m3j1
7497b4O3O5k28m9N7k1L9K80m81N0l9L77l9J21j04O5J09k06J56p7j09Q6j2Rj6j72
7523a00p7P8K63k25q6M48l47P1j83J75n0J92l53J48n3J65q6j12J30k61K20K1l4
7546e6K80j42o2k50P2K49p9j87J5J99j19P1R1m33O16Qm01j93K49M7P2P0l4j76
7570i3J12M1k96L96j84Q0k62M89j25k04J99j13r2J64q8j6P7j62k06K98M8qj08
7593e3J23q4k34K92j73R4K52j98j48Q4J82j73KJ05K6k36L21k50K62l1j71j01q1
$$ y = [337, -127, 6, 240, -161, -220, -22, -166, -144, -93, 136, -142, -121, -53, -6, -18, -79, -65, 207, 84, 186, -138, 169, 141, 219, 277, -26, 156, -208, -157, 0, 136, -171, 95, 5, -39, 44, 121, 16, -167, -123, 44, -182, -88, -79, 56, 76, -163, 136, -40, 123, -83, -43, 83, 199, -68, 21, 69, -262, -94, -11, 238, 248, -25, 39, 2, -120, 72, 30, -13, -24, 39, 104, -124, -173, -116, -137, -98, 182, -299, -249, -288, 89, 50, 171, 67, 132, 241, 35, 191, 114, 5, 91, 79, 88, 72, -100, -177, -99, 164, -61, -147, 301, -46, 25, -158, 17, -33, 159, -194, -46, -99, 66, -20, -132, -2, -263, -43, -22, -56, 224, 82, 20, -230, -158, 91, 12, -175, -160, 39, -80, -9, 82, -351, 265, 273, -128, -321, -72, -25, 47, 117, 83, -93, 19, 60, -236, 160, -24, 56, -206, 283, 158, -46, 153, 40, -52, 112, 24, 8, 85, -77, -283, 15, 63, 55, -53, 70, -14, -248, 44, -129, -35, 217, 19, -129, -45, 137, -36, -34, 71, 97, -139, 182, -68, 194, 163, -8, -109, -190]
7616a90P4%J29l4o3l3J15k18K85o3K7j72K8K03k27K4K36L9j37J22k25L41j99P0
7640A32k04J79j71q1J52L16k69M1N6j75q2J54o8K24m94K27J9N7J38k30J44j06
7662d1J30p8j81M05l40j49K32P3k27J29J10K21k53L4p2j66Q4L34j46J5j2J30k65
7685c3O6j02NJ33k17J15L76k60j40q0K60j43R7k31J81K68l78P4m3M3K32l55J44
7708A2j59R7K34j81j13j24K20P1p6M6m45J09L54K0K6K3m92L06Q4O8j15n6N9J28
7732I6j16m2L9m6N0P2j74J96l9J25k77J02PJ40n7k28K81j55R9j06P8k8Q4k61K23
7757F3j88j57L80l9n1lj40N0p9L1L20m76K57J85j97m5K46k21l3J24O0J64j12n2
7781H7n0l7L9j2l1J60k93K83j78J28j21r9P0j36j11N13k50J12j46K01l37L07l1
$$ y = [-190, -116, -116, 13, -21, -84, -117, -2, -220, 65, 2, 29, -143, -115, 88, -139, -115, 121, 160, 23, 145, -80, 261, 62, 132, -72, 107, -64, -145, 7, 323, 54, 95, 151, -24, -106, 48, -20, 204, -290, -63, -44, 13, 151, -79, 65, -41, 89, 11, -170, 235, -105, -254, -22, 51, -176, -47, 63, 284, 31, 65, -7, -173, -89, 245, 99, 114, 102, 232, -33, 33, -69, -64, 69, -148, -33, 343, 83, -57, -137, 123, -20, 77, -154, 27, 295, -83, -9, -52, -9, 223, -132, 12, -147, -50, 184, 3, -110, -234, -14, 57, -19, 27, -418, -309, 45, 65, 91, 114, -378, -72, 12, 80, -35, -91, -32, 96, -20, -62, -23, -69, -19, 53, -121, 75, 36, 161, -116, -14, -7, 133, 76, -152, 129, -26, 73, -33, 45, 17, 101, -160, 63, -125, -282, 98, 59, 8, 5, -135, -85, -164, -133, 187, -289, -32, 153, -44, -89, 157, -64, -97, 27, 87, 251, 139, 87, 37, 0, 39, 27, -4, 156, -137, 146, -32, 96, -25, -124, -54, -190, -301, 212, -38, 74, -72, 129, -208, 99, 68]
7804F8q8J09K0l17K59K00l09K45k49K04j66k16L20j44P4m8L1k8q0J61O0p4j20
7827h8M7N2J20m08M71k14j3O8J25l27l5J95m2J17L8O2j94M0j01K10k10L47k05
7850E5k13j31M84m30O6O5N4k5j03K45J20k28j3J35j87K25j8qj26l35K29K02Nk04
7874a36J39ln9J11J71j55l6K9l12%L57k79M1J61J6O4l54J14K27m5O5r9M3k1m1
7899bl2j3K17m5n3n8NM0j94J03K2J21n2mj32K75m7r0k64J70q6K62P8j8k11J09
7925A01Kk87J11J25j23J11J03k10P6o1l5K43j41q3m5K38j21j2j5j65J62K08j04
7948G8P8j46R5k6J09j49m8M1j06J54J91l13J31j16L14l54K16j15nj37J14k31M7
7971a78L64j63l5j02J39k58K84o9j11N0Q8l2J07n2j76K06Q1m41J60K73j54L0j16
$$ y = [68, -20, 89, 109, -208, 51, 251, -58, 187, -62, 142, -24, -240, 80, -64, 10, -38, -7, -35, -115, 46, 106, 32, -88, -41, 11, 131, -277, 194, -20, -33, 35, 160, -167, -202, -7, -49, 68, 106, 168, -26, 14, -87, 123, -87, 260, 55, -158, -289, 195, -235, -169, -104, -50, -75, -178, 67, 187, -41, -54, 81, -106, 119, 101, 93, -33, -368, -139, 63, 68, -136, 3, 0, -59, 52, 223, 68, 32, 61, -251, -251, 106, -173, -132, 29, 45, 109, -245, -131, 96, 51, 116, 17, 60, 39, -2, -34, -47, 170, 125, 72, 14, 19, 59, -135, -32, -10, 111, 59, 55, -77, 198, 151, 61, -203, -33, -119, 143, 221, 203, -8, 101, 103, -184, -73, 52, -71, 40, 143, -67, 9, -52, -87, 156, 15, -68, -113, 125, 4, -8, -23, -188, -26, 182, 78, 156, 10, 105, 79, 188, 39, -9, 32, -74, 80, 271, -42, 89, -27, 287, -67, 149, 34, 29, -108, 6, -225, -178, 186, 23, -12, -114, 25, -233, 51, -18, -129, -79, 9, -23, 84, 32, -144, 62, 143, -298, -138, 135, -19, 11, -105]
7994a05P6J5j3L7P6k9m2m2K4K5j9K04l01K62l70K12J9j92L24l9n1j78J72k00J97
8019F2o6j17J75j6k00K01n5j58R3J9J19j45n2J46J6j29J39L0j65M1J68n5K6p5
8043BJ36k57K52k14M8M1r8K23j31J44j33J04r7j84J16J3q7K53l83K35M7j79N4
8066i5K31q8k41J79r3K03k7j78N7L19m90L64Pm65N38l68m5L66k3j45j08K34l66
8089b34K37j22j92M49l26J3J38k18L72k80Q7pr3K11k69M16j98L7l0Q9p4l1r9M1
8113h3J32K4J12m37K91J70j17l20L32r8J72k38m8l09K83R8R5j30q0O1K3p3J02
8136c8O5j57J30J26k74N3K71l32L10K9l32J9K35j17Q6j30J6N7k63M10j2n1j91
8159i0r9L49k58l6K77l10K03j81J77j13J6Q7j8j01J16n1M9M3j1Qn2J22j07j61
$$ y = [-105, -29, -14, -27, 10, 86, 57, 15, -27, -3, 22, 3, 207, -94, 168, -202, 10, 29, -163, 161, 122, 71, -107, 65, -135, 62, -4, -121, 54, 38, -162, 39, -16, -174, -81, -62, 57, -88, -140, 6, 22, -107, 32, 62, -103, -62, 106, 51, 77, 2, 138, -119, 133, -81, -33, 8, -90, 133, 2, 146, 13, 117, 20, -164, -48, -35, -122, 131, -252, -17, 30, -149, -95, 136, 48, -193, -14, -107, 96, 69, -109, -52, 267, -223, 141, 148, -317, 221, -147, -192, 174, 151, 6, -102, 132, -234, 3, -119, -311, 138, -188, -175, -37, -255, 117, -163, -76, -83, -176, 35, -234, 182, -16, 21, -9, 80, 6, -25, -124, -83, 49, 73, 185, -252, 39, 209, 92, -228, 104, 6, 178, -60, -108, -417, -134, -36, 59, -71, -151, -90, -67, -140, -38, 27, -130, 0, 126, -148, -95, 176, -156, 154, 183, -149, -130, 105, -12, 74, -56, -40, 17, -246, 164, 152, 101, -90, -189, 160, -98, -134, 143, -167, 36, -145, 32, -81, -65, 22, 4, -97, 19, -32, 17, 60, 49, 57, 5, 127, 20, -141]
8183a41J32j02M7J88l22K91K2R3
$$ y = [-141, -9, -111, -64, 124, -198, 93, 115, 208]
8191B08
$$ Imaginary data points
##PAGE= N=2
##DATA TABLE= (X++(I..I)), XYDATA
0@%%%%%%%%%%%%%qJ6j6J6j6J6k4L2l5M3n3O1p2Q3r2J05j20J39j60J81k05K32k60
36a37K92l27L64m05M51n01N56o17O81p51Q28r12J005j107J219j343J481j636J808
55I49k003K227k486K789l147L582m123M812n722O989q872J1952j7834L2835j37865
70a15917k74130M10419K83347k66973k33476J82098J40642j11891q3337N5072
80a4146K1955K3870N1203o8276j50588N8151K13623k364k22702m3928J70858M9285
92H6941j16704k1902P6193j208m2337J4983j2894l6837P4936Q3417j04918j22077
104a22407R4236J27648o9813q9903O1511M4510o2710j1353N2489j3274k5730M6515
116C1719j222r1951N614J21135j95j19955O849R9041m1580r1138Q3464J01329
$$ y = [0, 0, 0, 0, 0, 0, 0, 0, 0, 0, 0, 0, 0, 0, -8, 8, -8, 8, -8, 8, -16, 16, -19, 24, -29, 32, -40, 43, -49, 56, -64, 75, -85, 96, -109, 123, -137, 155, -172, 192, -213, 238, -263, 293, -324, 357, -394, 434, -478, 527, -580, 639, -704, 777, -859, 949, -1054, 1173, -1313, 1476, -1671, 1911, -2212, 2600, -3122, 3867, -5005, 6947, -10887, 21948, -115917, -390047, 20372, 303719, 36746, -196730, -14632, 126010, 14119, -69218, -14146, 7809, 31679, 82882, 14606, -135982, -77831, 135792, 133428, -89274, -133202, 37656, 86941, -29763, -51665, 24528, 23320, -19017, -4034, -16928, -53765, 21171, 104588, -330, -122407, -28171, 99477, 29664, -60239, 1272, 45782, -16928, -28281, 24208, 10934, -14796, 31719, 30497, -61454, -55840, 65295, 65100, -54855, -48006, 51035, 9455, -81683, 1781, 103110]
128A03110j07468j07367J14149R2600j19803o5566J39411N2509j52314n3698J40789
139C6352N2671j02391k9258O3972q136m4317L6524L3708m6727j5911M7311j6105
151G693n8181L8974P3286m3581p8717L6872O1977l8444l4664N2421J7362o2591
163b7593j0188N9212K334m3155J8700L2594l8591k9309M5628K6184l9198j2018
175a5400L3127r087l6118K1425L7561k4019k8189K2275O246l1228J2814M5399
187C4806k5062n3088L1830M9631m3382m2717O1182M5346p0900n1619O6760N2261
199E5048n0549l6819L8389J7719l3090n526K7707M39j4050O461n714k2921J6791
212f115L8375j7669m6724J4057M1676j8089l4210K7555L0158l2867k8185L0390
$$ y = [103110, -4358, -111725, 2424, 95024, -24779, -90345, 49066, 101575, -50739, -104437, 36352, 89023, -13368, -42626, 21346, 13210, -31107, 5417, 39125, -7602, -23513, 23798, 7693, -50488, -11514, 61772, 18191, -60526, -23654, 38323, -121, -34785, 17636, 34998, -27593, -37781, 21431, 23765, -19390, -690, 31904, -6687, -35996, 9632, 35816, -3382, -15400, 17727, 8640, -27478, -6053, 31508, 7489, -20700, 1575, 7821, -23407, -10593, 34806, 9744, -43344, -11514, 38117, -5265, -47982, 13200, 58546, -12354, -63973, 2787, 55048, 4499, -32320, 6069, 23788, -9302, -14828, 12879, 13318, -732, 5729, 15, -22906, -6115, 32260, 14591, -32133, -18076, 23600, 5511, -28699, -1144, 29014, -3853, -32038, -1648]
224a648K1023k3841m414K3954j0192k6806J7867K8526j7423k2405J8987J4203
236A7831k3353r756K4454P528j8660m087P396o912k346J9154R01k7613l54K8464
250A2647n295k9461J2422L5210j5222l8560J2670L4640q044k0991R763R922j4136
263d435m035J7295J995j3177L200P052j2662o016J8090R245j8553j0761J2494
276b68L720j0311N643J1118j2187j3606J3590J1712j4822n672K0849J531k5468
289a4171r30K6530M096k0950k528J5208j213j0294L812O750l293j710J321n473
303b845l784J0418P330j3674j0448J3018Q129j3585o115J5290O057j5898n912
316a2019J2997L201o996L140N229q073m993J0345O081q762j770P569k519r125
$$ y = [-1648, 19375, -4466, -8880, 15074, 4882, -21924, -4057, 24469, 7046, -15359, 3628, 17831, -5522, -15278, 9176, 16704, -1956, -6043, 1353, -5559, -7905, 11249, 12150, -15463, -15817, 12647, 7352, -22109, -9687, 25523, 10301, -28259, -15589, 19051, 11007, -9984, -221, 9701, -4435, -8470, 8825, 10820, -2357, 843, 7895, -4767, -10783, 7307, 16552, -2001, -12762, -268, 3452, -6859, -1216, 9902, -2285, -15891, -2301, 9411, -5411, -11083, 9766, 11297, -14171, -15101, 11429, 15525, -5425, -7953, 7255, 6042, -4252, -440, 6310, 3017, 1307, 2628, -2845, -6629, 3789, 11119, -2555, -13003, 15, 8144, -5441, -11556, 3734, 9791, -6107, -12019, 978, 4179, -2817, 323, 5552, -2521, -7514, 2831, 8912, 150, -1620, 5949, 3430, -5695]
330e695L387J0110r79q136j449K116j967K027N577l007q959J398P105j771n559
345e802O447N287r845o353R831P609n727m534M256J578m472J813M910j576k704
360G18Q58l63k436J897M719k534o651O10N159p60m492L47L981j199l678J265J237
377a322j463K767L231m120m950M595P483l144o788K918N680r34m679j440M186
392B020M238j239p454m315O874Q184m063j0455j120R028L316p829n144O900O054
407D995n119p057J548P648K794l237n847j371O906O419m682o943K329O893k41
422E035o353j257N074K809m129m457P49M133N36k111k171j134P54L079j25k755
438b323j839K704L372j591l299J8M452K635l199l649J654M139J146j403k611j893
$$ y = [-5695, -2308, 7802, 6823, -1313, -2762, -646, -2613, -586, 4991, 1984, -6975, -5577, 1528, -243, -5802, 645, 5932, -3913, -10266, -435, 7174, 1447, -3087, 1169, 2747, -1725, 88, 4998, 3422, 718, 1576, 1213, -1223, 674, 5393, 2859, -3792, -3182, 1977, 1217, -3275, -2928, 1053, -146, -3824, -2559, -1322, -2785, -18, 3213, -907, -5857, -1262, 6221, 3077, -3711, -793, 4887, 3953, -726, -2166, 2020, 6258, 5019, -2435, -6750, 124, 8308, 4245, -6210, -7330, 1698, 5014, -2815, -7959, -1059, 4995, -124, -7181, -5633, 2015, 4809, 1572, -4275, -5646, 1260, 7679, 2997, -3946, -1617, 5276, 5035, -1318, -2575, 2499, 5308, 1179, -3278, -2529, 1604, 2140, 29, -2142, -3276, -2522, 557, 432, -2323, -4162, -1458, 1914, 323, -2976, -2958, 1494, 4129, 930, -2719, -1065, 3074, 4220, 2817, 206, -1687]
454a687K100M951j391p854n32R661K258j1635p791J1158J2704r080j6517M433
468i222J7138J69j5284l345J2974M781q181m815M116N988J471m487o585J250J0194
483F162N031j1170r607Q685J2951o336j5629J996J6961J031j8194m954J5571P824
497A0322j1829r633P390Q389j867o123k092M026M898Q08n508m729M322R008O13
512G995j1294n121J2234R628j2088j3262J0793J5722j0006j7689O659J7618m708
525F481j5631K347J1877l087r965N119R570p017j0131Q473J1180q309r946Q232
539h07R673p725p425P284N389n784j841M934l256n261P641Q890j2213j3481J1886
554b096J6946j0069k0243N795K0729n95k0162m099J5648Q206r481r741L823R057
$$ y = [-1687, 413, 5364, 3973, -3881, -4413, 5248, 7506, -4129, -11920, -762, 11942, 2862, -13655, -9222, 7916, 8085, -7199, -10544, 2430, 7211, -970, -5785, -1669, 4319, 5790, 1303, -5282, -4032, 6162, 11193, 23, -9584, -899, 12052, 5716, -9913, -7917, 9044, 10075, -8119, -13073, 2498, 10322, -1507, -11140, -3750, 4639, 2772, -3351, -5443, -1417, 3481, 4289, -1219, -5948, -1626, 7382, 7995, -3299, -8420, 3814, 13442, 1354, -11908, -1115, 14607, 4601, -13088, -6429, 11189, 6481, -9150, -6803, 5074, 1987, -7978, -2859, 6711, -306, -10437, -1964, 9216, 907, -9039, -807, 8866, 1141, -6284, 1000, 6389, 605, -1236, 3698, 442, -4819, 2822, 11712, -501, -13982, -2096, 14850, 4781, -15462, -9667, 11062, 10467, -9695, -13794, 1854, 10060, 579, -9162, -5339, 3718]
568C718K839m219p491j031R367Q042p004j4266K026J8707M434j9298j2023J6687
582D88J7510j2302k1689P042K1575k742k1025j216J7556L590j3203l007P847J24
596E48l533M666K091q008j902J1221L577j2193l568J1053M479r597l394P951K018
611E409p070N92M323m176m117P188N387r970q656J0352J0363q915j0967M280J0985
626E008l5q207k792M604N553o02m864k991M057N774l12o853l948O552P903l966
642D881j0831j010J1474N645j0102j0728O102J3247k347j4746j460J3727M136
655G988j1530n812Q734N434m262l251J120R29K363K321l554m411L738O361k466
670C702o916R22O026k8m479r68K755M95k350l21J064j020l52J550n20l270Q48
$$ y = [3718, 6557, 2338, -5153, -6184, 3183, 11225, 4221, -10045, -8019, 10688, 15122, -4176, -16199, 488, 17998, 5696, -15993, -8951, 12624, 9882, -11143, -12359, 5197, 8787, -4416, -7423, 424, 548, -2985, 1681, 3772, -4236, -6138, 5083, 8660, -3533, -7101, 3952, 8431, -1166, -4560, 3391, 5409, -1661, -1069, 3254, -922, -5039, 2149, 7536, -2434, -11090, -738, 9625, 710, -10257, -5977, 5008, 4973, -3234, -6026, -1422, 4131, 3529, -1335, -4326, -269, 5505, 5193, -1660, -5608, 944, 8847, 4881, -5950, -6960, 4514, 10159, 57, -10671, -4569, 8678, 6331, -8415, -9875, 3852, 7988, -3542, -9354, -620, 4814, 552, -2699, -1579, -650, 1713, 4034, 480, -3931, -193, 6168, 3702, -3214, -2292, 3734, 3706, -773, -1741, 1014, 1509, -841, -1162, -98, -1118, -1470, 80, -440, -3710, -2862]
687b862M839p69m815J078M486q54k621J184K028p15o17P40k9j6M31o92q06J508
705A498K41j764q50J492M87k091q86J592L91j833p68J844J143k155o26K129O37
722D81j751L02K149k19k124J150K328m46j621L71L26N43L05j147j188Q89J188
739A536j342k269J367K369j207l519n2L536J010l534j528L462J230j561j452J611
755c43J231m73k26M63L5O94M98j352k78R24N40p10j223O36j50o7M08n83j112n45
775a633J182M16o84j272J156P08j054m05J466Q44j150o55J299O70k81N93o1r02
793B37L54Q51J64o99o19K59j70p6K68p37n59l8K34k82q14N28J335q13j908J175
813a310K208l27k619P35K553O6j627K96P11N12k72n49L63L48P57j138j464J067
$$ y = [-2862, 1977, 1208, -3607, -2529, 1957, 1103, -1518, -334, 1694, 979, 362, 1102, 1073, 1057, 1488, 796, -10, 1498, 1739, -25, -875, 617, 1104, -987, -1873, -281, 110, -1723, -2491, -647, 496, -1659, -2285, -156, 481, -1270, -968, 1181, 962, -1162, -12, 2316, 1870, 249, 620, 946, 1489, 1794, 647, -541, 348, 1536, 194, -2075, -708, 1661, 454, -3065, -3117, 419, 1429, -2105, -3633, -171, 1059, -502, -1954, -343, 888, 415, 189, 652, 687, 1381, 1879, 527, 249, 1173, 1713, 1003, -220, 416, 266, 199, 607, 24, -1088, -1633, -451, -35, -719, -1991, -835, -127, -1181, -1586, -120, 724, -426, -1081, 218, 888, 607, 1200, 1139, 237, 591, 1442, 1606, 907, 288, 547, 377, 301, 569, -168, -727, -765, -531, -813, -1627, -1099, 236, -577, -2485, -1310, 898, 571, -2048, -1313, 1240, 1306, -321, -25, 686, 1198, 926, 377, 740, 1088, 1845, 707, -757, 310]
831C10J677j214k483K90J932M33k425o47K016J31j724k35J290O96k52k32k75n84
849a296J985J620j677j870J631K269j276j829P89J252m26r08l36k07J048mo79
866H6j897O2K342J44k766o46K169J564k040j017J487N54l80J226k51j715O52L010
884B584m35l172M59L421l94k867n49K004O28j052o72n84n99J203J719k465k548
901c319J819L330j183m229J462L771p13k845L24J419J146O36n16k312J12M152
917C054Q08m914q64M036J487l592j874K415Q29j613K2J73j794R8K840o87l140
934b716m68M721M61m807k31M470J15k891R68J444j344j31L424o06m758Q72N762
951D285l74n907n90N067P50m273j082J957L41j61l75j051j409K615K741l166m191
$$ y = [310, 1987, 773, -1710, -1420, 512, 945, -1480, -2127, -111, 20, -1704, -1939, -649, 47, -205, -437, -712, -1296, 689, 2309, 632, -1238, 393, 2662, 1386, -443, 346, 1598, 1172, 264, -72, -279, 769, 765, 86, -1811, -1749, 593, 737, -2029, -2675, -506, 1058, -982, -1999, -512, 42, -338, 888, 637, -1078, -426, 2584, 2149, -1023, -564, 2857, 2463, -404, -953, 1051, 1679, 627, -45, -629, -1228, -25, 1694, -771, -3319, -1500, 1830, 647, -3582, -2120, 1651, 938, -1907, -1583, -164, 982, 1618, 1102, -1210, -1098, 3054, 3862, -1052, -1916, 2120, 3607, 15, -1859, 556, 1385, -228, -206, -33, -1827, -1729, 1111, 424, -2716, -3184, 1537, 1998, -2809, -3040, 1430, 1545, -1346, -378, 1066, -278, -409, 3015, 2409, -2349, -1477, 4285, 3911, -1996, -2586, 2481, 3231, -1042, -2124, -167, 174, 13, -362, -1413, -2822, -207, 2534, -632, -4823]
968d823L366M864k204m690J106M060Q98j925j488m03K536K604k490m294K261N585
984D963j974o827J251O264j020n302K31L604q44j903J392L15l436J460M874k643
1000D05n433L388O445m085o144N099O298n452m754N623L337n278j948N779N5n942
1016b607R82N671j941n632J878M649k564l900K914K736l550j486L213N73l213
1031b277N05L771j567l129K323L114j827k194J034J662j31K16p72j939J340L076
1047C205k389l911L018M057l777m874L554M688l706m033L614K073l394m84L901
1062A542j421m043L824M660n537m074P042M673q208l954Q442M036q595k855P145
1077B677K271o867l60M695r87m592K942L449m857k749N490K103o629q93O756K77
$$ y = [-4823, -1457, 3407, 1203, -3487, -2381, 1679, 2577, 652, -836, -1239, 1297, 3901, 1411, -2883, -622, 4963, 2989, -3838, -2587, 3677, 2657, -2645, -2414, 1190, 346, -1557, -165, 150, -3286, -1826, 3048, 405, -5028, -1640, 4805, 720, -5424, -325, 5973, 521, -4233, 1390, 4727, -551, -2499, 3280, 3335, -2607, -1625, 4046, 2105, -3527, -1649, 3000, 436, -3464, -550, 2186, -1364, -2850, 363, 936, -2277, -1772, 1999, 432, -2697, -374, 2740, 913, -1281, -247, 1415, 1284, 1500, 728, -1211, 129, 3205, 816, -3095, -77, 3980, 203, -4671, -1117, 3571, -135, -4168, -554, 1519, -1875, -2359, 1542, 121, -3922, -98, 4562, -975, -5049, 1993, 6666, -1542, -5496, 2946, 6982, -1613, -4468, 2677, 4948, -1919, -2279, 2416, 1429, -3163, -221, 3228, -1629, -4378, 1112, 3215, -3414, -4307, 2449, 2726]
1093B726o465j9O111m66l893J415K244j606o74K506k73k551J295K268k693j203
1109a278K905N40l509l55L629r16l551J583K974k688k973L024K732l552j839L952
1125F78P98l677Q34M292k345l929L956M165n316l092O606J884o864o50O029J57
1141C526o282J260M761k498l668K909K035l876j434M389R22n453P11M909j125
1156A086m615J878M586k108l823L360K662l589r06L741j16l963J670L684k523
1171A024l510L555K162m299j403M136K65m520J90L994j159l397J985K805l171
1186a343j630L499Q14l070L25L833j219l277K209K943k735k105L148J578l683
1201g13j105M494n69m300J605L152k544k923K981K145l818j903M114Q36m132K54
$$ y = [2726, -3739, -3758, 2353, 1887, -2006, -591, 1653, 47, -627, 1879, 1606, -945, 350, 2618, -75, -1278, 1627, 2167, -1342, -1697, 1932, 1016, -2535, -952, 2022, -666, -3639, -615, 2117, -1435, -3274, 678, 1476, -2201, -1367, 2925, 580, -3349, 607, 4772, -544, -3636, 2970, 4854, -2010, -2660, 3369, 3526, -2756, -1496, 3265, 767, -2901, 8, 2043, -1833, -3267, 1122, 2044, -3409, -2698, 2211, 1086, -3529, -1651, 2935, 827, -2996, 364, 3026, -563, -1469, 2272, 2156, -1807, -137, 3547, 1024, -2486, 1069, 3231, -1068, -2471, 1665, 1930, -2590, -2400, 1594, 435, -2962, -977, 1828, -1343, -2973, 526, 1340, -1730, -1405, 2428, 1209, -2068, 141, 3084, 349, -1756, 1392, 2970, -713, -1818, 2676, 2107, -2193, -588, 2564, 20, -2903, 78, 2223, -1595, -3498, 616, 1452, -2680, -2426]
1217b426M099r08l468K097L098k769k118L592J343l701N2L850o53l837J226L883
1233C360k619k656K188J899k677j482K870L95l266j45L535j239k935J785K697
1248A710j946k333K403J866k551m22K692j18k845J665K435j987k246L173J223
1263B719l220o48L128k92l264O91K765j508k749J638K020k214j521L046O52l141
1279a898j98L005p6k795J462K307j869j370K283J495k602o16L098q18k738J201
1295a29K629j642k390J511J726j868j587K118R3k154J56K262l87k754J286K176
1311A046j447j774K560J498k555o16K480M52k333L98K223j035j574J367J164j517
1327C37j085J580L72j854J27J300p54j388O34J415j184j067J240M89j429M27J471
$$ y = [-2426, 1673, 765, -2703, -606, 2492, -277, -2395, 1197, 2540, -1161, -1109, 2741, 2088, -1749, -523, 3360, 741, -1915, 273, 2172, -505, -1987, 883, 1278, -1988, -2133, 1402, 163, -2772, -987, 1710, -236, -2569, -166, 1700, -851, -1273, 1419, 1301, -1544, 121, 2556, 569, -1677, 1496, 2719, -501, -1149, 1979, 1687, -1577, -886, 1879, 371, -2378, -740, 1280, -934, -2455, 591, 1243, -1898, -2096, 909, 833, -1962, -500, 1807, -62, -1432, 851, 2346, -256, -872, 2226, 1408, -1330, -129, 2500, 858, -1532, -21, 1705, -163, -1750, 368, 461, -1693, -1537, 725, 338, -2416, -1130, 1046, -401, -2175, 385, 1883, -672, -1288, 1192, 1644, -689, -291, 1932, 897, -677, 690, 1854, 337, -748, 832, 1204, -650, -523, 777, 23, -1365, -731, 684, -500, -1567, -327, 162, -1267, -840, 631]
1344F31o41r92P25J301p22o71J597J09j872Q3K190k6k015K18J953j300j563J119
1362A24J302j707j254J574M33j577k26J545k45j644O14J718o97j142O44J320n94
1379A88p47J289K39r09J23J022l74p11J79J008o59r85O63K70l82o51J20q8j66
1398e71J54L53p58l7P31K35j104k4J136L68j091L08J065o77J53K59L37q04K58
1417B91N79K91j554J11J268l43r08l88P52K76j114k70P34Op05K08M01K5n14N85
1437b69M55n43j92Q27M95n64k49L13P65j75l55m54N87M84n84m13Q4L08n17M7K60
1458C10p97k22O22J27r01m27Q38Q07q47o77M22J015k57m86m3J155K89o84r0M17
1478E71K00l55N4K77o81m4N40L58j291m74J055N10j591n61J099J047j429p58J185
$$ y = [631, -10, -1002, -277, 1024, 302, -369, 1228, 1337, -535, -452, 1738, 1712, -303, -85, 1868, 568, -995, 124, 1426, -281, -1535, 39, 472, -1105, -1331, 214, -31, -1675, -1061, 657, -40, -1182, -538, 782, 188, -559, 730, 969, 60, 183, 1205, 831, 120, 299, 1307, 648, -337, 326, 596, 214, -437, -317, -405, -571, -417, -64, -822, -859, -128, 107, -997, -1021, 115, 483, -608, -300, 765, 88, 241, 500, 837, 33, 291, 870, 1161, -393, -282, 986, 643, -265, -653, 99, 375, -739, -1009, -275, -269, -974, -766, -365, -340, -854, -269, 186, -357, -549, 278, 773, 209, -40, 273, 1038, 863, 508, 54, 641, 1125, 541, 128, 212, 520, 3, 50, 310, -487, -709, -87, 40, -861, -1288, -450, 357, -490, -1167, -745, 270, 13, -473, -516, 639, 928, 244, 154, 571, 771, 416, 470, 747, 66, 22, 562, 920, -371, -845, 210, 720, -871, -1432, -333, 714, -715, -1473, -288]
1497b88M88p37m14J013J10n26O7J289l14j114N87J066k67j234N71R84r02p11M88
1516A56M26k73q84M97M27q53k28R28j49r69j25P40M25n93m88Q82N07n16l31M95
1536G4P57o52rL76L00p1j19j59k6r1j61J79M2p01m30P96K43r47n06R02L62j174
1558a015K30R11L01j352O7J389J3j019M46J140p13p07P09J031o84j010R41L88
1576A066p04j153J197K52j077n5R35j20j168O6N65m8p79O79K27j14k31K60L11
1595A09j49mk7N91l63J49N33O6l17j94J10j41m7K20j85n45K48jp56O02J62n94
1617e33k83L16N84o41m55P49L25q62N57M85N6n53O35J89j20l82N15L43j48n24
1637B53K54M93m94p69O31J65r36r1Q04L8j296J33R27m64r52R38N52m68m28L00
$$ y = [-288, 200, -537, -951, 62, 172, -354, -287, 1002, 688, -426, 161, 1227, 960, -274, 297, 1281, 379, -332, 156, 582, 309, -575, -78, 349, -504, -732, 196, 47, -922, -1047, -307, 118, -475, -963, -81, 426, -90, -421, 74, 831, 179, 170, 546, 846, 775, 656, 497, 471, 380, 219, 398, 440, -261, -691, 105, 348, -599, -1105, -203, 159, -1015, -785, 126, 427, -925, -858, 531, 544, -475, -29, 1111, 398, -309, 400, 1431, 747, -263, 678, 1066, 362, -791, 406, 658, -419, -474, 461, 341, -827, -761, -196, -244, -1023, -344, -117, -231, -462, -202, 109, -40, -44, -71, 520, 157, 306, 839, 905, 588, 394, 504, 363, 316, 536, 351, -194, 54, 53, -703, -101, 61, -533, -816, -500, 84, -557, -1012, -263, 62, -800, -243, 242, 298, -255, 380, 569, 449, 67, 582, 925, 777, 253, 507, 1000, 506, -263, 368, 533, -403, -494, 310, 348, -948, -815, 112, -352, -1304, -366, 186, -282, -710, -410]
1657d10O79l50K91L39j79j24K08L04m69L9oM82p69j53N28k76k99J93O9m46k06
1678e55J68J55l82oM10j97m44L93L93j25j04L65J77k50l40R50K69o76K37N09l50
1699E97p46M55N00n53p50P31L2p49k41P06J01q05q8O76k99j47k1O73m04l12O73
1720B9L87l04m37Q99K07m17j86M38J5l27J71N1n99K06K99k7p43k7N41o37k70N01
1742b30p7n12L71O00n39m01L25N87j02n59O60M68n17l3M14L90m01k52K49K95p94
1763e8J48N33l18l10k51M75l23m82M35P2p06L79L34n7n24K53L99j44LK47j8R3
1785A80R1M7K0k7K25J72l34j46K05j14k89k61N41k32m01J90Ql74p7K01L20k17
1807b72m40N42j77L5n7O06o7m65L52L93m5l13L13K28k4n10J66M33n8o58M4L09
$$ y = [-410, 269, -81, 210, 549, 370, 246, 454, 758, 289, 328, 322, 804, 35, -118, 410, 134, -165, 28, 97, -349, -555, -387, -232, -614, -620, -210, -407, -851, -458, -65, -190, -294, 71, 248, -2, -342, 608, 877, 201, 438, 947, 597, -149, 306, 806, 253, -497, 234, 266, -483, -724, -18, 83, -722, -810, -134, -433, -580, -601, 72, -332, -644, 29, 416, 112, -325, 574, 781, 364, 178, 616, 631, 304, 475, 526, -73, 133, 432, 405, -338, -365, 176, -461, -731, -230, -307, -819, -448, 152, -387, -788, -463, 124, 22, -537, 123, 591, 74, 41, 455, 845, 444, 192, 441, 736, -58, 90, 623, 305, -5, -256, 219, -104, -586, -151, -79, -785, -406, -72, -129, -653, -400, -1, -145, -142, 105, 87, 180, 271, 318, 338, 311, 536, 708, 374, 228, 433, 319, 30, -231, 310, 78, -323, -133, -125, -499, -576, -375, -55, -272, -712, -170, -347, -312, -369, 237, 170, -295, 57, 450, 405, 92, 405, 633, 609, 99, 265, 698, 640, -18, 26, 335]
1829C35l21l95R3L02j61m94J70L49ll20k66M30L19o45L51L85K93n29J2M83P0l72
1851H6J83K60R0m26k02N00q6o31J59N89m30q58L52O02n15j45K30K70m41l32M03
1872c42O38l45n71N09N06j03o96Q08N53n49l82K94N08m19j38J28j6l02j97M71
1892C55q5l17l80L22J67m13j89L10L96o45l64P17K58n16K23M00K7l67p4N55K14
1913E94m55r6M43K06m75l08N56Q8n60l08N79q0m69l68P57m6o94k20P03K85o65
1934e33J0M10L73n48r9Q36K18p90L22M06j03l45j19N91N7p83J07L17n8o01J17
1955b15M60j55p24K56O54o22j27L8M53k78l12L48O78o63o7N87K7j64j77N93m3
1976E47l80l06M60M85l95o72Q4N76l74l11k4M96m19l71K35L99m13m77K01M60j55
$$ y = [335, 14, -381, -288, 14, -147, -641, -471, -122, -125, -445, -711, -281, 38, -607, -256, 129, 422, -107, -95, 388, 458, 86, 269, 529, 619, 193, -9, 491, 405, -226, -67, 522, 92, -766, -414, 188, -327, -472, -242, 28, -413, -745, -342, 296, -49, -620, -111, 395, 292, -404, 404, 957, 408, 26, 320, 828, 409, 271, 399, 383, 81, -116, 355, 270, -47, -427, -105, 62, -351, -540, -230, 166, -479, -843, -126, 132, -384, -161, 239, 266, -101, -175, 380, 594, 139, 43, 486, 692, 217, -91, 465, 553, -7, -315, 264, 184, -285, -653, 104, 58, -636, -856, -153, 132, -533, -523, -113, 260, -288, -387, 449, 667, -123, 199, 605, 502, 157, 38, 629, 686, -97, 10, 327, 269, -332, -215, 245, 90, -634, -378, 276, -346, -473, -435, 18, -260, -572, -224, 454, -209, -276, 311, 338, 174, -3, 590, 547, 167, -139, 321, 806, 411, -261, -177, 399, 25, -286, -310, 186, -233, -604, -369, 30, -383, -860, -659, -199, -354]
1997c54l93O55O54o61o02J052L51p68l78J028J0o58rO32m9n89M5N71k94p28J06
2018c79M83J79r66J22L05k2l30m3P58m12k30O52J99p24K97J13L80l61J08K64l2
2039C61p2J7J54P3j81m89j17M93rl33k81J78J84o48K41K28j1l01J30L80J6q09
2061g96K27R42j38k76J70M23k34n47K55J021n72n26O78r3p27j48Q62j58j107K32
2081e12Q28j48j082O69N27p42m32O64K00k70j2M17q0l12Q7M12K92n35M0O47m51
2102B07L7L60k06l70Q1N14p09m5L09Q8o75K6L20j16n95K09O03p09m4L82M71q43
2124g05J38J215k87n58j17J251m95n89J65J023o54o15M78N57p23l44O02R8o16
2143a76k15O60k76q86L15P03p30JO80R8o81j84Q98ql82K57O92n48l65N48M10n86
$$ y = [-354, -747, -92, 562, -99, -701, 351, 702, -66, -444, 584, 594, -64, -73, 559, 510, -79, -34, 537, 243, -485, -379, 104, 283, -683, -561, -256, -278, -608, -651, 107, -305, -535, 117, 316, -408, -111, 2, 382, 21, 129, 393, 361, 289, 306, 460, 533, 352, -137, -254, 239, 230, -103, -384, -206, -22, -670, -429, -201, -212, -513, -383, -3, 13, -796, -569, 373, 235, -41, 129, 552, 318, -229, 26, 1047, 475, -51, 627, 534, -193, -341, 521, 363, -744, -512, 316, 168, -914, -245, 282, -460, -892, -228, -28, -298, -310, 107, 27, -285, -198, 214, 506, -29, 11, 658, 207, 244, 604, 398, 28, 109, 623, -86, -131, 178, 266, -409, -383, -63, -179, -774, -565, 38, -671, -715, -333, 138, -705, -567, 648, 361, -197, -314, 937, 442, -147, 18, 1041, 387, -228, 250, 807, 84, -260, 342, 440, -176, -391, 269, -7, -893, -578, 125, -605, -604, 76, 174, -507, -691, 207, 199, -183, 74, 766, 218, -147, 401, 811, 225]
2165B25r6L77n2n96O0P43o58l70N27jn25j92R40m30p29L74N94p03j88O84M79o77
2187b14l87J111J93j158J16J117j57p83O93K29n02n15P05K52r60n4Q24j65j241
2206h96N13N30l66p22O52N24n45m00K81O21n52r3N69K99m04J35N95o63j65L77
2226B90M52o63j43P67j32p24j8P78p05o67P38L85q05k02O77j01m15J79M69l40
2246a80p97J189K41j017K16R32J7r43K78J058m23j047R23L76o11o04P85L26r44
2265b25m52R85q0o76p3P08m11o13O01O22q41k30N64J02j80l23P82j19m71L25Q24
2286H19o49k61Q96l49n08J65L88l34q55N84M98p57j58P65j9q63l35R39J25r92
2306i01L40O79k04o03M88N70m85o18R61L86p17J66P66k26p52K52M69n26j05K89
$$ y = [225, 129, 506, 454, -142, -82, 661, 3, -367, 160, 159, -366, -558, 382, -48, -777, -403, 191, -512, -700, -16, 463, -214, -601, 510, 703, -455, -339, 778, 621, -162, 531, 760, 258, -257, 448, 700, -260, -314, 510, 345, -896, -383, 147, -219, -941, -289, 235, -310, -710, -429, 192, -360, -453, 116, 415, 11, 146, 741, 78, -87, 290, 742, 79, -64, 703, 571, -153, -171, 607, -98, -765, -27, 358, -447, -649, 28, -73, -488, -309, 160, -180, -977, 212, 453, -564, -348, 584, 601, -342, -64, 994, 571, -476, 447, 823, 212, -392, 393, 719, -225, -677, 308, 228, -448, -521, 187, -224, -837, -236, 386, -455, -685, -121, -19, -199, -522, 260, 141, -330, -5, 819, 170, -91, 805, 456, -52, 113, 501, 167, -688, -104, 394, -363, -521, 244, 225, -638, -973, -34, 91, -901, -561, 118, -86, -689, -201, 369, -116, -734, 227, 613, -104, 62, 828, 602, -150, 102, 571, 45, -60, 229]
2326B29kk56k78L54K5m10k51P81m22k59J85L66l05m2K44kk2k42Q13n56j68N25
2348C07M37q33j40P24k62l99M19M23l56q59Q56K77m52p27N55L52j111J52P75q7
2368E1p61K28M86L1q98O50P61o77j01L25N38n38j28N69P3o36O7M42K9k57l11M86
2390D29m17l93M89J2n30Jj8k4O9L63l07pJ15K75R2l34J19N70o36j30R05j27n03
2413A3j97O06M9k08r7K02j84n60L47M44p31l29L84M76o56n35J064j71m72K06N77
2434B28k69n77L21N78j12l95L28M06m77K35J73j06j70J39ML3Rm8n10M13m47j8
2456b62N6J86j29k02L6k00N34l86j28L90L27l32O4J88K15k29j72M44l6n76L45
2477A33M80l33l87L42k9J2n85L65M00q59n1J78M24l59r3K32J61m66K20J99K51
$$ y = [229, 227, -29, -307, 47, 72, -338, -589, 192, -230, -489, -304, 62, -243, -285, -41, -43, -65, -307, 506, -50, -218, 307, 744, -89, -229, 495, 233, -166, 253, 676, 320, -539, 317, 594, 142, -585, -30, 322, -789, -637, 138, 51, -710, -482, 4, 35, -863, -213, 548, -129, -230, 95, 633, 95, -33, 536, 609, -27, 40, 482, 511, 254, -57, 429, 12, -381, 108, 120, -410, -409, -427, -451, -382, -19, -326, -333, -218, 57, 149, -185, -66, 504, -132, -262, 643, 516, 13, -184, 422, 471, 263, 166, 368, 184, -376, -29, 415, -316, -645, -261, 215, -441, -976, 88, -83, -555, -349, 228, -41, -618, -297, 281, 169, -226, 102, 508, 31, 266, 439, 333, 163, 302, 306, 339, 348, 300, -210, 203, -244, -262, -206, -20, -149, -351, -315, -515, 19, -367, -495, -105, 222, -110, -46, 142, 357, 128, -44, 400, 364, -212, 133, 613, 280, -107, 235, 206, 218, -367, -2, 398, -461, -512, -334, 90, -269, -362, -130, 31, -435, -215, -16, 235]
2498B35k96k6M07j61j49K16K52l11o9K31Q5R9o27K47k61K55j03K08j31k61j12
2519b72k72K26J56j71K6r%P9k6L37j4J36q5P6Q5q6k4K55l36j1L77l12J23m1l41
2544a24L82k93j88O7m2J16k21MK70j88j10kJ18Q5J56j69L7J58p3P1R7J43k05k3
2568F6L24j43nJ10n4j24j81K69k20J84n98K30nk69M32m73K51j57rJ96j00K66p7
2591h7j03P5K32j7l6Q7p3N9k5K2J51m6j65Q9J75k51j83l2M52p59O9J77J23l52
2615d18J06L95q1l60M4J91L88m32P0L77m6j99Q3L35k69j9P4M7k84l5J75J12k73
2638a9j7K81q7n02J60L62l87j00J04j56l5L07j61l03L08K10J90l48N53J09m29
2659D0Q6K63J77n11j8M83o7o21K51K18M9m80Q3J03k27l39K34K48k92n71P20j16
$$ y = [235, -61, -87, 320, 159, 10, 226, 478, 167, 98, 329, 414, 513, -114, 133, -128, 127, 24, 232, 101, -160, -272, -544, -318, -162, -333, -307, -316, -316, -237, -263, 74, 60, 196, 111, 187, 272, 186, 162, 417, 81, 70, 447, 135, 258, 217, -124, 258, -35, -223, -156, -198, -82, -303, -299, -29, -217, -327, -329, -211, -126, 30, -139, -102, 56, -17, 54, 151, 294, 89, 66, 390, 247, 242, 352, 298, 174, -7, 262, 42, 226, -372, -142, -147, -416, 16, -457, -206, -363, -372, -176, -276, -10, -87, -190, -115, 117, 100, 64, 151, 78, 137, 112, 134, 285, 239, 74, 163, 338, 87, -96, -128, 324, -435, -366, -189, -66, -418, -312, 83, 2, -358, -314, -123, 265, -167, -97, 280, 234, 35, 118, 453, 184, 165, 239, 286, 2, -33, 142, 254, -19, -36, 245, 158, -344, -184, 178, -209, -309, -205, -361, -396, -89, -250, -553, -245, -35, 155, -193, 360, 469, 40, 126, 389, 566, 55, 37, 520, 453, -168, 83, 301, 350, -130, -47, 56, -171, -510, -276, -28, -320, -891, -171, -287]
2681b87k2KL98j37m76L53N02p8m28L10K95k33l56N37m4k65j32M09k69o4j94N00
2703C21k03m50N6J81n1qn5l16K48R8K52l11K65N5j14J48J94K6k04j49L24K28l47
2726A88j24N06m07l49J5N78l95m28J62N31l49o31N46J85l99k74M56J28n01J49
2746d13P25q6n75J76M42K95o21J93r6L35l03J30K95j45k84m7M8k21j64M64n12
2767c64l0J92J73k80j67L02J3j71J27J90j06M4L35n80N41K4J78m45J39L26j45
2788B96k89K27J69J55o22R0K49Mn52j43O61k69m96K14M31n14q2N57m9o35L27K99
2810B8J12m29K13K84k19J64j22M86n12L04k10K62l04k8J99jm87k34M89kl77J90
2832a94n2Mr6J28K08j43Q4Mj2K5J26k10N4J43K74j90j51K39J86j15j35J21J47
$$ y = [-287, -309, -307, 91, -46, -522, -169, 333, 255, -173, 137, 432, 199, -157, 380, 336, 71, -61, 348, 79, 15, -179, 321, 118, -332, -276, -95, -146, -154, -209, -525, -277, -179, 73, -238, 27, 82, -32, 116, 310, 336, 132, -17, 307, 535, 188, 64, 570, 163, -186, -171, 407, 12, -416, -254, 277, -72, -703, -157, 28, -371, -645, -189, -61, -562, -413, 312, 226, -349, -173, 269, 564, -57, 136, 40, 375, 72, 202, 497, 352, 68, 21, 69, -152, -316, 148, -364, -394, -202, -29, -309, -476, -174, -161, -332, -205, -15, -121, -77, 258, -322, 219, 243, 421, -24, 115, 441, 296, 7, 234, 403, 558, -64, 26, 275, 279, -273, -416, 245, -24, -520, -306, 125, -389, -471, 86, 37, -598, -271, 28, 140, -289, -76, 208, -11, 153, 31, 517, 5, 309, 99, 361, 57, 29, 228, 227, -260, -494, -5, -7, -384, -194, -246, -242, -338, -210, -2, -145, -61, -57, -69, -44, 82, -128, -74, 69, 343, 153, 2, 241, 427, 312, 177, 298, 445]
2855D45m59j49L85j25l52P4L76k32l57J6K83k14qJ92Q8k45q2O08J25m78l5O46
2877E02l49j57N9J35q1j86J07M30k09k62J59K71o57J8J92pk61j48L83J18n41K1
2899d63K33M28n10O3K44K4L02l66K61p1M50n17L2K51j98k14J66J81k94K13p0J05
2921B50q9m50J20K96k25l66K07N20m69r2J28L49n26j42R53k57m95J43N72m6n56
2942a75L1J97J58l62K56P09m87n24R2J11l70j11O7M94j73m71K74L9J95j56J97
2963iq0pj5J23J77l5j29J52K72o5l49j2L29j34j28M0k72L3o9K95m5k81q3o5L20
2988c7l08m4M54l8p4k26K32J62j90j00L55J43k81k01L27L66j85p7k61M05l29q8
3010EO2JjK07k48j02p4P8R8n24O0J54K88n3n4r7K93k46K38J9J64j49j23L45k0
$$ y = [445, -14, -163, 222, 97, -255, -181, 195, -37, -394, -378, -95, -309, -317, -125, -37, -282, -364, 244, 369, -109, -144, 502, 153, -4, 55, 190, 109, -77, 30, 460, 251, -11, 148, 419, -238, -220, -28, -35, -296, -444, -61, 57, -484, -463, -230, 198, -312, -249, -5, 19, 321, -45, 216, 145, 595, 78, 110, 361, 163, -51, 115, 296, 2, 215, 145, 250, 161, -289, -169, 127, -98, -464, -257, 263, -206, -298, -170, 179, -347, -489, 464, 207, -288, -145, 427, 381, -175, -144, 53, 211, -151, 105, 814, 327, -197, -105, 6, -364, -475, -408, 86, -87, -558, -284, -245, -50, -206, -9, -89, -96, -111, 12, 189, 154, 25, 177, 449, 384, 35, 23, 352, 218, 90, 130, -142, -109, -178, 117, 72, -209, -292, -357, -37, -345, -389, 65, 27, -47, -273, -41, 121, -69, -169, 186, 329, 48, -153, 174, 540, 355, 278, 17, 422, 93, 5, 67, 68, 67, 274, 26, -76, -150, -72, 26, -498, -438, -284, 4, -49, -103, -200, 93, -153, 85, 104, 268, 119, -4, 341, 321]
3035C21j40J35j15j13J22j96Q4o9J54j63K07n01J15k42L05K48k98j11J76k85O5
3056c01J21M17n8k79k1J94o2L02l38J65R8L5N4l82M20l30O5n2l9P6o3j43Q7K15
3080A81m30J38j73J51p8p7L78k48K24j20J96k23j12J73K21%J08k55O3P6M0k86
3102e3K01J5k2k88J45P7j07p5j47J55J08m64L51OL9l20K97J65q1j34pL76j51l6
3126E0L15J33n27K30J14Q3m06J48p9Q8k27P6q6J0p6J25L20m45l37K45O8j32J3
3149b97Q8K81j79j31J90mJ79R0j41J83L7j4l22J34J24q4r7kR9l45P7K37j32q6
3173a15r9K78q0l87R3L55j17k34p5L48P0k73K98L7k35K71P8J13j41j63L06l49
3195b1P6N4K49m20J6o2K33l64j35L29j13Q9r8rl8K21j14K5M4J31j48K2K21j85
$$ y = [321, 181, 316, 201, 88, 210, 14, 98, 29, 183, 20, 227, -274, -159, -401, -96, 152, -146, -257, -81, -366, -301, -180, 237, 179, -100, -121, 73, 11, 313, -25, 140, 238, 273, 327, -55, 365, 35, 100, 48, 9, 85, 22, -121, -34, 181, -249, -111, -284, -133, -211, -288, 90, -158, 66, -54, 142, -81, -193, -20, 201, 201, 309, 54, 117, 193, 233, -53, 148, 163, 141, -147, -2, 75, -32, -107, -254, -99, 9, -455, -104, -98, -59, -379, -82, 83, 2, -132, -139, 237, 86, 50, 365, 498, -29, 201, 315, 398, -8, 140, 61, 149, -78, -2, -88, -78, -154, -29, 291, -154, -491, -246, -178, -310, -297, -209, 72, -107, -238, -48, -52, 127, 217, 76, 259, 296, 282, -40, 94, 218, 134, 37, 35, 134, -211, -134, 103, -29, -115, -214, 64, -16, -403, -310, 45, -72, -306, -381, -33, 37, -236, 62, 99, -136, 135, 213, 326, 185, 22, 328, -21, 55, 109, 358, -62, -46, -108, 125, -239, -374, -45, -158, -69, -167, -176, -214, 7, -107, -82, -38, 93, -55, -33, 188, 3]
3219CK02j04J5J44j24j2J13J27j40k88R0J82j40l66Q9M27m19J4K57l01m07L57
3241b81L87Q7n22J29K50L47o94L42L84k27m14M12J88m85K6K24K29l21pM57l51
3262A60j55J1j89lp6r0L97j79LO3p2M1J7J08j7P8M0J22j91J74j48O9k27K49j41
3287D4K04j48P9k05k3J7N27o09J27n8K21l31l71L85o7J42j53K0J16q9l3N33l06
3310B2M7j88L46j28k34K62P1k32R5K43l5l29J96K33l10p3K4R3k74k6k57L72j29
3333b11p4nJ99j30j7L78j94L5Q6J05l99K14J38J77k78L25J13l70o5L27l8o22L42
$$ y = [3, 205, 101, 116, 260, 136, 124, 237, 364, 224, -64, 26, 208, 68, -298, -209, 218, -201, -187, 70, -231, -638, -281, 106, 193, -329, -200, 50, 397, -297, 45, 429, 202, -212, 200, 388, -97, -71, 153, 382, 61, 54, 511, 160, 5, 16, -173, -176, -252, -342, 55, -124, -121, -58, -130, -89, -72, 36, 19, 97, 137, 259, 68, 242, 94, 163, -64, 185, 44, 248, 100, 179, -26, -49, -32, 495, -114, 13, -45, 176, -155, -526, -141, -208, -66, -219, -199, -83, -172, -205, 328, 22, 69, -119, 227, 99, -135, 127, 198, -34, 61, 304, 269, -60, 136, 369, 59, -14, 10, 103, -171, -197, -454, -82, -211, -285, -290, -91, -221, -238, 140, -54, -19, 67, 172, -227, -13, 125, 302, 24, 349, 462, 92, 27, 354, 316, -306, 36]
$$ [...]
8191D7
##END NTUPLES=NMR FID
##END=
