##TITLE=1H_Pr 3CF3
 CDCl3
 8 sc, 
 5.05.2022
##JCAMPDX= 6.0         $$ Bruker NMR JCAMP-DX V2.0
##DATA TYPE= NMR FID
##DATA CLASS= NTUPLES
##ORIGIN= UXNMR, Bruker Analytische Messtechnik GmbH
##OWNER= root
$$ XWIN-NMR		Version 3.5
$$ Thu May  5 10:43:26 2022 Russian Standard Time (UT+4h)  she@DPX200
##.OBSERVE FREQUENCY= 200.13135
##.OBSERVE NUCLEUS= ^1H
##.DELAY= (6, 6)
##.ACQUISITION MODE= SIMULTANEOUS
##.ACQUISITION SCHEME= undefined
##.AVERAGES= 8
##.DIGITISER RES= 18
##SPECTROMETER/DATA SYSTEM= spect
##.PULSE SEQUENCE= zg30
##.SOLVENT NAME= CDCl3
##.SHIFT REFERENCE= (INTERNAL, CDCl3, 0, 15.7039)
##AUDIT TRAIL= $$ (NUMBER, WHEN, WHO, WHERE, WHAT)
$$ ##TITLE= Audit trail, XWIN-NMR		Version 3.5
$$ ##JCAMPDX= 5.01
$$ ##ORIGIN= Bruker BioSpin GmbH
$$ ##OWNER= she
$$ F:/spectra/data/she/nmr/H-F/1/audita.txt
$$ ##AUDIT TRAIL=  $$ (NUMBER, WHEN, WHO, WHERE, WHAT)
(   1,<2022-05-05 10:42:11.26 +0400>,<she>,<DPX200>,
      <created by zg, POWCHK disabled, PULCHK disabled
       configuration hash MD5:
       00 E9 B6 7A A2 85 ED C7 34 08 36 98 17 FE 4E 26
       data hash MD5: 16K
       8F 96 31 30 E3 AD 77 BE B6 03 B4 4A 43 03 DC EF>)
$$ ##END=
$$ 
$$ hash MD5
$$ D7 57 46 0E 62 58 82 9A 1E 5D 9A F6 CE CD 9F 4B
##$RELAX= 
##$RELAX= 
##$RELAX= 
##$RELAX= 
##$RELAX= 
##$RELAX= 
$$ Bruker specific parameters
$$ --------------------------
##$DU= <F:/spectra>
##$EXPNO= 1
##$NAME= <H-F>
##$PROCNO= 1
##$TYPE= <nmr>
##$USER= <she>
##$AMP= (0..31)
100 100 100 100 100 100 100 100 100 100 100 100 100 100 100 100 100 100 
100 100 100 100 100 100 100 100 100 100 100 100 100 100 
##$AQSEQ= 0
##$AQ_mod= 1
##$AUNM= <au_zg>
##$AUTOPOS= <>
##$BF1= 200.13
##$BF2= 200.13
##$BF3= 200.13
##$BF4= 200.13
##$BF5= 200.13
##$BF6= 200.13
##$BF7= 200.13
##$BF8= 200.13
##$BYTORDA= 1
##$CFDGTYP= 0
##$CFRGTYP= 5
##$CHEMSTR= <none>
##$CNST= (0..31)
1 1 145 1 1 1 1 1 1 1 1 1 1 1 1 1 1 1 1 1 1 1 1 1 1 1 1 1 1 1 1 1 
##$CPDPRG= <>
##$CPDPRG1= <>
##$CPDPRG2= <>
##$CPDPRG3= <>
##$CPDPRG4= <mlev>
##$CPDPRG5= <mlev>
##$CPDPRG6= <mlev>
##$CPDPRG7= <mlev>
##$CPDPRG8= <mlev>
##$CPDPRGB= <>
##$CPDPRGT= <>
##$D= (0..31)
0 1.2 0 0 0 0 0 0 0 0.06 0 0.03 0 0 0 0 0.0002 0 0 0 0 0 0 0 0 0 0 0 0 
0 0 0 
##$DATE= 1651732930
##$DBL= (0..7)
120 120 120 120 120 120 120 120 
##$DBP= (0..7)
150 150 150 150 150 150 150 150 
##$DBP07= 0
##$DBPNAM0= <>
##$DBPNAM1= <>
##$DBPNAM2= <>
##$DBPNAM3= <>
##$DBPNAM4= <>
##$DBPNAM5= <>
##$DBPNAM6= <>
##$DBPNAM7= <>
##$DBPOAL= (0..7)
0.5 0.5 0.5 0.5 0.5 0.5 0.5 0.5 
##$DBPOFFS= (0..7)
0 0 0 0 0 0 0 0 
##$DE= 6
##$DECBNUC= <off>
##$DECIM= 32
##$DECNUC= <off>
##$DECSTAT= 4
##$DIGMOD= 1
##$DIGTYP= 9
##$DL= (0..7)
0 120 120 120 120 120 120 120 
##$DP= (0..7)
150 150 150 150 150 150 150 150 
##$DP07= 0
##$DPNAME0= <>
##$DPNAME1= <>
##$DPNAME2= <>
##$DPNAME3= <>
##$DPNAME4= <>
##$DPNAME5= <>
##$DPNAME6= <>
##$DPNAME7= <>
##$DPOAL= (0..7)
0.5 0.5 0.5 0.5 0.5 0.5 0.5 0.5 
##$DPOFFS= (0..7)
0 0 0 0 0 0 0 0 
##$DQDMODE= 0
##$DR= 18
##$DS= 0
##$DSLIST= <SSSSSSSSSSSSSSS>
$$ [...]
##$SUBNAM2= <"">
##$SUBNAM3= <"">
##$SUBNAM4= <"">
##$SUBNAM5= <"">
##$SUBNAM6= <"">
##$SUBNAM7= <"">
##$SUBNAM8= <"">
##$SUBNAM9= <"">
##$SW= 18.05172834244
##$SWIBOX= (0..15)
0 0 2 0 0 0 0 0 0 0 0 0 0 0 0 0 
##$SW_h= 3612.71676300578
##$TD= 16384
##$TD0= 1
##$TE= 0
##$TE2= 300
##$TE3= 300
##$TEG= 300
##$TL= (0..7)
0 120 120 120 120 120 120 120 
##$TP= (0..7)
150 150 150 150 150 150 150 150 
##$TP07= 0
##$TPNAME0= <>
##$TPNAME1= <>
##$TPNAME2= <>
##$TPNAME3= <>
##$TPNAME4= <>
##$TPNAME5= <>
##$TPNAME6= <>
##$TPNAME7= <>
##$TPOAL= (0..7)
0.5 0.5 0.5 0.5 0.5 0.5 0.5 0.5 
##$TPOFFS= (0..7)
0 0 0 0 0 0 0 0 
##$TUNHIN= 0
##$TUNHOUT= 0
##$TUNXOUT= 0
##$USERA1= <user>
##$USERA2= <user>
##$USERA3= <user>
##$USERA4= <user>
##$USERA5= <user>
##$V9= 5
##$VALIST= <valist>
##$VCLIST= <CCCCCCCCCCCCCCC>
##$VD= 0
##$VDLIST= <DDDDDDDDDDDDDDD>
##$VPLIST= <PPPPPPPPPPPPPPP>
##$VTLIST= <TTTTTTTTTTTTTTT>
##$WBST= 1024
##$WBSW= 4
##$XGAIN= (0..3)
0 0 0 0 
##$XL= 0
##$YL= 0
##$YMAX_a= 207840
##$YMIN_a= -243082
##$ZGOPTNS= <>
##$ZL1= 120
##$ZL2= 120
##$ZL3= 120
##$ZL4= 120
##$ABSF1= 10
##$ABSF2= 0
##$ABSG= 5
##$ABSL= 3
##$ALPHA= 0
##$AQORDER= 0
##$ASSFAC= 0
##$ASSFACI= 0
##$ASSFACX= 0
##$ASSWID= 0
##$AUNMP= <proc_1d>
##$AZFE= 0.1
##$AZFW= 0.1
##$BCFW= 1
##$BC_mod= 2
##$BYTORDP= 1
##$COROFFS= 0
##$CY= 11.3945322036743
##$DATMOD= 1
##$DC= 2
##$DFILT= <>
##$DTYPP= 0
##$F1P= 2.36226072786647
##$F2P= -0.459571619588291
##$FCOR= 0.5
##$FTSIZE= 0
##$FT_mod= 4
##$GAMMA= 1
##$GB= 0.15
##$INTBC= 1
##$INTSCL= 1
##$ISEN= 128
##$LB= 0.24
##$LEV0= 0
##$LPBIN= 0
##$MAXI= 10000
##$MC2= 0
##$MEAN= 0
##$ME_mod= 0
##$MI= 1.114404
##$NCOEF= 0
##$NC_proc= 0
##$NLEV= 6
##$NOISF1= 3.799351
##$NOISF2= 2.8
##$NSP= 1
##$NTH_PI= 0
##$NZP= 0
##$OFFSET= 15.70392
##$PC= 1
##$PHC0= -18391.74
##$PHC1= 13.00075
##$PH_mod= 1
##$PKNL= yes
##$PPARMOD= 0
##$PSCAL= 0
##$PSIGN= 0
##$REVERSE= no
##$SF= 200.130013532006
##$SI= 16384
##$SIGF1= 3
##$SIGF2= 2
##$SINO= 400
##$SIOLD= 16384
##$SREGLST= <1H.CDCl3>
##$SSB= 0
##$STSI= 0
##$STSR= 0
##$SW_p= 3612.71676300578
##$SYMM= 0
##$S_DEV= 0
##$TDeff= 0
##$TDoff= 0
##$TI= <>
##$TILT= no
##$TM1= 0
##$TM2= 0
##$TOPLEV= 0
##$USERP1= <user>
##$USERP2= <user>
##$USERP3= <user>
##$USERP4= <user>
##$USERP5= <user>
##$WDW= 1
##$XDIM= 8192
##$YMAX_p= 0
##$YMIN_p= 0
$$ End of Bruker specific parameters
$$ ---------------------------------
##NTUPLES= NMR FID
##VAR_NAME=  TIME,          FID/REAL,        FID/IMAG
##SYMBOL=    X,             R,               I
##VAR_TYPE=  INDEPENDENT,   DEPENDENT,       DEPENDENT
##VAR_FORM=  AFFN,          ASDF,            ASDF
##VAR_DIM=   8192,          8192,            8192
##UNITS=     SECONDS,       ARBITRARY UNITS, ARBITRARY UNITS
##FACTOR=    0.0002768,     1,               1
##FIRST=     0,             0,               0
##LAST=      2.2672688,     0,               0
##MIN=       0,             -243082,         0
##MAX=       2.2672688,     207840,          0
$$ Real data points
##PAGE= N=1
##DATA TABLE= (X++(R..R)), XYDATA
$$ [...]
1879H15K4o16P27N3j10m41J77J04n30j29k9N4j87n40J84J76m39j84K75J54l52
1900h14r3N87K74k89J60L87M0L0L12l5K8L6K50l80J32J95l98K9M70o80k69o8J48
1923E2l72j50j02J90k49k75Q7J87jk11J68O36j45l35N16L28j65Q0K50L05m79J26
1945D41N41l27Rj25J28l19J52k86j48j72p2j69K58j83k85k89K92K25n47K86j59
1966g49M73j71J00J79K58o3J12L25O8nl7M24k3m47j10K55k23j50l02L68o8m92
1988b78o9J87m50J17k60K66J05k90L7K11N5j89J57K78L12n40K34P63k38l79O83
2009G12J70q4n35N15j91k02k34K36j16j32n25L76k55l28k42K87J87m49j53M55
2029e08O6k88K23L68j17K00n2L10JK40nJ5J06M40k88j07J41m14J28k11pj52k17
$$ plain form
1879 815 839 223 950 1003 893 452 629 733 203 74 45 99 -88 -628 -444 -268 -707 -891 -616 -462 -814
1900 -814 -907 -320 -46 -335 -175 212 252 282 594 559 587 623 873 493 625 820 422 451 921 241 -28 -96 52
1923 52 -320 -470 -572 -382 -631 -906 -819 -632 -633 -844 -676 -40 -185 -520 -4 324 159 239 489 794 315 441
1945 441 982 655 664 539 667 348 500 214 66 -106 -178 -347 -89 -272 -557 -846 -554 -329 -876 -590 -749
1966 -749 -276 -447 -347 -168 90 27 139 464 532 527 490 914 891 444 334 589 366 216 -86 282 214 -278
1988 -278 -347 -160 -610 -493 -753 -487 -382 -672 -635 -424 -369 -558 -401 -123 189 -351 -117 646 408 29 712
2009 712 882 798 263 778 587 385 151 387 271 139 -386 -10 -265 -593 -835 -548 -361 -810 -963 -508
2029 -508 -442 -730 -507 -139 -256 -56 -108 202 203 443 438 453 559 999 711 604 745 331 459 248 241 89 -128
2052a28J2j44l34k0O1N3k16L74k87O8j58K00K91L3P5j72O60q8j45n0M38o2J23
2075E84j79L95n06Q7L2N1m05K07j93Q4l50m06K54J57n43J72l10o1K67l1M90J24
2097h0l95M96J89R8k07K25K71k00L56j17M0m27O18l80k3k00K02m45m0l48L66l28
2119c29J22k24N4l69O2J36K81m28l4M00nK5J71K83Q9j01L25J26M9j45P5J93j96
2142E60J19j20k73j06p2L02m54l20J06O5j53j18m0n1j67L30j25J29k05M08o1K63
2164A7j1P1L93l94L83j71J55M42j38k51K17l96K46k35j03k45L40j52l51j74K04
2185a53m20n0O32o04j04l6J81K78j74J60K86P2j49K83K85k09RJ07N74m80k50M47
2207F85j41j78p3J54p0m02j94J10k70j75J99k60K53l63J90n2l8J35L91k64j1K76
$$ plain form
2052 -128 -116 -260 -594 -614 -553 -500 -716 -342 -629 -561 -719 -519 -228 -195 -120 -292 368 280 135 85 523 461 584
2075 584 405 800 294 381 413 464 59 266 73 157 -193 -599 -345 -188 -731 -559 -869 -930 -663 -694 -204 -80
2097 -80 -475 21 210 308 101 326 597 397 753 636 676 249 867 487 464 264 466 21 -19 -367 -1 -329
2119 -329 -207 -431 -377 -746 -684 -548 -267 -695 -729 -329 -334 -309 -138 145 234 133 458 584 633 488 563 756 560
2142 560 679 559 286 180 108 410 -44 -364 -258 -193 -346 -464 -504 -555 -722 -392 -517 -388 -593 -185 -246 17
2164 17 6 77 470 76 459 288 443 885 747 496 713 317 563 328 225 -20 320 168 -183 -357 -153
2185 -153 -573 -623 9 -595 -699 -735 -554 -276 -450 -290 -4 68 -81 202 487 278 287 394 968 488 238 685
2207 685 544 366 293 447 377 -25 -219 -109 -379 -554 -355 -615 -362 -725 -535 -587 -625 -490 -99 -363 -374 -98
2229i8K77j27K93K60j91J53m5jP3k9k32J12j78J22o3p9j80j05K7n51j11M48m4
2252b69j85m57N17Q8m46K20O19m31L51J4K21q0K84n2j53J18J02m9M99k69m55L35
2274E22p5o35K05L73n45j49K27j63l39k25O10l91j87N18j38k6O5J24pJ16L65L1
2296B76J1kM61j12kj67J12N0k96r3J64o2j77k19L42l85k35n4J28k26q5M9J38l79
2320g63J41K66o3l23N18L87k76K30J73l5J28N7J17K58p0j24j55o5j18r9J23k70
2342C7j30J22J34n46j14L75l29p5Q5N1K0l81P21k59Q0K82k16K52P1j6K14M6p2
2365C52J12J3J4M7j98L37j84m44L94n48l14j9J67O3j93R8j70k07J79Q0J12j22
2387d31o0L26J45r8K40K70Q2j36j84L48lq3j69K20o7J82m24k40J81p6k31J67j93
$$ plain form
2229 -98 179 52 345 605 414 567 522 521 594 565 333 445 267 389 326 247 67 -38 -11 -562 -673 -225 -269
2252 -269 -454 -911 -394 -306 -752 -532 87 -344 7 21 242 162 446 394 241 359 461 412 911 642 187 522
2274 522 447 -188 17 390 -155 -304 -77 -240 -579 -804 -194 -585 -772 -254 -392 -418 -353 -229 -236 -120 245 276
2296 276 287 285 746 634 632 465 577 627 331 238 402 340 163 -56 286 -99 -334 -388 -260 -486 -571 -522 -384 -763
2320 -763 -622 -356 -419 -742 -224 163 -113 117 290 255 383 440 557 815 745 621 466 401 283 184 307 37
2342 37 -93 29 163 -383 -497 -122 -451 -526 -441 -390 -370 -751 -30 -289 -209 73 -143 109 180 164 378 424 352
2365 352 464 477 491 538 340 677 493 49 443 -105 -419 -438 -271 -208 -401 -303 -473 -680 -501 -421 -309 -431
2387 -431 -491 -165 -20 -118 122 392 474 338 154 502 499 416 247 467 400 582 158 -82 99 23 -208 -41 -234
2410b34j79P7l16J91J1j7j79K95J66k49M38N8k56K37L35J0l19K81J67m8j31j49
2432A89K54p3j41J56j39j89k5l18J69q2l94K15qO7j6M6N1l39k21O94l83L26J80
2455A9j25J77L38k71L27m40L68O9m0N9kk50j31K56p5r7j41l6k62J53J01k88j02
2478c93J0j4J51j94M3J34K6j4K1K96J00Ro2K74j43q8L86k98J08R4j04J81j81k59
2502H3J32j29l03J60l24J96l97J88K39k77p5J15j08%J74J70J64J09O9j01K14M
2524C03K94k28N4N5k2J4O2j1j21j05n9k97n5J8k14n3r5J30q1l5J5K98j55j54L72
2549g0k58L03M1ML3J39K92l60K11l1j3J1O0j13nJ10j67j72J44rJ69m25n4k18q0
2574d58mM06n43J89O1J30Mk26J26N9K01K23o5J69kJ38j07J33k04Q4k70L06L2k03
$$ plain form
2410 -234 -413 -336 -652 -461 -450 -467 -646 -351 -185 -434 4 62 -194 43 378 388 69 350 517 469 338 189
2432 189 443 370 229 385 246 57 32 -286 -117 -199 -593 -378 -386 -319 -335 -289 -238 -577 -798 -104 -487 -161 19
2455 19 -106 71 409 138 465 25 393 462 422 481 479 229 98 354 279 182 41 5 -257 -104 -3 -291 -393
2478 -393 -383 -397 -246 -440 -397 -263 -237 -251 -230 66 166 175 113 387 244 156 542 244 352 446 342 523 342 83
2502 83 215 86 -217 -57 -381 -185 -582 -394 -155 -432 -507 -392 -500 -500 -326 -156 8 117 186 85 299 303
2524 303 597 369 423 478 456 470 532 521 400 295 236 -61 -116 -98 -312 -365 -460 -330 -411 -446 -431 -133 -288 -442 -70
2549 -70 -328 -25 16 20 53 192 484 124 335 304 291 302 362 249 244 354 187 15 159 150 319 -106 -160 -378 -458
2574 -458 -462 -56 -599 -410 -349 -219 -215 -441 -315 -256 -55 168 103 272 270 408 301 434 230 314 44 350 382 179
2598A79o1p8j1J25m04M4J00k42j71L40N6l41K25j85P3L51l60K49R0q0J58J84k8
2621B13J64k06J78L03m52L5J81p1o6j36Q5n1l00K08o2p07J88K31o1k1l04N44k26
2644c33o2J20M9mJ91L22q8L4K72j88J59J29k08j03J88P0j80N5k21p8O0m25l8M6
2668b33R7N9l7m9l84k0K77q2J42r6k6K32J96j6P8Q7j08k55K97K60J07l11J93j26
2692B82q6K02j5j27l50L08j87q1l80M63m39K70j48j65J18R3j65j69M97j43J46
2713g6j22J76N25k25j27L83k09k00J15R6K22k00P6k60l7o1n9J55k13j81j19L6
2735c05R4k61J39Q9j17pJ06K06j31l20N26J22J32j43ML83m91J52K71j28M4l00
2757F5Q6K12m08K22P1k19k29J63k35r2l3K29k22J36k3k5L7J30K07k09k5K08K19
$$ plain form
2598 179 118 40 29 154 -250 -206 -106 -348 -519 -179 -123 -464 -239 -424 -351 0 -360 -111 -21 -101 57 241 213
2621 213 377 171 349 652 200 235 416 345 279 143 228 177 -123 85 23 -684 -496 -265 -326 -347 -651 -107 -333
2644 -333 -395 -275 -226 -230 -39 283 195 229 501 313 472 601 393 290 478 548 368 423 202 124 184 -241 -279 -233
2668 -233 -136 -77 -114 -163 -547 -567 -290 -372 -230 -326 -352 -120 76 60 138 225 117 -138 159 419 526 215 408 282
2692 282 196 398 383 256 -94 214 27 -54 -434 29 -410 -140 -288 -453 -335 -242 -407 -576 -79 -222 -76
2713 -76 -198 -22 503 278 151 534 325 125 240 336 558 358 434 174 137 76 17 172 -41 -222 -341 -305
2735 -305 -211 -472 -333 -244 -361 -368 -262 -56 -187 -507 19 141 273 130 134 517 26 178 449 321 365 65
2757 65 151 363 -45 177 248 29 -200 -37 -272 -364 -397 -168 -390 -254 -277 -302 -265 -135 72 -137 -162 46 265
2780B65q2j72K93r8j75L69j17O7n9n2K40j97J16p4j45o21K75j28l0JR6k7qj03
2804c66N3J47j79J27j2K54j86J95O2Q4J04RM5N0p7J31L8o38M55j01%k59J95k15
2828h4Q3o8k4J7j94Mk45K6K79k0r1R1R9K35j74j03L91L2l0k36L90K4j61J11J18
2853D70k1k56j74L40l16m19L85K76l13r6J19j91j03j77M0J8J77n8j24K17J50k0
2875g6J60QK8N5RJ11J39n6j47J55K22m82M43k92l92L98n05K32J9k72k62J09J53
2898b43n1j34J56l9J9m5K50J5M9j00J73m6j4K87N3O1qj12J19M1j62J79k69m2j14
2923B3J23l07Q2j73Q9k21J00n1mk37K77j65K75n7k4L59k16k5K13J5J54O0lk2Q1
2948C46J01k20M4j3j64J2K55j41l59J66k41j09k2r6R0J66R8k84M30l37Q9M3q8
$$ plain form
2780 265 183 11 304 206 31 400 283 350 291 239 479 282 398 324 179 -442 -167 -295 -325 -324 -228 -255 -263 -366
2804 -366 -313 -166 -345 -218 -230 24 -162 33 95 179 283 292 337 387 310 441 479 -159 296 195 195 -64 131 -84
2828 -84 -1 -69 -93 -76 -270 -266 -511 -485 -206 -226 -317 -226 -127 108 -66 -169 222 254 224 -12 378 402 241 352 470
2853 470 449 193 19 359 43 -376 9 285 -28 -124 -5 -196 -299 -476 -436 -418 -241 -299 -423 -206 -56 -76
2875 -76 84 92 120 175 184 295 434 378 231 386 608 126 569 277 -115 283 -222 10 29 -243 -505 -396 -243
2898 -243 -294 -428 -272 -311 -292 -337 -87 -72 -23 -123 50 4 -10 277 330 391 383 271 390 431 269 448 179 137 23
2923 23 146 -161 -79 -252 -163 -384 -284 -335 -339 -576 -299 -464 -189 -246 -270 89 -127 -152 61 76 230 290 287 265 346
2948 346 447 227 271 258 94 106 361 220 -139 27 -214 -323 -345 -441 -351 -185 -87 -371 59 -278 -189 -146 -234
2971b34J94J71p6RL01m8M3k6j9K39m7k90Q4J10j87q8K1l20J7J0ON9j36J28q0k49
2997d08K52o0j28Q6L25j06p2L5J13R0l1J50j47R2k3j01K36P9j50J75m4k45r5P5
3021I8l9k45K04k94l5KJ26k98K2P7O9P7m8K21n9K78k9L66o71L68R0j45m4L27J14
3046E32n00K61l04J61J41m93K33k03J57q2l0m9J52j75k1J00k80L41j78K05K2j79
3068a89lJ83O1L5J7L61m9k93j11K52K5J8J18j63l2j2m4k85J96l62J8Q7j87oj7
3093c82J04J75k41J07K87j81K93j66l7J21l2J91j07J22n5J16MK23m30J82M5j27
3115B12k26n4K38k25K9j18j75J27J8mO5k26L5M8J47R1J44l72J70lK07L7q4Q1J91
3140C53j5o1k51L13k26J64k01J23n7l62K68j02k80L00m52L67l43J50K69k20k02
$$ plain form
2971 -234 -40 131 55 64 365 317 360 334 315 554 507 217 301 411 224 136 157 -163 -146 -136 -130 -71 -207 -79 -159 -408
2997 -408 -156 -216 -344 -258 67 -39 -111 -76 37 127 96 246 99 191 168 67 303 382 232 407 363 118 23 98
3021 98 59 -186 18 -276 -311 -309 -183 -481 -459 -382 -313 -236 -284 -63 -122 156 127 493 -178 190 280 135 91 418 532
3046 532 32 293 -11 150 291 -202 31 -172 -15 -97 -127 -176 -24 -199 -220 -120 -400 -59 -237 -32 -10 -189
3068 -189 -192 -9 52 87 104 465 416 123 12 264 289 307 425 262 230 218 174 -111 85 -277 -259 -172 -359 -365 -382
3093 -382 -278 -103 -344 -237 50 -131 162 -4 -41 80 48 239 132 254 199 315 319 542 112 294 339 212
3115 212 -14 -68 170 -55 -26 -144 -319 -192 -174 -178 -113 -339 -304 -256 -109 -18 126 -246 -76 -79 128 165 81 162 353
3140 353 338 277 26 339 113 277 76 199 142 -220 48 -54 -334 -34 -486 -119 -462 -312 -43 -263 -465
3161d65M73k93k3M16n4n2j12J14R9P6K01k12q1K78j90R4j62R0k23j34J65Lj9L4
3185B3l78L60l18J19j68Q4L72j57J6l2j89J16K23l2J39K5K06R5k15l3k16K55j75
3208A20N8p2p4L62n04N7N3Rk11K45l07K8k8Q6k73L35j31j45L58k91J86J62j71
3231a48J70L06j13j6jj8Jj46q3J00L44j26n0k83K10J55l19J57k31K26j0m23K4
3254b74J30p8Q0j07K86j92J56j50K28J83j30J57q4q5K48L0j74Q6Q9j11q9k90K35
3277A44j20j64K22k14M03n53k9K1jM6j20K05l3j71L80j81k9K12j80L56j48K11
3299B57o1n3K13k03J7n0L2K26k97qn9q1R3k04J83k62k64K57k70K61J59j25J74
3322f5o7r1J21NJ11J8j7r7K5K02NJ06J25J5j81o0J22j34r8J19j2J24m01J38m1
$$ plain form
3161 -465 8 -285 -308 108 54 2 -110 4 103 179 380 168 87 365 175 269 107 197 -26 -160 5 8 -11 23
3185 23 -355 5 -313 -194 -362 -278 94 -63 -47 -79 -268 -152 71 39 178 203 409 504 289 256 40 295 120
3208 120 178 106 32 394 -110 -53 0 9 -202 43 -264 -236 -264 -178 -451 -116 -247 -392 -34 -325 -139 23 -148
3231 -148 22 328 215 199 198 180 181 35 -48 52 396 270 220 -63 147 302 -17 140 -91 135 125 -298 -274
3254 -274 -144 -222 -142 -249 37 -155 1 -149 79 262 132 289 205 120 368 398 224 310 399 288 199 -91 144
3277 144 24 -140 82 -132 271 -282 -311 -290 -291 -245 -365 -160 -193 -364 16 -165 -194 18 -162 194 46 257
3299 257 196 143 356 153 170 120 152 378 81 73 14 -67 26 -178 5 -257 -521 -264 -534 -273 -114 -239 -65
3322 -65 -132 -223 -102 -97 14 32 15 -82 -57 145 150 256 381 396 215 155 277 143 45 164 152 276 -125 13 -28
3347b8qj07r4L11l94J21O1RK8j5J5j60L09j49J01J30K73l02K12k05j23K16j57
3370D4J62M5k54J59m0j40j83L63l97K61j50o7J98j79J7j69K82m59N39k96L18j52
3392i8K10J4j63O51k30k04J47j79p5m6P7j6L12m95PJ87j49J05l5J6l82K38k1Q
3416a21k16K67J9j49j9m7K43o0r7K43j75J63J94K64j65n7r2j47K36l40K41J30
3438C15l80J2J37Q0K4j94k33j27K78j88K02n3m6pJ76O1Ok2o5J30p4J93n6j17R0
3463A42R5j08J07j94J98k52K73l36R0j17j98K52l3l30J48K04k08k0J41J24k22
3484b44m8L49j41J23R3J2k21P8N3J05k39J35L5L52n60K22J6K2R5j19J71k47j62
3507a20j46m9K60J6k20q3J12l14K45Q5l5J06K8J17M7O3m2k12L78P3j44M6j16J84
$$ plain form
3347 -28 -36 -143 -237 74 -320 -199 -138 -129 -101 -116 -101 -261 48 -101 0 130 403 101 313 108 -15 201 44
3370 44 206 251 -3 156 116 -24 -207 156 -241 20 -130 -197 1 -178 -161 -330 -48 -507 32 -264 54 -98
3392 -98 112 126 -37 614 384 180 327 148 73 27 104 88 400 -95 -88 99 -50 55 20 36 -346 -108 -129 -121
3416 -121 -337 -70 -51 -200 -219 -266 -23 -83 -180 63 -112 51 245 509 344 287 195 48 284 -56 185 315
3438 315 -65 -53 84 164 188 -6 -239 -366 -88 -276 -74 -127 -173 -180 -4 57 63 41 -24 106 32 225 169 52 142
3463 142 237 129 236 42 240 -12 261 -75 15 -102 -300 -48 -81 -411 -263 -59 -267 -287 -146 -22 -244
3484 -244 -292 57 -84 39 132 144 -77 1 54 159 -80 55 90 442 -118 104 120 142 237 118 289 42 -120
3507 -120 -266 -315 -55 -39 -259 -342 -230 -544 -299 -214 -249 -143 -115 2 49 112 70 -142 236 309 165 211 95 279
3531B79j16p8j2j06O8K45l96O6nJ77k14O5k27r9K38o0J36Q2R2k09mJ33j05j0k1
3556h1J06O7K73j27J52l6j07n4j06K8J1k38J85L8j18ro1j40J08j65q4L57j21L
3580a19k17K00J24r6j47J79Q3M1l2J43o7J54j9j12J30j5j27j16J92j27R2j88J67
3603A23l14mP1J03p1j09O1K11n5j64J45K0k07k40N29k10L4l1J44L3O7k36L20j19
3627A01M58k82l73K78k21joJ32m33L19j75L2j66P1M6J01j32p8j11J89J46Qo5J63
3651AL0L22j76j34j3J59K01j91r0K9Q4k61L49l68J52J7k31K86l86R7r3j59L73
3674bNJ4l73J47J27l21M14l9P6j51K54p2Q6j6M9L5j52M1K24j5m48L67k43J17K29
3699C53n36J22j34R0j9l3j02N73n60J31k03K35L3j57J28K20l14M64k92K48l3L0
$$ plain form
3531 279 163 85 73 -33 35 280 -116 -50 -55 122 -92 -27 -254 -353 -115 -175 -39 43 135 -74 -78 55 -50 -60 -81
3556 -81 25 92 365 238 390 354 247 193 87 115 126 -112 73 111 -7 -16 -77 -217 -109 -274 -358 -1 -122 -119
3580 -119 -336 -136 -12 -108 -255 -76 7 48 16 159 92 246 227 115 245 230 103 -13 179 52 144 -44 123
3603 123 -191 -195 -124 -21 -92 -201 -140 71 16 -148 -3 17 -190 -430 99 -111 -77 -108 36 69 136 -100 220 101
3627 101 559 277 -96 182 -39 -40 -46 86 -347 -28 -203 -171 -337 -266 -220 -119 -251 -329 -440 -251 -105 -97 -162 1
3651 1 31 353 177 43 30 189 390 199 109 138 222 -39 310 -58 94 111 -120 166 -220 -123 -216 -375 -2
3674 -2 3 17 -356 -209 -82 -403 11 -28 48 -103 151 79 165 149 198 233 81 122 346 331 -117 250 7 124 353
3699 353 -183 -61 -195 -105 -124 -157 -259 314 -246 -115 -318 -83 -50 -207 -79 141 -173 291 -1 247 214 244
3721B44Kj25K73k72M2m0M5k3O4j49n0n9K53j56M3j26K8J05Ok49j31J20J49j21
3745a27J32p5Qr6J25K70o7j4O7N6l21J54p9N9o7r5K01j37r4j06J00j4J46m59K22
3770b11j94L94o9k12J06M3L1KJ88L2p3r3K86J10j41k5N4J23m9J9j80J42j78j17
3794a2K53l73N5n1J36k45k94J04L18l07P1L63k31J88j02m6J55P8J42M6m13M08
3816B43p4j33QL2J37N8M2m64R3J0K36J2l89K23J1O5j4k87P1r8N9J44j3j17J30
3841a5j18r6J97J22o6l1j36P7O8q6L10k94L25j56k80K88k53O4M8K4k20j01J36
3864a93J89l19l5M55k68K12q2j72K33r2K23n9K0J00Jo3oj39r7K86j64j8K99k28
3888H3p6J67k30J53r8j45K01k40mL00l34K9K4j06L0J57j78k2J14n6K16p8K52j76
$$ plain form
3721 244 246 121 394 122 164 124 169 146 210 61 11 -48 205 49 92 -34 -6 99 105 -144 -275 -155 -6 -127
3745 -127 5 -70 -62 -158 -33 237 170 156 223 279 -42 112 33 92 25 -70 131 -6 -100 -206 -106 -120 26 -433 -211
3770 -211 -405 -11 -80 -292 -186 -143 -112 -110 78 110 37 -56 230 340 199 174 228 351 302 321 141 283 105 -12
3794 -12 241 -132 -77 -128 8 -237 -531 -427 -109 -416 -345 18 -213 -25 -127 -173 -18 60 202 248 -165 243
3816 243 169 36 44 76 213 271 313 -151 -58 -48 188 200 -189 34 45 110 96 -191 -120 -218 -159 -15 -28 -145 -15
3841 -15 -133 -229 -32 90 24 -7 -143 -66 2 -84 226 -68 257 101 -179 109 -144 -80 -32 -8 -228 -329 -193
3864 -193 -4 -323 -358 97 -171 41 -41 -213 20 -72 151 92 112 212 213 150 144 5 -92 194 30 12 311 83
3888 83 7 174 -56 97 -1 -146 55 -185 -189 111 -223 -194 -170 -276 -246 -89 -267 -289 -175 -231 -15 -93 159 -17
3912a7L09j05o8J40m23K25L5l4J51r0r1J5K72l70k48M4q0L10j68M1J21k3m4p9
3936a77J63k11J74k73K47mN4r3K0M69r2j83J32k50K00j18m4N2K6qk78j22K28k35
3960c23J38K00n2R3j05j78k12L56j67J20J89k67K99j3mm9j8J84K7p0j42K51j48
3983A09L2l4M8j4l59K29j0P6n7l2lm2j92n9L17k17J32j6K27m02L98k38R3R5q8
4008gPR7j34J07O2nj21K93n5k93J82j34n0L81k53k22j64K54o6q6J93j59O0l14
4032d27L95p7L8j54M25l55K4K23p7K61k66j61K55O0J79j23k50J14l6m4k14J12
4054i8J83Ml64M1K81l44J40R0j00J06j57R7k36J54K07J10j93L06K39k80L9j5j60
4077E0l1L0J49q6J83k70o3L10k70K58k56K35n12J42J05r3J11j38J59P0j36m4J19
$$ plain form
3912 -17 292 187 119 259 -164 61 96 62 213 123 32 47 319 -51 -299 -255 -335 -25 -193 -152 -31 -54 -98 -177
3936 -177 -14 -225 -51 -324 -77 -81 -27 -120 -100 369 277 94 226 -24 176 58 14 66 92 84 -194 -316 -88 -323
3960 -323 -185 15 -37 56 -49 -227 -439 -83 -250 -130 59 -208 91 78 74 25 7 191 218 148 6 257 109
3983 109 141 107 155 141 -218 11 1 77 20 -12 -15 -57 -249 -308 9 -208 -76 -92 135 -267 131 -107 -14 81 -7
4008 -7 0 97 -37 70 132 127 6 299 244 -49 133 -1 -51 330 77 -145 -309 -55 -121 -207 -14 -173 -113 -427
4032 -427 -32 -109 -71 -225 200 -155 -131 92 15 276 10 -151 104 164 343 220 -30 84 48 4 -210 -98
4054 -98 85 89 -275 -234 47 -297 -157 -67 -167 -61 -218 -121 -357 -203 4 114 -79 227 466 186 225 210 50
4077 50 19 49 198 112 295 25 -38 272 2 260 4 239 -273 -131 -26 -119 -8 -146 13 83 -53 -97 22
4100B2j57K44R9l88K27JQ9j3n0J78k48J38j58K07l26J41K2mm3k21L29l33P8K08
4124D2l57K68j93nJ16J23j02J59k25J01L36j15l68O7L02J7J55l60L19k13J94k81
4146b0o4K50j00R3j39O7k1K3l84K71j36O6K22m20K10o4J0K57mJ72j87k24M8L31
4170B57k02J86j9Q6k82K2L15j75r4q3J25q4J80p4q1k42QL42j47k06l5K51k69j98
4194d19L28n3J82k31M9J26k1O0O5p5j73M03j47J95j41k88K19l7k1J5J28k78L6
4217g8J74l6l96L29j65o0j89L00j54K92J87k59o4J95J01j87J94k08K57o8j65L38
4239C38l19J20J31l97J54m2j0p9R4L5r9n5j56K32q4k11J69M0k02Q9L23pJ02N8
4263B24j20n2p3J58j60K35j32l9k4k00K21n1j7J10j48RJ47j45r4J07j37K87l19
$$ plain form
4100 22 -135 109 208 -180 47 48 137 124 74 252 4 142 -16 191 -135 6 28 24 -19 -240 89 -244 -166 42
4124 42 -315 -47 -240 -245 -129 -6 -108 51 -174 -73 263 148 -220 -153 149 166 321 -39 280 67 261 -20
4146 -20 -84 166 66 159 20 87 66 89 -295 -24 -160 -94 128 -292 -82 -146 -136 121 117 289 102 -122 -74 257
4170 257 55 241 222 308 26 48 363 188 94 11 136 52 232 158 77 -165 -157 185 38 -168 -203 48 -221 -419
4194 -419 -91 -144 38 -193 -144 -18 -39 21 86 11 -162 241 94 289 148 -140 79 42 21 36 164 -114 -78
4217 -78 96 60 -336 -7 -172 -232 -421 -121 -275 17 204 -55 -119 76 177 -10 184 -24 233 165 0 338
4239 338 19 139 270 -127 27 -15 -25 -104 -10 25 -74 -129 -285 -53 -137 -348 -179 -139 -341 -252 71 64 166 224
4263 224 104 52 -21 137 -23 212 80 41 17 -183 38 -13 -30 80 -68 -59 88 -57 -151 -44 -181 106 -213
4286b13m0M1J11j54J99j40K98j87J74K59l06K0j14K46l14L24n2r7L8J31p5k11
4308f2m3M25l24J26k77p5Q3K07j65J32l6k07M29l72L87n25R2l1M13k37M3K03j17
4331F9ML6j0qkJ11p6k38L07j40J60k67J18N2l85J38J36j13J42j74J08J5j80J26
4355g1O3k8K01k45k3J09r2m7L97j05Rj16l9l6J29r9J81k64L05r4j43K28l92J22
4379e0j08p6J80%O6J02J00l27N0j85L03r2Q6j05J5J02m1J66j20L07l44Q7q8K84
4403C12k59J43K7j47j67J97j61q2K44k34Qj02J10n2K6J33j29k90K40N7j08J48
4425h6m5L04O7k51K05J9k23N2J6J83m1k35K87l33M56l40J6J12k50k23K34k8m06
4448e10K30L00k24J02K10j16J64j33k4j33M2K78j98p3K98J90J1N3o09J73K79k12
$$ plain form
4286 -213 -253 -212 -101 -255 -56 -196 102 -85 89 348 42 62 -52 194 -120 204 152 55 93 224 149 -62
4308 -62 -105 320 -4 122 -155 -230 -147 60 -105 27 -9 -216 213 -159 228 -297 -205 -236 177 -60 -17 186 69
4331 69 73 109 99 91 89 200 124 -114 193 53 213 -54 64 116 -269 -131 5 -108 34 -140 -32 -17 -197 -71
4355 -71 -8 -36 165 -80 -103 6 -86 -133 264 159 168 52 13 -23 106 7 188 -76 229 135 -8 220 -172 -50
4379 -50 -158 -234 -54 -54 12 114 214 -113 -63 -248 55 -37 49 -56 -41 61 20 186 66 373 29 116 28 312
4403 312 53 196 223 76 -91 106 -55 -137 107 -127 -119 -221 -111 -163 -137 -4 -133 -423 -183 -126 -234 -86
4425 -86 -131 173 240 -11 194 213 -10 42 58 241 200 -35 252 -81 375 35 51 163 -87 -310 -76 -104 -510
4448 -510 -280 20 -204 -102 108 -8 156 23 -1 -134 -92 186 -12 -85 213 403 414 467 -142 31 310 98
4470I8k07J5N7k89O1J35O1j78p7L23j65J88l67R6j13K40K00J14k57LP8j89L85
4493B12k46K02l21K54j08J58J5Mj70R4L0k37pJ82j00k02K35r3j22J22j4K09k16
4516a19Q2o4L1l7N2L2j4J87q3k01K36l9L5L0J83j9j37l3k16M5J50J12l94j39M91
4541A71j03j17k09J90q8K46r2j21K22Q9k23j61K15J64k17K42k35J6J60M1L8k70
4563d2k18L37P3j00J24o4O6j58N7k60m9J31Jl0J38j85j04J77j8J80Qn8P1J03l42
4588a62J24K31j71P6J71k8j42P9j76J41j84J70k71K43k53KL90j25r9q7pq5K02
4611C9r6M3q2k54L52r3K15j13m9J37J36j31Q7J43k97J86k90N8K3O2Qk53J04P3
4635Hm7O5q3J64j82l6J79j45P4J1n6k6rpPJ6M2J01p1j71J73L13k81k61L32j75
$$ plain form
4470 98 -109 -94 -37 -326 -265 -130 -69 -247 -324 -1 -166 22 -345 -249 -362 -122 78 192 -65 -62 16 -173 212
4493 212 -34 168 -153 101 -7 151 166 170 0 94 124 -113 -120 62 -38 -240 -5 -98 -220 -98 -112 97 -119
4516 -119 -37 -101 -70 -107 -55 -23 -37 150 67 -134 102 63 98 128 311 292 155 122 -94 -49 101 213 -181 -320 171
4541 171 68 -49 -258 -68 -156 90 -2 -123 99 188 -35 -196 19 183 -34 208 -27 -11 149 190 228 -42
4563 -42 -260 77 150 50 174 110 176 18 75 -185 -234 -103 -102 -132 6 -179 -283 -106 -124 56 64 6 77 180 -162
4588 -162 -38 193 22 98 269 241 99 178 2 143 -41 129 -142 101 -152 -150 240 115 16 -71 -78 -163 39
4611 39 -57 -14 -96 -350 2 -91 124 11 -38 99 235 104 191 334 37 223 -67 -9 14 76 84 -169 -65 8
4635 8 -39 26 -57 107 -75 -111 68 -77 -3 8 -48 -74 -83 -90 -83 -67 -25 76 5 -166 7 320 39 -222 110 -65
4661f5K50J37l05rJ25m04L93j43k09K65k28L39j43j35J89n3O4l62K29K02m01L80
4683A16j58K92n3r9p1J64J0k36P1K19j6m2K2j40j65l7M1P5m2J40j95RO5l6o2p2
4709b00J45J97k14o4M43j47q9j26R1J76j53r2K00o5j37L10K6O0m56J24r4K72k53
4732d6k21K33q0J35j22q9j51L83r3Q9Mj6J30k85r8K91J39p3J31j00m7k07J02J35
4756A44j48K03j51k2j46M7L3p9O5p0j69J31j41N66k67M4j71J94l21P0Q5M3J3P4
4780B7p5J25q0K40l09j05K05l4J35l44J57J38n0l8K5p6j34J05L4J2j69QK67o2
4804BP4l46K7K64q1j50J64J8l3K22k58M27j21J08n20M48l82J81K26P9l33j10K99
4827B05m01K55n7j2J3mj47l1jj00J19J81l6J27o0K2l9M6k03M96l31o0J97j10p4
$$ plain form
4661 -65 185 322 17 8 133 -271 122 -21 -230 35 -193 146 3 -132 57 4 68 -294 -65 137 -264 116
4683 116 -42 250 197 98 27 191 201 -35 36 255 239 197 219 79 -86 -123 -82 -7 -49 91 -104 -95 -30 -66 -128 -200
4709 -200 -55 142 -72 -136 307 160 71 -55 36 212 59 -33 167 102 -35 275 301 361 -95 29 -65 207 -46
4732 -46 -267 -34 -114 21 -101 -190 -341 42 -51 38 42 26 156 -129 -227 64 203 130 261 161 114 -93 9 144
4756 144 -4 199 48 26 -120 -73 -40 -119 -54 -124 -293 -162 -303 263 -4 40 -131 63 -258 -188 -103 -60 -47 27
4780 27 -48 77 -3 237 -72 -177 28 -6 129 -215 -58 80 30 -8 17 -59 -193 -88 -54 -42 -211 -203 64 2
4804 2 76 -270 -243 21 -60 -210 -46 -28 -61 161 -97 330 209 317 -203 245 -137 44 270 349 16 -94 205
4827 205 -196 59 2 -10 3 -1 -148 -179 -180 -280 -161 20 -16 111 51 73 34 80 -123 373 42 -18 179 69 -5
4852el4Q6K9l2J36k00J65k55J71o2k48J89K66l36R4R1k86K69m9l0O8O2j92J08
4876EK4J64j72r9K20o6M6j56n5P5J35j35K51j90n9Qq3L40l48M6J63q3j2j11r1
4901a83L36j42r5N8P1K49j10l80K64J17J1R1j08k29R6pM5Q9j73J29j76J05o3J84
4925A79J09k96N2r7j54J53m5J99k90K3L66n60J27J43r2L01M8k82J36M1PR2J00
4948B60k35J79j84k0P4j91J81P1j12k9Lm5L47l52j44k7J39J9M02k37k02J27j49
4971a25M3oJ71j44J95o0j4P9jp4J50k75J19p2J25P9Mj25j81K62k89K52j79j2M4
4996c4m4K05k51L23j18k16q3J30K54l50Q4L50j41p4Mp0Q4j7j07%J01P0m5R2Q7
5021B34j24K70l38J78k01N6r2k25k3n0K40k07J62o3L64j00K10k75J7J76m7J54
$$ plain form
4852 -5 -39 47 76 44 180 -20 145 -110 61 -1 -249 -60 206 -130 -36 55 -231 38 -11 -41 27 89 -103 5
4876 5 29 193 21 -78 142 76 122 -34 -89 -14 121 -14 237 47 -12 -4 -87 253 -95 -49 114 31 19 -92 -183
4901 -183 153 11 -84 -26 45 294 184 -196 68 185 196 287 179 -50 46 39 84 173 0 129 -47 58 -5 179
4925 179 288 -8 44 -53 -207 -54 -99 100 -190 -167 199 -361 -234 -91 -183 118 166 -116 20 61 68 160 260
4948 260 25 204 20 0 74 -117 64 135 23 -6 -3 -48 299 -53 -197 -224 -85 -66 336 99 -103 24 -125
4971 -125 -82 -88 83 -61 134 74 60 139 138 64 214 -61 58 -14 111 190 194 69 -112 150 -139 113 -66 -78 -34
4996 -34 -78 127 -124 199 81 -135 -218 -88 166 -184 -100 250 109 35 39 -31 53 36 -71 -71 30 100 55 147 234
5021 234 110 380 42 220 19 75 -17 -242 -265 -315 -75 -282 -120 -183 181 81 291 16 33 209 162 316
5043C16k84Q3R9j71p9M19m51j24J09J58j73J4K5m3K14j19j62N9j82K9M23l46k0
5066b06k4M85l73L04R1r4kk73J38J06k7j58L93j79k90L66j14l73M19j44o8j68
5088a91Q8j41K79Oj95N6K11k73R1K53m78M13j23Mk8j6n0k7K14p1P2Q9j21J25o7
5113A20k0l1QQ3Rl2J8j91J16j71O0j23J57l50L32J51l51L14k70J73j01p8L48n8
5137A13k64J73j01K58o6q4K40j25L7j2p3lj63q7L44k82M5O8l8p3o3pp2J77J07
5162D9Q5k55J08j91J74Q5o4j2rk00K32o3R7K18r6j15p7k3R7k5k25n3L83k41J07
5187a4N3J26l83Q4R4J10k16Q3j04J87K24l14P1o7L54j71p6J99k66k4J67K16n73
5210b40O32m14J94k85K04k71J38P0K5k51K64j76QJ8l51L25J01J05j53j74L62j72
$$ plain form
5043 316 32 115 214 43 -36 383 -68 -192 -83 75 -98 -84 -59 -102 112 -7 -169 -110 -292 -263 160 -186 -206
5066 -206 -230 255 -118 186 277 183 181 -92 46 152 125 -33 360 181 -109 257 143 -230 189 45 -23 -191
5088 -191 -103 -244 35 41 -154 -98 113 -160 -69 184 -294 119 -4 0 -28 -44 -94 -121 93 22 94 183 62 187 120
5113 120 100 69 77 160 169 137 155 -36 80 -91 -31 -154 3 -347 -15 136 -215 99 -171 2 -99 -177 171 113
5137 113 -151 22 -79 179 113 29 269 144 181 169 96 93 -70 -157 187 -95 -50 18 -20 -93 -156 -163 -235 -58 49
5162 49 134 -121 -13 -204 -30 55 -9 -21 -30 -230 2 -61 36 254 158 43 -34 -57 40 15 -210 -263 120 -121 -14
5187 -14 39 165 -218 -134 -40 70 -146 -63 -167 20 244 -70 1 -66 288 117 41 240 -26 -50 117 333 -240
5210 -240 392 -22 172 -113 91 -180 -42 28 53 -198 66 -110 -102 -84 -435 -110 -9 96 -57 -231 131 -41
5232d1K74k06k72L93j28k44K48j08Q1J09K4l6j18M9L2J78q6r8j44J23k60J37m8
5255a41J33k09K26K1j51K67k93J89m1r0J41j15O1m7L08j57j04J09Nk93L2L76k81
5278e4N2p5j35K89j33N3j06L21j32M5j98j08J07N8j52J56k15J91J02k57M01l5
5300A75j20m1J93k97K64j0k42L82n4l04p7j27J31K31l3J17l10K9M1n2M7rJ38J66
5324B38l02j54J10Q0n0kO6J05n9K04k88J37kP1k30J3L7M5r1Rj22J89j61k4J28
5349e3pj76L20j97l86N49l84L56R8l16K65o3J47j73J9K89k79l5L22j1j45r3j87
5372a40K16k02K91l04J39p0J13j52K6O6J81j57J31Lj54k14M6J17Q3J09J9j16k13
5395a82N55j35J04l01j1J23k17P8n2r6K35k19k5K96k26M1o9p6J17J69P9k06m7
$$ plain form
5232 -41 233 27 -245 148 20 -224 24 -84 -3 106 130 94 -24 25 57 235 149 51 -93 30 -230 -93 -141
5255 -141 -8 -217 9 30 -121 146 -147 42 1 -89 52 -63 -2 -49 259 102 -2 107 112 -181 -149 227 -54
5278 -54 -2 -77 -212 77 -56 -3 -109 212 80 125 -73 -181 -74 -16 -168 -12 -227 -36 66 -191 210 175
5300 175 55 14 207 -90 174 164 -78 304 250 -54 -131 -258 -127 104 71 188 -122 -93 -52 -104 -57 -66 72 238
5324 238 -64 -218 -108 -28 -78 -80 -14 91 32 236 -52 85 83 154 -76 -63 -26 19 -72 -63 -185 4 -157 -181 -53
5349 -53 -60 -236 84 -113 -499 50 -334 22 120 -196 69 6 153 -20 -1 288 9 -26 296 285 140 47 -140
5372 -140 76 -126 165 -139 0 -70 43 -109 -83 -17 164 7 138 141 -13 -227 -181 -64 19 128 147 31 -182
5395 -182 373 238 342 41 30 153 -64 14 -38 -134 101 -118 -143 153 -73 -32 -101 -177 -60 109 188 -18 -65
5418f5j5j8p4L9j72O9L50k92L29j95kJ57N9qpk61K51Q7j67jo9J36j27k51L09j0
5444E2j75K43k30k44O39n28m6J17k1k4M83k45J43m1n1r8R3J08k50L54j95K07l08
5467a7j8J98j70j35lM39k39K4K01l10M2k38K14K0L9j50L9l8L24q4k87K22P7R4
5491B44m94J64K5j02J33K05J81l37oNJ20l8j72J84n3j8j4k7j2p3m4N1R1n6j62
5516b05K12j84J36J3m0R7K2k07L35j55m8J31J08m6p5M4j48J60j37J21k65L6J1
5539h4O1j7l7m4k9O8L8j02O8M3j8N9p8K10k37r3K89j13R2j41J94J10k39P0l26
5564b56O96m20J26n7N4l66J71J71j1J16l03r5J4O1k01Q0L32j48K0K03p4J53k10
5587E6k4M6j57K24j49N4k20J90O1K18l51J64K9k35K09nJ63n16J19MK88k25n4J28
$$ plain form
5418 -65 -80 -98 -172 -133 -305 -236 114 -178 151 -44 -46 111 170 162 155 -106 145 232 65 64 -5 131 4 -247 62 52
5444 52 -123 120 -110 -354 285 -243 -289 -172 -193 -217 266 21 164 123 72 -26 67 175 -75 279 84 291 -17
5467 -17 -35 163 -7 -142 -145 294 55 79 280 -30 12 -226 -12 8 47 -103 -64 -102 222 138 -149 73 150 244
5491 244 -250 -86 -61 -163 -30 175 356 19 13 18 138 100 -72 112 59 41 27 0 -12 -85 -129 -78 13 -43 -205
5516 -205 7 -177 -41 -28 -68 29 51 -156 179 24 -24 107 215 169 94 138 -10 150 13 134 -131 -95 -84
5539 -84 -23 -40 -77 -121 -150 -82 -44 -146 -78 -35 -53 6 -72 138 -99 -192 97 -16 76 -65 129 239 0 70 -256
5564 -256 440 20 146 89 143 -223 -52 119 108 224 -79 -174 -160 -99 -300 -220 112 -36 -16 187 113 266 56
5587 56 32 78 -79 145 -4 50 -170 20 81 299 -52 112 141 -94 115 110 273 -243 -124 -120 168 -57 -111 17
5611A7rj76K65r2n5O2J26J73k35j33j51K08J74k56J27j18j51K06Q8m3O8L8k50
5634a17J77k33J96p5J71j56o1K88l99J79k80L30j36J49O3k80K39j07J44J9j05
5655FJ13Nj76K47k05J77J48k55J1j27L86m55j65L23Ll55N9J80l8j37J93J07M7
5678I2r5O1k6j48K35Q3k52J67r2J83l9J3k66L30m3p0l9n5j56J08n5J09j24L4R4
5703D9j88j8K41j71Pj22P7J71J37k32J15p7l2K68k25o6K17n4k09N7K24k16p5j64
5727b86K90Q9L9o4L8M6k19O6m4j23J01O1j27j9m5J35o8R1J88j54J76k3k01P0m1
5752b4o8K0J61m4J8o6K36j67j87M2R1j08j77L25k9j82n6J75m10M28j97J26K05
5775A12j40Q2k29J06L4j49L78r2k93L96n9J9q4J70k37J44r8k91L47l7k37K62j46
$$ plain form
5611 17 8 -168 97 5 -50 12 138 311 76 -57 -208 0 174 -82 45 -73 -224 -18 70 27 95 133 -117
5634 -117 60 -173 23 -52 119 -37 -98 190 -209 -30 -310 20 -116 33 96 -184 55 -52 92 111 6
5655 6 119 124 -52 195 -10 167 315 60 71 -56 330 -125 -290 33 36 -319 -260 -80 -118 -255 -62 45 92
5678 92 -3 58 32 -116 119 202 -50 117 25 208 169 182 -84 246 203 133 94 39 -117 -9 -64 45 -79 -45 49
5703 49 -139 -157 84 -87 -80 -202 -125 46 183 -49 66 -11 -43 225 0 -66 151 97 -112 -55 169 -47 -122 -286
5727 -286 4 93 132 68 106 152 -67 -1 -45 -168 -67 -6 -133 -152 -197 -62 -130 -39 149 -5 171 148 -53 17 -24
5752 -24 -92 -72 89 45 63 -3 233 66 -121 -79 12 -96 -273 52 23 -159 -215 -40 -450 -22 -219 -93 112
5775 112 -28 54 -175 -69 -35 -184 194 102 -191 205 146 165 81 251 14 158 60 -231 116 79 -158 104 -42
5798d2kj38pL93m63k17M90k17J82k66J90j66KK72J10K8n8l25K09J46n7k3j29L72
5822B84o08L73J17k52N1R8l9m3J78nk64Q3j29J85k26J43j13J17k91J70L79l09
5844a01J02q7n5J73P1q2J67l0k22p3K66l1L1J43l14J44j19m2O4k9M6Nj14j06N34
5869C41k80k21J14N1j06j49L49j57j3Ql7L65k93qP8n4K54j06K6k58J4K66r9k94
5893b09J28R0o0O2o7J73m8o3j09p5J77Q6k30K42K0m85M78j5j15K14q6k26L26k17
5917iP7J92j61l6RL1l6m3N8p1K08l80J45j00J6j1j3J47j31J48k97J53p2J65K0
5942Im3j09J42J8OO0m8l43K71P2j08K07j60q7r8K24j09L8J02n2Ok25l3L00j88
5967a48j05M5L3kR5J78k47J19j38J55Q6j16k2NJ31Mk08O5K49n0j08K80r8j72J50
$$ plain form
5798 -42 -44 -182 -189 204 -259 -476 14 -203 -21 -287 -97 -263 -261 11 121 149 91 -234 -25 121 64 41 -88 284
5822 284 -324 49 166 -86 -35 63 24 -19 159 154 -110 -27 -156 29 -197 -54 -167 -50 -341 -171 208 -101
5844 -101 1 -86 -141 32 103 21 188 158 -64 -137 129 98 129 272 -42 102 -17 -59 5 -24 22 27 -87 -193 341
5869 341 61 -160 -46 5 -101 -250 99 -58 -71 -63 -100 265 -28 -36 42 -12 242 136 162 -96 -82 184 85 -209
5893 -209 -81 9 -51 11 -56 117 69 6 -103 -178 -1 85 -145 97 117 -368 110 95 -20 194 108 -118 208 -9
5917 -9 68 260 99 63 72 103 67 24 82 11 219 -161 -16 -116 -100 -111 -124 23 -108 40 -257 -104 -176 -11 9
5942 9 -34 -143 -1 17 23 83 35 -308 -37 35 -73 134 -26 -113 -211 13 -96 -58 44 -8 -2 -227 -260 40 -148
5967 -148 -253 -208 -175 -177 -82 96 -151 -32 -170 -15 71 -45 -67 -62 69 73 -135 -70 179 129 21 301 203 31 181
5992A81j54k54K44j64J05m6L09j78k67J66L2l4j0Q9n6k05J59J51RL1k02L28k71
6015c7J05N6o5k07l4K83l9O6O9m00J71o8K20l08J88j66K6K2J98J81l47J19j39
6038a06K71p5k5j28K79k17R0R8j90K5J51k11K60n9j97j26N0K38l46K00K26k75
6060f7J4p1K8J14r4J95l9n0L2l4j26oK13N6p1K1n1j32K02l28K86q7K69k03kj2
6086E7Jj01N3J1l3k2j9J44j11k05J67K13j90L94m26O2J37k09Q2L8l13L90j96L8
6110c8L56l75J13q1j1J49j66k6oJ91L8j09J0L2J29l1k07K40j38J63j75k86K43
6133A5m8M3j56J57K12k75m9J46K6Rj54K01k95K74J22j48q4j20J11m2J76k9j00
6156hj65J62J15j78K7R1j57L41j64j24J36k51J16J39J01k74L0j08N0K01J7j03
$$ plain form
5992 181 27 -227 17 -147 -42 -88 221 43 -224 -58 -26 -60 -70 19 -37 -242 -83 68 77 108 -94 234 -37
6015 -37 68 124 59 -148 -182 101 62 128 197 -203 -32 -100 120 -188 0 -166 -140 -118 80 261 -86 33 -106
6038 -106 165 90 65 -63 216 -1 89 187 -3 22 173 -38 222 163 -34 -160 -110 128 -218 -18 208 -67
6060 -67 -53 -124 -96 18 -76 119 80 30 62 28 -98 -104 109 165 94 115 64 -68 134 -194 92 5 274 71 69 57
6086 57 58 -43 10 21 -12 -34 -53 91 -20 -225 -58 155 -35 359 -67 -5 132 -77 5 43 -270 120 -76 -38
6110 -38 318 -57 56 -25 -36 113 -53 -79 -85 106 144 35 45 77 206 175 -32 208 70 233 58 -228 15
6133 15 -33 10 -146 11 223 -52 -101 45 71 80 -74 127 -168 106 228 80 -4 -124 -13 -55 121 92 -8
6156 -8 -173 -11 104 -74 -47 44 -113 228 64 -60 76 -175 -59 80 181 -93 -63 -171 -121 80 97 -6
6178fM8J92j68k09J00j01K34k7p4j94K30j75K69j32Q1q3j89J06K18o6o9MJ50k98
6202a59K25j37Q8K6j69J52M8L42m26P6j15q2L94m19P0j18M16k99%r0N9j32J79
6225g1j54Oq3K23p6l3J42j23OJ86M6j03J09m9J04n2j23P4o0m0N6m8J24K7l03J81
6251c4p5j9Jk73M52j46L13l78K06L7j42J43k8j95K6K08o3k43K39j02P2j04N5J22
6275G2O4j54K78m32J51J22k86J07M33k25k09M2r7J20j18J35P0k70J19R1m6J98
6297A65N8J44l93o2J58p6P5J04j44J31p0r0n2n1k9K18m9j11L4n5J27j95P0J08
6321A5q5oj54K05M7j8K02n1k46K56r3j54J33Ok9J50m13K51N1j37J51J7L2k01j28
6346a99j56M19j48j26J33J16j63M48m37K52j77k2J07l13J67K71R2k30k51L87j98
$$ plain form
6178 -6 42 234 66 -143 -43 -144 90 63 -11 -205 25 -150 119 -13 68 -15 -204 -98 120 54 -15 -11 139 -159
6202 -159 66 -71 17 43 -126 26 74 416 -10 66 -49 -131 263 -156 -86 -204 212 -87 -87 -177 -118 -250 -71
6225 -71 -225 -219 -302 -79 -155 -188 -46 -169 -163 23 69 -34 75 26 130 78 -45 29 -31 -71 -15 -63 61 88 -215 -34
6251 -34 -109 -128 -127 -400 52 -94 219 -159 47 84 -58 85 57 -138 -112 96 33 -210 29 -73 -1 -105 -50 72
6275 72 136 -18 260 -172 -21 101 -185 -78 355 130 -79 -37 -134 -14 -132 3 73 -197 -78 13 -33 165
6297 165 223 367 -26 -88 70 -6 69 173 29 160 90 0 -52 -103 -132 86 37 -74 -40 -95 32 -163 -93 15
6321 15 -70 -76 -230 -25 22 4 206 155 -91 165 72 -82 51 57 28 178 -235 16 67 -70 81 98 130 -71 -199
6346 -199 -355 64 -84 -210 -77 39 -124 324 -113 139 -38 -60 47 -266 -99 172 264 34 -217 170 -28
6367b8L12l63K79j30p5J32j7j13j14L62n02M12m11L53k06k06O4J46K07k93M4l5
6389a82J70J03j39p3K30J91o39L69l6K2j5r4K35R3k65J79k06L8j7K37k54L2o3
6412h4L16m51K55q0l72M73o3K24j95j04k52L05n8J7L19m25J20K92r3j90J03O4
6434A21m63M15L7l2J67k16M1p8P3k3J14j22p7QJ40k33J82j65L4Q9N4p5q6M8K55
6459B08k78J28M7R0k40J28j06m9L39j25j78J59M3l97M09n2r7k7k60K92j62J05
6481b3j58k37M76j28K86m46O28m19J44q8J08q6K95n05L61K3j22j9L0K17j39j98
6503@K3k1j71k08L18Q5r5Q3J36m6j66r3j20M92l92L15j14q0L8K41j33j25j01P9
6527e5j0J81j88j22pJ77p8o7K75q0j7K55k45K4l08M88j55j29l9J20o2j17J49J7
$$ plain form
6367 -28 284 -79 200 70 -5 127 110 -3 -117 245 -257 155 -256 97 -109 -315 -251 -105 102 -191 -147 -182
6389 -182 -12 91 -48 -121 109 300 -339 30 -6 16 1 -93 142 235 -30 149 -57 -19 -36 201 -53 -21 -84
6412 -84 232 -219 36 -44 -416 57 -6 218 23 -81 -333 -28 -86 -69 250 -175 -55 237 144 -46 57 121
6434 121 -342 73 110 78 245 29 70 -8 65 42 156 34 -43 -35 105 -128 54 -111 -77 12 66 -9 -95 -47 208
6459 208 -70 58 105 195 -45 83 -23 -72 267 142 -36 123 166 -231 178 126 29 2 -258 34 -128 -23
6481 -23 -181 -418 58 -70 216 -230 398 -21 123 35 143 57 352 -153 208 231 109 90 120 337 198 0
6503 0 23 2 -169 -377 -59 26 -69 14 150 104 -62 -155 -275 217 -175 140 26 -54 -16 225 92 -33 -134 -55
6527 -55 -65 116 -72 -194 -201 -24 -102 -169 106 26 9 264 19 43 -265 223 68 -61 -100 20 -42 -159 -10 7
6551Gj4RL7o7j46K15R9J1l25P6O2K02j02L1k70J64J04j04K0r4K75l14J48j9l83
6576c78K63K93l24n0J97n5n5K06j69K83l4k91J96r7j4M6J15j10J32j7l1l54K97
6599D9J10l26J61N2J60k37p2O7P6R1J85m52J17k1N8j07K54k65J82k96O03o20K17
6622a4K90l89lO9R3j95J40J08j22m8R7j07J33Q7j48j7m0Kr8K02k23R9k53K80m3
6647a00P7qj82N11l57N6j8j12k13K24J20MK15l1j77J38l2q8j72l6J41O8p9O9m8
6672c0m1J8rk21K56P7K02j35k3m3j41J29K95m67L55O8j97k87K66m8r9K2o5N24
6696D06m58P8o4J18j0Q0l26J65pk20K34k18J15pm3L22%j89J65k27m7K9oP2%J3
6722b5J49l2l2q3L8O9P6j94ML24n09K67r6J77R7k66L0l0K05k60J78j83m0K86l23
$$ plain form
6551 7 -7 2 39 -28 -174 41 140 151 -174 -98 -36 166 64 95 -175 -11 93 -11 9 -85 190 -124 24 5 -378
6576 -378 -115 178 -146 -196 1 -54 -109 97 -72 211 177 -114 82 -15 -29 17 132 22 154 137 106 -248 49
6599 49 159 -167 -6 46 206 -31 -103 -36 40 131 316 -136 -19 -40 18 -89 165 -100 82 -214 389 -231 -14
6622 -14 276 -113 -116 -47 46 -149 -9 99 -23 -71 26 -81 52 139 -9 -26 -66 -64 -162 40 -183 -84 -337 -57 -100
6647 -100 -23 -31 -213 298 -59 -3 -21 -133 -346 -122 -2 2 217 186 9 147 115 27 -145 -181 -40 28 -51 18 -30
6672 -30 -71 -53 -62 -283 -27 50 252 117 94 51 -90 39 334 -133 222 290 93 -194 72 24 -75 -53 -118 406
6696 406 -52 26 -38 80 70 150 -176 -11 -18 -238 -4 -222 -107 -114 -157 165 165 -24 141 -86 -133 -104 -110 -38 -38 -25
6722 -25 124 92 60 -23 15 84 160 -34 -30 294 -215 52 -44 133 230 -36 -6 -36 169 -91 87 -96 -136 150 -173
6747a73Q3j10q9N09j50k77M15j70l6J10NN8j46Q4k97K43l6j99K03p8P7r8N7j51
6771a66K77j44R3n0Q0J72k80L4O5j77rN0J65q9M4r1o7J44N3J02k60K54k55K15
6795A60j46K3k1O5j9o2K66j10k74j7j20J05J59J38q2q7P1l7k04M10l02R5J56J04
6819B71n27P1L57l41N2K41J2k52R7J61p8j61N3J03j38K00k31L78q7k53n4J08j0
6842b8j29k32J05M32r5K09n40K67l5Rl7L27o8k43J25L5p6q1m3J79k03JQ9q4j13
6867b29J08m4L3k6J18j02K38j12j9O0k73K86k14K09l2L3kJ68k77Q5l0L08l57J72
6891A01n4K40k56n8J83l65N1M7N4o7kj56M73q1k05k7J84j41J40j62m4J84J25p4
6915I0M2j70Q0j80J90Pj66L34q7L5o9j38J37j04m1l2k7J53P5j37j72J81J94j36
$$ plain form
6747 -173 -90 -200 -289 220 70 -207 208 38 2 112 117 175 29 113 -184 59 23 -176 27 -51 26 -72 -15 -166
6771 -166 111 -33 60 10 90 262 -18 16 81 -96 -105 -55 110 21 65 -26 -93 51 104 206 -54 200 -55 160
6795 160 14 37 16 81 62 0 266 156 -118 -135 -255 -150 9 147 65 -22 49 12 -192 218 -84 11 167 271
6819 271 -256 -185 172 -169 -117 124 136 -116 -19 142 64 -97 -44 59 -79 121 -110 268 181 -72 -126 -18 -28
6842 -28 -157 -389 -284 148 53 262 -278 -11 -46 -37 -74 253 185 -58 67 102 26 -55 -98 81 -122 -121 -32 -116 -229
6867 -229 -121 -165 -132 -158 -40 -142 96 -16 -35 25 -248 38 -176 33 1 34 32 200 -77 8 -22 286 -71 101
6891 101 47 287 31 -27 156 -209 -158 -111 -57 -124 -126 -282 191 110 -95 -122 62 -79 61 -101 -145 39 164 90
6915 90 132 -38 42 -138 52 59 -107 227 140 175 106 -32 105 1 -40 -72 -99 54 129 -8 -180 1 195 59
6939E9j37R4j37L14K0j50p2k00J64K60m2p0j46RM1J71j38O0k51K21m7K64m34O1
6963h6m9J24k29K26j49P7K61k11M6k04K09q3j47L31K09k67Q5j1k35J02J75k95
6985a21M3K51j20p3p1rK49m6j83j99K60J21k06J67j70K68l94K04L8j63R5l1LL1
7009e6J52j53j48K11k2J15K0Q8l67J11K07j77Ok45L50j83O3J65m0r1R2j93K41
7032A46k19Q1j23j71L37r6J19K58l54J37k49K1J08J94j3N1m00J88%p3Q9J52m7
7055A36l74K12p6n4J88j76J19q5j04L31j06n2l9J81k02%K5J45K5r6J11m0R2k69
7079a08L28k6o5k90L05j36k9l32J63N4O7K85l84K03N1n9p0j28J27J58l73J99n5
7102a15k3K2K22p4j76L21j04k10J63p8N4L8K6J96q3j42k14K19j20j31J77J43l39
$$ plain form
6939 59 -78 16 -121 193 213 63 -9 -209 -45 215 173 103 -43 -34 7 178 40 100 -151 70 23 287 -147 -86
6963 -86 -135 -11 -240 -14 -163 -86 175 -36 10 -194 15 -68 -215 116 325 58 143 132 -103 -1 174 -121
6985 -121 -78 173 53 -20 -91 -100 149 103 -80 -279 -19 102 -104 63 -107 161 -233 -29 9 -154 -59 -90 -87 -56
7009 -56 96 -57 -205 6 -16 99 119 207 -160 -49 158 -19 -13 -258 92 -91 -28 137 97 6 98 -95 146
7032 146 -73 8 -115 -286 51 -45 74 332 -22 115 -134 -113 -5 189 176 227 -173 15 15 -58 31 183 136
7055 136 -238 -26 -102 -156 32 -144 -25 -110 -214 117 11 -41 -80 101 -101 -101 -76 69 94 -2 109 69 161 -108
7079 -108 220 194 129 -161 144 8 -21 -353 -190 -136 -69 216 -168 35 86 27 -43 -171 -44 114 -259 -60 -115
7102 -115 -138 -116 106 32 -144 177 73 -137 26 -52 2 40 66 262 179 37 -177 42 -78 -209 -32 111 -228
7125b28J11J72J02l83K02q2J02j36K20m8j35J33Kj17J14L1l76L12k24K28KJ85
7147A87O9j57j14J23k0j26q5K54k1j51L6j2k59K49N1k28K12k84L05n6N2k83K06
7170e2p4n1J41M6L3o5K92j18l26K13j56J93O5k1k39k6J36j03J34J19J50k18j42
7193f9j37K99M5l31J36J64j52n8J54j31J24j64K71j14r8J42j6J07k50o5J12O2
7215C1k5J7l3k11M5K07j42M6N9k1q8j00J92r0J68M4o4j8p8N3P0j55M6K68k02j57
7241a38K12M4j1k00n9J04j80K53L8k86K32l0j57J00n6J18J22j32Q6j61l4J34L
7264Bm7J06j26J19l47L85k6P7o4lk23N3K24l5q0k18L0L34k16K01j57NlR9k76J80
7290fP8m10K36M3O7R2Q1o23N00j69k5J10q3J77J54m1qm38K32O8m0O0N4p5p0M4
$$ plain form
7125 -228 -117 55 157 -226 -24 -106 -4 -140 80 32 -103 30 32 -85 29 60 -316 -4 -228 0 2 187
7147 187 256 99 -15 108 88 -38 -123 131 110 -41 -5 -17 -276 -27 24 -204 8 -276 29 -27 25 -258 -52
7170 -52 -126 -177 -36 10 43 -22 270 152 -174 39 -117 76 141 120 -119 -145 -9 -112 22 141 291 73 -69
7193 -69 -206 93 138 -193 -57 107 -45 -103 51 -80 44 -120 151 37 -61 81 65 172 -78 -143 -31 31
7215 31 6 23 -10 -221 -176 31 -111 -65 -6 -27 -115 -215 -23 -113 55 99 35 17 -61 -8 62 -93 -47 221 19 -138
7241 -138 74 118 107 -93 -152 -48 -228 25 63 -223 9 -21 -178 -78 -134 -16 106 -26 60 -101 -135 -1 2
7264 2 -45 61 -65 54 -293 92 66 143 79 76 -147 -94 130 95 15 -203 -173 161 -55 146 -11 -6 -9 90 -186 -6
7290 -6 72 -338 -102 -59 8 100 181 -442 58 -111 -136 -26 -109 68 222 181 173 -265 -33 35 -5 55 109 34 -36 8
7316HP5J26j65Rj97K61l14N4J69Nk79K15n7J12j08J21L30m35R1J4K53l98J85J5
7340I0j94m3J69L84k65r4J02N2l91K70P8m0r2J15l58O3J21J33j51J44j2j45M5
7363a9K00j34Q2l32K48pM15m03N5Q9j75J88k87O7j19M31j25l15J24N2j56n4L27
7386A52k00k21L59k30J57J7j73K23j36N8MK7J61j85M5p6M5L9j20J9J32O5L40n78
7410g6L2J46q8j1j88J53j8l7K9J76k47K48l42L09l67J37J19j09J95p8j99L66p
7433A43K51o91L12N3M7j41R9Q8j72J11j62j0O8R4k41J61m0j63J90j02L7K3j74
7456b19L20R3n28M23l7o0j1J81k48J72J46J32l11j77M3J10j06K01k64K78M9k02
7478a5J08j41j73K92O1k40m3J91j9k51L6j20L55j9j02K55rj53j45L74O2k23k05
$$ plain form
7316 8 83 209 44 53 -144 117 -197 -143 26 31 -248 -33 -90 22 -86 35 365 -70 21 35 288 -110 75 90
7340 90 -104 -147 22 406 141 47 149 201 -190 80 158 118 26 141 -217 -154 -33 100 -51 93 81 -64 -19
7363 -19 181 47 129 -203 45 38 453 50 105 194 19 207 -80 -13 -132 299 174 -141 -17 35 -121 -175 152
7386 152 -48 -269 90 -140 17 34 -139 84 -52 6 10 37 198 13 58 -18 27 66 -54 -35 97 162 502 -76
7410 -76 -44 102 14 3 -185 -32 -50 -87 -58 118 -129 119 -223 86 -281 -144 -25 -134 61 -17 -216 150 143
7433 143 394 -297 15 68 115 -26 73 161 -11 100 -62 -72 -4 90 -151 10 -30 -193 -3 -105 -68 -45 -219
7456 -219 101 194 -334 89 52 -8 -19 162 -86 86 232 364 53 -124 -81 29 -77 124 -140 138 187 -15
7478 -15 93 -48 -221 71 132 -108 -151 40 21 -230 -194 -314 41 22 -80 175 166 13 -132 242 304 81 -124
7501a24M47k87R8l0P9k06K2J41Jk42j38R9n2M3M8J19J65k83J8J55k02J11l39K23
7525a34l5J12k34L08J07k77K64p2J9M6J4j83K88k96J3L8J05k35J71n6Q3R7k99
7548a56K7nJ74r1O0J19k30j65L48k72K68k28O8M00k27J53r8k85J87O0p0jnj91
7572a60N65m09PJ2p0p0P4J8%k3j9j51J80J96k25k25K26J91j25pJ01k02M69j92
7596A61q8p4O0K29j77J6k66OK19j50j98L31k5o3M0R9k40K69j52J8k45J99j94L6
7620a89J55j33P4O1nK41k25J09Q7J0j00r2R7m16N20k22J23k43L47M6k00m4j31
7643a30K23j5k84k2K94l0j3j16k64L89P2Mk64N04j9m50OM41k83l1R1j40K23K9
7667B15l3m9K2j22j56J56j24J22m0O3j0k49K30j95K24j62J74k11J73j9k68K64
$$ plain form
7501 -124 323 36 134 104 183 -23 -1 140 141 -101 -239 -140 -192 -149 -101 18 183 -100 -82 73 -129 -18 -357 -134
7525 -134 -169 -57 -291 17 124 -153 111 39 58 104 118 -65 223 -73 -60 -22 83 -152 19 -37 46 143 -156
7548 -156 -129 -134 40 -51 9 128 -102 -267 81 -191 77 -151 -83 317 90 243 145 -140 47 107 37 36 31 -160
7572 -160 405 -4 3 15 -55 -125 -51 -33 -33 -56 -75 -226 -46 150 -75 -300 -74 117 -8 -15 86 -116 353 161
7596 161 73 -1 59 288 111 127 -139 -133 86 -64 -262 69 44 -19 21 120 -120 149 -3 15 -230 -31 -225 -189
7620 -189 -34 -167 -93 -32 -37 204 -21 88 175 185 85 -7 90 -326 194 -28 95 -148 199 245 45 1 -130
7643 -130 93 78 -206 -228 66 36 23 -93 -357 32 104 108 -156 348 329 -121 -115 326 43 12 103 -37 186 215
7667 215 182 133 155 33 -123 33 -91 31 -9 54 44 -205 25 -170 54 -108 66 -145 28 9 -259 5
7689Eq9K40j02p5J0K79p9J10j70n8j37P9Q2j19l0J07K2k81K07k56Q4m4M2J34j57
7714a96N59o26L46n7N6k7k27L46j28j21J51p0q0J89k62L37k03l7k6O4Kj52L1K17
7738H6P3k38p5K94j55P7l06J54o7J43j82L18j26j99J51J54rk82L22p5K6M2P4j64
7762C6Q2m8l48J19K03k21J78KK4j3k07L30m62L59k40J15r0L72k08n4j20n7J30
7785a18k29M52k87K35j93K21P3l5j5r7K33m2j31n2j81K6R6q0P7o8P2k30R9K61
7809H7p0j42K20j68K30n7K48j84j86j1j7L41j89k49J11Ll8L53m43J8K12Q9l15
7832a57J62Q4r1J87l93K27M6l13J31R0J77k01j25M47l09O0j19K94q0j92j97R5
7854a77J66J75k12o3J16Q1p4n6J54l24J04Q9J65m24L28K9p9J25j99kJ25k60L69
$$ plain form
7689 5 -84 156 54 -21 -11 268 189 299 129 71 -66 13 95 -24 -54 53 75 -206 1 -255 -171 -215 -173 -39 -196
7714 -196 363 -263 83 26 82 55 -172 174 46 -75 76 6 -74 115 -147 190 -13 -50 -76 -12 -10 -162 -131 86
7738 86 159 -79 -154 140 -15 62 -244 -90 -157 -14 -196 122 -4 -203 -52 102 93 -189 133 58 84 126 200 36
7762 36 118 70 -278 -159 44 -177 1 3 27 14 -193 137 -325 34 -206 -91 -181 191 -17 -71 -191 -248 -118
7785 -118 -347 105 -182 53 -140 81 154 119 104 7 240 198 67 15 -166 -140 -44 -124 -47 -115 -43 -273 -174 87
7809 87 17 -125 95 -73 157 100 348 164 -22 -33 -50 291 102 -147 -36 -33 -71 282 -161 -143 69 158 -157
7832 -157 5 89 -2 185 -208 19 65 -248 -117 -27 150 -51 -176 271 -38 22 -97 197 117 -75 -272 -177
7854 -177 -11 164 -48 -111 5 86 12 -44 110 -214 -110 -21 144 -280 48 77 -2 123 -76 -78 47 -213 156
7877A56q6j96Q4O5P2%p2J0L5RP2j47j20K03q3J56j51J61j18k74R2M3J60j01qk4
7903f2J07j00n8J02l6R4%r5jO9j13j39L94M9j45Q4j22j56K79k33K54k1j16j8J41
7928A58rk46J20q3J7j94L71l56j00N10j98j60J96J42l91L06r2J61k15j17J60P8
7950E8O1J12k13o2j5L61j42j55Q9lQj42j00%J77j13j6Q9J00l64K04q9j61N10j96
7975bk38K39J38k26j8K48j45K82j72p0r8k7K23M9l26K94q1j89K39k29m1j23L79
7998A06l17J25J79r3pK25J80n79J95R3l25M01l93M36k07n0J34j00P7j50M4K2J50
8021A46J7j46l4K7k16K42j97J22j55J38K70l28K68k04j24K89l19k14O00k68J31
8042D5j42m4n2M39k18Q5o5J23l83L14k1J91m76J79O2Rq5q8J40J0j06N8j02l4K03
$$ plain form
7877 156 70 -126 -42 23 95 95 23 33 68 77 149 2 -118 85 2 158 7 168 50 -224 -132 -89 71 -30 -38 -62
7903 -62 45 -55 -113 -11 -47 47 47 -48 -49 20 -93 -232 162 211 66 150 28 -128 151 -82 172 151 35 17 158
7928 158 149 -97 23 -60 -43 -237 134 -222 -322 188 -10 -170 26 168 -223 83 -9 152 -63 -180 -20 58
7950 58 119 231 18 -44 -59 302 160 5 94 91 99 -43 -143 -143 34 -79 -95 -6 94 -270 -66 -155 -316 194 -2
7975 -2 -240 -1 137 -89 -107 141 -4 278 106 36 -62 -89 134 183 -143 151 70 -119 120 -109 -150 -273 106
7998 106 -211 -86 93 0 -7 218 398 -181 14 107 -218 183 -210 226 19 -31 103 3 80 -70 -26 -4 146
8021 146 163 17 -17 10 -206 36 -161 -39 -194 -56 214 -114 154 -50 -174 115 -204 -418 182 -86 45
8042 45 -97 -141 -193 246 28 113 48 171 -212 102 81 272 -204 -25 37 46 -39 -127 13 23 -83 -25 -127 -161 42
8067D2j42r0J59N6k60J58Q7J09l6j61M5k0rK26k93j07K28q6J12K20r0l16L6K10
8091G8q2n4O0j47J27j30J80k0p4l8j23L44L8j90J22k1k50K33o1K1K7J86m83L09
8115E2P8j88J56Q8%j96Q1nn4j78J17Oj82j64M13m6K58o19J52J31P0j13o0L61J7
8140A75m56K58k28L35j7l2J09l58O0M05j47j30J28J28j75M5l3j88N5J78k00J15
8162B7j48K51k69l6J22j25J91o7o9J58m67K82L66j89J07k29j30L69K05m08K00
8183A41J24l21K93j77l3j93J20K97
$$ plain form
8067 42 -100 -190 -31 25 -235 -77 10 119 83 -78 -33 -53 -62 164 -129 -236 -8 -94 18 238 148 -168 -132 78
8091 78 -4 -58 2 -145 -18 -148 32 12 -62 -100 -223 121 159 -31 91 70 -180 53 -8 13 40 226 -257 52
8115 52 130 -58 98 186 186 -10 71 66 12 -166 -49 -43 -225 -389 24 -22 236 -383 -231 -100 -30 -143 -203 158 175
8140 175 -281 -23 -251 84 67 35 144 -214 -154 251 104 -26 102 230 55 100 67 -121 -66 112 -88 27
8162 27 -121 130 -139 -175 -53 -178 13 -54 -123 35 -432 -150 216 27 134 -95 -225 144 349 -59 141
8183 141 265 -56 237 60 27 -166 -46 251
8191B51
$$ Imaginary data points
##PAGE= N=2
##DATA TABLE= (X++(I..I)), XYDATA
0@%%%%%%%%%%%%%%Pj5J6j6J6j6K4l2L2m0M8n6O5p3Q8j02J14j29J48j67J88k11
36a11K35k64K96l28L67m11M54n02N55o13O77p46Q22r05R96j097J210j336J476
55G75j636J818k027K272k561K909l337L880m596N584p035R379j3777K4744j01223
70h4831j58251K82524J68398j65264j28618J31718Q9659p3494o0526K9193J0642
81D1150O684J0735n1491q3087L3480J05039j7654j22591J876J10617K926r7874
93f0190o369P4701J5513l1862l472k1306k8027N3991N9391o2034o2770O7915O4297
106E9778o2133m6400O6409N0958l0788k6613l823o167K2023L3726l0046n7709
118c0785K2237N7088m0194p7388M1575Q8657l6337r3029K7728P4715m2520n5773
$$ plain form
0 0 0 0 0 0 0 0 0 0 0 0 0 0 0 0 7 -8 8 -8 8 -8 16 -16 16 -24 24 -32 33 -40 48 -54 60 -69 79 -88 100 -111
36 -111 124 -140 156 -172 195 -216 238 -264 291 -322 355 -391 431 -474 522 -575 635 -701 775
55 775 -861 957 -1070 1202 -1359 1550 -1787 2093 -2503 3081 -3954 5425 -8352 16392 -84831
70 -84831 -243082 39442 207840 42576 -86042 45676 135335 61841 1315 30508 41150
81 41150 47834 58569 7078 -76009 -42529 62510 44856 -77735 -75859 34758 37684 -60190
93 -60190 -66559 8142 23655 -8207 -11679 -32985 -61012 -7021 52370 -9664 -72434 -4519 59778
106 59778 -2355 -48755 17654 68612 37824 11211 7388 1221 23244 56970 26924 -30785
118 -30785 -8548 48540 8346 -69042 -27467 61190 24853 -68176 -40448 34267 -8253 -64026
130f4026O8563M8245q6351m9533Q1590L8548p0458r379P9090K761o9396K335N9908
143C1897J4192j8269J344p038k3420J0727K5039k2169l0938K1668J9264m7675
155b5378m5158M3523N6988k8406m3224K5024K7702k1194l924L7686Q862k6423
167F078j501M108k1641qL3853j85l6849r613J6360l068l722K5288J1545k3318
181b673o149J9471k051j4361K1052K8220k8926m6529J6476L6979j9222l0140K6688
194a165K6169l9406l3790L8470L6774j9498j7566J5010K866j5951J797J3941M96
207H147N21J587k1683j8385K5386L0604j6148k7647J5193K3957k0926k2961K5951
220C596K9843j8332l1601K014J4122l383q35P855o360j0292O725N306p176N212
$$ plain form
130 -64026 4537 52782 -33569 -83102 -1512 37036 -33422 -42801 36289 39050 -30346 -28011 31897
143 31897 46089 27820 29164 22126 -1294 9433 34472 12303 -18635 3033 22297 -25378
155 -25378 -70536 -27013 29975 1569 -41655 -16631 11071 -10123 -14047 23639 32501 6078
167 6078 4577 8685 -12956 -12964 20889 20704 -16145 -25758 -9398 -12466 -16188 9100 20645 -2673
181 -2673 -8822 10649 8598 -5763 15289 43509 14583 -31946 -15470 21509 2287 -27853 -1165
194 -1165 25004 -14402 -48192 -9722 27052 7554 -10012 4998 7864 -8087 -6290 7651 8147
207 8147 8668 10255 -11428 -29813 -4427 26177 10029 -17618 -2425 21532 606 -22355 3596
220 3596 33439 15107 -16494 -14480 -358 -3741 -4576 3279 -3081 -13373 -6648 -1342 -8518 -3306
234c306K3078J622k3730n816J5421L933n725K534k128j5163n336J1686r15j2227
248a6072R893J9124j2386k4331J1499L0783P3k0965J614J3433o785j2671L064
261c727P615r93m182n298q092J066J5740N631j1073p33J2312J254j1784K592J6173
276A6501j365j5843j371N361o757o065Q620N641j2089o874J0869M063p022L494
290b837J0688p92q682j266M379p2P18J784n643n670L797L972m110j668J0233O951
306A1782j0155p071J0711Q754o687o200M965J303j0873m488N120o20k740J238
320d961j616m949J737Q795K499k839L774M552m167k798M079M804k294m259j339
335A018j907m124J231M922K52m101m16L964j311k631O379N720n378n090J171L08
$$ plain form
234 -3306 19772 21394 -2336 -8152 7269 11202 5477 8011 5883 -9280 -14616 -2930 -3845 -16072
248 -16072 -6179 12945 559 -23772 -12273 18510 18583 -2382 -768 12665 5880 -6791 -3727
261 -3727 3888 2895 -1287 -6585 -14677 -13611 2129 7760 -3313 -4046 8266 9520 -2264 328 16501
276 16501 15136 -707 -2078 3283 -3474 -9539 -919 4722 -7367 -14241 -3372 691 -6331 -2837
290 -2837 7851 7059 -1623 -2889 1490 1418 2136 3920 -1723 -7393 -3596 376 -3734 -5402 4831 11782
306 11782 1627 -5444 5267 14021 7334 1134 6099 7402 -3471 -7959 -2839 -3459 -6199 -4961
320 -4961 -6577 -11526 -9789 -994 1505 -1334 2440 6992 2825 27 4106 8910 6616 2357 1018
335 1018 -889 -5013 -3782 1140 1392 -2709 -3125 839 -472 -3103 3276 8996 3618 -1472 -301 7
351Gl054J098L368l485m848J536R40n70L859M526p03l143L24K553O83N15K224
368E830l40m328m580O01M402Ok457J203K37l026J12L326K877n71k49k365n251
385d573j23M543r24l382l20j81k167j16M453M360J242Q98R71p07Q60L260L811
402A1905j54o114m693J260J48l965k843J137O38m174l902O51M089O413R25n935
418d614j537N810N305k702m444K804N176k360p581k517P820P624l918q497N42
433c089Q467M284n228l495N095M057l778q189k373N454L460m913q117m154M701
448g818O185l865p527J938J0762K324j1313l110J3876R972p869r902N859J0764
462A0276j090o628J843N549N43l131k047R1Q65K106q58p480n107J457K451m195
$$ plain form
351 7 -3047 -1949 1419 -2066 -6914 -5378 -4438 -5008 -1149 3377 2674 -469 -145 2408 3091 3606 5830
368 5830 5490 1162 -3418 -2817 1585 1591 -866 337 574 -2452 -2340 986 3863 3292 3043 678 -4573
385 -4573 -4696 -153 -1077 -4459 -4779 -4960 -7127 -7243 -2790 1570 2812 3710 4681 3974 4834 8094 11905
402 11905 11751 5637 944 2204 2352 -1613 -4456 -3319 -2681 -6855 -10757 -10106 -6017 396 1321 -4614
418 -4614 -6151 -341 4964 2262 -2182 622 5798 3438 -4143 -6660 1160 8784 4866 -3631 -3089
433 -3089 5378 9662 4434 939 6034 10091 6313 -1876 -4249 1205 4665 -248 -8365 -12519 -7818
448 -7818 -1633 -5498 -13025 -11087 -325 1999 -9314 -12424 1452 11424 3555 -6347 -488 10276
462 10276 9186 2558 4401 9950 10493 7362 5315 5406 6271 8377 7519 39 -5068 -3611 -1160 -5355
478e355o506k01L553j844m221J824N598K078J09L773L261j707J789P938L119o080
494G128l456N019N369o396q601K788Q260k582j1956k143R607K511o843k633J139
509b789k18Q21J605m769o637N158R553o548j4282L289J8054M210j7039o549J9885
524C744J3516j3443j1811J3365J5433o149j3243R83P388K424l156p800n485M164
538g0N911m912j1669p87J2047L076j2880r164R939J4835o685j4554M848J4269
552D204o72j0328J298R369K674l114r80L28J917L218Q56k740m063o59M464O55
568F427r037l746Q583L663j2400o006J1334N104q979l166P817L054o367j268O388
583A401K693n630l346N046L644o103m272Q063M846p238m020O181L937k601k5J193
$$ plain form
478 -5355 -11861 -12062 -8509 -10353 -14574 -12750 -7152 -5074 -4965 -1192 2069 362 2151 10089 13208 7128
494 7128 3672 8691 14060 7664 -937 1851 10111 7529 -4427 -6570 3037 5548 -1295 -3928 -2789
509 -2789 -3007 -2186 -581 -5350 -11987 -6829 2724 -3824 -18106 -14817 3237 7447 -9592 -16141 3744
524 3744 17260 3817 -7994 5371 20804 14655 1412 2395 9783 12207 9051 1251 -4234 -70
538 -70 5841 929 -10740 -11527 520 3596 -9284 -18448 -8509 6326 -359 -14913 -10065 4204
552 4204 3532 -6796 -5498 3871 6545 3431 2451 2779 4696 7914 8770 6030 1967 1308 5772 6427
568 6427 -2610 -6356 2227 5890 -6510 -12516 -1182 3922 -5057 -8223 -406 2648 -3719 -4987 1401
583 1401 4094 -1536 -4882 164 3808 -2295 -6567 1496 6342 -896 -4916 1265 5202 2601 2576 3769
599C769j871P17L828l677n702L589M855l962q409j085P470L595o609o642O232
614c902Q948n064q160N741Q447k460n207J07K597J662N80j685k809Q47K505r26
630A221j679r38Q12M017M91o874j778P891L026p777l788O093J974m492j755K240
646a316J834N47k717k100K530L001j502j235J736M24j411O19J97r62K061J74l190
663a310j30L421p55k579J787K813k460l113K212J744J88j968k335J230K906k557
679i06m166K693M443k386m498K515L078k78N06Q5o00J500J224j698q16J736J62
696B594j282n19r42j509K264J054l271j429K560M83j667o56J058R41P73r86k989
713c523R57M548m76m107J348K898J42j941P1J572J289q9j568j263K633J057k646
$$ plain form
599 3769 1898 2615 6443 2766 -2936 653 5508 1546 -6863 -7948 -478 3117 -3492 -10134 -3902
614 -3902 5046 -18 -8178 -2437 6010 3550 -1657 -1550 1047 2709 3289 1604 -1205 -358 2147 1221
630 1221 -458 -1396 -584 3433 3924 -2950 -4728 3163 6189 -1588 -5376 717 2691 -1801 -3556 -1316
646 -1316 518 1065 -1652 -3752 -1222 1779 277 -958 778 1202 -209 410 607 -355 1706 1880 -1310
663 -1310 -1440 1981 1226 -1353 434 3247 787 -2326 -114 1630 1818 -150 -2485 -1255 1651 -906
679 -906 -5072 -2379 2064 -322 -4820 -2305 773 495 1001 1086 486 1986 3210 1512 696 2432 2594
696 2594 1312 793 -149 -1658 606 1660 -1611 -3040 -480 3 -1664 -2320 -1262 -321 452 -534 -3523
713 -3523 -2566 1982 1506 -2601 -1253 1645 1787 -154 -83 1489 2778 2689 1121 -142 2491 3548 902
730I02o82J539j250j158q02K10J64p0o17j082Q91Q58j250O74K166j847r85K197
748a42J470j623l06K290P40j903k2O31Q69N90q18j341J441O74j750j285R93J230
766A738j360j789q08N22J038q97k000R54J886j096j510J306K003k46m19N91Q11
783G24LJ210R1p16O15J03j1n43m4O72r1o13j099p11M80O01j083p89m17K31J80
804a207j333l92J084J169q94j295Q84K164k5j161P92J613O00j159O4J350L64j08
822B510q08o88Q13K17j029j78j55k06q50j051J77M87j54p66n76J44K92k23n39
841b583J133J55j9Q8O91Q14L31M55P38p24N99R81l82r7K18N83p21j457j44N82
861A241r00q16n55k86k83o30j6Mp19J78R48k39m94M85J735P53j228O69J201L95
$$ plain form
730 902 220 1759 509 -649 -1451 -1241 -1077 -1147 -1764 -2846 -1955 -1097 -2347 -1673 493 -1354 -2339 -142
748 -142 1328 -295 -601 1689 2429 526 504 1135 2004 2594 1776 435 1876 2550 800 -485 508 1738
766 1738 378 -1411 -2219 -1697 -659 -1556 -3556 -2602 -716 -1812 -3322 -2016 -13 -259 -678 -87 724
783 724 727 1937 2028 1312 1927 2030 2019 1476 1432 2104 2013 1400 301 -410 70 671 -412 -1201 -1618 -1387 -1207
804 -1207 -2540 -2932 -1848 -679 -1573 -2868 -1984 180 155 -1006 -214 1399 1999 840 904 2254 2618 2510
822 2510 1702 1014 1827 2044 1015 837 682 476 -374 -1425 -1248 -761 -915 -1681 -2257 -2113 -1821 -2044 -2583
841 -2583 -1450 -1295 -1314 -1226 -535 279 610 1065 1803 1079 1678 2659 2277 2180 2398 2981 2260 803 659 1241
861 1241 341 -475 -1030 -1316 -1599 -2229 -2245 -2241 -2960 -2782 -1834 -2073 -2567 -2082 -347 406 -822 -153 1048 1443
881A443M13N13k19J34N81L43j238q69J011N06j183j752j86L93N9j212r17n54O91
900b043K92j288o15P10J823L40k217n4L508J324j814p19K303J831j248n77P83
917B339L78O21L16j959j201R21J108j460k507q5J893o25k422q97J451J468j773
934b434j315J012J178L95J61Q8L39N96R88R1l83R61R05Rl43k28k83N19O32r06
954A982k060J72J885j120k530J03J293r42j283N9O98p62N6J686m92k301J364L333
972A141j30l017J32M843P09m359m70M297R61k719j188J650K80q78J73l05k003
989h83L59K022r78l751p2M186k82m216r92L749K080k786k057K382K410m84j998
1006a311J98J841J447o46j309K81P87Q52n69p67j61j37J299m00k141m58K072J237
$$ plain form
881 1443 1856 2369 2150 2284 2865 3208 1970 1101 2112 2618 1435 -317 -503 -110 -51 -1263 -2180 -2734 -2043
900 -2043 -1751 -3039 -3654 -2944 -1121 -781 -2998 -3052 456 1780 -34 -753 1550 3381 2133 1556 2339
917 2339 2717 3338 3654 1695 494 1415 2523 1063 -1444 -1529 364 -261 -2683 -3580 -2129 -661 -2434
934 -2434 -3749 -2737 -1559 -1164 -1003 -915 -576 20 1008 1099 716 1677 2582 2591 2248 2020 1737 2256 2888 1982
954 1982 -78 94 1979 859 -1671 -1568 -275 -1217 -2500 -2441 -1743 -2505 -2449 -763 -1255 -3556 -2192 1141
972 1141 1011 -2006 -1874 2969 3678 -681 -1151 3146 4107 1388 200 1850 2130 1252 1425 1120 -883
989 -883 -524 1498 520 -3231 -3303 883 601 -3615 -4607 -858 1222 -1564 -3621 -1239 1171 687 -1311
1006 -1311 -1113 728 2175 1529 220 501 1288 2140 1571 804 643 506 1805 1405 -736 -1194 878 2115
1024B115l027k519L260J856k972k017K513J840k808j348L329N42l138O74L324
1039A624o34k989J492L306r74l257J745K967j561k284J297J962k204j598K581
1054A473L80l540N44L016j122l755R26L101o49l126K62K580J49j496o75Q19J808
1071F95J75j458l50R55J890q99p35P8J014M29o85r65M31K82O14l15j873k97J752
1090G38Q86k551k111L195J716l777j726L368J159k743k91K345l61j530J416J041
1106G74j380j60K135N32j744p79K803R81k548j214K573N42k632o10K429k98l251
1123a847J182J065j463j318J823K83j941L63J707j116o22J460L49j061O92P82
1139C38O0J43J11Q77k11n33K10N83l1q68PO99j217l02R00m50j914M70J407j406
$$ plain form
1024 2115 -912 -3431 -171 1685 -1287 -3304 -791 1049 -1759 -3107 222 764 -2374 -1700 1624
1039 1624 990 -1999 -507 2799 1825 -1432 313 3280 1719 -565 732 2694 490 -1108 1473
1054 1473 1853 -1687 -1143 1873 751 -3004 -2078 1023 374 -2752 -2490 90 239 -1257 -1932 -1113 695
1071 695 870 -588 -938 17 1907 1008 273 351 1365 1794 1109 144 575 857 1471 1156 -717 -1014 738
1090 738 1624 -927 -3038 157 1873 -1904 -3630 -262 897 -1846 -2137 208 -153 -1683 -267 774
1106 774 -606 -766 1369 1901 157 -622 2181 3162 614 -600 1973 2515 -117 -727 1702 1404 -1847
1123 -1847 -665 400 -1063 -2381 -558 -275 -2216 -1853 -146 -1262 -1884 -424 -75 -1136 -444 338
1139 338 398 541 652 1529 1318 785 995 1578 1547 679 686 1385 168 -134 766 316 -1598 -1128 279 -1127
1159a127j622K191P35k527L52K010p55j236J438J005j030k44J929J69j417P63
1175F34J357m93n21j52R45L07j650j12J335q02j886L73J434j713j254J830l2j855
1193b255P46J644j642q11J841M25j264K08K078k49j126J118O11k88n27O06N22
1210A637Mn03o5J99m10l85N6M87j670j76J101q45j485J088N67j307j33J223l82
1229i99q07R24J187j428r6K041Q7r22L97J036k52k47K34M24k01M0l32j12P9p32
1249C21k30O42j288p09J249Q1j753o6J497m16j312Q55Q04j186L54J633q18o54
1267i96J320Q82r64k60J267L37o00N6n9L28Q5p30j17J8k91l71L29o84l99o1M51
1288d59q35n19R96k1r54L52J051l54m52O80P71m89N69Q18m93p5Q91J90l50o3J24
$$ plain form
1159 -1127 -2749 -558 177 -2350 -1998 12 -743 -1979 -541 464 -566 -810 1119 1288 -129 634
1175 634 1991 1498 977 825 1770 2077 427 315 1650 848 -1038 -665 769 -944 -2198 -368 -400 -2255
1193 -2255 -1509 135 -1507 -2318 -477 -52 -1316 -1108 970 721 -405 713 1324 1036 509 1115 1637
1210 1637 1641 1138 1073 1272 862 477 533 1020 -650 -826 275 -570 -2055 -967 -400 -1707 -1840 -617 -999
1229 -999 -1806 -882 305 -1123 -1219 822 909 -13 384 1420 1168 921 1155 1579 1378 1418 1086 974 1053 321
1249 321 91 733 -555 -1264 -15 66 -1687 -1753 -256 -672 -1984 -1129 -325 -1511 -1157 476 -342 -996
1267 -996 324 1206 242 -18 1249 1586 986 1042 983 1311 1396 666 549 567 276 -95 234 -450 -849 -910 -459
1288 -459 -1294 -1813 -817 -838 -1792 -1440 -389 -743 -1195 -515 256 -233 336 1154 661 586 1477 1667 1317 1254 1378
1309A378L1j96l65j01k48l48k50k22N6o72l35O37n47o48R27N40q52j42J212l6
1329a81q42Q94R73p81Q0P93K82j38j78N35Lo42K31l7K7l55k96l37K26p84k2k05
1351g54Jl03j86K45j94k67O45j13k40M18L56J37J10L73M15J82l2J20KM4L14o17
1373F56p0L12J96n42n03L7K52n32m15K45l28jm95j62L85k64n3M92J18k02L26P54
1395B06O4l70M27R67l78m76L94M93m43j22M2r2J04l53p9n09K93m16K4j58l13j27
1417h22J32k53J11m63K33K88n9qJ01M33K38L88m04Q80oK2l3R9L84m23j18N34m92
1440G62n63N02k6m96m35RJ24k33r68L24L69J0m72m66Q93L33n35J76N40o9p1J41
1462a51N38m5k35J242N0p68j43O01K03n22l66K85L55o03r02M00K06n98n88K84
$$ plain form
1309 1378 1409 1213 848 747 499 151 -99 -321 -265 -937 -1272 -635 -1182 -1830 -903 -363 -1215 -1357 -145 -181
1329 -181 -1023 -129 844 63 143 936 1218 1080 902 1437 1440 798 1029 992 1019 664 368 31 257 -527 -549 -754
1351 -754 -753 -1056 -1242 -997 -1191 -1458 -813 -926 -1166 -748 -392 -255 -145 228 643 825 793 913 915 959 1273 656
1373 656 586 898 1094 552 49 86 338 -194 -609 -364 -692 -693 -1188 -1350 -965 -1229 -1282 -790 -672 -874 -548 206
1395 206 270 -100 327 1294 916 440 834 1327 884 762 804 712 816 463 384 -125 168 -248 -224 -382 -695 -822
1417 -822 -690 -943 -832 -1295 -1062 -774 -833 -841 -740 -307 -69 319 -85 795 789 811 778 877 1261 838 720 1254 762
1440 762 199 701 675 179 -256 -247 -123 -356 -1324 -1000 -631 -621 -1093 -1559 -666 -333 -868 -692 -152 -221 -292 -151
1462 -151 387 342 107 1349 1399 631 488 1089 1292 770 404 689 1044 441 -461 -61 145 -453 -1041 -757
1482g57K73o70J7L32Q2k24N9N64K11k43J72M10P4K8j73N81K45m82J09K65L13m77
1504G09m4K82L1p38n7J42j55o14j54J54j19o49l5N47m3n77K32P29R9l30J34O96
1526B40K99p27O45N32l17o08Q89O39r03m24P04M53j033p22J215m3j061m93N87
1545a28J33q72m80P43l08m74J83M19l82K86L29K82k61J04O61L79k5L24K53mj97
1566I65k45K26k7l30k8k42k76K61k9q71L40J12l53n75M86J98p07l67J014k51j82
1587h81P1Q13J10r18O79R45k97m43P52O68o58m66P97K96j079k31Q04l63q20l4
1607b55P06o92q64M00L65o26l56P28pn41L3N11J85l52M03L48K06j42M06L51j20
1628F87j54L60J37l71K01M80n01m15J09L58q97l28L96k91j000L47M04p16k38P86
$$ plain form
1482 -757 -484 -1154 -1137 -805 -723 -947 -888 -324 -113 -356 -184 226 300 328 155 736 981 499 608 873 1186 709
1504 709 665 947 978 240 183 325 170 -444 -598 -444 -563 -1212 -1247 -700 -743 -1320 -1088 -359 -260 -590 -456 240
1526 240 539 -188 457 989 672 64 953 1592 689 265 969 1422 389 -333 882 839 -222 -715 -128
1545 -128 5 -867 -1347 -604 -912 -1386 -1203 -784 -1166 -880 -551 -269 -530 -426 235 614 589 913 1166 1162 965
1566 965 720 946 919 589 561 319 43 304 275 -596 -256 -144 -497 -1072 -586 -388 -1095 -1462 -448 -699 -881
1587 -881 -810 3 113 -805 -126 819 522 79 831 1499 841 375 1172 1468 389 158 962 599 -221 -255
1607 -255 451 -241 -1105 -705 -340 -966 -1322 -594 -601 -1142 -1109 -598 -413 -765 -362 -14 192 50 456 807 687
1628 687 533 893 1030 659 860 1340 839 424 533 891 -6 -334 62 -229 -1229 -882 -478 -1194 -1432 -646
1648f46L44q95K72Q39K13p99K96R00m7n61K24Q97l75n14Q13M87p22n90Q20L1r93
1669fj05R13r34q38O88L17q87l71P80j74p30K75N05j77M7M16N20m27L07L64K23
1690G06k63J97L28l76l1J41J80j32n90N88K76r25k86O23j04j412M81R22j123n57
1710a357J029J74j239K2R88p1l99L12N82k06m0L25P36N8m31M03N01m43p84R24
1730A084J19j089J12M69n26j014P14N73r08o02P75m15p38M76P09q16k39Q72J37
1749c07o03N36O48q0q0M11J08J36m39L43O46o06m46O32K79o58p50R10m05j229
1769i54N95N62o18r72R06L86r62k09J242l48p73P12O86n71q2N85J81j19k06L90
1789D31N77l68j64L64L82n77q1M79n80n14K13K90q72j70N01l20p30%O82n32m55
$$ plain form
1648 -646 -302 -1197 -925 -86 127 -672 -376 524 477 -84 140 1037 662 148 961 1448 726 136 956 987 -6
1669 -6 -111 802 -132 -970 -282 35 -852 -1223 -443 -617 -1347 -1072 -567 -744 -697 -281 239 -188 119 483 706
1690 706 443 640 968 592 561 702 882 750 160 748 1024 99 -187 436 332 -1080 -599 323 -800 -1357
1710 -1357 -328 -154 -1393 -1371 -383 -454 -853 -541 41 -165 -205 120 856 914 483 886 1387 944 160 1084
1730 1084 1203 114 226 695 169 -845 -131 442 -466 -1068 -293 -708 -1446 -970 -261 -1077 -1316 -444 -307
1749 -307 -910 -374 274 194 114 525 633 769 330 673 1319 713 267 899 1178 520 -230 680 275 -954
1769 -954 -359 203 -415 -1387 -481 -95 -1057 -1266 -24 -372 -1145 -433 253 -318 -400 185 366 247 41 431
1789 431 1008 640 476 840 1222 645 564 1043 463 -51 162 452 -420 -590 -89 -409 -1139 -1139 -457 -989 -1444
1810a444J204j85m33J73R19r8m71M96P19n31p2N78k8j38l53P30o9k71l79M97k61
1831E83r08j89P32l13r51N66J87q70n7O34K8n21K28N17j16P5P43j73k17L61J99
1852E38k36M48J06k24Qk91L06k6k47J54j17k06o2m11J11K41r57L04L51m24n73
1873a207Q46k04p22K83J130n39j99K58N53M2k69O17J97l30J42J09K03j53r2L6
1893G01K12k98p84L35p3k47o09M03O9m00O7k8j78J34J51J53l67K42K48p7L87K58
1915B99l48K64M37j93j11J94J80j07j47j54P02m71m34J57j87k93j18q6J02Lm52
1936g63K34J3k86m4L36K66l15k00O58J72j30K50J68N2K05l6R5j79K82k68R4K44
1958H48j01q55M53L7o36j33M92m62k63j42J90K2m99M71m2J28R6j0L36J41l36N23
$$ plain form
1810 -1444 -240 -425 -858 -685 234 136 -335 161 880 349 277 855 827 689 336 1066 997 726 347 844 583
1831 583 -325 -514 218 -95 -1046 -480 -293 -1163 -1220 -586 -558 -1079 -851 -334 -450 -375 368 195 -22 339 538
1852 538 302 750 856 632 640 349 655 629 382 536 419 213 151 -260 -149 92 -865 -561 -210 -634 -1207
1873 -1207 -361 -565 -1287 -1004 126 -413 -612 -354 199 241 -28 589 786 456 598 707 910 757 665 701
1893 701 913 615 -169 166 93 -154 -763 -360 -291 -691 -624 -652 -830 -696 -545 -392 -759 -517 -269 -346 41 299
1915 299 -49 215 652 459 348 542 722 615 468 314 1016 545 111 268 81 -212 -330 -416 -314 -311 -763
1936 -763 -529 -516 -802 -846 -510 -244 -559 -759 -101 71 -59 191 359 411 616 580 675 496 778 510 604 848
1958 848 747 -108 345 382 -254 -387 105 -357 -620 -762 -572 -550 -1049 -578 -620 -492 -396 -406 -70 71 -265 258
1980B58K91qj2M0J35m5k36O2K43j23j44j34L4k62m19J76j39Ll58J38OO3l63M31
2004c63K6k84p5O9K87K42l17P64P3j93M7L76m0r2O2J93N5l68j11J08J63o33j3
2027b4J17k52m73M96m40J48l42k10K92J59k14J21K14m8L27J39L2k9J77m0K98J56
2049F04K38m00J30k8j12L3j90k21L15k21m04k89J37p0R4P3k98j96L0N97m16L78
2071b16j17j08p4L27M63l60K66l9J72M1J00K1J74Rj80j93L55m83Nj08j55q1j18
2094b99P1j98k66J71l1k81M10r4M7j10J75J38L5K14q7M53K0K8L3J17O2J12Q5K2
2118H27m02J39p7l97J36j58j75j67K9P6l1q17N61n1k02O7J87J92l57R4M48J30
2140E2K4K4K53O8k51K73R0J01k89M13O8n28k86L12J25m26q5p4k33L3K55k15n55
$$ plain form
1980 258 549 541 529 569 704 659 423 485 728 605 461 327 361 99 -320 -144 -283 -280 -638 -500 -494 -431 -794 -363
2004 -363 -337 -621 -696 -627 -340 -98 -415 349 422 229 276 652 612 520 582 775 830 462 351 459 622 -11 -24
2027 -24 93 -159 -632 -136 -576 -428 -770 -980 -688 -529 -743 -622 -408 -456 -129 10 42 13 190 150 448 604
2049 604 842 442 572 544 432 465 275 54 369 148 -256 -545 -408 -478 -384 -311 -609 -805 -775 -178 -594 -216
2071 -216 -333 -441 -515 -188 275 -85 181 142 314 355 455 476 650 659 479 286 641 158 163 55 -100 -181 -299
2094 -299 -228 -426 -692 -521 -552 -833 -423 -517 -470 -580 -405 -267 -232 -18 -105 348 368 396 429 546 608 720 805 827
2118 827 425 564 487 90 226 68 -107 -274 -245 -169 -200 -1017 -456 -507 -709 -642 -455 -263 -620 -526 -78 52
2140 52 76 100 353 421 170 443 533 634 345 758 826 298 12 324 449 23 -62 -136 -369 -336 -81 -296 -851
2163h51K40J95j32k9q8K30K72J6O6j81O35l1Q8N7k47M29J04k40l0J26qj31m56
2186C4J93J53o98K14J33l14k42J10Q1j33k40J10K64k85J15M1K46J38k70L48j8
2207b0J11L21J53M7r4m7N02n17L0P9l57j76J18m0j82j50l9k3m69Q7J17p3j0J86
2231d46P9k42K20m6L64J55l55K97K31K97j43J81J53j49o9O0q7l27M21rn23j97
2253a35N19k12o76J84K0j94P3m4R8q0n29N93J5l82M27K29q4M70j58J85N7k54N64
2276F86K5k42j48L14l6l00p8Q3j84k68K18k50j07k94M86k68l28J87J27k69j51
2297g97L80K43p9L56k68L49j13J30J85J86K6l5r3P1l29l5P22n97k62J75r0n12
2319c87N5L87n39k92N42k33j18J16M0o7L8K5L99p8p8K31L3J38J79j71J25j14J84
$$ plain form
2163 -851 -611 -416 -548 -577 -665 -435 -163 -147 -81 -262 373 342 430 487 240 669 773 533 503 629 621 490 34
2186 34 227 380 -318 -104 29 -285 -527 -417 -336 -469 -709 -599 -335 -620 -505 -464 -218 -80 -350 -2 -20
2207 -20 91 412 565 612 518 471 973 456 486 565 208 32 150 110 -72 -222 -261 -284 -753 -666 -549 -622 -632 -446
2231 -446 -367 -609 -389 -435 -71 84 -271 26 257 554 411 592 745 596 527 587 500 173 594 585 62 -135
2253 -135 384 172 -504 -320 -300 -494 -421 -465 -367 -447 -976 -383 -368 -750 -323 -94 -178 292 134 319 376 122 686
2276 686 711 469 321 635 599 299 221 304 120 -148 70 -180 -287 -581 -95 -363 -691 -504 -377 -646 -797
2297 -797 -417 -174 -253 103 -165 184 71 201 386 572 598 563 470 541 212 177 899 302 40 215 125 -387
2319 -387 -332 55 -484 -776 -234 -467 -585 -469 -429 -496 -458 -433 -34 -112 -190 41 74 212 391 220 345 231 415
2342D15n2K61m11J54L29m83j94j36K85l72j56M07l09l86K50Lk21j40N47k60j04
2363e73l7N69o1n2J64N9K24J66k43M83O7l80RK12j21l25P1K42l65l28L84k31l57
2386d23L54m63J32o2P9M6k07L86j82J71J66j15K46J82j81r6L22K30l28J42M29
2407H28l98m8K16k26j94J54O1n15n2K83l89k90L32j30j82j19J26j37J19N9J54
2428c48J03Q9J38j8J31J5q7L07j0J96j31q3L82k87l8J03l16m57K78N5Q2l24K01
2451a9l77l16L01r8q0K14M8j46R9m3K74L3Q1o2rL66J88k5k39L49J52j58k61j18
2475A54K03m81M33j19l59J90j76J00M0m10R5j51J54k71J13L17J42o72O36J42j45
2496f5M96l65M42k87k2L25M5k46J19J0k53R0l70OJ13p4q6Q5k36l47L99j33R1r8
$$ plain form
2342 415 363 624 213 367 696 213 19 -117 168 -204 -360 47 -262 -648 -398 -395 -616 -756 -209 -469 -573
2363 -573 -610 -41 -102 -154 10 69 293 459 216 699 766 386 395 607 486 161 232 474 109 -219 165 -66 -423
2386 -423 -69 -532 -400 -462 -383 -337 -544 -158 -340 -169 -3 -118 128 310 129 33 355 585 257 399 828
2407 828 430 382 598 372 178 332 393 -122 -174 109 -280 -570 -238 -368 -550 -669 -543 -680 -561 -502 -348
2428 -348 -245 -156 -18 -36 95 110 23 330 320 516 385 302 684 397 359 462 146 -311 -33 22 104 -220 -19
2451 -19 -396 -712 -411 -509 -589 -375 -327 -473 -374 -417 -143 -110 -29 -91 -100 266 454 429 190 539 691 533 272 154
2475 154 357 -124 309 190 -169 21 -155 -55 -15 -425 -330 -481 -327 -598 -485 -168 -26 -698 -62 80 -65
2496 -65 431 66 508 221 199 524 569 323 442 452 199 289 -81 -75 38 -36 -122 -37 -273 -620 -221 -354 -263 -361
2520c61qp2K04r3nJ09M46j69q8p0J96L09k78M70m79K00K17j82K4j04J8O6r2r2
2544A66L1k16l61pK22m33M14k56q1J56J90j04R2k47J24M74j21j76M96m9qL3j8
2567C21K73k66J13J98l44N4l83J93L3L0l32q1q2j03L2j44Rn4J14k6P5J00J1O9
2591a90J94KJ62k32M68j08j84K36M2J82k12k14J76J03j56l7ll69l6Nk03K55k86
2614d05J37j76O8J1j19K17Lj35M33n4r2P9P6K49p1J24j27J51R3k09K26Oj89J00
2638C96J26m90N6N7l49k38L64q2J37n40M95n74M79j8j73r4J55J56MK59l8oK8K5
2662A35K68L1J20k23J12p3nk12J99m8p00M47mj63k74p6K52j75k07K79j07N1J4
2685c59K42k84R3P6L34k1L7O3K13k35N1K6J71k74k6K43n7j59K08j6l95K04k42
$$ plain form
2520 -361 -369 -441 -237 -330 -335 -226 220 51 -37 -107 89 398 120 590 111 311 528 346 370 266 284 350 258 166
2544 166 197 -19 -380 -387 -165 -598 -184 -440 -521 -365 -175 -279 -187 -434 -310 164 43 -133 363 314 306 339 321
2567 321 594 328 441 639 295 349 -34 159 192 222 -110 -191 -273 -376 -344 -488 -479 -533 -419 -445 -370 -270 -259 -190
2591 -190 4 6 168 -64 404 296 112 348 390 572 360 146 322 425 269 232 229 -140 -176 -171 -374 -119 -405
2614 -405 -268 -444 -376 -365 -484 -267 -264 -399 34 -20 -112 -33 43 292 221 345 218 369 462 253 479 485 296 396
2638 396 522 32 88 145 -204 -442 -78 -160 -23 -563 -68 -642 -163 -181 -354 -448 -293 -137 -133 126 88 82 110 135
2662 135 403 434 554 331 443 370 365 153 352 304 -396 51 47 -116 -390 -466 -214 -389 -596 -317 -424 -373 -359
2685 -359 -117 -401 -308 -232 102 81 118 181 394 159 210 236 407 133 107 350 293 134 342 326 -69 135 -107
2708a07j18k1j64N8k32J92K29m02K50J60R9k85L66M8j30r8LL37K06j79q3K31J82
2731E42l47Q7K5L1k21J84k96K77m58j00N3j76J18R8k91O7n9J80J3j93K14J99J94
2754A41Oj47M3N1mJ23K19k20K29j21k67P1lkj66J50O6k30J66l77k3J38J5j60k27
2779e29J48p0K76l9r4J33R9M6lJ57k0Q9N8j1J85k19k7K11q7l04r5L63k21j77J2
2804a19jk71l8K35j36K68k3p9j70j59K69P8J05J89q0j38L0K41Q3n3J3l81M97l2
2828C28P7J64l54o5l84M22j06j40L21j83k08j50M5j73P3P4j75L74l68J07J59r
2850a71J25r1K64K7J19j84L47l21j20N26k80lmjj76j99M28l24o5%k9n9j80J08
2874b63J71m02L83l63J87J86j91M8J92K51k58M0K57N5p2L87l11l55N97l72L6J1
$$ plain form
2708 -107 -225 -246 -410 -352 -584 -392 -163 -565 -315 -155 -56 -341 25 73 -57 -155 -152 185 391 212 129 360 542
2731 542 195 282 307 338 117 301 5 282 -176 -276 -223 -399 -281 -183 -474 -407 -466 -286 -273 -466 -252 -53 141
2754 141 147 0 43 94 90 213 432 212 441 320 53 124 121 119 -47 103 169 -61 105 -272 -295 -157 -142 -302 -529
2779 -529 -381 -451 -175 -214 -308 -175 -76 -30 -33 124 104 193 251 240 425 206 179 390 303 -1 -96 267 46 -131 -119
2804 -119 -120 -391 -429 -194 -330 -62 -85 -164 -334 -493 -224 -146 -41 148 68 -70 -40 201 284 231 244 -137 360 328
2828 328 405 569 215 150 -234 188 82 -58 263 80 -128 -278 -233 -406 -333 -259 -434 -60 -428 -321 -162 -171
2850 -171 -46 -137 127 154 273 89 436 115 -5 521 241 238 234 233 57 -142 286 -38 -103 -103 -132 -191 -371 -263
2874 -263 -92 -494 -111 -474 -287 -101 -292 -244 -52 199 -59 -19 238 293 221 608 297 -58 539 167 203 214
2896B14j88J55r3L7k3k81k0J06k65RP1r4L3j73K28j08K55K6j13K51O0OJ82M7J92
2921E14l16Q1R0p4LJ3J45l23pp3j91q3L67k08m2j88K06k73Q8j53M59l45J67Op2
2946b09M29l06J50J47j61J35N3N9k6l3l4k4O6J96k19k14K79k52q8K38l73oj53
2969c46j16L76m56Q8L51j00K04j18K19m13M62o1J06k21Q7J24l1N8k46L09J65p7
2991C64l35K60n1j47j46q5K01j41j21k9J45p5%o1J38k06J02p3K02k25%K21K36
3014A74j38j70M15j03J38O8J02k05l0J18j07k1J95n57J0Q1k00P6J97m30O4J65
3036a58l5k24m6J98J46J11n0j16j62M64j46J25J08K04k10J51j68K07j48m2L2o0
3058A81k07L41l10l06L64J19l88k39M91k64j55K54m7j28J51K41m00L88k77K40
$$ plain form
2896 214 26 181 88 125 102 -179 -199 -93 -358 -349 -278 -372 -339 -512 -284 -392 -137 -111 -224 27 87 93 275 322 514
2921 514 198 279 369 295 298 311 456 133 126 53 -138 -221 146 -62 -104 -292 -86 -359 -271 -424 35 -310 -143 -137 -209
2946 -209 220 -86 64 211 50 185 238 297 271 238 204 180 246 442 223 9 288 36 -52 186 -187 -193 -346
2969 -346 -462 -86 -542 -454 -103 -203 1 -117 102 -311 151 90 196 -25 62 186 155 213 -33 276 441 364
2991 364 29 289 238 91 -55 -140 61 -80 -201 -230 -85 -160 -160 -221 -83 -289 -187 -260 -58 -283 -283 -62 174
3014 174 36 -134 281 178 316 384 486 281 251 369 262 241 436 -121 -111 -30 -230 -154 43 -387 -323 -158
3036 -158 -193 -417 -463 -265 -119 -8 -58 -174 -336 128 -18 107 215 419 209 360 192 399 251 209 241 181
3058 181 -26 315 5 -301 63 182 -206 -445 46 -218 -373 -119 -166 -294 -143 98 -302 86 -191 49
3078D9J1NJ03JK15j32N6p2j58J07K1O4j06O8j06r3k14K05k50K23l57J18N1k53
3102d44K29nO8qj91M57k25j43O91m59J25Q2J36J58k20Q7j60J75m3k5j80p9n4L6
3126Hl20M79l57j00J40J43o05L15N0Q3j19j09K05R0k89N06k08J23k37P9M01j22
3148A56J64%j59qKj35L95m07J27j64m8o4M5j98K96l48K13j2P2j92R5o4Q2J54K0
3173B2j45K81n4N0k02K42O6j01J77r5MO3k45QL14m29K16m4k57J6j07j76K43j96
3197c49J16m7J66j26J56j82J45M5J48J62k05j27M0K22l3M92m68J01j83L00J34
3218E07m43Q2l8j67O0k91M8n7j4L26l50J5j24M62j92k67K52J82k59L48rK67j29
3241B09M9j52R1j0j22K61l98N20l68K19j52j81J18j40J57l0j15l31j97R7L21k85
$$ plain form
3078 49 60 65 168 169 384 252 308 236 78 185 206 270 164 232 126 33 -181 24 -226 -3 -360 -242 -191 -444
3102 -444 -215 -220 -152 -160 -351 106 -119 -262 429 -30 95 177 313 471 251 338 178 353 310 285 105 26 -28 8
3126 8 -312 167 -190 -290 -150 -7 -612 -297 -247 -164 -283 -392 -187 -97 -386 120 -88 35 -202 -123 278 156
3148 156 320 320 161 153 155 20 415 8 135 -29 -77 -141 -96 -294 2 -346 -133 -145 -73 -265 -170 -234 -152 2 22
3173 22 -123 158 104 154 -48 194 260 159 336 241 245 308 63 71 385 -44 172 128 -129 -113 -220 -396 -153 -349
3197 -349 -233 -280 -114 -240 -84 -266 -121 -76 72 234 29 -98 -58 164 131 623 155 256 73 373 507
3218 507 64 146 108 -59 1 -290 -242 -299 -313 13 -337 -322 -446 16 -176 -443 -191 -9 -268 80 71 338 209
3241 209 258 106 197 187 65 326 -72 448 80 299 147 -34 84 -56 101 71 -44 -375 -572 -475 -154 -439
3263d39J75K51k39l6J73j32K87j95M4L04k18K89j88J23K15l07J83J12k37K02k69
3284I8j32j4m6K02O1k48J35j43o1j09Q4k6j11Q9l9K53k74J64J56Q5J35p8Q0n5
3308B06k2J57j45m2ML48k54k29O8L9P4j00j83P0l05m5J2L42k63J66j92j77J58
3331c13N5q1L36j9K01k12J0K63j19M9L5J64j79o9P4qj87J57j61K33l80O1l32M99
3355G7k29KO5j18j39K15J46k03P9j24K0J51Q8K37j25j48L2k01M96j6P2k10K2p5
3379A14Q8n7Q0q6l37L43J01m20L6k11J74j21J12j43L20j06n8K16j77O9NK36k28
3402e0J75j28K04n3K86k88j27N60l53j86N2K2M9r2j71J47ql03R9j64J29m7K2L05
3426H0k85L3K7n0J67K99k72r7j36M37k25K14J57m48M71l20K13k25J55j13J15l73
$$ plain form
3263 -439 -264 -13 -252 -288 -115 -247 40 -155 -111 193 -25 264 76 199 414 107 290 402 165 367 98
3284 98 -34 -48 -94 108 169 -79 56 -87 -148 -257 -173 -199 -310 -221 -260 -7 -281 -117 39 124 259 181 261 206
3308 206 184 341 196 154 158 506 252 23 91 130 204 104 -79 -9 -314 -359 -347 -5 -268 -102 -294 -471 -313
3331 -313 -258 -339 -3 -22 179 -33 -23 240 121 170 205 369 190 121 195 187 0 157 -4 229 -151 -90 -422 77
3355 77 -152 -150 -85 -203 -342 -127 19 -184 -105 -229 -209 -58 30 267 142 -6 26 -175 321 305 377 167 189 114
3379 114 202 145 225 139 -198 145 246 -174 -138 -349 -175 -296 -184 -327 -7 -113 -171 45 -132 -63 -58 178 -50
3402 -50 125 -3 201 148 434 146 19 579 226 40 92 114 163 71 -100 47 39 -264 -165 -329 -200 -247 -225 80
3426 80 -205 -172 -145 -195 -28 271 -1 -98 -234 203 -22 192 349 -99 372 52 265 40 195 82 197 -176
3448a76L16j38j25m8m8KO2J05k61n0R3K5J96J56m04J63J48LJ00j97O3K92k36K31
3472B72k2M4l49N8K47k02j12J19k97M09k48j12K30m09K86k76J75M9m1j77R0M03
3494A37k15J13l11L66j0q6JJ83k16M33P0k05l5l89L32k94J69R4J99j99l39P7o9
3517a94K27K2k8l53K29RJ17k13K81m73K25K48j35Q0JJ24l92N27k1n9k59K84r2
3540A55J51j46k36J99o3j60P1o3j60L4k4j39L76j64j9L0K07j99L07l63O4J30k74
3563b86J59K93r9J14J27k58J65j76QK70m72pK82J61l04O3k41l4J13K16j65k11
3585b82P6J49j4p2O4j09J83j61J96m2n3L86j37o7P7k4l3j14K50j83K2P0m7k17
3609h2r8l2j8J54k13o2J54r3L01j82j42J88l84N07J0N1Jk70K44l29N50k14K44
$$ plain form
3448 -176 140 2 -123 -171 -219 -217 -155 -50 -311 -361 -268 -243 -47 109 -295 -132 16 19 119 -78 -15 277 41 272
3472 272 250 294 -55 3 250 48 -64 55 -242 167 -81 -193 37 -372 -86 -362 -187 -138 -179 -356 -266 137
3494 137 -78 35 -276 90 80 -6 -5 178 -38 395 465 260 225 -164 168 -126 43 137 336 137 -202 -125 -194
3517 -194 33 55 27 -326 -97 -88 29 -184 97 -376 -151 97 -38 42 43 167 -225 302 281 222 -37 247 155
3540 155 306 160 -76 123 60 -100 -29 -92 -252 -218 -242 -381 -5 -169 -188 -158 49 -150 157 -206 -142 -12 -286
3563 -286 -127 166 67 181 308 50 215 39 47 317 -155 -162 120 281 -23 40 -201 -235 -122 94 -71 -282
3585 -282 -206 -57 -71 -143 -79 -188 -5 -166 30 -12 -65 321 184 117 194 170 137 23 273 90 112 182 135 -82
3609 -82 -180 -212 -230 -76 -289 -351 -197 -290 11 -171 -313 -125 -509 -2 8 59 60 -210 34 -295 255 41 285
3632B85M0k29rM1jj03L8K62l59J15k06J86o3j13k75K71q1j9J38l55K08M9K8J67
3656A5J63j12k9J84l09j56J79L43q9j97K29n8PJ0j60J47j78l4J56j51j2j9O2r8
3680a07n6Q7k51K87n5J2j30n4L12k15L59k55l0kJ55j11L66m5k64K04J7j32J17
3703B09M1j04J40k01Qk97l1J67l29M55p2k63K89k55J9m0j1K73J42k06M7K29l25
3726a15M00k30K76j79J70ml91ML50o7l74K16l1m04K66q2J16P3m15L03O8O2j41
3749a29k77L48j09K45p0m5J49LQ9j31j87J63l0J50J17PP1j83m2J18k79N3j90J11
3773d8j32j2N8n2j4M4mJ35j21N7j39K30k23J37p6K99q2j56K13q1J26j79J53l9
3797I4o3Q9R3k23P2q1K41k42r8Q8r2J85l50L64O9j54j05M0nM7L16m33J03kJ19
$$ plain form
3632 285 325 96 87 128 127 24 62 324 -35 80 -126 60 -3 -116 -391 -120 -201 -220 -82 -437 -229 -180 -152 15
3656 15 178 66 37 221 -88 -244 -65 278 189 -8 221 163 170 180 20 167 -11 -45 111 -40 -52 -71 -9 -107
3680 -107 -163 -76 -327 -40 -95 -83 -213 -267 45 -170 189 -66 -96 -98 57 -54 312 267 3 207 224 92 209
3703 209 250 146 286 85 93 -204 -235 -68 -397 58 -14 -277 12 -243 -224 -264 -275 -2 140 -66 -19 210 -115
3726 -115 285 55 331 152 322 318 -73 -69 281 214 -160 56 25 -379 -113 -195 -79 -6 -421 -118 -50 12 -129
3749 -129 -406 -58 -167 78 8 -37 112 115 204 73 -114 49 19 169 286 293 364 181 139 257 -22 31 -159 -48
3773 -48 -180 -192 -134 -186 -200 -156 -160 -25 -146 -89 -228 2 -221 -84 -160 139 57 -99 114 33 159 -20 133 94
3797 94 31 120 213 -10 62 -19 222 -20 -118 -30 -122 63 -287 77 146 -8 -113 -73 -78 -31 285 -148 -45 -47 72
3822G2k2R5l3K6P0M4r9R2j54L6Q7k69J17k05j89J45J94k71R3m1P8k81J24K6L19
3847E4n3j52J73n4R7j12j0J35JpR9J3j17J87l17q4K04J71j44k2r3L82l74k0o5
3872a08pK15j41j65J18Q3l5O6j98L00o3K85o22K46M15m33L5p8K56j23l0K35j43
3895A08l59J58l3L63k29o9PJ9j42m4oJ56j54K96p9j08L0J30j46l00L85n9J39J31
3919A94k22L78k36pn4p1J46K7M9m5j31J19N6m22Q2J59p8J15j80j61J84p2L12L5
3943A77l01K3j04P1q1J84o8K58l78R7K32J7L2k4q8O2j83L7L1J32L0l1N7m79L28
3968C1l34J37N0J4q1K90l97L0K08P6q8RJ68j69pK52k79K70j71J87L5k18N0J80
3992B43p1k12Q0J6J98k96N5k04qJ75q0q8R1J57k79J12K15j84r1K32j70j12K84
$$ plain form
3822 72 50 145 112 138 208 252 153 245 91 127 214 -55 62 -143 -332 -187 7 -264 -171 -212 -134 -415 -291 -265 54
3847 54 1 -151 22 -32 65 -47 -57 78 79 72 171 184 67 254 -63 -147 57 228 84 62 -31 351 -23 -43 -108
3872 -108 -115 100 -41 -206 -88 -5 -40 26 -172 128 65 350 -272 -26 389 -44 -9 -87 169 46 16 251 108
3895 108 -251 -93 -126 237 8 -61 -54 -35 -177 -221 -227 -71 -225 71 -8 -116 -86 44 -102 -402 -17 -76 63 194
3919 194 -28 350 114 107 53 -18 128 155 204 159 28 147 203 -219 -137 22 -56 59 -121 -282 -98 -170 142 177
3943 177 -124 -101 -205 -134 -215 -31 -99 159 -219 -122 110 127 159 135 47 109 -74 -37 -6 126 156 125 182 -297 31
3968 31 -303 -166 -116 -102 -183 107 -290 -260 -52 24 -64 -55 113 -56 -63 189 -90 180 9 196 231 13 63 243
3992 243 172 -40 40 56 254 -42 13 -191 -199 -24 -104 -192 -101 56 -223 -111 104 -80 -171 61 -109 -221 63
4015F3k4O7Q4J32j28q5j62J63j37J84l04K28q4l68L01J11j91J33j15J58J67k74
4037h1p5M24mj74J91k75m5J11j49P3J08J2p1k45L64j60N0J27K08k07j11J3j15
4060c1Mq6J70Q1m13RK2N8L9L45m23jJ02J08r1j3O0J27j0p1J2q8K5K52R1k23J51
4087B06M8Q9k79j14L23j97n9j5J39n47N11j59p2P9o4Q5l37K96j90L2L77m35L60
4110G7m0J11j13J73k73Q7K46l20K28o4J15l09J54rM4j82J61j17J8qJ11l5l2j12
4134h9L8O8k90R5q9K14M0N0p8J87l11J54j75L47K30nj94O2j68P9%k38k7L4J49
4159H3j50K25j17k54J86k02J37j68J47J5J0R9R3l53K57J86j25J29l15J1J5k5K08
4182I2j24%Q2J88k52N8J16k64J31k10K56k49J82j39J09R0m1l65J76L28j52L3M2
$$ plain form
4015 63 39 106 190 322 194 109 -53 110 -27 157 -147 81 -3 -371 -70 41 -150 -17 -132 26 193 -81
4037 -81 -156 268 264 90 281 6 -39 72 -77 -4 104 116 45 -200 164 4 54 181 389 182 71 84 -31
4060 -31 -27 -113 57 138 -275 -266 -244 -186 -147 198 -225 -226 -124 -16 -107 -120 -60 67 57 -14 -2 -90 -65 187 278 55 206
4087 206 254 343 64 -50 273 76 17 2 141 -406 105 -54 -126 -47 -111 -26 -363 -67 -257 -225 152 -283 77
4110 77 37 148 35 208 -65 22 268 -52 176 112 227 -82 72 63 107 -75 86 -31 -13 -21 90 55 23 -89
4134 -89 -51 17 -273 -178 -267 -53 -13 37 -41 146 -165 -11 -186 161 391 386 192 254 86 165 165 -73 -100 -66 83
4159 83 -67 158 41 -213 -27 -229 -92 -260 -113 -98 -88 11 104 -249 8 194 69 198 -117 -106 -91 -116 92
4182 92 -32 -32 50 238 -14 44 160 -104 27 -183 73 -176 6 -133 -24 66 25 -340 -164 164 12 45 87
4205H7j38J71j59q8L53j18j59K81j05m0J75k35lj13K45L8k46N4n7K0r7K18l21
4228b37J22k7J25j43K70m10K80j39J47lj93K72p6J31l16K74j41M4Q1J23l74J50
4250d0J92K32l89k62K23K09J11j26k29rj7p3K81l38J24j64L89l34j9M39j81J56
4272A75j35L15j73j10q8r8L50j59k31J47Q3m6O9j22M9j42j62K12K2j76M9m2K07
4295fj50j4P6k8o7K78L0m56L55Pk53M69k46K24j06O1n2J19P6k72L04n66J60L14
4319B57k68O8k4l7j2oq0k08J34J05p9J7j8N8J03j41J02R0j51k14N13k19Q3J29
4343B02q4k80L98J22l73j03J11MP8p7L6r1j54K09k30J11Q6J03j81J05j57K55k39
4366a49k7L01m64M72j16K78l55J35P9J6r5J83m66M98j52K9kl26J44j05J60J0j22
$$ plain form
4205 87 -51 120 -39 -127 226 108 -51 230 125 85 260 25 22 -91 154 192 -54 0 -57 -37 -134 84 -237
4228 -237 -115 -142 -17 -160 110 -300 -20 -159 -12 -15 -208 64 -12 119 -197 77 -64 -20 61 184 -190 -40
4250 -40 152 384 -5 -267 -44 165 276 150 -79 -88 -105 -178 103 -235 -111 -275 114 -220 -239 200 19 175
4272 175 40 355 182 72 -16 -114 236 77 -154 -7 76 30 99 -23 26 -116 -278 -66 -44 -220 -171 -213 -6
4295 -6 -156 -170 -94 -122 -189 89 119 -337 18 25 -228 241 -5 219 113 174 122 241 317 45 349 -217 -57 257
4319 257 -11 57 33 -4 -16 -22 -102 -310 -176 -71 -150 -133 -151 -93 10 -131 -29 61 -90 -304 209 -10 73 202
4343 202 118 -162 236 358 -15 -118 -7 -3 75 -2 34 -57 -211 -2 -232 -121 -35 68 -113 -8 -165 90 -149
4366 -149 -176 125 -339 133 17 295 -60 75 154 170 75 258 -208 290 138 167 165 -161 -17 -122 38 48 -74
4389g4K7q6k40L05L1j18L0M0L5J1oO0L4M4P8j25O7q7%J50j43J06m9k7j77L05l40
4416a49J06J34k4%K9j46k36M35j75J1r3l3l9j05K44n4J07l2K3K27j06j32O8J0
4440G0J71j44J16K9Nm9k64Pk74L96J06j74J2m5l31K24J10J56k34L5n8J34p2j24
4464a98J57p0l4K75k31O0L3K04j5m0p4K07j63Ll7k18J08o8J64m35M10M9r4k26
4488b33J24J2N9K60k00k07K69k25N4J08n1K32l04J78j54J91j00Q4p0J45l04M05
4510B73l50K35j37p0k7R8j32J8R4j21J89r0k02K42k4J54j18j59K77j58K15l28
4532a21J76j26L48l17K45j58q2L58l33K9k17L24j13L8r2K01k99K05j57j54K97
4553E2j8K4j66K92m8j19m8rj31NL52k58J32K30l11J01j15J76oJ45j97k7K07k85
$$ plain form
4389 -74 -47 -133 -373 -68 -37 -155 -125 -85 -50 -39 -45 15 49 93 171 46 113 26 26 176 33 139 90 63 -114 191 -149
4416 -149 -43 91 67 67 96 -50 -286 149 -26 -15 -108 -141 -180 -285 -41 -95 12 -20 3 230 124 -8 60 70
4440 70 241 97 213 242 247 198 -66 -59 -333 63 169 -5 7 -38 -369 -145 -35 121 -113 -78 -136 -2 -74 -198
4464 -198 -41 -111 -145 130 -101 -41 -8 196 181 141 67 274 111 114 77 -141 -33 -101 63 -372 38 87 -7 -233
4488 -233 -109 -97 -38 222 22 -185 84 -141 -87 21 -30 202 -102 76 -78 113 13 97 27 172 -132 273
4510 273 -77 158 21 -49 -76 22 -110 -92 2 -119 70 -20 -222 20 -4 150 32 -127 150 -8 207 -121
4532 -121 55 -71 277 -40 205 47 -35 323 -10 19 -198 126 13 51 -41 160 -139 66 -91 -245 52
4553 52 34 58 -108 184 136 17 -31 -40 -171 -166 186 -72 60 290 -21 80 -35 141 135 280 83 56 263 -22
4577b2qrP4j62J73k58rJ91q5O1mo5m4K28k81K73r8K28m6l12O2J73j70L09j34L7
4603A02p9O6J42k15n2j39K80L6k6p9j65N2Q5k1p3j76K46N8k46K51P8j63K27j69
4627B0M2k11J84J79q3J47j69O6k70K42k32L0oj5J31L2k01K01l13Q7K31j31l05
4650c44L93m8l4J9j30J69q3K4J1J60l14K91K8J78j80p7l57L36rk0K31j15q5L7
4674H1J8k02R0j21j6K35j79K02l13J15m0k2J13j9r3k2L43lk8p1k71K50K79o8j86
4699G2o2J20N5r6K7k15K29l34R7K52k22m0K39k08l80N04J29o2m43M54j85j03J62
4722a0k9J32nl10K62p2J14j09J19k63J25L55j30pk35L47l21j53L59m09K93l3k70
4745b50L17k3j36J30j4j75M4O2j31K10l6K9K4j40L22k94L44j58L6k37K17j60K00
$$ plain form
4577 -22 -30 -39 35 -127 46 -212 -221 -30 -115 -54 -58 -123 -167 61 -220 53 -45 183 137 -175 -113 60 -110 199 65 102
4603 102 23 89 231 16 -36 -175 105 141 115 36 -129 -77 8 -13 -86 -262 -16 42 -204 47 125 -38 189 20
4627 20 62 -149 35 214 131 278 109 175 -95 147 -85 -55 -61 -76 55 87 -114 87 -226 -139 92 -39 -344
4650 -344 49 1 -33 -14 -144 25 -58 -34 -23 137 -177 114 142 320 140 63 -294 42 33 13 244 129 44 81
4674 81 99 -103 -13 -134 -150 85 -94 108 -205 -90 -130 -152 -39 -58 -151 -173 170 167 139 68 -203 47 326 258 72
4699 72 10 130 185 89 116 -99 130 -204 -107 145 -77 -117 122 -86 -466 38 167 105 -338 116 -69 -172 -10
4722 -10 -39 93 88 -222 40 -32 82 -27 92 -171 -46 309 179 172 -63 284 -37 -190 169 -240 53 20 -250
4745 -250 67 44 -92 38 24 -151 -107 -45 -176 34 -2 27 51 -89 233 -61 283 125 161 -76 141 -19 181
4768A81j07j46Q0j73J99l53K31R9m5k1R9Q6r2k70P4m4L11J16j69q4Q7k4J43q4
4792I4j96J50J44l1k09Q6J22N6lj85J31k94K37l02K10P2P7q1j76K7J18j32Q2p7
4816h0J47K2l15K65N5L10k14j85P8m2J17L1o4j35K4J58j72N0j97q1K51J17m31
4839b91K71j70J30j50K13j42K25J71m49K44k83K46jJ44r4q6nO5k21K19j91K48
4861I3k15J97J29l17k50L69j29R7N9l28K69j53K77J20k64n9k04M58j58K52j70
4882G3J17k75K58j35J14k7N7J09q8j06j52K45k63J77k73J65L3r8J51j68k4M9R
4905e2J83p8j04r4%J23np6K4J67l23L32m6q9o0J29J02o2n3L52l91M3r2K26J2K7
4931A95o4l45P2K3j5J40k20l1K78P2l00K23j22P9nJ65p7k60n4K89J56l20K33o9
$$ plain form
4768 181 74 -72 8 -165 34 -319 -88 11 -34 -55 44 130 38 -232 -158 -202 109 225 56 -28 59 35 178 94
4792 94 -102 48 192 161 -48 38 160 216 213 28 159 -135 102 -200 10 82 159 78 -98 -71 47 -85 -3 -80
4816 -80 67 89 -226 39 94 404 190 5 83 41 158 189 125 -10 14 172 0 50 -147 -228 23 140 -291
4839 -291 -20 -190 -60 -210 3 -139 86 257 -192 52 -231 15 14 158 64 -22 -27 38 -183 36 -155 93
4861 93 -122 75 204 -113 -363 6 -123 -26 33 -295 -26 -179 98 218 -46 -105 -309 149 -9 243 73
4882 73 190 -85 173 38 152 125 182 291 203 97 -55 190 -73 104 -169 -4 29 -69 82 -86 -110 -61 -52
4905 -52 131 53 -51 -145 -145 -22 -27 -103 -79 88 -235 97 51 -38 -98 31 133 71 18 370 -21 22 -70 156 168 195
4931 195 131 -214 -142 -119 -134 6 -214 -245 33 105 -195 28 -94 -15 -20 145 68 -192 -246 43 199 -121 112 43
4955D3K1J51j50j5nJ60m45L33q3n7J06rr9m3kj46J56R3R8k05J73K4k48O2J49J97
4981B59j29r8k01L50k76J21nJ87p5L0k74K39m5J00J1k25M7J50l62P7P7k7k0n1
5005a40k1L5J49O9m5P2k52L21k62J76M9l38K85j30K05J38j11m50L37j15J22n4
5027D0n4j3k5j27J50K84m43k9o3J62J89j43j47K77j80J0Q1j07l0J36j16n2L06
5050A06N9K18k86m38K32K91J53L6l12k1J36l44J68K9L4l89K71k8j18P6j07J15
5072a19P8q4O2Q8l5j90L12k29J77l6j88K86K6j64J2q2L05j56j22j52N02q5p8k48
5096a20M6M1J09J39k65J16q6j49K08j83L13M2k72J41j38P6j47J01M2J62p2J37
5118B41j6j46k46P6J7r0L86k49%q8J54O2lk57L11k54Q4R0m00K14m4J92j89J53
$$ plain form
4955 43 64 215 65 50 45 205 -240 93 10 -47 59 50 -49 -92 -94 -240 -84 9 107 -98 75 99 -149 -87 62 259
4981 259 130 32 -169 181 -95 26 21 208 133 163 -111 128 83 183 194 -31 16 166 -196 -119 -42 -69 -89 -140
5005 -140 -161 -126 23 92 47 119 -133 188 -74 102 151 -187 98 -32 173 311 200 -250 87 -28 94 40
5027 40 -14 -27 -52 -179 -29 255 -188 -217 -280 -118 71 -72 -219 58 -122 -112 -31 -138 -168 -32 -148 -200 106
5050 106 165 383 97 -341 -109 182 335 371 59 38 174 -170 -2 27 61 -328 -57 -85 -203 -127 -234 -119
5072 -119 -41 -125 -63 25 -10 -200 112 -117 60 24 -164 122 148 -16 -4 -86 219 63 -59 -211 291 206 128 -120
5096 -120 -74 -33 76 215 -50 66 -20 -169 39 -144 169 211 -61 80 -58 18 -129 -28 14 176 104 241
5118 241 225 79 -167 -91 -74 -164 222 -27 -27 -115 39 101 98 -159 152 -102 -18 72 -328 -114 -158 34 -155 -2
5142bj7K69l08J55j28J18j82J85K35r8o0l4M8j31rj48M7L9L8J26k36J24q0J06
5166E7p1o4J60j15n8R2R6R5l92J54N6K7p1K62j32J32j37R6k28J70m3n3k00J3L79
5191B25j73J98m68J33J66r7J39j80l07N02j10O8l27J79P1k70J72L6l4K70j90J05
5213A08K5j96K68j51k21K22N3k76L2J27%MJ12k63K4J77l5M5j5j14l3j08J07l6
5237a44J74j48k2J90k71L57r2J80J26l57J49j33m5P2N1K9k24L56J43o37L93k57
5259a10j45K04q4O2K54k00J12j89J4q6L12k95k7K85j09P3K9P8j65m6Q4o9J41M4
5283A67j27j70K37o9JJ49o5k47K58j93J19k13L07J21l47J03%Q3l21J09j5M09k97
5306aq0M7K58j42oN2n7j85J87j53P2P5J63l2k23J25n8k81K19l9o3M9K21j45J2
$$ plain form
5142 -2 -19 250 -58 97 -31 87 -95 90 325 227 167 133 181 50 41 -107 -60 -21 17 143 -93 31 -49 57
5166 57 -14 -78 82 -33 -91 1 97 192 -200 -46 10 37 -34 228 96 228 91 187 -41 129 86 33 -167 -154 225
5191 225 52 250 -218 -85 81 -16 123 -57 -364 138 28 96 -231 -52 19 -251 -79 -43 -77 193 3 108
5213 108 133 -63 205 54 -167 55 108 -168 -136 -9 -9 -5 107 -156 -132 45 10 55 40 -74 -107 -215 -108 -144
5237 -144 30 -118 -140 50 -221 136 44 224 350 -7 142 9 -36 36 87 116 -108 248 391 -246 147 -110
5259 -110 -255 -51 -135 -73 181 -19 93 -96 -82 -168 144 -151 -178 107 -2 71 100 178 13 -33 51 -18 123 167
5283 167 40 -130 107 38 39 188 123 -124 134 -59 60 -153 154 275 -72 31 31 114 -207 -98 -113 296 -1
5306 -1 -81 -34 224 82 76 128 71 -114 73 -80 -8 67 230 198 -25 100 42 -239 -20 -59 -122 -73 148 3 15
5331A5j08K67l64J76J05r8j8J49K1q1k8R8j12K42k93K29j95lMO8k33J91J47k49
5355g0K04J07l16K02M7j15j73J42j04Lo8J06K09l9k33K43M5J20l05R1L2j45J1
5378fR3n5j35K97l49K2J46j41J37l98M11J06j25K17k84j77q7L91Q7k49OJ13k44
5401b24K12j07OJ84J00p3K7k84K39q0K16k31J5k4mJ27k86R2nJ18j5j58J91L5l4
5426C7Q7k86J3L16m1k21K35J33k34p4r7J8K32p7n6K75n3l15N23k29l88K74j08
5449c6kJ5J47k79J46k20K07k4J43l20m8K26jK85j63j51Q7j83J56l3J30k7n5j18
5473a18L36m06J91p2J07k9l17L12nj50r1K07J39k43m3P5k8K45j01k15J12M9j08
5496a53j1K66k86M37m13J15K47k93L83k31K14l74J5K68k12N5K3k04kJ00N8K22
$$ plain form
5331 15 -93 174 -190 -14 91 -7 -25 124 145 64 36 134 22 264 -29 200 5 2 6 74 -159 32 179 -70
5355 -70 134 241 -75 127 174 59 -114 28 -76 -73 -141 -35 174 135 -98 145 190 310 5 96 128 -17 -6
5378 -6 87 32 -103 194 -155 -133 13 -128 9 -389 22 128 3 220 -64 -241 -328 63 150 -99 -93 20 -224
5401 -224 -12 -119 -113 71 171 98 125 -159 80 0 216 -15 0 -24 -28 99 -187 -95 -100 18 3 -155 36 71 37
5426 37 124 -162 -149 167 126 -95 140 273 39 -35 -132 -114 118 41 -15 260 207 -108 415 186 -202 72 -36
5449 -36 -38 -23 124 -155 -9 -229 -22 -46 97 -223 -271 -45 -46 239 76 -75 12 -171 -15 -48 82 55 0 -118
5473 -118 218 -188 3 -69 38 9 -308 4 -1 -151 -242 -35 104 -139 -182 -107 -135 110 9 -206 -94 -45 -153
5496 -153 -164 102 -184 253 -160 -45 202 -91 292 61 275 -99 -84 184 -28 27 50 -154 -156 -56 2 224
5518B24m17O1J74L0J80k20q3N8j52j53K67J08R3J6j72J8po7J76j21j05J89P2%
5542A69j35j99J56J48m48O16j19k51k51M5K48o7k74L49K38j84JQ3k50K52rn2Q4
5565A50k2J58k1m98K32K42k58N3r1L0L0J16o5p0j29j26J50J73q0N1P2o7J39k64
5589i5N8r1M07l30J0k0K22k14J21k8r8N8r4P9j1J71ko8p7J63l10K31k1j4k20J17
5615e6k7Lm4K27k13j39J98J23k5K1J74l47N9J04j23j72L64j43K47k83J27j7n1
5638GM9J2k74R3j07M76l29j43K19J23l03j69K85Mj72K30J70l33L27j02r1J11J20
5661B03l11n5K86L2o7Nj21L83k13L9p0N7j64j14J36J12k40l0J05m4L61j79k40
5684a29p0K65k84J78m7J04K8K0L8l10L8L02j83J2l5Q8K51j39K2J35j50k36Q1J67
$$ plain form
5518 224 -193 -132 42 72 252 32 -51 7 -145 -298 -31 77 170 186 14 32 25 -42 134 13 -92 97 169 169
5542 169 34 -165 -9 139 -309 307 188 -63 -314 -269 -21 -88 -362 -13 225 41 42 125 -125 127 118 66 150
5565 150 128 286 265 -233 -1 241 -17 36 -55 -25 5 121 56 -14 -143 -269 -119 54 -26 25 97 30 169 -95
5589 -95 -37 -128 279 -51 -41 -61 161 -53 68 40 -58 0 -94 -15 -26 145 143 75 -2 161 -149 82 61 47 -173 -56
5615 -56 -83 -80 -124 103 -110 -249 -51 72 47 68 242 -105 -46 58 -65 -237 127 -16 231 -52 75 58 7
5638 7 56 68 -206 -113 -220 256 -73 -216 3 126 -177 -346 -61 -57 -229 1 171 -162 165 63 -28 83 203
5661 203 -108 -163 123 155 88 93 -28 355 142 181 111 168 4 -110 26 138 -102 -132 -27 -71 290 111 -129
5684 -129 -199 66 -218 -40 -87 17 45 65 103 -207 -169 133 -50 -38 -73 15 266 127 149 284 134 -102 -21 146
5708A46r6j29k6n5p4Q1K41k76J27j79L55r9O1l79KL79q3k6KJ01j06J91r0K85k93
5733F0J19j95r0L08k28lK67l04p2Q9r9J86o9l14J89N8J17K6O9j65P5K13j04n1
5757H2J66j25P1j04j26J2L90l96J64q9K8l79L66k7o8j13L95l71O4k5Q5r5j2J62
5781E5k56J94K34j36o0M7p9%J7R5k62K36O8n4j99R6J85J69k54K41m11n5J35k63
5805b57K48k02K80k57n8O9K02P0k13O2j13K82q1O3j99J60K08k80KJ57K1j42k5
5828cR6k23L79l27L13k11r8j35J88r1K49o8rj8k9l6J39j38Q2l8m13L74k1K80j51
5853I1m1j42P7J67Q6k9k02L4J16j74J49RP0p0k03rKJ47jl7o9j74J09J2k7J05j01
5880a05J84k65O7J85j73M15k40o2k8J35J6N0k81K88N2k74J17JM6Nj25j15K8R4
$$ plain form
5708 146 50 -79 -105 -160 -234 -153 88 -188 -61 -240 115 16 77 -302 -300 79 -4 -30 -28 73 -33 158 68 353 60
5733 60 179 -16 -106 202 -26 -29 238 -66 -138 -49 -148 38 -31 -345 -156 -98 19 45 114 -51 24 237 133 82
5757 82 248 123 194 90 -36 -24 366 -30 134 45 73 -306 60 33 -35 -148 247 -124 -60 -85 0 -95 -107 55
5781 55 -201 -7 227 91 31 78 -1 -1 16 111 -151 85 153 99 -100 -4 181 350 96 337 -74 -129 6 -257
5805 -257 -9 -211 69 -188 -246 -177 25 95 -118 -56 -169 113 32 95 -104 56 264 -16 -14 143 164 22 -3
5828 -3 93 -130 249 -78 235 24 -74 -209 -21 -112 137 69 60 42 13 -23 116 -22 60 22 -391 -17 -38 242 91
5853 91 50 -92 -15 152 238 209 7 41 157 -17 132 141 211 141 -62 -71 -69 78 77 40 -29 -203 -94 -82 -109 -4 -105
5880 -105 79 -186 -119 66 -107 308 68 6 -22 113 129 179 -102 186 238 -36 81 82 128 133 8 -107 -79 15
5904A5k93K7K85nr7J13j83N1K42k37J04J62m78J61R4p5M3M9mJ27j22J26j05R6
5928I6L3k44J82k20L35k74J24l20K26Q1k63K14QM1k57Q6J62J42j13k7J44j78K4
$$ plain form
5904 15 -278 -251 34 29 -68 45 -138 -87 155 -82 22 184 -294 -133 -39 -114 -71 -22 -26 101 -21 105 0 96
5928 96 129 -115 67 -153 182 -92 32 -288 -62 19 -244 -30 -22 19 -238 -152 10 152 39 12 156 -22 2
$$ [...]
8191c4
##END NTUPLES=NMR FID
##END=
