##TITLE=1H_Pr NCS-2M
 200.13MHz, CDCl3,
 8 sc
 
 22.10.2025
##JCAMPDX= 6.0         $$ Bruker NMR JCAMP-DX V2.0
##DATA TYPE= NMR FID
##DATA CLASS= NTUPLES
##ORIGIN= UXNMR, Bruker Analytische Messtechnik GmbH
##OWNER= pz
$$ XWIN-NMR		Version 3.5
$$ Wed Oct 22 15:35:14 2025 Russian Standard Time (UT+4h)  she@DPX200
##.OBSERVE FREQUENCY= 200.1313
##.OBSERVE NUCLEUS= ^1H
##.DELAY= (6, 6)
##.ACQUISITION MODE= SIMULTANEOUS
##.ACQUISITION SCHEME= undefined
##.AVERAGES= 8
##.DIGITISER RES= 18
##SPECTROMETER/DATA SYSTEM= spect
##.PULSE SEQUENCE= zg30
##.SOLVENT NAME= MeOD
##.SHIFT REFERENCE= (INTERNAL, MeOD, 0, 14.3821)
##AUDIT TRAIL= $$ (NUMBER, WHEN, WHO, WHERE, WHAT)
$$ ##TITLE= Audit trail, XWIN-NMR		Version 3.5
$$ ##JCAMPDX= 5.01
$$ ##ORIGIN= Bruker BioSpin GmbH
$$ ##OWNER= she
$$ F:/spectra/data/she/nmr/H-C/1/audita.txt
$$ ##AUDIT TRAIL=  $$ (NUMBER, WHEN, WHO, WHERE, WHAT)
(   1,<2025-10-22 15:33:28.54 +0400>,<she>,<DPX200>,
      <created by zg, POWCHK disabled, PULCHK disabled
       configuration hash MD5:
       00 E9 B6 7A A2 85 ED C7 34 08 36 98 17 FE 4E 26
       data hash MD5: 16K
       2B 53 38 4D 2B 95 51 EE CD 78 4D B4 BD AA 5F 7D>)
$$ ##END=
$$ 
$$ hash MD5
$$ BD 8C 8F 8F D4 32 7F 51 13 8C 85 81 0F C0 77 AF
##$RELAX= 
##$RELAX= 
##$RELAX= 
##$RELAX= 
##$RELAX= 
##$RELAX= 
$$ Bruker specific parameters
$$ --------------------------
##$DU= <F:/spectra>
##$EXPNO= 1
##$NAME= <H-C>
##$PROCNO= 1
##$TYPE= <nmr>
##$USER= <she>
##$AMP= (0..31)
100 100 100 100 100 100 100 100 100 100 100 100 100 100 100 100 100 100 
100 100 100 100 100 100 100 100 100 100 100 100 100 100 
##$AQSEQ= 0
##$AQ_mod= 1
##$AUNM= <au_zg>
##$AUTOPOS= <>
##$BF1= 200.13
##$BF2= 200.13
##$BF3= 200.13
##$BF4= 200.13
##$BF5= 200.13
##$BF6= 200.13
##$BF7= 200.13
##$BF8= 200.13
##$BYTORDA= 1
##$CFDGTYP= 0
##$CFRGTYP= 5
##$CHEMSTR= <none>
##$CNST= (0..31)
1 1 145 1 1 1 1 1 1 1 1 1 1 1 1 1 1 1 1 1 1 1 1 1 1 1 1 1 1 1 1 1 
##$CPDPRG= <>
##$CPDPRG1= <>
##$CPDPRG2= <>
##$CPDPRG3= <>
##$CPDPRG4= <mlev>
##$CPDPRG5= <mlev>
##$CPDPRG6= <mlev>
##$CPDPRG7= <mlev>
##$CPDPRG8= <mlev>
##$CPDPRGB= <>
##$CPDPRGT= <>
##$D= (0..31)
0 0.7 0 0 0 0 0 0 0 0 0 0.03 0 0 0 0 0 0 0 0 0 0 0 0 0 0 0 0 0 0 0 0 
##$DATE= 1761132807
##$DBL= (0..7)
120 120 120 120 120 120 120 120 
##$DBP= (0..7)
150 150 150 150 150 150 150 150 
##$DBP07= 0
##$DBPNAM0= <>
##$DBPNAM1= <>
##$DBPNAM2= <>
##$DBPNAM3= <>
##$DBPNAM4= <>
##$DBPNAM5= <>
##$DBPNAM6= <>
##$DBPNAM7= <>
##$DBPOAL= (0..7)
0.5 0.5 0.5 0.5 0.5 0.5 0.5 0.5 
##$DBPOFFS= (0..7)
0 0 0 0 0 0 0 0 
##$DE= 6
##$DECBNUC= <off>
##$DECIM= 32
##$DECNUC= <off>
##$DECSTAT= 4
##$DIGMOD= 1
##$DIGTYP= 9
##$DL= (0..7)
0 120 120 120 120 120 120 120 
##$DP= (0..7)
150 150 150 150 150 150 150 150 
##$DP07= 0
##$DPNAME0= <>
##$DPNAME1= <>
##$DPNAME2= <>
##$DPNAME3= <>
##$DPNAME4= <>
##$DPNAME5= <>
##$DPNAME6= <>
##$DPNAME7= <>
##$DPOAL= (0..7)
0.5 0.5 0.5 0.5 0.5 0.5 0.5 0.5 
##$DPOFFS= (0..7)
0 0 0 0 0 0 0 0 
##$DQDMODE= 0
##$DR= 18
##$DS= 0
##$DSLIST= <SSSSSSSSSSSSSSS>
$$ [...]
##$SUBNAM0= <"">
##$SUBNAM1= <"">
##$SUBNAM2= <"">
##$SUBNAM3= <"">
##$SUBNAM4= <"">
##$SUBNAM5= <"">
##$SUBNAM6= <"">
##$SUBNAM7= <"">
##$SUBNAM8= <"">
##$SUBNAM9= <"">
##$SW= 18.0517328524113
##$SWIBOX= (0..15)
0 0 2 0 0 0 0 0 0 0 0 0 0 0 0 0 
##$SW_h= 3612.71676300578
##$TD= 16384
##$TD0= 1
##$TE= 0
##$TE2= 300
##$TE3= 300
##$TEG= 300
##$TL= (0..7)
0 120 120 120 120 120 120 120 
##$TP= (0..7)
150 150 150 150 150 150 150 150 
##$TP07= 0
##$TPNAME0= <>
##$TPNAME1= <>
##$TPNAME2= <>
##$TPNAME3= <>
##$TPNAME4= <>
##$TPNAME5= <>
##$TPNAME6= <>
##$TPNAME7= <>
##$TPOAL= (0..7)
0.5 0.5 0.5 0.5 0.5 0.5 0.5 0.5 
##$TPOFFS= (0..7)
0 0 0 0 0 0 0 0 
##$TUNHIN= 0
##$TUNHOUT= 0
##$TUNXOUT= 0
##$USERA1= <user>
##$USERA2= <user>
##$USERA3= <user>
##$USERA4= <user>
##$USERA5= <user>
##$V9= 5
##$VALIST= <valist>
##$VCLIST= <CCCCCCCCCCCCCCC>
##$VD= 0
##$VDLIST= <DDDDDDDDDDDDDDD>
##$VPLIST= <PPPPPPPPPPPPPPP>
##$VTLIST= <TTTTTTTTTTTTTTT>
##$WBST= 1024
##$WBSW= 4
##$XGAIN= (0..3)
0 0 0 0 
##$XL= 0
##$YL= 0
##$YMAX_a= 667210
##$YMIN_a= -900443
##$ZGOPTNS= <>
##$ZL1= 120
##$ZL2= 120
##$ZL3= 120
##$ZL4= 120
##$ABSF1= 10
##$ABSF2= 0
##$ABSG= 5
##$ABSL= 3
##$ALPHA= 0
##$AQORDER= 0
##$ASSFAC= 0
##$ASSFACI= 0
##$ASSFACX= 0
##$ASSWID= 0
##$AUNMP= <proc_1d>
##$AZFE= 0.1
##$AZFW= 0.1
##$BCFW= 1
##$BC_mod= 2
##$BYTORDP= 1
##$COROFFS= 0
##$CY= -3
##$DATMOD= 1
##$DC= 2
##$DFILT= <>
##$DTYPP= 0
##$F1P= 0
##$F2P= 0
##$FCOR= 0.5
##$FTSIZE= 0
##$FT_mod= 4
##$GAMMA= 1
##$GB= 0.15
##$INTBC= 1
##$INTSCL= 1
##$ISEN= 128
##$LB= 0.25
##$LEV0= 0
##$LPBIN= 0
##$MAXI= 10000
##$MC2= 0
##$MEAN= 0
##$ME_mod= 0
##$MI= 1.114404
##$NCOEF= 0
##$NC_proc= 0
##$NLEV= 6
##$NOISF1= 3.799351
##$NOISF2= 2.8
##$NSP= 1
##$NTH_PI= 0
##$NZP= 0
##$OFFSET= 14.38212
##$PC= 1
##$PHC0= -2636.453
##$PHC1= 11.59233
##$PH_mod= 1
##$PKNL= yes
##$PPARMOD= 0
##$PSCAL= 0
##$PSIGN= 0
##$REVERSE= no
##$SF= 200.129724274929
##$SI= 16384
##$SIGF1= 3
##$SIGF2= 2
##$SINO= 400
##$SIOLD= 16384
##$SREGLST= <1H.CDCl3>
##$SSB= 0
##$STSI= 0
##$STSR= 0
##$SW_p= 3205.1282051282
##$SYMM= 0
##$S_DEV= 0
##$TDeff= 0
##$TDoff= 0
##$TI= <>
##$TILT= no
##$TM1= 0
##$TM2= 0
##$TOPLEV= 0
##$USERP1= <user>
##$USERP2= <user>
##$USERP3= <user>
##$USERP4= <user>
##$USERP5= <user>
##$WDW= 1
##$XDIM= 8192
##$YMAX_p= 0
##$YMIN_p= 0
$$ End of Bruker specific parameters
$$ ---------------------------------
##NTUPLES= NMR FID
##VAR_NAME=  TIME,          FID/REAL,        FID/IMAG
##SYMBOL=    X,             R,               I
##VAR_TYPE=  INDEPENDENT,   DEPENDENT,       DEPENDENT
##VAR_FORM=  AFFN,          ASDF,            ASDF
##VAR_DIM=   8192,          8192,            8192
##UNITS=     SECONDS,       ARBITRARY UNITS, ARBITRARY UNITS
##FACTOR=    0.0002768,     1,               1
##FIRST=     0,             0,               0
##LAST=      2.2672688,     0,               0
##MIN=       0,             -900443,         0
##MAX=       2.2672688,     667210,          0
$$ Real data points
##PAGE= N=1
##DATA TABLE= (X++(R..R)), XYDATA
$$ [...]
$$ plain form
2239 -459 805 2087 3037 2653 2159 1254 30 -799 -1900 -2452 -2658 -2182 -1177 222 1390 2294 2204 2274
2257 2274 1670 518 -606 -1675 -2545 -2650 -2343 -1342 -224 853 1424 2596 2754 2184 1157 -186 -1144
2274 -1144 -2191 -2474 -2143 -1935 -1054 158 1434 2592 2683 2634 1630 550 -484 -1224 -2064 -2643 -2479 -1384
2292 -1384 -498 483 2022 1919 2158 1746 1467 43 -1278 -2375 -2414 -2168 -1657 -850 189 1350 1848 2680
2310 2680 2473 1758 548 -610 -1484 -2100 -2248 -2500 -1626 -554 604 1759 2235 2012 1764 1318 288 -754
2328 -754 -1696 -2229 -2516 -1857 -986 34 1192 2037 2589 2499 1771 712 -312 -1274 -2187 -2107 -2053 -1176 -708 565
2348 565 1636 2349 2531 1935 1131 235 -731 -1550 -2474 -2554 -2074 -1035 43 1174 2093 2224 2117 1867 833
2367 833 -509 -1385 -2011 -2462 -2125 -1335 -31 515 1597 2136 2364 1968 1345 100 -903 -1876 -2279 -2195 -2085
$$ packed form
2239d59J264J282R50l84m94r05j224q29j101n52k06M76J005J399J168R04r0P0
2257B274o04j152j124j069q70j05L07J001J118J077N71J172J58n70j027j343r58
2274a144j047k83L31K08Q81J212J276J158R1m9j004j080j034p40q40n79J64J095
2292a384Q86R81J539j03K39m12k79j424j321j097l9K46N11Q07J039J161M98Q32
2310B680k07p15j210j158q74o16j48k52Q74J072J158J155M76k23k48m46j030j042
2328g54r42n33k87O59Q71J020J158Q45N52r0p28j059j024r62r13Q0N4Q77M68J273
2348E65J071P13J82n96q04q96r66q19r24q0M80J039J078J131R19J31j07k50j034
2367H33j342q76o26m51L37P90J304N46J082N39K28l96o23j245j003r73m03Q4J10
$$ plain form
2386 -2085 -1020 -152 1123 1819 2449 2338 1836 848 -251 -1103 -1808 -2017 -2289 -1636 -757 490 1476 2024
2404 2024 2176 2015 1247 32 -547 -1547 -2256 -2044 -1845 -953 -79 747 1523 2005 2391 1692 784 -280 -864
2423 -864 -1963 -2358 -1829 -1451 -814 628 1422 1870 2395 1905 897 325 -598 -1637 -2016 -2382 -2011 -1082 4
2442 4 865 1684 1917 2044 1597 717 20 -1057 -1986 -2122 -1969 -1743 -471 269 1246 1845 2250 1865 1410 307
2462 307 -694 -1497 -1910 -1934 -1756 -985 -246 865 1608 2148 2087 1544 532 24 -1171 -1731 -1949 -1671 -1496
2481 -1496 -203 354 1445 1554 1961 1869 1080 500 -494 -1454 -1862 -2007 -1635 -997 -194 764 1456 1993 2064 1704
2501 1704 709 14 -812 -1320 -1565 -1773 -1776 -713 277 1430 1984 1832 1382 1216 352 -443 -1281 -2000 -1970 -1569
2521 -1569 -833 -196 692 1360 1508 1746 1579 943 -190 -1005 -1721 -1796 -1455 -1089 -576 412 983 1667 1907 1644
$$ packed form
2386b085J065Q68J275O96O30j11n02r88j099q52p05k09k72O53Q79J247R86N48
2404B024J52j61p68j215n79j000p09K12J99Q92Q74Q26P76M82L86o99r08j064n84
2423h64j099l95N29L78O37J442P94M48N25m90j008n72r23j039l79l66L71R29J086
2442DQ61Q19K33J27m47q80o97j077r29j36J53K26J272P40R77N99M05l85m55j103
2462C07j001q03m13k4J78P71P39J111P43N40o1n43j012n08j195n60k18K78J75
2481a496J293N57J091J09M07r2p89n80r94r60m08j45L72O38Q03R58O92N37P1l60
2501A704r95o95q26n08k45k08lJ063R90J153N54j52m50j66q64p95q38p19L0M01
2521a569P36O37Q88O68J48K38j67o36j133q15p16p5L41L66N13R88N71O84K40k63
$$ plain form
2541 1644 1176 305 -627 -1500 -1515 -1804 -1501 -731 160 725 1451 1823 1521 1082 585 124 -1090 -1541 -2067 -1596
2561 -1596 -1141 -97 500 1039 1697 1782 1801 981 314 -678 -1563 -1601 -1851 -1560 -1163 -223 793 1446 1526 1683
2581 1683 1162 667 -266 -987 -1238 -1570 -1437 -1308 -653 513 1214 1725 1573 1375 861 58 -728 -1299 -1766
2600 -1766 -1572 -1417 -559 106 820 1447 1710 1475 1426 851 -392 -1146 -1550 -1487 -1426 -1374 -819 249 864 1449
2620 1449 1806 1700 1031 293 -336 -1232 -1547 -1597 -1342 -701 104 876 1096 1342 1532 1246 590 -161 -968 -1598
2640 -1598 -1707 -1648 -1141 -457 481 938 1875 1808 1851 1218 83 -523 -1084 -1799 -1732 -1440 -822 -198 494 1426 1953
2661 1953 1467 1084 423 -186 -816 -1317 -1663 -1508 -785 -147 597 1187 1557 1580 1828 1059 218 -515 -1438 -1731
2681 -1731 -1913 -1558 -1072 -127 569 1295 2054 1471 1223 529 149 -927 -1289 -1914 -1615 -995 -531 460 1013
$$ packed form
2541A644m68q71r32q73j5k89L03P70Q91N65P26L72l02m39m97m61j214m51n26M71
2561a596M55J044N97N39O58Q5J9q20o67r92q85l8k50K91L97R40J016O53Q0J57
2581A683n21m95r33p21k51l32J33J29O55J166P01N11j52j98n14q03p86n71m67
2600a766J94J55Q58O65P14O27K63k35m9n75j243p54m04O3O1N2N55J068O15N85
2620A449L57j06o69p38o29q96l15n0K55O41Q05P72K20K46J90k86o56p51q07o30
2640a598j09N9N07O84R38M57R37o7M3o33j135o06n61p15O7K92O18O24O92R32N27
2661A953m86l83o61o09o30n01l46J55P23O38P44N90L70K3K48p69q41p33r23k93
2681a731j82L55M86R45O96P26P59n83k48o94l80j076l62o25K99O20M64R91N53
$$ plain form
2700 1013 1491 1536 1400 916 574 -386 -1216 -1617 -1827 -1268 -851 57 764 1098 1647 1730 1042 767 -87 -756
2720 -756 -1374 -2027 -1787 -1065 -532 246 985 1660 1921 1677 1305 527 -354 -1078 -1361 -1513 -1225 -1076 -103 516
2740 516 1090 1418 1577 1358 383 -416 -930 -1848 -1725 -1455 -1194 -167 192 1219 1672 1699 1525 1090 615 -57
2760 -57 -955 -1311 -1602 -1243 -1208 -199 655 1156 1086 1488 1310 684 -86 -381 -1348 -1623 -1859 -1225 -524 293 828
2781 828 1252 1326 1315 818 560 -5 -745 -1115 -1386 -1269 -631 -38 552 902 1441 1484 1313 925 14 -725 -1265
2802 -1265 -1216 -1498 -1222 -846 -191 527 1077 1335 1302 1096 380 -255 -633 -1337 -1239 -1158 -990 -189 354 1014 1409
2823 1409 1494 1015 573 57 -652 -1211 -1391 -1017 -1200 -394 34 690 1075 1203 1431 985 257 -122 -691 -1280
2843 -1280 -1178 -1078 -871 59 441 769 1316 1202 1053 769 -52 -532 -1189 -1436 -1314 -900 -392 -15 450 871
$$ packed form
2700A013M78M5j36m84l42r60q30m01k10N59M17R08P07L34N49Q3o88k75q54o69
2720g56o18o53K40P22N33P78P39O75K61k44l72p78q81p24k83j52K88J49R73O19
2740E16N74L28J59k19r75p99n14r18J23K70K61J027L59J027M53K7j74m35m75o72
2760e7q98l56k91L59L5J009Q54N01p0M02j78o26p70k95r67k75k36O34P01Q17N35
2781H28M24P4j1m97k58n65p40l70k71J17O38N93N90L50N39M3j71l88r11p39n40
2802a265M9k82K76L76O55P18N50K58l3k06p16o35l78p04R8Q1J68Q01N43O60L95
2823A409Q5m79m42n16p09n59j80L74j83Q06M28O56L85J28K28m46p28l79n69n89
2843a280J02J00K07R30L82L28N47j14j49k84q21m80o57k47J22M14N08L77M65M21
$$ plain form
2863 871 1172 1181 651 139 -492 -1033 -1189 -1076 -1177 -426 -273 581 1242 1170 1263 1093 468 37 -256 -1177 -1035
2884 -1035 -1178 -988 -398 62 601 1052 1374 1147 863 348 -378 -814 -1236 -984 -876 -677 -138 368 849 1218
2904 1218 1058 881 388 -65 -411 -995 -1195 -957 -689 -370 171 802 987 1135 1315 815 163 -454 -992 -1396
2924 -1396 -1124 -1382 -540 -196 590 850 1190 1158 800 548 34 -821 -1089 -1107 -712 -793 -412 442 862 1290 1187
2945 1187 786 640 286 -474 -961 -1455 -1122 -1029 -655 -84 506 971 1327 1451 1113 530 -133 -490 -1239 -1196
2965 -1196 -1313 -736 -437 170 842 1492 1329 1124 501 286 -418 -992 -1450 -1571 -1006 -498 196 651 887 1260
2985 1260 845 1167 299 17 -832 -1150 -1386 -1261 -743 -144 -22 966 1064 1546 1273 558 69 -559 -922 -1212
3005 -1212 -1114 -887 -550 96 492 1397 1380 1115 1107 454 80 -798 -731 -1486 -964 -908 -346 372 1052 895 1141 1172
$$ packed form
2863H71L01Rn30n12o31n41j56J13j01P51J53Q54O61p2R3j70o25m31k93r21J42
2884a035j43J90N90M60N39M51L22k27k84n15p26m36m22K52J08J99N39N06M81L69
2904A218j60j77m93m53l46n84k00K38K68L19N41O31J85J48J80n00o52o17n38m04
2924a396K72k58Q42L44P86K60L40l2l58k52n14q55k68j8L95q1L81Q54M20M28j03
2945A187m01j46l54p60m87m94L33R3L74N71N90M65L56J24l38n83o63l57p49M3
2965a196j17N77K99O07O72O50j63k05o23k15p04n74m58j21N65N08O94M55K36L73
2985A260m15L22q68k82q49l18k36J25N18N99J22R88R8M82k73p15m89o28l63k90
3005a212R8K27L37O46L96R05j7k65qo53l74q78O7p55N22N6N62P18O80j57K46L1
$$ plain form
3027 1172 394 309 -318 -978 -1236 -1339 -1032 -582 94 564 904 1146 1259 957 357 -313 -856 -1128 -1147 -1096 -765
3048 -765 -35 195 818 1153 1217 1377 823 287 -602 -722 -1150 -1026 -1086 -894 -145 243 1210 1195 1196 734 358 71
3070 71 -247 -1036 -1333 -1026 -784 -515 339 524 1075 1098 1157 859 339 -421 -927 -1250 -1454 -1117 -600 -195 697
3091 697 999 1262 1257 891 500 190 -442 -809 -1311 -864 -1059 -521 404 819 967 1184 890 772 431 -714
3111 -714 -622 -1277 -1134 -976 -301 342 380 1063 1265 1224 872 333 -65 -729 -1109 -1258 -1253 -660 -358 282 979 1065
3133 1065 967 1052 637 442 -386 -743 -1097 -1210 -827 -672 -119 531 957 1035 1141 865 713 -12 -648 -1068 -1124
3154 -1124 -1068 -752 -364 346 885 1137 1075 650 746 232 -554 -977 -915 -1731 -1167 -478 -245 270 860 1167 1194
3175 1194 820 506 -143 -627 -851 -1162 -1110 -1079 -378 168 589 870 1005 935 636 218 -642 -510 -1118 -1341 -920
$$ packed form
3027A172p78q5o27o60k58j03L07M50O76M70L40K42J13l02o00o70n43k72j9N1L31
3048g65P30K30O23L35O4J60n54n36q89j20m28J24o0J92P49L88R67j5Jm62l76k87
3070G1l18p89k97L07K42K69Q54J85N51K3N9k98n20p60n06l23k04L37N17M05Q92
3091F97L02K63nl66l91l10o32l67n02M47j95N38R25M15J48K17k94j18l41j145
3111g14R2o55J43J58O75O43L8O83K02m1l52n39l98o64l80j49NN93L02O40O97Q6
3133A065r8Q5m15j95q28l57l54j13L83J55N53O50M26P8J06k76j52p25o36m20n6
3154a124N6L16L88P10N39K52o2m25R6n14p86m23O2q16N64O89K33N15N90L07K7
3175A194l74l14o49m84k24l11N2L1P01N46M21K81J35p0k99m18q60J32o08k23M21
$$ plain form
3196 -920 -540 -89 323 659 1168 1267 934 734 -72 -309 -694 -1045 -1103 -692 -574 115 553 1081 942 994 697
3217 697 288 -516 -881 -1066 -1184 -658 -835 -285 403 986 1077 818 994 195 -147 -507 -963 -1112 -894 -527
3237 -527 -543 262 596 964 995 1147 768 67 -112 -635 -1144 -964 -958 -469 -315 177 483 840 756 987 510 -104
3259 -104 -265 -718 -878 -938 -420 -425 127 475 1296 1073 1080 847 294 -318 -570 -867 -999 -808 -724 -461 429 603
3281 603 967 954 728 402 6 -272 -903 -861 -750 -739 -275 110 582 712 951 919 880 80 169 -524 -663 -1033
3303 -1033 -683 -466 -112 360 574 1125 880 893 184 117 -479 -1095 -979 -890 -790 -442 -65 432 780 1063 656
3324 656 614 267 -104 -602 -854 -806 -769 -329 -204 15 626 591 744 809 278 -116 -721 -847 -841 -950 -796 -158
3346 -158 120 706 903 926 690 485 69 -244 -861 -1060 -1022 -537 -223 190 380 835 959 850 678 -25 -140
$$ packed form
3196i20L80M51M12L36N09R9l33k00q06k37l85l51n8M11J18O89M38N28j39N2k97
3217F97m09q04l65j85j18N26j77N50O88N83R1k59J76p99l42l60m56j49K18L67
3237e27j6Q05L34L68L1J52l79p01j79n23n09J80OM89J54M92L06L57q4K31m77o14
3259a04j61m53j60o0N18nN52L48Q21k23Pk33n53o12k52k97j32J91Q4K63Q90J74
3281F03L64j3k26l26l96k78o31M2J11J1M64L85M72J30K39l2l9q00Q9o93j39l70
3303a033L50K17L54M72K14N51k45J3p09o7n96o16J16Q9J00L48L77M97L48K83m07
3324F56m2l47l71m98k52M8L7M40J25K19O11l5J53O5n31l94o05j26Oj09J54O38
3346a58K78N86J97K3k36k05m16l13o17j99L8M85L14M13J90M55J24j09j72p03j15
$$ plain form
3367 -140 -688 -906 -1291 -781 -441 -349 252 485 665 649 779 490 65 -452 -724 -647 -710 -755 -275 154 543 1006
3389 1006 1006 1025 464 187 -171 -927 -1041 -796 -801 -442 -156 195 805 860 644 586 316 -53 -224 -841 -855 -773 -736
3412 -736 -331 247 658 707 925 858 617 106 -149 -596 -1012 -907 -610 -571 -209 197 519 705 841 811 518
3433 518 32 -450 -868 -1056 -1121 -833 -526 196 778 933 916 913 922 44 -317 -782 -736 -1046 -861 -698 -108 400
3455 400 559 1032 933 1024 358 87 -297 -481 -1014 -1009 -475 -359 76 501 653 983 665 653 -89 -250 -621 -872
3477 -872 -991 -783 -595 -46 186 785 829 827 766 503 172 -301 -562 -1030 -1076 -801 -300 58 574 893 764 955
3499 955 902 -166 -148 -204 -531 -918 -797 -704 -109 367 352 1045 1071 593 846 25 -259 -995 -1017 -706 -875 -528
3521 -528 -29 527 1087 919 816 765 154 -195 -518 -977 -683 -878 -719 -144 230 843 947 1056 748 672 66
$$ packed form
3367a40n48k18l85N10L40R2O01K33J80j6J30k89m25n17k72P7o3m5M80M29L89M63
3389A006%J9n61k77l58p56j14K45nL59K86L51O10N5k16n8k70l69j71o17j4Q2L7
3412g36M05N78M11M9K18o7k41n11k55m47m16J05K97L9L62M06L22J86J36l0k93
3433E18m86m82m18j88o5K88L07P22N82J55j7lRq78l61m65M6l10J85J63N90N08
3455D00J59M73r9R1o66k71l84j84n33NN34J16M35M25J52L30l18j2p42j61l71k51
3477h72j19K08J88N49K32N99M4ko1k63l31m73k61m68m6K75N01L58N16L19j29J91
3499I55n3j068J8n6l27l87J21R3N95M76j5O93K6m78K53q21k84p36k2L11j69L47
3521e28M99N56N60j68j03n1o11l49l23m59K94j95J59N75L74O13J04J09l08p6o06
$$ plain form
3542 66 -523 -719 -772 -751 -946 -285 -5 431 614 723 751 656 146 -20 -431 -838 -988 -855 -640 -188 319 649
3564 649 725 684 1071 376 -40 -376 -780 -1141 -759 -794 -363 -72 13 670 891 831 753 389 42 -678 -676 -761 -700
3587 -700 -605 -323 194 448 798 1106 657 439 111 -483 -869 -745 -649 -733 -312 -82 286 958 784 903 525
3608 525 176 124 -165 -682 -885 -867 -565 -205 250 563 706 834 706 798 408 -116 -651 -980 -534 -497 -256
3629 -256 0 295 423 934 757 525 -52 49 -654 -559 -849 -697 -463 42 35 610 636 1004 685 741 169 -289
3651 -289 -469 -767 -881 -600 -388 -266 271 634 700 749 351 151 -266 -445 -690 -616 -828 -507 -99 323 307
3672 307 371 697 616 345 -227 -145 -271 -899 -771 -626 -149 210 513 566 616 585 732 251 -154 -228 -819 -515
3694 -515 -968 -622 -374 41 296 630 883 932 333 95 -578 -568 -764 -452 -450 -485 96 389 929 875 647 674
$$ packed form
3542F6n89j96n3K1j95O61K80M36J83J09K8r5n10j66m11m07j50J33K15M52N07L30
3564F49P6m1L87o95m16l36m04l61L82l5M31K91Q5O57K21o0p8l64l47p20Kq5O1
3587g00R5K82N17K54L50L08m49k18l28n94l86J24R6q4M21K30L68O72j74J19l78
3608E25l49n2k89n17k03J8L02L60M55L13J43J28j28R2l90n24n35l29M46L7K41
3629b56K56K95J28N11j77k32n77J01p03R5k90J52K34N05pN75K6L68l19N6n72m58
3651b89j80k98j14K81K12J22N37L63O6M9l98k00m17j79k45P4k12L21M08M22j6
3672C07O4L26q1k71n72Q2j26o28J28J45M77L59L03N3N0l1J47m81m05p4n91L04
3694e15m53L46K48M15K55L34K53M9n99k38o73J0j96L12Kl5N81K93N40n4k28K7
$$ plain form
3716 674 259 -193 -277 -592 -644 -568 -697 -215 166 223 703 444 750 367 -156 -576 -759 -668 -957 -480 -385 85
3738 85 154 573 560 574 625 564 -389 -510 -632 -684 -810 -345 -212 33 521 749 843 550 426 205 -185 -690 -719
3761 -719 -641 -676 -212 -8 230 667 872 586 562 357 68 -422 -584 -635 -872 -578 -244 351 544 567 664 548
3783 548 25 153 -458 -756 -1086 -725 -795 -307 52 166 667 772 787 273 200 -139 -386 -802 -607 -398 -721
3804 -721 -244 152 478 711 1088 769 294 -48 -335 -412 -630 -681 -462 -352 175 348 374 764 575 691 348
3825 348 40 -392 -850 -824 -354 -751 -281 274 581 609 862 462 495 209 -500 -622 -617 -673 -287 -344 -287 171 481
3848 481 743 780 779 135 -74 -319 -563 -729 -419 -544 -183 571 571 743 704 570 281 -101 -378 -592 -895 -672
3870 -672 -528 -544 -60 318 336 750 716 420 162 -335 -442 -574 -720 -494 -478 -81 480 487 719 912 909 251 10
$$ packed form
3716F74m15m52q4l15n2P6j29M82L81N7M80k59L06l83n23m20j83R1k89M77R5M70
3738H5O9M19j3J4N1o1r53j21j22n2j26M65J33K45M88K28R4k93j24k21l90n05k9
3761g19P8l5M64K04K38M37K05k86k4k05k89m90j62n1k37K94L34N95J93K3R7j16
3783E48n23J28o11k98l30L61p0M88L59J14N01J05J5n14p3l39k47m16J95K09l23
3804g21M77L96L26K33L77l19m75l42k87p7k18n1K19J10N27J73K6L90j89J16l43
3825C48l08m32m58K6M70l97M70N55L07K8K53m00L3k86p09j22Nn6L86n7N7M58L10
3848D81K62L7jo44k09k45k44j66L10j25L61P54%J72l9j34k89l82k77k14l03K23
3870f72J44j6M84L78J8M14l4k96k58m97j07j32j46K26J6L97N61PK32J93lo58k41
$$ plain form
3893 10 -283 -419 -691 -423 -396 -160 195 243 481 583 568 458 404 -285 -355 -623 -778 -791 -500 -201 460 707
3915 707 780 966 753 468 352 -340 -489 -387 -694 -632 -383 -232 639 797 862 666 366 389 -219 -267 -807 -683
3937 -683 -552 -411 -378 44 362 632 682 531 298 121 -202 -654 -862 -749 -405 -130 -189 648 634 836 580
3958 580 704 5 163 -648 -730 -874 -502 -653 -153 226 325 756 365 698 628 369 -261 -559 -1064 -937 -756
3979 -756 -432 -171 262 707 822 679 380 12 247 -401 -789 -857 -815 -554 -241 226 587 686 817 718 446
4000 446 161 -210 -790 -902 -764 -465 -415 128 352 522 700 815 439 224 -145 -337 -473 -503 -756 -316 -126
4021 -126 -239 568 450 829 449 279 98 -100 -286 -744 -609 -645 -479 -30 254 688 733 735 811 310 107 -21
4043 -21 -722 -561 -654 -677 -298 -82 449 496 814 842 651 326 -511 -491 -543 -473 -507 -449 197 260 585 708 572 390
$$ packed form
3893A0k93j36k72K68K7K36L55M8K38J02j5j10n4o89p0k68j55j3K91K99O61K47
3915G07P3J86k13k85j16o92j49J02l07O2K49J51Q71J58O5j96l00K3o08m8n40J24
3937f83J31J41L3M22L18K70N0j51k33j77l23m52k08J13L44K75n9Q37j4K02k56
3958E80J24o99J58q11q2j44L72j51N00L79R9M31l91L33p0k59o30k98n05J27J81
3979g56L24K61M33M45J15j43k99l68K35o48l88o8M2K61L13M67L61R9J31r9k72
4000D46k85l71n80j12J38K99N0N43K24J70J78J15l76k15l69j92j36l0k53M40J90
4021a26j13Q07j18L79l80j70j81j98j86m58J35l6J66M49K84M34M5KP6n01k03j28
4043b1p01J61r3k3L79K16N31M7L18K8j91l25q37K0n2P0l4N8O46O3L25J23j36j82
$$ plain form
4067 390 399 -9 -575 -420 -608 -714 -604 -480 -96 384 192 598 729 388 223 20 -444 -797 -898 -562 -412
4088 -412 -175 207 248 546 619 619 463 106 -308 -600 -793 -707 -298 -172 91 267 583 576 523 580 337 15 -391
4111 -391 -770 -523 -757 -444 -95 447 644 523 614 643 504 45 -260 -568 -893 -654 -626 -380 -193 469 259
4132 259 411 484 560 194 -108 -106 -586 -438 -817 -438 116 -161 674 786 558 542 104 -110 -215 -391 -635 -658
4154 -658 -525 -279 38 229 438 368 603 306 147 -314 -454 -501 -764 -417 -267 40 229 483 641 531 517
4175 517 82 101 -120 -189 -472 -608 -675 -285 28 351 590 805 481 265 18 109 -364 -655 -808 -514 -148
4196 -148 -359 -45 505 319 529 334 327 32 -334 -556 -375 -584 -633 -436 38 204 474 417 553 178 249 89
4218 89 -61 -477 -409 -378 -374 31 119 552 551 498 427 137 41 -291 -466 -572 -501 -218 -321 -12 109 351 355 932 409
$$ packed form
4067C90Rm08n66J55j88j06J10J24L84M80j92M06J31l41j65k03m64l53j01L36J50
4088d12K37L82M1K98P3%j56l57m14k92j93Q6M09J26K63J76L16pn3N7k43l22m06
4111c91l79K47k34L13L49N42J97j21R1K9j39m59l05l08l25K39K8K46J87O62k10
4132B59J52P3P6l66l02Km80J48l79L79N54k77Q35J12k28j6m38k14j05j76k44k3
4154f58J33K46L17J91K09p0K35k97j59m61j40m7k63L47J50L07J89K54J58j10j4
4175E17m35J9k21o9k83j36o7L90L13L23K39K15l24k16k47R1m73k91j53K94L66
4196a48k11L14N50j86K10j95pk95l66k22J81k09m9J97M74J66K70n7J36l75P1j60
4218H9j50m16O8L1MM05Q8M33jn3p1k90r6l32j75j06P1K83j03L09J21K42MN77n23
$$ plain form
4243 409 85 -549 -307 -483 -470 -564 -326 -185 127 382 408 726 352 315 78 -238 -212 -570 -425 -343 -355 102
4265 102 370 427 660 433 194 -145 67 -244 -285 -707 -393 -99 -214 4 415 307 570 527 591 -384 -271
4286 -271 -341 -511 -862 -544 -247 44 388 613 738 545 518 122 13 54 -654 -364 -614 -48 -225 54 568
4307 568 472 449 216 367 221 -202 -668 -567 -478 -256 -198 74 246 570 498 450 401 291 -41 -450 -473 -703 -792
4330 -792 -457 -59 136 184 588 328 151 283 262 -103 -170 -772 -821 -462 -212 -56 272 319 892 325 468 165
4352 165 -33 -129 -690 -500 -533 -200 210 91 302 681 575 333 399 38 -76 -72 -478 -649 -243 -418 -265 24
4374 24 335 671 521 273 294 -144 -297 -649 -364 -324 -372 -221 97 474 593 528 721 450 -104 -136 -407 -483
4396 -483 -386 -423 -428 -273 -34 347 521 431 467 294 -112 -159 -539 -392 -359 -398 -107 188 301 718 341 382 133
$$ packed form
4243D09l24o34K42j76J3r4K38J41L12K55K6L18l74l7k37l16K6l58J45Q2j2M57
4265A02K68N7K33k27k39l39K12l11m1m22L14K94j15K18M11j08K63m3O4r75J13
4286b71p0j70l51L18K97K91L44K25J25j93k7l96j09M1p08K90k50N66j77K79N14
4307E68r6k3k33J51j46m23m66J01Q9K22N8K72J72L24p2m8m9j10l32m09k3k30q9
4330g92L35L98J95M8M04k60j77J32k1l65o7o02m9L59K50J56L28M7N73n67J43l03
4352A65j98r6n61J90l3L33M10j19K11L79j06k42O6l61j14Mm06j71M06j75J53K89
4374B4L11L36j50k48K1m38j53l52K85M0m8J51L18L77J19o5J93k71n54l2k71p6
4396d83R7l7nJ55K39L81J74r0L6j73m06m7l80J47L3l9K91K95J13M17l77M1k49
$$ plain form
4419 133 111 -136 -182 -460 -390 -360 -276 -265 318 317 738 481 282 410 -76 -225 -503 -341 -530 -387 -230 19 424
4442 424 674 363 298 443 217 -71 -322 -312 -447 -637 -115 -108 212 478 673 322 334 158 -10 -366 -482 -701
4464 -701 -541 -155 -351 -34 217 320 332 669 658 418 37 -365 -379 -291 -541 -429 49 24 169 509 133 535
4486 535 269 57 -95 -296 -836 -190 -423 -214 -70 99 305 549 460 498 240 97 -251 -502 -540 -386 49
4507 49 59 140 422 517 355 553 577 132 13 -451 -722 -277 -241 -229 -196 85 306 448 302 50 12 108 -302
4530 -302 -426 -572 -483 -592 105 190 55 307 514 240 132 132 -332 -272 -612 -497 -350 -177 14 179 445 598
4552 598 527 484 157 -120 -87 -80 -475 -496 -372 -205 232 171 360 360 413 483 248 -108 -358 -601 -746 -406 1 198
4576 198 249 272 418 681 237 55 -59 -118 -461 -115 -299 -463 -270 -123 412 676 532 288 174 12 181
$$ packed form
4419A33k2k47m6k78P0L0Q4J1N83jM21k57j99J28m86j49k78J62j89J43J57K49M05
4442D24K50l11o5J45k26k88k51J0j35j90N22PL20K66J95l51J2j76j68l56j16k19
4464g01J60L86j96L17K51J03J2L37j1k40l81m02j4Q8k50J12M78k5J45L40l76M02
4486E35k66k12j52k01n40O46k33K09J44J69K06K44q9L8k58j43l48k51l8J54M35
4507D9J0Q1K82R5j62J98K4m45j19m64k71M45L6J2L3K81K21J42j46k52l8R6m10
4530c02j24j46Q9j09O97Q5j35K52K07k74j08%m64O0l40J15J47J73J91J65K66J53
4552E98p1m3l27k77L3Pl95k1J24J67M37o1J89%N3P0k35l56k50k43j45L40M07J97
4576A98N1K3J46K63m44j82j14n9l43L46j84j64J93J47N35K64j44k44j14j62J69
$$ plain form
4597 181 -199 -375 -329 -328 -363 -123 68 446 323 585 429 -174 265 -72 -450 -438 -505 -389 -272 -95 243 380
4619 380 375 690 235 -239 -269 -402 -356 -334 -390 -41 -101 174 330 533 374 306 30 25 168 -390 -348 -340 -149 -266
4643 -266 15 130 234 275 430 196 109 -429 -36 -697 -556 -397 -298 191 242 277 283 544 300 48 -85 -575
4665 -575 -229 -226 -311 -208 -223 72 222 274 425 168 315 131 107 -86 -300 -339 -157 -109 -28 356 406 304 552
4688 552 313 44 74 -17 -442 -327 -377 -178 -175 102 297 166 619 257 606 124 -110 -226 -346 -451 -503 -226
4710 -226 140 177 203 736 219 272 288 373 -183 -387 -558 -360 -360 -246 86 71 362 297 393 417 353 -92 -202 -314
4734 -314 -295 -202 -210 8 274 320 522 515 457 121 27 -54 -156 -435 -216 -525 -257 -278 370 312 109 367 82 257
4758 257 -213 -155 -425 -228 -300 -160 -25 -14 409 491 642 471 393 141 -184 -450 -380 -135 -116 -9 26 102 101 605
$$ packed form
4597A81l80j76M6Jl5K40J91L78j23K62j56o03M39l37l78J2o7J16J17J77L38J37
4619C80nL15m55m74l0j33M6K2n6L49o0K75J56K03j59o8k76nJ43n58M2QJ91j17
4643b66K81J15J04M1J55k34q7n38L93o61J41J59R9M89N1L5OK61k44k52j33m90
4665e75L46Lq5J03j5K95J50N2J51k57J47j84k4j93k14l9J82M8Q1L84N0j02K48
4688E52k39k69L0r1m25J15n0J99LK77J95j31M53l62L49m82k34j16j20j05n2K77
4710b26L66L7K6N33n17N3J6Q5n56k04j71J98%J14L32j5K91o5R6K4o4m45j10j12
4734c14J9R3qK18K66M6K02pn8l36r4q1j02k79K19l09K68k1O48n8k03K58k85J75
4758B57m70N8k70J97p2J40J35J1M23Q2J51j71p8k52l25k66P0K45J9J07L5P6jN04
$$ plain form
4782 605 311 340 75 -145 -46 -347 -442 -428 -386 -267 270 439 548 456 494 296 238 -5 -177 -631 -409 -393 -375
4805 -375 -106 203 374 573 501 452 413 -85 90 -588 -372 -546 -127 -252 121 182 280 398 377 489 63 -219
4827 -219 -281 -567 -406 -428 -185 185 -52 364 397 174 327 280 99 100 -627 -774 -473 -289 -130 44 191 361
4849 361 561 324 376 40 22 -360 -196 -417 -291 -314 -288 -138 199 799 476 59 -51 15 -405 -488 -233 -522
4871 -522 -280 -323 -21 412 329 433 444 299 31 -67 -289 -559 -327 -430 -299 -244 119 326 652 197 400 410
4893 410 99 -345 -437 -451 -497 -19 188 -224 365 330 661 200 197 54 89 -104 -231 -463 -472 -351 -81 102 347
4916 347 519 271 397 292 127 -118 -135 -427 -324 -480 144 -93 184 435 490 519 218 34 35 -245 -175 -407
4938 -407 -158 -73 -10 100 215 53 532 113 244 1 -238 -245 -268 -334 -341 -105 -215 -87 379 387 300 453 39 -165
$$ packed form
4782F05k94K9k65k20R9l01r5J4M2J19N37J69J09r2L8j98n8k43j72m54K22J6J8
4805c75K69L09J71J99p2m9l9m98J75o78K16j74M19j25L73O1R8J18k1J12m26k82
4827b19o2k86J61k2K43L70k37M16L3k23J53m7j81Jp27j47L01J84J59J74J47J70
4849C61K00k37N2l36j8l82J64k21J26k3K6J50L37O00l23m17j10O6m20q3K55k89
4871e22K42m3L02M33q3J04J1j45k68r8k22k70K32j03J31N5L63K07L26m55K03J0
4893D10l11m44r2j4m6M78K07m12N89l5L31m61lj43L5j93j27k32rJ21K70J83K45
4916C47J72k48J26j05j65k45j7k92J03j56O24k37K77K51N5K9l01j84Jk80P0k32
4938d07K49Q5O3J10J15j62M79m19J31k43k39pk3o6pK36j10J28M66Qq7J53m14k04
$$ plain form
4962 -165 -260 -534 -440 -417 -179 -154 8 256 268 372 569 100 64 -269 -461 -45 -397 -156 -164 74 104 341 361
4985 361 529 -60 156 -131 -162 -368 -282 -260 -45 -88 -96 142 434 303 290 291 -73 -241 -352 -383 -241 -416 -264
5008 -264 -80 155 371 459 278 358 90 -219 -148 -39 -272 -325 -100 -145 194 214 394 463 209 79 -27 -278
5030 -278 -298 -514 -285 -104 -522 -105 275 540 409 193 405 300 -48 -67 -346 -446 -612 -369 -301 158 473
5051 473 605 294 57 210 3 -147 -583 -172 -401 -395 -465 264 349 170 703 154 204 -156 -522 247 -296 -294
5073 -294 -289 -344 -4 187 344 327 445 295 183 -88 -240 -314 -496 -467 -235 -195 -132 331 277 317 464 345 -52
5096 -52 5 -185 -195 6 -523 -142 -33 24 223 417 338 301 185 25 -156 -353 -333 -307 -215 -183 154 10 222
5119 222 376 167 291 61 -61 -176 -230 -246 -315 -255 -181 341 314 320 319 61 132 -82 -150 -392 302 -106 -161 -108 169
$$ packed form
4962a65r5k74R4K3K38K5J62K48J2J04J97m69l6l33j92M16l52K41qK38L0K37K0
4985C61J68n89K16k87l1k06Q6K2K15m3qK38K92j31j3Jl64j68j11l1J42j75J52
5008b64J84K35K16Q8j81Q0k68l09P1J09k33n3K25m5L39K0J80O9k54j30j06k51
5030b78k0k16K29J81m18M17L80K65j31k16K12j05l48j9k79j00j66K43O8M59L15
5051D73J32l11k37J53k07j50m36M11k29Op0P29Q5j79N33n49N0l60l66P69n43K
5073b94Nn5L40J91J57j7J18j50j12k71j52p4j82K9K32M0O3M63n4M0J47j19l97
5096e2N7j90j0K01n29L81J09N7J99J94p9l7j16j60j81j97K0K6R2L2L37j44K12
5119B22J54k09J24k30j22j15n4j6o9O0P4N22k7Ojk58P1k14o8k42O94m08n5N3K77
$$ plain form
5144 169 136 490 415 153 222 7 -38 -61 -158 -231 -111 -439 -237 87 146 483 198 297 385 129 -89 -157 -430 -547
5168 -547 -591 -102 -43 -210 318 233 247 357 55 28 -302 -262 -452 -378 -73 -187 63 249 445 244 527 156
5190 156 -64 -3 -351 -300 -382 -630 -288 129 -152 271 329 237 394 159 -100 -478 -149 -527 -475 -179 -31 -2
5212 -2 89 512 160 364 465 -31 48 -67 -160 -340 -127 -146 -191 147 -21 548 570 295 194 -44 -199 -334 -166
5235 -166 -442 -113 147 -192 107 480 292 189 236 -94 16 -138 -562 -595 -221 -294 -118 27 413 329 490
5256 490 459 113 20 -220 -48 -406 -299 -550 -205 12 320 407 648 318 369 -80 -162 -116 -359 -259 -422 -109
5278 -109 -67 108 186 308 295 326 48 41 -101 -132 -585 -392 -43 -56 -1 323 217 386 392 141 -110 4 -181 -479
5302 -479 -513 -68 -189 -14 468 252 307 232 676 259 230 -98 -36 -409 -635 -335 -346 103 262 299 433 411 567
$$ packed form
5144A69l3L54p5k62O9k15m5k3r7p3J20l28K02L24N9L37k85R9Q8k56k18o8k73j17
5168e47m4M89N9j67N28q5J4J10l02k7l30M0j90P4L05j14K50J86J96k01K83l71
5190A56k20O1l48N1q2k48L42M17k81M23N8r2J57k35k59l78L29l78N2K96J48K9
5212bR1M23l52K04J01m96P9j15r3j80K13j9m5L38j68N69K2k75j01k38j55j35J68
5235a66k76L29K60l39K99L73j88j03M7l30J10j54m24l3L74p3J76J45L86q4J61
5256D90l1l46r3k40J72l58J07k51L45K17L08Q7K41l30N1m49q2M6k43J00j63L13
5278a09M2J75P8J22j3L1k78pj42l1m53J93L49j3N5L24j06J69Ok51k51J14j85k98
5302d79l4M45j21J75M82k16N5p5M44m17k9l28O2l73k26L00j1M49J59L7J34k2J56
$$ plain form
5325 567 -57 0 -266 -589 -387 -159 -54 -27 194 193 476 316 333 121 -151 -282 -260 -316 -288 -296 -110 220 233 370
5349 370 433 320 3 105 -161 45 -196 -350 -249 56 -121 152 254 356 314 306 88 -20 -139 -295 -461
5370 -461 -299 -257 -254 13 8 226 337 288 168 108 -302 -416 -308 -235 -341 -417 9 157 197 364 952 336 73
5393 73 296 -84 -38 -351 -400 -83 -285 304 -43 417 238 487 260 273 151 -234 -232 -280 -514 -36 -60 32 310
5416 310 178 440 247 322 -6 -459 -201 -526 -480 -235 -111 -115 249 333 365 425 240 532 -85 -200 -211 -545 -278
5439 -278 -215 -48 38 89 298 476 518 146 123 -128 -390 -384 -382 -378 -394 102 -23 167 401 243 157 -104 -7 39 -196
5464 -196 -258 -362 -167 -87 206 130 189 469 276 388 176 -127 -240 -345 -169 -154 -264 -70 48 504 253 548
5486 548 104 86 -16 -6 -235 -115 -232 -283 -289 -60 200 81 244 298 120 311 126 -516 -365 -463 -488 -100 -106
$$ packed form
5325E67o24N7k66l23K02K28J05K7K21jK83j60J7k12k72j31K2n6K8qJ86L30J3J37
5349C70O3j13l17J02k66K06k41j54J01L05j77K73J02J02m2qk18j08j19j56j66
5370d61J62M2LK67nK18J11m9j20o0m10j14J08P3j06p6M26J48M0J67N88o16k63
5393G3K23l80M6l13m9L17k02N89l47M60j79K49k27J3j22l85Km8k34M78k4R2K78
5416C10j32K62j93P5l28m53K58l25M6K45J24mL64Q4L2O0j85K92o17j15j1l34K67
5439b78O3J67Q6N1K09J78M2l72k3k51k62OKMj6M96j25J90K34j58q6k61R7M6k35
5464a96o2j04J95Q0K93p6N9K80j93J12k12l03j13j05J76J5j10J94J18M56k51K95
5486E48m44j8j02J0k29J20j17n1oK29K60j19J63N4j78J91j85o42J51r8k5L88o
$$ plain form
5509 -106 7 10 71 510 393 118 -41 158 -423 -92 -420 -323 -233 51 279 319 481 595 309 93 3 -24 -311
5532 -311 -379 -242 267 -3 92 455 430 247 -10 111 -3 49 -257 -261 -363 -259 -92 75 -118 433 222 306
5554 306 261 324 2 10 -389 -535 -171 33 31 134 81 216 188 497 142 -53 -6 -269 -274 -454 -321 -29 154 -159
5578 -159 187 248 258 230 -171 -331 -344 -545 -462 -274 118 -44 31 226 734 97 199 118 77 5 -333 -392 -223
5601 -223 -190 62 -138 -119 541 169 140 212 97 -174 -23 -109 -600 -158 -415 -116 -239 258 313 352 486 117
5623 117 -328 -221 -407 -149 -454 -253 -295 -6 227 470 430 668 211 104 -128 -326 -427 -317 -15 -180 86
5644 86 53 263 342 273 444 -7 -12 123 -419 -165 -319 -503 24 -109 338 237 245 542 345 254 -144 -194 -121 -356
5668 -356 -146 -81 50 3 109 420 201 275 300 55 -199 -590 -419 -483 -155 -307 -109 509 290 382 329 352 -56
$$ packed form
5509a06J13LO1M39j17k75j59J99n81L31l28R7R0K84K28M0J62J14k86k16r0k7k87
5532c11o8J37N09k70R5L63k5j83k57J21j14N2l06mj02J04J67J67j93N51k11Q4
5554C06m5O3l22Ql99j46L64K04kJ03n3J35k8L09l55j95M7k63nj80J33K92J83l13
5578a59L46O1J0k8m01j60j3k01Q3J88L92j62P5J95N08o37J02q1m1p2l38n9J69
5601b23L3K52k00J9O60l72k9P2j15k71J51q6m91M42k57K99j23M97N5L9J34l69
5623A17m45J07j86K58l05K01m2K89K33K43m0K38m57j07k32j98j01J10L02j65K66
5644H6l3K10P9o9J71m51nJ35n42K54j54j84N27j33M47j01QK97j97r1l98n0P3k35
5668c56K10O5J31m7J06L11k19P4K5k45k54l91J71o4L28j52J98O18k19R2n3K3m08
$$ plain form
5691 -56 64 -168 -259 -285 -298 -89 13 -96 139 285 364 127 212 29 -51 -251 -391 -498 22 18 -179 372 391
5714 391 197 142 176 -132 -119 -299 -164 -130 -447 63 123 238 121 288 446 332 344 171 137 -166 -140 -324 -276
5737 -276 84 90 36 333 205 130 70 16 -3 -84 -401 -216 -107 -225 105 106 -18 305 231 134 170 24 -42 -27 -192
5762 -192 -342 -283 -166 305 282 52 297 -29 8 246 68 -302 -358 -402 -119 24 -181 -146 -107 214 458 -102
5784 -102 110 -15 -18 45 -238 -333 -393 116 -345 -127 -5 218 414 142 133 -144 -582 -178 -172 -435 -183 -124 210
5807 210 407 417 368 336 295 229 -109 -321 -138 -153 -182 106 122 -11 396 8 187 181 -66 -35 -177 -125 -249 -178
5831 -178 -170 -97 106 74 377 300 -60 250 523 -128 -297 -277 -354 -16 55 29 148 150 145 320 -39 95 -232 -236 -457
5856 -457 -79 -300 -66 -156 30 328 122 251 345 218 49 -10 -128 -247 -248 -235 -233 -278 211 259 697 311 85
$$ packed form
5691e6J20k32r1k6j3K09J02j09K35J46P9k37Q5j83q0k00j40j07N20mj97N51J9
5714C91j94n5L4l08J3j80J35L4l17N10O0J15j17J67J58j14J2j73l4l03K6j84M8
5737b76L60On4K97j28p5o0n4j9q1l17J85J09j18L30Jj24L23p4r7L6j46o6J5j65
5762a92j50N9J17M71k3k30K45l26L7K38j78l70n6m4K83J43k05L5L9L21K44n60
5784a02K12j25lO3k83r5o0N09m61K18J22K23J96k72rk77m38M04Ok63K52N9L34
5807B10J97J0m9l2m1o6l38k12J83j5k9K88J6j33M07l88J79ok47L1j42N2j24P1
5831a78QP3K03l2L03p7l60L10K73o51j69K0p7L38P1k6J19KnJ75l59J34l27mk21
5856d57L78k21K34r0J86K98k06J29R4j27j69n9j18j19jJ3Km5M89M8M38l86k26
$$ plain form
5879 85 -29 -195 -243 -456 -138 -164 -137 -220 -46 162 158 154 180 147 268 118 -380 -237 -335 -256 -102 -96 -6 -50 261 437
5905 437 87 132 10 -252 -143 -391 94 -113 -471 30 89 238 78 -81 -43 12 0 -378 -10 -347 -87 -251
5927 -251 -116 245 236 351 427 268 59 -70 -85 -175 -284 -143 21 -104 201 250 126 307 226 -6 183 66
5949 66 -229 -272 -507 -305 -110 -32 -7 292 218 43 157 172 -13 7 -201 -422 -298 -67 -162 -268 56 118 324
5972 324 124 133 39 -114 -343 -236 -131 -81 37 86 135 321 130 -110 -89 31 -10 -107 -34 -258 33 -150 -377
5995 -377 118 -14 234 251 -37 -94 18 -172 -318 -222 -46 -353 120 -70 -12 194 442 316 198 -45 -47 -82
6017 -82 -465 -181 -249 -117 38 302 130 254 126 372 -73 11 175 -341 -264 -70 -151 -61 -203 77 180 218
6039 218 265 56 -182 -140 -84 -375 -360 -303 -247 -172 -64 114 332 -83 69 213 -85 -141 76 201 6 -150 -460
$$ packed form
5879H5j14j66m8k13L18k6K7q3J74K08mmK6l3J21j50m98J43r8P9J54OR0m4L11J76
5905D37l50M5j22k62J09k48M85k07l58N01N9J49j60j59L8N5j2l78L68l37K60j64
5927b51J35L61rJ15P6j59k09j29j5r0j09J41J64j25L05M9j24J81q1k32J89j17
5949F6k95m3k35K02J95P8K5K99p4j75J14J5j85K0k08k21J24K31r5j06L24O2K06
5972C24k00Rr4j53k29J07J05N0J18M9M9J86j91k40K1J20m1r7P3k24K91j83k27
5995c77M95j32K48J7k88n7J12j90j46R6J76l07M73j90N8K06K48j26j18k43kl5
6017h2l83K84o8J32J55K64j72J24j28K46m45Q4J64n16P7J94q1R0j42K80J03L8
6039B18M7k09k38M2N6k91J5N7N6P5J08J78K18m15J52J44k98n6K17J25j95j56l10
$$ plain form
6062 -460 -84 191 102 168 -77 171 197 50 -277 -376 125 -208 -298 7 190 128 67 232 299 152 272 21 -128
6085 -128 -86 -118 -346 -64 269 17 34 341 237 430 37 45 -104 -353 -188 -382 90 -89 -253 318 149 87
6107 87 182 -52 97 -70 -395 -242 -336 -258 13 210 -109 329 392 -99 72 -86 76 -248 -128 -341 -177 -221
6129 -221 -16 -85 1 225 44 78 216 -22 107 -85 -496 -78 -462 94 15 15 184 179 333 -15 -54 -79 -94 -293
6153 -293 -216 -387 -113 -18 -123 7 241 131 431 51 115 59 -333 -113 -357 -132 -233 -208 -21 106 526 190
6175 190 340 158 -49 -31 -199 -203 -331 50 -286 38 68 256 315 203 156 142 -117 -68 -57 -313 39 -240 -25
6198 -25 11 27 71 319 105 87 -178 -42 -216 -131 -66 -469 -136 90 86 196 356 427 17 210 47 -293 -315 -59
6222 -59 -419 -399 -161 204 366 146 254 16 121 -113 73 128 -63 -342 -276 -107 -201 236 221 206 102 -41
$$ packed form
6062d60L76K75q9O6k45K48K6j47l27r9N01l33r0L05J83o2o1J65O7j47J20k51j49
6085a28M2l2k28K82L33k52J7L07j04J93l93Qj49k49J65j94M72j79j64N71j69o2
6107H7R5k34J49j67l25J53r4P8K71J97l19M38O3m91J71j58J62l24J20k13J64m4
6129b21K05o9Q6K24j81L4J38k38J29j92m11M18l84N56p9%J69nJ54l48l9k5j5j99
6153b93P7j71K74R5j05J30K34j10L00l80O4n6l92K20k44K25j01K5J87J27M20l36
6175A90J50j82k07J8j68mj28L81l36L24L0J88N9j12m7j4k59M9J1k56L52k79K15
6198b5L6J6M4K48k14j8k65J36j74Q5O5m03L33K26mJ10J60P1m10J93j63l40k2K56
6222e9l60K0K38L65J62k20J08k38J05k34J86N5j91k79O6J69r4M37j5j5j04j43
$$ plain form
6244 -41 25 -7 -188 -224 -300 -356 -82 43 -13 199 131 391 186 291 -10 100 -349 -434 0 -88 50 -249 -15
6267 -15 291 352 124 234 139 3 24 -250 -318 -288 4 373 194 -49 216 223 194 -8 19 -167 -299 -71 -272
6290 -272 -219 33 4 -90 68 234 72 -19 184 168 -260 -140 -49 -18 19 -67 15 228 529 150 159 44 -83 124
6314 124 -40 -262 -46 -225 -46 -277 150 85 327 27 258 55 -235 -106 -544 -383 -3 50 -87 16 43
6335 43 269 425 100 153 148 88 -311 -69 -446 -229 -161 -20 -19 -83 147 104 160 193 -18 51 -491 -395 -227 173 152
6360 152 -32 280 237 104 64 83 168 -35 -406 -383 -73 -76 -143 -22 144 223 189 29 411 103 143 -387 -115 -128
6384 -128 -17 -2 -44 45 53 68 541 26 152 -59 -28 -61 -481 165 -70 168 -6 -119 43 440 215 84 -10
6407 -10 -32 -45 -204 -95 -299 -168 -84 249 50 147 70 181 168 -33 -28 -276 -217 -181 -169 -152 -35 -61 131 161 182
$$ packed form
6244d1O6l2j81l6p6n6K74J25n6K12o8K60k05J05l01J10m49q5M34q8J38k99K34
6267a5L06O1k28J10r5j36K1k74o8L0K92L69j79k43K65Pk9k02K7j86j32K28k01
6290b72N3K52k9r4J58J66j62r1K03j6m28J20R1L1L7q6Q2K13L01l79Rj15j27K07
6314A24j64k22K16j79J79k31M27o5K42l00K31k03k90J29m38J61L80N3j37J03K7
6335D3K26J56l25N3no0l99K42l77K17O8J41Jo4K30m3N6L3k11O9n42R6J68M00k1
6360A52j84L12m3j33m0J9Q5k03l71K3L10lo7J21J66P9l4j60L82l08M0n30K72j3
6384a28J11J5m2Q9QJ5M73n15J26k11L1l3m20O46k35K38j74j13J62L97k25j31r4
6407a0k2j3j59J09k04J31Q4L33j99R7p7J11j3k01Nk48N9L6J2J7J17k6J92L0K1
$$ plain form
6432 182 83 145 -257 12 -178 -388 -286 58 237 26 273 194 175 293 133 305 77 -290 -102 -310 -14
6453 -14 -258 -122 252 257 260 144 36 -97 -211 -160 -75 -279 -197 -138 -166 -265 42 282 13 168 224 233 -59 -211 -79
6478 -79 -156 -75 -15 -38 -110 133 210 172 79 4 -119 -13 -201 109 -256 -260 -278 355 171 70 74 218 45 66 213
6503 213 -49 -282 -164 -472 -156 81 144 304 -204 250 -50 281 124 72 -367 -138 -11 -97 120 152 161 91
6525 91 132 236 76 -72 -83 -142 -367 -210 -266 -288 200 -48 128 259 218 237 -8 146 250 -35 3 -96 -420
6548 -420 -189 116 170 255 99 260 -70 101 -67 17 -38 -107 -348 -55 -7 -37 197 88 152 -103 -212 20 -48
6571 -48 -32 -32 -70 70 90 -57 -92 -72 -61 151 159 -36 -146 -383 -129 159 -319 -196 -153 -247 -13 124 63 116 85
6596 85 52 -330 -234 -196 -66 57 -125 -94 197 -34 308 49 -96 -116 -294 -255 -141 -46 -163 -424 0 156 70
$$ packed form
6432A82r9O2m02K69j90k10J02L44J79k11K47p9j9J18j60J72k28l67J88k08K96
6453a4k44J36L74NLj16j08j33j14N1Q5k04Q2N9k8r9L07K40k69J55N6Rk92j52J32
6478g9p7Q1O0k3p2K43P7l8r3p5j23J06j88L10l65mj8O33j84j01MJ44j73K1J47
6503B13k62k33J18l08L16K37O3J60n08M54l00L31j57n2m39K29J27q6K17L2Rp0
6525I1M1J04j60j48j1n9k25J57n6k2M88k48J76J31m1J9k45J54J04k85L8r9l24
6548d20K31L05N4Q5j56J61l30J71j68Q4n5o9k41K93M8l0K34j09O4k55j09K32o8
6571d8J6%l8J40K0j47l5K0J1K12Qj95j10k37K54K88m78J23M3r4K34J37o1N3l1
6596H5l3l82R6L8J30J23j82L1K91k31L42k59j45k0j78L9J14R5j17k61M24J56q6
$$ plain form
6619 70 217 14 399 181 -177 -98 43 -298 -228 -209 -109 -236 110 -122 120 191 185 139 107 -328 -312 -150 -275
6642 -275 121 70 135 149 101 -61 -43 180 27 -74 -126 -372 -125 -183 -140 190 -33 268 448 177 347 23 -44
6665 -44 -5 -341 -394 -142 58 77 94 39 -66 313 227 129 -45 -63 -117 -114 -387 -2 14 -185 284 165 -138 133
6689 133 20 47 42 13 -119 -255 -158 37 -217 141 188 103 151 21 32 44 -32 -3 -39 -195 -245 -185 -53 -138 224
6714 224 7 175 268 174 93 58 -209 -41 -115 -137 171 -374 27 366 67 52 144 149 93 225 -175 -197 -44 -24
6738 -24 7 -141 237 128 44 202 180 123 -164 8 -65 -202 -92 -106 205 159 116 163 124 174 -167 76 89 -382
6762 -382 -257 -38 -180 -79 101 -214 347 68 356 61 -110 -7 -74 127 194 -243 257 -10 -155 -18 -5
6783 -5 276 160 -91 -215 -41 -81 -84 -233 -54 -131 22 -71 80 -109 -62 35 320 32 -198 -324 -239 -53 -39 -39
$$ packed form
6619G0J47k03L85k18l58P9J41l41P0J9J00j27L46k32K42P1om6l2m35J6J62j25
6642b75L96n1O5J4m8j62J8K23j53j01n2k46K47n8M3L30k23L01J80k71J70l24o7
6665d4L9l36n3K52K00J9J7n5j05L79q6r8j74j8n4Lk73L85J6j99M69j19l03K71
6689A33j13K7nk9j32j36R7J95k54L58M7q5M8j30J1J2p6K9l6j56n0O0J32q5L62
6714B24k17J68R3r4q1l5k67J68p4k2L08n45M01L39k99j5R2Nn6J32m00k2J53K0
6738b4L1j48L78j09q4J58k2n7k87J72p3j37J10j4L11m6m3M7l9N0l41K43J3m71
6762c82J25K19j42J01J80l15N61k79K88k95j71J03o7K01O7m37N00k67j45J37J3
6783eK81j16k51j24J74m0lj49J79p7J53r3J51j89M7R7K85k88k30j26Q5J86J4%
$$ plain form
6807 -39 -97 82 234 242 -5 361 -87 -160 -305 143 -356 -30 -37 -22 238 184 -167 271 -76 151 62 -95 -270
6830 -270 151 -39 -25 15 8 404 112 223 118 42 -74 96 -127 -77 -294 125 318 160 151 123 -83 -54 -49 58
6854 58 7 -8 -86 -93 255 -144 -5 226 -165 -109 275 -57 71 18 -42 93 -61 89 160 113 186 -19 -118 297
6878 297 -70 221 99 -171 -142 -214 -150 38 -351 94 67 46 89 361 337 -159 -197 -88 -165 -31 26 110 28 -396
6902 -396 144 221 225 -67 150 161 -21 -258 -293 -322 -406 -122 183 143 -4 -1 -8 -119 99 19 -167 -280 -174 10
6926 10 -31 -88 18 115 -103 79 -51 -171 -31 197 -50 111 -108 -101 -206 -144 156 -136 90 -75 44 -52 248
6949 248 210 -274 -142 -144 -122 -158 190 -74 281 235 93 -28 20 -400 -110 141 -231 -190 -118 -123 123 231 20 -80
6973 -80 172 82 142 -118 144 -48 40 76 -208 162 -72 -70 153 380 -142 57 -121 -239 -237 -310 7 149 -347
$$ packed form
6807c9n8J79J52Qk47L66m48p3j45M48m99L26pJ5K60n4l51M38l47K27q9j57j75
6830b70M21j90J4M0pL96k92J11j05p6j16J70k23N0k17M19J93j58rk8k06K9NJ07
6854E8n1j5p8pL48l99J39K31l91N6L84l32J28n3o0J35j54J50P1m7P3k05r9M15
6878B97l67K91j22k70K9p2O4J88l89M45k7k1M3K72k4m96l8J09p7J34N7Q4q2m24
6902c96N40P7Mk92K17J1j82k37l5k9q4K84L05m0j47Lpj11K18q0j86j13J06J84
6926A0m1n7J06R7k18J82j30j20J40K28k47J61k19Pj05O2L00k92K26j65J19r6L00
6949B48l8m84J32kK2l6L48k64L55m6j42j21M8m20K90K51l72M1P2nK46J08k11j00
6973h0K52r0O0k60K62j92Q8L6k84L70k34KK23K27n22J99j78j18Kp3L17J42m96
$$ plain form
6996 -347 66 209 189 -35 -18 119 -88 6 -331 -478 -103 -171 -124 38 58 80 202 51 191 142 73 -116 79
7019 79 31 -182 -126 -193 224 41 -253 35 -48 71 157 7 -264 37 78 115 -27 208 -202 -47 84 208 -149
7042 -149 -325 -293 -171 -69 13 42 -184 192 106 58 -286 151 -155 -43 273 139 39 -59 -113 -166 -60 -15 -11 74
7066 74 317 361 1 147 46 157 -108 -229 83 -159 48 -134 125 184 80 56 56 -33 -22 -243 -197 -171 -52
7089 -52 -89 -61 141 -107 -65 141 -71 -107 -22 22 216 -108 110 -34 50 210 22 -39 147 122 -60 88 37 -215
7113 -215 147 -343 -145 144 -157 45 -48 -228 219 -144 89 61 -75 -24 -16 202 -200 66 -170 -53 -15 72
7135 72 189 -46 111 -77 -283 -63 19 15 22 155 -131 126 139 122 -31 10 -40 -253 82 65 103 -117 131 200
7159 200 -6 279 194 3 221 -253 -174 -143 104 -31 13 -30 -146 261 -38 207 69 -55 -162 159 -112 -42
$$ packed form
6996c47M13J43k0k24J7J37k07R4l37j47L75o8M7J62K0K2J22j51J40m9o9j89J95
7019G9m8k13N6o7M17j83k94K88q3J19Q6j50k71L01M1L7j42K35m10J55J31J24l57
7042a49j76L2J22J02Q2K9k26L76q6m8l44M37l06J12L16j34j00r8n4n3J06M5MQ5
7066G4K43M4l60J46j01J11k65j21L12k42K07j82K59N9j04k4%q9J1k21M6K6J19
7089e2l7K8K02k48M2K06k12l6Q5M4J94l24K18j44Q4J60j88o1J86k5j82J48n1k52
7113b15L62m90J98K89l01K02r3j80M47l63K33k8j36N1QK18m02K66k36J17L8Q7
7135G2J17k35J57j88k06K20Q2mPJ33k86K57J3j7j53M1n0k13L35j7L8k20K48O9
7159B00k06K85q5j91K18m74P9L1K47j35M4m3j16M07k99K45j38j24j07L21k71P0
$$ plain form
7181 -42 -123 -49 330 16 -87 108 100 387 166 -11 81 -66 -183 -329 18 -65 -92 30 51 130 190 98 -20 -53
7205 -53 -86 173 75 -178 -79 -78 -63 205 156 36 -146 -66 109 -30 -114 23 -240 -80 72 -103 -87 -178 143 -48
7229 -48 303 315 -8 -24 4 37 155 -131 13 -48 -180 191 -38 196 164 -89 -187 -129 57 -115 -120 -305 -395 39
7253 39 26 102 7 -23 226 27 70 154 -334 -399 -35 -205 6 -19 -275 -30 57 -25 -303 -83 -43 43 -251 -73
7277 -73 -48 75 -70 30 126 -13 244 76 -5 54 15 -190 -125 -191 -255 138 -154 131 222 -54 205 117 -191 -79
7301 -79 -165 -1 141 59 -129 120 185 -58 145 40 -34 30 111 93 -79 -51 83 -186 -182 -38 -195 173 49 21
7325 21 38 223 21 -75 -70 -48 -122 -55 -118 -219 29 -49 41 4 -88 -170 -79 -148 184 229 -224 197 120 302 -152 -100
7351 -100 235 24 -194 -111 -9 231 -265 -309 139 -139 50 -30 412 203 123 135 -93 225 -104 -283 101 -89
$$ packed form
7181d2q1P4L79l14j03J95qK87k21j77R2j47j17j46L47q3k7J22K1P9O0r2j18l3
7205e3l3K59r8k53R9JJ5K68m9j20j82Q0J75j39q4J37k63J60J52j75J6r1L21j91
7229d8L51J2l23j6K8L3J18k86J44o1j32L71k29K34l2k53r8N8J86j72nj85r0M34
7253C9j3P6r5l0K49j99M3Q4m88o5L64j70K11k5k56K45Q7q2k78K20M0Q6k94J78
7277g3K5J23j45J00R6j39K57j68q1N9l9k05O5o6o4L93k92K85R1k76K59q8l08J12
7301g9q6J64J42q2j88K49O5k43K03j05p4O4Q1j8j72K8J34k69MJ44j57L68j24k8
7325B1J7J85k02r6NK2p4O7o3j01K48p8R0l7r2q2R1o9L32M5m53M21p7J82m54N2
7351a00L35k11k18Q3J02K40m96m4M48k78J89q0M42k09q0J2k28L18l29j79L84j90
$$ plain form
7373 -89 -123 -85 -7 211 23 162 -28 138 12 -332 -13 -225 -297 -131 -208 43 83 272 -65 276 185 286 115
7396 115 -136 -270 -449 -48 -56 171 75 27 -101 -193 -231 -86 104 119 -203 -206 -374 147 -226 260 -96 -156 311
7419 311 -392 -41 -164 -50 -157 177 -56 -256 -369 83 93 79 -130 102 292 17 -47 -42 -154 -96 77 -88
7441 -88 68 126 101 153 230 122 42 -457 11 128 -90 59 -130 -91 -151 -71 -126 -241 -101 -94 -72 138 -302 -252 71
7466 71 -336 -68 109 -108 54 36 145 298 -13 -133 -44 -127 194 65 -48 3 -20 33 -40 83 59 92 183 -59
7490 -59 95 293 -62 -115 -138 71 161 158 308 -34 62 58 -167 234 -151 -161 -31 -166 -23 -95 130 -109 212 316
7514 316 53 280 -47 110 -178 -12 27 128 137 -7 99 -279 357 455 80 -53 -170 48 -266 -19 -261
7535 -261 -61 -191 91 237 2 175 45 -41 83 -28 -303 -142 33 -243 -299 63 -132 295 25 84 111
$$ packed form
7373h9l4L8P8K18j88J39j90J66j26l44L19k12p2J66p7K51M0J89l37L41r1J01j71
7396A15k51j34j79M01qK27r6m8j28r2l8J45J90J5l22lj68N21l73M86l56o0M67
7419C11p03L51j23J14j07L34k33k00j13M52J0j4k09K32J90k75o4Nj12N8J73j65
7441h8J56N8k5N2P7j08q0m99M68J17k18J49j89L9o0Q0n5j15J40PK2K10m40N0L23
7466G1m07K68J77k17J62j8J09J53l11j20Q9q3L21j29j13N1k3N3p3J23k4L3R1k42
7490e9J54J98l55n3k3K09R0lJ50l42R6mk25M01l85j0J30j35J43p2K25k39L21J04
7514C16k63K27l27J57k88J66L9J01Rj44J06l78O36R8l75j33j17K18l14K47k42
7535b61K00j30K82J46k35J73j30q6J24j11k75J61J75k76n6L62j95M27k70N9K7
$$ plain form
7556 111 187 106 -92 -109 266 104 50 -12 4 139 113 -98 48 -130 -129 70 -90 307 77 -25 70 -265 1
7579 1 119 -20 -272 164 85 -60 -81 1 -262 -131 -116 113 149 138 -41 -111 -22 125 -271 17 133 -489 23
7602 23 -15 269 -59 -117 204 288 -57 147 215 51 -4 85 90 -337 -90 225 34 -7 51 -86 42 -209 -42 -254
7626 -254 45 153 40 -10 -110 257 341 114 -73 52 -5 -124 9 -59 -146 -208 -136 286 100 109 162 -208 -162 213
7650 213 117 165 173 -80 -214 -114 -26 53 -180 -83 -149 -32 280 -54 -21 -225 -15 -344 -109 28 -113 -117 244 -120
7674 -120 35 165 228 -13 -6 -34 34 22 -120 44 -62 323 -40 -71 -2 45 -188 -84 28 166 -173 44 31
7697 31 37 154 -297 173 25 80 15 191 -127 91 182 -373 -29 45 -69 -7 152 269 -29 160 -72 -19 28
7720 28 0 141 -82 12 157 89 -234 227 -66 -154 -145 210 206 111 -348 -46 -161 133 22 255 60 41 125 -74
$$ packed form
7556A11P6q1j98j7L75j62n4o2J6J35k6k11J46j78JJ99j60L97k30j02R5l35K66
7579AJ18j39k52M36p9j45k1Q2k63J31J5K29L6j1j79p0Q9J47l96K88J16o22N12
7602B3l8K84l28n8L21Q4l45K04O8j64n5Q9Nm27K47L15j91m1N8j37J28k51J67k12
7626b54K99J08j13n0j00L67Q4k27j87J25n7j19J33o8q7o2P2M22j86RN3l70M6L75
7650B13r6M8Qk53j34J00Q8P9k33R7o6J17L12l34L3k04K10l29K35J37j41mL61l64
7674a20J55J30O3k41Pk8O8j2j42J64j06L85l63l1O9M7k33J04J12J38l39K17j3
7697C1OJ17m51M70j48N5o5J76l18K18R1n55L44P4j14O2J59J17k98J89k32N3M7
7720B8k8J41k23R4J45o8l23M61k93q8RL55mr5m59L02j15K94j11K33j95j9Q4j99
$$ plain form
7744 -74 0 -278 -54 -135 -110 36 -340 64 65 -241 -127 172 0 106 -51 -201 62 122 -203 -81 -56 -71 -87
7767 -87 -106 64 232 -97 128 18 -136 62 -388 31 -3 28 17 55 -42 61 -344 48 -36 163 94 -336 -33
7790 -33 -71 54 -110 43 18 106 -22 -43 97 159 -184 -79 -10 -35 -1 86 -75 17 76 54 266 7 12 42 54 -1
7816 -1 -221 -341 -7 101 173 -133 194 126 -250 -128 188 -33 -54 4 207 -269 -134 204 20 156 -47 -55 -26
7839 -26 36 -197 -120 266 301 90 147 205 108 78 371 124 -96 228 -141 -118 -37 177 30 -67 123 -423 3 170
7863 170 -57 188 257 -41 93 71 -22 188 -144 -158 63 3 -176 252 -18 -21 192 -110 -54 -11 -99 -51 56 132
7887 132 49 8 -63 35 224 113 -284 67 -188 -47 -140 -30 -288 -17 173 163 40 -139 290 107 220 106
7909 106 222 -48 -256 -144 40 -51 143 155 272 9 320 240 0 1 -102 -148 -69 -3 136 -187 21 56 161
$$ packed form
7744g4P4k78K24q1K5J46l76M04Jl06J14K99j72J06j57j50K63O0l25J22K5j5j6
7767h7j9J70J68l29K25j10j54J98m50M19l4L1j1L8r7J03m05L92q4J99o9m30L03
7790c3l8J25j64J53k5Q8j28k1J40O2l43J05O9k5L4Q7j61R2N9k2K12k59NL0J2n5
7816ak20j20L34J08P2l06L27o8l76J22L16k21k1N8K03m76J35L38j84J36k03qK9
7839b6O2k33P7L86L5k11N7N8r7l0K93k47k20L24l69K3Q1K14j47r7J90n46M26J67
7863A70k27K45O9k98J34k2r3K10l32j4K21o0j79M28k70lK13l02N6M3q8M8J07P6
7887A32q3m1p1R8J89j11l97L51k55J41r3J10k58K71J90j0j23j79M29j83J13j14
7909A06J16k70k08J12J84r1J94J2J17k63L11q0k40Jj03m6P9O6J39l23K08L5J05
$$ plain form
7932 161 126 45 -225 -80 -32 89 46 -162 -78 89 -305 -123 -222 -159 -12 197 -394 -114 -286 -220 26 -209 -20
7955 -20 -77 -34 -65 40 34 -70 -97 -257 32 -62 1 218 -136 21 -99 138 13 -24 -202 88 3 -151 28 42
7979 42 -318 -94 81 41 140 -24 14 -241 -85 -6 -17 -75 -290 -51 -136 -43 -48 -389 -13 -256 100 26 -230 -117
8003 -117 262 275 47 123 -17 -198 109 138 83 -51 -243 101 15 5 19 -10 -20 79 -32 20 167 -199 203 -36
8027 -36 -23 312 -58 -158 -212 26 -67 120 -16 -436 96 -18 -81 311 8 -145 -299 -58 -115 -26 -65 70 -129
8050 -129 -49 -114 -119 -283 63 71 213 123 110 156 21 242 -160 48 -28 65 -98 11 -34 -24 2 0 128 1 69 202
8076 202 -312 -80 151 48 67 213 24 17 -380 -79 -134 -109 392 135 106 -4 -123 -114 216 194 -179 5 30
8099 30 101 263 -14 -47 190 272 33 122 -95 -25 141 -97 -282 64 -152 -123 14 -63 113 107 21 11 130 -63
$$ packed form
7932A61l5q1k70J45M8J21m3k08Q4J67l94J82r9O3J47K09n91K80j72O6K46k35J89
7955b0n7M3l1J05oj04k7j60K89r4O3K17l54J57j20K37j25l7j78K90q5j54J79J4
7979D2l60K24J75m0R9j64L8k55J56P9j1n8k15K39q5R3nl41L76k43L56p4k56J13
8003a17L79J3k28P6j40j81L07K9n5j34j92L44q6j0J4k9j0R9j11N2J47l66M02k39
8027c6J3L35l70j00n4K38r3J87j36m20N32j14o3L92l03j53j54K41n7Q9l9J35j99
8050a29Q0o5nj64L46QJ42r0j3M6j35K21m02K08p6R3j63J09m5J0K6kJ28j27O8J33
8076B02n14K32K31j03J9J46j89pl97L01n5K5N01k57k9j10j19RL30k2l73J84K5
8099C0P1J62k77l3K37Q2k39Q9k17P0J66k38j85L46k16K9J37p7J76oq6j0J19j93
$$ plain form
8123 -63 137 120 -20 38 12 -65 164 169 92 179 300 104 -198 168 -119 208 77 -194 -130 -223 25 -9 164 -52
8147 -52 435 175 -37 52 108 -36 -133 -73 -206 -193 -147 71 -175 33 225 232 -5 -85 -121 9 -110 114 -278 -248
8171 -248 -136 61 167 88 75 -278 157 192 -16 8 -106 -163 23 196 57 -54 266 219 244 235
$$ packed form
8123f3K00j7j40N8k6p7K29Np7Q7J21j96l02L66k87L27j31k71O4r3K48l4J73k16
8147e2M87k60k12Q9N6j44r7O0j33J3M6K18k46K08J92Pk37q0l6J30j19K24l92L0
8171b48J12J97J06p9j3l53M35L5k08K4j14n7J86J73j39j11L20m7K5r
8191B35
$$ Imaginary data points
##PAGE= N=2
##DATA TABLE= (X++(I..I)), XYDATA
$$ plain form
0 0 0 0 0 0 0 0 8 -8 8 -8 8 -16 16 -24 32 -40 49 -64 80 -96 112 -136 160 -191 222 -258 297 -347 401 -458
30 -458 526 -600 681 -770 871 -980 1100 -1235 1379 -1539 1712 -1902 2110 -2337 2585 -2856
46 -2856 3152 -3475 3830 -4218 4647 -5120 5644 -6231 6882 -7620 8460 -9424 10546 -11867
60 -11867 13453 -15402 17858 -21066 25455 -31852 42095 -61173 108983 -488220 -672989
71 -672989 170956 -40675 -98654 254013 667210 503589 310296 222580 144993 -74685 -172134
82 -172134 -260206 -352948 -367772 -153194 34958 108322 183225 382824 434313 211708 -79374
93 -79374 -151752 -133505 -201460 -308721 -284484 -172495 -33715 112129 206515 178819 162097
104 162097 242924 251298 44109 -173474 -215568 -191246 -226459 -218446 -106662 18991 113853
$$ packed form
0@%%%%%%Qj6J6j6J6k4L2m0N6p2Q9j13J44j76K08k48K96l51M13m80N55o44P48q59
30d58R84j126J281j451J641j851K080k335K614k918L251l614M012m447M922n441
46b856O008o627P305q048Q865r767J0764j1875J3113j4502J6080j7884J9970k2413
60a1867K5320k8855L3260l8924M6521n7307P3947j03268J70156n97203j84769
71f72989Q43945k11631n7979L52667M13197j63621j93293q7716p7587k19678r7449
82a72134q8072r2742j4824K14578J88152P3364P4903J99599N1489k22605k91082
93g9374p2378J8247o7955j07261K4237J11989J38780J45844R4386k7696j6722
104A62097Q0827Q374k07189k17583m2094K4322l5213Q013J11784J25653R4862
$$ plain form
115 113853 202058 235435 200980 180052 155787 8590 -184652 -212557 -115756 -130091 -225354
126 -225354 -145304 88171 184786 103884 89129 178803 154368 -7873 -107582 -107436 -144628 -203590
138 -203590 -158208 -42822 30658 85104 165618 199729 151418 101666 75068 765 -107307
149 -107307 -149949 -128674 -125066 -124925 -59124 40473 91571 107788 137113 141553 74378 -14242 -60077
162 -60077 -89896 -132838 -141162 -88955 -37360 -12210 38114 115005 142741 109000 76624 55102
174 55102 6139 -58028 -97868 -115180 -111219 -69217 -10726 23823 57283 113333 133861 81539
186 81539 25480 15793 -12988 -99785 -155088 -115300 -54422 -42332 -28460 38680 107707 121092
198 121092 101118 82393 47935 -8024 -54945 -83517 -106716 -106757 -63651 -9581 22947 56396
$$ packed form
115A13853Q8205L3377l4455k0928k4265j47197j93242k7905R6801j4335r5263
126b25354Q0050K33475R6615q0902j4755Q9674k4435j62241r9709J46l7192n8962
138b03590M5382J15386P3480N4446Q0514L4111m8311m9752k6598p4303j08072
149a07307m2642K1275L608J41O5801R9597N1098J6217K9325M440o7175q8620m5835
162f0077k9819m2942q324N2207N1595K5150N0324P6891K7736l3741l2376k1522
174E5102m8963o4167l9840j7312L961M2002N8491L4549L3460N6050K0528n2322
186H1539n6059r687k8781q6797n5303L9788O0878J2090J3872O7140O9027J3385
198A21092j9974j8725l4458n5959m6921k8572k3199m1M3106N4070L2528L3449
$$ plain form
210 56396 101594 112005 70570 28794 10803 -20570 -72588 -99659 -90560 -73167 -46001 6738
222 6738 55991 71476 75747 89050 76013 18352 -40327 -62902 -69262 -80980 -75381 -40355 671
235 671 33124 63037 84956 87076 71702 44132 -2957 -55951 -81990 -80033 -80893 -78901 -38861
248 -38861 26813 66039 69630 74659 81602 60376 15433 -21114 -47496 -75565 -90555 -74543 -41854
261 -41854 -9724 27220 66131 85006 77875 60536 35239 -5180 -47960 -70117 -72706 -68884 -54195
274 -54195 -20690 16629 45369 69425 85609 74793 39450 4264 -23078 -55131 -83693 -83721 -57445
287 -57445 -28769 -1893 32878 66310 78345 70347 53484 27356 -7606 -40597 -63620 -77541
299 -77541 -74772 -48438 -10355 20516 45735 69454 78632 62288 32725 5642 -23540 -56162
$$ packed form
210E6396M5198J0411m1435m1776j7991l1373n2018k7071R099J7393K7166N2739
222F738M9253J5485M271J3303j3037n7661n8679k2575o360j1718N599L5026M1026
235F71L2453K9913K1919K120j5374k7570m7089n2994k6039J957q60J992M0040
248c8861O5674L9226L591N029O943k1226m4943l6547k6382k8069j4990J6012L2689
261d1854L2130L6944L8911J8875p131j7339k5297m0419m2780k2157k589L822J4689
274e4195L3505L7319K8740K4056J6184j0816l5343l5186k7342l2053k8562k8K6276
287e7445K8676K6876L4771L3432J2035p998j6863k6128l4962l2991k3023j3921
299g7541K769K6334L8083L0871K5219K3719R178j6344k9563k7083k9182l2622
$$ plain form
311 -56162 -76426 -72037 -53222 -30234 -879 34822 62494 74002 72410 55937 21805 -17313
323 -17313 -44027 -59046 -68979 -67582 -48131 -17500 14764 45050 66829 70669 57129 36243 11080
336 11080 -20164 -49189 -63810 -62948 -51104 -27031 5413 32903 47035 53768 57095 47302 20209
349 20209 -13728 -40742 -57209 -62208 -54355 -34845 -9487 18934 47069 65330 66675 52764 29794
362 29794 1887 -25641 -46144 -58695 -64980 -59932 -35637 865 32552 50754 59772 60679 49416
375 49416 25723 -3640 -31536 -52540 -60850 -54422 -37077 -14489 10118 33438 49739 56875 53291
388 53291 35459 6233 -24029 -43715 -51696 -52031 -44904 -26568 498 28794 49763 57227 51114
401 51114 37171 18009 -5094 -31643 -53492 -61402 -54494 -38174 -14750 12808 38048 52815
$$ packed form
311e6162k0264M389J8815K2988K9355L5701K7672J1508j592j6473l4132l9118
323a7313k6714j5019r933J397J9451L0631L2264L0286K1779L840j3540k0886k5163
336A1080l1244k9025j4621Q62J1844K4073L2444K7490J4132O733L327r793k7093
349B0209l3937k7014j6467m999P853J9510K5358K8421K8135J8261J345j3911k2970
362B9794k7907k7528k0503j2551o285N048K4295L6502L1687J8202R018R07j1263
375D9416k3693k9363k7896k1004q310O428J7345K2588K4607K3320J6301P136l584
388E3291j7832k9226l0262j9686p981l35P127J8336K7066K8296K0969P464o113
401E1114j3943j9162k3103k6549k1849p910O908J6320K3424K7558K5240J4767
$$ plain form
413 52815 56069 50097 35989 13679 -12601 -36976 -52577 -53791 -42432 -24808 -5273 16817 40507
426 40507 55238 52308 35371 13579 -7291 -28618 -47913 -55781 -50304 -35158 -13951 11574 36440
439 36440 53332 57940 50617 33790 9667 -17757 -40578 -53544 -55094 -45976 -25758 1646 27175
452 27175 44013 51701 51723 42396 20988 -7585 -32968 -49077 -56012 -52599 -38247 -15946 9324
465 9324 34221 51369 54358 44656 28471 9440 -13996 -37345 -49219 -45528 -33654 -20821 -2202
478 -2202 22839 43645 50221 43416 31492 14974 -5968 -27913 -44953 -53191 -48246 -29131 -5324
491 -5324 13963 28902 43882 53517 44126 19012 -3600 -17638 -32506 -50425 -56147 -40551 -15491
504 -15491 4791 20911 40914 58797 60860 44426 19160 -4822 -24008 -39708 -50173 -52328
$$ packed form
413E2815L254n972j4108k2310k6280k4375j5601j214J1359J7624J9535K2090K3690
426D0507J4731k930j6937k1792k0870k1327j9295p868N477J5146K1207K5525K4866
439C6440J6892M608p323j6827k4123k7424k2821j2966j550R118K0218K7404K5529
452B7175J6838P688K2r327k1408k8573k5383j6109o935L413J4352K2301K5270
465I324K4897J7148K989r702j6185j9031k3436k3349j1874L691J1874J2833J8619
478b202K5041K0806O576o805j1924j6518k0942k1945j7040q238M945J9115K3807
491e324J9287J4939J4980R635r391k5114k2612j4038j4868j7919n722J5596K5060
504a5491K0282J6120K0003J7883K063j6434k5266k3982j9186j5700j0465k155
$$ plain form
516 -52328 -40332 -16414 7781 22365 28918 35443 38925 28099 3651 -18155 -28010 -31853 -36514
529 -36514 -34040 -15235 12052 31007 38370 41348 40677 31015 11130 -11248 -31010 -42458 -43687
542 -43687 -36862 -27757 -15641 6037 30605 42882 38963 31533 26857 12960 -12930 -34742 -39086
555 -39086 -34273 -31722 -25081 -6726 16186 30478 35460 35700 30339 17675 1866 -13681 -26458
568 -26458 -33870 -31378 -19996 -8025 4071 18319 31251 35220 28956 17538 3880 -12760 -29805
581 -29805 -40248 -40124 -32019 -19048 -3065 15120 30181 37327 37007 30727 19839 4674 -10749
594 -10749 -22507 -29626 -32386 -28823 -16171 1917 16737 25824 29866 28427 17542 3356 -9599
607 -9599 -20515 -28906 -30479 -22654 -11965 -4134 5813 20275 31508 31287 23413 14974 4044 -12658
$$ packed form
516e2328J1996K3918K4195J4584O553O525L482j0826k4448k1806r855l843m661
529c6514K474J8805K7287J8955P363K978o71r662j9885k2378j9762j1448j229
542d3687O825R105J2116K1678K4568J2277l919p430m676j3897k5890k1812m344
555c9086M813K551O641J8355K2912J4292M982K40n361j2664j5809j5547j2777
568b6458p412K492J1382J1971J2096J4248J2932L969o264j1418j3658j6640j7045
581b9805j0443J24Q105J2971J5983J8185J5061P146l20o280j0888j5165j5423
594a0749j1758p119k760L563J2652J8088J4820R087M042j439j0885j4186j2955
607i599j0916q391j573P825J0689P831R947J4462J1233k21p874q439j0930j6702
$$ plain form
621 -12658 -27698 -33231 -28817 -20328 -10135 3740 17752 27866 31800 28922 20677 9879 -1256
634 -1256 -14017 -27515 -35462 -31834 -21072 -9411 1890 14713 26778 30738 25169 14346 2674
647 2674 -7375 -16758 -23517 -24975 -19547 -9097 2549 13017 21759 27796 26593 18334 5831 -6647
661 -6647 -17262 -24680 -28267 -26494 -17918 -3827 9922 18738 23421 25872 24561 14556 -759 -13503
675 -13503 -20121 -23610 -24768 -20751 -9915 2966 14200 21858 26192 25035 17896 7227 -4974 -16116
689 -16116 -23184 -24971 -22555 -15452 -3677 9421 18144 21689 22472 19641 12431 514 -11714 -20178
703 -20178 -24314 -23169 -17061 -8080 2395 13221 22482 25642 22252 14954 5211 -5236 -15464 -21592
717 -21592 -23086 -20192 -13416 -3084 8889 18390 22884 22119 16773 8877 -213 -10652 -19551 -24096
$$ packed form
621a2658j5040n533M414Q489J0193J3875J4012J0114L934k878q245j0798j1135
634a256j2761j3498p947L628J0762J1661J1301J2823J2065L960n569j0823j1672
647B674j0049r383o759j458N428J0450J1646J0468Q742O037j203q259j2503j2478
661f647j0615p418l587J773Q576J4091J3749Q816M683K451j311j0005j5315j2744
675a3503o618l489j158M017J0836J2881J1234P658M334j157p139j0669j2201j1142
689a6116p068j787K416P103J1775J3098Q723L545P83k831p210j1917j2228q464
703b0178m136J145O108Q981J0475J0826R261L160l390p298r743j0447j0228o128
717b1592j494K894O776J0332J1973R501M494p65n346p896r090j0439q899m545
$$ plain form
731 -24096 -21545 -14703 -6096 3332 13073 20988 23983 21326 13836 3681 -7651 -16830 -21643 -21942 -18348
746 -18348 -11627 -2078 8364 17566 22639 22552 17325 8831 -476 -10150 -19259 -23455 -21896 -15360 -5701
761 -5701 4321 13125 18397 20099 18840 13884 5218 -5709 -13930 -19419 -20989 -18181 -11145 -1335 8829
776 8829 16628 20905 20506 15230 6736 -2440 -10854 -16855 -19583 -19284 -14616 -6515 3847 13195 19241
791 19241 21575 19855 13490 3580 -7342 -15577 -20467 -21258 -17785 -10389 -1656 7588 15221 20140 20559
806 20559 17008 10011 970 -8903 -16849 -20931 -20965 -16225 -7656 2228 11646 18040 20510 19200 13599
821 13599 5282 -3925 -12144 -18201 -19624 -17136 -11353 -3830 5661 14285 19450 19955 15768 8868 -31
836 -31 -9025 -16202 -20428 -20283 -14758 -6035 3422 11545 17220 20177 18640 13503 5741 -3263 -12635 -19280
$$ packed form
731b4096K551O842Q607R428R741P915K995k657p490j0155j1332r179m813k99L594
746a8348O721R549J0442R202N073q7n227q494r307r674r109m196J559O536R659
761e701J0022Q804N272J702j259m956q666j0927q221n489j570K808P036R810J0164
776H829P799M277l99n276q494r176q414o001k728K99M668Q101J0362R348O046
791A9241K334j720o365r910j0922q235m890p91L473P396Q733R244P633M919M19
806B0559l551o997r041r873p946m082l4M740Q569R884R418O394K470j310n601
821A3599q317r207q219o057j423K488N783P523R491Q624N165N05m187o900q899
836c1q994p177m226J45N525Q723R457Q123N675K957j537n137p762r004r372o645
$$ plain form
852 -19280 -20356 -16812 -11598 -4382 4447 13234 19457 20167 16213 9119 -169 -7552 -13589 -17583 -18464
867 -18464 -14430 -6787 1915 9935 15658 18240 16708 12094 5158 -3478 -11810 -18085 -19816 -16917 -10742
882 -10742 -2400 5876 12964 17741 19765 17077 9471 -360 -8257 -13759 -17403 -17926 -14986 -8387 494
897 494 9000 15700 17856 16429 12233 5934 -2145 -10431 -16011 -17573 -15687 -10149 -2217 5483 11539
912 11539 14785 16104 13688 7836 298 -7191 -12945 -15981 -15291 -11508 -6011 616 8387 14790 17912
927 17912 15963 10755 4062 -2901 -8994 -14020 -16731 -15585 -10468 -2984 3750 9313 13349 15461 13575
942 13575 9014 2198 -4992 -11221 -14789 -14816 -12092 -6836 458 7369 11972 14496 14758 11887 5104 -2777
958 -2777 -7966 -11292 -14044 -14557 -10907 -3724 3326 8942 12964 13853 11678 7766 2341 -4751 -11222 -14167
$$ packed form
852a9280j076L544N214P216Q829Q787O223P10l954p094r288p383o037l994q81
867a8464M034P643Q702Q020N723K582j532m614o936q636q332o275j731K899O175
882a0742Q342Q276P088M777K024k688p606r831p897n502l644n23K940O599Q881
897D94Q506O700K156j427m196o299q079q286n580j562J886N538P932P700O056
912A1539L246J319k416n852p538p489n754l036O90L783N497O627P771O403L122
927A7912j949n208o693o963o093n026k711J146N117P484O734N563M036K112j886
942A3575m561o816p190o229l568k7K724N256P294O911M603K524K62k871o783p881
958b777n189l326k752n13L650P183P050N616M022Q89k175l912n425p092o471k945
$$ plain form
974 -14167 -12856 -10540 -6917 -268 7247 12349 13535 13289 11386 6406 -826 -7652 -12160 -13664 -12612
989 -12612 -9960 -4918 1344 7798 12407 13277 11393 8024 3248 -2680 -8846 -12999 -13796 -11374 -6438
1004 -6438 -1515 3778 9412 13344 13560 10057 5744 665 -4927 -10732 -13062 -11705 -8991 -4729 1148
1019 1148 7712 12211 13502 12250 8531 2275 -4696 -8761 -12336 -14882 -13669 -8195 -1291 4034 8394
1034 8394 12846 14648 12100 7118 1788 -4200 -9702 -13072 -12035 -8873 -4982 421 6752 10790 12066
1049 12066 10965 7784 2430 -3430 -8109 -11401 -13238 -11585 -7355 -1378 4718 9806 12560 12719 10394
1064 10394 6282 555 -5251 -10332 -12677 -12335 -9256 -4766 759 5894 10316 13216 13503 9132 3497
1079 3497 -1772 -6610 -11194 -13236 -11723 -7783 -3509 2331 7903 10939 11516 9690 6730 1023 -4861
$$ packed form
974a4167J311K316L623O649P515N102J186k46j903m980p232o826m508j504J052
989a2612K652N042O262O454M609Q70j884l369m776n928o166m153p97K422M936
1004f438M923N293N634L932K16l503m313n079n592n805k330J357K714M262N877
1019A148O564M499J291j252l719o256o971m065l575k546J213N474O904N325M360
1034H394M452J802k548m982n330n988n502l370J037L162L891N403O331M038J276
1049A2066j101l181n354n860m679l292j837J653M230N977O096N088K754J59k325
1064A0394m112n727n806n081k345L42L079M490N525N135M422K900K87m371n635
1079C497n269m838m584k042J513L940M274N840N572L036N77j826k960n707n884
$$ plain form
1094 -4861 -8683 -10639 -11492 -9626 -4002 2266 6656 9619 12036 11815 8347 3028 -2501 -7014 -10975
1109 -10975 -12448 -11074 -7906 -3267 2988 8634 10863 11385 9802 6659 1351 -4489 -8006 -10147 -11035
1124 -11035 -9280 -4901 44 4971 8996 11183 10844 7996 4026 -840 -6356 -10051 -10709 -9131 -7110
1139 -7110 -2823 2694 6863 9456 10260 9057 5797 1351 -3437 -7466 -10663 -11160 -8558 -4151 21
1154 21 4321 9049 10766 10014 7551 4236 -746 -5825 -8700 -9842 -9176 -7224 -2883 2060 6333 8599
1170 8599 9940 8345 4845 777 -3019 -7023 -9840 -9962 -7300 -3700 290 4532 8251 9837 8945
1185 8945 7054 3387 -1059 -5775 -8553 -9282 -8847 -6224 -2132 2282 5970 9189 10047 8451 4838 1018
1201 1018 -2691 -6499 -8849 -9067 -7549 -4617 -396 4041 7298 8653 8866 7250 3812 -1402 -5153
$$ packed form
1094d861l822j956q53J866N624O268M390K963K417k21l468n319n529m513l961
1109a0975j473J374L168M639O255N646K229N22j583l143n308n840l517k141q88
1124a1035J755M379M945M927M025K187l39k848l970m866n516l695o58J578K021
1139g110M287N517M169K593Q04j203l260m446m788m029l197m97K602M407M172
1154B1M300M728J717p52k463l315m982n079k875j142O66J952M341M943M273K266
1170H599J341j595l500m068l796m004k817j22K662L600L990M242L719J586q92
1185H945j891l667m446m716k778p29M35K623M092M414L688L219Q58j596l613l820
1201A018l709l808k350k18J518K932M221M437L257J355K13j616l438n214l751
$$ plain form
1216 -5153 -7696 -9341 -8356 -5715 -1670 2228 5291 8175 9624 7986 4939 981 -2990 -6606 -8886
1231 -8886 -9009 -7775 -4741 -194 4316 7702 8708 8733 6994 3287 -975 -4595 -7516 -9398 -8467 -5800
1247 -5800 -2295 1477 5417 8379 9311 7838 4994 1423 -3017 -6963 -8648 -8645 -7323 -4097 240 4145
1263 4145 6918 8914 8860 6801 3158 -626 -4662 -7938 -9794 -8699 -5954 -2435 1736 5807 8647
1278 8647 8804 7822 5207 1190 -3298 -6337 -8381 -8977 -7466 -4293 86 3880 6846 9046 8906 6519
1294 6519 3098 -865 -4624 -7763 -9076 -8269 -6212 -2964 1831 5880 8274 9042 8368 5557 1118 -3350
1310 -3350 -6465 -8524 -8952 -7624 -4230 -424 3356 6856 9059 8973 7210 3631 -113 -4475 -7999 -9381
1326 -9381 -8829 -6496 -2747 2083 5451 7917 8984 8392 5910 1696 -2128 -5507 -8387 -9273 -8160 -5031
$$ packed form
1216e153k543j645R85K641M045L898L063K884J449j638l047l958l971l616k280
1231h886j23J234L034M547M510L386J006K5j739l707m262l620k921j882R31K667
1247e800L505L772L940K962R32j473k844l571m440l946j685LJ322L226M337L905
1263D145K773J996n4k059l643l784m036l276j856J095K745L519M171M071K840
1278H647J57r82k615m017m488l039k044n96J511L173M379L794K966K200j40k387
1294F519l421l963l759l139j313Q07K057L248M795M049K394P68o74k811m439m468
1310c350l115k059m28J328L394L806L780L500K203q6j763l579l744m362l524j382
1326i381N52K333L749M830L368K466J067n92k482m214l824l379k880q86J113L129
$$ plain form
1342 -5031 -1379 2920 6614 9194 9060 7103 4067 363 -4163 -7130 -8406 -8118 -6772 -3117 960
1357 960 4564 7412 8750 8541 6049 2560 -1475 -5517 -8278 -9534 -7961 -5628 -1717 2365 6145
1372 6145 8104 8690 7569 4738 805 -3092 -6226 -8442 -8794 -7316 -4149 -17 3964 6952 8915
1387 8915 8566 6371 3148 -460 -4607 -7612 -8786 -7687 -5778 -2315 1923 5549 7641 8241 7936 5101
1403 5101 1417 -2620 -5939 -7947 -8502 -7361 -4336 -352 3476 6714 8211 8364 6208 3357 -712
1418 -712 -4083 -7064 -8493 -7663 -6068 -2538 1301 4878 7238 8080 7261 5079 2018 -1795 -5232 -7430
1434 -7430 -8139 -7083 -4400 -917 2835 5749 7692 7912 6560 3586 265 -3289 -6156 -7578 -7275 -5689
1450 -5689 -2718 1193 3879 6546 8062 7365 4815 1996 -1197 -4504 -6836 -7919 -6741 -4345 -1041
$$ packed form
1342e031L652M299L694K580j34j957l036l704m526k967j276K88J346L655M077
1357I60L604K848J338k09k492l489m035m042k761j256J573K333L911M082L780
1372F145J959N86j121k831l933l897l134k216l52J478L167M132L981K988J963
1387H915l49k195l223l608m147l005j174J099J909L463M238L626K092O00l05k835
1403E101l684m037l319k008n55J141L025L984L828L238J497J53k156k851m069
1418g12l371k981j429Q30J595L530L839L577K360Q42q19k182l061l813l437k198
1434g430p09J056K683L483L752K914J943K20j352k974l321l554k867j422L03J586
1450e689K971L911K686K667J516o97k550k819l193l307k332j083J178K396L304
$$ plain form
1465 -1041 2325 5325 7060 7501 6233 3623 595 -3072 -5650 -7179 -7046 -5477 -2901 582 3262
1480 3262 6022 7017 6939 4678 1747 -1244 -3976 -5889 -6740 -6152 -4046 -1324 2046 4869 5977 6736
1496 6736 5331 3442 969 -2210 -5091 -6906 -6601 -4880 -2641 387 3020 5701 6403 5929 4509 2056
1512 2056 -1095 -3971 -5615 -6143 -5785 -3831 -1191 1959 4401 5938 6610 5070 2875 186 -2204 -4497
1528 -4497 -6305 -6099 -4801 -2410 396 2979 4924 6152 5873 4298 1799 -1368 -3870 -5591 -5898 -5198
1544 -5198 -3302 -995 1750 4101 5461 5938 4927 2601 -13 -2416 -4572 -5514 -5718 -4706 -2553 703
1560 703 3352 4706 5840 5348 3998 1612 -877 -3733 -5294 -5731 -4884 -3107 -989 1504 3794 5266
1576 5266 5752 4527 2640 -54 -2807 -4237 -5324 -5361 -4200 -2240 521 3275 5247 5644 5229 3746
$$ packed form
1465a041L366L000J735M41j268k610l028l667k578j529J33J569K576L483K680
1480C262K760R95p8k261k931k991k732j913q51N88K106K722L370K823J108P59
1496F736j405j889k473l179k881j815L05J721K239L028K633K681P02m74j420k453
1512B056l151k876j644n28L58J954K640L150K442J537O72j540k195k689k390k293
1528d497j808K06J298K391K806K583J945J228k79j575k499l167k502j721l07P00
1544e198J896K307K745K351J360M77j011k326k614k403k156r42k04J012K153L256
1560G03K649J354J134m92j350k386k489k856j561m37Q47J777K118K493K290J472
1576E266M86j225j887k694k753j430j087l7J161J960K761K754J972L97m15j483
$$ plain form
1592 3746 1496 -1396 -3604 -5369 -5559 -5076 -3168 -740 1569 3787 5203 5506 4488 2775 261 -2354
1608 -2354 -4343 -5448 -5382 -4273 -2220 487 2997 4751 5378 4991 3799 1272 -757 -3162 -4499 -5495
1624 -5495 -4582 -3122 -877 1527 4034 5326 5587 4684 2599 73 -2474 -4257 -5385 -4895 -4039 -2048
1640 -2048 464 2782 4681 5691 5217 3515 1440 -1380 -3359 -4838 -5465 -4658 -3162 -751 1549 3870
1656 3870 4943 5332 4650 2731 388 -2334 -3841 -5207 -5167 -4132 -2476 481 2804 4313 5180 4929
1672 4929 3572 1561 -863 -2993 -4768 -5443 -4741 -3173 -855 1273 3634 4658 5221 4311 2704 483
1688 483 -1755 -4130 -5226 -5000 -4071 -2225 -94 2298 4476 5249 5070 3603 1832 -704 -2893 -4458
1704 -4458 -5135 -4913 -3343 -1078 1258 3183 4426 5111 4568 2774 724 -1653 -3475 -4994 -5023 -3854
$$ packed form
1592C746k250k892k208j765j90M83J908K428K309K218J416L03j018j713k514k615
1608b354j989j105O6J109K053K707K510J754O27l87j192k527k029k405j337r96
1624e495R13J460K245K404K507J292K61r03k085k526k547j783j128M90Q56J991
1640b048K512K318J899J010m74j702k075k820j979j479o27Q07J496K411K300K321
1656C870J073L89o82j919k343k722j507j366M0J035J656K957K323J509Q67k51
1672D929j357k011k424k130j775o75P02J568K318K128K361J024N63r10j607k221
1688D83k238k375j096K26R29J846K131K392K178P73j79j467j771k536k189j565
1704d458o77K22J570K265K336J925J243O85n43j794k050k377j822j519k9J169
$$ plain form
1720 -3854 -2342 -270 2072 4186 5021 4883 3899 1959 -618 -2693 -4394 -5163 -4672 -3583 -1327 1098
1736 1098 3268 4352 4713 4351 2877 685 -1584 -3515 -4856 -5017 -4226 -2384 -675 1672 3790 4806
1752 4806 4898 3816 1905 -169 -2263 -3950 -4608 -4620 -3307 -1600 729 2791 4120 4990 4066 3051 749
1769 749 -1384 -3441 -4593 -4914 -4116 -2329 -212 1838 3735 4766 4749 4247 2266 308 -2248 -3970
1785 -3970 -4895 -4060 -3158 -1545 518 2211 3861 4606 4180 2636 714 -1093 -2878 -4413 -4789 -4259 -2708
1802 -2708 -702 1638 3629 4610 4485 3753 2146 -6 -1947 -3461 -4550 -4320 -3333 -1879 273 2286
1818 2286 3821 4564 4321 3030 1061 -1020 -2635 -4001 -4458 -3823 -2562 -708 1641 3031 4270 4415
1834 4415 3620 2254 273 -1806 -3483 -4631 -4489 -3421 -2125 721 2130 3980 4356 4217 3048 1523
$$ packed form
1720c854J512K072K342K114Q35j38r84j940k577k075j701p69M91J089K256K425
1736A098K170J084L61l62j474k192k269j931j341j61P91J842J709K347K118J016
1752D806R2j082j911k074k094j687o58j2J313J707K329K062J329Q70r24j015k302
1769G49k133k057j152l21P98J787K117K050J897J031j7n02j981j958k556j722
1785c970r25Q35R02J613K063J693J650P45m26j544j922j807j785j535l76N30J551
1802b708K006K340J991R81j25p32j607k152j941j514j089K30R87J454K152K013
1818B286J535P43k43j291j969k081j615j366m57O35J261J854K349J390J239J45
1834D415p95j366j981k079j677j148J42J068J296K846J409J850L76j39j169j525
$$ plain form
1850 1523 -537 -2227 -3754 -4349 -3920 -3006 -885 963 3192 3907 4119 3508 1914 137 -1657 -3167
1866 -3167 -4320 -4016 -3340 -2042 13 1871 3189 4362 4456 2977 1320 -644 -2404 -3659 -4382 -3903
1882 -3903 -2831 -1018 805 2688 3850 3994 3131 2228 849 -1044 -2670 -3939 -3971 -3351 -1774 52
1898 52 1814 3113 4175 4057 3056 1372 -618 -2084 -3717 -3861 -3566 -2915 -1434 789 2616 3564 3918
1915 3918 3645 2308 728 -1086 -2492 -3559 -3683 -3118 -1865 -116 1547 2775 3661 3741 2829 1767 -110
1932 -110 -2194 -3161 -3729 -3542 -2764 -1432 776 2151 3579 3628 3587 2209 514 -1113 -2194 -3339 -3596
1949 -3596 -2805 -1815 -223 1291 2975 3338 3286 2574 1602 -345 -1663 -3114 -3247 -3257 -2355 -788 480 1980
1967 1980 2953 3275 3169 2216 670 -744 -2493 -3236 -3364 -2728 -1654 -11 1718 2503 3333 3325 2677 1274
$$ packed form
1850A523k060j690j527n95M29R14K121J848K229P15K12o11j594j777j794j510
1866c167j153L04O76J298K055J858J318J173R4j479j657j964j760j255p23M79
1882c903J072J813J823J883J162J44q63r03j379j893j626j269l2O20J577J826
1898E2J762J299J062j18j001j684j990j466j633j44K95O51J481K223J827R48L54
1915C918k73j337j580j814j406j067j24N65J253J749J663J228Q86Q0r12j062j877
1932a10k084r67n68J87P78J332K208J375J428M9m1j378j695j627j081j145k57
1949c596P91R90J592J514J684L63n2p12r72j947j318j451j33j0R02J567J268J500
1967A980R73L22j06r53j546j414j749p43j28O36J074J643J729P85Q30qo48j403
$$ plain form
1985 1274 -182 -1613 -2671 -3271 -3045 -2238 -1131 495 1799 2810 3120 2582 1848 686 -915 -2032
2001 -2032 -2917 -3167 -2530 -1290 106 1209 2294 3153 2971 2621 1185 -187 -1811 -2461 -3067 -2736 -2064
2018 -2064 -995 159 1740 2803 3192 2516 1717 176 -765 -2332 -3074 -3012 -2515 -1549 -63 1206 2589
2035 2589 2564 2644 2264 1163 -217 -1436 -2448 -3088 -2603 -1744 -726 393 1442 2572 2983 2483 1794 127
2053 127 -1055 -2240 -2490 -2811 -2515 -1583 -233 1359 2109 2875 2920 2260 930 -496 -1579 -2394 -2849 -2609
2071 -2609 -1961 -608 482 2072 2284 2473 2548 1329 290 -865 -2041 -2897 -2815 -2144 -900 289 1278
2088 1278 2319 3031 3054 2018 1220 -501 -1493 -2121 -2742 -2748 -1644 -980 459 1930 2835 3033 2372 1533 408
2107 408 -931 -1944 -2715 -2963 -2535 -1589 55 1379 2177 2838 2665 2326 1296 -29 -1527 -2802 -2900 -2713
$$ packed form
1985A274j456j431j058o00K26Q07J107J626J304J011L10n38p34j162j601j117
2001b032q85k50O37J240J396J103J085Q59j82l50j436j372j624o50o06L31O72
2018b064J069J154J581J063L89o76p99j541r41j567p42O2M97R66J486J269J383
2035B589k5Q0l80j101j380j219j012o40M85Q59J018J119J049J130M11n00o89j667
2053A27j182j185k50l21K96R32J350J592P50P66M5o60j330j426j083q15m55K40
2071b609O48J353J090J590K12J89P5j219j039j155j176q56Q2O71J244J189R89
2088A278J041P12K3j036p98j721r92o28o21oJ104O64J439J471R05J98o61q39j125
2107D08j339j013p71k48M28R46J644J324P98O61j73l39j030j325j498j275r8J87
$$ plain form
2125 -2713 -1380 -940 367 1707 2577 2948 2666 1674 108 -1239 -2086 -2570 -2752 -2227 -1481 -155 1160
2142 1160 2444 3132 2933 2026 991 10 -1141 -2475 -3151 -2913 -2065 -750 690 1520 2300 2325 2458 2101
2160 2101 887 -787 -2119 -2797 -2639 -2068 -1304 -229 871 1971 2916 2695 2293 880 -309 -1416 -2289
2177 -2289 -2844 -2883 -2257 -826 391 1808 2789 2890 2423 2006 955 -462 -1667 -2808 -2952 -2688 -1762 -276
2195 -276 740 1860 2486 2780 2617 1396 177 -1385 -2332 -2471 -2315 -1733 -556 211 1524 2580 3027
2212 3027 2441 1412 305 -726 -2025 -2280 -2980 -2777 -1946 -424 1036 1991 2594 2827 2219 1359 545 -1048
2230 -1048 -2193 -2505 -2616 -2198 -1094 -85 1272 2199 2596 2756 1994 628 -665 -1727 -2409 -2519 -2550 -1759
2248 -1759 -523 674 1795 2582 2586 2212 1358 178 -944 -1898 -2548 -2572 -2252 -1343 198 1493 1955 2589
$$ packed form
2125b713J333M40J307J340Q70L71k82r92j566j347q47m84j82N25P46J326J315
2142A160J284O88j99r07j035r81j151j334o76K38Q48J315J440Q30P80K5J33l57
2160B101j214j674j332o78J58N71P64J075J100J100R45k21m02j413j189j107q73
2177b289n55l9O26J431J217J417R81J01m67m17j051j417j205j141j44K64R26J486
2195b76J016J120O26K94j63j221j219j562r47j39J56N82J177P67J313J056M47
2212C027n86j029j107j031j299k55p00K03Q31J522J460R55O03K33o08q60q14j593
2230a048j145l12j11M18J104J009J357R27L97J60p62j366j293j062o82j10l1P91
2248a759J236J197J121P87Ml74q54j180j122r54o50k4L20R09J541J295M62O34
$$ plain form
2266 2589 2199 1980 704 -97 -1372 -2363 -2693 -2104 -1628 -621 244 1398 2260 2689 2227 1262 205 -929
2284 -929 -1648 -2100 -2467 -2343 -1116 -288 1432 2536 2587 2376 1932 724 -243 -1434 -2157 -2690 -2738 -1934 -658
2303 -658 635 1462 2112 2271 2050 1499 527 -750 -2029 -2290 -2171 -1811 -901 -336 1041 1913 2680 2713 1833
2322 1833 463 -262 -1286 -1951 -2342 -2474 -1556 -873 425 1653 2334 2514 2230 1115 570 -936 -1611 -2466
2340 -2466 -2538 -1779 -875 63 1048 1799 2327 2178 1978 1030 -136 -1267 -1876 -2195 -1970 -1409 -517 338 1452
2359 1452 2110 2352 2067 975 408 -490 -1562 -2405 -2412 -1890 -1258 -154 993 2219 2426 2229 1670 890 -308
2378 -308 -1162 -2213 -2406 -2150 -1523 -569 136 1381 1916 2165 2111 1509 235 -691 -1657 -2202 -2348 -1657 -1001
2397 -1001 -366 1029 1530 2467 2026 1791 907 -217 -1328 -1866 -2062 -2315 -1672 -806 397 1437 1862 2058
$$ packed form
2266B589l90k19j276q01j275r91l30N89M76J007Q65J154Q62M29m62r65j057j134
2284i29p19m52l67J24J227Q28J720J104N1k11m44j208r67j191p23n33m8Q04J276
2303f58J293Q27O50J59k21n51r72j277j279k61J19L60R10N65J377Q72P67L3q80
2322A833j370p25j024o65l91j32R18O83J298J228O81J80k84j115n45j506o75q55
2340b466p2P59R04R38R85P51N28j49k00r48j166j131o09l19K25N61Q92Q55J114
2359A452O58K42k85j092n67q98j072q43pN22O32J104J147J226K07j97n59p80j198
2378c08q54j051j93K56O27R54P05J245N35K49n4o02j274r26r66n45j46O91O56
2397a001O35J395N01R37m41k35q84j124j111n38j96k53O43Q66J203J040M25J96
$$ plain form
2415 2058 1943 1542 505 -490 -1668 -2099 -2192 -1804 -1094 39 770 1440 1835 2028 1884 870 -169 -1302
2433 -1302 -1843 -1971 -1919 -1690 -662 216 1040 1652 2364 1842 1137 392 -849 -1369 -1724 -2265 -2179 -998 -124
2452 -124 765 1913 1963 1895 1646 1031 -154 -796 -1849 -2012 -1929 -1374 -597 185 833 1659 2142 2046 1396 215
2472 215 -700 -1457 -1947 -2059 -1661 -1259 -290 822 1452 2108 1993 1535 985 26 -435 -1481 -2071 -1624 -1693 -629
2492 -629 288 1180 1495 1807 1720 1256 635 -376 -1321 -1989 -1811 -1742 -1196 -520 431 1526 1815 2007 1624 735
2512 735 20 -1019 -1309 -1680 -1680 -1489 -700 130 1083 1516 1859 1387 1146 402 -463 -1233 -1836 -1880 -1511 -808 107
2533 107 547 1100 1593 1698 1381 1134 -58 -769 -1422 -1742 -1581 -1255 -519 206 788 1604 1793 1754 1156 -29
2553 -29 -440 -1029 -1421 -1791 -1535 -1057 -200 743 1401 1551 1749 1382 745 32 -739 -1141 -1748 -1495 -1279 -527
$$ packed form
2415B058j15m01j037r95j178m31r3L88P10J133P31O70L95J93j44j014j039j133
2433a302n41j28N2K29J028Q78Q24O12P12n22p05p45j241n20l55n41Q6J181Q74
2452a24Q89J148N0o8k49o15j185o42j053j63Q3N55P77P82O48Q26M83r6o50j181
2472B15r15p57m90j12L98M02R69J112O30O56j15m58n50r59m61j046n90M47o9J064
2492f29R17Q92L15L12q7m64o21j011r45o68J78O9N46O76R51J095K89J92l83q89
2512G35p15j039k90l71%J91P89Q30R53M33L43m72k41p44q65p70o03m4L69P03R15
2533A07M40N53M93J05l17k47j192p11o53l20J61L26P36P25N82Q16J89l9n98j185
2553b9m11n89l92l70K56M78Q57R43O58J50J98l67o37p13p71m02o07K53K16P52
$$ plain form
2573 -527 79 1131 1342 1854 1648 960 556 -703 -1021 -1827 -1612 -1594 -1196 -124 473 1178 1887 1693 1291
2592 1291 589 -192 -929 -1229 -1858 -1668 -1436 -810 431 1129 1550 1496 1473 1100 516 -368 -913 -1489 -1723 -1222
2612 -1222 -601 -179 625 1094 1512 1880 1389 665 -163 -1167 -1316 -1489 -1350 -1120 -484 220 1296 1288 1643 1692
2632 1692 1200 449 -227 -1292 -1517 -1742 -1655 -879 -218 663 1192 1439 1731 1540 756 -226 -1187 -1559 -1888 -1516
2652 -1516 -1091 -153 440 1383 1474 1725 1710 926 302 -631 -864 -1729 -1733 -1466 -1109 -150 548 1354 1833 1871 1356
2673 1356 876 176 -709 -1181 -1779 -1619 -1368 -578 344 950 1442 1509 1612 1089 319 -697 -989 -1588 -1600 -1265
2693 -1265 -730 -221 815 1228 2075 1903 1161 817 -67 -834 -1408 -1925 -1797 -1166 -645 462 1067 1438 1319
2712 1319 1792 1228 595 -165 -963 -1296 -1544 -1300 -603 -145 448 1038 1439 1843 1451 858 -96 -771 -1092 -1539
$$ packed form
2573e27O06J052K11N12k06o88m04j259l18q06K15J8L98J072N97P05P09j94m02
2592A291p02p81p37l00o29J90K32O26J241O98M21n4k3l73n84q84n45n76k34N01
2612a222O21M22Q04M69M18L68m91p24q28j004j49j73J39K30O36P04J076qL55M9
2632A692m92p51o76j065k25k25Q7P76O61Q81N29K47K92j91p84r82r61l72l29L72
2652a516M25R38N93R43R1K51j5p84o24r33k33q65mK67L57R59O98Q06M79L8n15
2673A356m80p00q85m72n98J60K51P90R22O06M92O7J03n23p70j016k92n99j2L35
2693a265N35N09J036M13Q47j72p42l44q84p67n74n17J28O31N21J107O05L71j19
2712A319M73n64o33p60p98l33k48K44O97M58N93N90M01M04l92n93r54o75l21m47
$$ plain form
2732 -1539 -1438 -1380 -442 -19 892 1543 1845 1845 1262 412 -246 -956 -1678 -1677 -1442 -1151 -502 528 996 1371 1676
2753 1676 1167 674 29 -588 -1077 -1632 -1449 -951 -621 233 614 1251 1541 1556 1018 597 -333 -1073 -1274 -1648
2773 -1648 -1288 -1049 -313 309 1144 1349 1493 1305 793 249 -642 -1057 -1455 -1359 -1343 -732 36 777 1239 1600
2793 1600 1549 1411 773 -95 -538 -1104 -1415 -1359 -886 -118 418 1143 1504 1535 1438 779 -109 -710 -1149 -1700 -1356
2814 -1356 -1334 -552 40 783 1379 1502 1405 994 566 -178 -674 -1153 -1273 -1237 -729 -480 -34 763 1196 1230 1191
2835 1191 813 85 -677 -965 -1301 -1408 -736 -765 58 659 1129 1164 1471 1094 387 -205 -744 -876 -1588 -1276
2855 -1276 -801 -449 449 907 1331 1499 1275 829 -4 -735 -1318 -1284 -1086 -1098 -433 -7 611 1152 965 973 982 616
2877 616 -305 -672 -1029 -988 -800 -587 -29 749 811 1037 1291 962 345 -3 -546 -945 -1340 -1047 -873 -513 201
$$ packed form
2732a539J01N8R38M23R11O51L02%n83q50o58p10p22JK35K91O49J030M68L75L05
2753A676n09m93o45o17m89n55J83M98L30Q54L81O37K90J5n38m21r30p40k01l74
2773a648L60K39P36O22Q35K05J44j88n12n44q91m15l98R6J6O11P68P41M62L61
2793A600n1j38o38q68m43n66l11N6M73P68N36P25L61L1r7o59q88o01m39n51L44
2814a356K2P82N92P43N96J23r7m11m28p44m96m79j20L6N08K49M46P97M33L4l9
2835A191l78p28p62k88l36j07O72k9Q23O01M70L5L07l77p07n92n39j32p12L12
2855a276M75L52Q98M58M24J68k24m46q33p31n83L4J98j2O65M26O18N41j87QRl66
2877F16r21l67l57M1J88K13N58P78O2K26K54l29o17l48n43l99l95K93J74L60P14
$$ plain form
2898 201 825 867 1349 891 835 174 -397 -888 -1151 -1179 -1015 -709 -80 277 1059 1134 1467 883 197 -126 -383
2919 -383 -824 -1014 -1104 -731 -226 201 876 1000 1146 1023 936 207 -183 -998 -1132 -1144 -927 -832 -40 519 775
2940 775 1389 1096 914 491 122 -544 -1084 -1143 -1254 -1150 -323 267 665 1110 1043 1089 683 259 -529 -947 -972
2961 -972 -1377 -782 -690 -220 570 915 1241 1056 769 371 93 -541 -877 -1338 -1419 -877 2 377 830 765 980
2982 980 1246 591 41 -401 -854 -1293 -1135 -830 -372 -151 508 1123 1240 1188 1028 703 -203 -617 -1213 -1212 -951
3003 -951 -944 -404 304 726 933 1292 1075 600 106 -286 -668 -1128 -1383 -853 -617 -86 415 1157 1200 1252 954
3024 954 548 -22 -761 -932 -1368 -1180 -906 -448 254 760 1173 1109 959 770 322 -158 -487 -1144 -1229 -1197 -595
3045 -595 -125 195 927 1165 1387 1112 492 -62 -649 -1193 -1190 -1191 -870 -143 243 836 850 1311 1359 605 56 -341
$$ packed form
2898B01O24M2M82m58n6o61n71m91k63k8J64L06O29L57P82P5L33n84o86l23k57
2919c83m41j90r0L73N05M27O75J24J46j23q7p29l90q15j34j2K17R5P92N59K56
2940G75O14k93j82m23l69o66n40n9j11J04Q27N90L98M45o7M6m06m24p88m18k5
2961i72m05N95R2M70P90L45L26j85k87l98k78o34l36m61q1N42Q79L75M53o5K15
2982I80K66o55n50m42m53m39J58L05M58K21O59O15J17n2j60l25r06m14n96JK61
3003i51PN40P08M22K07L59k17m75m94l92l82m60k55N30K36N31N01P42M3N2k98
3024I54m06n70p39j71m36J88K74M58P02N06M13o4j50j89m48m80l29o57q5L2O02
3045e95M70L20P32K38K22k75o20n54n87n44LjL21P27L86N93J4M61M8p54n49l97
$$ plain form
3067 -341 -1108 -1019 -1173 -1085 -601 -168 586 824 955 1212 981 589 -61 -501 -896 -1447 -1257 -991 -517 -121 566
3088 566 1092 1139 1207 932 367 -203 -877 -1068 -1331 -1130 -424 221 540 628 1312 1433 1053 478 -172 -588 -906
3109 -906 -1167 -1367 -1029 -757 216 955 1187 1281 1140 1150 272 -111 -719 -1074 -1204 -877 -638 -69 35 785 1149
3130 1149 1025 1043 420 75 -461 -1037 -1295 -1233 -804 -666 27 938 1258 1315 937 761 359 -129 -615 -964 -1026
3151 -1026 -1080 -679 -398 531 1027 1261 1178 778 823 -88 -430 -846 -952 -917 -683 -513 57 716 1068 1317 773
3172 773 851 399 -428 -797 -1029 -1403 -1115 -628 19 264 1039 1305 1021 933 856 197 -780 -668 -1120 -1122 -954 -476
3194 -476 11 543 948 848 1021 768 74 -105 -615 -1087 -823 -904 -792 -299 658 1050 980 1371 797 622 130
3215 130 -709 -1002 -1037 -1155 -1017 -610 -255 759 993 983 1108 737 185 -392 -785 -933 -1202 -907 -974 -208 473
$$ packed form
3067c41p67Q9j54Q8M84M33P54K38J31K57k31l92o50m40l95n51J90K66M74L96O87
3088E66N26M7O8k75n65n70o74j91k63K01P06O45L19Q8O84J21l80n75o50m16l18
3109i06k61k00L38K72R73P39K32R4j41J0q78l83o08l55j30L27K39N69J04P50L64
3130A149j24J8o23l45n36n76k58O2M29J38O93R11L20N7l78j76m02m88m86l49o2
3151a026n4M01K81R29M96K34q3m00M5r11l42m16j06L5K34J70N70O59L52K49n44
3172G73P8m52q27l69k32l74K88M87O47K45P75K66k84q8p7o59r77J12m52kJ68M78
3194d76M87N32M05j00J73k53o94j79n10m72K64q1J12M93R57L92p0L91n74j75m92
3215A30q39k93l5j18J38M07L55J014K34j0J25l71n52n77l93j48k69K95o7P66O81
$$ plain form
3236 473 971 839 1170 945 532 14 -516 -674 -997 -1045 -720 -202 256 510 759 954 931 820 493 -168 -580
3257 -580 -1102 -886 -823 -589 -336 -77 900 962 1110 690 580 -31 -547 -786 -1022 -1151 -651 -376 222 475 981
3278 981 1033 990 618 206 -8 -490 -987 -855 -796 -634 -165 480 748 1094 1038 703 395 114 -255 -605 -972
3299 -972 -970 -751 -311 339 482 649 951 1037 958 166 -305 -752 -858 -803 -796 -576 -142 92 668 1070 999 756 353
3322 353 -389 -311 -629 -861 -863 -538 -549 86 425 849 803 934 491 422 -121 -666 -479 -746 -1079 -525 -96 127
3344 127 459 1078 967 786 234 29 -512 -521 -819 -755 -656 -191 114 504 763 964 820 880 126 -300 -464 -573
3366 -573 -807 -704 -302 109 443 479 752 690 425 -217 -133 -670 -612 -1071 -801 -554 -262 -98 435 606 913
3387 913 464 471 6 -273 -337 -835 -668 -741 -422 98 268 592 822 449 500 224 -490 -532 -814 -725 -569 -454
$$ packed form
3236D73M98j32L31k25m13n18n30j58l23m8L25N18M58K54K49J95k3j11l27o61m12
3257e80n22K16O3K34K53K59R77O2J48m20j10o11n16k39k36j29N00K75N98K53N06
3278I81N2m3l72m12k14m82m97J32N9J62M69O45K68L46n6l35l08k81l69l50l67
3299i72KK19M40O50J43J67L02Q6p9p92m71m47j06N5PK20M34K34N76M02p1k43m03
3322C53p42P8l18k32kL25j1O35L39M24m6J31m43o9n43n45J87k67l33N54M29K23
3344A27L32O19j11j81n52k05n41rk98O4R9M65L05L90K59K01j44O0p54m26j64j09
3366e73k34J03M02M11L34L6K73o2k65o42Q4n37N8m59K70K47K92J64N33J71L07
3387I13m49Pm65k79o4m98J67p3L19N20J70L24K30l73N1k76p14m2k82Q9J56J15
$$ plain form
3409 -454 -287 90 539 751 1043 723 652 118 -355 -716 -1142 -1016 -689 -230 132 562 659 784 1193 774 318
3430 318 -115 -530 -693 -904 -884 -753 -488 426 674 833 955 813 502 189 -258 -799 -864 -650 -757 -337 51
3451 51 631 890 841 1192 540 224 -164 -724 -738 -883 -952 -842 184 392 957 687 1108 635 542 148 -297
3472 -297 -690 -922 -931 -778 -622 117 533 725 902 1001 966 449 -47 -621 -985 -735 -937 -564 -306 352 507
3493 507 1078 1288 1049 535 327 -176 -783 -616 -859 -553 -464 165 387 708 964 794 638 466 -263 -759
3513 -759 -837 -1155 -788 -766 -391 168 459 1082 932 1030 547 -69 -363 -844 -863 -829 -737 -470 -248 294 856 815
3535 815 819 558 310 -197 -616 -746 -975 -756 -715 -212 328 364 985 1235 904 635 -33 -135 -615 -964 -917 -967
3557 -967 -444 -166 355 568 606 1080 697 46 50 -261 -622 -605 -774 -622 -241 296 484 761 882 816 503 244
$$ packed form
3409d54J67L77M49K12K92l20p1n34m73l61m26J26L27M59L62M30R7J25M09m19m56
3430C18m33m15j63k11K0J31K65R14K48J59J22j42l11l13m47n41o5K14j07M20L88
3451E1N80K59m9L51o52l16l88n60j4j45o9J10J026K08N65k70M21m73r3l94m45
3472b97l93k32rJ53J56P39M16J92J77R9l5n17m96n74l64K50k02L73K58O58J55
3493E07N71K10k39n14k08n03o07J67k43L06Q9O29K22L21K56j70j56j72p29m96
3513g59p8l18L67K2L75N59K91O23j50R8m83o16k94m81j9L4R2K67K22N42N62m1
3535H15Mk61k48n07m19j30k29K19M1N03N40L6O21K50l31k69o68j02m80l49M7n0
3557i67N23K78N21K13L8M74l83o51Ml11l61J7j69J52L81N37J88K77J21o6l13k59
$$ plain form
3579 244 -332 -616 -845 -1073 -826 -313 9 327 752 724 804 406 551 77 -610 -631 -844 -953 -640 -375 184
3600 184 473 769 696 976 386 312 -464 -672 -925 -651 -619 -734 130 543 443 820 811 674 253 -278 -547 -678
3622 -678 -728 -776 -520 -288 105 488 775 786 821 486 48 -173 -561 -637 -758 -969 -642 -104 437 615 923 985
3644 985 567 208 -220 -464 -678 -1076 -703 -646 -249 241 430 468 609 745 406 53 -321 -412 -725 -755 -445
3665 -445 -397 97 255 483 823 703 428 191 17 -556 -539 -1002 -859 -373 -224 -73 407 835 559 732 289
3686 289 -58 -300 -686 -754 -847 -571 -125 104 305 794 875 649 635 265 -27 -462 -924 -709 -530 -514 -120 314
3708 314 484 860 1088 423 309 -5 40 -606 -743 -553 -672 -216 14 588 509 748 704 270 238 -111 -183 -617
3730 -617 -724 -670 -403 -348 109 679 824 630 482 374 -36 -268 -707 -624 -972 -385 -444 -81 635 596 604 699 390
$$ packed form
3579B44n76k84k29k28K47N13L22L18M25k8Q0l98J45m74o87k1k13j09L13K65N59
3600A84K89K96p3K80n90p4p76k08k53K74L2j15Q64M13j00L77rj37m21n31k69j31
3622f78n0m8K56K32L93L83K87J1L5l35m38k21l88p6j21k11L27N38N41J78L08O2
3644I85m18l59m28k44k14l98L73N7L97M90J89L8J41J36l39l53l74r1l13l0L10
3665d45M8M94J58K28L40j20k75k37j74n73J7m63J43M86J49J51M80M28k76J73m43
3686B89l47k42l86o8r3K76M46K29K01M89Q1k26j4l70k92m35m62K15J79J6L94M34
3708C14J70L76K28o65j14l14M5o46j37J90j19M56K30N74p9K39m4m34l2l49p2m34
3730f17j07N4K67N5M57N70J45j94j48j08m10k32m39Q3l48N87n9L63P16l9QR5l09
$$ plain form
3753 390 367 29 -265 -573 -525 -854 -541 -369 85 760 931 694 479 488 108 -323 -327 -624 -729 -687 -571 -38
3775 -38 364 653 410 792 697 223 25 -240 -598 -563 -700 -418 -162 98 344 734 734 622 399 137 -300 -715
3797 -715 -612 -736 -518 -590 -134 185 431 894 569 521 103 37 -318 -489 -784 -825 -532 -409 151 540 550 788
3819 788 619 241 204 -306 -759 -561 -1108 -725 -219 -218 141 685 807 900 373 607 -158 -99 -599 -689 -692 -795 -47
3842 -47 127 486 799 571 865 624 60 -225 -656 -783 -951 -844 -568 -164 53 333 887 741 616 333
3862 333 -95 -461 -657 -942 -744 -545 13 146 240 623 819 703 452 175 -461 -681 -840 -546 -454 -532 -126
3883 -126 121 805 568 733 349 84 168 -520 -485 -882 -920 -448 -26 51 459 842 904 703 542 122 -352 -584
3905 -584 -522 -862 -923 -424 -240 162 527 618 633 272 -120 -77 -179 -685 -401 -593 -522 19 337 338 740 769 753
$$ packed form
3753C90k3l38k94l08M8l29L13J72M54O75J71k37k15Rl80m31mk97j05M2J16N33
3775c8M02K89k43L82r5m74j98k65l58L5j37K82K56K60K46L90%j12k23k62m37m15
3797g15J03j24K18p2M56L19K46M63l25m8m18o6l55j71k95m1K93J23N60L89J0K38
3819G88j69l78l7n10m53J98n47L83N06JL59N44J22R3n27K34p65N9n00r0lj03P48
3842d7J74L59L13k28K94k41n64k85m31j27j68J07K76M04K17K80N54j46j25k83
3862C33m28l66j96k85J98J99N58J33R4L83J96j16k51k77o36k20j59K94R2p8M06
3883a26K47O84k37J65l84k65Q4o88L5l97l8M72M22P7M08L83O2k01j61m20m74k32
3905e84O2l40o1M99J84M02L65R1J5l61l92M3j02n06K84j92P1N41L18JM02K9j6
$$ plain form
3928 753 518 283 -130 -608 -611 -810 -464 -342 93 199 456 1125 783 442 369 184 -282 -679 -781 -576 -428
3949 -428 -97 123 573 647 569 598 499 69 -116 -382 -787 -856 -634 -408 -127 480 525 724 917 572 303 -97
3971 -97 -316 -498 -738 -457 -675 -232 253 223 509 715 568 415 164 -159 -488 -871 -887 -567 -462 -115 548
3992 548 549 891 606 587 395 49 -220 -610 -745 -726 -179 -242 -93 360 706 933 264 245 145 -160 -313 -548
4014 -548 -908 -714 -174 -58 -13 241 614 433 643 177 195 -173 -744 -796 -774 -568 -153 -32 490 610 954
4035 954 670 712 -16 -160 -291 -370 -668 -740 -277 -579 198 492 567 564 509 419 -125 -240 -523 -857 -707 -385 -152
4058 -152 -220 347 657 495 447 568 362 -114 -500 -790 -537 -624 -671 -47 238 538 466 634 527 474 18 115
4080 115 -604 -926 -653 -405 -232 -140 245 196 690 537 418 337 58 -267 -791 -822 -583 -571 -81 362 119 613
$$ packed form
3928G53k35k35m13m78lj99L46J22M35J06K57O69l42l41p3j85m66l97j02K05J48
3949d28L31K20M50P4p8K9r9m30j85k66m05o9K22K26K81O07M5J99J93l45k69m00
3971i7k19j82k40K81k18M43M85l0K86K06j47j53k51l23l29l83j6L20J05L47O63
3992E48JL42k85j9j92l46k69l90j35J9N47o3J49M53L46K27o69j9j00l05j53k35
4014e48l60J94N40J16M5K54L73j81K10m66J8l68n71n2K2K06M15J21N22J20L44
4035I54k84M2p28j44j31p9k98p2M63l02P77K94P5ln5r0n44j15k83l34J50L22K33
4058a52o8N67L10j62m8J21k06m76l86k90K53q7m7O24K85L00p2J68j07n3m56R7
4080A15p19l22K73K48J73R2L85m9M94j53j19q1k79l25n24l1K39J2M90M43k43M94
$$ plain form
4102 613 485 580 347 -119 -494 -493 -443 -720 -525 -366 83 268 800 739 336 380 198 28 -393 -529 -606 -552 -752
4125 -752 -170 -48 483 637 678 433 47 112 -340 -931 -542 -487 -459 -358 -169 130 492 667 466 297 155
4146 155 -89 -186 -639 -585 -497 -416 38 212 266 527 523 779 278 148 -203 -384 -489 -692 -519 -492 146 173 370
4169 370 351 406 339 391 218 -335 -207 -343 -414 -556 67 136 -17 487 459 384 305 -42 -176 -135 -334 -778 -347
4192 -347 -213 96 281 463 587 566 599 179 -154 -183 -569 -467 -806 -345 -55 138 523 573 737 766 232 109
4214 109 -148 -451 -511 -449 -589 -465 -274 222 610 517 826 315 133 -103 -254 -491 -592 -562 -632 -316 181 432
4236 432 598 581 687 183 374 -163 -617 -610 -542 -468 -339 155 196 260 641 667 446 66 4 -389 -295 -448 -432 -792
4260 -792 54 215 482 242 484 544 127 160 -233 -421 -594 -637 -718 -324 -73 403 561 601 487 656 171 -45
$$ packed form
4102F13j28R5k33m66l75JN0k77J95J59M49J85N32o1m03M4j82j70m21j36p7N4k00
4125g52N82J22N31J54M1k45l86O5m52n91L89N5K8J01J89K99L62J75k01j69j42
4146A55k44r7m53N4Q8Q1M54J74N4K61mK56n01j30l51j81j05k03J73K7O38K7J97
4169C70j9N5o7N2j73n53J28j36p1j42O23O9j53N04k8p5p9l47j34M1j99m44M31
4192c47J34L09J85J82J24k1L3m20l33k9l86J02l39M61K90J93L85N0J64K9n34j23
4214A09k57l03o0O2j40J24J91M96L88r3L09n11j82k36j51k37j01L0p0L16M97K51
4236D32J66j7J06n04J91n37m54PO8P4J29M94M1O4L81K6k21l80o2l93R4j53J6l60
4260g92Q46J61K67k40K42O0m17L3l93j88j73m3q1L94K51M76J58M0j14J69m85k16
$$ plain form
4282 -45 -535 -358 -535 -461 -288 16 109 300 561 610 472 243 149 -258 -470 -668 -616 -752 -95 123 181 489
4304 489 780 523 574 197 125 -397 -338 -939 -498 -299 -278 404 159 612 139 474 534 109 -223 -445 -685 -190
4326 -190 -531 -253 -37 390 263 806 496 321 306 -154 -250 -450 -669 -739 -486 -211 98 492 514 462 396 323
4348 323 157 -162 -286 -585 -376 -750 -413 -69 142 363 494 616 501 253 -116 -424 -441 -507 -290 -292 -136
4369 -136 36 322 692 529 460 278 254 -34 -368 -662 -678 -480 -348 -166 278 472 526 481 338 -5 -75 -137
4391 -137 -440 -593 -598 -595 -116 -39 31 333 553 382 416 106 -78 -119 -510 -421 -192 -431 -33 135 461 155 242
4414 242 554 87 108 -86 -235 -417 -363 -265 -149 -8 308 134 562 615 135 336 -141 -273 -613 -569 -304 -206
4436 -206 86 126 365 250 306 514 85 11 -143 -470 -335 -325 -265 -480 113 144 505 687 435 395 216 -234
$$ packed form
4282d5m90J77j77P4J73L04R3J91K61M9j38k29r4m07k12j98N2j36O57K18N8L08
4304D89K91k57N1l77p2n22N9o01M41J99K1O82k45M53m73L35O0m25l32k22k40M95
4326a90l41K78K16M27j27N43l10j75j5m60r6k00k19p0K53K75L09L94K2n2o6p3
4348C23j66l19j24k99K09l74L37L44K11K21J31J22j15k48l69l08j7o6K17kJ56
4369a36J72K86L70j63o9j82k4k88l34k94j6J98J32J82M44J94N4m5j43l43p0o2
4391a37l03j53nLM79P7P0L02K20j71L4l10j84m1l91Q9K29k39L98J68L26l06Q7
4414B42L12m67K1j94j49j82N4R8J16J41L16j74M28N3m80K01m77j32l40M4K65R8
4436b06K92M0K39j15N6K08m29p4j54l27J35J0O0k15N93L1L61J82k52m0j79m50
$$ plain form
4458 -234 -47 -358 -615 -374 -258 -254 283 522 595 658 326 327 12 99 -379 -429 -355 -460 -435 -211 116 381 441 459
4482 459 461 454 -196 -326 -348 -533 -392 -391 -53 149 389 451 268 374 273 169 67 -289 -584 -618 -443 -142 323
4505 323 276 439 251 318 429 151 69 -355 -299 -514 -176 -140 -204 221 429 496 458 312 526 88 -138 -326 -565
4528 -565 -323 -542 -233 35 289 384 318 467 319 254 13 -287 -166 -439 -480 -209 55 44 354 299 608 479
4550 479 82 110 -125 -221 -655 -593 -399 -387 -86 -56 239 595 588 379 342 -364 -89 -458 -461 -437 -269 -53 -20 180
4574 180 388 584 295 598 72 6 -539 -671 -577 -353 35 -103 38 236 376 614 534 124 -11 -286 -410
4595 -410 -448 -326 -226 -325 -158 280 544 640 457 319 61 -66 -154 -619 -130 -341 -326 -33 47 164 360 413
4617 413 139 215 -21 7 -517 -397 -422 -306 -148 -172 232 535 507 680 421 115 38 -433 -413 -445 -477 -211 -99
$$ packed form
4458b34J87l11k57K41J16MN37K39P3O3l32Jl15Q7m78n0P4j05K5K24L27K65O0J8
4482D59Kpo50j30k2j85J41JL38K02K40O2j83J06j01j04j02l56k95l4J75L01M65
4505C23m7J63j88O7J11k78q2m24N6k15L38L6o4M25K08O7l8j46K14m38k26j88k39
4528e65K42k19L09K68K54R5o6J49j48o5k41l00J21k73m1K71K64j1L10n5L09j29
4550D79l97K8k35r6m34O2J94J2L01L0K95L56pk09l7p06K75l69lK4J68K16L3K00
4574A80K08J96k89L03n26o6n45j32R4K24L88j38J41J98J40K38q0m10j35k75j24
4595d10l8J22J00r9J67M38K64R6j83j38k58j27q8m65M89k11J5K93Q0J17J96N3
4617D13k74P6k36K8n24J20k5J16J58k4M04L03k8J73k59l06p7m71K0l2l2K66J12
$$ plain form
4640 -99 158 250 377 456 133 361 6 -149 -377 -382 -392 -477 -368 224 251 268 496 713 407 94 -275 -342 -407 -462
4664 -462 -264 -332 -89 252 163 431 373 593 124 -94 -264 -43 -743 -254 -297 53 -68 209 667 467 326
4685 326 150 432 -331 -369 -504 -593 -423 -268 -156 339 536 417 303 263 214 -202 -291 -477 -703 -353 -309 42
4707 42 -191 108 461 412 359 327 120 -275 -246 -405 -327 -211 -317 -273 323 314 505 459 268 327 -228 179 -309 -337
4731 -337 -291 -119 -385 -27 451 269 364 522 664 116 33 -309 -320 -638 -636 -454 -151 406 245 557 532 558 284
4754 284 -218 -201 -388 -331 -442 -364 -328 -72 331 407 498 437 237 -48 24 -58 -463 -408 -583 -356 -94 130 217 479
4778 479 507 547 388 381 -240 -683 -204 -512 -474 -248 31 228 296 551 294 725 306 -180 -146 -416 -573 -602 -442
4801 -442 -309 337 122 608 702 459 11 227 -233 -393 -481 -751 -477 -229 -58 184 343 466 475 430 192 192
$$ packed form
4640i9K57R2J27P9l23K28l55j55k28nj0q5J09N92K7J7K28K17l06l13l69o7o5n5
4664d62J98o8K43L41q9K68n8K20m69k18j70K21p00M89m3L50j21K77M58k00j41
4685C26j76K82p63l8j35q9J70J55J12M95J97j19j14m0m9m16q9j86k26L50M4L51
4707D2k33K99L53m9n3l2k07l95K9j59P8J16j06M4N96rJ91m6j91N9n55M07m88k8
4731c37M6J72k66L58M78j82R5J58J42n48q3l42j1l18KJ82L03N57j61L12k5K6k74
4754B84n02J7j87N7j11P8L6K56M03P6R1o1k00k85P2q2m05N5j75K27K62K24Q7K62
4778D79K8M0j59po21m43M79l08L8K26K79J97O8K55k57M31m19m86L4k70j57k9J60
4801d42J33O46k15M86R4k43m48K16m60j60q8k70K74K48J71K42J59J23Rm5k38%
$$ plain form
4823 192 -12 -268 -331 -397 -428 -227 358 321 331 277 498 455 71 -34 -119 -627 -616 -511 -232 148 177 257 590 556
4847 556 84 555 109 -116 -434 -537 -674 -245 -253 -88 186 319 439 390 386 -192 35 -367 -175 -490 -190 -202
4869 -202 132 -304 399 574 418 228 206 140 -630 -319 -581 -572 -200 -120 196 386 302 489 166 298 206 -235
4891 -235 -201 -229 -323 -338 -480 128 -212 17 337 618 409 55 106 -249 -20 -324 -668 -429 -181 -100 229 396
4913 396 659 282 82 150 -1 -247 -321 -418 -447 -54 26 69 219 194 241 353 226 104 -410 -86 -388 -323 -445
4936 -445 -155 -68 56 434 235 563 338 111 -304 -185 -261 -493 -450 -230 140 192 110 539 126 426 168 89
4958 89 -352 -255 -476 -395 -384 -164 -242 34 147 152 502 190 160 -40 -412 -443 -309 -20 -412 -80 34 -123 530
4981 530 299 443 189 54 -152 -285 -461 -698 -522 -113 -83 285 238 315 406 437 207 -180 -169 -564 -256 -339
$$ packed form
4823A92k04k56o3o6l1K01N85l7J0n4K21m3l84j05q5n08J1J05K79L80K9Q0L33l4
4847E56m72M71m46k25l18j03j37M29qJ65K74J33J20m9mn78K27m02J92l15L00j2
4869b02L34m36P03J75j56j90k2o6p70L11k62RL72Q0L16J90q4J87l23J32r2m41
4891b35L4k8r4j5j42O08l40K29L20K81k09l54N1l55K29l04l44K39K48Q1L29J67
4913C96K63l77k00O8j51k46p4r7k9L93Q0M3J50k5M7J12j27j22n14L24l02O5j22
4936d45K90Q7J24L78j99L28k25k27m15J19p6k32M3K20L70N2q2M29m13L00k58p9
4958H9m41R7k21Q1J1K20p8K76J13NL50l12l0k00l72l1J34K89l92L32J14j57O53
4981E30k31J44k54j35k06j33j76k37J76M09L0L68m7P7R1L1k30l87J1l95L08q3
$$ [...]
8191f9
##END NTUPLES=NMR FID
##END=
