##TITLE=1H_Pr 3798-M
 CDCl3, 8 sc, 
 12.3.2019
##JCAMPDX= 6.0         $$ Bruker NMR JCAMP-DX V2.0
##DATA TYPE= NMR FID
##DATA CLASS= NTUPLES
##ORIGIN= UXNMR, Bruker Analytische Messtechnik GmbH
##OWNER= root
$$ XWIN-NMR		Version 3.5
$$ Tue Mar 12 14:17:26 2019 Russian Standard Time (UT+4h)  she@DPX200
##.OBSERVE FREQUENCY= 200.1316
##.OBSERVE NUCLEUS= ^1H
##.DELAY= (6, 6)
##.ACQUISITION MODE= SIMULTANEOUS
##.ACQUISITION SCHEME= undefined
##.AVERAGES= 8
##.DIGITISER RES= 18
##SPECTROMETER/DATA SYSTEM= spect
##.PULSE SEQUENCE= zg30
##.SOLVENT NAME= CDCl3
##.SHIFT REFERENCE= (INTERNAL, CDCl3, 0, 15.7039)
##AUDIT TRAIL= $$ (NUMBER, WHEN, WHO, WHERE, WHAT)
$$ ##TITLE= Audit trail, XWIN-NMR		Version 3.5
$$ ##JCAMPDX= 5.01
$$ ##ORIGIN= Bruker BioSpin GmbH
$$ ##OWNER= she
$$ F:/spectra/data/she/nmr/H-F/1/audita.txt
$$ ##AUDIT TRAIL=  $$ (NUMBER, WHEN, WHO, WHERE, WHAT)
(   1,<2019-03-12 14:16:08.37 +0400>,<she>,<DPX200>,
      <created by zg, POWCHK disabled, PULCHK disabled
       configuration hash MD5:
       00 E9 B6 7A A2 85 ED C7 34 08 36 98 17 FE 4E 26
       data hash MD5: 16K
       85 EE 24 4D F5 33 45 B7 7B 34 19 0B 2A FA 9C 79>)
$$ ##END=
$$ 
$$ hash MD5
$$ 44 A4 79 DA 31 C8 10 1E 6A 69 86 8A 37 AD DE B8
##$RELAX= 
##$RELAX= 
##$RELAX= 
##$RELAX= 
##$RELAX= 
##$RELAX= 
$$ Bruker specific parameters
$$ --------------------------
##$DU= <F:/spectra>
##$EXPNO= 1
##$NAME= <H-F>
##$PROCNO= 1
##$TYPE= <nmr>
##$USER= <she>
##$AMP= (0..31)
100 100 100 100 100 100 100 100 100 100 100 100 100 100 100 100 100 100 
100 100 100 100 100 100 100 100 100 100 100 100 100 100 
##$AQSEQ= 0
##$AQ_mod= 1
##$AUNM= <au_zg>
##$AUTOPOS= <>
##$BF1= 200.13
##$BF2= 200.13
##$BF3= 200.13
##$BF4= 200.13
##$BF5= 200.13
##$BF6= 200.13
##$BF7= 200.13
##$BF8= 200.13
##$BYTORDA= 1
##$CFDGTYP= 0
##$CFRGTYP= 5
##$CHEMSTR= <none>
##$CNST= (0..31)
1 1 145 1 1 1 1 1 1 1 1 1 1 1 1 1 1 1 1 1 1 1 1 1 1 1 1 1 1 1 1 1 
##$CPDPRG= <>
##$CPDPRG1= <>
##$CPDPRG2= <>
##$CPDPRG3= <>
##$CPDPRG4= <mlev>
##$CPDPRG5= <mlev>
##$CPDPRG6= <mlev>
##$CPDPRG7= <mlev>
##$CPDPRG8= <mlev>
##$CPDPRGB= <>
##$CPDPRGT= <>
##$D= (0..31)
0 1.2 0 0 0 0 0 0 0 0 0 0.03 0 0 0 0 0 0 0 0 0 0 0 0 0 0 0 0 0 0 0 0 
##$DATE= 1552385767
##$DBL= (0..7)
120 120 120 120 120 120 120 120 
##$DBP= (0..7)
150 150 150 150 150 150 150 150 
##$DBP07= 0
##$DBPNAM0= <>
##$DBPNAM1= <>
##$DBPNAM2= <>
##$DBPNAM3= <>
##$DBPNAM4= <>
##$DBPNAM5= <>
##$DBPNAM6= <>
##$DBPNAM7= <>
##$DBPOAL= (0..7)
0.5 0.5 0.5 0.5 0.5 0.5 0.5 0.5 
##$DBPOFFS= (0..7)
0 0 0 0 0 0 0 0 
##$DE= 6
##$DECBNUC= <off>
##$DECIM= 24
##$DECNUC= <off>
##$DECSTAT= 4
##$DIGMOD= 1
##$DIGTYP= 9
##$DL= (0..7)
0 120 120 120 120 120 120 120 
##$DP= (0..7)
150 150 150 150 150 150 150 150 
##$DP07= 0
##$DPNAME0= <>
##$DPNAME1= <>
##$DPNAME2= <>
##$DPNAME3= <>
##$DPNAME4= <>
##$DPNAME5= <>
##$DPNAME6= <>
##$DPNAME7= <>
##$DPOAL= (0..7)
0.5 0.5 0.5 0.5 0.5 0.5 0.5 0.5 
##$DPOFFS= (0..7)
0 0 0 0 0 0 0 0 
##$DQDMODE= 0
##$DR= 18
##$DS= 0
##$DSLIST= <SSSSSSSSSSSSSSS>
##$DSPFIRM= 0
$$ [...]
##$SUBNAM2= <"">
##$SUBNAM3= <"">
##$SUBNAM4= <"">
##$SUBNAM5= <"">
##$SUBNAM6= <"">
##$SUBNAM7= <"">
##$SUBNAM8= <"">
##$SUBNAM9= <"">
##$SW= 24.9336934301222
##$SWIBOX= (0..15)
0 0 2 0 0 0 0 0 0 0 0 0 0 0 0 0 
##$SW_h= 4990.01996007984
##$TD= 16384
##$TD0= 1
##$TE= 0
##$TE2= 300
##$TE3= 300
##$TEG= 300
##$TL= (0..7)
0 120 120 120 120 120 120 120 
##$TP= (0..7)
150 150 150 150 150 150 150 150 
##$TP07= 0
##$TPNAME0= <>
##$TPNAME1= <>
##$TPNAME2= <>
##$TPNAME3= <>
##$TPNAME4= <>
##$TPNAME5= <>
##$TPNAME6= <>
##$TPNAME7= <>
##$TPOAL= (0..7)
0.5 0.5 0.5 0.5 0.5 0.5 0.5 0.5 
##$TPOFFS= (0..7)
0 0 0 0 0 0 0 0 
##$TUNHIN= 0
##$TUNHOUT= 0
##$TUNXOUT= 0
##$USERA1= <user>
##$USERA2= <user>
##$USERA3= <user>
##$USERA4= <user>
##$USERA5= <user>
##$V9= 5
##$VALIST= <valist>
##$VCLIST= <CCCCCCCCCCCCCCC>
##$VD= 0
##$VDLIST= <DDDDDDDDDDDDDDD>
##$VPLIST= <PPPPPPPPPPPPPPP>
##$VTLIST= <TTTTTTTTTTTTTTT>
##$WBST= 1024
##$WBSW= 4
##$XGAIN= (0..3)
0 0 0 0 
##$XL= 0
##$YL= 0
##$YMAX_a= 190432
##$YMIN_a= -279961
##$ZGOPTNS= <>
##$ZL1= 120
##$ZL2= 120
##$ZL3= 120
##$ZL4= 120
##$ABSF1= 10
##$ABSF2= 0
##$ABSG= 5
##$ABSL= 3
##$ALPHA= 0
##$AQORDER= 0
##$ASSFAC= 0
##$ASSFACI= 0
##$ASSFACX= 0
##$ASSWID= 0
##$AUNMP= <proc_1d>
##$AZFE= 0.1
##$AZFW= 0.1
##$BCFW= 1
##$BC_mod= 2
##$BYTORDP= 1
##$COROFFS= 0
##$CY= 11.3945322036743
##$DATMOD= 1
##$DC= 2
##$DFILT= <>
##$DTYPP= 0
##$F1P= 18.9103706918063
##$F2P= -1.10871071338519
##$FCOR= 0.5
##$FTSIZE= 0
##$FT_mod= 4
##$GAMMA= 1
##$GB= 0.15
##$INTBC= 1
##$INTSCL= 1
##$ISEN= 128
##$LB= 0.24
##$LEV0= 0
##$LPBIN= 0
##$MAXI= 10000
##$MC2= 0
##$MEAN= 0
##$ME_mod= 0
##$MI= 1.114404
##$NCOEF= 0
##$NC_proc= 0
##$NLEV= 6
##$NOISF1= 3.799351
##$NOISF2= 2.8
##$NSP= 1
##$NTH_PI= 0
##$NZP= 0
##$OFFSET= 15.70392
##$PC= 1
##$PHC0= -8853.785
##$PHC1= 13.80025
##$PH_mod= 1
##$PKNL= yes
##$PPARMOD= 0
##$PSCAL= 0
##$PSIGN= 0
##$REVERSE= no
##$SF= 200.130013532006
##$SI= 16384
##$SIGF1= 3
##$SIGF2= 2
##$SINO= 400
##$SIOLD= 16384
##$SREGLST= <1H.CDCl3>
##$SSB= 0
##$STSI= 0
##$STSR= 0
##$SW_p= 3612.71676300578
##$SYMM= 0
##$S_DEV= 0
##$TDeff= 0
##$TDoff= 0
##$TI= <>
##$TILT= no
##$TM1= 0
##$TM2= 0
##$TOPLEV= 0
##$USERP1= <user>
##$USERP2= <user>
##$USERP3= <user>
##$USERP4= <user>
##$USERP5= <user>
##$WDW= 1
##$XDIM= 8192
##$YMAX_p= 0
##$YMIN_p= 0
$$ End of Bruker specific parameters
$$ ---------------------------------
##NTUPLES= NMR FID
##VAR_NAME=  TIME,          FID/REAL,        FID/IMAG
##SYMBOL=    X,             R,               I
##VAR_TYPE=  INDEPENDENT,   DEPENDENT,       DEPENDENT
##VAR_FORM=  AFFN,          ASDF,            ASDF
##VAR_DIM=   8192,          8192,            8192
##UNITS=     SECONDS,       ARBITRARY UNITS, ARBITRARY UNITS
##FACTOR=    0.0002004,     1,               1
##FIRST=     0,             0,               0
##LAST=      1.6414764,     0,               0
##MIN=       0,             -279961,         0
##MAX=       1.6414764,     190432,          0
$$ Real data points
##PAGE= N=1
##DATA TABLE= (X++(R..R)), XYDATA
0@%%%%Lj1J6j6J6k4L3m1N3o2P5r7J20j40J64j95K30k70L16l64M18m81N51o29P13
29C78q05R08j024J150j287J440j606J787j988K208k449K713l003L323l678M077
45B144m519N013n572O212o953P813q833J0065j1588J3530j6100J9682k5059L4146
59A9981n3423J63540j80697j23564L64595j92746q1405K27047j34023j74429K65156
70A00032m4253j90092J58344P236j72097J75338K2442k09970J32655J02421k10919
81a28863R3371J44434k12310Q941K13469j34145q2661J51957m0769m8448Q8617
92E3593q4618o879J44092j14932p7639J80624o9488j12669J87919n8197j91387
103a49581K23547O6459k68845J02494J59613k01009L7224J59696j84891p210J86043
$$ y = [0, 0, 0, 0, 0, 3, -8, 8, -8, 8, -16, 17, -24, 29, -33, 42, -55, 65, -75, 89, -106, 124, -146, 170, -194, 224, -257, 294, -335, 378, -427, 481, -543, 607, -680, 760, -846, 941, -1047, 1161, -1288, 1425, -1578, 1745, -1933, 2144, -2375, 2638, -2934, 3278, -3675, 4138, -4695, 5370, -6218, 7312, -8788, 10894, -14165, 19981, -33442, 130098, -50599, -174163, 190432, -2314, -83719, 143328, 9305, -165124, 100032, 55779, -134313, 24031, 31267, -140830, 34508, 56950, -153020, -20365, 82056, -128863, -35492, 108942, -103368, -94427, 119042, -15103, -97764, 54193, 13424, -35024, 53593, -31025, -37904, 106188, -8744, -86383, 94241, 24753, -87916, 100003, 41806, -149581, 73966, 140425, -128420, -25926, 133687, -67322, -30098, 129598, -55293, -62503, 123540]
114A23540j45085l4541J88008j66146q7206K77121r5694k24584K27845K8819k29176
125a37099J72774Q1479k70930J00506J97436k15128l2530J76589j15195l2879
135g4977J38024j13927l1922J59320j13288o6217J95464q3204j35225J97341o849
146F4540j74839J51841N2382j79515J00126R3303j62481N1137J06725j36099K2827
157a0053R8354j24694L2309J11787j70308L044K02686j51727j13673K13518n3095
168C8148j53349J72808k140j77969J40652O3582j74553P9402Q1772j49580O4341
179a6886R6468j56654M2343J24546j64495J3798J82593j64699q0951K25504p1871
190B9696j52299J72148j848j50729J35498L0692j55819J04856O2839j50276P9146
$$ y = [123540, -21545, -56086, 131922, -34224, -121430, 155691, 59997, -164587, 63258, 92077, -137099, 35675, 117154, -153776, -53270, 144166, -70962, -103492, 73097, -42098, -74977, 63047, -50880, -82802, 76518, -36770, -102987, 92477, 9273, -125952, 71389, 64540, -110299, 41542, 93924, -85591, 14535, 107838, -54643, -3506, 103219, -32880, -10053, 88301, -36393, -4084, 107703, -62605, -59561, 143125, -8602, -122275, 91243, 38148, -115201, 57607, 55467, -122502, 18150, 81732, -92821, -13419, 68353, -81227, -16886, 79582, -77072, -34729, 89817, -74678, -60880, 121713, -42986, -123937, 101567, 29696, -122603, 49545, 47697, -103032, 32466, 63158, -92661, 12195, 75034, -75242, 3904]
201C904Q2705j54674O1349J13767j69478K7285J71936j64344n9566K08743q8502
212C3125j30821J71140j7469j40772J25761J6736j32927R8915K7964j35042R2958
223I568N5979j51009O6835Q9529j51446M3503J28802j59056j6287J77149j04240
234a0673q4414J52399m3595q9193J24360k7592r2279J18864j6628j08526J27023
245D9746O957j47369J17087O0137j70724P8183J11571j75569K2734J61198j44181
256c0230m9550J69085q4032q5040J45288m9386r3030J38734l2894j19751J43879
267E3073R414j58383J17622O5913j70105P2887J12817j64647J3973J49164j25923
278b4195m4546J43818p5764o8935J22876m6377p3500J10911l7784q3369J21405
$$ y = [3904, 86609, -68065, -6716, 107051, -62427, -35142, 136794, -27550, -87116, 121627, 33125, -97696, 73444, 55975, -84797, 40964, 57700, -75227, 23688, 51652, -83390, 9568, 65547, -85462, -18627, 70902, -80544, -37041, 91761, -67295, -83582, 93567, -10673, -95087, 57312, 13717, -75476, 48884, 21292, -70987, 47877, 31249, -77277, 49746, 56703, -90666, 26421, 86558, -84166, -5983, 105588, -69981, -47247, 113951, -30230, -79780, 89305, 5273, -79767, 65521, 16135, -76895, 61839, 28945, -90806, 53073, 62487, -95896, 21726, 87639, -82466, -9579, 103238, -61409, -47436, 101728, -24195, -68741, 75077, -687, -69622, 53254, 6877, -66623, 44288, 6504, -76865, 44540]
289D4540j9100j18936J17673K8574j38853Q5216O8282j37987M9746R7815j25260
300d8290J0329J12912r9559j5765J10919q5374k8392J21356q4407n6969J46729
311H3489o0517j09324J50014p248j46204J20786M6541j57868P8760Q8611j49114
322f2074L2698J13836j26892m413J23328j05403l0301J33258q7953o3054J46590
333F9620n7726j04844J43669o875j37229J11785M5237j37698O8814P0850j24397
344e8794L8911Q9463j11654P806R8597r2450r194J02022q8087k9829J23552p0971
356f28p0653J27832l1819r7463J11767L053j11502R0023L3179j13023O6685N2751
368F0202j13960N0428P4937j17810K3973J00863j10078p308J20723r8779m5751
$$ y = [44540, 25440, -93496, 24177, 52751, -86102, -886, 67396, -70591, -20845, 76970, -48290, -37961, 74951, -24608, -40373, 70546, -14828, -43220, 78136, -6271, -63240, 83489, 22972, -86352, 63662, 56414, -89790, 30996, 77537, -80331, -1571, 87040, -62074, -29376, 84460, -42432, -46845, 76483, -28920, -59221, 74037, -13916, -76970, 69620, 11894, -92950, 50719, 43844, -93385, 18400, 63637, -74061, -5247, 65603, -58794, -19883, 69580, -42074, -34268, 64329, -28121, -37315, 64707, -23380, -53209, 70343, -628, -71281, 56551, 24732, -72731, 39036, 42089, -69413, 20610, 53789, -59234, 7451, 60202, -53758, -3330, 71607, -46203, -22230, 78633, -31445, -38753, 81970, -16809, -62560]
379f2560J41517o4620r3585J30637j5941j09555J05412J1157j20334R0848M4103
390E7079j29540O0063P2987j23890L4420R6893j19501o64J22592r7098l9784J29972
402F3529o6028p2311J28291k8507r6312J07242N020j00823Q8504K3885j10454
413e7964P3854N3930j17117M2876P7656j06953J5985R2093r9928j2311J10582
424G2703p9373m6454J10310n0729o6402J04858k8245q3850R8323k279r8281Q6544
436A7125K4672j12073O8009N7670j14217L7932P9339j05177J3120R8411r7081
447c2270k0152J15730p2306n2635J15283m4956p5088J11913j8182r7722J01704
458C1319J6024j13391P8242N0197j15576M7988P4082j08498K1018R1711r8895
$$ y = [-62560, 78957, 14337, -79248, 51389, 35448, -74107, 31305, 42462, -77872, 12976, 57079, -72461, -12398, 60589, -63301, -28881, 68012, -51489, -52153, 70439, -26659, -66443, 63529, -2499, -74810, 53481, 24974, -71338, 35904, 40924, -59899, 28605, 52490, -57964, 15890, 69820, -47297, -4421, 73235, -33718, -17733, 74360, -25568, -37879, 72703, -6670, -53124, 57186, 6457, -59945, 44913, 16668, -67182, 31141, 28862, -69419, 17125, 41797, -70276, -2267, 55403, -58814, -20882, 58457, -46720, -33600, 64811, -32270, -52422, 63308, -8998, -61633, 53650, 8694, -66394, 45519, 27337, -70385, 31319, 47343, -66048, 12194, 62391, -53185, -5197, 68885, -39613, -18595, 73116, -25779]
469b5779p702J07946q1944m1185J12667n2807o6483J05847k7228q5202R7453J489
481C7072j01282P7410L1154j02911N4931M9253j00274L7093O7950r7909J5783
492c1730Q5883r0395j1339J03589p1073m3545J06280m3737o2864J01001k1802
503B0268q2240R3488Q074r5614P3313L0981r8018N7883N1382j06324L7254P9721
515G0168j04185L649J01428q5374l1690J09085n7768n9635J02745k7797p6326
526e5700R1686n150q7545P9421J9073r6592O1397M0619r9281M5179O3441j04798
538d8250J6903R2049q9320k1245R7982o1378m1550R4169m0668n7926Q9715j9348
550A1133o8831Q2915k700q1173P8659K1236r6218O3278M9649j02232L7362P6846
$$ y = [-25779, -33481, 74465, -7479, -48664, 64003, 11196, -55287, 50560, 23332, -61870, 35583, 37072, -64210, 13200, 44354, -58557, -3626, 45627, -54647, -17554, 50396, -47513, -31730, 54153, -36242, -47581, 56008, -15065, -58610, 47670, 3933, -58931, 42070, 20268, -61972, 31516, 39590, -56024, 17289, 48270, -49748, 8135, 59517, -46807, -9553, 70168, -34017, -30368, 71060, -14314, -46004, 63081, 5313, -54322, 48423, 20626, -55700, 35986, 30836, -56709, 22712, 41785, -54807, 6590, 47209, -52072, -6893, 56548, -48250, -31347, 60702, -28618, -49863, 48119, -13259, -54809, 39360, -1308, -59234, 30481, 11133, -57698, 25217, 22517, -58656, 20003, 41239, -54979, 8299, 57948, -44284, -6922, 69924]
562F9924r7003K717R3956p4414k7630R0327n2472m0975Q7583m1587n8452R0920
574D2894k1017p8462Q3699K982r2958P4196L2560j07139M7779O8159r8252J2293
586c3266Q1230p7607j1165Q5596n9220k8375Q3828m5783l8944Q8597l6779o2416
598e4304R3447q574q6215P8895K2043r7314N8828N0711r9496K5154P3067p8693
610b2451k709P1116o3133j0336P5952o0571k7955Q8263m6368n0662R2533k4876
622A8803p7132Q9699R201r5609O3114M0975r1261L5521N6276q2244J3833O4100
634D5276o8126j100O4974o5979p726Q1703o4638l8090R7459l6586o7943Q8654
646B7878n686q1321P4649K3422q9260M8120M5849p6325K7660M7264p2265K2305
$$ y = [69924, -27079, -24362, 69594, -4820, -32450, 57877, 5405, -35570, 52013, 10426, -48026, 42894, 21877, -56585, 27114, 30096, -62862, 11334, 43894, -63245, -15466, 52693, -45559, -33266, 47964, -29643, -40808, 44788, -14432, -42807, 41021, -4762, -43706, 44891, 8112, -54304, 39143, 30569, -55646, 23249, 45292, -52022, 6806, 57517, -41979, -16825, 56242, -22451, -25160, 45956, -17177, -27513, 48439, -12132, -40087, 48176, 1808, -48854, 43679, 18803, -58329, 31370, 40571, -55038, 8076, 49051, -42210, -6689, 49587, -32657, -18824, 45276, -22850, -23950, 41024, -24955, -32681, 49022, -15616, -53706, 43753, 7167, -60776, 27878, 22192, -59129, 15520, 38942, -50318, -2198, 43651, -32674, -5014, 42250, -30015, -7710]
658g710O0248p5776L683P6573p1632j9561R5510n7156n8505R8086j6271p7925
670e0436P2654Q488p8708N7559K7621p9596L7159L9928p1384K8897M6127p8305
682c9996J9232P1234p9304j0810R1746n9097m5497R3191k5765o6679P5811J952
694B6018o9341N6475J6396o5901M6015K1824o8692M1717L6851p7825K9387N7695
706E0619q1793O866Q3277p1363l2757R1793l5623n3893P3342j4212n7364O3934
718B2826l76o1109N4548P683o6923N5807K4522q4018M2061N1348q6274J8021P6672
731E4788p9806j9632R0990m4473m5758P2822k2536m5956O7031j2659n4039O0464
743B1236j855n9753O3302J0989q1508N2213M5076q5470K3682O4803p8005m237
$$ y = [-7710, 52538, -23238, -19555, 57018, -14614, -34175, 61335, 4179, -54326, 43760, 27489, -50436, 22218, 30706, -48002, 9557, 37178, -42418, -5259, 34669, -36715, -7818, 38309, -39996, -20764, 50470, -28834, -39644, 52102, -6995, -52492, 40699, 14934, -51745, 24066, 26018, -43323, 13152, 29548, -36353, 9662, 31486, -37206, 4511, 41362, -36463, -7076, 50619, -31174, -24308, 58969, -12394, -45151, 46642, 11019, -42874, 30468, 16256, -41108, 22826, 22450, -38659, 15889, 23572, -43351, 12456, 36978, -47040, -4979, 46369, -39905, -21884, 54788, -25018, -44650, 46340, 1867, -43891, 28931, 6395, -39561, 27470, 14811, -39228, 21236, 19381, -40372, 22930, 33919, -47589, 4624, 49700, -35770, -12088, 52715, -25290, -29527]
755b9527Q1170n5076l4865O9913k7219l4608N8296k6925l8696O6733j8418n6699
767d5921O8040J601p3533O0034K9195q5405L7636N8492q0071K885P1783n4779
779a0043j8189O3412l9658k4263O2007l1222l2260O1448k8766m2148P5911j3902
791B2327p6272O6531K6731p8551L7739L9962p5824K2095O3121o4179j1883N7733
803B9530l8048p125N0429m8951j6720P0917l7988l8673P2080k5673n9056P8549
815B9271O119q3996M9744L8328p1377K5523M3188o5738J2335N3858n4804l668
827b1217N2526m8529n722O2667n3081k7484Q3340l2356o2185P6735M590p1922
839d2638N2403K4669p1299L5143M2145o2161J1068M1308m8506J2163M3568n8842
$$ y = [-29527, 51643, -3433, -38298, 31615, 4396, -30212, 28084, 1159, -37537, 29196, 10778, -45921, 22119, 23720, -49813, 10221, 39416, -45989, -8353, 50139, -29932, -27047, 44736, -10043, -28232, 35180, -4478, -28741, 33266, 2044, -30216, 31232, 2466, -39682, 36229, 22327, -53945, 12586, 39317, -39234, -1495, 38467, -37357, -15262, 47859, -16320, -28203, 29530, -8518, -15643, 34786, -14165, -30885, 40032, 2044, -36629, 35451, 9778, -49278, 29271, 35390, -48606, 1138, 39466, -31911, -6388, 36800, -28938, -16603, 37255, -17549, -21217, 31309, -17220, -22942, 39725, -13356, -40840, 42500, 10144, -52041, 24694, 29284, -42638, 9765, 34434, -36865, -1722, 40423, -21738, -10670, 30638, -17868, -5705, 37863, -20979]
851b0979m96O2268m8859k0110O7066m2245m2574Q0079r743p1085N1585J9392n4433
864c0134L6159J7226n8677L1373L3943n4261J8403L3185n7230J9774N4545o5855
876b1549q613P3880m7249l5150P6507k3822n6813O4560M443n9563M4717J3714
888B5062n4088L7361J9344n9409L4176L3845o7751J9676N3268o4482o68O6633
900D2967n6683k7093P9574k8116n4333N9580q23m6448M5960Q13n0350M3953J3819
913B2820n2307L6402J9227o1631L4300M4147o8828O212N9991n2776j2364O4848
925D0041m0975l5261O3502j3215m1497M4532q952l5949M9347o714n2192N0666
937A3333J2919o3406L9074L3252o8637K0618N3919o2780n340O4262m2922k5512
$$ y = [-20979, -21475, 40793, -8066, -28176, 38890, -3355, -45929, 34150, 24407, -46678, 4907, 24299, -30134, 6025, 23251, -35426, -4053, 29890, -24371, -5968, 27217, -30013, -10239, 44306, -21549, -30162, 43718, -3531, -38681, 37826, 14004, -42809, 21751, 26194, -33369, 11348, 25062, -29026, 8335, 27679, -31730, 2446, 36291, -31460, -11784, 41484, -22998, -23666, 42967, -13716, -40809, 38765, 10649, -43684, 15896, 15073, -31375, 14585, 15398, -34952, 9001, 22820, -29487, 6915, 26142, -35489, -1189, 42958, -25870, -19658, 40333, -12443, -24807, 40041, -934, -36195, 27307, 14092, -27405, 17127, 8175, -27774, 21573, 14859, -37333, 13333, 26252, -37154, 1920, 35172, -33465, -12847, 41072, -21708, -27048, 37214, -5708, -31220]
949c1220N9016k5259l1660N2827j6832l7027N1314r361m4814N3540J699o3380
961d1157M8735L1269p0023K0612M6873n6782N092N3398n0700j5354N9263k9804
973A422k5580M6740k4671k3715N4376k2034m2689N7218l287n5273N1619J5118
985B9244o7100L5201M0466o1306R415M5193m7689Q05M8155m3826j2828N2951l1647
998b966k1045N0190k8664k9538O1824j8329n4436N8863J1515o3163L7208K8313
1010B9772n8355K2515L8994n3309O256M4645m2655k410M5383m1770j1064N6080
1022C4082l4273k8925N8293k0873m2382N9336k847o1191M6050K4796n8378K2478
1034c834K8945m8682J8230L4851n1748N129M5308m2850n346M8230m0209j7775
$$ y = [-31220, 27796, 2537, -29123, 23704, 6872, -30155, 21159, 11798, -33016, 20524, 22223, -41157, 7578, 38847, -31176, -10564, 36309, -20473, -15381, 38017, -12683, -28037, 31226, 1422, -24158, 22582, -2089, -25804, 28572, 6538, -36151, 21067, 17780, -37493, 14126, 29244, -37856, -2655, 37811, -23495, -14080, 31113, -16576, -15771, 32384, -11442, -24270, 28681, -2966, -24011, 26179, -2485, -32023, 29801, 11472, -42964, 15899, 27414, -35749, 1459, 29772, -28583, -6068, 32926, -20383, -14127, 30518, -12137, -14547, 30836, -10934, -21998, 34082, -191, -29116, 29177, 8304, -34078, 25258, 22411, -38780, 7270, 32066, -26312, -3834, 25111, -23571, -5341, 29510, -22238, -17109, 28199, -14651, -19997, 28233, -11976, -29751]
1046b9751N9852k8707l8922N8786p288m9643M8424J0151n3173L3669K3098m8424
1058b1928K2109K5912m6961J8936L5512n1875N572M9433m5496j1848N4361l5796
1070b069k5245N9119k2724m4043N3819L44m9823L8839J0013m7387L3788J7548
1082B2179n2600K6796L1117n4723J4441M5188n2777l700N6355m0214k2369N7655
1094B7348k4908l5384N4436q545m5285M5039O754m6273L4417J3864m6967L0571
1106E067K3366n3571K0177M0275n1366J011M8157m0639j2275N0244l0334k5893
1118b5781N0948j6318l5345M4063n673l8722M0162K526m4444L6186J3606n0940
1130b9732K8908K8794n5283J4488M3407m8138l714M8543l6880j5073N0066k8717
$$ y = [-29751, 30101, 1394, -37528, 21258, 13970, -35673, 12751, 22902, -30271, 3398, 26496, -21928, 181, 26093, -20868, -1932, 33580, -18295, -12723, 36710, -8786, -20634, 33727, -2069, -27314, 31805, 9081, -34962, 18857, 19201, -30622, 8217, 18230, -29157, 4631, 22179, -30421, -3625, 27492, -27231, -12790, 32398, -20379, -24079, 32276, -7938, -30307, 27348, 2440, -32944, 21492, 12947, -32338, 12701, 19455, -26818, 7599, 21463, -25504, 5067, 28433, -25138, -4961, 35314, -16052, -15041, 33116, -7523, -19798, 30446, 112, -25781, 25167, 8849, -26496, 17567, 11894, -26828, 13334, 15860, -28584, 7602, 21208, -29732, -824, 27970, -27313, -12825, 30582, -17556, -21270, 27273, -9607, -24680, 25386, -3331]
1142c331k6300N2838j6027l8362M7329k519m3172M2999P221n2498L6659K6197
1154C1034n6241J8854L9477m9860L697M6286m2043j0512M9304l1303k1131M9069
1166B6631k1858l1292M8584r369m0558M2202L027m5230L6532J4506n1202K6260
1178a767K9687m8924R651L6458m1071L87M0559l7851r612M6801k9365k2679M7503
1191A9777j8191l1130M6051o931m0876M2045O935m6488L3402K0006m9258K2296
1203b362L2218m6412Q562L8739m1471j553M5900l8083j5207N0633k5192k9500
1215b3728M7617j2891l7235M4424j555m6144L8317J3376n0204K6078K5991m8453
1227b4407J4296L4589m4894L077M2889l9358j0122M8476k9571k2794M8148j6139
$$ y = [-3331, -29631, 23207, 7180, -31182, 16147, 13628, -29544, 13455, 20676, -31822, 4837, 31034, -25207, -6353, 33124, -16736, -13039, 33247, -8796, -19308, 29996, -1307, -22438, 26631, 4773, -26519, 22065, 12696, -27862, 14340, 17367, -27863, 8669, 23175, -28027, -1767, 27920, -21004, -11353, 25105, -15966, -15579, 24980, -12871, -22483, 24318, -5047, -27726, 19777, 1586, -29544, 16507, 9576, -31300, 10745, 17680, -28808, 4594, 24600, -24658, -2362, 29856, -16556, -7994, 30745, -10726, -12279, 33621, -4462, -19669, 30964, 5772, -23728, 23889, 10998, -26237, 18187, 16632, -29512, 8805, 22181, -28023, -1945, 24046, -24407, -10111, 24478, -20416, -17339, 25550, -13808, -23930, 24546, -5025, -27819, 20329, 4190]
1239D190l1541M3459n909l6899M0293M731m4537L2443J8444m5889K0975K6483
1251B6243m3722J1254L5016m1933p93M2325l4234j3435M4521k5247k2466M3551
1263B1080j5552l0381M2696o281l9442L9837P748m6606K9966K1422m7157J8311
1275d359L0956m5069P089L9589m0907o684M4771l0093j8358M4126k0985k6716
1287b6640M5207j1228l7769M2360L451m4723L3404J7602m6552K1174K8204m2534
1299a8044R883L4423l9189l19M0631l2332j2102M1330k3594j8889M1901j8382
1311E317k8609M3504o366l9332L6744P945m2768K7146J7687m2934J8861K5166
1323B2361m1038R760L2456l8465K5L8656l3998j0571M3987k6169k2285M6838j6920
$$ y = [4190, -27351, 16108, 10199, -26700, 13593, 18324, -26213, 6230, 24674, -21215, -240, 26243, -17479, -6225, 28791, -13142, -13935, 28390, -5844, -19279, 25242, -5, -22471, 21080, 5528, -24853, 17843, 11562, -27880, 11957, 19705, -26901, 3065, 24487, -22670, -4359, 26597, -18472, -11383, 28206, -12701, -19385, 25386, -4707, -23065, 21061, 76, -26640, 18567, 7339, -30430, 11930, 15381, -29342, 4062, 21664, -24888, -3714, 24490, -18044, -8161, 26262, -12927, -13246, 27385, -4947, -17049, 24281, 687, -18202, 23699, 5317, -23292, 20212, 13846, -25486, 11258, 19203, -23565, 3581, 21268, -21666, -2805, 22361, -18677, -8917, 23539, -14926, -14901, 23755, -10243, -20814, 23173, -2996, -25281, 21557, 4637]
1336D637l4609M4902J005m3773L3146J3861m1393K3836K0197m2597J5867L0619
1348B5698m0861M137L6955l6181n664M2156k9798j8738M5816j8169l0791M3153
1360A7713m663l8203L4763Q856l9466K3931J4973l6819J9838K0071m0484J2848
1372f642L1592l8537m46L7078l2171r314M2277k6543k2943M4420j0747l3102L6222
1385A1144k52l3778L0662P137l6761K5645J4292l8815K1201K3825m4036J0150
1397i586L7367l8036o023M0618k9028j5525M3633k0978k8146M1198n480l2085
1409b2071L1950L25l2564L1285P057m0782K6867K0846m3999J5599L1710m1625
1421a5402J989M0700l2970j2928M1050k1728j9771L8625j3730k7728L5870l158
$$ y = [4637, -29972, 14930, 15935, -27838, 5308, 19169, -22224, 1612, 21809, -20788, -4921, 25698, -15163, -11026, 25929, -10252, -15916, 26240, -3558, -22296, 23520, 5351, -25440, 17713, 13050, -25153, 9610, 18466, -21000, 2931, 17904, -18915, 923, 20994, -19490, -6642, 24950, -13587, -14033, 23045, -9126, -18440, 23837, -2706, -25649, 18771, 8024, -25078, 11144, 10892, -22886, 7776, 14913, -21848, 3797, 18089, -20726, 475, 24300, -19736, -9586, 27781, -10255, -16278, 24340, -4688, -20213, 23420, 2442, -25704, 15494, 10014, -22071, 9879, 10204, -22360, 8925, 15982, -24800, 2067, 22913, -21086, -5487, 26223, -15402, -13413, 27287, -5683, -18611, 22439, 711, -19060, 19565, 5835, -21893, 13977, 10819]
1433A0819l0481K9917P90l4421L1626J1515m4934K0768K8898m1056M679L3425
1445B1545l3104m390L7122k5885j4513L6152j6745j8900L4144j1910k4708L5267
1457A4075m203l2143L3242M485l9545K9046J9681m4845J3297L2258l5292j03L1581
1470B1534k9502m994L5340k5187j4770L6414j7696k0579L7289j2614k9378L8325
1482A4182j43m0173L2104J5197m4155J9457K7138l8704N112L0217k9688j694L0875
1495A9725k7466p051L4979k3116j6393L7350j5283k5388L7580o145l4201L4650
1507I241P838m0982K2697K1289l5641R906K3639l0287N570K6164k9844K37L1392
1520B1219k8714p804L8562k2585k1150L9368j1015k9260L5975O88l7888K8401
$$ y = [10819, -19662, 10255, 11045, -23376, 8250, 19765, -25169, -4401, 24497, -16559, -11880, 21545, -11559, -15949, 21173, -4712, -19225, 16927, 182, -18718, 15426, 3516, -21192, 14075, 9872, -22271, 10971, 15456, -24089, 4957, 24638, -20207, -6910, 25348, -9944, -10047, 21534, -7968, -12962, 22378, -2809, -17579, 18835, 1139, -19440, 17849, 5235, -24143, 14182, 14039, -26134, 5970, 21167, -22988, -3531, 23607, -15097, -9985, 20232, -9456, -11150, 19725, -7741, -14792, 20187, -2929, -19322, 18028, 2745, -22643, 14937, 8792, -25409, 9241, 17079, -23903, -1206, 20083, -15558, -5652, 17987, -12300, -6730, 19434, -10410, -10173, 21219, -7495, -15299, 23263, 678, -20472, 18896, 7881, -21379, 14596, 15284, -22604, 5797]
1532E797J4879l6416J4715J8483l1216J0886K1715l2372N269K8471l2172k900
1544a4861L6569k7434j7293L9978j4265k7301L5881l133l3405L0538R144l5030
1556b0612J9713J5276k9944J4869J7333l1536J1486K5049l4245L695L5267l1140
1568d789j1349L9568j9300k2545L6484q956k8572L1091J526l0733K3536P377l0277
1581a6939J9923J2187l2907J6260J8849l4910R579L0734l5649n191L8637k2995
1593b422j7522L5251j3386k2340L2404m655k6661K6651J839k7166K4479O247l2335
1606a9616K1798J6038l6026J3666K6373l6002O48L6636k7814j3098L5605j6383
1618A825j8625L1934r375k2687K9125l052k5660K7123K307l0753K4328J1625l5533
$$ y = [5797, 20676, -15740, -1025, 17458, -13758, -2872, 18843, -13529, -8260, 20211, -11961, -14861, 21708, -5726, -23019, 16959, 2694, -24607, 11274, 8141, -25264, 5274, 14418, -20612, -899, 14377, -15567, -698, 16635, -14901, -3415, 21634, -12611, -8916, 26351, -4789, -16138, 23430, 4130, -18415, 18069, 9113, -19459, 11632, 13158, -17575, 5961, 13338, -16939, 2984, 15171, -17736, -1476, 17373, -17537, -7958, 22776, -12873, -18064, 20573, -2422, -19944, 15307, 1921, -20419, 11985, 7330, -19331, 7320, 9159, -18007, 6472, 12719, -19616, 2182, 18220, -17806, -4140, 22233, -13769, -13121, 23515, -4299, -17397, 18208, 1825, -16800, 15134, 5759, -16928, 12197, 9145, -16515, 10608, 12915, -17838, 6490, 18115, -17418]
1631a7418J7410K2669l7296N205L1949k9494p873L1869j9467j3931K9784j3292
1643A15j7610K8148r188k0508K9220m596k8143K8962O370l3584K1635J6841l5963
1656a8301J2322K7941l2094r63K9460k2628n915K8337k0501j1259L0828j4806
1668B421j7542L1067j0275k5321L2906L74l4767K5992J3644l6170J5381K2883
1680B0593l3351M103K7499k5833l455K6452k1354p063K8784j8953j3669L1705
1692A5458j2517k3653L1718k100l0372K6950P918l3943J8641J8847l1375O715
1704g713K1929k4546L272K2471k4265j973K7809k0698p983K9102j7688j6405L4394
1717A7706q167k7587K8614L192k9449K2283R873l1531J4096J8426k7535O138J8419
$$ y = [-17418, -8, 22661, -14635, -9430, 22519, -6975, -14848, 17021, -2446, -16377, 13407, 115, -17495, 10653, 1465, -19043, 10177, 5581, -22562, 6400, 12770, -20814, 821, 17662, -18301, -5979, 21962, -10132, -11095, 18365, -4263, -10178, 18159, -2342, -13601, 17227, 2421, -15121, 15946, 5671, -19650, 13256, 13630, -21137, 4855, 18499, -17671, -2290, 20593, -12758, -8655, 18844, -6989, -10444, 16008, -5346, -12409, 16375, -2578, -16247, 15458, 2941, -20712, 11006, 8906, -21466, 5484, 13402, -20541, -1900, 16947, -14428, -7713, 14216, -10330, -7058, 15413, -8852, -10825, 16984, -3714, -11697, 17405, -283, -16688, 17706, 9539, -18048, 10566, 13758, -15691, 6592, 16465, -15066, -970, 17456, -10079, -3941, 14478]
1730A4478k6304N397K4511k8269m944L2210k0845j4308L2703j3346k2852L2412
1742A0843j974k9644K4870Q541k8122J6735J2684k7481J3116J7373k8001P011
1754d049K1552k6244J466K7372k5998r781L3970j5343k0069K8115o143k1938K6004
1767H914M88k7339K0102R170k4974J4846R897k6066J4725J8230l0181M799K6230
1780A8841k5125m113K9554k0234j3648L0630j0108k0918K4948k942k1917K2957
1792G925J143k6024J9425R115k6883J4336J3654k8886J1098K3093k9869j280K9764
1805A6611j9738j0793K7659j3777j4191K7276p644k0237K4735r78k2328K1824
1817H419K701k6187J9612J1033k9317J2169J8634k9129M871K4809k5225n994K7940
$$ y = [14478, -11826, -6429, 18082, -10187, -15131, 17079, -3766, -18074, 14629, 1283, -21569, 10843, 8869, -20775, 4095, 12636, -15486, 1249, 13933, -13548, -432, 16941, -11060, -4049, 17503, -8741, -7275, 20097, -5901, -15682, 18288, 2945, -17124, 10991, 4848, -17090, 8914, 9402, -17937, 2165, 11335, -13639, 1207, 11104, -14962, -237, 17993, -12188, -7389, 18841, -6284, -10397, 19157, -1077, -14725, 15905, 5797, -15121, 9827, 6885, -15032, 7925, 9068, -16956, 2469, 11584, -15299, -963, 12691, -16195, -5097, 17996, -11873, -13153, 16611, -3127, -13920, 13739, -38, -14229, 13047, 5403, -14834, 9901, 8923, -13405, 8419, 11120, -15067, 4545, 15578, -13739, -1570, 17064, -12065, -7194, 17615, -7610, -13604, 14336]
1830A4336j6162j1961K4589j1520j3953K6388q211k0846K5615O14k4734K1514
1842E669O153k7252J7544J5094k9725Q095K2679k5466q64K4349j9927p063K4380
1855A3666j4896j0988K4340j0963j6043K5399n457k2492K3752L262k6356J8304
1867A528J0619k7306J3087J7517k7186M503K2758k1153k939K2582j7673o067K4546
1880A4816j5132j3271K6463q411j9767K4996j521k3657K1099O553k6442J5000
1892G26J3443k6142Q372J8951k3703J356K1881k0015l196K2455j7471q365K6275
1905A4567j2797j7044K6589m863k1901K1694K263k3661J8019Q145k5459J2387
1917b061J4880k4042N469J8247k1423P18K1826j9582m867K4913j5831j1756K6380
$$ y = [14336, -1826, -13787, 10802, -718, -14671, 11717, 3506, -17340, 8275, 8889, -15845, 5669, 11822, -15430, 2114, 17208, -12517, -4422, 18257, -7209, -8073, 16276, -3651, -10714, 13666, -1230, -12218, 12122, 1159, -14884, 10515, 5058, -17434, 6318, 9580, -16776, 1528, 12147, -15159, -2072, 15445, -11741, -7238, 15520, -5633, -8572, 14010, -3663, -9730, 14816, -316, -13587, 12876, 4465, -15302, 9694, 8173, -15484, 5615, 12168, -14274, 726, 14169, -11973, -3601, 15350, -8353, -6997, 14884, -5131, -8327, 14128, -3343, -11708, 14567, 1770, -15274, 11315, 6452, -15449, 6245, 8508, -15153, 2866, 11011, -14448, -2061, 12819, -11223, -5754, 12493, -8930, -8212, 13614, -5968, -10835, 14078, -1753, -13509, 12871]
1930A2871q706j8732K3971r20k1595J9512M823k3492J5891J0671k5167R380J6399
1943A4906k3053L462J9080k1267j258K2986j8921q944K5575j1657j5783K3852
1955H978m727j9205K1281N83k1691J7829O855k3390J3003J2618k3197O723J8028
1968A3688k1630J368J9945j8768m691K4367j5166j2180K4089p839j5985K0845
1980H043k600j9000J9869K567k2709J6234R452k3509J0751J4120k2238N593J7800
1993A4373k0688j10K1166j7784o728K3756j3106j2694K2676o466j6975K0574j791
2006F203k0513J9502M411k3550J3380J1603k2665P485J5085k1852M004J9396j9750
2019g261l134K2281j4864r137K2420r540j3654K2497m329j8175J9955J983k1009
$$ y = [12871, 4165, -14567, 9404, 8484, -13111, 6401, 11224, -12268, 3623, 14294, -10873, -1493, 14906, -8147, -4685, 14395, -6872, -8130, 14856, -4065, -13009, 12566, 909, -14874, 8978, 4251, -14954, 6327, 6910, -14781, 3048, 9903, -13487, -484, 12134, -11063, -4340, 13688, -7942, -6574, 13371, -5397, -10088, 14279, -887, -13067, 11022, 3183, -12802, 8043, 5443, -13557, 6312, 8879, -13830, 2404, 11856, -11653, -902, 13218, -9020, -3427, 14373, -6315, -6425, 14741, -3043, -9771, 13985, 879, -11815, 10861, 4395, -12580, 7994, 6203, -14310, 5192, 9603, -13947, -567, 11036, -11629, -4144, 10941, -10911, -6907, 12489, -7261, -10395, 11886, -2978, -12115, 10305, 765, -12889, 9608, 5279, -12896, 7059, 9042, -11967]
2032a1967J6113P654k1939J0568J2903k0909N467J5852k0420J478J9961j8104
2044c343o450K2213j1871j1491K0715q077j4929K1230k449j9931J7726M708k0558
2057a2507J3178Q242k0889R449J3615k0807M358J7483j9354j278K1486j5799q349
2070a1172K2532j0039j2508K0791n781j6068J9586O83k0080J5366O551j9833J1288
2083A316R894k1233Q240J5706k1831J240J9706j7070m707K0773j3442r683K1248
2096A0157p403j4300J9099k583j7067J7661K465j9904J3788P729j9931J0374J1393
2109A1478k1486N142J8214j9388k387J9696j4090o886J9479j0058j1145J9775
2121H344n621j4779J7584n61j6673J6277L243j9654J3631R115k0799Q401J4052
$$ y = [-11967, 4146, 11800, -10139, 429, 13332, -7577, -2110, 13742, -6678, -5200, 14761, -3343, -9793, 12420, 549, -10942, 9773, 1696, -13233, 7997, 5548, -14383, 3343, 8051, -12507, 671, 8913, -11976, -2527, 11088, -9719, -5361, 12122, -7232, -8510, 12976, -2823, -11172, 11360, 1321, -11187, 9604, 3823, -12245, 7341, 8024, -12056, 3310, 9861, -9972, 1316, 11210, -10023, -1783, 13923, -7908, -6668, 13038, -4032, -8739, 12034, -1408, -11091, 10157, 2754, -11546, 7553, 4970, -12097, 5564, 8029, -11875, 1913, 9642, -10289, 85, 11478, -10008, -4866, 13348, -6040, -8427, 11269, -2821, -9707, 9772, -286, -11431, 8344, 2723, -12056, 5528, 4967, -11706, 4571, 7814, -11840, 1791, 10906, -9893, -1492, 12560]
2134A2560k0219K673J8118j6153m299J8657j1929p346J8671r834j1553K0072m874
2147D544j6111J7574K68j8616J5856N483k1406J0851J2451k0603M716J6098j7757
2160f652r34J7847j3436n430J7902j0638q049J9030q009j3090J9362k352j6626
2173a1075J6339K414j8986J3721P949k0139P476J3533j7506K050J4066j4810o76
2186e644J6143j3829m869J8076j0395r479J9391o679j4852J9284k51j8459J4759
2199C196O003j9839J0748J0881j8918M230J4037j5692R56J4683j5277k112J8330
2212A1226j2993q507J9584p515j3168J8921k572j7017J6011M020j8264J0849Q658
2225I233j7168O566J0610j6186M235J2389j5006O84J5371j5204l439J8850j1589
$$ y = [12560, -7659, -4986, 13132, -3021, -7320, 11337, -592, -7938, 10733, 899, -10654, 9418, 4544, -11567, 6007, 6275, -12341, 3515, 8998, -12408, -1557, 10894, -9709, -4993, 11105, -6652, -7586, 10261, -3175, -8605, 9297, -1341, -9390, 9640, 1631, -11459, 7903, 5551, -11075, 5264, 7678, -11308, 2413, 10362, -9777, -2301, 11232, -6274, -4224, 9842, -4968, -5644, 10499, -3330, -8199, 9877, -518, -9997, 9394, 2715, -12137, 7147, 6896, -11563, 3196, 9199, -10640, 108, 10989, -7929, -3699, 10338, -5354, -4398, 10285, -4992, -7104, 11226, -1767, -10274, 9310, 1795, -11373, 7548, 4976, -12041, 3970, 7990, -10274, 575, 9233, -7935, -1369, 9241, -6945, -2710, 9679, -5327, -4643, 10728, -4476, -7915, 10935, -654]
2238f54j0504J9027m815j4118J6803l47j6562J4475M509j7648J0118Q130j6052
2251g638P515J0238j7672M370J5450j7106k087J9510j3550q054J9523p447j3363
2264a0311J7077j680j4937J3931J944j6164J1690N670j6472Q015Q568j6355O197
2277b827J2147j7415J322J7468j4796n341J8545q829r829J7109m763j1661J5014
2290F144j240j3503J3120K006j5366J1738N611j7421R436J0166j8331M169J5110
2303A1639j7085k452J8669j1870q290J7035o671r966J5463m077j2122J5391m39
2316E225j5060J2931L844j5721J0327Q158j8407O366J3749j7006l48J6208j2697
2329b431n366J6046q886p714J4312o276q711J5106m248j2737J4927R71j5666J2478
$$ y = [-654, -11158, 7869, 3054, -11064, 5739, 5392, -11170, 3305, 7814, -9834, 284, 8414, -7638, -123, 10115, -7557, -3187, 12263, -4843, -6930, 12580, -970, -9024, 10499, 3052, -10311, 6766, 5086, -9851, 4080, 6024, -10140, 1550, 7220, -9252, -1237, 7331, -9024, -2827, 9320, -8095, -6773, 10695, -4101, -9442, 9103, 274, -9555, 7554, 2791, -8870, 6144, 4904, -8599, 4521, 6527, -8839, 2899, 8510, -8911, 525, 10691, -7640, -3471, 11639, -5446, -7898, 10771, -1099, -9389, 7646, 975, -8991, 6472, 2395, -9727, 5664, 5225, -9835, 3096, 6940, -8781, 1546, 9704, -8703, -2337, 11412, -5594, -5942, 10266, -2431, -7797, 8249, -637, -8351, 5961, -315, -9026, 6080, 1832, -10905, 4022, 4993, -10673, 1805]
2343A805N803j7348R301J0688j7552L739J4594j4051k313J5186j0173m507J4173
2356I345r213o901J6605p040j1605J6034j923j5226J4401L412j8352J0403R146
2369I086j7767N350J1915j5325K29J4505j1463l733J3623r553m361J5786r027
2382g35r512J7339m057j3177J4930J214j5710J1845O243j6305P127J0214j5269
2395e853L254J1958j3132p7J2600j1456k168J4390j0825o081J7121p746j1971
2408i986J7059j175j5808J3355L762j5582R555O742j5570O072J0407j4845K422
2421c592J1195j2757L55J3501j2769m236J7182r704r866J7630l778j4140J4383
2434C404J875j4127J0421M549j4140Q414P819j4623M692J0646j3849K267J2428
$$ y = [1805, 7608, -9740, -439, 10249, -7303, -3564, 11030, -3021, -5334, 9852, -321, -4828, 9345, 132, -6769, 9836, 2796, -8809, 7225, 5302, -9924, 4477, 7889, -10463, -60, 9086, -8681, -3331, 8584, -6741, -6512, 7993, -3470, -7203, 6420, -3133, -7494, 8292, -735, -10247, 7092, 3035, -10142, 4788, 6002, -9708, 2137, 8380, -7925, -798, 9416, -5853, -2599, 9359, -3773, -3850, 8750, -2706, -4874, 9516, -1309, -7390, 9731, 1985, -9986, 7073, 5898, -9910, 3445, 7207, -8375, 1180, 7922, -7648, -1576, 8831, -6014, -3592, 7603, -5154, -4799, 8702, -4067, -8303, 8879, -825, -10691, 6939, 3161, -10979, 3404, 5279, -8848, 1573, 6122, -8018, 396, 8215, -6408, -1716, 8930, -4919, -2652, 9776]
2447I776j3506j420J5841j1104p769J7085n905j2101J4938m03j3407J0923K357
2460E305j2755R545M491j4257O810Q929j4785M197J0833j4066Q13J4560j3027
2473c407m742J6232p507r608J4672l181j1101J1898K1j1689J0992J988j3110J0290
2487A748N137j4952O786R989j4906K549J2966j3545j548J5580j0621o752J5677
2500H108n000j0045J3050k478j0537J2872j088j3160J1657M044j5122Q581P624
2513H506j6157N061J1930j4576o67J3868j1005m045J4489q466p659J3748l635
2526A392r304J1995k604j0525J3206Q09j4442J0289O650j4691O276R496j4289
2539e742K704J2249j2251j952J3744r146m921J2899p251o685J3505n450r805J3827
$$ y = [9776, -3730, -5150, 10691, -413, -8182, 8903, 2998, -9103, 5835, 5432, -7975, 2948, 5305, -7450, 2095, 6586, -7671, -861, 8068, -6717, -2520, 8313, -5753, -4940, 9620, -3407, -8149, 8083, 576, -9032, 5640, 2459, -8642, 3256, 3277, -8412, 2580, 4568, -8542, 1748, 6885, -8067, -1281, 8708, -6198, -3649, 9317, -4228, -5776, 9804, -817, -7569, 8108, 3108, -6937, 6113, 3635, -6902, 5970, 4882, -8278, 3379, 7423, -7699, 882, 8506, -7651, -2590, 9340, -5236, -5903, 7965, -3040, -7085, 7404, -1062, -8721, 5027, 1392, -7912, 4083, 1479, -9046, 4160, 4969, -9473, 816, 7466, -7225, -949, 8547, -5742, -3038, 9211, -3040, -4992, 8752, -394, -5315, 7584, 333, -6352, 7153, 1703, -8102, 5725]
2553E725j903j2753J2302L412j5793R061Q370j5427M247J0434j3032J250J2686
2566H579j1971l009J3895q796n131J3000o686p972J4887l455j2779J3274K030
2579E866j4622R976N859j4625O242R005j3183K609J0572j2010K22J1953j0243
2592b379l522J3495q222o590J4386o133r279J4291j744j2896J1533L699j3643
2605g004P677O247j3156N648Q672j3429K291J1198j1455j099J2410j0143m621
2618f764J4453p500q646J4645l667j1712J3107J158j3813R963M410j2905P034
2631b37O706j3227M925R455j3045J439J1852j0558k947J3672r249n956J4564n432
2645A962j0013J3196r61j1598J0564J979j2115Q419N052j3236O346P731j3325
$$ y = [5725, 3822, -8931, 3371, 6783, -9010, 51, 8421, -7006, -2759, 7675, -5357, -4107, 8579, -3392, -6401, 7494, -1302, -6433, 6567, -119, -8091, 6796, 3341, -9438, 3836, 5866, -8756, 1220, 7079, -7546, -1304, 7701, -5482, -2873, 7699, -4311, -4089, 7864, -2379, -5901, 7594, -628, -7218, 7168, 1035, -8244, 6047, 4303, -8593, 2940, 6639, -7004, 673, 6920, -6236, -588, 8084, -5345, -3054, 8144, -3311, -4410, 8000, -2143, -6764, 7689, 189, -8457, 6188, 2521, -9191, 3916, 5074, -8739, 1224, 5634, -7271, -237, 6469, -6758, -1833, 7622, -5423, -3984, 7868, -2690, -5637, 8035, -1214, -7170, 7394, 1962, -8051, 5145, 4184, -7414, 3150, 5129, -6986, 1433, 6485, -6751, -405, 7326, -5999]
2658e999L601J0168j2199m97J2624j0099l591J3371p500p670J3849l545j0274
2671g761J1518j5j1138R917K556j2807R031N632j3769N722R109j3090J821J1746
2685H472j1717j798J2886q921n524J3412n724q676J2695k568j0707J1617O77j2031
2699g907J0498K937j3514P667P961j3741L491J0486j2008RJ1863j0252l140J3371
2713G721p734o771J2967m077r263J2151j070j1326J1110J780j2594Q567N333j3291
2727f497N457Q570j2950K306J0406j0785q96J1414r199m207J3257o452p915J2440
2741D949l057r407J1955j060j1333J0259L597j3590P836O674j2900M482R145j2047
2755d497R87J1304j0779k029J2819q541n691J3121n048q813J2599k174j0932J1821
$$ y = [-5999, -2398, 7770, -4429, -4926, 7698, -2401, -5992, 7379, -121, -7791, 6058, 2513, -7761, 3757, 3742, -7396, 2521, 5077, -7730, 1301, 6933, -6836, -1114, 7995, -5095, -3274, 8472, -3245, -5043, 7843, -1078, -6602, 6810, 1086, -7590, 5105, 2537, -8170, 3447, 4124, -7907, 2591, 5528, -7986, -319, 7642, -6099, -2608, 7878, -4130, -4121, 7742, -2510, -5650, 7721, -13, -6784, 6183, 2106, -7157, 4994, 3924, -7402, 3708, 5488, -7106, 1461, 6794, -6497, -1040, 7530, -5420, -3114, 7292, -3493, -4389, 7025, -2174, -6381, 6876, 424, -7491, 4949, 1892, -7515, 4440, 3380, -7953, 2306, 5903, -7687, 149, 6823, -6077, -1595, 7550, -4497, -3510, 7794, -2985, -5014, 7805, -736, -6427, 6694, 1646, -7167, 5432, 3258, -7674, 4147]
2769D147N36j2256R543M497j2781N394P759j1873K503R543j1300L8J1952j0116
2783b414l583J2765o881o384J2163m076r049J2380j200j1047R822K460j2553Q210
2797F13N863j2904N422Q316j2228J718J0797j1166j308J2660q871n223J2730n250
2811A169p669J1689k997r705J1821O99j1992Q575M159j1912O754O208j2531L934
2825a798R399j1803L26J1358r702l046J1845p241n807J1952m589p973J1357k048
2839B230j0140J1102J448j2619Q448N222j2006N383P633j2344L010J0367j1156
2852c422j078J1619q244l515J1394o777o307J2773l752r654J1783n52j0867R591
2866B992K829j2131P019O355j2555M431P849j1326J091J0807j0276k268J1318
$$ y = [4147, 4683, -7573, 1970, 6467, -6314, -920, 6839, -5034, -2531, 7012, -4288, -4250, 7702, -2414, -5997, 6768, -113, -6497, 5666, 1590, -7459, 4921, 3721, -7326, 2496, 4956, -7597, 613, 6476, -6428, -1006, 7310, -4918, -3200, 7597, -3569, -4877, 7783, -1088, -6311, 6419, 1169, -6500, 5189, 2192, -7513, 4308, 5007, -6985, 1590, 5749, -6163, 591, 6799, -5732, -1798, 7601, -4202, -3876, 7482, -2220, -5266, 6579, -662, -6469, 5483, 894, -7079, 4278, 2230, -7910, 3192, 4640, -7979, 469, 5691, -6315, -932, 6701, -5643, -2633, 7734, -3422, -4500, 7119, -1125, -4640, 6754, -23, -6330, 6443, 2691, -6963, 4820, 4268, -6599, 2992, 5821, -6310, 709, 7064, -5491, -1060, 6789, -4537, -3446, 7361, -2915, -5183, 6135]
2879F135p765m227J1488n752p632J2650k571j0429J1018J220j1474Q196M594j2323
2893f872O286P230j1573K757R036j0514K13J0749r176l047J1643o672o151J3033
2907F942n072q929J1948m69j1277R232K810j1246O540N326j1441M759P513j1602
2921d966K502R285j0518m28J0936q737m072J2157n992p202J2103k992r635J1186
2935C627J96j0421Q305L128j0845O299N608j1675M605Q303j1451J011J0380r951
2949b881j866J2017q212n735J2615m104q678J1356j005r937R275J982j0988P415
2963A254M526j1626O030O543j1551K913R222j0738n16J0754q360l934J1522n799
2977B40o808J1264k773q331R734q17r312R123J496j0906P614M881j1528M937P617
$$ y = [6135, -1630, -5857, 5631, -121, -7753, 4897, 2326, -8103, 2915, 4135, -7339, 857, 5451, -6872, -586, 6644, -4929, -2172, 6864, -3650, -3437, 7312, -1864, -4911, 6732, 60, -6091, 6942, 1870, -7059, 4889, 4420, -6857, 2375, 5185, -6061, 479, 5805, -5636, -877, 6636, -4966, -2464, 6821, -3697, -4125, 6811, -1926, -5998, 6159, 167, -7035, 5068, 2076, -7559, 3627, 3823, -6598, 1707, 4835, -6010, 289, 5897, -5778, -1173, 7130, -4321, -3310, 7070, -2881, -4747, 7270, -942, -6677, 5938, 1834, -6844, 4512, 3507, -6430, 2845, 4827, -6161, 1254, 5780, -5846, 184, 6727, -4824, -1911, 7311, -3427, -3943, 6811, -1549, -5483, 6039, 240, -6568, 4696, 1923, -6408, 3326, 2509, -6803, 2320, 3816, -7090, 524, 5405, -6123, -1186, 6431]
2992F431j1478J983J0316j0043k034J1831p808m621J1322m543p178J0744k329
3005B593q256R625j39j0235Q824L073j1812O603O530j1831K946Q932j0795k21
3019d163J0567q774l201J0828n767n354J0566m337o789J0563j930r204R919J124
3033D048j1058Q280M260j1570M916Q004j0953J671R162r353r90J0374p682m291
3047e182J1070n488n620J0919m043q644J1257l02j1111R087L531j1492O109O073
3061F164j1433L073Q427r961L44R079p971j737R693o816m092J0629n242o225J0751
3076D683k535r228J0064J022j0706P016M901j0283M658O203j0511K863Q312r683
3090c224K14R472q598j940J0828p510n057J1649m140q307J0833o00j0270R099
$$ y = [6431, -5047, -3064, 7252, -2791, -4825, 7006, -802, -5423, 5899, 1356, -5822, 4922, 2593, -5663, 3962, 3823, -6412, 2412, 5485, -6327, 276, 6806, -5025, -2079, 6853, -3942, -4163, 6404, -2370, -5571, 5257, -510, -5864, 4702, 365, -6424, 4139, 2209, -6995, 2924, 4048, -7010, 1270, 5530, -6040, -1124, 6880, -4073, -2402, 6760, -2593, -3583, 6791, -891, -5182, 5888, 400, -5220, 5699, 1656, -6988, 4269, 3967, -7144, 1943, 5474, -6018, 91, 6164, -5269, -2196, 6231, -3730, -3386, 5693, -2278, -4015, 5678, -1138, -5230, 5399, 157, -6068, 4683, 2148, -7080, 2984, 4006, -6700, 316, 5217, -5066, -408, 5795, -4716, -1853, 6459, -3224, -3010, 6462, -2136, -4076, 6752, -758, -5815, 5834, 1694, -6613, 4220, 3620, -6650, 2449]
3104B449K907j1047N838M915r881M043O622j0340J955Q822r132j177J0174p580
3118a432l681J1113o096o688J1088j494r198Q770J238r326O792L117r483N582
3132C02M413r169L279O847r804J490R227q952j965J0444o844m596J0889m226p479
3147f144J0301p80r051P999J656q944O864L211j0844O003N711j0740K738Q506
3161F486r693p19J0380p931l953J0472m942o274J0124k300p954Q837j2q228P325
3176A618J719r052O682M358j0913M312P810r716P48Q685q228j840R816n928m530
3191d459R644m314n801R055k170p125Q293L12r294P681K825j0585N910N774j0789
3206e043K639Q851r877j54R259p236l152R966n602n012R816l140o680Q947j155
$$ y = [2449, 5356, -5691, 147, 5062, -4819, -776, 5846, -4494, -2539, 6283, -2849, -4026, 6148, -1432, -5113, 6000, -96, -6784, 4304, 2810, -6388, 2382, 3620, -5706, 1086, 4203, -5280, 302, 4715, -4454, -1175, 5672, -4132, -2642, 6585, -2367, -4332, 6112, -732, -5328, 5561, 1335, -6144, 4157, 3377, -5674, 2325, 3981, -4963, 1901, 5112, -5732, 271, 5982, -4758, -2020, 6486, -3207, -3926, 6454, -1477, -5430, 5042, 100, -6174, 3950, 1650, -6304, 2533, 2521, -5707, 1618, 3337, -5715, 967, 5325, -5588, -1276, 6534, -3182, -2434, 6251, -1977, -3817, 5999, 71, -4459, 5185, 871, -4930, 4125, 1955, -5170, 3123, 3435, -5859, 1822, 4647, -5938, -28, 5746, -5043, -2404, 6447, -3430, -3584, 5675, -1561, -4713, 5253, -349, -5361, 4455, 1315, -5365, 3582, 2427]
3221B427q188Q710J156j0424P058M688j0383M030O878r388P72Q366p816j128Q393
3236E151o444l441R610m664n409R194k872o712Q768l1r353Q334K432j0277N449
3251b65N786r884K731P444q588L19Q014p832j068R092o374l857R311m344n817
3266e332R310j957q105R090N17r524O735L894r574M009N570q549J776P050p979
3281c069R9Q696p761k130R781n808m855R788l548o901R163k62q793P500K688r283
3297d695M969M469q602L011N894q672J817P458q342q86R075o778l276R375m428
3312C89o228R777j765q037Q056J303r020O604L080q566M485M691q639K969O431
3327E530q810M88Q726p726k460R543n416m613R174l349o713Q593o38p627P013
$$ y = [2427, -5761, 2949, 4105, -6319, 739, 5427, -4956, -926, 5952, -3436, -2664, 5702, -2114, -3242, 5151, -1293, -4734, 4876, 212, -5197, 3997, 1125, -5587, 3181, 3150, -6203, 2131, 4563, -5714, -265, 5521, -4363, -1632, 5812, -2776, -2457, 5557, -2275, -3343, 5749, -625, -4482, 4829, 485, -5332, 3978, 2021, -6084, 3006, 3523, -6001, 734, 4628, -4946, -937, 4633, -3916, -2140, 4910, -3069, -2970, 5726, -2035, -4165, 5616, -192, -5047, 4741, 1193, -5708, 3455, 3193, -5600, 1900, 4588, -4695, 274, 4743, -3859, -848, 5046, -3626, -1809, 5649, -2693, -3579, 5496, -1282, -4558, 4817, 389, -5839, 3938, 2173, -5864, 2192, 3495, -5525, 1079, 4159, -4407, 78, 4769, -3870, -901, 5530, -3280, -2792, 5934, -1792, -4252, 5291, -125, -4738, 4436, 1087, -5626, 2967, 2329, -5298, 1715]
3342A715J625q377N662L367q697M366N361r034K393P376q249n86Q766o433l603
3357d348R304m356n199R117l158o514Q116L1p979O704J798q141N397L485q992
3372d735L725O612r320J168P879p446j650Q487n402m110Q890l722n428Q512j452
3387B008p321P731M76p974O182K640q570M702M872q544J927P387p911n73Q283
3402E315o338k440Q475n221l732Q565l308n944Q105j167p060P222J190q730O232
3417A164L478r106M166N571q666J107P484p698r33P755n546k785P901m397m951
3432e456Q533j819o502P441K28p642O572K474q830N154M441q123K435O352p423
3447b165K58O922o837j206P818n119l666Q500l506n948Q332j136p112O921R71
$$ y = [1715, 3340, -5037, 625, 3992, -4705, -339, 5022, -4012, -1619, 5757, -2492, -3078, 5688, -745, -4348, 4956, 600, -4599, 4518, 1360, -5154, 2962, 2993, -4986, 1718, 3516, -4625, 772, 4257, -4735, -1010, 5602, -3718, -2550, 5329, -2117, -3767, 4720, -682, -4792, 4098, 376, -5052, 3460, 2008, -5313, 2418, 2894, -5080, 1102, 3742, -4828, -126, 4746, -3798, -1871, 5516, -2395, -2968, 5315, -1023, -3463, 5012, -209, -3941, 4624, 1316, -4628, 3477, 2310, -4750, 2472, 3662, -5068, 1164, 4642, -4464, -298, 5273, -3393, -2286, 5198, -2500, -3433, 4322, -1224, -4009, 3892, -505, -5456, 3077, 1258, -5244, 2197, 2425, -5217, 1355, 3829, -5001, 153, 4594, -3529, -1094, 5258, -2165, -1907, 5015, -1822, -3028, 4790, -329, -3995, 4505, 999, -4949, 3383, 2247, -4865, 2056, 3027]
3462C027p722N670L173q859M102N494q223J612O238p024m8P342o069k461Q504
3477D756m481m630Q028k500o117P979p25p898O374K456q167N191L545q056L047
3492a198N494p643J022O669o951p20Q180n842k938Q552l697n048P667j289o200
3507c942P019N76p596N743K701q258M080M309p745J936N842p563O41O792o531
3522a996k104Q010m840l960P829k802n221P592j262o407O594J133p516N368L419
3537C837p888L797M707p339J667O045o817p25P937n711k502P258l543m454P414
3552C683k360n613P255k59p293N869K367p332L989L798p615K480N703p430O66
3567b092O056n790j247P491m859l707P864l186n018P637j798o154O476J185p449
$$ y = [3027, -4695, 975, 4148, -4711, -609, 4885, -3338, -1726, 4512, -2512, -2560, 4782, -1287, -3748, 4756, 275, -4355, 3673, 1173, -4944, 3035, 2310, -5588, 786, 3242, -4925, 266, 3811, -4245, -1198, 4296, -3347, -2325, 4344, -2607, -3327, 4853, -989, -3927, 4625, 928, -4120, 3547, 2258, -3942, 3077, 3653, -3943, 1800, 4501, -3757, 323, 4632, -3113, -1177, 4665, -2898, -2257, 4535, -1996, -4100, 3910, -930, -4890, 2939, 137, -5084, 2508, 1246, -5161, 1433, 2566, -4950, 418, 3837, -4051, -254, 4453, -2886, -1219, 4826, -1991, -2716, 5221, -490, -2992, 4266, 723, -3731, 3683, 1323, -4290, 2965, 2706, -4587, 1282, 3649, -3683, 306, 4104, -3511, -1031, 4672, -2758, -2092, 3964, -1826, -3073, 4418, -441, -4148, 3716, 530, -4488, 3149, 1351, -4803, 1673, 2858, -4591]
3582d591M897K895p141L205M358p498K156N978o868m9O771n544j806P305l817
3597B51m143P690k206n291O970m76o964O314J849p507M537K840p189L002M535
3612D212p201J516N971o504j052O977n057k066O830l400m625P455j668o171O478
3627A695O8o065N117K088p164M196L544p146K563N189o830K54O871n875j524O772
3643C753l841l528P100k467n028P263j281n851N895R31o749N071K316p111L863
3658C36M314p236J340N850o326n91O725n366k191O933l771m002O795j893m864
3673c947N801k61n775N061J410o718M783K941p174K623N171o598P21O007n423
3688a378j321O783m617k669P214l332m097O424j031n486N838K50o155M868K155
$$ y = [-4591, 306, 3201, -3940, -735, 3623, -3875, -1719, 4259, -2609, -2658, 4113, -1431, -3237, 4068, 251, -3892, 3798, 1592, -3699, 3271, 2795, -4169, 2145, 3994, -3513, 1024, 3864, -3325, -323, 4212, -2989, -1473, 4498, -2006, -3058, 3919, -1138, -3204, 3626, 226, -4399, 3056, 1388, -4783, 1695, 1763, -4302, 815, 2903, -4261, -65, 3479, -3667, -1104, 4085, -2745, -2491, 4380, -1495, -3019, 3753, -88, -3616, 3484, 1017, -4011, 3252, 1971, -3880, 2015, 2946, -3803, 1268, 3584, -3527, 336, 4650, -2586, -1246, 4604, -1722, -2313, 4412, -954, -3145, 3788, 17, -3985, 2810, 917, -3947, 1854, 1593, -4182, 879, 2289, -4429, 354, 3295, -3879, -1256, 3915, -2683, -1962, 4045, -1378, -2699, 4084, -533, -3202, 4012, 680, -3417, 3007, 1976, -3510, 2328, 2578, -3577, 1291, 3446]
3703C446o990L601M041o964J409N776o259m3N735m957j827O679l766l437O790
3718C234k106m952O049m91n585N373R15o584M626K992p149K451N374o195N3N644
3734C649n368j075O051m151k128O379l146m271O720j506n026N706R4n999N069
3749I98K023p035L993M010o581J776M418n543N38N126m968j054O503m303k894
3764b993O539k617m754O418r82n475N656Q77o733M490K670o314K342M227o056
3779b705J228M730n133m2N462n012j902O951l554l565O487k331m457O099j12o127
3795c983N219J776o471L940K704n838K154M166n987Q32N551n748m59O323m466
3810b87k987O469k558m510O502j188n464N852L57n886M239K729o324K840L134
$$ y = [3446, -3544, 57, 4098, -2866, -1457, 4319, -1940, -1983, 3752, -1205, -3032, 3647, -119, -3556, 3234, 1128, -3824, 2225, 1734, -3851, 1522, 2437, -4147, 479, 3471, -3678, -1227, 4147, -2048, -1995, 3649, -1719, -2794, 3257, -894, -3022, 3357, 211, -4060, 2660, 1154, -3872, 1834, 1928, -4071, 998, 3021, -4014, -21, 3989, -2592, -816, 3602, -1941, -1403, 3723, -1245, -2299, 4204, -99, -2993, 3546, 929, -3825, 2593, 1611, -3864, 1792, 2669, -4064, 426, 3096, -3218, -876, 3351, -2705, -1477, 3253, -1880, -1922, 3540, -1472, -3374, 3577, 23, -3542, 2945, 614, -3843, 2256, 2144, -3983, 1236, 3012, -3459, 481, 3185, -2653, -499, 3667, -2320, -1488, 4063, -1685, -2144, 4179, -287, -3274, 3195, 637, -3873, 2629, 1441, -4023, 1829, 2186, -3700, 539, 3268, -3056, -216, 2918]
3825B918o191K772M441o320N99N531m935j482O243l706l207O145k147m283N776
3840B154p27n349N324Q23n839M017K531o415L197L452o047J060N890n995j053
3855b977O535m111k497O425k853l764O120j096m623N307Jn703M556J690n820L346
3871E36L012o592K584M130n870M02N439m856j702N908k710l491O161k754l828
3886c631N866j081n233N281O67n543M353K138o434L320L659o206J429N258n378
3901a535l74N156l778k077N867l169k951O124k185m644O038n37n124M914Q74n981
3917c382M158K976o366J882M479n618K48N105m380j097N051l782k318N760k627
3932H9l590O071j704m724N280N54n928M531J770n964L239L393n972J766M773n481
$$ y = [2918, -3273, -501, 3940, -2380, -1781, 3750, -1185, -2667, 3576, -130, -3337, 2808, 661, -3622, 2154, 1427, -3922, 1402, 2225, -3614, 403, 2934, -3481, -284, 3168, -2879, -1819, 4071, -1924, -2977, 3558, -553, -3050, 3375, 522, -3242, 2878, 1782, -2841, 2466, 2467, -3236, 1320, 3010, -2810, 536, 3548, -3044, -460, 3670, -2200, -1798, 3641, -1215, -2917, 2991, 281, -3210, 2951, 197, -3631, 2235, 1154, -4079, 1202, 1869, -3674, 679, 2817, -3617, -297, 3362, -2844, -1415, 3843, -1535, -1909, 3247, -531, -2608, 3259, 90, -2861, 3263, 1078, -3566, 2472, 1935, -3189, 1725, 2599, -3382, 776, 3752, -2614, -732, 3747, -1871, -1623, 3482, -898, -1995, 3056, -726, -3044, 2716, 89, -3501, 2570, 866, -3858, 1422, 1976, -3952, 579, 2349, -3615, -376, 3017, -2955, -1189, 3584, -1897]
3948a897J00M963m275r99N028l349k513O199k505m082N665o06m887M722R62n589
3964c063L407K790n713K165L750n243O22M660n039j40M952m249j502N968l219
3979A46l537O193j885m414N356K07n500M307J595n660L042K755n194J547M124
3994C082n359P48M307m491q71N911m254k476O283k339m023N516o16m686M802R74
4010B508n354M049J792n362K849K992n285J614L807n150O15M459m170j678N629
4025C315l276l282N551j794m024N074j34n251M822M06m946L563K448n455K389
4040e94L509n827J752M333m777p27N980l777k482N397j980l534M863o71m430N309
4056B344n72m982M386J357n204K921K756n554J986L676n152N31M926m609j239
$$ y = [-1897, -1797, 3166, -1109, -2108, 2920, -429, -2942, 3257, 752, -3330, 2335, 1729, -3158, 1564, 2526, -3063, 344, 3134, -2579, -414, 3336, -1907, -1285, 3375, -1664, -1804, 3148, -1101, -2603, 3365, 146, -3391, 2802, 917, -3497, 1859, 2066, -3434, 873, 2468, -3192, -150, 2605, -2589, -1042, 3082, -2277, -1529, 2778, -1713, -2584, 3327, -927, -3403, 2880, 541, -3482, 2034, 1418, -3268, 1534, 2508, -2846, 1203, 2995, -2367, 482, 3474, -1811, -197, 3610, -1540, -925, 3534, -636, -2314, 3315, 39, -3243, 2308, 514, -3510, 1564, 1430, -3821, 1001, 1407, -3539, 24, 2472, -2983, -594, 2915, -2912, -1160, 3173, -1604, -2331, 3649, -128, -2610, 2787, 807, -2727, 2136, 1465, -2965, 2344, 1772, -3210, 1176, 2533, -2671, 250, 3006, -2548, -562, 3114, -2038, -1507, 3419, -1190, -2429]
4071b429N411l070k595N061k100l219N265j154m161M613L44n231L641J995n458
4086c087K686L303n486J133M344m843k03N192m042j439N180k792l066N660j871
4101F69l919N007k44m852M522J200n368L454K562n295K391L217n099N59M391m184
4117i89r66M812l108j787M679k206l116M801j202m184M619N25n186L884J781n493
4133c136K844K946n206J572L996m711O9M765m346j142N592l762k037N271k622
4148I3l096N546r23m908M576R12m816L030K318n241K266L326n128J086M392m577
4164a144o90N046l847j369N246k977l248N504j431m044M584l2m625M176J010m966
4180b807K817K491m987J785L408m796L44M570l963j115M863l154k234N286k049
$$ y = [-2429, 2982, -88, -2683, 2378, 278, -2941, 2324, 1170, -2991, 1622, 1966, -3265, 376, 2371, -3087, -401, 2902, -2584, -1451, 2893, -1950, -2153, 3039, -1003, -2442, 2738, -54, -3120, 2540, 669, -3250, 1757, 1513, -3339, 1183, 2383, -2985, 469, 3031, -2264, 127, 3344, -1755, -1196, 3195, -989, -1955, 2857, -251, -2038, 2641, 435, -2681, 2120, 918, -3266, 1353, 1878, -3308, 576, 2357, -3136, -292, 2654, -2552, -980, 3016, -1695, -1626, 3139, -1207, -2349, 3243, -519, -2556, 2715, 93, -3003, 2543, 1620, -3288, 1288, 2200, -2616, 414, 2732, -2509, -243, 3083, -2045, -959, 3433, -1144, -1834, 3212, -635, -2004, 3242, 265, -2983, 2521, 1090, -2954, 1630, 1598, -3027, 1149, 2159, -2807, 10, 2501, -2486, -701, 2707, -2089, -1745, 2825, -1138, -2253, 2610, -544, -2778, 2508, 459]
4195D59l493M824l59m451M444M78m669L731J936n342K421L032n178J137M179m985
4211a836J2M950m263j127N058k915k728M983j271m120M966j30m492L730J129m753
4227b807K959K485n058K068L311m707O50M190m526n97N268l691k142M982k104
4242B81l024M643j125m181M972j71m507L912J128m977L120K511n021J567M125
4257C253n135M33M608m297q05M981l052k516N227k069l265M387k91m303M156R30
4273B242n291L483K127n184K405L047n187J142L925m523rM552l484j438M755k690
4289a28k700M733q10l876M291j84m199M090J080n083L065K160m643J552L422m612
4305a842M87M566m455p40M867l261j837M696k370k638M613j221l791M185N51m499
$$ y = [459, -3034, 1790, 1431, -3020, 1424, 1902, -2767, 964, 2900, -2442, -21, 3011, -2167, -1030, 3149, -1836, -1824, 3126, -1137, -2264, 2794, -121, -2849, 2134, 863, -3257, 1709, 1579, -2913, 817, 1946, -2807, 152, 2637, -2421, -353, 2958, -1749, -1099, 3091, -1435, -2032, 3236, -455, -2597, 2385, 281, -2743, 1900, 775, -3406, 1566, 1395, -3112, 800, 1928, -3049, 71, 2582, -2439, -872, 3253, -1882, -1449, 3159, -1138, -1943, 3038, -14, -2530, 2697, 628, -2637, 1750, 1459, -2844, 1312, 2242, -3049, 434, 2561, -2623, -218, 2829, -2358, -1216, 2709, -1814, -1823, 2729, -755, -2193, 2562, -128, -2828, 1905, 1095, -2781, 1510, 1326, -2873, 1217, 2297, -2786, 279, 2439, -2204, -652, 2770, -1842, -1355, 3211, -1244, -1984, 2883, -378, -2215, 2481, 111, -2527, 2086, 865, -2926, 1259, 1810, -2689]
4321b689L377J511m733K667K568m927J537L792m262k34M503m065j232M942k592
4336A63k861N156j845l377M677o04m265M289N19m737L508J417m482K331K794m687
4352b004R69L530m108l97M604k988j951M701k499k503M917j282l718M539j46m516
4368b852L880J304m820K337K811m997J748L450m087J15M138l911j006M270k733
4383c53k121M555j878l085M590r11l653M002M83m370L310J450m634K534K894n129
4399b316J307L709l964l83M054k941j335M484k607k316M777j624l251M032p4m260
4415b708L687J361m770K624K028m331J947K789m613N83M287m022n77M250l072
4430e37j365M600k375k950M574q08l672M060l7l996L025J433m664K801K227m633
$$ y = [-2689, 688, 2199, -2534, 133, 2701, -2226, -689, 3103, -1159, -1393, 3110, -955, -2187, 2755, 163, -2698, 2458, 613, -2764, 1913, 1309, -2956, 1333, 1852, -2885, 623, 2040, -2442, -111, 2683, -2004, -1035, 2495, -1613, -2010, 2594, -394, -2345, 2356, -143, -2646, 2271, 989, -2729, 1810, 1664, -2852, 1028, 2332, -2488, -151, 2660, -2337, -589, 2861, -1226, -1111, 3027, -884, -1890, 2380, -353, -2474, 2081, 203, -2882, 1708, 797, -2856, 1146, 1629, -2741, 569, 2019, -2615, -81, 2813, -2316, -1009, 2700, -1264, -1647, 2407, -534, -1869, 2615, 8, -2308, 2469, 845, -2406, 1626, 1552, -2708, 979, 2340, -2430, 194, 2222, -2109, -162, 2627, -1986, -1403, 2884, -1138, -1715, 2535, -537, -1902, 2698, 323, -2627, 1947, 1139, -2533, 1527, 1490, -2506, 519, 1952, -2712, 89, 2316, -2317]
4446b317J314L673l885J7L914m081n75M573l187j777M882j955l348M508l86m058
4462b688L752K29l739K708J894m449J860K976m140Q32L534m219J8M214l489j267
4478a974M568k523k450M473j104l416L740K20l869L208J057m480K605K347m538
4493b136J494K996l995L75L833l841q33M363k750j875M894k344k912M468q30l794
4509b887M088k3l489L318R89m293K270K488m158J131L306l933R7M081l863j131
4525b009M468k301k611M114j286l034M244o67l714L602O03l844K673J702m049
4540b109J547K989m023K67L973m005m40M472l217j630M287j350k890L806r38k964
4556b225M063l33m058L363J310l825K109J877m057J304L008m152K09M048l378
$$ y = [-2317, -1003, 2670, -1215, -1198, 2716, -1365, -1940, 2633, -554, -2331, 2551, 596, -2752, 1756, 1370, -2688, 1064, 1293, -2446, 262, 2156, -2293, -433, 2543, -1597, -765, 2769, -1450, -1432, 2782, -707, -1974, 2594, 71, -2379, 2094, 990, -2426, 1314, 1534, -2335, 873, 1930, -2550, 55, 2402, -2136, -642, 2354, -1641, -1266, 2567, -1274, -2107, 2256, -494, -2369, 2525, 181, -2731, 1737, 907, -2887, 1201, 1178, -2311, 1007, 1996, -2297, -27, 2461, -1697, -566, 2740, -1193, -1096, 2985, -878, -2009, 2459, 158, -2453, 1661, 375, -2659, 1585, 918, -2796, 806, 1409, -2435, 238, 1940, -2109, -562, 2427, -1596, -1329, 2644, -1361, -1801, 2671, -546, -2176, 2111, 761, -2129, 1677, 739, -2225, 1838, 1505, -2553, 810, 2120, -1705, 404, 2281, -1776, -472, 2536, -1616, -1407, 2641, -737]
4571g37j143M143k335j976L973j471k845L821o08l657M086L32l828K364J980m164
4587b065J937K451m137Q05L279l635m8L643k597j578L802j995k193M424j879k911
4603b697M034o6l799L466O60l864K542J819m186J831K793l892L78L667l285j215
4619a814M082k675j429M123k202k447M336j041l424L775J7l814K806J471m042
4634b278J999K304l820P48L609m093L98L378l189p54M090k635k012M393j830k680
4650b372M130o00l368K916J018l525K011J961m050J788K446l871O61L243l126
4665g38o96L444k711j027M054k331k114L849q49l212L255M14l426K469J173l654
4681b100J868K410m135J389K654l618K79L605l291o13L780k421j916M296j928
$$ y = [-737, -1880, 2263, -72, -2048, 1925, 454, -2391, 1430, 822, -2835, 1251, 1583, -2245, 119, 2099, -2065, -128, 2323, -1814, -1009, 2270, -1365, -1413, 2230, -367, -1945, 1857, -138, -2331, 2093, 214, -2697, 1337, 1271, -2528, 938, 1598, -2266, 276, 2095, -2091, -260, 2533, -1359, -981, 2686, -599, -1814, 2268, -407, -1836, 2287, 85, -2362, 1974, 933, -2491, 1284, 1301, -2513, 293, 1764, -2278, -279, 2025, -1795, -1047, 2562, -1531, -1133, 2245, -944, -1698, 2392, -243, -2255, 2138, 308, -2372, 1758, 1158, -2210, 706, 1724, -1801, 210, 2171, -1879, -91, 2355, -1516, -855, 2388, -738, -1434, 2010, -701, -1728, 2326, -5, -2119, 1730, 881, -2331, 924, 1338, -2088, 381, 1554, -2100, -232, 2178, -1957, -568, 2086, -1532, -1253, 2352, -939, -1552, 2228, -193, -2109, 2187, 259]
4696B59k639M016o57k975L015J83l107K254J350l679K050K329m012R73K692l383
4712a331J37L357k865j283M271k452j984L784r94k643L232k98k974K895P10l446
4728a884K227J482l667J377K800l622P02K887l064o68L764k720j637L683j664
4743dj963L271n56k803L216K1l351L009O28l788K478J988l691R82K659l441M17
4760i28L300k778j228L741k447j246L154j071k664L655o13l058L068K11l324K406
4776A78J621l629J926J769l628R58K610l086J68L052k590j099L460j713j880L206
4792A323n92k649L388p0l415L158P72l824J983K011l866J425K660l339K26K827
4808B018k729m87L203k424j094L191j352k403L553r85k904L491J16l478K463J662
$$ y = [259, -2380, 1636, 979, -1996, 1019, 1202, -1905, 349, 1699, -1980, 70, 2399, -1613, -640, 2052, -1331, -1194, 2163, -702, -1985, 2286, -166, -2150, 1634, 640, -2003, 1229, 931, -2043, 852, 1562, -1884, 343, 1825, -1842, -465, 2335, -1287, -585, 2302, -762, -1430, 2334, -386, -2023, 1660, -4, -1967, 1304, 748, -2055, 1161, 1182, -2169, 840, 1468, -2320, 158, 2146, -1545, -563, 2096, -1345, -928, 2372, -406, -1634, 2107, -340, -1586, 1568, 497, -2167, 1488, 875, -2183, 885, 1096, -2228, 178, 1799, -1830, 96, 1865, -1763, -805, 1805, -1281, -1113, 1939, -651, -1750, 1710, -3, -1883, 1323, 731, -1918, 1470, 1400, -2015, 1143, 1915, -1909, 74, 2085, -1781, -356, 2304, -1035, -809, 2018, -711, -1198, 2005, -419, -1513, 1678, 326, -2077, 1476, 491, -2413, 1078, 1194, -2284, 179, 1841]
4824A841l695J967J772l429R95K421l067J18K954k537j068L603j981j608L578
4839A864j620k171L054k26l319L452O09l608K234J640l605J271J900k856P15K652
4855A986l108p1L410k749q52L320j944j888L558p22l143L319j50l218K734R55
4871A437l120J793J543k985J041K584l435J85L020k676o47L325k105j341L136
4886A755j783k093L190k48k726K702J72l034K303J388l485K047J792l678J291
4901d07K005k625l4L382k686q43K928j736j793L288p85k474K830q8l096K816O25
4918A307k994J762J256k954J446K161l166M74K441k515q81L321k290r13L493j779
4934A69j999K950l89k482K731l21k079K033O44l049J692J998l266R37K459k985
$$ y = [1841, -1854, 113, 1885, -1544, -549, 1872, -1195, -1077, 1877, -660, -1728, 1875, -106, -1714, 1864, 244, -1927, 1127, 901, -2418, 1034, 1643, -1965, 269, 1909, -1696, -425, 1475, -1381, -666, 1986, -1122, -1193, 2217, -532, -1384, 1936, -8, -1896, 1662, 940, -2203, 1116, 966, -2252, 482, 1437, -1683, 110, 1653, -1332, -291, 2293, -1142, -957, 2063, -613, -1260, 2065, -40, -1381, 1755, -28, -2121, 1069, 821, -1905, 797, 969, -2065, 238, 1626, -1859, 188, 1980, -1698, -407, 1598, -1027, -1061, 2321, -365, -1208, 1720, -16, -1809, 1479, 694, -1780, 1050, 962, -2134, 682, 1307, -1687, 75, 1331, -1623, -177, 1984, -1182, -708, 1733, -782, -1663, 1658, -632, -1545, 1948, 169, -1830, 1120, 731, -1751, 980, 659, -1420, 613, 1257, -1792, -100, 1898, -1368, -431, 2028, -957]
4950i57j9L345k893o32K921j759j678K934q54k165K712j96k739K860K43l057K299
4967C65J149l292J564K061k806J75K429k201l32K488k117p20K836j615j517L060
4983A527q37k538K822pk896K608N63k939J920J220k942J050J966k624M74K267
4999A634k543j65K654j826j505L213j552j682L038j154j964K615J02k774K348
5014D39J138k749J068J924l015O70K264k511K81K259k170r93L066j758j447K836
5030A302q57j951K468k94k361K380L41k943J899J602l338J387J925k859P26K485
5046A912k706k30K703j984j081K875j546j677L275q31k260K541o2k480K121O48
5062A218k583J297J646k668P21J815k463K81K650k403o97K503j567r16K362j131
$$ y = [-957, -976, 2369, -524, -1156, 1765, 6, -1672, 1262, 408, -1757, 955, 759, -1980, 880, 1123, -1934, 365, 1514, -1778, -214, 1847, -959, -784, 1645, -556, -888, 1600, -517, -1237, 1599, -16, -1533, 1527, 690, -1848, 974, 967, -1929, 679, 1242, -1697, 223, 1443, -1499, -449, 1517, -1107, -633, 1634, -909, -1074, 1580, -246, -1751, 1462, -90, -1772, 1266, 112, -1852, 763, 865, -1909, 439, 1577, -1172, -104, 1820, -1195, -525, 1739, -772, -491, 1768, -402, -1395, 1671, -87, -1534, 1302, 445, -1506, 962, 668, -1693, 687, 1028, -1915, -16, 1586, -1752, -365, 1560, -1299, -573, 1912, -794, -1024, 1679, -305, -1386, 1489, -57, -1734, 1541, 710, -1550, 991, 929, -1551, 570, 1218, -1365, -68, 1578, -1090, -369, 1446, -1017, -736, 1914, -489, -1186, 1317, -250, -1166, 1196, 65]
5078F5j879K981k97k031J867K91k421J633J027k720J285J697k668L34K360k638
5094a114Q2K538j863r53K404j136j496K825j101j828K709n25k397K530O15k980
5110a690J782J032k546J145J746k469L71K365k249n43K648j850j509L100j122
5125B11j571K432m52k162K255L30k934K253Q22k726J794R25k306R62J653k602
5141a116M67K131k068q09K809j477j413K905j118j916K823j060j511J966M40k691
5157a638J628J414k791J189J561k347O54K104k543q9K439j691q05K347j476j233
5173a277K549p55j771K109o7k171J949jk015J309J479k757J210J610k518P01J748
5190A332k144l04K305j486q99K473j146j680K619m75k121K227M52k440J717R85
$$ y = [65, -1814, 1167, 870, -1161, 706, 997, -1424, 209, 1236, -1484, -199, 1498, -1170, -836, 1524, -1114, -1032, 1506, -357, -1310, 1094, -42, -1538, 1287, 186, -1642, 1067, 542, -1855, 675, 1290, -1690, 92, 1124, -1422, -277, 1469, -1000, -629, 1736, -513, -1056, 1592, -258, -1767, 1333, 211, -1360, 1072, 620, -1542, 713, 1043, -1891, 362, 1184, -1542, 252, 1177, -1129, -167, 1486, -1116, -649, 1482, -586, -1395, 1414, -63, -1476, 1429, 311, -1605, 1218, 158, -1353, 613, 1053, -1638, -10, 1404, -1387, -198, 1363, -984, -330, 1774, -769, -858, 1581, -110, -915, 1432, -44, -1277, 1272, 517, -1254, 855, 788, -1383, 566, 565, -1450, -141, 1338, -1419, -209, 1401, -1117, -416, 1332, -812, -1116, 1189, -297, -1196, 1277, 131, -1549, 1070, 595, -1526, 701, 1153, -1287, 430, 1415]
5206A415k973J798J263k782R16J445j723j78K128j563o38K013j377j099K272o78
5222B39j797K145j74j842J922N13k355J869Q25k612J095J762k443L76K162k325
5238f40m34K466j880n61K509j477j196K160m90j899K088j84j971J724R54k425
5254a256J332J306k760R40J803k055m3K188j721p64K566j490j252K474o76j655
5270a063K072l12j926J916N6k216J670J026k755J574J235k167L24J995k097NK114
5287A451k224k38K104r54j081K165r55j779K451m15k142K374N73l000J869J050
5303A249k237P17J525k099K56J882k006J15J866j503j086K857j607j168K082l02
5319E41k127K208k34j728J599R55k516J164J066j983P74J571j895l94K099j432
$$ y = [1415, -1558, 240, 1503, -1279, -363, 1082, -641, -819, 1309, -254, -892, 1121, -256, -1355, 917, 239, -1558, 587, 413, -1429, 493, 1006, -1349, 520, 1345, -1267, -172, 1590, -853, -477, 1685, -640, -1074, 1392, -488, -1049, 1460, -17, -1213, 947, 457, -1442, 646, 462, -1509, 215, 1169, -1256, 76, 1382, -1378, -438, 1365, -690, -733, 1455, -266, -1030, 1536, 46, -1206, 1268, 592, -1063, 1009, 697, -1229, 687, 743, -1473, 197, 1223, -1532, 42, 1277, -890, -566, 1429, -668, -663, 1451, -773, -1011, 1093, 139, -942, 1223, 268, -1511, 940, 525, -1617, 757, 1330, -1670, 199, 1249, -988, -271, 1254, -845, -589, 1293, -713, -598, 1268, -235, -1321, 1536, -71, -1239, 843, 541, -1586, 622, 388, -1340, 259, 1214, -1302, -138, 928, -1055, -281, 1290, -605, -999, 1100, -332]
5335c32n96K336j465j208K352r60j496K312o66j405J812L35k239J465J009k114
5351h60O00J692k443M78J983k253R8J886j085j412K428r58j429K309q85j466K057
5368G40k62j850K019L63k512J463P80j975J137J398k300O01J694j613p21K660
5384A622j784r85K242p50j601J910k11j737J661N23k022J531M76j860J097P41
5400H53j933N75J664j908J33J762j828k81K167j255j239K318o71j761K049j40
5416E05j713J586N70k127J883M62k454J423J477k433L39J816j979m14K310j672
5432d21n43J925q17j168K052p83j596K388m63j947J752R35k530J038J683k492
5448i87P17J629k186j5J829j481m73K180j581o92K216r68j633K156m63j716J997
$$ y = [-332, -928, 1408, -57, -1265, 1087, 127, -1369, 943, 277, -1128, 684, 1019, -1220, 245, 1254, -860, -260, 1432, -1011, -533, 1450, -803, -705, 1181, 96, -1316, 1112, 154, -1275, 1034, 149, -1317, 740, 478, -1372, 647, 1010, -1502, -39, 741, -1234, -97, 1301, -999, -398, 1296, -317, -1038, 1622, -162, -1147, 1095, 345, -1256, 654, 443, -1294, 367, 890, -1132, 399, 875, -985, 112, 853, -1080, -505, 1159, -749, -616, 1146, -682, -963, 1204, -51, -1290, 1028, 357, -1404, 645, 505, -1208, 378, 948, -1179, 704, 1166, -1288, 135, 1612, -821, -482, 1334, -645, -1059, 1251, -421, -964, 961, 144, -1024, 1028, 245, -1351, 1037, 574, -1373, 379, 1314, -1216, -178, 1505, -987, -270, 1359, -827, -842, 987, -494, -967, 1213, -368, -1060, 1156, 188, -1445, 711, 248, -1468, 529]
5465E29J38j941J484Q05k180J159J044k153N19J566j973N84J812j497p95K097
5481A198j187r61K100o75j482J752k4j912J822N51k428J375J235k216N93J786
5497A527k335P26J476j867l6J720j598q52K045p33j180K258q00j811K235K98k259
5514a186J636N05k147J255J118j758K74J482j547m0J964j842p24K201j180j336
5530a325K515r75j489J936j55j748J449M90j848R27J459k332P66J463k191O39
5546d19J306j580Q1K223k087o86K322q04j173J373j83j431K079n02j719J735K89
5563H24j675P21J252k161Q15J577k192N7K161j920k97K136j327r46K029o14j327
5580h87J682m47j918K556m6k388J873N11j958J002J202k192Q02J264j714J17J799
$$ y = [529, 667, -1274, 210, 1015, -1165, -6, 1038, -1115, -596, 970, -1003, -419, 1393, -104, -899, 1198, 11, -950, 1150, 475, -1007, 745, 721, -1191, 631, 1182, -1246, 129, 1364, -852, -259, 1527, -808, -82, 1394, -473, -509, 1211, -387, -1239, 806, 73, -1107, 1151, 351, -1460, 775, 1073, -1186, 450, 955, -1192, 63, 1181, -577, -303, 1179, -368, -408, 1556, -286, -1010, 1191, 11, -1325, 1190, 215, -1274, 662, 507, -1241, 208, 698, -1150, -223, 1236, -1096, -330, 1133, -1058, -419, 887, -693, -612, 1611, -476, -1162, 1160, 356, -817, 556, 373, -1058, 1021, 519, -1200, 535, 824, -851, -130, 1122, -1039, -224, 1353, -839, -782, 1379, -541, -838, 1298, -29, -975, 1054, 440, -887, 795, 348, -1570, 986, 940, -1448, 425, 936, -1022, -20, 1182, -1010, -208, 1056, -658, -541, 1258]
5597A258j525o84J787r72j073K536j011j747K097j45j747J699L90k157J367J124
5613A197k194O82J446j933M07J567j567m64K138j309r02J897o89j557K390o17
5629D92j838K100k55j694J615K89j831J268R05k073N77J674j852j50J901j694
5645e66k89J840q93q96J999j088j576K485l54k161J804N57j971J398N74j923O43
5662d17J491k050L85J643j161o95J933j624l24K206j192j169J908m00j603J879
5678H10q1j938J805M15k200J457P60k247J044J212j870K30J603j457l31J906j557
5695d39m70K128j348q57K015q12j424J733k4j657J600O22k088O63J512k015Q14
5712d7J281j987J80K027k015j67K112j648j084K443r53j568J936m4j729J824L58
$$ y = [1258, -267, -951, 836, -136, -1209, 1327, 316, -1431, 666, 521, -1226, 473, 863, -1294, 73, 1197, -997, -315, 1131, -802, -395, 1172, -395, -859, 1279, -30, -932, 965, 276, -1281, 1109, 492, -1346, 754, 499, -1195, 420, 709, -1122, 146, 1051, -1022, -445, 1229, -623, -773, 1128, -566, -855, 985, 92, -804, 1195, 107, -1469, 1016, 662, -1499, 305, 862, -1109, 289, 863, -1060, -417, 1074, -976, -591, 1052, -109, -804, 1129, -495, -819, 1387, 195, -974, 934, 534, -1069, 810, 729, -1209, 596, 1011, -1189, 268, 1028, -1219, -175, 1037, -833, -603, 1000, -457, -788, 1118, -439, -909, 1219, -129, -986, 1029, 217, -1207, 526, 502, -1155, 445, 1067, -1021, -358, 1154, -861, -47, 1234, -753, -573, 1454, -561, -728, 1384, -264, -1348, 1095, 142, -1426, 510, 466, -1263, 561, 919]
5729I19k273J222J051j909Q99J260j887JJ889j611K16J323j405o62J980j071r88
5746a046J709m52j552J841P2j802J362O38k054J357Q39j856P06J288j825K66J546
5763A037j554k43J785j383o60K068q43j374J845O3j928J883K06j839J509M93j972
5780i07P59J078j943J058R17j401l27J806j842k70K071j076r69J768o56j127J812
5797G51Q3j832J431K09j906J696M30j630O72J250k198O99J283j483k55J826j199
5814a73p71K172j054j141J660n11j598J879K02j755J221N81j953J310O78k020
5830a273J063J632j825L9J546j626l73K042j216j097K050p59j061J444l3j646
5846a093J888j53j548J315O98k077Q35J381k244P60J208j411l89J735j083p26
$$ y = [919, -1354, -132, 919, -990, -91, 1169, -718, -717, 1172, -439, -223, 1100, -305, -967, 1013, -58, -1046, 663, 211, -1341, 500, 572, -1230, 132, 770, -1284, 73, 912, -944, -238, 1050, -775, -509, 1037, -517, -760, 1025, -358, -1018, 1050, 207, -1167, 678, 741, -1187, 696, 902, -937, 572, 1065, -907, -148, 930, -1013, 45, 962, -439, -766, 1040, -802, -1072, 999, -77, -1046, 722, 66, -1061, 751, 834, -998, 433, 642, -1264, 432, 862, -768, -96, 1154, -1044, -345, 938, -545, -800, 1026, -173, -944, 1228, 174, -967, 693, 182, -1416, 463, 665, -1090, 131, 712, -1241, 69, 747, -1273, -210, 1422, -403, -364, 1182, -444, -817, 1225, 9, -1088, 962, 203, -858, 586, 553, -1093, 795, 642, -906, 409, 1107, -970, -135, 1246, -998, -238, 970, -441, -830, 905, -178, -904]
5862i04J854r42j206K138q38j209J967k96j730J532K13j668J269N58j784R22J258
5879A134j772qJ630j502j11J686j318l51J451q79r74J671j60j733J956j34j296
5896g10R88O29k051J073J083j915M03J613j721J1J585j485n3J649j016j274J999
5913H08o81j175J801m25j311J539r8j680J410M81j777O61J550j711L29J389j756
5930f46j90J780j302m60J801j077r57J974p69j292J527J58j350J166M35j837J114
5947G5Q95j747O03J195j651K1J593j765j13J855j020q55K242j350j180J765j85
5964C78j704J702K18j854J415P53k173J215J499k338M64J707j942p6J614j419
5980e41j30K006j651o87K168q95j284J936k21j708J662J74j598J018Q04j570N88
$$ y = [-904, 950, 8, -1198, 940, 102, -1107, 860, 564, -1166, 366, 579, -1089, 180, 738, -1046, -124, 1134, -638, -646, 984, -518, -629, 1057, -261, -612, 839, -40, -1014, 657, 497, -1236, 720, 586, -710, 278, 907, -1144, -71, 1012, -903, -500, 1113, -608, -597, 988, -497, -550, 1099, 83, -1191, 808, 127, -1048, 753, 328, -983, 556, 458, -1222, 188, 669, -1108, -447, 1103, -608, -279, 1110, -646, -836, 944, -358, -818, 983, -94, -1051, 923, 154, -1138, 389, 547, -803, 363, 798, -1039, 75, 970, -777, -174, 1021, -630, -609, 984, -781, -894, 961, -59, -914, 1328, -22, -1202, 563, 378, -1326, 376, 594, -1260, 155, 908, -1265, -50, 1449, -889, -425, 1282, -660, -736, 878, -541, -671, 1335, -316, -1003, 1165, 270, -1014, 922, 701, -1007, 655, 829, -769, 249, 1053, -517, 71]
5997G1J015j836M5J598j493J50J842j572r48K291r89j144J868o69j197J371J04
6014E07j598J538L29j918J120Q38j605N42J422j678J97J667j711l89J791j110
6030e8q85J681l27j371J955n48j789J703K48j816J379Q02j705O84O35j601Q02
6047b11J199j771K35J646j453j39J487r44q65J540m16j284J672J29j737J313M87
6064H88j896J177Q61j780N96J082j792K58J767j839j5J940j165r35J790q25j149
6081a037J853n1k015J397M76j712J240O20j589Q70P86j848J112R16j620K2J897
6098A317j653l63J547p93p49J514o57j263J844l75j348J446J99j675J043P73j427
6115f20K70J305k069O92J519j980j5J888j095n73J690j154p45J650n17j318J513
$$ y = [71, 1086, -750, -705, 893, -600, -450, 1392, -180, -1128, 1163, 174, -970, 898, 229, -968, 403, 507, -1091, 447, 776, -1142, -22, 816, -789, -247, 1175, -503, -306, 1361, -350, -739, 1052, -58, -943, 738, 411, -960, 995, 447, -1342, 361, 609, -1207, 172, 974, -731, -47, 588, -1013, -211, 988, -783, -548, 1098, -355, -494, 993, 49, -816, 724, 308, -976, 696, 825, -912, 401, 888, -1008, 169, 1030, -750, -154, 928, -864, -606, 1161, -678, -693, 1247, 82, -853, 937, 112, -1037, 816, 765, -1250, 147, 623, -1089, 151, 771, -818, 52, 838, -1010, 102, 1018, -602, -580, 1317, -336, -699, 848, 55, -694, 820, 163, -1100, 744, 369, -979, 467, 666, -1009, 34, 807, -620, -350, 955, -1114, -422, 1097, -883, -898, 990, -105, -678, 1012, -142, -887, 763, 246, -1072, 441]
6132D41R4j434J240L88j526J086P68k013O35J323j618j24J683j184m77J651j255
6149c22n41J529o44j048J757m25j265J296K46j558J415L23j454N69J113j694M96
6166b07J541j740j05J438j173m23J771j242p27J930p88j120J088K21j438J373
6182C99M59j938J142J055k155R34J023j540M62J206j531K13J469j356r67K200
6198A075q23j066J767o36j264J575k57j504J345M71j505Q11J281k084P10P97j289
6215e96J02J691j606k02J384q37j013J797m88j309J617m53q54J189K10j574P98
6232a44J098j823O18J128j707N25J215j321jJ755j431o27J904j469n65J555n57
6249A53j050J338N6j542J273M15j446R18N33j408R77L54j550M13J285j217j41
$$ y = [441, 535, -899, 341, 729, -797, 289, 1057, -956, -321, 1002, -616, -740, 943, -241, -718, 933, -322, -863, 666, 22, -1026, 731, 306, -959, 337, 583, -975, 440, 763, -691, -122, 991, -703, -207, 1334, -406, -511, 927, -246, -669, 1102, -140, -867, 1063, 275, -845, 243, 464, -974, 399, 858, -1080, 62, 1117, -1038, -104, 919, -621, -159, 1047, -484, -271, 1198, -158, -1125, 1075, 252, -814, 953, 317, -947, 628, 371, -1133, 212, 683, -822, -11, 1270, -814, -104, 693, -596, -494, 1197, -409, -611, 773, -64, -1077, 720, 232, -1077, 540, 87, -767, 422, 632, -942, -144, 954, -869, -251, 877, -830, -305, 910, -411, -412, 1343, -88, -715, 1189, -280, -845, 710, 153, -897, 441, 497, -1045, 228, 643, -803, 115, 648, -760, 217, 571, -979, -566, 719, -498, -639]
6266f39J689j417l79J752r62r56J272j46j376J564J24j498J418J76j677J262O01
6283H08j425M74J185j345l07J469r25o50J539j042q13J860n78j297J500k66j380
6300a193J609K67j740J090Q18j960Q70J064j326J80J295j412JJ566j417j54J483
6317A041q83p82J529n27j281J374j23j021R03J44j501J189Q61j758Q52R36j804
6334h51L09J451j293l42J744j282m91J667o58r49J490m80j279J725l65j258R81
6351A19O52j542J031L47j352L64J444j550J73J313j330n35J430o69n59J497o28
6368B05j471J778j84j338J303J25j019P82O23j530N64J081j402O2J277j239j33
6385e16J233q73l52J397r16p82J709p91j136J567k91j343J377J97j292P75J096
$$ y = [-639, 1050, -367, -746, 1006, 44, -912, 360, 214, -1162, 402, 526, -972, 446, 622, -1055, 207, 808, -617, -143, 1042, -303, -610, 859, -66, -716, 823, -219, -1032, 828, 250, -1047, 453, 187, -1193, 416, 683, -1057, 33, 851, -1109, -239, 825, -501, -321, 974, -438, -437, 1129, -288, -442, 1041, 158, -624, 905, 378, -903, 471, 348, -673, 230, 374, -1127, 62, 923, -835, 17, 953, -851, -542, 909, -384, -726, 1018, -264, -755, 912, 254, -695, 795, 315, -964, 761, 396, -862, 119, 771, -771, 260, 607, -745, -381, 1063, -487, -314, 999, -331, -866, 564, -105, -664, 833, 205, -1266, 512, 328, -1010, 293, 418, -601, 181, 804, -726, -162, 919, -483, -421, 856, -383, -516, 717, -156, -508, 889, -27, -809, 900, 109, -1027, 540, 249, -1094, 283, 480, -812, -37, 1059]
6402A059j768P53R52j612N18J214j411n3J351j195o39J577o95j186J598j44j253
6419i34J307J10j537J188L98j490R78P52j374M80J024j515J31J197r68l97J838
6436A188j201r37J700l75j349J647k54j393J616k33j112J077K62j358N18R16j470
6453g58J06J648j235k60J613j049p46J466r15n45J223n02r82J270N11j934J336
6470B47R9j622J265O39j116L0J369j765K54J679j384l52J391q70o87J924q83j208
6488i90J552j29j564J580N4j298J102N28j354O91O22j232M07J107j748J42J415
6505H85r73p64J791p02r39J464p74r13J658q70o55J127K15j280O41R90j659L81
6523c77J285j671N88R25j219k58J657j114n94J391n95r99J698k84j396J559m11
$$ y = [1059, -709, 44, 996, -616, -98, 1116, -295, -348, 1003, -192, -831, 746, 51, -1135, 463, 319, -934, 373, 483, -1054, 134, 532, -958, 20, 772, -602, -122, 902, -613, -482, 715, -253, -650, 1188, -13, -950, 750, 375, -974, 673, 419, -974, 642, 409, -703, 374, 636, -722, -204, 712, -758, -652, 996, -239, -499, 1114, 65, -681, 785, -130, -675, 548, 46, -936, 334, 845, -1089, 247, 346, -1276, -11, 628, -488, -458, 911, -854, -600, 1079, -305, -657, 734, -136, -823, 1101, 218, -990, 562, 433, -1131, 449, 503, -795, 307, 835, -519, 172, 794, -438, -31, 1076, -672, -530, 885, -88, -852, 939, 237, -702, 762, -12, -925, 733, -137, -792, 335, 550, -730, -89, 901, -758, -377, 908, -763, -175, 750, -469, -727, 930, -184, -778, 613, 18, -981, 717, 433, -963, 596, 185]
6540A85j036J031P52j517M63J005j604M01J293j589NJ379p89r15J510o88n99J266
6558E53n86r20J625l19j265J121Q09j846Q16Q63j446L71J120j219j63J647j365
6575b04k50J317j129k47J094o97l49J184o56p99J152o1j662J540M00j608J214
6592B39N01j171J55J283j441K8J571j602J21J289j081m22J270p44p48J458o50
6609E6o63Q73Q0r69Q52M76j786J018P10j555L89J235j346L35J068j220j50J301
6627G04o92p89J361m48j207J664O3j575R93M73j378J175L12j250N58J024j412
6644d24L99P38r58k59J358n40j042J244m52o20J036j2j432J532j53j270J287o
6662D26j005O78P46j549L84J176j718K73J462j066k51J308o82r84J400m09r75
$$ y = [185, -851, 180, 932, -585, -122, 883, -721, -320, 973, -616, -611, 768, -21, -936, 574, -114, -713, 553, -33, -953, 672, 353, -912, 209, 1018, -828, -12, 851, -595, -224, 896, -323, -486, 1161, -204, -454, 863, -266, -513, 581, -116, -465, 719, 63, -736, 416, 355, -1307, 233, 633, -975, 239, 740, -431, -276, 1007, -434, -406, 1165, -437, -316, 973, -108, -530, 740, -4, -752, 706, 56, -607, 266, 346, -623, 229, 705, -1081, -63, 647, -908, -519, 716, -630, -295, 773, -447, -597, 704, 12, -777, 584, 136, -1071, 593, 656, -919, 74, 547, -831, 344, 656, -594, -36, 988, -424, -25, 713, -245, -504, 854, 314, -728, 516, 64, -556, 480, 468, -964, 568, 415, -855, 432, 426, -579, 99, 845, -704, -320, 856, -862, -589, 873, -193, -444, 864, 182, -802, 598, 189, -786]
6679g86J170L6r66N49K75j069R66P68j739P93O61j127L6J328j053k73J473j075
6697c3n67J630j235n89J277j41j291J287O1j337J476l0j131M67P60j119L53Q49
6715F87j207J79Q44q38j73J417j177o06J649q41n97J501m62j276J320j26j209
6732i15J212L76j122J89Q07j089O48Q00j389J27J198r68p71J541o86m95J355r89
6750a71n61J256j06j088J083K69j505Q56M28j236M60Q56r51K9J005p21n77J541
6768H67j079r52K015r13m32J049n51o07J111j08j065R75K26j416J011M88j216
6785e97L79Q37r84j72J474j096k97J168o21n99J044o12q92J311j08j122J214K36
6803E63j600J376N72j582O96N81j269O80Q15j194J02R34r78l87J223n09j089J695
$$ y = [-786, 384, 420, -546, 3, 278, -791, 175, 943, -796, -3, 658, -469, -433, 895, -158, -431, 1042, -33, -600, 1030, -205, -794, 483, 342, -949, 338, 399, -938, 538, 508, -623, -156, 604, -515, -162, 687, -520, -341, 503, -335, -508, 909, -268, -874, 775, -66, -663, 838, 376, -900, 420, 294, -915, 297, 673, -449, -260, 547, -542, 106, 906, -483, -356, 842, -126, -897, 644, -42, -537, 818, -171, -732, 524, 418, -670, 413, 682, -823, 33, 461, -775, -315, 541, -410, -381, 624, -97, -674, 867, -212, -1164, 851, -62, -494, 555, 4, -603, 508, 400, -665, 310, 536, -880, 131, 619, -597, -218, 619, -365, -537, 937, -159, -456, 712, 91, -508, 536, -76, -968, 343, 235, -887, 327, 563, -1037, 339, 911, -671, 25, 606, -663, 17, 832, -362, -260, 674, -304, -691, 532, 23, -1066, 629]
6821F29l27q99J065k83j220J536K51j520R07N22j015L28R46j696J94J047p89q6
6839d10J114n32r15J395q38m43J213m33j000J251Q0j253J153M07j546Q74N67j675
6857i91J010Q17j230K7Q69p64k79J308r99j53J214p66p71J189m05q24J045L48
6875F45j280L83Q09j358Q29O79j172L86J136r92m13J027j165l07J512p64o02J307
6893F60o75p94J472M4j352J119J72j249Q78L09j086M60Q51j511L14J099j060K8
6911c21R57q20j75R12l97j241J531N1j097R44J80j211O82L37q81P78M18r81K73
6930f1O66r63L37P04r40l05J054m05j079J304k04r36J542o77q52J237N7j295R22
6949A06N19j585J164K11r85N23R03j285J1J060o40n49J094m38m85Q93k17j050
$$ y = [629, 302, -597, 468, 185, -1035, 501, 752, -768, 139, 661, -354, -26, 920, -776, -582, 465, -324, -410, 704, 172, -743, 652, -186, -629, 584, 151, -849, 402, 482, -771, 382, 789, -757, 117, 684, -991, 19, 836, -394, -367, 502, -262, -541, 767, -232, -385, 829, 63, -708, 481, 76, -748, 297, 645, -635, -252, 557, -801, 28, 707, -465, -79, 1057, 65, -348, 679, -486, -793, 719, -45, -647, 660, -15, -809, 663, 707, -645, 474, 646, -603, 275, 584, -502, -42, 809, -702, -388, 711, -349, -321, 636, -184, -359, 553, 156, -1085, 446, 497, -600, 344, 524, -687, -5, 332, -549, 229, 647, -334, -61, 605, -358, -21, 683, -257, -562, 492, 87, -992, 312, 108, -828, 714, 37, -815, 422, 479, -816, 106, 625, -960, 204, 415, -570, -47, 856, -429, -418, 642, 2, -547, 547, 109, -376, 517, 300, -750]
6967g50J026R9j021Q28L44j433O14J046j367J66J112r86K20Q40r43l99J281p04
6985b7p04J347p32n79J270n75r05J117L14j115P41L65j118N62M42j106M33Q41
7003E71o50o94J753j239k42J497j192l13J185m99o75R47k21p96Q36M42j247O74
7021A37N30j291N35O75j131N16Q36q73n6O51l74p94J481o85r59J545q02n71J338
7040G08l95r63J195k7j394R61O78j120JJ031j109j76J341j064p2J159o55q06J605
7059H98p89n55J130m09j216R89K75j240J243r4q43P86O71j408N96Q54j300j53
7077e65J533r94o20J203p33n02R96m98m66J045Q5j027J099k21r32K09J208j726
7095i06R67J006j472P2J108j064l69J466j065l95J563q80p32J130r6q74Q36J12
$$ y = [-750, 276, 375, -646, 182, 526, -907, -293, 753, -614, -448, 664, -322, -102, 738, -205, -604, 677, -27, -731, 616, -116, -695, 575, 0, -905, 212, 526, -589, 152, 517, -601, -39, 403, -703, -270, 571, -79, -773, 980, -259, -501, 996, -196, -509, 676, 177, -498, 449, 228, -568, 268, 710, -537, 137, 667, -624, -89, 586, -545, -29, 807, -66, -122, 529, 155, -639, 842, 157, -802, 743, -59, -630, 708, 313, -650, 545, 518, -876, 85, 763, -357, -356, 675, -434, -610, 731, -333, -405, 754, 99, -707, 898, 109, -446, 684, 275, -941, 48, 323, -917, 326, 232, -611, 175, 846, -562, 34, 888, -412, -565, 968, -26, -646, 557, -176, -678, 318, -180, -646, 399, 484, -543, 556, 335, -597, -388, 820, -906, 61, 1067, -405, -333, 775, -289, -658, 808, -257, -652, 911, 31, -701, 429, 333, -541, 295, 407]
7113D07r61P80R8j002O89M69j113K89J076j007q5J228r76n97J173l82q45J310
7131E51n12q25J368j37r42R34K39j323P41O36j463M02J046j224J32R09r48K5J135
7150G44j082J68Q28o67p23J259q9j276J234j89q28Q77M24j522J330K2j394P35
7168a49J113j354Q9J071r67j77J104p11o16J363o46q80R43Q0r36J133m90o24Q44
7187A90M51j517J118N58j287O42P19p79l86J077p10o82J259n42o26R30l81q28
7205g94J136J32j340J139L42j384R17M87j264N84J002j406L48J023j475N4J326
7222H27r30n07J331q25m34P23m9p69J044J39j128P02M46r46M00L24j027K76J352
7241I49j168k17J186j048k74J480q08p16J384m92p99Q79j23r90J142l8j227R35
$$ y = [407, -554, 226, 324, -678, 11, 480, -633, -344, 732, -275, -360, 868, -108, -705, 468, 86, -759, 551, 39, -786, 582, 445, -497, 437, 676, -647, 94, 730, -733, -331, 715, -509, -377, 532, -416, -391, 744, -338, -170, 658, -9, -732, 527, 438, -838, 396, 207, -621, 256, 680, -842, 488, 510, -884, -149, 964, -390, -301, 770, -197, -374, 730, 19, -597, 766, 120, -760, 183, 263, -673, 460, -30, -654, 190, 641, -876, 242, 800, -487, 155, 874, 95, -291, 786, 76, -606, 653, 111, -515, 415, 34, -794, 342, 474, -866, 273, 615, -769, 148, 635, -629, -45, 957, -449, -101, 922, -553, -499, 827, -103, -610, 721, -104, -538, 185, 136, -633, 411, 550, -578, 124, 570, -376, 24, 348, -679, -403, 949, -219, -436, 750, -298, -572, 908, 100, -616, 768, 276, -523, 356, 233, -757, 385, 347, -880, 55]
7259E5O36j237O12N29j028K79R66j398L69J085j120j70J124o88m78J104q02r01
7277a063J669k70j252J359q3j138J049M52j376P99O37j162L17Q92j235j71J367
7294G91r91l41R15k94o13R00j76j015J093J49j178Q52K58p92M64P28j086K25R92
7313H81j299K8J285j189j00J186r69l36J194m81q90J062j05j010Q18M05j219Q44
7331A05P09j408P35J17r61M39Q60r19R6J078r26m84J384j061m07J167m72r28J422
7350E46j76j192P30O07r91M51O59j340Q09O09j328P4J172r05m12J435j122l02
7368f76J389p77p30J149j8r54P06L18j357Q74O55r58K79R17j719Q84N69r26P8
7387b97J055j123k48J236n35o74R98l09q43J366j76j271J020J41j077Q42O12j373
$$ y = [55, 691, -546, 66, 595, -433, -154, 812, -586, -217, 868, -252, -422, 702, 14, -464, 640, -162, -1063, 606, 336, -916, 443, 360, -778, 271, 723, -653, 146, 783, -379, -62, 830, -405, -576, 791, -200, -541, 374, 80, -533, 367, 191, -824, 269, 418, -760, 92, 350, -442, 22, 750, -336, -111, 881, -418, -390, 895, -294, -394, 792, -177, -513, 681, 200, -690, 372, 267, -743, 75, 480, -739, 105, 814, -594, 141, 258, -703, -264, 596, -323, -227, 851, -75, -559, 825, -236, -643, 524, 52, -876, 546, 370, -822, -92, 515, -476, -25, 634, -706, 103, 712, -616, -542, 630, -275, -687, 748, -374, -676, 713, -64, -794, 355, 337, -617, 89, 407, -950, -76, 579, -379, -100, 817, -902, -18, 551, -375, -297, 758, -365, -613, 623, 88, -586, 412, 103, -740, 626, 450, -821, 199, 340, -737, 105, 717, -656]
7405f56P37O92j143j6R07p22j48J333j093l38J125n74p66J023l74o68R35j81o83
7424f10R14r2j096J221K25j414N00Q54j212O3J398j088k30J567j139m27J162m77
7442A19q29J184j69j150J049J5j135Q73N32j191N82J011j629Q39P84j310J28J078
7460G81j249j19J253m93n76J031l60p28R43k43j062J089M27j442Q17M67r33J47
7478b50J073j207M08P58r16k16J059p52n53J158m91o09J154o65m42O92J07j044
7496g36Q83N78j424Q03N22j392P14P60j035P6R99q67l68Q31l08m25R51m81o81
7515f00J197l77r59J086J62j096Q77L27j287P12R72j483K41J145j227J16P07o92
7533a79j55R76o30p30Q97j41q35J336j61j464J245L74j446J025M89j195M02J068
$$ y = [-656, 81, 773, -370, -386, 521, -201, -349, 984, -109, -447, 678, 104, -662, 361, -13, -681, 254, 73, -610, 304, 212, -884, 337, 562, -852, -352, 502, -710, -647, 751, -337, -567, 1000, -139, -566, 596, 119, -710, 474, 305, -845, 204, 219, -916, -43, 489, -702, -120, 891, -738, 101, 885, -425, -297, 781, -468, -587, 666, 173, -403, 628, 268, -460, 483, 240, -822, 267, 694, -748, 69, 536, -397, -250, 823, -384, 24, 782, -134, -350, 709, -43, -596, 562, 71, -538, 616, -49, -491, 201, 308, -736, 147, 725, -699, 104, 626, -766, -52, 708, -327, -251, 748, -119, -487, 344, 36, -389, 562, 81, -600, 597, 220, -739, 347, 509, -587, 290, 617, -670, 42, 1014, -469, -228, 917, -310, -194, 513, -179, -334, 642, 12, -718, 179, 38, -797, 539, 378, -1086, 159, 533, -913, 112, 601, -594, -192, 876]
7551H76j280j69J633j808O4J220o04p79J500n54p10R48j81q95J348j51j234R97
7569B21P18j714M20Q02j226P16R74j142k5J244j502p3J142n15o90J186l64p63
7587e91R35Kj077Q10M17r78P90J71q91J36J051j287J19J425j228kR45r21k32J060
7607F54p74o50J300k90j077J513l65j021Q50M55j392P14M21p20M28N25r95m6J022
7626E52r91l60J538j259J5J260p77q38J131Q2j330J330L4j009Q62K61j221Q45
7644A25P93j575M03Q03q94J2J005p47n24J248m78p52R63m1j303J339k79j029J177
7663B46L18j215P26N31j349O84N28o66o3Q55j080r5J116o46n81J218m51o21J110
7682E65k61q99Q25P8j191O85N42j234Q98P77j346K79R40j235R4J243j123J94P05
$$ y = [876, -404, -573, 1060, -748, -684, 536, -68, -847, 653, 99, -611, 337, 156, -739, 609, 458, -776, 221, 939, -775, -355, 447, -779, -63, 911, -231, -256, 988, -514, -587, 555, 40, -650, 536, 172, -591, 344, 346, -731, 79, 496, -482, 308, 479, -412, -276, 775, -512, -393, 1032, -196, -198, 747, -174, -406, 654, -120, -770, 530, 240, -837, 676, 311, -710, 140, 595, -797, -83, 338, -382, 46, 571, -424, -470, 552, -439, -799, 739, -520, -505, 755, -22, -860, 271, 353, -977, 353, 387, -622, 240, 501, -720, 125, 918, -657, -254, 549, -345, -333, 672, -75, -599, 649, 171, -581, 382, 341, -962, 377, 98, -931, 246, 564, -651, 75, 606, -743, -59, 469, -197, -260, 595, -485, -580, 536, -110, -691, 527, 76, -545, 565, 304, -595, 230, 308, -883, -198, 344, -890, 8, 785, -561, -282, 658, -577, -483, 760, -363, -169, 536]
7701E36n35p63J526l94j019J119j13j028J125j44j241J036N18j229K15J082j101
7718d10L11N81r12j25J226r37k47J124q22k80J035m41o11R67L7j091O55M14j118
7737f44P42O67j513N18O34j195M55J132j194q2J291r42l15J106n91o58J005J77
7755E93j378J333l59r31R09K31j048P42M08p69L5P97r84L78P77q28m84J160o30
7774d8n34J237m92q29R15j09n57P35K84j375R94L72j093O39M36r30L12Q14j171
7793d00K53P39o85k76J036p24m21J182m70r83J350l68q27P31L66j115O65N04j051
7812d94L68P98r97l03J004m11n05J330p86p13J428l82r97J054L1j039J240j46
7830D80j512J335l9q62N96P83r89L36M92j305K12J027p77k98J157o97m99J127
$$ y = [536, 1, -762, 764, 370, -649, 470, 357, -671, 454, 310, -931, 105, 623, -606, -391, 691, -410, -99, 482, -430, -555, 671, -266, -513, 611, -211, -491, 544, 103, -508, 459, 496, -595, 60, 474, -644, 98, 765, -748, -230, 404, -791, -336, 796, -398, -480, 811, -131, -446, 660, 69, -589, 416, 593, -785, 548, 189, -742, 167, 398, -650, 92, 500, -269, -234, 563, -421, -43, 734, -94, -578, 582, -48, -582, 655, 163, -666, 249, 140, -417, 318, 602, -773, 221, 593, -500, 139, 575, -355, -43, 771, -400, -147, 592, -93, -369, 667, -57, -478, 704, 234, -749, 601, 233, -594, 137, 503, -612, 53, 557, -494, -126, 672, -325, -628, 376, -35, -540, 790, 4, -709, 719, 337, -660, 394, 425, -614, 626, 480, -1032, 303, 264, -598, -2, 781, -208, 128, 620, -685, -473, 554, -223, -521, 636, -61, -560, 567]
7848E67n54q14J124m9q78P76L59j329J280k8q37N12M83j073J19J160r77j64R04
7867E81q37M2P53o11m14Q21n2j062J338M1j540J404j07q98O64M32j192J83J052
7886E98r23j79J395j086k96J289r79l75R30k32q21J206j20j149J226j25j327R94
7904B6J15o68Q25K84j100L20Q41j075J17Q23o48m59J279q71n08J206n2j430J516
7923E41k60r88J082J45j220Q95K70j283M88P63r63K53R71j468N69M37n04j78J316
7942H66n85n41N24j17j045J077N6q91Q41L51j353O15R48j156M31O89j060J40P24
7961E14r02l8R61p25l96Q53l29n01J061k18q79Q27M22j188O19K72p08M14J83n35
7981b93J61Q19j185o6J048p75l96J089m28j55M81k31p16Q13L51j177J018J18o06
$$ y = [567, 13, -801, 323, 274, -604, 172, 531, -798, 482, 454, -383, 129, 612, -461, -342, 818, -159, -323, 581, -256, -214, 539, -72, -486, 335, 283, -779, 559, 600, -940, 464, 357, -541, 123, 555, -637, -454, 598, -325, -504, 891, -195, -491, 798, -181, -556, 374, 142, -679, 527, 407, -742, 484, 359, -968, 26, 141, -527, 298, 582, -518, -198, 643, -432, -315, 508, -140, -599, 680, -191, -699, 507, 455, -975, 541, 281, -707, 375, 520, -700, 195, 465, -818, -330, 433, -530, -277, 694, -774, -205, 232, -272, -450, 866, 281, -260, 264, 147, -898, 179, 235, -656, 185, 536, -817, -202, 746, -410, 21, 710, -350, -210, 514, -388, -426, 535, -190, -586, 267, -62, -563, 498, 280, -599, 228, 650, -538, 81, 353, -355, 59, 242, -293, -132, 687, -498, -564, 484, -291, -687, 402, -26, -181, 300, 69, -647, 166, 517, -660, 358, 476, -130]
8000a30L36J29p04J68N47p44J70P73m37n80R90n13m00J033m96o71Q69k36o48R78
8020D34J45r88K01O50r44L92N58r55L64J010j336J93R07p78j64N46k02k39P54
8039E48k69p96Q47l72n29P62J56q76N01L80j013J000K65j410N43J088q49n97J055
8058D34m25m95J157p59m74J050k04q37R82q2n70O94q0q15N12N40r33J62N29p78
8078c92Q3R79q41o4Q13r50OM18j35l26R92n01q35J061j80p31J104j37o19J55P35
8099F35j095L37R73q00j73P67p89j46Q21l94p55J120l98o27J241k58j024N07O38
8118E80j140O19J22q77N10J099j352J35J016j047P2J051q90m22J007m33m50R16
8136E16k84p78J308m65o60L66N12r35M16N45j188N71M91o82m9Q24p66M2O37o31
$$ y = [-130, 206, 335, -369, -201, 346, -398, -228, 545, 108, -472, 518, 5, -395, 638, 142, -529, 340, 104, -544, 434, 579, -409, -208, 442, -502, -110, 448, -507, -143, 867, -469, -276, 631, -147, -311, 235, 33, -206, 548, 279, -517, 330, -42, -571, 191, 347, -529, -28, 352, -661, 339, 604, -806, -263, 825, -24, -621, 434, 9, -486, 671, -88, -562, 488, 284, -553, 429, 347, -223, 471, 391, -424, 88, 628, -305, -143, 386, -392, -309, 670, -171, -235, 578, -372, -366, 52, -83, -409, 583, 82, -753, 308, 128, -603, 501, 364, -255, -100, 635, -460, -123, 850, 50, -123, 644, -145, -291, 530, 136, -619, 501, 103, -524, 717, 459, -565, -58, 580, -560, 59, 181, -696, -186, 913, -439, -304, 712, -335, -263, 788, -102, -524, 483, 50, -400, 516, 232, -546, 762, 297, -363, 3, 515, -420, -4, 541, -647, -76, 415, -267, -316, 508, -258, -216, 421, -210]
8156b10l62J115l43n82Q35k62p47N44K57o82O31J68q58M90N77r83N9J065j021
8175c09o1Q70p61l15J058n62k46O33j47n41P19K9q25M07K80q13
$$ y = [-210, -572, 543, 200, -382, 453, 191, -556, -12, 245, -437, 194, 362, -496, -6, 571, -412, -353, 712, -309, -370, 500, -261, -576, 482, -80, -326, 307, 160, -381, 338, 367, -458, -51, 229, -584]
8191e84
$$ Imaginary data points
##PAGE= N=2
##DATA TABLE= (X++(I..I)), XYDATA
0@%%%%%%%JrJ6j6J6k4L2l7M5n2O0p2Q8j02J16j32J51j73K00k30K58k89L26l68
31a95M14m63N16n74O39p11P92q77R67j073J189j314J458j617J791j991K223k492
49a318K802l171L621m178M892n837P145r085J2248j8213L2989j28624j73232M04173
63A24212o9227k21756K21396k8370k27380K26758O4557k44492J14513J11904j84904
74a12789J00848J10023k08722O2125J77314j86160m63J95417j64135p1073K33632
85A36017q1364j55502J59286J5508j12067P9757k2855o0589J27060n5611j27711
96i8071J60938O588j64179J37844L3692k07839J49019J41422k66692J9600K31221
107A43543j67143o4797J97872j25337r2636K06406p7794j25804J83655p0467j54811
$$ y = [0, 0, 0, 0, 0, 0, 0, 0, 1, -8, 8, -8, 8, -16, 16, -21, 24, -28, 32, -40, 48, -54, 62, -70, 81, -92, 108, -122, 136, -153, 173, -195, 219, -244, 272, -302, 337, -374, 418, -459, 508, -565, 624, -690, 768, -849, 942, -1049, 1174, -1318, 1484, -1687, 1934, -2244, 2648, -3189, 3956, -5129, 7119, -11094, 21895, -106729, -279961, 124212, 54985, -166771, 54625, 26255, -201125, 25633, 90190, -154302, -39789, 72115, -112789, -11941, 98082, -110640, -48515, 128799, -57361, -57824, 137593, -26542, -97615, 136017, 54653, -100849, 58437, 73945, -38122, 41635, 18780, -41809, 85251, 29640, -98071, 62867, 69455, -94724, 43120, 76812, -131027, 17992, 159414, -107278, -87678, 143543, -23600, -88397, 109475, -15862, -108498, 97908, 20114, -105690, 77965, 7498, -147313]
118a47313K38805l618k73623J74133J36321k48964P9004J68727k41048J2630K54029
129A49083j72594j18594K16670m9287j10505J47798m5778r4495J56503m0736j24977
140h6912J71084n780j80455J53257P0554k02951Q6843J22012j83200K6892J47028
151A18372j48472k3084J46570j08915m7748J31101q6107m2345J32726j09963o4976
162a02841K02229q2119j72601J97548L2542j98643J25152Q2039j91858Q0922J32045
173A04415j73488J2151J42161j28113p982J38992j22522l1622J57584j10694o3905
184h3023J90140r4494j42932K11780N124k03466J34790Q0306j76667P8981R9848
195A00387j62141M2721J22018j42442R498J29714j30482j4433J48925j26278n1314
$$ y = [-147313, 91492, 87874, -185749, -11616, 124705, -124259, -45255, 123472, -117576, -104946, 149083, -23511, -142105, 74565, 25278, -85227, 62571, 16793, -77702, 78801, 38065, -86912, 84172, 78392, -102063, 51194, 121748, -81203, 5640, 127652, -55548, -28656, 118372, -30100, -53184, 93386, -15529, -63277, 67824, -18283, -60628, 72098, -37865, -102841, 99388, 17269, -155332, 42216, 74758, -123885, 1267, 83306, -108552, -27630, 104415, -69073, -56922, 85239, -42874, -50856, 88136, -34386, -66008, 91576, -19118, -83023, 107117, 12623, -130309, 81471, 86595, -116871, 17919, 98225, -78442, 539, 100387, -61754, -19033, 102985, -39457, -29959, 99755, -30727, -45160, 103765, -22513, -73827]
206g3827J85049j03502j28390K00419j7947j85211J41579N7390j72303Q1378Q3812
217F8447j44994M6984Q9683j31133L6426J07335j34611O455J35326j18579k4933
228f3594J55050j08039p8154J84273m7214j40768J42885K0182j32217R5852L3316
239F1572j22081Q2456M2788j28081P7451O5831j52305N7862J14170j57294P429
250e0202J54305j38077m9587J83161r1225j14398J71442k0643j38170J28054J8075
261E2735j32306J04788L4663j43385R6181P1855j65688N7900J22604j57091L042
272e4702J53436j30269n3269J70148p7917j05153J48228j9515j16493J11911J0466
283C6871j09176Q9617K1019j08717Q8342L8358j32067P5158Q2516j39485L2005
$$ y = [-73827, 111222, 7720, -120670, 79749, 61802, -123409, 18170, 75560, -96743, -15365, 68447, -76547, -29563, 60120, -71013, -34587, 72748, -61863, -55408, 79918, -38661, -63594, 91456, -16583, -94737, 89536, 42322, -98446, 44439, 64621, -67596, 28256, 61572, -60509, 21947, 64735, -63346, 14105, 79936, -72369, -14507, 99663, -57631, -50202, 104103, -33974, -83561, 99600, 8375, -106023, 65419, 44776, -93394, 34660, 52735, -79571, 25217, 59880, -83505, 12676, 84531, -81157, -23257, 99347, -57744, -54702, 98734, -31535, -84804, 85344, 7427, -97726, 50502, 30987, -85506, 26405, 36871, -72305, 17312, 38331, -70386, 17956, 56314, -75753, -595, 81921, -57564, -25559]
294b5559J14029j21910q883J30103r6621m7243J31426o1965p0746J17537l9914
305B0254p9487J14624k9765j01531J25515Q0j41988J13094N5906j62772O9045
316a7025J04649j52781J7956J34001j25654k9447J44054q8612o4067J38541n6234
327E381q4208J32462l0877j08455J29122L863j37518J10570N4232j52946O5767
338a2607R9265j37039J5022J14372j07680j6187J17727q4200m3411J16441n6428
349E275n9805J08425m3208p4120J16210k1034j06787J08567K1035j23494P9326
360A0390N5192j23295M8427P9383j13046J9121R2072j00636k064J04700r3060
371b2816k9364J20255p3806o0649J26475m9994r2426J30386j0428j28825J06642
$$ y = [-25559, 88470, -33440, -42323, 87780, -8841, -56084, 75342, 13377, -57369, 60168, 20254, -59233, 55391, 25626, -75905, 49610, 49690, -92298, 20796, 76702, -86070, -17025, 87624, -65157, -47201, 86800, -38854, -68301, 75753, -12859, -76926, 61615, 5381, -78827, 53635, 22758, -85697, 43425, 47288, -90230, 20340, 74572, -78374, -12607, 86658, -50381, -35359, 79013, -28667, -44854, 72873, -11327, -54738, 61703, 5275, -54530, 53895, 10687, -63433, 52777, 31743, -75044, 33523, 54558, -68936, 10390, 65582, -57713, -9286, 70097, -42949, -23828, 68244, -32392, -34456, 70244, -22816, -52180, 68075, -5731, -66380, 60095, 10101, -82325, 48061, 37633, -91192, 15450]
382A5450M1659j32355O7658O6256j24893M4667R0942j21475R454J12677j00734
393c0694k0476J23110q3668n2529J33524n1845q7853J25241j4346j09482J07494
404C8476K3608j22836P5238N4867j15327M6210O8059j10894K6715R0328j06577
415c2133o650J05951q4089l4951J08752o4853n8125J14853l7704q6544J04369
426B8876l074r7178Q6330K0821j03895P0661M5614j08384M9486O9217j09317K4826
438b6017R3670r9677j0238J07444p8404l6538J12994o0537o4518J17258k8505
449B6932r1975J03549M373j04878Q6571L1411j14967O5343O3345j18437L4036
460a4697Q9577j06797j241J03978q7064k9344J09402o6415n5780J13131m1362
$$ y = [15450, 57109, -75246, -7588, 58668, -66225, -21558, 69384, -52091, -42637, 70040, -30694, -51170, 71940, -11728, -64257, 69267, 17422, -70431, 54810, 40464, -69018, 38476, 62084, -60752, 14486, 69353, -45974, 236, 68295, -42599, -15884, 74444, -32133, -38783, 67168, -16921, -51872, 56880, -7973, -66098, 48755, 11051, -75493, 28876, 25802, -71376, 14954, 35775, -68120, 2541, 48155, -60229, -10743, 58474, -50843, -26017, 67653, -32024, -42262, 65182, -13222, -49760, 63234, 2697, -61821, 55437, 26932, -65043, 38506, 42879, -61999, 24572, 55983, -58984, 6359, 69704, -48733, -14697, 74880, -31917, -33158, 70820, -16244, -45588, 63814, -2601, -58381, 54750, 13388]
471A3388q2711J06128p860r9271Q6982K1030j05712O8869M6629j09675M2820P2675
483E3292r9586J4044Q4493q5306n866R4126p3632k8383J02642n7471n2929J08074
495E3498l2207q0685R8574N17r3363Q0472K2621j01362O3534M9668j04873L6307
507g299O9333r5245J4373Q2100r1128q703J02015p7693m2932J12595m9036p3540
519f5160J06542j5409r2429Q8603J5978r8843O6472L8444r9310M7097N8567r8074
531d7522K3441P6051q8964K049Q9807q1648k5476J08083n7877o1182J03144k1683
543A8223p5968Q7387R44q3491P3603K2237q7281N7271L8222r0330M4644N7497
$$ y = [13388, -69323, 36805, 28945, -70326, 16656, 37686, -68026, 843, 47472, -62203, -19383, 53292, -46294, -32250, 52243, -33063, -38929, 55197, -18435, -46818, 55824, -1647, -54576, 53498, 21291, -59394, 39180, 39697, -53666, 26806, 49427, -51935, 11599, 61267, -43606, -7299, 62034, -33211, -18838, 63262, -27866, -36569, 65446, -12247, -55179, 57416, 8380, -65160, 41382, 25973, -66456, 22147, 38125, -60718, 5754, 44198, -55112, -8015, 50552, -47522, -24081, 51970, -36994, -34945, 54862, -26786, -52262, 55821, -2056, -63238, 39906, 18223, -57745, 29642, 30586, -52905, 20698, 42935, -44346, 12925, 51147, -39183, 5461, 62958]
$$ [...]
8191d79
##END NTUPLES=NMR FID
##END=
