##TITLE=1H_Pr 3798-07
 CDCl3, 8 sc, 
 11.3.2019
##JCAMPDX= 6.0         $$ Bruker NMR JCAMP-DX V2.0
##DATA TYPE= NMR FID
##DATA CLASS= NTUPLES
##ORIGIN= UXNMR, Bruker Analytische Messtechnik GmbH
##OWNER= root
$$ XWIN-NMR		Version 3.5
$$ Mon Mar 11 18:09:53 2019 Russian Standard Time (UT+4h)  she@DPX200
##.OBSERVE FREQUENCY= 200.1316
##.OBSERVE NUCLEUS= ^1H
##.DELAY= (6, 6)
##.ACQUISITION MODE= SIMULTANEOUS
##.ACQUISITION SCHEME= undefined
##.AVERAGES= 8
##.DIGITISER RES= 18
##SPECTROMETER/DATA SYSTEM= spect
##.PULSE SEQUENCE= zg30
##.SOLVENT NAME= CDCl3
##.SHIFT REFERENCE= (INTERNAL, CDCl3, 0, 15.7039)
##AUDIT TRAIL= $$ (NUMBER, WHEN, WHO, WHERE, WHAT)
$$ ##TITLE= Audit trail, XWIN-NMR		Version 3.5
$$ ##JCAMPDX= 5.01
$$ ##ORIGIN= Bruker BioSpin GmbH
$$ ##OWNER= she
$$ F:/spectra/data/she/nmr/H-F/1/audita.txt
$$ ##AUDIT TRAIL=  $$ (NUMBER, WHEN, WHO, WHERE, WHAT)
(   1,<2019-03-11 18:08:39.17 +0400>,<she>,<DPX200>,
      <created by zg, POWCHK disabled, PULCHK disabled
       configuration hash MD5:
       00 E9 B6 7A A2 85 ED C7 34 08 36 98 17 FE 4E 26
       data hash MD5: 16K
       58 F8 EA 64 40 08 1D 37 0F 70 A2 4A 3B 1E 08 20>)
$$ ##END=
$$ 
$$ hash MD5
$$ F7 5E 41 31 EE E8 50 B3 80 55 E7 D3 00 81 79 BC
##$RELAX= 
##$RELAX= 
##$RELAX= 
##$RELAX= 
##$RELAX= 
##$RELAX= 
$$ Bruker specific parameters
$$ --------------------------
##$DU= <F:/spectra>
##$EXPNO= 1
##$NAME= <H-F>
##$PROCNO= 1
##$TYPE= <nmr>
##$USER= <she>
##$AMP= (0..31)
100 100 100 100 100 100 100 100 100 100 100 100 100 100 100 100 100 100 
100 100 100 100 100 100 100 100 100 100 100 100 100 100 
##$AQSEQ= 0
##$AQ_mod= 1
##$AUNM= <au_zg>
##$AUTOPOS= <>
##$BF1= 200.13
##$BF2= 200.13
##$BF3= 200.13
##$BF4= 200.13
##$BF5= 200.13
##$BF6= 200.13
##$BF7= 200.13
##$BF8= 200.13
##$BYTORDA= 1
##$CFDGTYP= 0
##$CFRGTYP= 5
##$CHEMSTR= <none>
##$CNST= (0..31)
1 1 145 1 1 1 1 1 1 1 1 1 1 1 1 1 1 1 1 1 1 1 1 1 1 1 1 1 1 1 1 1 
##$CPDPRG= <>
##$CPDPRG1= <>
##$CPDPRG2= <>
##$CPDPRG3= <>
##$CPDPRG4= <mlev>
##$CPDPRG5= <mlev>
##$CPDPRG6= <mlev>
##$CPDPRG7= <mlev>
##$CPDPRG8= <mlev>
##$CPDPRGB= <>
##$CPDPRGT= <>
##$D= (0..31)
0 1.2 0 0 0 0 0 0 0 0 0 0.03 0 0 0 0 0 0 0 0 0 0 0 0 0 0 0 0 0 0 0 0 
##$DATE= 1552313318
##$DBL= (0..7)
120 120 120 120 120 120 120 120 
##$DBP= (0..7)
150 150 150 150 150 150 150 150 
##$DBP07= 0
##$DBPNAM0= <>
##$DBPNAM1= <>
##$DBPNAM2= <>
##$DBPNAM3= <>
##$DBPNAM4= <>
##$DBPNAM5= <>
##$DBPNAM6= <>
##$DBPNAM7= <>
##$DBPOAL= (0..7)
0.5 0.5 0.5 0.5 0.5 0.5 0.5 0.5 
##$DBPOFFS= (0..7)
0 0 0 0 0 0 0 0 
##$DE= 6
##$DECBNUC= <off>
##$DECIM= 24
##$DECNUC= <off>
##$DECSTAT= 4
##$DIGMOD= 1
##$DIGTYP= 9
##$DL= (0..7)
0 120 120 120 120 120 120 120 
##$DP= (0..7)
150 150 150 150 150 150 150 150 
##$DP07= 0
##$DPNAME0= <>
##$DPNAME1= <>
##$DPNAME2= <>
##$DPNAME3= <>
##$DPNAME4= <>
##$DPNAME5= <>
##$DPNAME6= <>
##$DPNAME7= <>
##$DPOAL= (0..7)
0.5 0.5 0.5 0.5 0.5 0.5 0.5 0.5 
##$DPOFFS= (0..7)
0 0 0 0 0 0 0 0 
##$DQDMODE= 0
##$DR= 18
##$DS= 0
##$DSLIST= <SSSSSSSSSSSSSSS>
##$DSPFIRM= 0
$$ [...]
##$SUBNAM2= <"">
##$SUBNAM3= <"">
##$SUBNAM4= <"">
##$SUBNAM5= <"">
##$SUBNAM6= <"">
##$SUBNAM7= <"">
##$SUBNAM8= <"">
##$SUBNAM9= <"">
##$SW= 24.9336934301222
##$SWIBOX= (0..15)
0 0 2 0 0 0 0 0 0 0 0 0 0 0 0 0 
##$SW_h= 4990.01996007984
##$TD= 16384
##$TD0= 1
##$TE= 0
##$TE2= 300
##$TE3= 300
##$TEG= 300
##$TL= (0..7)
0 120 120 120 120 120 120 120 
##$TP= (0..7)
150 150 150 150 150 150 150 150 
##$TP07= 0
##$TPNAME0= <>
##$TPNAME1= <>
##$TPNAME2= <>
##$TPNAME3= <>
##$TPNAME4= <>
##$TPNAME5= <>
##$TPNAME6= <>
##$TPNAME7= <>
##$TPOAL= (0..7)
0.5 0.5 0.5 0.5 0.5 0.5 0.5 0.5 
##$TPOFFS= (0..7)
0 0 0 0 0 0 0 0 
##$TUNHIN= 0
##$TUNHOUT= 0
##$TUNXOUT= 0
##$USERA1= <user>
##$USERA2= <user>
##$USERA3= <user>
##$USERA4= <user>
##$USERA5= <user>
##$V9= 5
##$VALIST= <valist>
##$VCLIST= <CCCCCCCCCCCCCCC>
##$VD= 0
##$VDLIST= <DDDDDDDDDDDDDDD>
##$VPLIST= <PPPPPPPPPPPPPPP>
##$VTLIST= <TTTTTTTTTTTTTTT>
##$WBST= 1024
##$WBSW= 4
##$XGAIN= (0..3)
0 0 0 0 
##$XL= 0
##$YL= 0
##$YMAX_a= 164899
##$YMIN_a= -281105
##$ZGOPTNS= <>
##$ZL1= 120
##$ZL2= 120
##$ZL3= 120
##$ZL4= 120
##$ABSF1= 10
##$ABSF2= 0
##$ABSG= 5
##$ABSL= 3
##$ALPHA= 0
##$AQORDER= 0
##$ASSFAC= 0
##$ASSFACI= 0
##$ASSFACX= 0
##$ASSWID= 0
##$AUNMP= <proc_1d>
##$AZFE= 0.1
##$AZFW= 0.1
##$BCFW= 1
##$BC_mod= 2
##$BYTORDP= 1
##$COROFFS= 0
##$CY= 11.3945322036743
##$DATMOD= 1
##$DC= 2
##$DFILT= <>
##$DTYPP= 0
##$F1P= 18.9103706918063
##$F2P= -1.10871071338519
##$FCOR= 0.5
##$FTSIZE= 0
##$FT_mod= 4
##$GAMMA= 1
##$GB= 0.15
##$INTBC= 1
##$INTSCL= 1
##$ISEN= 128
##$LB= 0.24
##$LEV0= 0
##$LPBIN= 0
##$MAXI= 10000
##$MC2= 0
##$MEAN= 0
##$ME_mod= 0
##$MI= 1.114404
##$NCOEF= 0
##$NC_proc= 0
##$NLEV= 6
##$NOISF1= 3.799351
##$NOISF2= 2.8
##$NSP= 1
##$NTH_PI= 0
##$NZP= 0
##$OFFSET= 15.70392
##$PC= 1
##$PHC0= -8842.692
##$PHC1= 18.80024
##$PH_mod= 1
##$PKNL= yes
##$PPARMOD= 0
##$PSCAL= 0
##$PSIGN= 0
##$REVERSE= no
##$SF= 200.130013532006
##$SI= 16384
##$SIGF1= 3
##$SIGF2= 2
##$SINO= 400
##$SIOLD= 16384
##$SREGLST= <1H.CDCl3>
##$SSB= 0
##$STSI= 0
##$STSR= 0
##$SW_p= 3612.71676300578
##$SYMM= 0
##$S_DEV= 0
##$TDeff= 0
##$TDoff= 0
##$TI= <>
##$TILT= no
##$TM1= 0
##$TM2= 0
##$TOPLEV= 0
##$USERP1= <user>
##$USERP2= <user>
##$USERP3= <user>
##$USERP4= <user>
##$USERP5= <user>
##$WDW= 1
##$XDIM= 8192
##$YMAX_p= 0
##$YMIN_p= 0
$$ End of Bruker specific parameters
$$ ---------------------------------
##NTUPLES= NMR FID
##VAR_NAME=  TIME,          FID/REAL,        FID/IMAG
##SYMBOL=    X,             R,               I
##VAR_TYPE=  INDEPENDENT,   DEPENDENT,       DEPENDENT
##VAR_FORM=  AFFN,          ASDF,            ASDF
##VAR_DIM=   8192,          8192,            8192
##UNITS=     SECONDS,       ARBITRARY UNITS, ARBITRARY UNITS
##FACTOR=    0.0002004,     1,               1
##FIRST=     0,             0,               0
##LAST=      1.6414764,     0,               0
##MIN=       0,             -281105,         0
##MAX=       1.6414764,     164899,          0
$$ Real data points
##PAGE= N=1
##DATA TABLE= (X++(R..R)), XYDATA
$$ [...]
3007B315J241q796O780L218r283M200N604q834J181P656p388j418Q355n731l415
$$ 2315 3556 -5240 1540 4758 -4525 -325 5279 -3555 -2374 5282 -2106 -3524 4831 -900 -4315
3022d315Q348m017m662Q345k440o923Q696m09q319P091K325q804M668N397r384
$$ -4315 4033 16 -4646 3699 1259 -5664 3032 2623 -5696 1395 3720 -5084 -416 4981 -4403
3037d403K877P004q064l16P878o337j789P969n273l323Q362l456o079Q591j168
$$ -4403 -1526 5478 -2586 -2902 4976 -1361 -3150 4819 -454 -3777 4585 1129 -4950 3641 2473
3052B473p656Q134Q01q801N880L753q705L274O097q368R04O990o957p30P021n852
$$ 2473 -5183 2951 3752 -5049 831 4584 -4121 -847 5250 -3118 -2214 4776 -2181 -2911 4110 -1742
3068a742j949P930n317l999R014l094o384Q548n92q014O968K727q938M590N054
$$ -1742 -3691 4239 -1078 -5077 3937 843 -5541 3007 2415 -5599 1369 4096 -4842 -252 4802
3083D802q661K939N859q034J436P268p604q42Q172o184l002Q811m297n634Q999
$$ 4802 -3859 -920 4939 -3095 -1659 5609 -1995 -2837 5335 -849 -3851 4960 663 -4971 4028
3098D028j581p349P090J042q268N483L506q197L664M512p249J670N902p252O48
$$ 4028 2447 -4902 2188 3230 -5038 445 3951 -4246 -582 3930 -3319 -1649 4253 -2999 -2351
3113b351P198o969j561Q353n071m060Q699k930o396Q231n77p374O516J349p412
$$ -2351 4847 -2122 -3683 4670 -401 -4461 4238 1308 -5088 3143 2566 -4808 1708 3057 -4355
3128d355N172K919p854L443N169p838J648O419p390n10Q649o767k981Q623l745
$$ -4355 817 3736 -4118 -675 4494 -3344 -1696 4723 -2667 -3177 5472 -1295 -4276 4347 602
3143F02n302Q167j313o891P096O75p189N074K679p556M343M288q151K372N962
$$ 602 -4700 3467 2154 -4737 2359 3034 -4155 919 3598 -3958 385 4673 -3478 -1106 4856
3158D856p790P43P097o868j944Q569m971m400P752k060n575O862n03o415O430
$$ 4856 -2934 -2191 4906 -1962 -3906 4663 -308 -4708 3044 984 -4591 2271 1768 -4647 1783
3173A783R50p142N243K467p617M409M205q102K114O821p289l77P405o023k063
$$ 1783 2733 -4409 834 3301 -4316 93 4298 -3804 -1690 5131 -2158 -2535 4870 -1153 -3216
3188c216P544l515m828P591j981n305O769p37o535O328J535q105M896L863q631
$$ -3216 4328 813 -4015 3576 1595 -3710 3059 2322 -4213 2115 3650 -4455 441 4304 -4327
3203d327L428N712q014N97P100o244k215P620m263l225P478l362m683O884j148
$$ -4327 -899 4813 -3201 -2604 4496 -1748 -3963 3657 -606 -3831 3647 285 -4398 2486 1338
3218A338n805O598M37p492O176K788q193L741N162p866K082N947p234j45O805
$$ 1338 -4467 2131 2568 -4924 1252 4040 -4153 -412 4750 -3116 -1034 4913 -2321 -2466 4339
3233D339n082k133P132m658l009P174l182m872P184r29o844O836J129p830N075
$$ 4339 -743 -2876 4256 -402 -3411 3763 581 -4291 2893 1964 -4880 1956 3085 -4745 330
3248C30L586p791L017N021o790N75O290o377n40O887n114k507P323l705l914P015
$$ 330 3916 -3875 -858 4163 -2627 -2052 4238 -2139 -2679 4208 -906 -3413 3910 205 -3709 3306
3264C306j908n925O943K63p153N483K094o990L952M184p643J602N724o173N10
$$ 3306 1398 -4527 2416 2679 -4474 1009 3103 -3887 65 4249 -3394 -1792 3932 -2241 -1731
3279a731N676n952j127P040m582l034P582l142m936P361j139o353O353J113p690
$$ -1731 3945 -2007 -3134 3906 -676 -3710 3872 730 -4206 3155 2016 -4337 2016 3129 -4561
3294d561N200L139p091K819M572o718J520N108o240O3O349n577k046P704m930
$$ -4561 639 3778 -3313 -494 4078 -2640 -1120 3988 -2252 -2189 4160 -1417 -3463 4241 -689
3309f89l579P751k450n409O211R0o324N542J909p003L649L727o673K573M346o380
$$ -689 -4268 3483 1033 -4376 1835 1925 -4399 1143 3052 -3951 -302 3425 -3248 -675 3671 -2709
3325b709J300N607o313n89O863n248k490P353l206m476O690j141o110O278L39
$$ -2709 -1409 4198 -2115 -2704 4159 -1089 -3579 3774 568 -3908 2782 1641 -4469 1809 2148
3340B148n949M536K422o872L901L520o713K013N341o788M07O540n780j815O896
$$ 2148 -3801 735 3157 -3715 186 3706 -3007 -994 4347 -2441 -2034 4506 -1274 -3089 3807
3355C807l452l902O712k331n070O581l46n661N159R35o214M491K127o417L266
$$ 3807 355 -3547 3165 834 -4236 2345 1999 -3662 1497 2432 -3782 709 2836 -3581 -315
3370c15L861o526J161N714n911m79O334m819k189O547l001l662N829j259n045
$$ -315 3546 -2980 -1819 3895 -2016 -2495 3839 -980 -3169 3378 377 -3285 2544 1285 -3760
3385c760O193n01n883N017J564o455L863L273o703K625M514o289M68O056n255
$$ -3760 2433 1932 -3951 1066 2630 -3825 38 3311 -3392 -767 3747 -2542 -2074 3982 -1273
3400a273j553O453m165l037O626k309m118O366j331n444O431k24o252M759K747
$$ -1273 -2826 3627 -538 -3575 3051 742 -3376 2990 1659 -3785 2646 2422 -3830 929 3676
3415C676o856L012M234o771J286N355n635r28N830m485k076O222l432l388O418
$$ 3676 -3180 -168 4066 -2705 -1419 3936 -1699 -2627 3203 -1282 -3358 2864 -568 -3956 2462
3430B462k041m393N852m53n404N009J410o489M166L404o714K571M490n901Q64
$$ 2462 421 -3972 1880 1427 -3977 1032 2442 -4047 119 3523 -3191 -620 3870 -2031 -1167
3445a167N373n216q33N858m122k621O153k752l715O191j515n509N768K07n761
$$ -1167 4206 -1010 -1843 4015 -107 -2728 3425 673 -3042 3149 1634 -3875 1893 2100 -3661
3460c661M270K024o043L136L576o067J486M809n495k45N858n051j006N998l955
$$ -3661 609 2633 -3410 -274 3302 -2765 -1279 3530 -1965 -2210 3648 -1403 -2409 3589 -366
3475c66l100O314k044l987N577q63n163M689J597o068M045J998n682K579L666
$$ -366 -3466 2848 804 -3183 2394 1531 -3632 1057 2654 -3414 631 2629 -3053 -474 3192
3490C192n996R69N107n243l74N647m326k186O434k969l482O051j475m187N022
$$ 3192 -2804 -1835 3272 -1971 -2345 3302 -1024 -3210 3224 255 -3227 2824 1349 -2838 2184
3505B184m4n397M680J803n954L215K851n873K424L898n939L11N506m962j022N563
$$ 2184 2140 -3257 1423 3226 -2728 487 3338 -2535 -111 3787 -2152 -1841 3665 -1297 -2319 3244
3521C244m193k023N751k223m086N319p78m599M474O69n061L612K488n820K714
$$ 3244 -949 -2972 2779 556 -3530 1789 1011 -3588 886 1555 -3506 106 2594 -3226 -512
3536e12L463n721J726M498n219P9N345m628j361N624l009k707N175k061l983N545
$$ -512 2951 -2770 -1044 3454 -1765 -1686 3659 -969 -2330 3294 285 -2422 2753 692 -3291 2254
3552B254l56n220M656Q56n427L664K657n569K182L584n336O57M916m760j165N350
$$ 2254 1898 -3322 1334 2190 -3237 427 3084 -2485 -303 3281 -2055 -1398 3518 -1242 -2407 2943
3568B943l230k744N561k292l332N398j216m624M611M56n014L774K082n723K717
$$ 2943 -287 -3031 2530 238 -3094 2304 1088 -3536 1075 1531 -3483 291 2373 -3350 -633
3583f33L433n196J150M105m718M5N140m251j431N387l206k615N680j884l747N397
$$ -633 2800 -2396 -1246 2859 -1859 -1814 3326 -925 -2356 3031 -175 -2790 2890 1006 -2741 2656
3599B656m74m723M510N33m889L302J727n335K625L005m959Q49M585n220l98N218
$$ 2656 2182 -2541 1969 2502 -2387 915 2642 -2693 -68 2937 -2022 -1173 3412 -1808 -2206 3012
3615C012l670k290N608k676l634N505j207l840M516K87m974L933J545n124K643
$$ 3012 -658 -2948 2660 -16 -3650 1855 648 -3192 1324 1611 -3363 570 2115 -3009 -366
3630c66L054n408J755M089m844J27M598m212j267N609l057k926N242j750l460
$$ -366 2688 -2720 -965 3124 -1720 -1593 3005 -1207 -2474 3135 78 -2848 2394 644 -2816
3645b816M523o17l979M153Q22m878L540J838m993K719K661n103J534L975m559
$$ -2816 1707 1090 -2889 1264 2086 -2792 748 2586 -2407 312 2973 -2130 -596 3379 -1180
3660a180o50M987l480j903N230k735k666M950j632m027M765j42m627M037N52n090
$$ -1180 -1830 3157 -323 -2226 3004 269 -2397 2553 921 -3106 1659 1517 -3110 927 1479 -3611
3676c611L449K811n455J791L720n065O23M830m635q90N246l203k153N179k246
$$ -3611 -162 2649 -2806 -1015 2705 -2360 -1737 3093 -1542 -2432 2814 -389 -2542 2637 391
3691C91k871M556p66l945M511J05m835L965J871n261K350K954n289J399L984m411
$$ 391 -2480 2076 1310 -2635 1876 1981 -2854 1111 2982 -2279 71 3025 -2264 -865 3119 -1292
3707a292k91M375l296j628M753k793k747N121j514l704M556k24m243L827Q07m786
$$ -1292 -1583 2792 -504 -2132 2621 -172 -2919 2202 688 -3016 1540 1316 -2927 900 1707 -3079
3723c079L243K274n279K572L119m773O15M071m171l31M346l305j642M874k355
$$ -3079 164 2438 -2841 -269 2850 -1923 -1308 2763 -1408 -1739 2607 -698 -2340 2534 179
3738A79k869N070j641l667M243P05n154M001J308m826K815K466m792J506L780
$$ 179 -2690 2380 739 -2928 1315 2020 -3134 867 2175 -2651 164 2630 -2162 -656 3124
3753C124m409r2M395l893j126N026l387j747M407j647l515M891o99m199M226P29
$$ 3124 -1285 -1377 3018 -875 -2001 3025 -362 -2109 2298 651 -2864 2027 1328 -2871 1355 2084
3769B084n228L512K210n174K146K970m217L70M067m163l77M094l346j288M728
$$ 2084 -3144 368 2578 -2596 -450 2520 -1697 -1327 2740 -1423 -1800 2294 -1052 -2340 2388
3784B388k696k277M708j426l731M647j46m150L745J086m917L069K263m550J581
$$ 2388 -308 -2585 2123 697 -3034 1613 1467 -2683 1062 2148 -2769 300 2563 -1987 -406
3799d06K700l845Q80L576l867o54M536k684k618M922j843l683M716j65m423M134
$$ -406 2294 -1551 -671 2905 -962 -1616 2920 236 -2382 2540 697 -2986 1730 1565 -2858 1276
3815A276L22m218L233J436m626K405K708m419J117L322m141J14M112l924j058
$$ 1276 1598 -2620 613 2049 -2577 -172 2536 -1883 -766 2556 -1585 -1471 2641 -1283 -2341
3830b341M968k783k572M840j436l426M058k34l816L699R31m322K868J542m119
$$ -2341 2627 -156 -2728 2112 676 -2750 1308 1074 -2742 957 1888 -2434 434 1976 -2143
3845b143J447L003m244Q65L612l923j57M333l392j549M758k266k833M155p60l488
$$ -2143 -696 2307 -1937 -1072 2540 -1383 -1540 2793 -599 -2148 2610 344 -2489 1666 906 -2582
3861b582M402n96l539L181J026m335K724K438m883J753L479m447P4M262l854r35
$$ -2582 1820 1224 -2315 866 1892 -2443 281 2719 -2164 -411 3068 -1379 -1305 2957 -897 -1832
3877a832M627k857k542M348r96l205L917n83l486L761N10m409K889J863m373K028
$$ -1832 2795 -62 -2604 1744 748 -2457 1460 877 -2609 1152 1662 -2747 142 2005 -2368 -340
3893c40K727m262N58M196m095m00M278l276j334L678j733k152M119j511k862L959
$$ -340 2387 -1875 -1317 2879 -1216 -1616 2662 -614 -1948 1730 -3 -2155 1964 453 -2409 1550
3909A550m39l811L732R65m475K720K162m371J768K898m202L46L989l422j212M131
$$ 1550 1111 -2700 1032 1997 -2478 242 2404 -1967 -199 2699 -1503 -1157 2832 -590 -1802 2329
3925B329k556j884M041j853k727M147q45l354L927P7m342L441J461m710K219K521
$$ 2329 -227 -2111 1930 77 -2650 1497 652 -2702 1225 1302 -3040 401 1862 -2848 -629 1892
3941A892l980J687K935m249q5M136l005r17L890k528j732M082j753k563M280o87
$$ 1892 -2088 -401 2534 -1715 -1800 2336 -669 -1586 2304 -224 -1956 2126 373 -2190 2090 1403
3957A403l956L945Q19m463K434J859m080J673K632l850O87L110l294l57L978l056
$$ 1403 -2553 1392 2211 -2252 182 2041 -2039 -366 2266 -1584 -897 2213 -1081 -1438 2540 -516
3973e16j522M048k164k305M488j477l029L801j07l801L171J593l966J628K402
$$ -516 -2038 2010 -154 -2459 2029 552 -2477 1324 1217 -2584 587 2180 -1786 -158 2244
3988B244m337J585K907l797N55L098l681m34M216l126j347M399k091k760M073
$$ 2244 -2093 -508 2399 -1398 -843 2255 -1426 -1860 2356 -770 -2117 2282 191 -2569 1504
4003A504o86l298L193P97l547K665J560m010J977K332m050J034L158l736K24L467
$$ 1504 818 -2480 713 1510 -2037 628 2188 -1822 155 2487 -1563 -529 2629 -1107 -883 2584
4019B584l268j350M359k366j911L642q47l160L166J19l594L187R69l894K093K045
$$ 2584 -684 -2034 2325 -41 -1952 1690 843 -2317 849 968 -2626 561 1530 -2364 -271 1774
4035A774m153J718K599l757O80L159l376l63L991k578j706M206j805k327L863
$$ 1774 -2379 -661 1938 -1819 -1139 2020 -1356 -1719 2272 -306 -2012 2194 389 -1938 1925
4050A925q91k986L276L1l526L009J009l628K314K123m144J212K732l694j08L605
$$ 1925 1034 -1952 1324 1355 -2171 838 1847 -1781 533 2656 -1488 -276 2456 -1238 -1346 2259
4066B259k746j412M128k149k207M072j088k947L327m5l539L345M31l804K862J344
$$ 2259 -487 -1899 2229 80 -2127 1945 857 -2090 1237 1192 -2347 998 1429 -2375 487 1831
4082A831l802J671K204l501L85L348l166p56L687k441j673L698j608j754L346
$$ 1831 -1971 -300 1904 -1597 -1212 2136 -1030 -1786 1901 -540 -2213 1485 -123 -1877 1469
4097A469r54k652L470J97l682K896Q46l492K633J598l613J003K427l101p7L383
$$ 1469 515 -2137 1333 1530 -2152 744 1590 -1902 731 2329 -1284 -281 2146 -955 -1032 2351
4113B351l028p82L872k172k144L883j568k554L719o57l304L460K56l719K495J636
$$ 2351 -677 -1459 2413 241 -1903 1980 412 -2142 1577 920 -2384 1076 1332 -2387 108 1744
4129A744l693J886J931l461Q01K667k729m11L512k908j004L325j778k116L758
$$ 1744 -1949 -63 1868 -1593 -792 1875 -854 -1265 2247 -661 -1665 1660 -118 -2234 1524
4144A524j219k436L366j05l520L182Q45l528J842K011l874J378K625l582Q26K895
$$ 1524 305 -2131 1235 1130 -2390 792 1637 -1891 -49 1962 -1912 -534 2091 -1491 -665 2230
4160B230k782n64L642k993q27L456j922k094L674o70l037L234K15l656K747J148
$$ 2230 -552 -1116 2526 -467 -1294 2162 240 -1854 1820 1150 -1887 1347 1562 -2094 653 1801
4176A801l566J717K160l959J230K495l310l2L747l341j015L785k196j667M009
$$ 1801 -1765 -48 2112 -1847 -617 1878 -1432 -1464 2283 -1058 -2073 1712 -484 -2151 1858
4191A858j456k842L551rk986K453J294l785K144J630l377J207K517l291L66L004
$$ 1858 402 -2440 1111 1102 -1884 569 1863 -1922 222 1852 -1525 -318 2199 -1092 -726 2278
4207B278l039m40L419k330j438L694j834k104L246o19l004K933N95l469K605J060
$$ 2278 -761 -1201 2218 -112 -1550 2144 310 -1794 1452 833 -2171 762 1357 -2112 493 1553
4223A553l748K208J728l578J757K484l729K14L025k692r35M022k139j672L191
$$ 1553 -2195 13 1741 -1837 -80 2404 -1325 -1111 1914 -778 -1713 2309 170 -1502 1689
4238A689j261k857L641p3k928K539M53l333K401J380l493J560K385l479L98K982
$$ 1689 428 -2429 1212 1139 -1789 750 1203 -2130 271 1651 -1842 -282 2103 -1376 -978 2004
4254B004l109l39L520k398j484L812k020j816L247p37k619L186j84l056K695Q92
$$ 2004 -1105 -1444 2076 -322 -1806 2006 -14 -1830 1417 680 -1939 1247 1063 -1993 702 1594
4270A594l579K322J365l495J669J905l008n3L126k760m13L385k484j085L187j352
$$ 1594 -1985 337 1702 -1793 -124 1781 -1227 -1280 1846 -914 -1327 2058 -426 -1511 1676 324
4286C24k111L166q20k609K687L44k752K165J314l392J365K346l616Q00K764l002
$$ 324 -1787 1379 559 -2050 637 981 -1771 394 1708 -1684 -319 2027 -1589 -789 1975 -1027
4302a027j78L459k696j063L424j910j844L531j163k453L511o35k903K776P61l479
$$ -1027 -1205 2254 -442 -1505 1919 9 -1835 1696 533 -1920 1591 956 -1947 829 1590 -1889
4318a889K101J682l466J271K105l027N25K894l108n08L442k548j155L398j617
$$ -1889 212 1894 -1572 -301 1804 -1223 -698 2196 -912 -1420 2022 -526 -1681 1717 100
4333A00j909K967l80k870K959K54l326K667R43l124J758J565k894P41K613k916
$$ 100 -1809 1158 778 -2092 867 1121 -2205 462 1405 -1719 39 1604 -1290 -549 2064 -852
4349h52j44L077k812n46L046j887j572L342j434k190L437q70k483K742j1k853
$$ -852 -996 2081 -731 -1277 1769 -118 -1690 1652 218 -1972 1465 595 -1888 854 843 -2010
4365b010K483J159l288J404K122l044O51K567l049l29L397k706m60K746j519j887
$$ -2010 473 1632 -1656 -252 1870 -1174 -523 2044 -1005 -1334 2063 -643 -1103 1643 124 -1763
4381a763L158o58k727K980p8k966K613R22l434K258J550l120Q68K077k970L46
$$ -1763 1395 737 -1990 990 912 -2054 559 1481 -1953 305 1855 -1265 -397 1680 -1290 -944
4397i44K792k539p15L313k109j439L356j316k284K771j10k724K977k9k932K266
$$ -944 1848 -691 -1406 1907 -202 -1641 1715 399 -1885 886 776 -1948 1029 1000 -1932 334
4413C34J459l506J552K065l463P59K919l222N70K419k286j094L167j546j531L050
$$ 334 1793 -1713 -161 1904 -1559 -800 2119 -1103 -533 1886 -400 -1494 1673 127 -1404 1646
4429A646j416j967K768J8l035K675Q76l448K230J211l105J356K119l047N52K283
$$ 1646 230 -1737 1031 1049 -1986 689 1565 -1883 347 1558 -1547 -191 1928 -1119 -567 1716
4445A716k678pK414k103r67L142j244k276L274n76k739L119J63k913K236J265
$$ 1716 -962 -969 1445 -658 -1625 1517 273 -2003 1271 695 -2044 1075 1238 -1675 561 1826
4461A826l473J769J348k769J266K112k998Q1K771k603o93K995j566j842L381j179
$$ 1826 -1647 122 1470 -1299 -33 2079 -919 -838 1933 -670 -1363 1632 66 -1776 1605 426
4477D26k348L070m19k609K699N60l373K280J361l121J655J381k912Q12K452k726
$$ 426 -1922 1148 729 -1880 819 1379 -1994 286 1647 -1474 181 1562 -1350 -538 1914 -812
4493h12j09K595k299o79K807j559j739K991n64k488K929j54k912K309Q12k954
$$ -812 -921 1674 -625 -1304 1503 -56 -1795 1196 632 -1856 1073 919 -1993 316 1128 -1826
4509a826J730J635k978Q39K337k696K66K693k762k65K684j630j564L256j134j900
$$ -1826 -96 1539 -1439 -600 1737 -959 -693 2000 -762 -1027 1657 27 -1537 1719 585 -1315
4525a315K586m03k445K382N61l079K246R40l055J390J936l042Q66K071k685j03
$$ -1315 1271 868 -1577 805 1366 -1713 533 1473 -1582 -192 1744 -1298 -432 1639 -1046 -1149
4541a149K903k208q91L051k016j304L036r05k022K503m6k628K213P18l054J833
$$ -1149 1754 -454 -1345 1706 -310 -1614 1422 517 -1505 998 952 -1676 537 1255 -1799 34
4557C4J426k879J159K118k656M43K230k637j70K735k092j066K647q61j957K960
$$ 34 1460 -1419 -260 1858 -798 -355 1875 -762 -932 1803 -289 -1355 1292 431 -1526 1434
4573A434r91k023K036L78k411K103P04k955J534J803l018Q87K568k950k66K793
$$ 1434 443 -1580 456 834 -1577 526 1230 -1725 -191 1612 -1406 -519 2049 -901 -1167 1626
4589A626k231o82L098j727j953L076m46k266K733m94k622K426N31k721J901J176
$$ 1626 -605 -1287 1811 84 -1869 1207 761 -1505 1228 734 -1888 538 1069 -1652 249 1425
4605A425k820J610J340k621J91K552k548l26K962k188q32K760j442j452K856q73
$$ 1425 -1395 215 1555 -1066 -875 1677 -871 -1197 1765 -423 -1255 1505 63 -1389 1467 594
4621E94k052K438m12k389K187J028l108J623K055l246O83K384l144N30K463k251
$$ 594 -1458 980 568 -1821 366 1394 -1714 -91 1964 -1282 -599 1785 -1359 -829 1634 -617
4637f17p69K574j448j154K666j217j682L011p74j992K008M94k704J904R78k611
$$ -617 -1386 1188 -260 -1414 1252 35 -1647 1364 590 -1402 606 1100 -1604 300 1278 -1333
4653a333J120J602k131J29K265k459j33K297k100l41K727j835j052K751j154k325
$$ -1333 -213 1389 -742 -613 1652 -807 -940 1357 -743 -1084 1643 -192 -1244 1507 353 -1972
4669a972K864N9k445J807R07k669J562R76k389J075J718k495K08K373k207l32
$$ -1972 892 951 -1494 313 1220 -1449 113 1089 -1300 -225 1493 -1002 -794 1579 -628 -960
4685i60K710k265j196K932j214j338K476m46k395K641k39k392J862J192k649J178
$$ -960 1750 -515 -1711 1221 7 -1331 1145 699 -1696 945 706 -1686 176 1368 -1281 -103
4701a03J338k294O55J908k132j52K481k132n71K323j361r93K469q14k259K500
$$ -103 1235 -1059 -404 1504 -628 -780 1701 -431 -1002 1321 -40 -1033 1436 622 -1637 863
4717H63J12k240J813K41k257J565J166k303J021J646k757O52K215k425P9J801
$$ 863 975 -1265 548 789 -1468 97 1263 -1040 -19 1627 -1130 -478 1737 -688 -609 1192
4733A192j764n52K390r97j874K536l93k222K467j2k175J640N33k234J479J288
$$ 1192 -572 -1124 1266 269 -1605 931 538 -1684 783 771 -1404 236 769 -1465 14 1302
4749A302k546J095J837k496J37K302k146m32K519j723q88K385j031j691K239l44
$$ 1302 -1244 -149 1688 -808 -671 1631 -515 -947 1572 -151 -1039 1346 315 -1376 863 519
4765E19j762J818K54k275J853R61k722J199J388k431O35J988j816k60J843j262
$$ 519 -1243 575 829 -1446 407 1368 -1354 -155 1233 -1198 -563 1425 -391 -651 1192 -70
4781g0j340K623r65j427K232q05j552K111K8k127J592O07k275J392R87k287P64
$$ -70 -1410 1213 248 -1179 1053 248 -1304 807 835 -1292 300 907 -1368 24 1011 -1276 -512
4798e12J881k279R7K153j625p05K008j324r70K520j103j650K680p36j845K551
$$ -512 1369 -910 -813 1340 -285 -990 1018 -306 -1276 1244 141 -1509 1171 435 -1410 1141
4814A141p8k536J902R38k675J271J281k109K88K276k392J2K075j564q30J784p29
$$ 1141 1063 -1473 429 1367 -1308 -37 1244 -865 -577 1699 -693 -681 1394 -170 -1000 784 55
4831E5j401K706j092j651K085q1j800J518M55j927J057J439k367M56J735j825
$$ 55 -1346 1360 268 -1383 702 621 -1179 339 794 -1133 -76 1363 -1004 -548 1187 -638
4847f38L14J595j927q3J983j494o99K654j710j446K729p84j926K499m9k397K062
$$ -638 -324 1271 -656 -739 1244 -250 -949 1705 -5 -1451 1278 494 -1432 1067 1018 -1379 683
4864F83K92j962Q47J225k089O12J446j754J8J864j638n88K247j376r62K073n45
$$ 683 975 -987 -140 1085 -1004 -392 1054 -700 -682 1182 -456 -1044 1203 -173 -1135 938 393
4881C93j641K133j47j984J697M51k054J425J253k712Q42J413j919K30J661j629
$$ 393 -1248 885 738 -1246 451 902 -1152 273 1526 -1186 -344 1069 -850 -620 1041 -588
4897e88j86J985j726l35J979j158j164K105p38j273J771k28j853J820L07j754
$$ -588 -774 1211 -515 -850 1129 -29 -1193 912 174 -1099 672 444 -1409 411 718 -1036
4913a036J002J081j869M58J839k131l6K150j806m03J925j420p71J860k51j806
$$ -1036 -34 1047 -822 -364 1475 -656 -692 1458 -348 -751 1174 -246 -1017 843 592 -1214
4929a214K028m16j825J884Jj660J483Q09k388J210J294k280P20J513j783m7J738
$$ -1214 814 398 -1427 457 458 -1202 281 1090 -1298 -88 1206 -1074 -354 1159 -624 -671 1067
4946A067j474o04K138j240r74K543j231j481J900k5j827J956K08j842Q12J217
$$ 1067 -407 -1011 1127 -113 -1087 1456 225 -1256 644 619 -1208 748 956 -886 -74 1143
4962A143k603J327J418k231P96J582j741m78J882j233r08J952p88j441K037l59
$$ 1143 -1460 -133 1285 -946 -150 1432 -309 -787 1095 -138 -1046 906 118 -1323 714 355
4978C55j365J322L7j941J693R94k034Q91J279j838K80J516k098J48J806j367m10
$$ 355 -1010 312 349 -1592 101 1095 -939 -48 1231 -607 -327 1189 -909 -761 1045 -322 -732
4995g32J804j165r81J648l94j406J853j08j488J718q7j841J183J163k027P11J650
$$ -732 1072 -93 -1074 574 180 -1226 627 519 -969 749 662 -1179 4 1167 -860 -149 1501
5012A501k116R0J744j678l20J685q54j001K115j120j297J943l95j467J845P0j725
$$ 1501 -615 -525 1219 -459 -779 906 52 -949 1166 46 -1251 692 297 -1170 675 745 -980
5029i80J114P79j934J263Q32j953O65J499j833j26J711j558k42J631j136q71J806
$$ -980 134 913 -1021 242 1074 -879 -214 1285 -548 -674 1037 -521 -763 868 -268 -1139 667
5046F67n15j267J697k47j125R97J88j249J081N25j734N10J495j336j26J388j282
$$ 667 152 -1115 582 335 -790 207 395 -854 227 752 -982 -472 1023 -313 -439 949 -333
5063c33k37J851j716k63J933j053j053J785p39j241J414J77j380J376K37j764
$$ -333 -570 1281 -435 -698 1235 182 -871 914 175 -1066 348 525 -855 521 758 -1006
5079a006R17R66j698N70J024j466J32J522j327l57J547r71o56J424q89r12J741
$$ -1006 -89 877 -821 -251 773 -693 -561 961 -366 -723 824 -147 -803 621 -268 -1180 561
5096E61l22j296J327L45k012J605Q34j512J83J268j447J40J419j534k42J812j401
$$ 561 239 -1057 270 615 -1397 208 1042 -470 -287 981 -466 -326 1093 -441 -683 1129 -272
5113b72l74J962j325p79J679q48j060J548j9j621J186N75j646J212P65j673M70
$$ -272 -646 1316 -9 -788 891 43 -1017 531 512 -1109 77 652 -994 218 983 -690 -220
5130b20J148j619P0J634j647j81J969j273p06J573p38j006J670l64j207J056L12
$$ -220 928 -691 -621 1013 -634 -815 1154 -119 -825 748 10 -996 674 310 -897 159 471
5147D71j298O01J092j980J047O91j058M5J451j451o1J406j652j51J730r80p57
$$ 471 -827 -226 866 -1114 -67 624 -434 -389 1062 -389 -450 956 -696 -847 883 -97 -854
5164h54J515n10j028J553j51j132Q36N64j751J278P64j685O01Q11j395P5J353
$$ -854 661 151 -877 676 525 -607 229 793 -958 320 1084 -601 0 811 -584 -509 844
5181H44j166j02J286q72j005K057j077j140J851l82j221J163L92j693J294M38
$$ 844 -322 -424 862 -10 -1015 1042 -35 -1175 676 294 -927 236 628 -1065 229 667
5197F67j508Q65Q17j539Q51N39j126K4J302j257o17J790p45q43J481o70j107J736
$$ 667 -841 24 841 -698 153 692 -434 -410 892 -365 -982 808 63 -780 701 31 -1076 660
5215F60q2j494J406r6j021M65O82j463P80J168j602JJ482j345R3J302j093l96
$$ 660 578 -916 490 394 -627 -162 520 -943 -163 1005 -597 -596 886 -459 -366 936 -157 -553
5233e53Q44j38j202J400k7j335J578l64j235J461L07j452P30O28j177N93N24j115
$$ -553 291 153 -1049 351 324 -1011 567 203 -1032 429 736 -716 14 642 -535 58 582 -533
5251e33j99J636j391k19J492q64o29J362m11r73J404j70j030J030K37j468Q31
$$ -533 -732 904 -487 -706 786 -78 -707 655 244 -729 675 505 -525 505 742 -726 105
5268A05P37j385M92J118j940M68J770k053K73J104o80j088J918r52o36J360j93
$$ 105 842 -543 -51 1067 -873 -405 1365 -688 -415 689 9 -1079 839 -113 -749 611 418
5285D18j185J162n2q80Q42M42j721P10Q96j306O94R74j302q3J441j735L5J454
$$ 418 -767 395 343 -537 305 747 -974 -264 632 -674 20 994 -308 -391 1050 -685 -650 804
5303H04p61l56J108r53m06R66J17j626J485K39j285J096J86j317P72R39j690N39
$$ 804 43 -313 795 -158 -564 402 519 -1107 378 617 -668 428 614 -703 69 1008 -682 -143
5321a43J217j313l00J387j000o57J366l50o25J264m28j417J104P16k030J541J88
$$ -143 1074 -239 -539 848 -152 -809 557 207 -418 846 418 -999 105 821 -1209 332 520
5338E20j326Q82L71j266N41J117j588K88R76j052j59J397q58l06J065m92p48J144
$$ 520 -806 76 447 -819 -278 839 -749 -461 515 -537 -696 701 -157 -463 602 110 -638 506
5356E06p0j223J260K78j359Q15K68j061P36N71j203K19J045j213PJ059r58l14
$$ 506 436 -787 473 751 -608 207 475 -586 150 721 -482 -263 782 -431 -424 635 -323 -637
5374f37J339j001j84J088n24r98J410p6p51O85j29q52P05O41j218M60O34p75j5
$$ -637 702 -299 -483 605 81 -917 493 417 -334 351 222 -630 75 716 -502 -42 592 -183 -198
5393a98R55j088j03J132q94n12J198l94o42J020Q0j119R25J86j495R71M59j289
$$ -198 757 -331 -434 698 -196 -708 490 96 -546 474 554 -565 360 546 -949 22 481 -808
5411h08O10R11j087J62Q01q13k33J421j175o01J792q90o66J053k89j061J524k04
$$ -808 -198 713 -374 -212 589 -224 -457 964 -211 -812 980 90 -576 477 188 -873 651 447
5429D47j296J130J0q44Q75j6r72L69J036j152J51J088j346j85J274p21l66J341
$$ 447 -849 281 291 -553 322 306 -666 -297 739 -413 -262 826 -520 -705 569 -152 -518 823
5447H23r90p54J671m58j021J025L0q51M82N30j279J013K58r34K98P26j001J03
$$ 823 -167 -921 750 292 -729 296 326 -525 -43 487 -792 221 479 -455 -157 569 -432 -329
5465c29J071j121q8J408j039o69J482n52q34R34M0j014O75M43j236R49K12q13
$$ -329 742 -379 -467 941 -98 -767 715 163 -671 263 303 -711 -36 407 -829 120 332 -481
5483d81L32Q81j008K45O96j049q1J093o32r74J537l55j223J331K20j113Q12J53
$$ -481 -149 732 -276 -31 665 -384 -465 628 -4 -978 559 204 -1019 312 532 -581 231 384
5501C84j030J053K55j541P43Q48j202M17P95j117RJ060q46k61R83m52q54J625
$$ 384 -646 407 662 -879 -136 712 -490 -73 722 -395 -386 674 -172 -433 550 98 -756 869
5519H69p26j018J230k51n74Q37N6j204J012L74j183M64P58r88J24J085j107j83
$$ 869 143 -875 355 104 -470 367 423 -781 231 605 -578 -114 644 -344 -220 865 -242 -425
5537d25J185p29j83R46p41m68Q74n11m12J046l91o91J045n5j171Q43N37j471P05
$$ -425 760 31 -152 794 53 -415 459 -52 -464 582 191 -500 545 490 -681 162 699 -772 -67
5556f7O11j039J48P88m80p31J484p26r02J384l99p89J178k45o81R14L70j399N87
$$ -67 544 -495 -347 441 -39 -770 714 -12 -914 470 71 -718 460 215 -466 448 818 -581 6
5575FN95j239O28P62j384K80J121j388K26J129p65m82J086m61n56J094m22r02
$$ 6 601 -638 -10 752 -632 -352 769 -619 -393 736 -29 -511 575 114 -442 652 230 -672
5593f72J031K62j255J022l25m02O30J18q93L82Q10j202L4J004q73m2R53p23m33
$$ -672 359 621 -634 388 63 -339 291 409 -484 -102 708 -494 -460 544 -329 -371 582 -141 -574
5612e74J222p59m90J050k77q34J042p4r31O66L06r62M58Q65q44o6Q40r48L5O03
$$ -574 648 -111 -601 449 172 -662 380 306 -625 41 347 -615 -157 708 -136 -202 638 -310 -275 328
5632C28m52o84J592j052l37J237p65m00R36rr95R14L39j307O92M71j058N86O32
$$ 328 -124 -808 784 -268 -605 632 -133 -533 403 394 -601 313 652 -655 37 508 -550 36 668
5651F68p32k39Q96r92R5J034p90o16J138l62n06O69J30j041J102l05q21O42L09
$$ 668 -64 -303 593 -399 -304 730 -60 -676 462 100 -406 263 393 -648 454 149 -672 -30 279
5670B79p85N38K93o50L27M33j005L20R94o39k84P10j76j012R42L9r14R17j19j104
$$ 279 -506 32 325 -325 2 435 -570 -250 744 105 -179 531 355 -657 285 324 -590 327 208 -896
5690h96J398l07r19L65J184j210k14J364j578L81J061j174j27R70k59n34R70m51
$$ -896 502 195 -724 -359 825 -385 -599 765 -813 -432 629 -545 -672 298 39 -495 475 24
5708B4q78J109o2p53Q38J23q72O81J51q53O48M31r39RR37p96J65Q61j018o50J614
$$ 24 -854 255 193 -560 278 401 -471 210 361 -492 156 587 -352 -343 594 -202 -37 824 -194 -844 770
5729G70r35o66J089p47k86J119l22p39R55J83q80M43N42q70K32Q21j170L63P61
$$ 770 -165 -831 258 -489 -775 344 22 -717 238 421 -459 -16 526 -344 -112 709 -461 -98 663
5748F63r94j49J159o08n50R01l13o29R48m12p35R91J27j411J057J99o61N03M69
$$ 663 -331 -480 679 71 -479 422 109 -520 428 16 -719 272 399 -1012 45 244 -417 86 555
5767E55o34j54O99p68J14J007j013l00J028q53n7Q27k16r56J258j88o34L93L51
$$ 555 -79 -233 466 -302 -188 819 -194 -494 534 -319 -376 451 235 -721 537 349 -285 108 459
5786D59j144P07L87o11K86L74r35L27R72j166J07P62n41k47R88o94m35P74k92
$$ 459 -685 22 409 -202 84 458 -477 -150 822 -344 -237 525 -16 -263 725 31 -404 370 78
5805G8p07Q12M5q48Q14J02q44M57N42q59J62O46o38M3Q43q32m25Q75m06k28O91
$$ 78 -629 183 228 -620 194 296 -548 -91 451 -408 -246 400 -238 -195 648 -184 -609 266 -140 -368 323
5826C23Po99L73L65r97P50L87p29N4L25m63P2Q17j138N72L55p67j45J080l92o79
$$ 323 330 -369 4 369 -628 122 509 -220 -166 159 -304 -232 585 -553 19 374 -393 -538 542 150 -529
5847e29Q26l80n76R49Q3p65R54l68p13O41K57o37O47q0m84j7O34o31j5J013j179
$$ -529 297 -83 -659 290 373 -392 562 194 -519 122 379 -258 389 309 -175 -192 442 -189 -204 809 -370
5868c70L00M35m75k53Q80o16m49N75K68p89P82J05j056J099j59r09O50K56o66
$$ -370 -70 365 -110 -363 517 -99 -548 27 295 -494 288 393 -663 436 277 -632 18 274 -392
5887c92J14R95p53k47R41o79m22J091p65j57P13k25n96O55j55q29Q88K45j062
$$ -392 -278 717 -36 -283 658 -21 -443 648 -117 -274 439 214 -382 273 118 -711 177 422 -640
5906f40O15M64q63K19N51p12PR61o80k48P91n50m81R08m31l61O54m45j58M56M01
$$ -640 -25 439 -424 -205 346 -366 -359 602 -78 -326 465 -85 -566 342 -89 -450 204 -241 -399 57 458
5927D58q56P04p8o24M57M58p61M60N84q36l44Q01p42r9R15m44k41M78k23m71P06
$$ 458 -398 306 228 -396 61 519 -242 218 802 -34 -378 423 -319 -418 497 53 -188 290 67 -404 302
5948C02J75r46O70K81p79L75K59q75M36N09p11j16P81o94O6P84p17n61J017k91
$$ 302 477 -469 201 482 -297 78 337 -538 -102 407 -304 -420 361 -333 -267 517 -200 -761 256 -35
5968c5n43Q42m8q70J054m8q86N31O51j010P3P50r70M14O79q16j0R64q21m13R88
$$ -35 -578 264 216 -654 400 352 -534 -3 648 -362 -289 461 -509 -95 584 -232 -242 722 -99 -512 476
5989D76l16n14N42O8m96P15j03p14N13R5p45N14L43q89N53j03m09M67M70p59J06
$$ 476 160 -354 188 256 -240 475 372 -342 171 266 -479 35 378 -511 42 -61 -470 -3 467 -292 -186
6010a86Q57n62n94J067n72o47R52j07o18O38N07j141O39J65n43K11L48r53O11
$$ -186 671 109 -485 582 10 -637 315 208 -410 228 735 -406 233 398 -145 66 414 -539 72
6029G2P66j032l6R10j091n5R26k43l48N84l81n77P33K04o57M23J97q27M93N24
$$ 72 838 -194 -230 680 -411 -466 460 217 -131 453 72 -505 228 432 -225 198 395 -432 61 585
6049E85r55J01O37o80l8P82n17j59Q09o25l44Q38n58l35Q13j32j018R67L33r78
$$ 585 -370 -269 368 -312 -350 432 -85 -244 565 -60 -404 434 -124 -459 354 222 -796 171 504 -474
6069d74J18O68p03N82N1p12L07O83j027R9J012q97l10Q46k06l14O97m12o26Q09
$$ -474 -356 312 -391 191 242 -470 -163 520 -507 -408 604 -293 -603 243 37 -277 420 8 -618 191
6089A91J03r45J141j11q95L21N31n47J64M34o54K0O65o99mO64k02n48R75o44m18
$$ 191 294 -651 490 379 -516 -195 336 -211 -47 387 -267 -247 418 -281 -285 379 177 -371 604 -40 -458
6110d58Q26n28l25J047k16p87O06J06q62O80K89q42M95K77n57R8O41p12J52Q70
$$ -458 368 -160 -485 562 346 -441 165 271 -591 89 378 -464 31 308 -249 -151 490 -222 -70 800
6130H00r02k01N95j26r61J002m0n22K88M03o30L57J18q62N30O34r72L70N04o80
$$ 800 -102 -303 292 166 -795 207 167 -355 -67 336 -294 63 181 -681 -151 483 -489 -119 385 -295
6150b95r5Q14k93o12Q13n48k57Q00k40q85J048L1p26M07Np46M66Q71r53K10N97
$$ -295 -390 424 131 -481 332 -216 -473 327 87 -798 250 281 -445 -38 -33 -779 -313 558 -395 -185 412
6171D12l50k65O65o10OP55o73j49M82j76o71J175j87r51P73l3l54M14L61p79J75
$$ 412 62 -203 462 -148 -142 613 -60 -209 273 97 -574 601 414 -537 236 203 -151 263 624 -155 20
6192B0N35o96j31L55m3j12L52l17k78O37k83o53P52m6m74O76m4p36M99K2q69R45
$$ 20 555 -141 -272 83 40 -72 280 -37 -315 322 39 -614 138 92 -382 294 250 -486 13 35 -834 111
6214A11ql71Q6O41o03l65Q43n32j79R29m55n43R32l82m22O06mp91N63M38q19M84
$$ 111 103 -268 -182 459 -144 -509 334 -198 -377 552 97 -446 486 104 -318 288 284 -507 56 494 -325 159
6236A59K65r33L91N07p69J30K58l21j32N31k82k52P73k37k36O64m09n56R02J2
$$ 159 424 -509 -118 389 -380 -250 8 -313 -445 86 -196 -448 325 88 -148 516 107 -449 453 465
6256D65j133Q59J29j127P21K99o05M16J68n70L45L48k84k02N59m52j94Q15n75
$$ 465 -668 191 320 -807 -86 213 -392 24 192 -378 -33 315 31 -171 388 -64 -258 557 -18
6275a8m55Q35l03o16P40K4r82P48K67n62M82K61p26j4O79p26K51K64l65j53P00
$$ -18 -473 362 59 -557 183 207 -775 -27 240 -322 160 421 -305 -319 360 -366 -115 149 -216 -369 331
6296C31k94m48P51m31j36L72j57m30P17p8o23M58K77o16p9Q06o83J27N62n48q7
$$ 331 37 -411 340 -91 -227 145 -12 -442 275 197 -426 32 309 -307 -386 420 -263 -136 426 -122 -209
6317b09N92p13J12O17m43k69M56j32p35Q72J61q79Q33j6o47N90K70r24L69O68
$$ -209 383 -330 -218 399 -44 -313 143 11 -724 148 309 -570 263 247 -400 190 460 -464 -95 573
6337E73n54q9N92o61o8L75k09k50L40l16n11J034L5q54P14K52r12M21N88j008
$$ 573 19 -70 522 -139 -207 168 -41 -291 49 -267 -778 256 291 -563 151 403 -509 -88 500 -508
6357e08O04L36o69K27N59p95j20Q58n38l41L58J75o94R88j82n66M87J0n27N82
$$ -508 96 432 -237 -10 549 -246 -366 492 -46 -387 -29 146 -548 440 258 -308 179 189 -338 244
6377B44Q2q60Q70j23k92l6O67p01k3Q21r72LL80j15k16K06K7q55J071k7o94O59
$$ 244 326 -534 336 213 -79 -115 552 -149 -172 649 -323 -320 60 -55 -271 -65 -38 -893 178 151 -543 116
6399A16k2l89L68M53j169P69Q7n86K57L28n54m2P14o02M4P60k62n42N40j93k98
$$ 116 94 -295 73 526 -643 126 213 -373 -116 212 -342 -384 330 -272 -228 532 270 -272 268 75 -223
6420b23J90J37p15P59j36l79L28J94o99M83N20o64n0P32o00k7M16L0n47N03j89
$$ -223 -33 104 -611 148 12 -367 -39 155 -544 -61 459 -205 -255 477 -123 -150 266 296 -251 252 63
6441F3m16J054n26n55N51j10m11M80J66m00J7K93k30o3Q12q25j65R08r09j69O93
$$ 63 -353 701 175 -380 171 61 -350 130 296 -104 -87 206 -24 -87 725 -100 -265 643 -266 -435 258
6462B58j70o41P05l5o28P06L6n59O90N9r34P19K12o51J46O36o97K2P84q11j61
$$ 258 88 -553 152 117 -511 195 231 -328 362 421 -513 206 418 -233 -87 549 -148 -126 658 -153 -314
6483c14P72n63M7M12m72l51O07j13o05R02l3n78K80K67o74L42O64p12R2M55n61
$$ -314 458 -105 -58 354 -118 -469 138 25 -580 322 289 -289 -9 258 -416 -74 590 -122 -30 425 -136
6504a36r3O08m62j83N64l33l72M29K43m59M72J13q32O81K04p30N38r0n85J44M43
$$ -136 -229 379 -83 -266 298 -35 -407 22 265 -194 278 391 -441 240 444 -286 252 162 -423 -279 164
6525A64m77L3O71o69j45P80m74j36Q54m43o50O32n7p52R17k63j55K71K47n85J52
$$ 164 -313 -280 391 -278 -423 357 -117 -253 601 158 -492 140 83 -669 248 -15 -170 101 348 -237 -85
6546h5J66m94P22m8m42j97J023m48n48J244r45m93Q33n51Q8L86J29p97M33L72
$$ -85 81 -413 309 261 -181 -378 645 197 -351 893 -52 -545 288 -263 -175 211 340 -457 -24 348
6566C48o44L66M07q45j30J056p13K82L48n37l89R57o18n45J153l53l53P80p13
$$ 348 -296 70 477 -368 -498 558 -155 127 475 -62 -451 506 -112 -657 496 143 -210 570 -143
6585a43M4O85m24l64K98K14q87N20M83n61K98O3k02j86M19n24j02P44m31n36R54
$$ -143 -99 586 162 -202 96 310 -577 -57 426 -135 163 226 24 -162 257 -267 -369 375 -56 -592 362
6606C62m61l50P74j47n95M97J68o30M64J29n55N10M23q03J58P82r26J41K07k91
$$ 362 -99 -449 325 178 -417 80 248 -382 82 211 -344 166 589 -214 -56 726 -200 -59 148 -143
6626a43l86J171n50m93O90j31n98N48j09m66M93K0m38K29N20p72K97N23q88M35
$$ -143 -529 642 92 -401 289 158 -440 108 -1 -467 26 46 -392 -163 357 -415 -118 405 -483 -48
6646d8N15r75N32L76n34l50P79j85m70O93l77m39L96L87r60L36N96m21O6M22m95
$$ -48 467 -508 24 400 -134 -484 295 110 -360 333 -44 -483 -87 300 -660 -324 272 -149 -83 339 -156
6667a56L11K11o09p0O73n88l03J128m60n48P87j77n75O23q2p41P95K90r15N22
$$ -156 155 366 -243 -313 360 -228 -531 597 137 -411 376 199 -376 247 165 -576 219 509 -406 116
6687A16K39q82M91L75n02k00P42o42R3O14n96k56Q25m00j97M32k67m65P53j19
$$ 116 355 -527 -36 339 -163 -363 379 -263 -170 444 -152 -408 417 17 -180 252 -15 -480 273 154
6707A54n29K29K09o11O65J68o36QN91l53j91P87n49l74O80k04l68O08m63j84Q47
$$ 154 -375 -146 63 -548 117 285 -351 -343 248 -105 -296 491 -58 -432 248 44 -324 284 -179 -363 484
6728D84k56n33M37J62q04P09L03p05J51N92n22j62P82r56r1P95k74l46L93l69
$$ 484 228 -305 132 294 -510 199 502 -203 -52 540 18 -144 638 -318 -409 386 112 -234 159 -210
6748b10l72P62o1l13J44J09l75M16M07j061Q81q9o81N25K48m93J59Q57j159j03
$$ -210 -582 180 119 -194 -50 59 -316 100 507 -554 327 238 -443 82 330 -163 -4 853 -306 -409
6768d09J122m54l30L75n5n09P64l56r45J142j02p28P59K19n56k62O02l74K21J44
$$ -409 713 259 -71 304 249 -260 504 148 -797 345 243 -485 274 493 -63 -325 277 -97 124 268
6788B68p60J32P75o81j30P56l21m37Q09n19j76P18l78m89Q24k10m51O01j91n79
$$ 268 -492 -360 415 -266 -396 360 39 -398 411 -108 -284 434 56 -433 391 181 -270 331 140 -439
6808d39M43Ll15j77P25m49j48O22m65K0N88n36k07P14o1r98R43k7n37L79m8m74
$$ -439 4 7 -308 -485 240 -209 -357 265 -200 -180 408 -128 -335 379 318 -680 263 236 -301 78 30 -444
6830d44P01L4q43L89M52o25L40O83q35J05P38o51l26P47m65j27K68K90n22K77
$$ -444 257 291 -552 -163 289 -336 4 687 -148 -43 695 44 -282 465 0 -127 141 431 -91 186
6850A86M96j275P74P7n97L32L30n33p8O21m93L21jj61j79O38o26r2M20j10j19
$$ 186 682 -593 181 258 -339 -7 323 -210 -288 333 -160 161 160 -1 -180 458 -168 -260 160 50 -69
6871f9J40l1j89R2L80p30L48L7l18J72P23r07J66P87o20k41N75k23l30L79j1n43
$$ -69 71 40 -149 -57 323 -407 -59 -22 -340 -168 555 -352 -186 601 -19 -260 315 92 -238 141 130 -413
6893d13P53j0p12O18J47p86N29J50m02L90J48q85N11N69j152J26Q68n43j21N46
$$ -413 340 330 -382 236 383 -403 126 276 -126 264 412 -473 38 607 -545 -419 449 -94 -215 331
6913C31k82l72O46L6n92O65j73l62K39L68q04L59K90q39M79L94p74M7O41k28l11
$$ 331 49 -323 323 359 -233 432 259 -103 136 504 -300 59 349 -490 -11 383 -391 -344 297 69 -242
6934b42O70n15j86M45k47l77Q89m05m28Q66k22q07Q79Q3r55O39M62n67n7M29n62
$$ -242 428 -87 -273 172 -75 -452 437 32 -396 470 248 -559 320 403 -552 87 549 -18 -75 354 -208
6955b08J89N09p63J50O89p74j19P62n74m84J056k32n46N58K21o29N55Q6n62J7
$$ -208 -19 490 -273 -123 566 -208 -327 435 -139 -623 433 201 -345 213 434 -195 360 446 -116 -99
6975i9M80o97j31Q84q28J12O15m54l52O02j32m46P04rq74P46J84o28N19L59p59
$$ -99 381 -316 -447 437 -391 -279 336 -118 -470 132 0 -446 258 249 -625 121 305 -323 196 555 -204
6996b04K88L10r49N62J88n29P9L13m74J13P00n30j05M49m10j23N52p8n48L72N8
$$ -204 84 394 -555 7 195 -334 -255 58 -416 -303 397 -133 -238 211 -199 -322 230 152 -396 -24 34
7017C4l43L00K08q85Q44R6j043P96P10j144J34M83m00p3P35k74m41O92j75q28
$$ 34 -309 -9 199 -686 158 254 -789 7 717 -427 -293 190 -210 -283 452 178 -263 429 254 -574
7037e74Q33L9m99M22R7l00r5N04m03P2M52q23N2P62p83N2M67m12m05R10l35m81
$$ -574 259 298 -201 221 318 18 -77 427 24 96 548 -275 -223 539 -244 -192 275 -137 -542 368 33 -448
7059d48P66j88p76R27n2o46M75R5q15N24P75q97k3O14j81j06K19n47k52Q71n88
$$ -448 318 130 -646 281 229 -417 58 153 -662 -138 637 -260 -283 331 150 44 263 -284 -536 335 -253
7080b53J71M39k20n08O91P5r18O27M13q75Q7Q44j019M35M59o84p9J175j096r4
$$ -253 -82 357 137 -371 320 395 -523 104 517 -358 -271 573 -446 -11 448 -236 -315 860 -236 -330
7100c30Q31q01j87R77o35l83Q21n8m84N16K5m45N37k58p79R05J87n61j9M72n83
$$ -330 501 -300 -487 490 -145 -528 293 235 -249 267 292 -153 384 126 -653 252 439 -122 -141 331 -252
7121b52L34K17o64j2J185r13l49O23m1o39N47K8n42R48j99o72K73L16o25M23M96
$$ -252 82 299 -365 -377 808 -105 -454 169 128 -511 36 64 -478 470 271 -401 -128 188 -437 -14 482
7142D82p00K8P44q07O0P27m46m07Q65m36o09R10l58n54P50K86q37L13J12n04M64
$$ 482 -218 -190 554 -253 -193 534 88 -319 546 110 -499 411 53 -501 249 535 -302 11 123 -381 83
7163H3L16q56M56M68p24N26K96j052p3J197q47K0Q06p73k92O43n1o58O21j9m55
$$ 83 399 -457 -1 467 -257 269 565 -487 -560 637 -210 -190 616 -157 -449 194 143 -515 106 87 -368
7184c68M61L84j029N83M38q55L66N57r48L30N23q19l1R13o67j9N98j99n27O81
$$ -368 93 477 -552 31 469 -386 -20 537 -411 -81 442 -377 -408 505 -162 -181 417 218 -309 372
7204C72N0m98K98K58n71O20M7r61M58M81q23L34L79o36j33P33m75m76Q45m29m08
$$ 372 422 -76 222 480 -91 529 576 -385 73 554 -269 65 444 -192 -325 408 -67 -543 302 -127 -535
7225e35O30Jp19R89O0j186J038j19n37M48J52p11L23N69r84P09M64o19l38Q37
$$ -535 95 96 -623 366 426 -760 278 159 -378 70 222 -489 -166 403 -581 128 592 -27 -365 472
7245D72q53j20P73l83k59Q58n00p27Q43pm42O06k28n67N96O63p85l7O97r60L0
$$ 472 -381 -501 272 -111 -370 488 -12 -739 104 97 -345 261 33 -534 62 725 -60 -97 600 -360 -330
7266c30M14n08J96P59p56j31Q61l68n61P54k96q34J147r3p64M65O08q64J93M49
$$ -330 84 -424 -228 531 -225 -356 505 137 -424 330 34 -800 347 254 -510 -45 563 -301 -108 341
7286C41p39J40R61o94m78J012r29K73N61m65l06R34n57p55J016j0q14L67L91q46
$$ 341 -398 -258 703 9 -469 543 -386 -113 448 -17 -323 611 54 -701 315 305 -509 -142 249 -597
7306e97M00P45j091P16M78j008j0Q04m38k58L32p0m13Q73m52p87J265l79o82N34
$$ -597 -197 548 -543 173 651 -357 -367 437 -1 -259 73 3 -410 463 11 -776 489 110 -572 -38
7326c8L15n52M48N18j464P20M45q60M90J80o11J61P85r57K1P35n69k66R54k03
$$ -38 277 -275 173 691 -773 -53 392 -468 22 202 -409 -248 537 -420 -399 336 -233 -499 455 252
7346B52m73J30K31m64P03k9p57M69M97j053N04L97n01j02P61p86j09P54l54o74
$$ 252 -221 -91 140 -324 379 350 -407 62 559 -494 10 407 -94 -196 565 -221 -330 424 70 -604
7366f04R59k74m10Q54k64o30N36J6o40P01K72j089M97M51n60M3P50q70k8J090
$$ -604 355 81 -329 525 261 -369 167 183 -457 244 516 -573 -76 375 -185 -142 608 -262 -290 800
7386H00q42k66P98n81l73R32p24m66J169m67n75Q02L18j189P17M92j138Q76L97
$$ 800 -42 -308 490 -91 -464 468 -256 -722 447 -20 -595 207 525 -664 53 545 -593 283 680
7405F80j062L8Q83r32K81O14p21m5Q90n95n49R75k26o90O02K91j173J008j33o32
$$ 680 -382 -344 539 -393 -112 502 -219 -264 626 31 -518 457 231 -459 143 434 -739 269 136 -496
7425d96L70P45r49J13R85j230L45M85m30k50P01n53j55P36m10l44Q54k63o76Q73
$$ -496 -126 619 -330 -217 768 -462 -117 368 -62 -312 389 -164 -319 417 7 -337 517 254 -422 451
7445D51O0j211Q44M05j062K80Q66j368O51N82o39l8O81q61P4P80o13k18Q76m74
$$ 451 511 -700 144 549 -513 -233 633 -735 -84 498 -141 -179 502 -359 -285 495 -118 -336 540 66
7465F6p34J125K19j252R88P0q75K45O77r19K13Q11j116N21N26p69J41N44o54k94
$$ 66 -668 457 676 -576 412 482 -393 -148 529 -390 -177 634 -482 39 565 -204 -63 481 -173 -467
7485d67Q67k74n93M99p8q09J063J91q32P08N5o94M37O28j194K55O71o35j06N50
$$ -467 400 126 -467 32 -46 -855 208 399 -433 275 330 -364 73 701 -493 -238 433 -202 -308 242
7505B42j42m21Q58o30o21J052m5m71L32np30Q26j82o01Q55K08r36L63N93p94j57
$$ 242 100 -321 537 -93 -714 338 293 -178 154 149 -581 245 63 -538 317 525 -411 -48 545 -249 -406
7526d06Q81o73J74O08q25j91J137q09m47Q70k59n12Q64m4r94Q24K67r90K95N32
$$ -406 475 -198 -24 584 -241 -432 705 -104 -551 319 60 -452 412 368 -626 198 465 -525 -230 302
7546C02q46L61R38j303M33M83m54m97R58l18o10J087o10m08P93k59m49N90q8n23
$$ 302 -544 -183 755 -548 -115 368 -86 -583 375 57 -553 534 -76 -484 309 50 -399 191 103 -420
7566d20L13L98n37K74O66j322N74P44r93L29M79p19j47P86o59l48J449n92p42
$$ -420 -107 291 -246 28 694 -628 -54 690 -303 26 505 -214 -361 425 -234 -582 867 275 -467
7585d67Q02K63j094M33J10m61P17K36j044N06N16p17J01O86j232K96J001q93l08
$$ -467 335 598 -496 -63 47 -414 303 539 -505 1 517 -200 -99 587 -645 -349 652 -241 -549
7604e49J116n32n90J143o04l84M49Jo96O04L47m87J66M30j047L23P41p92p9J298
$$ -549 567 35 -555 588 -16 -400 49 50 -646 -42 305 -182 -16 414 -633 -310 431 -361 -440 858
7624H58q71n18R59m30m36P75k43n86J075l09p97P01J68o90O12p5p52K47R69r46
$$ 858 -13 -531 428 -2 -438 337 94 -492 583 274 -523 178 346 -344 268 193 -559 -312 657 -289
7644b89K80N91o98k17P15m40l28R81q17l36J080n02r49J426o86m08P71N62j269
$$ -289 -9 582 -116 -333 382 -58 -386 595 -222 -558 522 20 -929 497 -189 -597 174 736 -533
7663e33O18M25r51N93O26j440M52R98j010k74J173p53l1N25l61m69J268o44r90
$$ -533 85 510 -441 152 778 -662 -210 788 -222 -496 677 -76 -107 418 57 -412 856 212 -778
7682g78Q81k7l43O24M1p85L96O73r37JO35j073M42N11n19k26J148p39l02R32n49
$$ -778 103 76 -267 357 398 -387 9 682 -255 -254 381 -692 -250 261 -258 -484 664 -75 -377 555 6
7703Fo01J081o5p74N58J13q27N31K98j024J079K23j062M45L67q20R1Q51p38m03
$$ 6 -595 486 421 -353 205 318 -509 22 320 -704 375 598 -464 -19 348 -472 -381 470 -268 -671
7723f71J236p04m46Q48Kp56P01K68j185Q41K10o31K78L60q95O47K40p87M46O38
$$ -671 565 -139 -585 263 265 -491 210 478 -707 134 344 -287 -9 351 -544 103 343 -444 2 640
7743F40j083j90R10k87k20O13l00l90O44k54q71Q95N49j163M26N75q90M16M84
$$ 640 -443 -633 277 -10 -230 383 83 -307 337 83 -788 107 656 -507 -81 494 -396 20 504
7762E04p91M75N47j161P0R83p07j74P68n73k87P95l50n34Q33l64n50O78M57j041
$$ 504 -287 188 735 -426 -356 627 -80 -254 514 -59 -346 449 99 -435 398 34 -516 162 619 -422
7782d22P53N4q43L51O98j174N99L33m25k54O71k97o12J099l14p19P59q1q39J137
$$ -422 331 385 -458 -107 591 -583 16 349 -76 -330 341 44 -568 531 217 -502 257 176 -663 474
7802D74l03o57L81L53n78L01O53j043P4R04o11k41P91r00RJ036q57m30J082m84
$$ 474 171 -486 -105 248 -330 -29 624 -419 -345 559 -52 -293 498 -402 -393 643 -214 -644 438 -46
7822d6o47J242l76m71P34l26r42J084K8p93M74O16j008L59M68p88J03Q72q47j60
$$ -46 -693 549 173 -298 436 110 -832 252 280 -513 -39 577 -431 -72 396 -392 -289 583 -264 -424
7842d24J039m50o23J186n20o53R27j14r48Q85K57j111M62O92r17K07N76n84M8
$$ -424 615 165 -458 728 208 -445 482 368 -580 305 562 -549 -87 605 -312 -105 471 -113 -65
7861f5L65m14k15P02m99j74P31l96m79P90J06r96P67j72l25M14K20r03O69K71
$$ -65 300 -114 -329 373 -126 -300 431 35 -444 346 452 -544 223 51 -274 140 360 -543 126 397
7881C97r83L52Q66p19k5Q33p39p33J455p75m57R97m43o61Q29K57j330Q83M67r26
$$ 397 -586 -234 632 -87 -112 721 -18 -751 704 -71 -528 469 26 -635 194 451 -879 4 471 -455
7901d55N77L48j043N12N94r71K98P75p56l08R24o30j94M54k22l78P38j44o81J116
$$ -455 122 470 -573 -61 533 -438 -140 635 -121 -429 495 -135 -329 125 -97 -475 263 119 -562 554
7921E54k69o63O65R7n72J36L95q90L03P35r85K18J027q23l14Q14n52n96J215r23
$$ 554 285 -378 287 384 -188 -52 343 -547 -244 491 -494 -276 751 -72 -386 428 -124 -720 495 -428
7941d28k29R52J02q52N87K00r10O82P57j268K97N88q41L13N59q55J38Q30p52m85
$$ -428 -657 295 397 -455 132 332 -578 104 861 -407 -110 478 -363 -50 509 -346 -208 622 -130 -615
7961f15R73o46k79J084k86o09O56J14r45P78K0o39N18L22j004L97N60o82P9O74
$$ -615 358 -288 -567 517 231 -378 278 392 -553 225 245 -394 124 446 -558 -161 399 -283 -204 470
7981D70p09K38N31q13j40N84j38n23R99m72q01J200k84p02O69M64r66O34M41r20
$$ 470 -239 -1 530 -283 -423 161 23 -500 499 27 -774 426 142 -560 109 573 -393 241 682 -238
8001b38K68N16j148N7N28l09k22R83l43o93J014k70r74R28K73r76Q49K5q90Q30
$$ -238 30 546 -602 -545 -17 -326 -548 435 92 -601 413 143 -831 97 370 -606 243 268 -622 208
8021B08L01r43J20P61p82n8Q46q29J09P65r36P8Q04k56o99R65n03o48Q76m3n57
$$ 208 509 -434 -314 447 -335 -393 453 -376 -267 498 -438 -360 444 188 -511 454 -49 -697 179 136 -421
8042d21O10M17j189Q30K71j020M95N12q59L4O67p55n4J031p23k14Q95q15k49R47
$$ -421 189 606 -583 247 518 -502 -7 505 -354 -320 347 -408 -462 569 -154 -368 527 -288 -537 410
8062D10Jq75N93J31p31N32L89r08K97O94o57J7Q87j095J51P73j105K30P46o15
$$ 410 411 -464 129 260 -471 61 450 -458 -161 533 -124 -107 780 -315 -164 609 -496 -266 480 -135
8082a35k66Q12n87n62J157j16r22O36L43q68L31N98r36N27L65r08J56P80o95j93
$$ -135 -401 411 -176 -738 419 303 -619 17 360 -508 -177 421 -515 12 377 -531 -375 405 -290 -483
8102d83R88p08k51J090m93o98J030k10r31J180l16j294J334R6j045N88R88j434
$$ -483 505 -203 -454 636 143 -555 475 265 -666 514 198 -1096 238 334 -711 -123 865 -569
8120e69M46O28r93l2J403j270j75J287q10l86J090n12n23Q10k14r75J026O8q05
$$ -569 -123 505 -488 -520 883 -387 -562 725 -85 -471 619 107 -416 394 180 -795 231 299 -506
8139e06O67M10j221N94O98j085M41O42r02JQ74r23J82O63n73k46O05j62n20Q81
$$ -506 161 571 -650 -56 642 -443 -2 640 -262 -261 613 -310 -128 535 -38 -284 321 159 -361 520
8159E20k98r03R61J48r18M01N23r39O14L66p45J56O27p26j52Q84o22l38J196q29
$$ 520 222 -681 280 428 -490 -89 434 -505 109 475 -270 -114 513 -213 -365 519 -103 -441 755 -74
8179g4n29J043l16p12J080j60j011J114k42o56L34M69
$$ -74 -603 440 124 -588 492 332 -679 435 193 -463 -129 340
8191C40
$$ Imaginary data points
##PAGE= N=2
##DATA TABLE= (X++(I..I)), XYDATA
0@%%%%%%%%qJ6j6J6j6J7k5L2l3M1m9N7o9P8r0J02j15J33j52J72j93K19k44K70
$$ 0 0 0 0 0 0 0 0 0 -8 8 -8 8 -8 9 -16 16 -17 24 -25 32 -37 41 -49 53 -62 71 -81 91 -102 117 -127 143
32A43l03L39l79M21m66N18n75O35p01P76q61R54j058J175j307J461j639J849k100
$$ 143 -160 179 -200 221 -245 273 -302 333 -368 408 -453 501 -557 618 -689 772 -867 982 -1118
51a118K405k789L285l950M888o303Q659j3226K4926j00260j97622L65074k78k36298
$$ -1118 1287 -1502 1783 -2167 2721 -3582 5077 -8149 16777 -83483 -281105 83969 83691 -152607
65a52607J81843L0298k31408J48599J18626k01979M0096J22771j33024M2944J10764
$$ -152607 29236 59534 -171874 -23275 95351 -106628 -66532 56239 -76785 -33841 76923
76G6923j53432J0515J60823j20637l9470J60662r4886q9835J72538k1256j36133
$$ 76923 -76509 -65994 94829 -25808 -65278 95384 498 -89337 83201 61945 -74188
87g4188R9991L8943q6213M3059k334m8692Q6993k5462j01248J07601K0593j26816
$$ -74188 25803 64746 -21467 21592 19258 -29434 57559 32097 -69151 38450 59043 -67773
99f7773R2216M4691j62286Q8899J31969j88231j9871J80427j01759o7891J48240
$$ -67773 24443 69134 -93152 -4253 127716 -60515 -80386 100041 -1718 -69609 78631
110G8631p6329q9940J51320l2962j08637J26261l1079j26856J65399K2540k11090
$$ 78631 2302 -87638 63682 30720 -77917 48344 17265 -109591 55808 78348 -132742
121a32742J06198J24794j80478L2928J42747j67795k1308J97136j02005j10171
$$ -132742 -26544 98250 -82228 -49300 93447 -74348 -95656 101480 -525 -110696
131a10696J51563j5419q9544J01075j8678p7693J07240j2961r6586J14897R192
$$ -110696 40867 25448 -64096 36979 18301 -59392 47848 34887 -61699 53198 62390
142F2390j33459J01485O4947j49073M9305J03102j27945P14J12700r4910k7942
$$ 62390 -71069 30416 95363 -53710 -4405 98697 -29248 -28534 84166 -10744 -38686
153c8686J04240p0676m1657R4603n5594l8125R6909p3077n6567J46928m7965j35486
$$ -38686 65554 -5122 -46779 47824 -7770 -45895 51014 -22063 -78630 68298 20333 -115153
165a15153J37254L7743j49048Q1741P2916j40806M3912J08061j17518n962J04131
$$ -115153 22101 59844 -89204 -7463 65453 -75353 -31441 76620 -40898 -46860 57271
176E7271q4667j2113J03319q5098l2354J18099p1687n7021J37713n7638j13184
$$ 57271 -27396 -39509 63810 -21288 -53642 64457 -7230 -64251 73462 15824 -97360
187i7360J50088J7172j54021Q8805P1543j28963M4513Q2908j11913J8263R2117
$$ -97360 52728 69900 -84121 4684 76227 -52736 -8223 74685 -37228 -18965 73152
198G3152r5951m19R5505r0800j6916J12300q6167m8229J35759o3398j02813J39791
$$ 73152 -22799 -23218 72287 -18513 -35429 76871 -9296 -57525 78234 14836 -87977 51814
210E1814j084j38082R5099N1445j26633M8561P0283j00604K2193O6349q8275K2454
$$ 51814 50730 -87352 7747 59192 -67441 -18880 51403 -49201 -27008 39341 -48934 -26480
222b6480P7898r6135N12J01674q2761k5850J15859p2427o4391J32252k4486j05930
$$ -26480 51418 -44717 -44205 57469 -25292 -51142 64717 -7710 -72101 60151 35665 -70265
234g0265R8557K0902r7435O6539L0032r0069N4211L5881r1463N3268M9421j12626
$$ -70265 28292 49194 -48241 18298 48330 -41739 12472 48353 -43110 10158 59579 -53047
246e3047L9659R1411j17259m406J20936r4849m8352J35041n6047r1760J21969
$$ -53047 -13388 78023 -39236 -43642 77294 -17555 -65907 69134 13087 -78673 43296
257D3296n436j06580Q8601K3524r9936O8834L4102j04432O2307N9268j19594L3821
$$ 43296 37860 -68720 19881 43405 -56531 12303 46405 -58027 4280 63548 -56046 -22225
269b2225R6491j11988r194J19119q6719n2695J23314m2390q3750R9761m474q5595
$$ -22225 74266 -37722 -46916 72203 -14516 -67211 56103 13713 -70037 29724 25250 -60345
281f0345P5139J4565q0718N8522K1985p7531N8008L1407r5088N0352O5448j01748
$$ -60345 14794 29359 -51359 7163 29148 -48383 9625 41032 -54056 -3704 61744 -40004
293d0004J5776R0255q5455j7101R8661o2477m2514R4839l8365n6187Q5746k4582
$$ -40004 -24228 66027 -19428 -36529 62132 -345 -42859 51980 13615 -42572 43174 18592
305A8592o4730Q5161j3565q2537Q8624J1587j08929P5218N1954j22531M0913Q9856
$$ 18592 -46138 39023 25458 -57079 31545 43132 -65797 9421 61375 -61156 -20243 69613
317F9613j11155l300J08314q1804l7724J07036n3514n7017J00899l1018p1800
$$ 69613 -41542 -44842 63472 -18332 -56056 50980 -2534 -59551 41348 10330 -61470
328f1470R5096r390q8449Q7561J8038j05123O9813N2227j11473L5713Q2659r5882
$$ -61470 33626 24236 -64213 23348 41386 -63737 6076 58303 -53170 -17457 65202 -30680
340c0680l171R0807o9628k4918Q7102n0825l9281Q2315l4136m8824P9708k4812
$$ -30680 -33851 56956 -12672 -37590 49512 -1313 -40594 41721 7585 -41239 38469 13657
352A3657o2616Q2937l857q4092P2829K5118r2892N1976M9621r3018K7142O8289
$$ 13657 -48959 33978 30121 -53971 18858 43976 -48916 3060 52681 -40337 -13195 55094
364E5094q1146K258P3924o8528j1560Q1457o3163l2205R4031m7103n8157R5894
$$ 55094 -26052 -23794 50130 -18398 -29958 51499 -11664 -43869 50162 3059 -55098 40796
376D0796k3406q1286R2021Q318j02802O9243M5008j01816L9526O3171r2960J7042
$$ 40796 17390 -63896 28125 36443 -66359 2884 47892 -53924 -14398 48773 -44187 -27145
388b7145P9896q2721r705Q9051o5223k8703R5581n1496n4845J00657k1559p8679
$$ -27145 52751 -29970 -39675 49376 -15847 -44550 51031 -465 -55310 45347 23788 -54891
400e4891Q6407P015q8121O9640L2143r3909M4513N3646q5391K0568O2827p8230
$$ -54891 31516 38531 -49590 20050 52193 -41716 2797 56443 -28948 -8380 54447 -23783
412b3783M909P4724p1338j7942Q2822n4702l7838Q4555l7851n7424Q4426j3084
$$ -23783 -18874 55850 -15488 -33430 49392 -5310 -43148 41407 3556 -53868 30558 17474
424A7474p3988P1138J0237p8706N8555K8071q4210M3709M9213q2741K3144O3229
$$ 17474 -56514 14624 24861 -53845 4710 32781 -51429 -7720 41493 -41248 -18104 45125
436D5125p8354M662Q0073o9917k2411Q8940m9367m4368Q8677k9976o4613Q5453
$$ 45125 -33229 -28567 51506 -18411 -40822 48118 -1249 -45617 43060 13084 -51529 33924
448C3924m362p9941P1803J9468q7696N6096M2629r1794L3283O4385q5741Q063
$$ 33924 29562 -50379 21424 40892 -46804 9292 51921 -39873 -6590 57795 -27946 -19883
460a9883P8379p3727j6895Q6750n6079l9870Q6847l5736n7306Q2080j4480p3231
$$ -19883 58496 -15231 -32126 54624 -1455 -41325 45522 9786 -47520 34560 20080 -53151
472e3151P3596R374q3065N7574L1399q4846L8707N0575q1662J6869O4694p0517
$$ -53151 20445 29819 -53246 4328 35727 -49119 -10412 40163 -41499 -24630 40064 -30453
484c0453j103P0854o0082j7427P9038m6810l6628Q0725l1079n2408Q0936j1662
$$ -30453 -31556 39298 -20784 -38211 40827 -5983 -42611 38114 7035 -45373 35563 23901
496B3901p1634P1963J5027q0477N3446L3990q2092L5758N2086p9577J4645O4431
$$ 23901 -47733 24230 39257 -41220 12226 46216 -35876 -118 51968 -27609 -12964 51467
508E1467p1325l060P5116o4447k5086Q5990m6385n0423Q6613k1815o9702P8169
$$ 51467 -19858 -22918 52198 -12249 -37335 48655 2270 -48153 38460 16645 -53057 25112
520B5112M788q2445N9870L1351q1857L7088M4898p5466K2487N6223p3628M546
$$ 25112 29900 -52545 7325 38676 -43181 -6093 38805 -36661 -14174 42049 -31579 -27033
532b7033O9328o4043j4794P7841n2539l6823Q5477l0417n9702P6363l526o7285
$$ -27033 42295 -21748 -36542 41299 -11240 -48063 37414 6997 -52705 23658 20132 -47153
544d7153O2588J5145p2095M7769L2010o9603L4407L9369p0385K5895N6462p5109
$$ -47153 15435 30580 -41515 6254 38264 -31339 3068 42437 -27948 -2053 54409 -20700
556b0700L424P4886o4092k3611Q2621m6871m6305Q1378k1988o4297O8166Q25o7686
$$ -20700 -17276 57610 -6482 -30093 52528 5657 -40648 40730 18742 -45555 22611 23436 -44250
569d4250N3974J3540p0227M7638K9372p7187L4904M7879p8234J7934O9297p4265
$$ -44250 9724 23264 -46963 675 30047 -47140 -12236 35643 -42591 -24657 44640 -29625
581b9625j1625Q5347m9814l8702P8706k5779m9886P1266q564n9761N9549P392
$$ -29625 -41250 44097 -5717 -44419 34287 8508 -41378 29888 21324 -38437 21112 28504
593B8504o1129N1245J4663p1039M7687L7091q1442K4300O1191p4416j153P3499
$$ 28504 -32625 18620 33283 -37756 9931 47022 -34420 -10120 51071 -23345 -24498 49001
605D9001n9157k8000P7074l3536m3614O4613j7710m4835O1000j0152n6526O0859
$$ 49001 -10156 -38156 38918 5382 -38232 26381 8671 -36164 24836 14684 -41842 19017
617A9017O455o7097N2129K4509p8455L9879N2253q1596O824P1289n9509j8053
$$ 19017 25472 -41625 10504 35013 -43442 -3563 48690 -32906 -26082 45207 -14302 -32355
629c2355O7447m1886k9682O5696k8020l8689O0587j8796m3339O4768j0548o3604
$$ -32355 35092 -6794 -36476 29220 1200 -37489 23098 4302 -39037 25731 15183 -48421
641d8421O5415J7661p8192M4701M2165p6353K3060O0673o9084m733O7049m5852
$$ -48421 16994 34655 -43537 1164 43329 -33024 -9964 50709 -18375 -23108 43941 -1911
653a911j8955N6362l8689k0951O4358l5878m0857O8382j8746n5867O8325j88p7557
$$ -1911 -20866 35496 -3193 -24144 40214 4336 -36521 31861 13115 -42752 25573 25385 -52172
666e2172N8268L4925q1218K4924N1755o4861O943N6704n4494q870N8165m0677
$$ -52172 6096 41021 -40197 -15273 36482 -28379 -21436 35268 -19226 -28096 30069 -10608
678a0608j4893N7476m1703k5079P2375l0262n2437P2717j931o9690N7208K3437
$$ -10608 -25501 31975 -9728 -34807 37568 7306 -45131 27586 25655 -44035 13173 36610
690C6610p3397L4837M3222o4770J0548M8041m8871J589M3940m7916m70N5572m8839
$$ 36610 -36787 -1950 41272 -23498 -12950 35091 -13780 -12191 31749 -16167 -16637 38935 -9904
703i904j8892O6677l7877l8482P3798j8189o5425O4383J6753o9419L7448K8645
$$ -9904 -28796 37881 4 -38478 35320 17131 -48294 16089 32842 -36577 871 29516
715B9516o0608K6263L7212n7022J1946M0300n1234J0965M9520o0103p270P1515
$$ 29516 -31092 -4829 32383 -24639 -12693 27607 -23627 -12662 36858 -23245 -30515 41000
727D1000m7201l4884P6358k5434n6946O9416O101o6450M4311K2873n6986L1315
$$ 41000 -6201 -41085 35273 9839 -47107 22309 28410 -38040 6271 29144 -27842 3473
739C473K7834n5858K2805L4109n5053J8306M4457o3051J577O6610n3705k6526
$$ 3473 31307 -24551 -1746 32363 -22690 -4384 40073 -22978 -21401 45209 -8496 -35022
751c5022P3307l2435m8802O7460m179n9133M6042J3108n0614L5161J5231n1098
$$ -35022 38285 5850 -42952 24508 20329 -38804 7238 20346 -30268 4893 20124 -30974
763c0974L2945K3447n7161K8229L9151o4594J1941O0468n8621j5766P1998l8647
$$ -30974 1971 25418 -31743 -3514 35637 -28957 -17016 43452 -15169 -30935 41063 2416
775B416m1717O7268j0011n0242M7064K218m5221M1762O656m9655L6817J4893n4233
$$ 2416 -39301 27967 17956 -32286 14778 16996 -28225 13537 20193 -29462 7355 22248 -31985
788c1985L7661K9192p0670K0275N8900n9920j0531O2390m2136k5992O5687k2839
$$ -31985 5676 34868 -35802 -15527 43373 -16547 -27078 35312 -6824 -32816 32871 10032
800A0032m4650M9579l088l4121M1850j0637m2919N1823O162n7878M1478K1470
$$ 10032 -34618 14961 11873 -22248 19602 8965 -33954 17869 24031 -33847 7631 29101
812B9101o5715L3250M7209p0874J106O4894m6703k0737N7683l1057k8499N4034
$$ 29101 -36614 -3364 43845 -27029 -25923 38971 -7732 -28469 29214 -1843 -30342 23692
824B3692j8269l3918M8166j2847l7411N2374o157n4532N4617J7145p1041L4448
$$ 23692 5423 -28495 19671 6824 -30587 21787 15630 -38902 15715 32860 -38181 -3733
836c733M5750o4400O531N3505n0562j0129N7360l3751k6394M6489j9207k0000
$$ -3733 42017 -22383 -15852 37653 -12909 -23038 34322 571 -25823 20666 1459 -18541
848a8541M3845k6630l1731N6504r376m8553M8643M486n8919M5883L1741o8860
$$ -18541 25304 -1326 -33057 23447 14071 -34482 14161 18647 -40272 5611 37352 -31508
860c1508J3472M8711m4114n58M0816m1075o020M8631l1607j6033M4345l1402j8101
$$ -31508 -18036 30675 -13439 -13997 26819 -14256 -20276 28355 -3252 -19285 25060 -6342 -24443
873b4443N9307k7656m6076O2805J67o0919M7612K2603o5135K7061M0116n5538
$$ -24443 34864 7208 -38868 23937 24104 -36815 10797 33400 -31735 -4674 35442 -20096
885b0096O869M3126m3479j905M2625l9674o048M9152l9990k0897O0467k6745l9797
$$ -20096 -13227 29899 -13580 -15485 27140 -12534 -18582 30570 -9420 -30317 30150 3405 -36392
898c6392N9389q621n5899N3581J8851o3797K5705L4320m5375J3701K9761m5030
$$ -36392 22997 14376 -41523 12058 30909 -32888 -7183 27137 -18238 -4537 25224 -19806
910a9806R853L9209m0203j64L8898m2358m530N7471l9444l3015O1319j4519m5094
$$ -19806 -9953 29256 -10947 -11111 27787 -14571 -19101 38370 -1074 -34089 27230 12711 -32383
923c2383N1076J648n4682L8942K2136m9354K0218K2053m2144K1208K6915n0588
$$ -32383 18693 20341 -34341 4601 26737 -22617 -2399 19654 -22490 -1282 25633 -24955
935b4955J3970M2515n0179j969N4647m3311k1639O2291k5645m3026N7281o08n1293
$$ -24955 -10985 31530 -18649 -20618 34029 -9282 -30921 31370 5725 -37301 19980 19372 -31921
948c1921L9499J3570m5665K9994J6729m6346K4677K5434m7464J8308L4394n3740
$$ -31921 7578 21148 -24517 5477 22206 -24140 537 25971 -21493 -3185 31209 -22531
960b2531O870N4543m7183k0531N7537k5850l1540N2162j3237m3167M5373O052
$$ -22531 -15661 38882 -8301 -28832 28705 2855 -28685 23477 10240 -32927 12446 18498
972A8498m2244K9974O674l8229L5089J2617n2388K7649L1629n3187J3774M3540
$$ 18498 -23746 6228 12902 -25327 9762 22379 -30009 -2360 29269 -23918 -10144 33396
984C3396n1623m869N7808l6573k7713N2200j7291l0753M4655j0788l6771M3078
$$ 33396 -18227 -23096 34712 -1861 -29574 22626 5335 -25418 19237 8449 -28322 14756
996A4756K5m0922L6651N974m5740L7237K1320n9877K2157M4854n3223j566M9554
$$ 14756 14781 -26141 10510 16484 -29256 7981 29301 -30576 -8419 36435 -16788 -18354 31200
1009C1200l9315j4237N1345k7263k8066M7041j2477l0315M0392j0840l5402M5567
$$ 31200 -8115 -22352 28993 1730 -26336 20705 8228 -22087 18305 7465 -27937 17630
1021A7630J101m9742L7237J8191n2372K6778L2285n6262Q286M9254m1652j3089
$$ 17630 18731 -31011 6226 24417 -27955 -1177 31108 -25154 -16868 32386 -9266 -22355
1033b2355M3656k7645j4033M3138k4726k5487M6057j2575l1030M2089q190m0039
$$ -22355 21301 -6344 -20377 22761 -1965 -27452 18605 6030 -25000 17089 8899 -31140
1045c1140M5560R051n3737L1671K7901m9923J5489L5943m5284J736M2628l5023
$$ -31140 14420 23471 -30266 1405 29306 -20617 -5128 30815 -14469 -12733 29895 -5128
1057e128j0035L9970k8462j2392M3394k8166k5396N0449j4388l9762M5464l86
$$ -5128 -15163 24807 -3655 -16047 27347 -819 -26215 24234 9846 -29916 15548 15162
1069A5162m7328M0575J5851n5576K4895L3291m7361P775L5012l9749K457M0745
$$ 15162 -32166 8409 24260 -31316 -6421 26870 -20491 -12716 22296 -17453 -14996 25749
1081B5749l8133r657M6371k9551j9459M9738k2482l4031N1867l646m6581L9841
$$ 25749 -12384 -22041 24330 -5221 -24680 25058 2576 -31455 20412 16766 -29815 10026
1093A0026J2601m7675K8538K3727m7003J5204L2456m0257M380L4004l6504j58
$$ 10026 22627 -25048 3490 27217 -19786 -4582 27874 -12383 -8003 26001 -10503 -10661
1105a0661L9149l4999j3204M7090k5168k7471M5993j2087l6473M2111J291m3595
$$ -10661 28488 -6511 -19715 27375 2207 -25264 20729 8642 -27831 14280 15571 -28024
1117b8024L2589J3709m2104K2973J9849m2227J7362K8350m2756P285L7048l9559
$$ -28024 4565 18274 -23830 -857 18992 -23235 -5873 22477 -20279 -12994 24054 -15505
1129a5505k806M5180l5138j8533N1595k0594l2918M6275n174l9561M0241M983
$$ -15505 -18311 26869 -8269 -26802 24793 4199 -28719 17556 12382 -27179 13062 18045
1141A8045m3740L2716J7080m5817K2130K6433m5125J3523L4814m4448O53M4795
$$ 18045 -25695 7021 24101 -21716 414 26847 -18278 -4755 30059 -14389 -13736 31059
1153C1059l6752j5197M7694k4917k6748M6168j2398l5482L9862M81l8130L2551
$$ 31059 -5693 -20890 26804 1887 -24861 21307 8909 -26573 13289 13770 -24360 8191
1165H191P726m1196K7967J8365m3746J7158K8078m1370Q135L5240l9361l656M2802
$$ 8191 15917 -25279 2688 21053 -22693 -5535 22543 -18827 -10692 24548 -14813 -18469 24333
1178B4333l0796j6894M3127j9020k5159M1014j0880l1839L8722l86l7686L3185
$$ 24333 -6463 -23357 19770 750 -24409 16605 5725 -26114 12608 12222 -25464 7721
1190G721J0728m2519K7269K1721m4691J5643L2564m1120L481L8357l6144q161
$$ 7721 18449 -24070 3199 24920 -19771 -4128 28436 -12684 -9203 29154 -6990 -15151
1202a5151M4568k7665k1837M3515j6295k9414M1458p540l7666L7407O280m3791
$$ -15151 29417 1752 -20085 23430 7135 -22279 19179 11639 -26027 11380 17660 -26131
1214b6131K8269J7310m4337J9623K6777m2994P722L5592l7542l351M0085l0477
$$ -26131 2138 19448 -24889 -5266 21511 -21483 -13761 21831 -15711 -19062 21023 -9454
1226i454j3723M3289k1346k3782M1884j0056l0662L8129q11l7435L3804J0564
$$ -9454 -23177 20112 -1234 -25016 16868 6812 -23850 14279 13468 -23967 9837 20401
1238B0401m0706K3963J9589l9681J6061K6072l9324O204L4894l5848n368L8773
$$ 20401 -20305 3658 23247 -16434 -373 25699 -13625 -7421 27473 -8375 -13743 25030
1250B5030k8825j4987M1044k0231k5449M0201r107l2331L6516P52l8156L1500
$$ 25030 -3795 -18782 22262 2031 -23418 16783 7676 -24655 11861 12613 -25543 5957
1262E957J1700m0595K2696K1119m1683J4533L0817m0844J839L9508l3642j1703
$$ 5957 17657 -22938 -242 20877 -20806 -6273 24544 -16300 -14461 25047 -8595 -20298
1274b0298M2453k3947k1180M1514j3934l0478L9067k107l5813L2173P826l8632
$$ -20298 22155 -1792 -22972 18542 4608 -25870 13197 11090 -24723 7450 15276 -23356
1286b3356K6558J7558m1262J6969K7493l9227O740L4868l4641o227L9144k4726
$$ -23356 3202 20760 -20502 -3533 23960 -15267 -8527 26341 -8300 -14527 24617 -109
1298a09j6582L7304j6674k1897L6027r684k8903L3535o24l3401K9089P482l8368
$$ -109 -16691 20613 3939 -17958 18069 8385 -20518 13017 12393 -21008 8081 15563 -22805
1311b2805K5065J7730m1131J4364K8979l7695K072L4728l1695p294L7267k4335
$$ -22805 2260 19990 -21141 -6777 22202 -15493 -13421 21307 -10388 -17682 19585 -4750
1323d750j5713L8295j7030k3348L8781r476l1736L6850K918l9194K9983J4814
$$ -4750 -20463 17832 802 -22546 16235 6759 -24977 11873 14791 -24403 5580 20394
1335B0394m2928K1224K7125m2404N995L5300l2704m880L4939k6590j1621L7643
$$ 20394 -22534 -1310 25815 -16589 -10594 24706 -7998 -12878 22061 -4529 -16150 21493
1347B1493k0572k0023L7096j1817k7601L6753k887l5924L1910R739l9184K1797
$$ 21493 921 -19102 17994 6177 -21424 15329 12442 -23482 8428 18167 -21017 780
1359G80K0109l8214J1568K7358l3649R37K9738k6826m717L0695k5130j0209L6858
$$ 780 20889 -17325 -5757 21601 -12048 -11111 18627 -8199 -12916 17779 -7351 -17560 19298
1372A9298k0052k2257L7951q809k9525L4832J217l7080K8925J5037l8514J6483
$$ 19298 -754 -23011 14940 6131 -23394 11438 12655 -24425 4500 19537 -18977 -2494
1384b494K2049l3716R428K6138l2457J872L0841k8759n351L5238k6611j6194M1678
$$ -2494 19555 -14161 -4733 21405 -11052 -9180 21661 -7098 -12449 22789 -3822 -20016 21662
1397B1662j5640k9770L7221k074l4157L1035P081l7932K2929J9070l5862J1684
$$ 21662 6022 -23748 13473 11399 -22758 8277 15358 -22574 355 19425 -16437 -4753
1409d753K2010l0998P993K6108l3237O95L5783k9445j1803L9359k0665k2716L9179
$$ -4753 17257 -13741 -5748 20360 -12877 -12182 23601 -5844 -17647 21712 1047 -21669 17510
1422A7510p706l2185L1309M718l2584K3838J0114l4091J8989J7717l3308J0524
$$ 17510 9804 -22381 8928 13646 -18938 4900 15014 -19077 -88 17629 -15679 -5155
1434e155K1360l0836P381K8525l4126n061L9680k3016j9922L6390j1259k4269
$$ -5155 16205 -14631 -7250 21275 -12851 -17912 21768 -1248 -21170 15220 3961 -20308
1446b0308L3061k927k9656K7108O003k9478K1625R264l2017J9360J8431l5484
$$ -20308 12753 9826 -19830 7278 13281 -16197 5428 14692 -17325 2035 20466 -15018
1458a5018J0662K6573l4274K419L5145l1227j3780M0308j6375k3876L1626o743
$$ -15018 -4356 22217 -12057 -9638 25507 -5720 -19500 20808 4433 -19443 12183 5440
1470E440k3725K9731k795k9311K6870O797l2470K1889J2787l5414J7404K4242
$$ 5440 -18285 11446 8651 -20660 6210 13007 -19463 2426 15213 -20201 -2797 21445
1482B1445l7579M833L3488l0566q147L6280k0730j8224L3763r885k1413K7540
$$ 21445 -16134 -11301 22187 -8379 -16526 19754 -976 -19200 14563 4678 -16735 10805
1494A0805n590k2000K8804l221k9389K7706R056l4596J9555J7389l5222J2677
$$ 10805 5215 -16785 12019 8798 -20591 7115 16171 -18425 1130 18519 -16703 -4026
1506d026K7115l4831j576L4419k3292j1723L0139j6200j4380L0157j2593j9297
$$ -4026 23089 -11742 -13318 21101 -2191 -13914 16225 25 -14355 15802 3209 -16088
1518a6088K9895q030k4659L1480J059l5670K5624J5665l6672J4450K2951l4166
$$ -16088 13807 5777 -18882 12598 13657 -22013 3611 19276 -17396 -2946 20005 -14161
1530a4161M165L0496k8036p267L0003j8488j1408K8094j5886j4692L0707j2025
$$ -14161 -9996 20500 -7536 -14803 15200 -3288 -14696 13398 -2488 -17180 13527 1502
1542A502k3104L3122k470l2573K8030J1148l4876J8301J9738l2881P807K6047
$$ 1502 -21602 11520 9050 -23523 4507 15655 -19221 -920 18818 -14063 -6256 19791
1554A9791k7399n17K6188k1933n085K7802j9813r768K9310j7112j7492L4888r867
$$ 19791 -7608 -8125 18063 -3870 -8955 18847 -966 -10734 18576 1464 -16028 18860 8993
1567H993l0660L1789N570l4178K0579J3458l2395J3279K0201k9446M420K3056
$$ 8993 -21667 10122 15692 -18486 2093 15551 -16844 -3565 16636 -12810 -8390 14666
1579A4666k5506Q61K5231k4263n332L0003k0780j2844L4758j4507k5050L4243
$$ 14666 -10840 -9979 15252 -9011 -14343 15660 -5120 -17964 16794 2287 -22763 11480
1591A1480K79l2109K4568J0172l0053J6387J5035k8220J0200J8135k6600N959
$$ 11480 11759 -20350 4218 14390 -15663 724 15759 -12461 -2261 15874 -10726 -4767
1603d767K3123k6302j123K8246k3881q974L3666j7876k1748L4554m104k8947K5714
$$ -4767 18356 -7946 -9069 19177 -4704 -13678 19988 2112 -19636 14918 10814 -18133 7581
1616G581N716k8590J8673J1010k7174J2974J3500k6806J1089J8987k9533L267
$$ 7581 13297 -15293 3380 14390 -12784 190 13690 -13116 -2027 16960 -12573 -9306
1628i306K6843k5945n553L0911k1161j5390L3447r819k4794K7039J042k4520K1023
$$ -9306 17537 -8408 -13961 16950 -4211 -19601 13846 4027 -20767 6272 7314 -17206 3817
1641C817M730k3932J7650Q622k5280J5869J4399l0128J1094K3581k9708P39K9620
$$ 3817 8547 -15385 2265 10887 -14393 1476 15875 -14253 -3159 20422 -9286 -8547 21073
1654B1073k4352j0021L2541j5766j9147K8798n366k2588K4394q14k3737K1578
$$ 21073 -3279 -13300 19241 3475 -15672 13126 7760 -14828 9566 8752 -14985 6593
1666F593L523k6248K0281J0328l1913J4644K1949l1754K992K8188k6240o713L1431
$$ 6593 10116 -16132 4149 14477 -17436 -2792 19157 -12597 -9605 18583 -7657 -14370 17061
1679A7061j7981j5866K8387q371j8386K4082m224k0647K2722M77k3721K1392N986
$$ 17061 -920 -16786 11601 3230 -15156 8926 4702 -15945 6777 7254 -16467 4925 10911
1692A0911k9230J7959J6431l0475P196K4302k5733j988K6926j9267r303K5682
$$ 10911 -18319 -360 16071 -14404 -7208 17094 -8639 -10627 16299 -2968 -12271 13411
1704A3411j1980j2349K4125r600j6005K4941m684k1181K4113M43k7724K2561J1800
$$ 13411 1431 -10918 13207 3607 -12398 12543 7859 -13322 10791 11234 -16490 6071 17871
1717A7871l2237J1741K0402k8257K402K4092k3361n209K5321j6748r745K3882
$$ 17871 -14366 -2625 17777 -10480 -8078 16014 -7347 -12556 12765 -3983 -13728 10154
1729A0154j3295j3402K6938r090k0335K6989j008k5768K3558Q527k9674J5431
$$ 10154 -3141 -16543 10395 1305 -19030 7959 6951 -18817 4741 13268 -16406 -975
1741i75J8340k8020N526K2440k2426j307K1518j8242m483K3162j6532j0571K5340
$$ -975 17365 -10655 -5129 17311 -5115 -6422 15096 -3146 -7629 15533 -999 -11570 13770
1754A3770j2328j5303K5960p170k3051K5684L708k7964J6922J1621k5406J1590
$$ 13770 1442 -13861 12099 4929 -18122 7562 11270 -16694 228 11849 -13557 -1967
1766a967J6000k4504M168J9992j9842P2J9892j9772l156K6096j7605j4002K7759
$$ -1967 14033 -10471 -6303 13689 -6153 -6081 13811 -5961 -9117 16979 -626 -14628 13131
1779A3131q665j9697K5655j697k5867K1169Q608k7059J2515J3113k3031Q209J5997
$$ 13131 4466 -15231 10424 8727 -17140 4029 12637 -14422 -1907 11206 -11825 -3616 12381
1792A2381k3624M004K0480k0549k133K2991j8070p704K7484j3102j7852K7018
$$ 12381 -11243 -7239 13241 -7308 -9441 13550 -4520 -12224 15260 2158 -15694 11324
1804A1324k782k1867K0242L354k2655J7235Q507k4012J0531J2718k1725P076J5548
$$ 11324 8542 -13325 6917 10271 -12384 4851 13358 -10654 -123 12595 -9130 -2054 13494
1817A3494k3789L212K2518k1718n573K4954j5124j2579K6116q831j9612K4126
$$ 13494 -10295 -7083 15435 -6283 -11856 13098 -2026 -14605 11511 2680 -16932 7194
1829G194K52k0935J7528L933k0863J6765P998k4299J1940J4462k2903N552J8388
$$ 7194 7446 -13489 4039 7972 -12891 3874 11872 -12427 -487 13975 -8928 -3376 15012
1842A5012k2814j81K4331j8960j0115K4953j0745j4713K2572n461j8259K0569
$$ 15012 -7802 -7983 16348 -2612 -12727 12226 1481 -13232 9340 3879 -14380 6189
1854F189P03k0175J6674M723k1212J4815J0094k4276R733J7067k2968K336K1286
$$ 6189 6892 -13283 3391 8114 -13098 1717 11811 -12465 -2732 14335 -8633 -6297 14989
1867A4989k0010m546K4037j4874j1802K3132p288j5172J9914l775j7280J9297
$$ 14989 -5021 -9567 14470 -404 -12206 10926 3638 -11534 8380 4605 -12675 6622
1879F622R93k1283J6633P375k2902J1747J3781k4006N989J9424k0931k002K1437
$$ 6622 7615 -13668 2965 10340 -12562 -815 12966 -11040 -5051 14373 -6558 -8560 12877
1892A2877j6040o691K2375j2260j1968K1460o314j5047J9688k478j8909J9101
$$ 12877 -3163 -9854 12521 261 -11707 9753 3439 -11608 8080 5602 -13307 5794
1904E794L302k2970J4819J0198k2888Q874J4914k1737K978J9299j8882l092K1099
$$ 5794 9096 -13874 945 11143 -11745 -2871 12043 -9694 -6716 12583 -6299 -9391 11708
1917A1708j4060p859K1305j0620j1602K1553n537j6805K0084K56k0360J7577O394
$$ 11708 -2352 -10211 11094 474 -11128 10425 4888 -11917 8167 8423 -11937 5640 12034
1930A2034k3094J2098J2700k2081N697J5878j9858O71J8355j7145m659K0181j2594
$$ 12034 -11060 1038 13738 -8343 -2646 13232 -6626 -5955 12400 -4745 -9404 10777 -1817
1943a817r931K1357q907j4533K0753k769j8480J8096M063k0821J3815R106k1029
$$ -1817 -11748 9609 702 -13831 6922 4153 -14327 3769 7832 -12989 826 9932 -11097
1956a1097R191J3677j9555L484J6789j7680j178J9086j4747o626K0245j0491j1405
$$ -11097 -1906 11771 -7784 -4300 12489 -5191 -6369 12717 -2030 -8656 11589 1098 -10307
1969a0307J9689n639j5666J9539m18j9586J5910N902k0172J1417R879k0225P307
$$ -10307 9382 3743 -11923 7616 7198 -12388 3522 9424 -10748 669 10548 -9677 -2370
1982b370J4407j9414K165J7412j6758l279J9756j3297q646K0457q642j2960J9641
$$ -2370 12037 -7377 -5212 12200 -4558 -7837 11919 -1378 -10024 10433 1791 -11169 8472
1995H472m063j6853J7967J890j9892J4346O978k0217R953J1159j9757N667J5215
$$ 8472 4409 -12444 5523 7413 -12479 1867 8845 -11372 -1419 9740 -10017 -4350 10865
2008A0865j8237m40J8897j5044n643J9703j0705r823J9807o154j4409J8788j443
$$ 10865 -7372 -7812 11085 -3959 -9602 10101 -604 -10427 9380 3226 -11183 7605 6162
2021F162j6926J5968L870j8964J2253Q985j9606Q089J2479j8917L184J5872j6966
$$ 6162 -10764 5204 9074 -9890 2363 11348 -8258 -169 12310 -6607 -3423 12449 -4517
2034d517k127J8035j3129p138J8300r518j0450J8767n861j5189J7746P47j8229
$$ -4517 -6644 11391 -1738 -8876 9424 -94 -10544 8223 2362 -12827 4919 5666 -12563
2047a2563J4427N350j9072J0929J0209j9157N881J4299j7252J359J6276j5450
$$ -12563 1864 7214 -11858 -929 9280 -9877 -3996 10303 -6949 -5590 10686 -4764
2059d764l049J8646j1548q216J8826p741j2223J8848l223j6636J6533L436j8326
$$ -4764 -7813 10833 -715 -8931 9895 2154 -10069 8779 5556 -11080 5453 8889 -9437
2072i437J2198O829j8132Q749J0915j8466M085J4370j6368k80J5982j4141m504
$$ -9437 2761 9590 -8542 207 11122 -7344 -3259 11111 -5257 -5537 10445 -3696 -8200
2085h200J8614j1020j0609J8977n021j4253J7124n01j6918J4321N592j8366R762
$$ -8200 10414 -606 -11215 7762 2741 -11512 5612 5111 -11807 2514 8106 -10260 -498
2098d98Q587j7064P483J1163j7184K298J5866j4907k874J7273j2549o939J9167
$$ -498 8089 -8975 -1492 9671 -7513 -5215 10651 -4256 -7130 10143 -2406 -9345 9822
2111I822q645j2135J8011k341j4372J4381J556j5875J2473N332j6588Q810Q777
$$ 9822 1177 -10958 7053 4712 -9660 4721 6277 -9598 2875 8207 -8381 429 9206
2124I206j6621N875J2543j7247J354J6567j4513m937J8207j0604r140J8444o173
$$ 9206 -7415 -1540 11003 -6244 -4890 11677 -2836 -7773 10434 -170 -9310 9134 2961
2137B961j3863J6375m20j4867J3242K261j5976J1762O545j7757P633J1072j7031
$$ 2961 -10902 5473 5053 -9814 3428 5689 -10287 1475 8020 -9737 -2104 8968 -8063
2150h063L938J4423j6025j876J7704j1442p570J7309p205j0344J6211l217j2899
$$ -8063 -4125 10298 -5727 -7603 10101 -1341 -8911 8398 1193 -9151 7060 3843 -9056
2163i056J3945N16j3622J2088K760j6149J1569P477j8370P216J2091j6513J460
$$ -9056 4889 5405 -8217 3871 6631 -9518 2051 9528 -8842 -1626 10465 -6048 -4588
2176d588J5003j3956l784J6990j0354p522J5769o400r611J5624m210j2896J5075
$$ -4588 10415 -3541 -7325 9665 -689 -8211 7558 1158 -8453 7171 2961 -9935 5140
2189E140O76j5576J2709M921j8199R776J1348j8213K874J4378j4405j971J5388
$$ 5140 5816 -9760 2949 7870 -10329 -553 10795 -7418 -4544 9834 -4571 -6542 8846
2202H846j1081o119J6400p807q454J4606m692j0548J4998j903j4328J3949L761
$$ 8846 -2235 -8354 8046 239 -8215 6391 1699 -8849 6149 4246 -10082 3867 7628
2215G628j6277R874P836j6609N850J1948j5087M11J3809j2009k479J3336j0374
$$ 7628 -8649 1225 9061 -7548 -1698 10250 -4837 -4426 9383 -2626 -5105 8231 -2143
2228b143m595J4896q235q551J5213m577j2044J5586o12j6152J3210O122j6993
$$ -2143 -6738 8158 -77 -8628 6585 2008 -10036 5550 4938 -11214 1996 8118 -8875
2241h875P674R603j5448M009J2590j3648n10J3442j1182k711J4357j0397o044
$$ -8875 -1201 8402 -7046 -3037 9553 -4095 -4605 8837 -2345 -5056 9301 -1096 -7140
2254g140J6334p224j1146J5680j892j4341J3420K779j6028R157P877j4975N191
$$ -7140 9194 1970 -9176 6504 4612 -9729 3691 6470 -9558 -401 7476 -7499 -2308
2267b308Q898j2588K264J0851j2253O5J3130j1736k737J4873r429p454J6807m809
$$ -2308 6590 -5998 -3734 7117 -5136 -5071 8059 -3677 -6414 8459 -970 -8424 8383 3574
2281C574j2492J4561O14j4178J1199L904j4363Q165P520j4405M981R056j3570
$$ 3574 -8918 5643 6257 -7921 3278 7182 -7181 984 8504 -5901 -920 8136 -5434
2294e434K689J1829j4147j199J5705j1366p082J6502o373j1393J5644j724j3047
$$ -5434 -2745 9084 -5063 -6262 9443 -1923 -9005 7497 1124 -10269 5375 3651 -9396
2307i396J1809L218j3009Q509M881j3111P291P375j3535M174R793j2921J518J2661
$$ -9396 2413 5631 -7378 1131 6012 -7099 192 7567 -5968 -1794 7999 -4922 -3404 9257
2321I257j2912l555J5592q329q583J4542m069j0447J2369o28j1089J0385J885
$$ 9257 -3655 -7210 8382 53 -8530 6012 1943 -8504 3865 3237 -7852 2533 4418
2334D418j2113R542M326j4052Q382Q201j5207M026J2756j4051j267J5430j1092
$$ 4418 -7695 1847 6173 -7879 503 8704 -6503 -2477 10279 -3772 -5039 10391 -701
2347g01o272J5515o305j0126J3391j787j0872J1696q04j2547J1497K995j4465
$$ -701 -6973 8542 2237 -7889 5502 3715 -7157 4539 3735 -8812 2685 5680 -8785
2360h785Q155P100j4337M795J1276j4249l66J4343j0434m473J3238p026o509J3005
$$ -8785 -630 6470 -7867 -3072 8204 -6045 -6411 7932 -2502 -6975 6263 -763 -7272 5733
2374E733l627r024J1300j987q967J1474m44j2583J0738N243j4707O520R041j4211
$$ 5733 2106 -6918 4382 2395 -6572 4902 4458 -8125 2613 7856 -6851 -331 8710 -5501
2388e501L168J1486j2430j801J3167q842m777J1920o333o259J2528n066q499J2951
$$ -5501 -2333 9153 -3277 -5078 8089 -753 -5530 6390 57 -6202 6326 1260 -7239 5712
2402E712k129j2065J2103J925j4490R677P198j5422M256J0676j2151J52J1211
$$ 5712 3583 -8482 3621 5546 -8944 733 7931 -7491 -3235 7441 -4710 -4558 6653
2415F653j0621k465J2737p682n495J1802n807o077J3214m724j1030J3757J161
$$ 6653 -3968 -6433 6304 -1378 -6873 4929 -878 -6955 6259 1535 -9495 4262 5423
2428E423j3387J0358M935j3777O236R153j3122K210R666j0440L78J0428r981k056
$$ 5423 -7964 2394 7329 -6448 -212 8941 -4181 -1971 7695 -2745 -2367 8061 -1920 -3976
2442c976J1668p790n798J2707n900q582J3135k268j2005J1449L273j3756P009
$$ -3976 7692 -98 -5896 6811 911 -7671 5464 3196 -8809 2640 5913 -7843 -834
2455h34O661j2136M777P582j1313J869R996j0586l77J1008r400k954J3060p358
$$ -834 5827 -6309 -1532 6050 -5263 -3394 6602 -3984 -4361 6647 -2753 -5707 7353 -5
2469ep638J3953l641j0828J2351O44j2545R313M955j2526N496O369j1382M821
$$ -5 -7643 6310 2669 -8159 4192 4836 -7709 1604 6559 -5967 -471 5898 -5484 -663
2483f63P449j1597K162J0466j0752j717J2692r009n528J4162n662r550J3053q98
$$ -663 6786 -4811 -2649 7817 -2935 -4652 8040 -969 -6497 7665 2003 -7547 5506 4608
2497D608j1910J0118K612j1879P674M406j1332N365O620j2340L876R153j2215
$$ 4608 -7302 2816 5428 -6451 1223 5629 -5703 -338 6282 -6058 -2182 6971 -5244
2510e244P27J1671j0549l583J3001o928o978J2312k826r291J1084j31j0392Q911
$$ -5244 -4517 7154 -3395 -6978 6023 -905 -7883 4429 1603 -7688 3396 3265 -7127 1784
2524A784K344r844P433L832j1395O075P517j2251K457J0483j1355r85J2023q727
$$ 1784 4128 -5716 1717 5549 -5846 229 7746 -4505 -2048 8435 -2920 -3905 8118 -609
2538f09n244J2760n189q250J1542j917r552R767J43j0319Q923K349j1722P348
$$ -609 -5853 6907 1718 -6532 5010 3093 -6459 3308 3451 -6868 2055 4404 -7318 30
2552C0O135j2682M148R614j2017l3J2064r300m496J2210o209n846J1338l401q309
$$ 30 6165 -6517 -2369 7245 -4772 -4805 7259 -2041 -6537 5673 -536 -6382 4956 1555 -6754
2567f754J0475o81r422R771N80j0706Q248M547j2040N398P453j1539K173J0412
$$ -6754 3721 3040 -6382 3389 3969 -6737 1511 6058 -5982 -584 6869 -4670 -2497 7915
2581G915j0734j471J1203q105l714J0792n750o135J1387l782q075J0727j129j0216
$$ 7915 -2819 -4290 6913 -1192 -4906 5886 136 -5999 5388 1606 -6469 4258 3129 -7087
2595g087J0086K096j2351Q289N674j2765M015Q733j0710O18J0064r360k135J1197
$$ -7087 2999 5095 -7256 1033 6707 -6058 -2043 6690 -4020 -3402 6662 -2698 -4833 6364
2609F364p220m771J1270n416o792J1691l206r028J0544J176j1862Q742M319j2197
$$ 6364 -856 -5627 5643 227 -6565 5126 1920 -7108 3436 4612 -7250 1492 5811 -6386
2623f386N511P417j1512K267R644j0227k89R810q379k491J0787o611n300J1406
$$ -6386 -875 6542 -4970 -2703 6941 -3286 -3575 6235 -2144 -4635 6152 -459 -5759 5647
2637E647m331p828J1206j568r839R543K176j1428P369M814j0845M048P454j0566
$$ 5647 1316 -6512 4694 3126 -6713 2830 5006 -6422 947 5761 -5084 -1036 6418 -4148
2651d148J596Q785r256q46R868q340l090J1477n787p409J1909k634r187J0416
$$ -4148 -2552 6233 -3023 -3869 5999 -2341 -5431 6046 259 -7150 4759 2125 -7062 3354
2665C354P60j1032Q408L568j1313O028N796j0416L550P846j0759J206R809r219
$$ 3354 4114 -6918 1490 5058 -6255 -227 5569 -4847 -1297 6549 -4210 -3004 6805 -2414
2679b414j696J0874p616m909J1526m686p939J1095r86j0143R522J781j0928P712
$$ -2414 -4110 6764 -852 -5761 5765 1079 -6860 4235 3249 -6894 2628 4409 -6519 1193
2693A193M387j1345M903O801j0851K758Q836j0316m67J0918q407l641J0940n747
$$ 1193 5580 -5765 -862 5939 -4912 -2154 6682 -3634 -4101 6817 -1590 -5231 5709 -38
2707c8n774J0905l149q608J0177j17r343Q593J873j0496O857M664j0811M217P316
$$ -38 -5812 5093 1944 -6664 3513 3396 -5947 2646 4519 -5977 880 5544 -5267 -1050 6266
2722F266j0673J905R055r645j239J0515p319m629J0802m706o778J0865k554q728
$$ 6266 -4407 -2502 6553 -3092 -4331 6184 -1135 -5764 5038 332 -6446 4419 1865 -6863
2736f863R768O52r905P949L165j0420N917O118j1438L034Q626r760J69R488q322
$$ -6863 2905 3557 -6348 1601 4766 -5654 263 6381 -5057 -2023 6603 -3157 -2988 6500 -1822
2751a822k281J0477o045n298J0106l673p271J0423j605r002Q829J287j0106O541
$$ -1822 -4103 6374 329 -4969 5137 1464 -5807 4616 3011 -5991 2838 4125 -5981 560
2765E60M572j0605M685O585j0472J991Q420r230n16R758p754l010J0363n655n685
$$ 560 5132 -5473 -788 5797 -4675 -2684 5736 -3494 -4010 5748 -2006 -5016 5347 -308 -5993
2780e993J0899l404p563R479k28r488Q314K976j0604O168M731r931L731P452j0400
$$ -5993 4906 1502 -6061 3418 3190 -6298 2016 4992 -5612 556 5287 -4644 -913 6539 -3861
2795c861J189R338q744j841R998o490m525J0540m636p092J0270j552q905Q830
$$ -3861 -2672 6666 -2078 -3919 6079 -411 -4936 5604 968 -6124 4146 2594 -6311 2519
2809B519J649r808O984L194j0046N411N934j0377K582P823r123j3R183p739l054
$$ 2519 4168 -5640 1344 4538 -5508 -97 5837 -4540 -1958 5865 -3258 -3271 5912 -1827 -4881
2824d881J0547o062m952R405k967p189R476p61q891Q189J967r708O418M098r969
$$ -4881 5666 -396 -5348 4057 1090 -6099 3377 2616 -6275 1914 3881 -5827 591 4689 -5280
2839e280M816O273j0041K025Q790r259j167R760o548l960J0194m982o005R844
$$ -5280 -464 5809 -4232 -2207 6583 -2676 -3843 5917 -631 -4591 5603 621 -5384 4460
2853D460k075p858Q848j1q797P277K894r804N369M878r648L708O891r935O62Q759
$$ 4460 2385 -5473 3375 3364 -5433 1844 4738 -5066 303 5181 -4467 -759 6132 -3803 -3141 5618
2869E618p902k041R138o080l823R540m192o405R182j095q031Q222Q37r248P382
$$ 5618 -2284 -4325 4813 -1267 -5090 4450 258 -6147 3035 1940 -6091 2131 2968 -6280 1102
2884A102L450r881M804O177r419K058P919q860m72R371o832l282R224m817m956
$$ 1102 4552 -5329 -525 5652 -3767 -1709 6210 -2650 -3122 6249 -583 -3865 5359 542 -4414
2899d414R446l339p275R571q44q717P647K138r933O087M938r969L042O814q948
$$ -4414 5032 1693 -5582 3989 3145 -5572 2075 4213 -5720 367 5305 -4664 -1622 5192 -3756
2914c756J144P720p966q19Q520o365k999R237m897n246R719k801p421R007M42
$$ -3756 -2612 5108 -2858 -3677 4843 -1522 -4521 4716 -181 -5427 4292 1491 -5930 3077 3519
2929C519r610P644L016r315M566N551r295K612P078q559L26P951p532j612R285
$$ 3519 -6091 1553 4569 -4746 -180 5371 -3924 -1312 5766 -2793 -2467 5484 -2048 -3660 5625
2944E625o201m173R668l614o852R168j030q462Q096J915r262N300M289q798L674
$$ 5625 -576 -4749 4919 1305 -5547 3621 2591 -5871 2225 4140 -5122 178 4467 -4331 -657
2959f57N722q796J508P378p963R7Q084p191k317R214n087n426R288k126p266Q269
$$ -657 5065 -3731 -2223 5155 -2808 -2711 5373 -1818 -4135 5079 -8 -5434 3854 1728 -5538 2731
2975B731J01q381P106K329q902N134M695r329L777N788q662J658P771q222q57
$$ 2731 2832 -5549 1557 3886 -5016 118 4813 -4516 -739 5049 -3613 -1955 5816 -2406 -3263
2990c263Q949o493l620R146l225o758Q784r04p620P350P72q195O295K891q728
$$ -3263 5686 -807 -4427 4719 1494 -5264 3520 2616 -5004 2346 3118 -5077 1218 4109 -4619
3005d619M355M996q751K724O545q879M49Q612p420k936R228m452n062Q938k623
$$ -4619 -264 4732 -4019 -1295 5250 -3629 -3180 5432 -1988 -4924 4304 -148 -5210 3728 1105
3020A105o559Q364q41o932O752J342q313O238L368r313M235O153r331J970P628
$$ 1105 -5454 2910 2069 -4863 1889 3231 -5082 1156 4524 -4789 -554 5599 -3732 -1762 5866
3035E866p962j179Q885n862m357R067l643n212P684j383o741P886k26p837O680
$$ 5866 -2096 -3275 5610 -252 -4609 4458 815 -4397 3287 1904 -4837 3049 2823 -5014 1666
3050A666K139q817N087M631r209K757O872q199M8Q056o805k478Q536m565m273
$$ 1666 3805 -5012 75 4706 -4503 -1746 5126 -3073 -3025 5031 -1774 -4252 4284 -281 -4554
3065d554Q116k878n467P946j719o546P690N66q500O243L545q670M178N608r137
$$ -4554 3562 684 -4783 3163 1444 -5102 2588 3154 -5346 897 4442 -4228 -50 5558 -3579
3080c579K079P255p559j159Q031n447l278Q325m387m677Q577k805o275Q244j079
$$ -3579 -1500 5755 -1804 -2963 5068 -379 -3657 4668 281 -4396 4181 1376 -4899 3345 2266
3095B266q008P656J995r073M646M869q437K372O460p523m39Q219o653j533P430
$$ 2266 -5742 1914 3909 -5164 -518 4351 -4086 -1714 4746 -2777 -3216 5003 -1650 -3183 4247
3110D247n435k408Q174m646m495Q643k384o708P463P38p954O070L066q256L495
$$ 4247 -1188 -3596 4578 -68 -4563 4080 1696 -5012 2451 3189 -4765 1305 4371 -3885 -390
3125c90M932q020J984O196p161j92P272o053j834Q022n452l966R350l650o413
$$ -390 4542 -3478 -1494 4702 -2459 -2651 4621 -1432 -3266 4756 -696 -4662 4688 1038 -5375
3140e375Q716m80p968O805J998q262M814M151p797K350N575p489J078O435o796
$$ -5375 3341 2861 -5107 1698 3696 -4566 248 4399 -3398 -1048 4527 -2962 -1884 4551 -2245
3155b245r97P890n898k687Q178m080n215Q740k049p132P567P83p135N291K152
$$ -2245 -3242 4648 -1250 -3937 4241 161 -5054 3686 1637 -5495 2072 2855 -4280 1011 3163
3170C163p048M453L627p673K585N262p095J171O541o610j610Q445n585l754Q220
$$ 3163 -3885 568 4195 -3478 -893 4369 -2726 -1555 4986 -1624 -3234 5211 -374 -4128 4092
3185D092l096n501P836q44p266O664J096p452N474K306p743M291M300p960J939
$$ 4092 996 -4505 3331 2487 -4779 1885 2981 -4471 1003 3309 -4434 -143 4157 -3803 -1864
3200a864O412p260o89P767o152k484Q455l935m923P631j340o050O718J90o706
$$ -1864 4548 -2712 -3401 4366 -1786 -4270 4185 250 -4673 2958 1618 -4432 2286 2476 -4230
3215d230N545J847o676L900L297p385L168N408p635O42P291o310j701P261m640
$$ -4230 1315 3162 -3514 386 3683 -3702 -534 4874 -2761 -2119 5172 -1138 -2839 4422 -218
3230b18l684P691l002m800O946j822n184O071L75o806N521K315p648M292M010
$$ -218 -3902 3789 787 -4013 2933 1111 -4073 1998 2373 -4433 1088 3403 -4245 47 4057
3245D057p806K427O112p531R5P222n523k828P352l558l782P153k506n314P008
$$ 4057 -3749 -1322 4790 -2741 -2646 4576 -947 -3775 3577 19 -3763 3390 884 -4430 2578
3260B578q03o154O237J112p282N161L125p972L058N360p140R72N837o043p57O454
$$ 2578 1775 -4379 1858 2970 -4312 849 3974 -3998 -940 4420 -2720 -1748 4089 -1954 -2711 3743
3276C743m102k767O640l355m102P058j893n655O604L06o989O305K051p821M100
$$ 3743 -359 -3126 3514 159 -3943 3115 1222 -4433 2171 2477 -4512 1793 3844 -3977 123
3291A23M320p642K022N049o605N89N990n564j306O945m429l017O610k720m524
$$ 123 4443 -3199 -1177 3872 -2733 -2144 3846 -1718 -3024 3921 -508 -3525 3085 365 -4159
3306d159P059j073o455O541J250p725N169K909p133L015M534o632J280N503n872
$$ -4159 2900 1827 -4628 1913 3163 -4562 607 3516 -3617 -602 3932 -2700 -1420 4083 -1789
3321a789o7N674m684k134O871l846l973P036j917n588P133m20o441N486J948p066
$$ -1789 -1856 3818 -866 -3000 3871 25 -3948 3088 1171 -4417 2716 2296 -4145 1341 3289 -3777
3337c777M015L427o920K621M423o500J154N448n647n08O341m976k644P697l622
$$ -3777 238 3665 -3255 -634 3789 -2711 -1557 3891 -1756 -2264 4077 -899 -3543 4154 532
3352E32m697O953r68n995N805Q21o575M652K333o357L044L770o388K143M942o408
$$ 532 -4165 2788 1820 -4175 1630 2451 -4124 528 2861 -3496 -452 3318 -3070 -927 4015 -2393
3368b393N86N712n145j941P191m277l455O899k155m929O182n87n367N242R50o255
$$ -2393 -1807 3905 -1240 -3181 4010 -267 -3722 3177 1022 -3907 2275 1688 -3679 1563 2513 -3742
3384c742M178K474o326L106M113o705J506N198o021k17O305m707k225O652k963
$$ -3742 436 2910 -3416 -310 3803 -2902 -1396 3802 -2219 -2436 3869 -838 -3063 3589 626
3399F26m280O841j734n156N741L04n762M805J487n961L478K987o668K268M981
$$ 626 -3654 3187 1453 -3703 2038 2342 -3420 1385 2872 -3089 389 3376 -3292 -1024 3957
3414C957o314K31N630n354r30O098l950l225O324k018m530N979r21m542N304N10
$$ 3957 -2357 -2126 3504 -1850 -2780 3318 -632 -3857 2467 449 -4081 1898 977 -3565 1739 2249
3430B249n624M117K452o295L241L978o558J617N401o153n31O185m490j987N984
$$ 2249 -3375 742 3194 -3101 140 4118 -2440 -823 4578 -1575 -2106 4079 -411 -2398 3586
3445C586l407l279N878j538m892N557k36n373M499J764o368L888L099o541K212
$$ 3586 179 -3100 2778 1240 -3652 1905 1669 -3704 795 2559 -3809 79 3178 -3363 -1151
3460a151M377n606N44N055m711j031N828l523k628N795k533l544N724j187m998
$$ -1151 3226 -2380 -1836 3219 -1492 -2523 3305 -218 -2846 2949 416 -3128 2596 1409 -3589
3475c589N491M4n310M226K125o499K950L616n831J364M740n416J15N401m279j605
$$ -3589 1902 1946 -3364 862 2987 -3512 -562 3054 -2777 -1413 3327 -2089 -1974 3427 -852 -2457
3491b457O158l846k785N906j672m558N511l17n434N069R92n447L663K201n516
$$ -2457 3701 -145 -2930 2976 1304 -3254 2257 1940 -3494 1575 2567 -2880 783 2984 -2532
3506b532K098L844n547Q01M766m889r66N325m113k180O072l082l476N768j243
$$ -2532 -434 3410 -2137 -1336 3430 -1459 -2425 2900 -1213 -3393 2679 -403 -3879 1889 646
3521F46m859N772j4n196M483J621n457L203L004n618J907M193n485M35N178m662
$$ 646 -4213 1559 1545 -3651 832 2453 -3004 199 3203 -2415 -508 3685 -1800 -1365 3813 -849
3537h49j120N638m048k461N944k346l971N656p37n094M592R52n624L788K148n646
$$ -849 -1969 3669 -379 -2840 3104 758 -3213 2443 1706 -3388 1204 2156 -3468 320 2468 -3178
3553c178K906L331n473J307M337n035n57N634m369j584N254k986k821N542j652
$$ -3178 -272 3059 -2414 -1107 3230 -1805 -2362 3272 -1097 -2681 2573 -413 -3234 2308 656
3568F56m237N198j74n001M177J520n553L504L027n867K040L869m911L94M636m321
$$ 656 -3581 1617 1443 -3558 619 2139 -3414 90 3117 -2750 -710 3159 -1752 -1358 3278 -1043
3584a043o87N168l608j995N095k154l499N242r35m587M903M96n677M428J330n105
$$ -1043 -1730 3438 -170 -2165 2930 776 -2723 2519 1584 -3003 1900 2396 -3281 1147 2477 -2628
3600b628K458L252n589J456L974n086J98M658l929j480N548l531k269N008j724
$$ -2628 -170 3082 -2507 -1051 2923 -2163 -1965 2693 -1236 -2716 2832 -699 -2968 2040 316
3615C16m018N297k14m896M627J116n148L369K315n312K224L505n243J192M240
$$ 316 -3702 1595 1381 -3515 1112 2228 -2920 449 2764 -2548 -324 3181 -2062 -870 3370
3630C370m720o38N347m248j511N343k700l204N314j257m068M797J81m870L697
$$ 3370 -1350 -1988 3359 -889 -2400 2943 243 -2961 2353 1096 -2972 1825 2006 -2864 833
3645H33J786n106K506K787m648J236L752m948Q37M137m230n91M883l418k498M866
$$ 833 2619 -2487 19 2806 -1842 -606 3146 -1802 -965 3172 -1058 -1649 3234 -184 -2682 2184
3661B184j441l769M859o41m489M515M25m927L682J792n213K415L163m993J161
$$ 2184 743 -3026 1833 1192 -3297 1218 1643 -3284 398 2190 -3023 -608 2555 -2438 -1277
3676a277L969m463N9N040m058j504N287k537l020N331j652l505M386k80m212L773
$$ -1277 2692 -1771 -1712 3328 -730 -2234 3053 516 -2504 2827 1175 -2330 2056 1776 -2436 1337
3692A337J304n315L116K247n226J953L448m714L02M567m360j134M999k922k309
$$ 1337 2641 -2674 442 2689 -2537 -584 2864 -1850 -1548 3019 -1341 -2475 2524 -398 -2707
3707b707M797j904k992M267o23l809M173M35m484L312J625n064L061K686m895
$$ -2707 2090 186 -2806 1461 838 -2971 1202 1637 -2847 465 2090 -2974 87 2773 -2122
3722b122J006M159m291k83M798l939j596M940k339k782M743j227l708M505r98
$$ -2122 -1116 3043 -1248 -1531 3267 -672 -2268 2672 333 -2449 2294 1067 -2641 1864 866
3737H66l432L905O79m704L432J664m851J793L341m775R18M280m223j011N048l301
$$ 866 -2566 1339 2018 -2686 746 2410 -2441 -648 2693 -2082 -1164 3116 -1107 -2118 2930 -371
3753c71j825M395k122k361M477j074m181M616L7m637M047J454n094K429K805m877
$$ -371 -2196 2199 77 -2284 2193 1119 -3062 1554 1591 -3046 1001 2455 -2639 -210 2595 -2282
3769b282J171M016m685N4M262l405j326M322k554j998M503j829l178N051r25m372
$$ -2282 -1111 2905 -1780 -1726 2536 -869 -2195 2127 -427 -2425 2078 249 -2929 2122 1197 -3175
3785c175M465Q83n197L608K005m825K068K904m166Q47L580m023l30L834l206q37
$$ -3175 1290 2173 -3024 584 2589 -2236 -168 2736 -1430 -583 2997 -1026 -1356 2478 -728 -1565
3801a565M249k857k479M885j592l339M459n29m025L712J108m571K558K333m207
$$ -1565 2684 -173 -2652 2233 641 -2698 1761 1232 -2793 919 2027 -2544 14 2347 -1860
3816a860J128L123m227O35L918l965l94M112k728k155M953k369k855M743o00m778
$$ -1860 -732 2391 -1836 -1201 2717 -1248 -1642 2470 -258 -2413 2540 171 -2684 2059 1459 -3319
3832c319M158J125m809K930J933m332K161K603l992R72L593m460j59M468l390
$$ -3319 839 1964 -2845 85 2018 -2314 -153 2450 -1542 -570 3023 -1437 -1596 2872 -518
3847e18j382M322k493j991M341j591l448M357n1m051L518Q24m052K429K136m737
$$ -518 -1900 2422 -71 -2062 2279 688 -2760 1597 1546 -2505 1013 1837 -2215 214 2350 -2387
3863b387K095K723m203R84L012l710o0M198l070k088M716j937l001M706j175l921
$$ -2387 -292 2431 -1772 -788 2224 -1486 -1546 2652 -418 -2506 2210 273 -2728 1978 803 -3118
3879c118M044N10l993L132J312m127K372K047m222J576K910l977L88M014l658
$$ -3118 926 1436 -2557 575 1887 -2240 132 2179 -2043 -467 2443 -1534 -1146 2868 -790
3894g90r04M453k661k181M391j504l146L935k46l862L377Q56l833K772J432m384
$$ -790 -1694 2759 98 -2083 2308 804 -2342 1593 1347 -2515 862 1718 -2115 657 2089 -2295
3910b295K283K616m068L99M108m597n1M245l164j720M648k414k336M166j309l271
$$ -2295 -12 2604 -1464 -1065 3043 -1554 -1605 2640 -524 -2244 2404 -10 -2346 1820 511 -2760
3926b760L745O0l940L623N23m034K753K067m279J688L238m219L39M116l366j059
$$ -2760 985 1045 -2895 728 1251 -2783 -30 2037 -2242 -554 2684 -1535 -1196 2920 -446 -1505
3942a505M645l276j523M033j646k839M093p37l385L605k4l827L202J455m565K141
$$ -1505 3140 -136 -1659 2374 728 -2111 1982 1245 -2140 1465 1441 -2386 816 2271 -2294 -153
3958a53K432m197O02L886l823m90L834k848j448M203k493j826M231j612k910L982
$$ -153 2279 -1918 -1316 2570 -1253 -1743 2091 -757 -2205 1998 -495 -2321 1910 298 -2612 1370
3974A370o00l422L528P62m049K746J894m065J299K872l802M32L518l591m76L658
$$ 1370 770 -2652 876 1638 -2411 335 2229 -1836 -537 2335 -1467 -1035 2483 -1108 -1584 2074
3990B074k343j410L793j814k432L893j072l235L700L35m053L279J604m243K365
$$ 2074 -269 -1679 2114 300 -2132 1761 689 -2546 1154 1489 -2564 715 2319 -1924 441
4005D41J995l886J276K718l784J91L478l380p20M076k821j852M583j980k961M034
$$ 441 2436 -1450 -174 2544 -1240 -1049 2429 -951 -1671 2405 -416 -2268 2315 335 -2626 1408
4021A408n23l941L719L22l784K770J453l802J902K550m036R08L125l314L56L572
$$ 1408 885 -3056 663 985 -2799 -29 1424 -2378 -476 2074 -1962 -1054 2071 -1243 -887 2685
$$ [...]
8191b02
##END NTUPLES=NMR FID
##END=
