##TITLE=1H_Pr 3780
 CDCl3+DMSO, 8 sc, 
 24.6.2019
##JCAMPDX= 6.0         $$ Bruker NMR JCAMP-DX V2.0
##DATA TYPE= NMR FID
##DATA CLASS= NTUPLES
##ORIGIN= UXNMR, Bruker Analytische Messtechnik GmbH
##OWNER= root
$$ XWIN-NMR		Version 3.5
$$ Mon Jun 24 15:25:34 2019 Russian Standard Time (UT+4h)  she@DPX200
##.OBSERVE FREQUENCY= 200.13155
##.OBSERVE NUCLEUS= ^1H
##.DELAY= (6, 6)
##.ACQUISITION MODE= SIMULTANEOUS
##.ACQUISITION SCHEME= undefined
##.AVERAGES= 8
##.DIGITISER RES= 18
##SPECTROMETER/DATA SYSTEM= spect
##.PULSE SEQUENCE= zg30
##.SOLVENT NAME= CDCl3
##.SHIFT REFERENCE= (INTERNAL, CDCl3, 0, 15.7039)
##AUDIT TRAIL= $$ (NUMBER, WHEN, WHO, WHERE, WHAT)
$$ ##TITLE= Audit trail, XWIN-NMR		Version 3.5
$$ ##JCAMPDX= 5.01
$$ ##ORIGIN= Bruker BioSpin GmbH
$$ ##OWNER= she
$$ F:/spectra/data/she/nmr/H-F/1/audita.txt
$$ ##AUDIT TRAIL=  $$ (NUMBER, WHEN, WHO, WHERE, WHAT)
(   1,<2019-06-24 15:24:18.34 +0400>,<she>,<DPX200>,
      <created by zg, POWCHK disabled, PULCHK disabled
       configuration hash MD5:
       00 E9 B6 7A A2 85 ED C7 34 08 36 98 17 FE 4E 26
       data hash MD5: 16K
       2F E5 89 09 D3 0F 66 A1 DA D0 18 F6 44 B7 31 3B>)
$$ ##END=
$$ 
$$ hash MD5
$$ 9D F2 72 EA 3E 1A 67 C5 F4 98 1F 4A 98 15 99 E4
##$RELAX= 
##$RELAX= 
##$RELAX= 
##$RELAX= 
##$RELAX= 
##$RELAX= 
$$ Bruker specific parameters
$$ --------------------------
##$DU= <F:/spectra>
##$EXPNO= 1
##$NAME= <H-F>
##$PROCNO= 1
##$TYPE= <nmr>
##$USER= <she>
##$AMP= (0..31)
100 100 100 100 100 100 100 100 100 100 100 100 100 100 100 100 100 100 
100 100 100 100 100 100 100 100 100 100 100 100 100 100 
##$AQSEQ= 0
##$AQ_mod= 1
##$AUNM= <au_zg>
##$AUTOPOS= <>
##$BF1= 200.13
##$BF2= 200.13
##$BF3= 200.13
##$BF4= 200.13
##$BF5= 200.13
##$BF6= 200.13
##$BF7= 200.13
##$BF8= 200.13
##$BYTORDA= 1
##$CFDGTYP= 0
##$CFRGTYP= 5
##$CHEMSTR= <none>
##$CNST= (0..31)
1 1 145 1 1 1 1 1 1 1 1 1 1 1 1 1 1 1 1 1 1 1 1 1 1 1 1 1 1 1 1 1 
##$CPDPRG= <>
##$CPDPRG1= <>
##$CPDPRG2= <>
##$CPDPRG3= <>
##$CPDPRG4= <mlev>
##$CPDPRG5= <mlev>
##$CPDPRG6= <mlev>
##$CPDPRG7= <mlev>
##$CPDPRG8= <mlev>
##$CPDPRGB= <>
##$CPDPRGT= <>
##$D= (0..31)
0 1.2 0 0 0 0 0 0 0 0 0 0.03 0 0 0 0 0 0 0 0 0 0 0 0 0 0 0 0 0 0 0 0 
##$DATE= 1561375457
##$DBL= (0..7)
120 120 120 120 120 120 120 120 
##$DBP= (0..7)
150 150 150 150 150 150 150 150 
##$DBP07= 0
##$DBPNAM0= <>
##$DBPNAM1= <>
##$DBPNAM2= <>
##$DBPNAM3= <>
##$DBPNAM4= <>
##$DBPNAM5= <>
##$DBPNAM6= <>
##$DBPNAM7= <>
##$DBPOAL= (0..7)
0.5 0.5 0.5 0.5 0.5 0.5 0.5 0.5 
##$DBPOFFS= (0..7)
0 0 0 0 0 0 0 0 
##$DE= 6
##$DECBNUC= <off>
##$DECIM= 24
##$DECNUC= <off>
##$DECSTAT= 4
##$DIGMOD= 1
##$DIGTYP= 9
##$DL= (0..7)
0 120 120 120 120 120 120 120 
##$DP= (0..7)
150 150 150 150 150 150 150 150 
##$DP07= 0
##$DPNAME0= <>
##$DPNAME1= <>
##$DPNAME2= <>
##$DPNAME3= <>
##$DPNAME4= <>
##$DPNAME5= <>
##$DPNAME6= <>
##$DPNAME7= <>
##$DPOAL= (0..7)
0.5 0.5 0.5 0.5 0.5 0.5 0.5 0.5 
##$DPOFFS= (0..7)
0 0 0 0 0 0 0 0 
##$DQDMODE= 0
##$DR= 18
##$DS= 0
##$DSLIST= <SSSSSSSSSSSSSSS>
##$DSPFIRM= 0
$$ [...]
##$SUBNAM2= <"">
##$SUBNAM3= <"">
##$SUBNAM4= <"">
##$SUBNAM5= <"">
##$SUBNAM6= <"">
##$SUBNAM7= <"">
##$SUBNAM8= <"">
##$SUBNAM9= <"">
##$SW= 24.9336996594482
##$SWIBOX= (0..15)
0 0 2 0 0 0 0 0 0 0 0 0 0 0 0 0 
##$SW_h= 4990.01996007984
##$TD= 16384
##$TD0= 1
##$TE= 0
##$TE2= 300
##$TE3= 300
##$TEG= 300
##$TL= (0..7)
0 120 120 120 120 120 120 120 
##$TP= (0..7)
150 150 150 150 150 150 150 150 
##$TP07= 0
##$TPNAME0= <>
##$TPNAME1= <>
##$TPNAME2= <>
##$TPNAME3= <>
##$TPNAME4= <>
##$TPNAME5= <>
##$TPNAME6= <>
##$TPNAME7= <>
##$TPOAL= (0..7)
0.5 0.5 0.5 0.5 0.5 0.5 0.5 0.5 
##$TPOFFS= (0..7)
0 0 0 0 0 0 0 0 
##$TUNHIN= 0
##$TUNHOUT= 0
##$TUNXOUT= 0
##$USERA1= <user>
##$USERA2= <user>
##$USERA3= <user>
##$USERA4= <user>
##$USERA5= <user>
##$V9= 5
##$VALIST= <valist>
##$VCLIST= <CCCCCCCCCCCCCCC>
##$VD= 0
##$VDLIST= <DDDDDDDDDDDDDDD>
##$VPLIST= <PPPPPPPPPPPPPPP>
##$VTLIST= <TTTTTTTTTTTTTTT>
##$WBST= 1024
##$WBSW= 4
##$XGAIN= (0..3)
0 0 0 0 
##$XL= 0
##$YL= 0
##$YMAX_a= 152129
##$YMIN_a= -296445
##$ZGOPTNS= <>
##$ZL1= 120
##$ZL2= 120
##$ZL3= 120
##$ZL4= 120
##$ABSF1= 10
##$ABSF2= 0
##$ABSG= 5
##$ABSL= 3
##$ALPHA= 0
##$AQORDER= 0
##$ASSFAC= 0
##$ASSFACI= 0
##$ASSFACX= 0
##$ASSWID= 0
##$AUNMP= <proc_1d>
##$AZFE= 0.1
##$AZFW= 0.1
##$BCFW= 1
##$BC_mod= 2
##$BYTORDP= 1
##$COROFFS= 0
##$CY= 11.3945322036743
##$DATMOD= 1
##$DC= 2
##$DFILT= <>
##$DTYPP= 0
##$F1P= 18.9103706918063
##$F2P= -1.10871071338519
##$FCOR= 0.5
##$FTSIZE= 0
##$FT_mod= 4
##$GAMMA= 1
##$GB= 0.15
##$INTBC= 1
##$INTSCL= 1
##$ISEN= 128
##$LB= 0.24
##$LEV0= 0
##$LPBIN= 0
##$MAXI= 10000
##$MC2= 0
##$MEAN= 0
##$ME_mod= 0
##$MI= 1.114404
##$NCOEF= 0
##$NC_proc= 0
##$NLEV= 6
##$NOISF1= 3.799351
##$NOISF2= 2.8
##$NSP= 1
##$NTH_PI= 0
##$NZP= 0
##$OFFSET= 15.70392
##$PC= 1
##$PHC0= -8505.087
##$PHC1= 22.60097
##$PH_mod= 1
##$PKNL= yes
##$PPARMOD= 0
##$PSCAL= 0
##$PSIGN= 0
##$REVERSE= no
##$SF= 200.130013532006
##$SI= 16384
##$SIGF1= 3
##$SIGF2= 2
##$SINO= 400
##$SIOLD= 16384
##$SREGLST= <1H.CDCl3>
##$SSB= 0
##$STSI= 0
##$STSR= 0
##$SW_p= 3612.71676300578
##$SYMM= 0
##$S_DEV= 0
##$TDeff= 0
##$TDoff= 0
##$TI= <>
##$TILT= no
##$TM1= 0
##$TM2= 0
##$TOPLEV= 0
##$USERP1= <user>
##$USERP2= <user>
##$USERP3= <user>
##$USERP4= <user>
##$USERP5= <user>
##$WDW= 1
##$XDIM= 8192
##$YMAX_p= 0
##$YMIN_p= 0
$$ End of Bruker specific parameters
$$ ---------------------------------
##NTUPLES= NMR FID
##VAR_NAME=  TIME,          FID/REAL,        FID/IMAG
##SYMBOL=    X,             R,               I
##VAR_TYPE=  INDEPENDENT,   DEPENDENT,       DEPENDENT
##VAR_FORM=  AFFN,          ASDF,            ASDF
##VAR_DIM=   8192,          8192,            8192
##UNITS=     SECONDS,       ARBITRARY UNITS, ARBITRARY UNITS
##FACTOR=    0.0002004,     1,               1
##FIRST=     0,             0,               0
##LAST=      1.6414764,     0,               0
##MIN=       0,             -296445,         0
##MAX=       1.6414764,     152129,          0
$$ Real data points
##PAGE= N=1
##DATA TABLE= (X++(R..R)), XYDATA
$$ [...]
3426e462O745L794r408L109O271p870P36O232n249j136O011m713j528O648m435
3441b55l580Q296l003o703Q337J50q425O129L570q834K823N897o841J8O452n709
3457a678o41N875m965j662O845m543l657Q389k748p000Q064Q40q475N933L550
3472D127p686K269N781p067O36N780n229p78O012m931j692O960m482l987Q422
3487D135k563o697Q009O86q334N061M345q201K408N590o649J89N718n253l83O104
3503D165n616j540P189m587l904Q437k501o783P050J262q073M958M115p583K080
3518a331N003n829N42N190n423j03N983n652j864P567m234m207Q219k392o694
3533e225P542R94p931M923L816p673K645M980o277J195M756n756J45N930n518
$$ y = [-5462, 1283, 5077, -4331, -1222, 5049, -2821, -2085, 4147, -1102, -2238, 3773, -940, -2468, 4180, -255, -3835, 4461, 1458, -5245, 3092, 3242, -5183, 946, 4516, -4318, -1495, 4402, -2439, -2421, 4031, -1678, -2319, 3556, -1409, -3071, 3774, -769, -4426, 3963, 1215, -5785, 2279, 3119, -5356, 577, 4127, -3559, -1290, 4491, -2576, -1940, 3840, -1389, -2167, 3845, -1086, -2778, 4182, -300, -4287, 4135, 1572, -5125, 2884, 3570, -4764, 297, 4642, -3559, -1151, 4439, -2210, -2021, 3697, -1556, -1939, 4165, -1451, -2991, 4198, -389, -4293, 4144, 1643, -5140, 1910, 3172, -4901, 57, 4172, -3411, -1331, 3672, -2157, -1615, 3575, -1848, -1951, 4032, -1620, -3484, 4083, -151, -4358, 3861, 1469, -5225, 2317, 3311, -4620, 303, 4119, -3554, -909, 4071, -2206, -1011, 3745, -2011, -1866, 4064, -1454]
3548a454j706P519m431l917P797j557p227O622J775p248L994L664p086K606M590
3563C941o239P10M998n577J61O096n752k060Q154m221n042P998j784o544O318
3578A157J966p165M095L241o527K261M616o134J098N025n843K8O317n333j984
3593c182O947l362m869P709j131o325N810J470o818M227L101o496K623L945o247
3608b598J570M972n717l62O300n114k374P157l066n158P263p35o681N619J693
3623B769o562L817L216o522K696L955o342J562N056n724m03O081m819k533P467
3638C714l364m953P129l89o213N289J244o018L969K921o546K760M081o192J121
3653a447N258n445o09O530m831k663O996k908m847O672o00o181N607J324o405
$$ y = [-1454, -3160, 4359, -72, -3989, 3808, 2251, -4976, 1646, 3421, -3827, 167, 3831, -3255, -649, 3941, -2298, -1588, 3410, -2167, -2006, 4090, -1662, -3722, 4432, 211, -4831, 3167, 1383, -5161, 1157, 3123, -4042, 53, 3294, -3233, -972, 3644, -2490, -1392, 3633, -2210, -2182, 4135, -1198, -3182, 3765, 403, -4466, 3243, 2112, -4213, 1597, 3067, -3751, 476, 3577, -2919, -296, 3649, -2598, -1028, 3944, -1773, -2135, 4165, -949, -3323, 3834, 768, -4390, 2873, 2138, -4543, 1076, 2769, -3793, 24, 3240, -3282, -586, 3369, -2973, -1411, 3645, -2079, -2482, 3599, -1220, -3753, 3714, 350, -4603, 2526, 2137, -4076, 1213, 2457, -3561, 408, 3329, -3217, -457, 3624, -2568, -1447, 3811, -1634, -2243, 4287, -544, -3207, 3789, 881, -3966, 2706, 2106, -4075, 1532, 2856, -3549]
3668c549M001K673o550K733M453o382J001N475n990l49O552m803k681O693k679
3683E98m431O270r93n391N229J114o125L893K694o225K819M176o364R73N798o012
3699a977n95O564m368l123O788k750m283O539q29n713N147J218n997M113K789
3714C523o235J991M763o117M97N553n339j205O152l790k870O281k278m552O265
3729B639q99n408M726J512o212L901L174o613K435M485o202M33N396m758j262
3744b653O118l783k979O143k807l644N847p12n542N238J183o217M053L074o203
3759b884K401M034n670M29N579n342q10N602l520k448N708k371m099N852q14n244
3775c597N158J005o102L874K943o126J839M680n629K3N612n045j291N509l307
$$ y = [-3549, 452, 3125, -3425, -692, 3761, -2621, -1620, 3855, -2135, -2484, 4068, -735, -3416, 3277, 598, -3833, 2437, 1444, -3947, 1282, 2396, -3729, 164, 2858, -3367, -548, 3628, -2736, -1763, 4035, -1977, -2572, 3992, -376, -3499, 3289, 539, -3744, 2795, 1966, -3747, 1400, 2618, -3379, 734, 3523, -2712, -721, 4042, -2075, -1578, 3975, -1364, -2569, 3583, -207, -3077, 3204, 926, -3626, 2639, 1740, -3668, 1058, 2570, -3642, 259, 3433, -3180, -745, 3740, -2462, -2029, 3367, -1391, -2653, 3465, -318, -3297, 2846, 39, -3605, 2242, 1530, -4012, 1226, 2409, -3808, 245, 3319, -2884, -483, 3551, -2119, -1690, 3889, -1453, -2263, 3339, -181, -2629, 3079, 708, -3391, 2461, 1647, -3597, 1561, 2566, -3536, 338, 3281, -2845, -1006, 3674, -1955, -1932, 3680, -1365, -2656, 2853, -454]
3790d54k505N958k667l753N710n29n953N473J492o310L568L265o491K137M650
3805C591n559j39N365m512j397O002l963k270N802k351m063N894o25n600N214
3820A389J641o408L545L446o102J339M609n325M6N255m506r87N342l732k285N729
3836B996k520m295O309p03n893N389J794o731L752L160o012J551M616m718k99
3851a604M736m313r26N361l911k356N877k336m378O208o89n693N042J743o247
3866c486L116L810o096J276M597n047j12N035l911j293N526l927k388O337k624
3881H13m337N913l3o175M953J880o248K865L885n586Q65M546n179Q0M860m526
3897a424m29N052l898k388O258k620m304N917j39o051M736K455o532K918L450
$$ y = [-454, -2959, 2999, 332, -3421, 2289, 1760, -4193, 1280, 2772, -3538, 30, 3295, -3196, -1059, 3591, -1968, -2107, 3258, -1254, -2651, 3351, -612, -2882, 2920, 569, -3494, 2400, 1775, -3825, 1389, 3030, -3378, 167, 3613, -2489, -1150, 3459, -1866, -1820, 3435, -1071, -2058, 3284, -448, -2733, 2996, 476, -3819, 2490, 1787, -4106, 1283, 3077, -3654, 98, 3258, -2754, -1203, 3413, -1305, -1604, 3132, -1181, -2107, 3254, -657, -3013, 2864, 528, -3850, 2358, 1669, -4024, 1018, 2761, -3486, -370, 3440, -2656, -1380, 3217, -1830, -1942, 3093, -818, -2111, 3415, -512, -2900, 3437, 813, -3524, 2389, 2356, -3819, 1134, 3014, -3234, -369, 3516, -2070, -1205, 3341, -1838, -1758, 3102, -1424, -1853, 3199, -699, -3087, 3171, 551, -3753, 2164, 2025, -4026, 710, 3165, -3367, -449, 3001]
3912C001n521J605L674m379QM622m470o25N117l653k124O176k731m534O137J08
3928B411n932M256K360o172K580L493m807Q13L976m340K53M210m422o52N499l769
3944b43k994O475k090n335O440K18o043L918K926n794K152L285n205J515L618
3959B843m400M69M336m690p24N333l668k751O386k076n207N898O80o246L990K424
3975B597n149J720L463m597R89M009m672J68M362m177r54N935m037l058O335j662
3991A272n167N789Q14o064L733K667n122J795K932m363J171L338m786R84M595
4006C588m943j122N929l733l135O523j799n511N708Q16n241L204K031m559J832
4021d12K587m452J699K888m467N41M741m601j284O480l961l456O450j250n296
$$ y = [3001, -2520, -915, 2759, -1620, -1612, 3010, -1460, -2085, 3032, -621, -2745, 3431, 700, -3834, 2303, 2411, -3521, 735, 3095, -3077, -497, 2996, -1811, -998, 2978, -1362, -1109, 3101, -1321, -1973, 3526, -243, -3237, 3238, 1148, -4187, 2253, 2471, -3572, 346, 3272, -2522, -370, 2915, -2290, -775, 2843, -1557, -1088, 3248, -1442, -2166, 3167, -501, -3252, 3134, 1058, -4149, 1749, 2429, -3817, 173, 2597, -2552, -832, 2631, -1966, -977, 3032, -1640, -1472, 2890, -1287, -2241, 3694, -343, -3401, 2934, 1272, -3895, 1894, 2708, -3356, 377, 3044, -2078, -283, 2649, -1714, -543, 2795, -1991, -1007, 3588, -1355, -2477, 3452, -281, -3416, 3107, 1308, -4203, 1505, 2321, -2920, 284, 2315, -2244, -412, 2175, -2277, -578, 2310, -2157, -1616, 3125, -1476, -2760, 3720, -241, -3697, 2753, 1503, -3793]
4036c793N085J146n420L226K168m578K101K582m752J688L435m824P39M788m983
4051a392j151O112l262l780O240q93n488M940J088n286L061K594m871J714K779
4066B405m443J902L002n121P03M848m738j503O527l676l750O029p93m608M180
4081I64J361n249K887K240m511K079K249m609J930L771n830J067N441n200j599
4096c009O453k745m233N878o74m896M149J421n063K805K201m296K359K138m680
4111b192J668L792n465O77N455n164j382O289l092m318N896k06n132L850J337
4126B013m513K673J599m032K524K286n192K488L228n717O91O136n305k390O791
4141C280k684m206N521k83m609L620J202m457L054J811m369K111K359m794K205
$$ y = [-3793, 1292, 2438, -2982, 244, 2412, -2166, -65, 2517, -2235, -547, 2888, -1936, -1197, 3591, -1392, -2543, 3569, 307, -3473, 2767, 1874, -3614, 1326, 2414, -2872, 189, 2783, -2088, -374, 2405, -2038, -136, 2866, -2255, -1552, 3296, -1442, -2945, 3582, -94, -3844, 2185, 1392, -3216, 964, 2325, -2924, -37, 2203, -2308, -229, 2020, -2589, -659, 3112, -2718, -1651, 3790, -1410, -3009, 3444, 699, -3534, 2344, 1670, -3226, 923, 2344, -2719, 86, 2287, -2009, 350, 2488, -2192, -524, 3268, -2197, -1520, 3935, -1229, -2611, 3678, 586, -3732, 2164, 1958, -3174, 676, 2013, -2500, 173, 1772, -2260, 264, 2550, -2642, -154, 3074, -2643, -1952, 4184, -1121, -3511, 3280, 596, -3610, 1911, 1628, -2981, 639, 1841, -2616, 438, 2249, -2120, -9, 2350, -2444, -239]
4156b39L887n493k84N797m481k136O577k523m395M902lm340L525J389m363K444
4172B64J772m272K690J829m632J544M219n543J52N678l927l255O194j781m075
4187c143M517J83m862L683J022m156L231J330m531K786K474n286J815M580n702
4202b059m23N882m043k478N875j677m305M798k33l572L148O28l841K770J576m518
4218b472K922K448n637J923M114m978n49N650l797k720N638j430m153M845l77
4233A427l891L686K47m146L670Q65m670L367K290n580J685M931n797p52N785l078
4249C9l409N711j358l919M308k64l681L473M60l831L315Q57m696L259K795n669
4265b610J280M901n054p44N411l446k793N211j009l740M365m89l595L750J13m245
$$ y = [-239, 3648, -1845, -2129, 3668, -813, -2949, 3628, 1105, -3290, 1612, 1609, -2731, 794, 2183, -2180, 264, 2036, -2236, 454, 2283, -2349, -805, 3414, -2129, -1977, 3701, -226, -3481, 2713, 932, -3143, 1374, 1557, -3305, 378, 1400, -2756, 475, 1805, -2726, 60, 2534, -2752, -937, 3643, -2059, -2482, 3400, -643, -3121, 2754, 1077, -3228, 1570, 1337, -2235, 913, 1541, -2300, 470, 2046, -2472, 450, 2898, -2739, -816, 3298, -1680, -2229, 3421, -376, -3096, 2542, 1112, -3041, 1804, 1427, -2464, 1222, 1469, -2677, 993, 1858, -2812, 555, 2845, -2735, -1050, 3881, -1916, -2668, 3117, 39, -3370, 2341, 983, -2936, 1372, 1108, -2573, 900, 1360, -2471, 844, 1701, -2995, 264, 3059, -2610, -1330, 3571, -1483, -2227, 3184, -262, -3055, 2156, 1147, -2593, 1772, 1283, -2312, 1438, 1551, -2694]
4281b694L957J483n780K843L613n725R97N091n230j131N773l043l205M867j317
4296D99l358M217j40l723L744k0m036L695J504n206K740L135n733J239M808m055
4312f90j669N317l162k393M623j444k984M392p86l712L721J82m368L788J487n248
4328b946K949L436n460O87M992m774j323N188k276l060M415j199l150M035n12
4343A002l462L704P5l893L238J626n063K538L358n066N30M477m213j360N201k783
4359i1k697M820j932k644L908o96l576L881N55m642L702J953n279K342L490n109
4375b015M89M512l827j652N096k450k384M442j707k888M229p82l604M196m3m615
4391c003L675J872n059K240L658n121K28M735m102j472N249k960k287M296j269
$$ y = [-2694, 1263, 2746, -3034, -191, 3422, -2303, -1306, 3785, -1445, -2576, 3197, 154, -3051, 1816, 499, -2859, 1358, 1218, -2505, 1239, 1219, -2817, 878, 2382, -2824, -84, 3051, -2682, -1443, 3365, -690, -2359, 2958, -204, -2597, 2026, 582, -2402, 1990, 1204, -2508, 1213, 1395, -2973, 815, 2302, -2946, 3, 3439, -2021, -1334, 3658, -1116, -2439, 2749, 473, -2587, 1828, 629, -2521, 1514, 1002, -2460, 1244, 1319, -2574, 664, 2290, -2773, -235, 3123, -1943, -1413, 3064, -1149, -2509, 2692, -91, -2788, 2032, 100, -2544, 1364, 668, -2908, 973, 1528, -3114, 588, 2541, -2738, -396, 3094, -2015, -1526, 2986, -841, -2493, 2603, 153, -2231, 2211, 504, -2384, 1845, 1063, -2541, 1655, 1612, -3003, 672, 2544, -2515, -275, 3383, -1738, -1510, 3225, -877, -2349, 2900, -60, -2347, 1949, 680]
4406F80l025M027p85l706L991O05m742L528K081n415K266L188m655K85M558l975
4422a094r72M472k851k033M463j671k697M191q73l798M115O85m941L601K159n201
4438b445K043L740n014J83M730m170j032M913k955k147M397j786k940M477j081
4453I13l495L647R27m629K981K122m782J643L651m916M09M418l763j253M380k742
4469d89j891M323j604l137M408m45m330M077O50m168K747K115m830K007L403m361
4485a525K9M227l453j120M277k727j811L745j151l122M176l85l894L962Q79m452
4501b345K375K484m594J812L093m434M62L834l309j051M185k810j970M388j552
4516E68l291M479n99l873L829P41m653K789K399m705J480L381m328O93L909l914
$$ y = [680, -2345, 1682, 897, -2809, 1182, 1787, -2955, 573, 2654, -2761, -495, 2693, -1962, -1677, 2881, -1094, -2066, 2406, -445, -2478, 1985, 314, -2383, 1808, 935, -2863, 1252, 1937, -3004, 597, 2756, -2445, -402, 3338, -1676, -1493, 3237, -933, -1965, 2948, -7, -2154, 2243, 457, -2483, 1994, 913, -2582, 1065, 1992, -2637, 344, 2466, -2316, -673, 2978, -1938, -1529, 2889, -874, -2127, 2253, -489, -2380, 1943, 339, -2798, 1610, 1165, -3165, 912, 1562, -2606, 141, 2256, -2574, -567, 2836, -1525, -1496, 2731, -722, -1842, 2435, -292, -2103, 1642, 491, -2631, 1545, 1160, -2734, 1228, 2107, -2345, 30, 2514, -2080, -268, 2825, -1609, -1147, 2687, -622, -1673, 2512, -298, -2268, 2120, 568, -2723, 1756, 1157, -2716, 1113, 1854, -2799, -10, 2389, -2316, -836, 2545, -1783, -1090, 2819, -1095]
4532a095p94M511l016j935M640j859l142M411n98l660L482J159m323K580J950
4547B311m030J185L032l964L60L557l271j046M128k105k381M507j486k988L719
4562A528k68l917L504J031m335K823J777m419J982K991m336K32L619l236j219
4577b243M744k756k218M281j353k930L985l22l588K995J022m402K794K144l973
4592a820J256L077m342O35L755l502j172M694k709k240M366j533l107M137j15
4607A380l860L193J130m038K411K099m358J723L178m276M78L746l636j077M592
4622B685k484k638M312j125l027L424K60l642L210R96m073K404J789m239J660
4637d88K843l994J43M161l567j217M521k334k359L944p91l311L546M9l467L347
$$ y = [-1095, -1889, 2622, -394, -2329, 2311, 452, -2690, 1721, 1123, -2537, 945, 2104, -2219, 361, 2311, -1719, -534, 2498, -1466, -1106, 2451, -820, -1866, 2262, 157, -2224, 2283, 797, -2191, 1528, 1260, -2657, 847, 1878, -2457, 366, 2143, -2276, -294, 2697, -1639, -1407, 2212, -1024, -2243, 2501, -255, -2473, 1808, 455, -2475, 1510, 1188, -2400, 595, 1617, -2785, 9, 2153, -1820, -564, 2513, -1829, -1194, 2561, -941, -2113, 2581, -128, -2368, 1998, 465, -2642, 1495, 1380, -2480, 713, 1843, -2195, 216, 2315, -2043, -320, 2858, -1418, -940, 2806, -830, -1907, 2685, 201, -2437, 1875, 750, -2277, 1147, 1407, -2235, 975, 1971, -2102, 302, 2091, -2148, -488, 2355, -1639, -1496, 2665, -902, -2119, 2402, 68, -2291, 1653, 862, -2449, 1097, 1146, -2321, 1026]
4653A026O29m137K503K201m465J804L117m060J72L612l193j123M178k327k296
4668b359L810p79k968L580j33l484L438M53l785K653J618m023J563K922l694k70
4684a458L813k744j351M028k372j956L579o92k762L107P3l646L222N08l797K910
4700D62J586m326J530L495m058j65L831l030j644M339j760k482L713j038k286
4715a833L300n79l046K965R59m222K906K083m621J206L633l978o94M610l042j466
4731a819M047j718k258L386j164k267K901j80l172L289N59m113K895J941m411
4746b084J152L733l784o97M108k842j289L631j786k077L208p47k525L083k45k748
4762a909K906O35l919K297K440m302J117L353l909m21L919k493j459L530j345
$$ y = [1026, 1655, -2482, 21, 2222, -2243, -439, 2678, -1382, -1210, 2402, -791, -1914, 2264, -63, -2359, 1451, 672, -2296, 1284, 1151, -2333, 1105, 1558, -2227, 426, 2044, -1979, -416, 2506, -1188, -1458, 2355, -389, -1740, 2288, -84, -2040, 1539, 847, -1915, 1192, 1265, -2381, 841, 1349, -2448, 462, 2048, -2278, -748, 2747, -1311, -1476, 2355, -675, -2319, 2020, 260, -2222, 1491, 453, -1833, 1467, 888, -2158, 807, 1766, -2456, 450, 2533, -2088, -882, 2751, -1227, -1921, 2689, -353, -1819, 2228, 510, -1748, 1638, 474, -1793, 1108, 928, -2244, 1045, 1604, -2509, 386, 2327, -2084, -932, 2801, -983, -1680, 2428, -414, -1703, 1928, 142, -1935, 1273, 526, -1999, 1084, 839, -1909, 997, 1632, -2287, 10, 2450, -1852, -735, 2618, -1291, -1712, 2207, -286, -1745, 1785, 440]
4777D40j903L017q55k369L186n46l417L417Q11m223K604K357m343J285L419l947
4793a067k76L269k204j430L652j648j885L279j411k068K925l17l218L441L33l537
4809b162J943K434m194Q58L311l167l95L070j872j404L244j660j915L277j034
4824C34k358L538o89l202L252P73m222K531K391l909N33L395l258n70L421k103
4840a43r92K669j330j730K980j159k352L569q19l089L388J081m316K149K624m075
4856a545P58L154l132n08L029k030j157K944j401j709K914j243k219L679m15l452
4872b333L376J022m319J914K738m251R53L030k983m83K690j805j033K805j420
4887i9j427L319j794j804L316q28k887L021J040l712J986K276l962P11L182k860
$$ y = [440, -1463, 1554, 699, -1670, 1516, 970, -2447, 970, 1781, -2442, 162, 2519, -1824, -539, 2880, -1067, -1343, 1926, -278, -1708, 1944, 296, -1589, 1690, 279, -1789, 1136, 819, -2399, 1042, 1375, -2162, -219, 2215, -1979, -1121, 2190, -977, -1372, 1698, -174, -1578, 1666, 6, -1909, 1368, 334, -2024, 1514, 825, -2377, 875, 1648, -2574, -43, 2348, -1561, -1028, 2367, -891, -1461, 1960, -143, -1135, 1534, 204, -1526, 1454, 295, -2057, 1512, 693, -2396, 992, 2073, -2243, -94, 2530, -1545, -787, 2367, -765, -1273, 1756, -274, -1431, 1513, 112, -1597, 1317, 74, -2145, 1534, 1119, -2333, 1043, 2065, -2254, -340, 2398, -1853, -900, 2130, -853, -1336, 1354, -451, -1484, 1321, -99, -1526, 1793, -1, -1805, 1511, 683, -2204, 817, 1857, -1855, 131, 2407, -1555, -844, 2338, -522]
4903e22p39L014k058r63K895j923j031K982j622k017L464o16l366K790J651l954
4919b015J574K533l519N14K688k785j59K813k005j185L167j754j587L498j467
4934C11k582L844o33l416K930J531l820J399K541l700P31K651k542j67K495k008
4950d35n91K788k101j307L670j734k479L829m30l529K953J405m071J184L171l402
4966a079N4K972k684k34K452j884p02K609k036j202L568j690k254L426k38l589
4982b511K673J584l512J094K320k741j4K763k205k97K386k337l60K979k235j459
4998a872L889j611k662L672Nl610K354J586l384R56K619l166O18K415k636J99
5014f28K434k471o99L306k064j928L746j096k725L144J32l364K438J676l511J201
$$ y = [-522, -1261, 1753, -305, -1268, 1627, -296, -1327, 1655, 33, -1984, 1480, 864, -2502, 288, 1939, -2015, -441, 2092, -1427, -913, 1775, -1010, -1169, 1644, -361, -1546, 1621, -133, -1720, 1778, 311, -2271, 1573, 940, -2476, 454, 1985, -1835, -436, 2105, -1595, -864, 1787, -755, -922, 1573, -435, -1026, 1762, -339, -1646, 2024, 290, -2189, 1640, 1210, -2319, 634, 2039, -2032, -848, 2323, -1079, -1025, 1947, -737, -971, 1481, -403, -1105, 1504, -532, -1734, 1834, 144, -2110, 1316, 1078, -2511, 162, 1746, -1766, -672, 1648, -1093, -1107, 1656, -549, -846, 1540, -797, -1157, 1822, -413, -1872, 2017, 406, -2256, 1416, 1421, -2189, 165, 1751, -1633, -677, 1942, -1224, -606, 1809, -827, -628, 1806, -665, -1364, 1942, -122, -2050, 1696, 600, -2125, 1019, 1151, -2213, 225, 1901, -1610, -409]
5030d09J852k313k10K610k287r3K291k484l44L072k085j611L879j484k588L139
5046I35L46l133K132J607l542J226J945k745R90J527k225J71K383k623j12L127
5062B009k242j429L463j106l005L448J47l431K386J525l269J259J756k670R63
5077a96J658k601N40K390k695p03L653k144j953L728o64l201K977N11k889J763
5093A74J241k816R62J764k462P59K075k736L88K370k651m1K722j615j858L422
5109A698n64l177K940M07l095K097R95k723J148J806k309N50J831k398jL015k801
5126e81o67L026j646k049L446p01k830K855M34k667J435R82k337J061J709k922
5142a452J007J780k287K79K520k685m35L004j753j848L085m20k705K758N04k907
$$ y = [-409, 1443, -870, -1080, 1530, -757, -850, 1441, -1043, -1387, 1685, -400, -2011, 1868, 384, -2204, 935, 1281, -1852, 280, 1887, -1655, -429, 1516, -1229, -239, 1288, -937, -766, 1617, -1006, -1118, 2009, -233, -1662, 1801, 695, -2310, 1138, 1285, -2146, 240, 1765, -1504, -245, 1511, -1159, -196, 1462, -1139, -599, 1791, -904, -1607, 2046, -98, -2051, 1677, 1013, -2188, 789, 1300, -1589, 174, 1415, -1401, -439, 1325, -1137, -378, 1697, -1039, -651, 1719, -932, -973, 1749, 134, -1724, 1698, 1134, -2043, 897, 1304, -1791, 306, 1301, -1422, -274, 1532, -777, -227, 1604, -794, -795, 2220, -581, -1248, 1778, 132, -1917, 1529, 828, -2002, 853, 1287, -1380, 55, 1037, -1300, -239, 1470, -1452, -445, 1335, -952, -673, 1847, -838, -1273, 1731, -22, -1870, 1215, 795, -1910, 848, 1352, -1555]
5158a555J848Q07k487J793P46k574J021K068k575j66K871k549o52L371j927k039
5174a999L238p10k450K789L48k739J709J144k584J141J303k428R44J969k668K66
5190g27K503k224j033L063j638j654K757n19k078K173O14k910J858R50k503J244
5206a24J635l057J342J854k709J33K899k188j193K851j413j871L085k60k784K364
5222E64M07k360J660R49k600J426J436k822J176K070k951N9K759k303q93L008
5238A585j256j761K527m33k319K338M09k558J878P47k703J814J087k586J046K090
5254A905k837r5K533j817j087L055j416j909K773o09j932K252j7k268J685Q51
5270A067k363J251J223k233N43K312k720m7K672j978j111K935j375j838K833l42
$$ y = [-1555, 293, 1100, -1387, 406, 1152, -1422, -401, 1667, -908, -1074, 1797, -752, -1404, 1967, 40, -1999, 1239, 529, -1921, 868, 1216, -1523, 186, 1330, -1254, -113, 1190, -1238, -294, 1675, -993, -727, 1776, -448, -1481, 1582, -56, -1710, 1047, 528, -1550, 623, 1237, -1673, 185, 1135, -1368, -124, 1511, -1546, -204, 1650, -1059, -926, 1973, -215, -1408, 1443, 30, -1841, 1244, 984, -1800, 564, 971, -1389, 271, 1220, -1380, 46, 1482, -1340, -164, 1906, -1045, -986, 1773, -530, -1423, 1585, 329, -1432, 1095, 662, -1657, 681, 1090, -1468, 410, 1157, -1546, 268, 1355, -1231, -185, 1905, -932, -1027, 1506, -311, -1398, 1657, 241, -1668, 1105, 496, -1436, 816, 799, -1469, 216, 1067, -1296, -45, 1178, -1055, -512, 1800, -920, -967, 1705, -273, -1384, 1551, 176, -1662, 1171, 829]
5286H29k505K492j26k307K131R31k964J440J512k663R22J830k530K25K288k179
5302f74q05K768j057j697K390m36j815J964K57k311J838O05k608J802J076k578
5318a281R09J869k687J83K560k062q78K748j268j523K959j350j918K616l9k586
5334a748K357Q43k638R37J850k802N64K210k477M15K171k019p68K645j461j526
5350a447K628q03j726K290m27j937J599P06k211J407J362k625N66J938k266l13
5366a259K617j922p34K586j356j345K424m22k028K038M56k810J975J195l086J752
5382H1J326k554P03J780k228L98J928j753p81K738j540j737K773l39k074J741
5398D62L80k306J929O11k621J784J008k424R23J757k415L25K291k044q69K660
$$ y = [829, -1676, 816, 690, -1617, 514, 1445, -1519, -79, 1433, -1230, -308, 1522, -1008, -783, 1505, -674, -1479, 1289, 232, -1465, 925, 489, -1326, 638, 895, -1416, 422, 1027, -1581, 221, 1297, -1281, -372, 1497, -1190, -1007, 1553, -509, -1387, 1361, 93, -1430, 1529, 179, -1739, 877, 838, -1748, 609, 1452, -1186, -249, 1601, -1201, -637, 1573, -904, -489, 1682, -337, -1105, 1540, 79, -1447, 1181, 378, -1348, 942, 515, -1422, 177, 883, -1328, 79, 1441, -1184, -618, 1320, -946, -1259, 1358, -564, -1298, 1288, -68, -1413, 1011, 589, -1439, 599, 1055, -1755, 220, 1415, -1671, 81, 1407, -1147, -444, 1336, -892, -494, 1434, -319, -1100, 1638, 98, -1639, 1134, 795, -1279, 462, 842, -1464, 465, 1076, -1545, 239, 1247, -1177, -254, 1503, -912, -587, 1704, -340, -1209, 1451]
5414A451j573j311K627q06j906K274L14k593J750P81k252J124J235k321O51K041
5430A486k073p02K630k083m48K651j579j633K635o34j920K339L65k417J882N91
5446A090k412J060J473k232Q78J778k133j45K436k301j87K556j808j696K778k25
5462I10k359K344j29k270J710J053k702J635J144k283N89J939k584K45K436k130
5478d52q50K892j504j569K333m98j945K356J75k273J692P19k580J261J167k020
5494a096P77J523k051L08K172k101o83K564j332j505K704j027j768K382J51j857
5510h39J159R40k145P95J386k485Q21J957k253j07K378k224l83K641j551j871
5526a781L059p40k108K088P40k777J577J108k624J536J086k450Q19J738k170k46
$$ y = [1451, -122, -1433, 1194, 388, -1518, 756, 1070, -1523, 227, 1008, -1244, -120, 1115, -1206, -555, 1486, -587, -1289, 1341, -742, -1190, 1461, -118, -1751, 884, 250, -1670, 669, 1034, -1383, 499, 1090, -1322, -262, 1211, -1021, -143, 1635, -498, -643, 1793, -508, -695, 1861, 53, -1643, 1135, 910, -1449, 895, 766, -1504, 206, 1259, -1443, 192, 1336, -947, -358, 1581, -1003, -758, 1678, -452, -1302, 1590, 86, -1483, 850, 352, -1593, 763, 938, -1335, 357, 1076, -1504, -243, 924, -1096, -319, 1204, -847, -539, 1633, -468, -1151, 1413, 81, -1424, 1280, 253, -1515, 867, 1018, -839, 320, 1260, -885, -90, 1296, -1189, -368, 1589, -664, -771, 1607, -617, -1000, 1641, 90, -1781, 1278, 538, -1570, 518, 1258, -1519, 58, 1166, -1458, 78, 1164, -1286, -467, 1271, -899, -1145]
5542a145K524k058o15K716j413j352K308l32k203K009J80j687J171P29j813R88
5558GJ233k499J261J607k627M26K155k075p99K819j358j216J976m88j781J884
5574E25R8k063J832M83k190J777R76k623J010J667k559K28K584k155j052K888
5590A426j373j739K483m70j507J690K3j848J597O07k276J395J229k132P97J522
5606A424k494o1K522j909r14K905j275j684K375l81j787J962M32k374J560L42
5622F43j803J579R08k558R81K097k885L48K350j768j187K905j402j773K328j80
5638E83j714J717k02j387J317L34j916J374J391l152J242K189k735R0K474k032
5654d27p45K495r61j823K184n47j534K088j65j691J621K30k173J654J379l157
$$ y = [-1145, 1379, -679, -1294, 1422, 9, -1343, 965, 633, -1570, 439, 619, -1068, 103, 832, -981, 7, 1240, -1259, 2, 1609, -1018, -592, 1563, -512, -1311, 1508, 150, -1066, 910, 422, -1359, 525, 623, -1440, 392, 875, -1315, 462, 1438, -1185, -175, 1492, -1067, -839, 1745, -410, -1462, 1426, 53, -1686, 797, 327, -1180, 510, 533, -1315, 282, 889, -1387, 8, 1237, -895, -98, 1424, -1070, -1131, 1391, -518, -1432, 1473, 198, -1486, 889, 508, -1279, 683, 1115, -1259, 301, 643, -1160, 419, 1327, -1231, -250, 1847, -1038, -690, 1660, -108, -1295, 1610, 208, -1565, 763, 583, -1131, 586, 384, -1003, 314, 648, -1268, 106, 1497, -1655, -413, 1776, -959, -869, 1605, -427, -1172, 1323, 362, -1461, 723, 176, -1358, 730, 565, -1126, 495, 725, -1448, 206, 1585, -1572]
5670a572J303J935k758J93K465j459j265K200q96j727K617k48j751J643q7j749
5686a156J914L3k096J537J095k669Q49J950k177n3K138j704r01K477q66j640K107
5703H38l70j754J686L8j666J887J87k268J326J576k689R10J932k787J76K193j529
5720c14q01K431j461j142J990k15j503K023m05j690J813K02k385J767J530l082
5736a242P26K115k140l83K313j534j187K139r22r27K002p06j286J905k21j902
5752a250J913K01k338J693J481k973P40K376k612k81K259j073j284K267q78j436
5768a195J736j41j708K269m32k011K138N67k418J212J367k362L94K173j700j003
5784a114K599j468q61J900p47j351J940o67j279K119l34k096K175K30k642J468
$$ y = [-1572, -269, 1666, -1092, -899, 1566, 107, -1158, 1042, 146, -1581, 1036, 788, -963, 680, 593, -1156, 758, 791, -1305, 232, 1327, -1342, -493, 1457, -720, -773, 1365, -339, -1240, 1237, 371, -1269, 838, 468, -1286, 400, 438, -1228, 659, 846, -1422, -96, 1480, -1209, -299, 1633, -1154, -978, 1215, -314, -1115, 1316, -145, -1287, 703, 488, -1015, 1008, 603, -1087, 726, 928, -1457, 310, 1840, -1242, -516, 1599, -541, -924, 1389, -145, -1332, 807, -115, -1042, 960, 254, -1032, 873, 652, -1250, 663, 864, -1474, 219, 1700, -1273, -533, 1843, -769, -1050, 1209, 136, -1148, 1119, 241, -1195, 541, 400, -1308, 961, 529, -1482, 656, 1223, -1195, 17, 1384, -978, -584, 1589, -111, -1114, 1485, 17, -844, 1056, 309, -1042, 898, 231, -1048, 1071, 737, -1359, 816, 1046, -1596, -128]
5800a28J688k672O67K085k025n62K188j204j200J835p62q04J854q37j365K149
5816I07l52k123J828Q28k586J511J558k677M27K314k125m84K323j453p78K018
5832A136j218j033K122q59r03J690k65k184K050P88k762J065J934k755Q89J848
5848A543k110k61K012j254q10J919j176q88K033o76j726K558l06k349K066O96
5864A271k622J334J482k308KK092j743m90K098r84j148K198j153r14J848q34j670
5881a541K386ok641K093Q72k662J228J649k358M11J919j776m14J717r88o00J729
5898A018j059p10K192j148j549J831L16k206J485J118k646J203J577k404M92K259
5914A769k150j27J854j640p15J966q81j091K393j189j794K816l53k129J763Q56
$$ y = [-128, 1560, -1112, -445, 1640, -385, -947, 1241, 37, -1163, 672, -90, -894, 960, 123, -1242, 907, 555, -1568, 260, 1088, -1498, 13, 1571, -1106, -679, 1635, -490, -974, 1349, -104, -882, 1136, -82, -1115, 1007, 148, -755, 935, 670, -1514, 536, 1324, -1438, -373, 1561, -1194, -305, 1543, -567, -828, 1184, -70, -880, 1039, -137, -1025, 1008, 332, -1394, 1164, 858, -1491, 575, 1271, -1351, -17, 1465, -843, -841, 1251, -492, -982, 1116, 132, -1016, 1182, 29, -885, 963, 129, -1541, 845, 839, -1802, 291, 1163, -1499, -271, 1378, -980, -569, 1350, -426, -840, 877, -111, -711, 1018, -41, -751, 1441, 293, -1256, 575, 891, -1315, 170, 1288, -1358, -155, 1422, -982, -490, 1769, -381, -508, 1346, -294, -1009, 957, 76, -1015, 1378, 189, -1605, 1211, 858, -1271, 492, 1348]
5930A348k424O10J715k512Q83J524j902n3K046j224r96J996j305q91K286p73j520
5947a192J825K56k558J903J137k484Q43J535j843o5J877j686k52K026j662n33
5963h73J983j195j047K157o12j990K315N40k666J604J090k649J185J463k105M55
5979c45J435j767L2J680j331n37J739j094j065J871%j874K030J14k377J677J106
5996A294k776J232J630k320L25J805j724j34J923j799l90K127j155j326K439p66
6012C85j854K205J49k227J439J180k257P27J733k310L50J697j687k66K140j651
6028b47l57J875j134j264K227n04j789J668M03k483K053O67k450Q37J709k126
6044i15N69J654j976N0J538j493q01K459j194j387K227k69j884J742K30j762J302
$$ y = [1348, -1076, -466, 1249, -1263, -380, 1144, -758, -811, 1235, 11, -985, 1011, -294, -1185, 1101, 328, -1192, 633, 889, -1669, 234, 1371, -1113, -270, 1265, -578, -643, 1234, -452, -704, 1322, -340, -873, 1110, -85, -1132, 1025, 413, -1577, 738, 1278, -1388, 216, 1306, -1343, -158, 1305, -800, -345, 1090, -677, -645, 1035, -296, -833, 906, -188, -1253, 618, 618, -1256, 774, 888, -1489, 188, 1294, -1482, -250, 1380, -940, -615, 1190, -534, -668, 1255, -544, -934, 1193, 38, -1288, 1151, 385, -1469, 736, 885, -1342, 97, 1277, -980, -253, 1480, -830, -480, 1217, -470, -736, 1404, -247, -604, 1271, 137, -1127, 1100, 596, -1193, 475, 878, -1605, 448, 1115, -1335, -498, 1211, -915, -346, 1308, -668, -618, 920, -573, -1374, 1085, -109, -1496, 731, 462, -1422, 320, 550, -1212, 90]
6061I0Q93k032R19J457k280K66J956k043J66J787j850j61K113j155j265J838p6
6078F23k089J847P12k349J221J238k148O87J542k105L84J613j972n2J777j464
6094e35p50K502j151j535K341m97j720K008j5k174J522J137k075O65J564k417
6110a130N84J667j531k16J895j459q67K337j230j401K209p66j207J931J9j853
6126a018J417Q33k122O96J468j993N40J433j912k53K181j347r75K158r42j355
6142a191K043N0k011J635J68j927J341P69j996J169R70j977L17K081k357j65K510
6159A429j545j074K352j104j391J972k08j834J697K78j973J448P39k020J094J180
6175A040j898L02J946j680o15J880j218n10J971q16j539K153n91j607J780L6j353
$$ y = [90, 983, -1049, -130, 1327, -953, -687, 1269, -774, -608, 1179, -671, -832, 1281, 126, -1139, 699, 623, -1466, 381, 1093, -1256, -35, 1203, -945, -258, 1284, -821, -437, 1176, -796, -848, 929, -535, -1285, 1217, 66, -1469, 872, 375, -1345, 663, 648, -1526, -4, 1133, -942, -277, 1287, -1130, -546, 1121, -410, -626, 1269, -190, -1057, 1280, 50, -1351, 858, 92, -1115, 816, 835, -1018, 399, 1232, -890, -194, 1274, -719, -179, 1254, -658, -911, 1270, -77, -1052, 1106, 164, -1191, 852, 902, -1109, 526, 694, -1233, 108, 877, -1119, 50, 1020, -957, -640, 1441, -916, -1081, 1429, -116, -1190, 1162, 58, -1333, 639, 431, -1403, 294, 572, -1401, 47, 786, -1234, -140, 1040, -858, -556, 1390, -290, -905, 975, -243, -753, 1218, 402, -1137, 1016, 425, -1182, 598, 634, -719]
6192g19Q50O04j451M66J263j822P75J436j875k73J686j011r66J955o58j151J815
6209I24q56j373J651N65j966J214J093k364J202Q99j940M25J490j545k91K006
6225A134j421p19J782n24j640J985j87j648K009j48j834J409J269k183M40J472
6241A196j708nK113k106k69J967j383q41K398j012j253J926n88j679K015L2j998
6258a195J573Q86k242O68J348j700n5J804j704l8J672j204p60K128j163j102J868
6275G84j70j604J520L81k119J461N76k070Q05J639k091M10J898j690o70K023j156
6292g3q91K075p53j293K000o15j501J617L29k150J511Q82j948N38J304j398NJ595
6310A234j829K60J432j445j62J647p59j801K198m57j550J800K05k056J366J055
$$ y = [-719, 131, 735, -716, -250, 1013, -809, -34, 1402, -473, -746, 940, -71, -1037, 918, 260, -891, 924, 68, -1305, 346, 911, -1055, 159, 1252, -1112, 90, 989, -951, -526, 964, -581, -872, 1134, -287, -1006, 776, 252, -1388, 597, 410, -1238, 771, 623, -1211, 198, 1467, -716, -276, 1196, -512, -517, 1596, -510, -779, 1188, -195, -1036, 1362, 350, -903, 1023, 435, -1244, 771, 803, -1195, 378, 1264, -978, -310, 1038, -662, -717, 1087, -617, -655, 1017, -187, -947, 1181, 18, -1084, 784, 614, -990, 530, 911, -1208, 253, 829, -1241, -436, 1203, -888, -478, 1420, -270, -940, 1083, -73, -964, 1111, 358, -935, 1065, 450, -1051, 566, 895, -1255, 256, 1138, -810, -272, 1032, -366, -361, 1234, -595, -335, 1097, -348, -510, 1137, 378, -1423, 775, 318, -1232, 568, 773, -1283, 83, 1138]
6326A138k018P17J414k151K02J686j224k96J579j566k44J934j322q31J986m62
6342E42j815J690L69k086J517Q55j972N40J436j533j32J443j113j86J884j293
6358A46j076J968j000j428K474m88j855J640M01k089R49J443k030N89J464j839
6374g31j59J967j534J5J564j206q65K173j099j390K210k34k039J639M75j932J322
6391A76R44j751J51J289j496J34J491j645K81J473j458m60K000j044j455K225
6407H55J30k182J515P28j856P24J266k074O59J614j966Q4J382j249J07J461j430
6424b32q07K411j278j333K229l56j973J519P43j922Q58R85j586L66J533j751J27
6441d67J629j818k2J663j562l46K079j076j356K020r5j849J349O19j893J279Q58
$$ y = [1138, -880, -163, 1251, -900, -698, 988, -236, -532, 1047, -519, -763, 1171, -151, -982, 1004, 542, -1273, 417, 786, -1300, 217, 1072, -900, -360, 1076, -457, -589, 854, -259, -445, 1439, 146, -930, 1038, 38, -1390, 1084, 596, -1259, 381, 782, -1307, -358, 1085, -945, -356, 1108, -731, -890, 1077, -457, -442, 1122, -84, -949, 1224, 125, -1265, 945, 711, -1328, 311, 786, -1146, 176, 1120, -631, -480, 809, -687, -553, 938, -707, -426, 1047, -411, -871, 1129, 85, -1370, 855, 985, -1197, 318, 1046, -810, -86, 1180, -894, -235, 1379, -587, -503, 879, -370, -263, 1198, -232, -1039, 1372, 94, -1239, 990, 634, -1339, 180, 923, -999, -141, 844, -742, -376, 1157, -594, -467, 1162, -656, -678, 985, -577, -923, 1156, 80, -1276, 744, 649, -1200, 149, 768, -1125, 154, 1012]
6458A012j698O63J008j654K52J488j479m58K011j226q48K101j067j598K239J49
6474H95k077J396N28j772P92J341j834O59J105j373K88J167j661l13J935j222
6490a46r93K366r74j851K095Rj649J373O49j760O06R28j197M58Q76j748P74J119
6508I35j436k25J872j177j106K185o69j506J836j47j829J686O07j732P14P79j689
6525i02Q78R91j436L81J543j902k94J888j163j098J967m09j780J714K01j685J231
6542A25Q10j886R81P87j773P06J339j559L7J436j563r8J576j274o14J981p35j527
6560a251J884J11j772J284K85j568Q32J178j737Q10J272k201O74J374j779k43
6576h47K279j346j331K333q58j107J318K07j411J029N17j623J114N59j742Q89
$$ y = [1012, -686, -23, 985, -669, -417, 1071, -408, -866, 1145, -81, -929, 1172, 105, -1493, 746, 895, -1182, 214, 742, -1030, -238, 1103, -731, -72, 1033, -340, -52, 1115, -546, -859, 1076, -146, -1139, 1227, 253, -1598, 497, 506, -1143, 230, 879, -881, -275, 653, -544, -86, 790, -958, -184, 935, -501, -726, 1146, -31, -1137, 1048, 379, -1127, 709, 562, -1267, 419, 1026, -706, 8, 787, -902, -24, 967, -469, -88, 1455, -447, -741, 1147, -16, -1114, 853, 444, -1336, 378, 579, -1106, 125, 935, -951, 30, 817, -956, -250, 1089, -470, -433, 1003, -560, -658, 918, -356, -970, 1011, 276, -1251, 633, 744, -1028, 256, 541, -1027, -195, 983, -754, 56, 1328, -873, -199, 1175, -604, -847, 1432, 86, -1245, 1088, 230, -877, 441, 648, -763, 266, 783, -840, 274, 833, -909, -20]
6592b0J026j842M24J571j665jJ467j031j159J926n43j318J192N93j272R42L39
6609F29j528J007N07j569Q08J173j862O25J605k101l81K364j460j157K377l56
6625F81j923J770J75j750J399N78j770Q62R82j757Q70J138j933M48J682j832l19
6642f99J948j019j428J975l26j465J396K31j673J212O89j759J177M45j522N72
6658b46J195j753J46J881j696l55J993r83j387K206q65j045J341L33j698R49N76
6675E92j402Q90N16j607R25J118j562l57J850j331m36J893j289o96J617j08j625
6692a012J077N86j575J521O4j374R36Q20j443J64J050j459n5J766j299o87K136
6709A216j257r12J445m86q86J213K92j540J201L76j779J056R20j761O53J758k350
$$ y = [-20, 1006, -836, -412, 1159, -506, -507, 960, -71, -1230, 696, 153, -1165, 27, 620, -652, 290, 629, -899, 108, 615, -954, -146, 1027, -835, -210, 1395, -706, -1087, 1277, -183, -1340, 1037, 681, -1242, 528, 703, -1047, 352, 930, -840, 22, 1004, -753, 117, 1255, -678, -230, 1452, -380, -699, 1249, 230, -1198, 777, 451, -1014, 382, 613, -1060, 152, 841, -918, 259, 704, -818, -246, 949, -804, -658, 1223, -473, -828, 1165, 182, -1205, 1001, 136, -909, 432, 765, -933, 16, 592, -810, 80, 596, -1011, -86, 1032, -530, -887, 963, -368, -804, 1089, -200, -896, 721, 613, -1012, 65, 651, -924, 597, 661, -713, 223, 1043, -400, -236, 814, -645, -700, 1066, -233, -920, 1216, -41, -953, 492, 6, -880, 333, 625, -915, 286, 662, -1117, -61, 859, -902, -249, 1509, -841]
6726h41K81J740j537n15J749o12j292J740k73j124J188J4j256J442lj667R59R13
6744I06j720Q74Q58j661J03J835j576o01J845q38j104J619L70j541J365l16j636
6761a218J286N03j525J076J022k362R38J249j809L9J756j261p42J949l74j539
6777a012J697o91r09J423l40r97J243K68j551J046P64j903P44J333j520j94J615
6794A016j322n86J824q70j010J514l42r61J331j45j360J414L23j791Q05J260j873
6811g73M74J278j418k38J851j358p60J655m45j343J669l18j164J253r8j290J410
6828C85M44j898R73J145j946L56J523j591l78J803q87q86J917j188p67J452M4
6845E01j668K023n00j293J467J32j634J187O11j584N27J297j635l17K081j393
$$ y = [-841, -560, 1180, -357, -872, 877, 265, -1027, 713, 440, -684, 504, 518, -738, 704, 701, -966, -7, 906, -814, 60, 918, -743, -640, 1195, -381, -982, 863, 25, -1079, 540, 910, -631, 734, 418, -1218, 68, 571, -954, 122, 1144, -1218, -280, 969, -840, -801, 955, -306, -1048, 901, 527, -1012, 685, -6, -915, 508, 168, -829, 414, 682, -869, 177, 941, -962, -218, 1115, -405, -599, 1016, -306, -892, 932, 62, -948, 566, 224, -737, 594, 449, -911, 503, 826, -965, -160, 1100, -773, -299, 979, -439, -677, 1174, -184, -944, 711, 266, -1077, 592, 274, -890, 363, 265, -1025, 385, 829, -1069, -96, 1049, -897, -541, 982, -609, -987, 816, -71, -957, 960, -228, -995, 457, 501, -1167, 856, 356, -937, 530, 662, -972, 215, 826, -758, -231, 1066, -569, -886, 1195, -198]
6861a98n76J504o16q96J302m91j053J711o6j457J275L32j588P40J054j657K99
6878c81J534j455M6J251j333n25J497m24j298J769m49j046J168J53j208J061N38
6895H98j654Q20Q80j597K14J506j487j98J589j267n03J837r24r44J562k67j198
6912g33J155J56j682J398N66j634P56J201j832J79J478j493J25J328j081o47J389
6929F29o49j223J828m49j184J467k9j034P01R02j910Q79J065j752L79J362j536
6946e54PJ436j104p61J812p81j032J764o27r73J086J49j433J044P73j800P51Q41
6964E98j268L58J059j246l7J443j165o10J858j132r01J948p54r19J445P9j746
6981i90J427J42j369P24J144j593K74R80j256O7J198r43o67J752r13j004J366
$$ y = [-198, -774, 730, 114, -782, 520, 29, -1024, 687, 621, -836, 439, 771, -817, -77, 977, -680, -381, 1153, -302, -256, 995, -338, -863, 634, 210, -1088, 681, 232, -814, 354, 507, -701, 360, 898, -756, 64, 944, -653, -439, 1067, -420, -618, 971, -296, -799, 1038, 114, -830, 732, 465, -733, 422, 578, -1104, 294, 860, -774, -18, 1183, -649, -470, 1008, -485, -360, 968, -113, -760, 629, -20, -1243, 585, 136, -1048, 419, 390, -644, 57, 959, -951, -72, 993, -759, -380, 982, -554, -547, 889, -215, -976, 836, 55, -977, 787, 160, -813, 273, 422, -1011, 33, 806, -994, -243, 598, -670, -312, 747, -499, -536, 907, -258, -868, 990, -142, -1043, 905, 151, -768, 677, 756, -990, 437, 579, -790, -66, 1078, -515, -241, 739, -517, -450, 748, -195, -862, 890, -23, -1027, 339]
6998C39L38j784J574J96j592J067N79j568P19J234j962M24J656j592k48J523j160
7015b57o40J659q59r59J594j54j575J646M18j633J110L27j400P71R99j705M17
7032b41J436j601k13J564j338J47J583j013j264J598l01j376J310K89j721J036
7048a05R33j843J076J105j708K98J134j504J44J438j192n94J815r34j330K213
7064I46o81j312J505J01j703J059Q08j458J019O47j749O47J132j462j00J654j434
7081c81m08J444p34p35J420j02j389J288J11j299R07N69j760J194J052k058L27
7098e54J518j505Q5J593j399o07J897r29q58J546n01j216J665m07j321Q23R21
7115G51j570P83P75j596L13J353j316j79J619r50r13J833n98r94J190J22j457
$$ y = [339, 677, -1107, 467, 663, -929, 138, 717, -851, -132, 1102, -860, -436, 1220, -372, -620, 903, -257, -897, 762, -97, -1056, 538, 384, -1191, 455, 873, -760, 350, 677, -723, 48, 1047, -658, -241, 1195, -406, -619, 945, -393, -246, 1337, 324, -940, 658, 357, -1019, 291, 580, -1141, -105, 828, -1015, 61, 1166, -542, -244, 890, -614, -470, 968, -224, -818, 997, 63, -1267, 946, 265, -1047, 458, 559, -1144, -85, 723, -735, 284, 931, -818, -171, 961, -501, -601, 1053, -381, -789, 655, -79, -814, 606, 504, -885, 403, 514, -785, 122, 691, -1069, 125, 1177, -881, -554, 964, -541, -456, 1137, -262, -869, 1028, 99, -759, 787, 286, -930, 735, 328, -993, -170, 751, -819, -36, 739, -857, -544, 809, -507, -686, 933, -17, -930, 903, 305, -689, 501, 623, -834]
7132h34J543k42j156J134M22j492L96J250j436K44J443j910M9J859j386r09J956
7149I31q92p53J490l49j270J404p6j433J240O23j903O48J458j835L40J501j745
7166f21j69J741r20p79J509p09o04J319n72r75J333l2j629J526M61j842R95R28
7184I60j829M68J242j269j22J524j225o17J619o52j019J470m08r43R79L18j390
7201h94J089O31j905J190J039j935M29J571j772j35J457q28p38J521n65p98J239
7218E96m78q00J228k9j408J056P18j985R36J084j460K93J344j313m13J554j023
7235a00m44J361p50p95J746o91j343J747k77j755J704Q30k297R41J189j813M26
7252c21J141j084j50J063r28n46J736q58p98J689o94j147J415j99j368J504J92
$$ y = [-834, 709, 467, -689, 445, 867, -625, -229, 1021, -415, -171, 1272, -638, -589, 1270, -116, -1025, 931, 39, -714, 776, 427, -843, 561, 485, -948, 292, 915, -988, -340, 1118, -717, -377, 1124, -621, -790, 951, 31, -748, 761, 52, -552, 767, 195, -780, 553, 521, -1108, 418, 879, -963, 32, 960, -869, -401, 841, -428, -550, 974, -251, -868, 751, 99, -920, 550, 142, -801, 178, 496, -894, 195, 826, -1079, 111, 1150, -785, -356, 1215, -557, -692, 765, -63, -801, 720, 155, -643, 596, 118, -682, 546, 517, -891, 165, 883, -1102, -166, 918, -542, -249, 1095, -218, -631, 923, -100, -544, 817, 67, -728, 1018, 327, -1016, 731, 454, -1301, 403, 1233, -1064, -123, 1066, -747, -321, 820, -264, -414, 649, -279, -825, 911, 53, -745, 944, 250, -897, 518, 319, -1049, 455, 647]
7269F47j785J404R69j700k74J534j303J7J190p79r06J510j43j297J624n03j089
7286h84J541J54j775J501K23j647O46J355j823L46J186j066m61J591j120q11J876
7303H32p04q08J622n61j380J502r1j726J746M66j779J025R28j981P32R93r49l18
7321d51J291j169n40J592r69o23J506n88j146J533K29j930J401Q92k140P33J304
7338I25j415j83J584j472k38J535j121o3J230r19o84J600p25j008J722j27j478
7355h37J168O50j881P15J273j637p7J289q30k70R54q14m19J648j138o39J804p33
7373B26j631J954qj463J035O70j580J84J838j723l12J677j368J73J323j250k07
7390d62J307r70r13J825n78j122J512K65j929O41J536k097P33J153j460P5J248
$$ y = [647, -1138, 266, 1235, -465, -739, 795, -508, -491, 699, -80, -986, 524, 381, -916, 708, 205, -884, 657, 811, -964, 537, 760, -887, -241, 1114, -709, -363, 823, -243, -704, 887, -233, -1044, 832, 128, -680, 942, 381, -999, 503, 412, -1314, 432, 898, -881, 144, 1072, -909, -177, 816, -133, -451, 840, -329, -869, 723, -246, -869, 637, 49, -1097, 436, 665, -1265, 136, 1028, -1112, -379, 925, -490, -673, 911, -561, -799, 736, -385, -448, 782, -137, -821, 779, 54, -954, 768, 641, -837, 331, 981, -900, -185, 1088, -549, -626, 663, -167, -437, 517, -297, -716, 932, -206, -845, 959, 226, -1405, 549, 541, -922, 113, 783, -797, -613, 1225, -498, -810, 867, -501, -328, 995, -255, -462, 845, -125, -1038, 787, 209, -913, 599, 864, -1065, -424, 1112, -985, -252, 901, -559, -484, 764]
7407G64j116k74J600j183n77J576p67r48J665n08j414J819R4j483P93O56j495
7424g98L76J178j401O4J420j354j4J336r29m19J564j184o70J467j90j694K003
7441G55m0j730J108O63j746Q45Q07j363N21R30q66k50J250j318m63J732p64j149
7459a078J736j23j725J652L06j849J140Q05j579M49O30q64J72J185j239k38J709
7476A089j373n53J727q39o28J251l18j262J420K76j645N59J197j509K23J615j595
7493c65L66O37j247M19J151j138q43J990n59j522J631m19j126J251N51j672R27
7510C2R26j759M34J072j288K61J126j269m5J624j546j96J578o55j590K043j61
7527E87j455J103J27j313R65O77j443O80R14j545L44J246j584L00J497j380q04
$$ y = [764, -352, -626, 974, -209, -786, 790, 23, -925, 740, 232, -1182, 637, 731, -752, 41, 697, -798, -422, 756, -645, -581, 839, -515, -529, 807, -122, -541, 1023, -161, -831, 636, 446, -1248, 755, 715, -1015, 93, 756, -990, -145, 662, -701, -180, 750, -116, -366, 884, -434, -897, 835, 71, -1078, 658, 535, -1190, 462, 768, -1081, 59, 864, -715, -266, 364, -500, -328, 857, -382, -620, 1089, -284, -837, 890, 51, -577, 674, 356, -906, 514, 790, -855, -296, 901, -608, -385, 1230, -365, 1, 638, -609, -190, 961, -177, -1020, 970, 411, -1111, 520, 101, -1025, 226, 777, -895, 32, 958, -801, -367, 705, -583, -322, 804, -465, -510, 1114, -432, -628, 950, 295, -1295, 748, 587, -868, 235, 362, -951, 14, 691, -752, -72, 842, -703, -359, 887, -697, -397, 1100, -280, -1084]
7544a084K173j165r73J652K7j709J336K94j503J350M60j547L22J237j282j79J574
7561I83j312l38J506j555j27J662o04j291J822n22r99Q87L61j344J009P49j541
7578f54L97J092j612L19J501j602J75J244r29p03J925q65j631K024j34j784J598
7595C61L95j563Q03Q64j457M24J060j624N56J179j695J97J579r39j319J881o08
7612I4j207J765j38j577J309K80j213Q39O16j367N83O94j463M67J043j135j18
7629e28J375j025n05J466n97j255J874l71j056P74O14j288O54O60j355O36Q13
7646H86j564L69J389j546J5J532j300o75J335l07r78J384j47j418J390J56j239
7663g18Q20M36j419P30J036j452K08R34j074p0J299r54o40J712r54q25J273l9
$$ y = [-1084, 1089, -76, -1049, 603, 630, -1079, 257, 551, -952, 398, 858, -689, -367, 870, -412, -591, 983, -329, -667, 839, -716, -843, 819, 215, -1076, 746, 224, -775, 112, 473, -871, 138, 887, -654, -257, 835, -777, -458, 1043, -559, -384, 860, -69, -772, 1153, 288, -1343, 681, 547, -1237, 361, 756, -807, -4, 860, -597, -173, 887, -737, -181, 998, -697, -500, 1079, 140, -1179, 702, 94, -1113, 652, 514, -1063, 246, 526, -687, 152, 768, -599, -16, 678, -785, -318, 725, -410, -528, 847, -178, -683, 783, 186, -1069, 805, 434, -622, 152, 766, -522, 132, 792, -563, 73, 886, -678, -309, 1080, -466, -451, 1081, -219, -894, 441, 134, -844, 540, 393, -1025, 365, 521, -718, 102, 538, -881, -151, 885, -567, -359, 575, -499, -569, 730, -224, -864, 848, -106, -931, 342, 303]
7681C03j146R05Q21j596O53O76r83L00J396j757J17J097j149k7J341j070o23J268
7699E26n62q51R93L13j272J287N9j299Q67P89j606O82J148j698L28J332j500k02
7717f66J630j044q77J800q17r50J438j55j185J315l8j174O00R28j387M63J099
7734I80j726J06J509j163k93J720j443o09J546o06p62R09K53j392J355L3j337
7751i20J097O05j508L65J530j757P4J494j129l61J594r35o79J188j67j495J617
7768F13j14j316J382K23j419O38N15j183O95P35j172pJ441j305n10J561o92j088
7786a003J735n95j044J337K3j463J020Q86k100J270R71j801P73R34j656J16J529
7803I32j100m64J285p49m19J126n23r77J063J47j287J152P14j757Q26P94j509
$$ y = [303, -843, 62, 883, -713, -60, 616, -367, -67, 1329, -428, -311, 786, -363, -390, 951, -119, -742, 526, -36, -887, 106, 419, -853, 434, 493, -806, 61, 850, -756, -74, 1074, -624, -296, 1036, -464, -666, 964, -80, -957, 843, 26, -924, 514, 359, -826, 489, 451, -723, -123, 805, -582, -119, 980, -746, -640, 869, -294, -587, 1133, -310, -919, 627, 21, -741, 168, 421, -971, 384, 417, -920, 177, 782, -726, -361, 1169, -588, -514, 980, -149, -510, 1084, 149, -530, 658, 491, -1004, 613, 499, -817, 565, 788, -631, 7, 522, -661, 34, 769, -403, -410, 1031, -274, -784, 777, 85, -1003, 732, 137, -907, 430, 453, -1010, 10, 896, -1204, 66, 1037, -764, 9, 943, -713, -597, 932, -168, -632, 653, -96, -515, 611, 88, -889, 174, 321, -966, 186, 900, -857, -31, 763, -746]
7820g46J025L66r67R3J354j326k62J545r99r60J368j86j225J442K0j404J163L73
7838F74j605R74O39j202pJ454j262k11J440j264j99J409r32j058J965n60j456
7855a201J434K81j163Q72M38j083N51O74j517P11P79j259Q1J394j275j00J053
7872F70o92p55J439m11j110J444mj243R41K16j103O51N61j408L66J277j214k25
7890f00J335q96p57J914j129n37J362p15j019J429N6j141J010K88j330Q87Q06
7907I63j509O03P14j341J27J486j306m39J599j120o12J632q25n46J170k06j155
7924g65P97P65j724J052N84j253K43Q37j138K05J105j357K7J599j249l08J384
7941H04n69j105J240mj280J277J13j420P65Q38j370M25R60j195K36J132j028k72
$$ y = [-746, 279, 645, -322, -229, 1125, -201, -463, 1082, 83, -877, 491, 305, -920, 522, 542, -862, 301, 674, -931, 43, 682, -520, -527, 927, -335, -546, 894, -370, -569, 840, -92, -1150, 815, 255, -1201, 233, 514, -649, 223, 661, -422, 129, 803, -714, -3, 776, -483, -402, 992, -283, -383, 670, -22, -777, 662, 251, -859, 585, 581, -662, 279, 495, -608, 43, 604, -804, -438, 839, -375, -600, 735, -161, -918, 996, -133, -670, 692, -23, -1042, 387, 443, -698, 312, 600, -730, 157, 963, -546, 57, 771, -570, -443, 1043, -263, -702, 897, -223, -835, 797, -28, -574, 596, 390, -765, 32, 797, -927, 125, 709, -544, -301, 536, -602, -397, 708, -649, -622, 977, -272, -580, 804, 235, -870, 370, 366, -914, 363, 476, -944, -179, 659, -711, -286, 674, -521, -285, 847, -181, -453]
7959d53J156p96p29J405k40j614J850J55j854J007N75r96N72O01j287M49N47j060
7977g12K87J414j227l21J568r52j023J456n57r36J379J81j187O94L84j177N88
7994a41J085j694O00P67q62J54R36j191k65J413q07j004J416j97j128J270L7j174
8012g85R09L50q77K75P56j040K41Q63j137r9J375j024j24J225j003n25J420m14
8030C86j429J456J37j342Q33N23j433Q54P42j309L69J032j226M4J299j262n03
8047h29J684p87p36J179m13r19J148k9j077R63L48r89M48Q23j516N42R30j589
8065h19L17J254j249m61J936j105m31J164O4j694J360k32r94J099K70j063O06
8082B2Q43j546O75O11r58j89J592j266m84J600r68q47J471j03j436J091O41j479
$$ y = [-453, 703, -93, -822, 583, 343, -1271, 579, 734, -1120, -113, 462, -534, 38, 639, -648, -199, 348, -712, -425, 989, -238, -559, 1009, 57, -966, 490, -67, -1003, 376, 557, -630, 64, 448, -729, -141, 944, -750, -150, 617, -245, -91, 845, -346, -611, 802, -5, -1009, 407, 210, -918, 352, 389, -785, 124, 474, -403, -128, 628, -412, -171, 692, -445, -544, 831, -193, -317, 908, -95, -620, 800, 386, -1043, 413, 550, -792, 41, 564, -869, -15, 727, -582, -213, 819, -407, -363, 936, -326, -829, 855, 68, -668, 511, 98, -821, 327, 298, -779, 184, 532, -457, -9, 814, -702, -160, 770, -819, -502, 752, -497, -958, 978, -127, -558, 606, 670, -1024, 336, 104, -890, 209, 479, -584, 22, 865, -681, -6, 605, -353, -542, 1050, -216, -700, 900, -68, -915, 556, 453, -983, 108, 749, -730]
8100g30J349J42j669Q12P19j043K11R17j475M00J296j305n63J973q28j067J246
8117C85m3j005R70L42j428J088K5j129M16R16j119K03J069j090J20J242j058r52
8135a048J732o09j184J577p4q90P60o6p94Q70M14j316J117nj181M63J115j091
8153b10m6J588j327p03J284p18p03J221J30j057P83J78q16O86K42j408J034O20
8171G78j358K18J356j341j90J513j291l97J303n48q07J375j58j270J133k47q71
8188h02Q51M35j096
$$ y = [-730, 619, 761, -908, -96, 623, -420, -209, 708, -767, -367, 929, -376, -939, 1034, 206, -861, 385, 342, -663, 307, 649, -779, 309, 334, -795, -379, 537, -582, -379, 690, -400, -280, 962, -96, -1048, 684, 75, -1109, 468, 394, -496, 264, 198, -596, 274, 688, -628, 489, 484, -697, -234, 881, -210, -256, 1332, 5, -698, 586, -132, -835, 386, 516, -541, 242, 420, -396, 290, 532, -876, 158, 778, -580, -362, 994, -347, -537, 976, -315, -712, 591, 43, -764, 611, 453, -817, 316, 69, -802, 49, 484, -612]
8191f12
$$ Imaginary data points
##PAGE= N=2
##DATA TABLE= (X++(I..I)), XYDATA
0@%%%%%%%Qj6J6j6K1k9L5m3N1n9P2q8J04j22J41j62J86k14K46k80L19l59M03m57
31b43N15n77O44p18Q00q88R86j094J213j343J486j646J823k018K237k489K776
48A464l104L486l937M480n149N998p115Q645j0884J4479k1144L7395j43496j77563
62b96445L70243o427j89808Q8731l928j37578J40473O4620j33764L7096P1518
73D731o2211O1300K1651r7605Q3243O8970j42931N8391J36173j49844l2369J82025
85A31524q1352j10065J29007j8673r7044J08572q518j16754Q6441K0290j04180
96f0752R1786K2542j59014Q3213J16505j58083L254J46755j20232n2729J65330
107G8575n8652j05111J30363J831j04845P9254J4519p4845Q1953l129j08156R7230
$$ y = [0, 0, 0, 0, 0, 0, 0, 0, 8, -8, 8, -8, 13, -16, 19, -24, 27, -32, 40, -48, 56, -66, 75, -87, 99, -115, 131, -149, 170, -189, 214, -243, 272, -305, 339, -379, 421, -467, 519, -575, 638, -705, 781, -865, 958, -1060, 1177, -1312, 1464, -1640, 1846, -2091, 2389, -2760, 3238, -3877, 4768, -6116, 8363, -12781, 24614, -118882, -296445, 73798, 67371, -122437, -33706, -37634, -175212, -34739, 29881, -103883, -66787, 4731, -57480, 3820, 25471, -72134, 11109, 80079, -62852, -4461, 131712, -18132, -50501, 131524, 50172, -59893, 69114, 50441, -46603, 61969, 53451, -63303, 23138, 43428, -60752, 31034, 53576, -105438, -22225, 94280, -63803, -60549, 86206, -34026, -86755, 78575, 19923, -85188, 45175, 47006, -57839, 21415, 35934, -38911, 43042, 39913, -68243, 28987]
119B8987M2359j43012O8029R7638j54071M341J45820j11723n6367J48031n8690
130A1342j00461J17082m46r0192P9493j267q0029R1121P901j09414R1760M5299
142F2189j40413O2558J03711j39040L329J40731j04419o3151J38419l9325q4070
153e9481R9423j3023p7682Q5250m677q0577Q6960M350j07250Q9537M4150j34644
165f7664O0388R8926j39185n130J37118r0237o1032J20815l9730p6761R3893j4356
177A7045p3663Q1418q086q1174Q6251J0409j04708Q0890M7854j27951M7858R8534
189G4677j18063p067J22136q0084n2604J12595l4109o6355Q4843j7772o0665Q3150
201D0682j5788p8243R1994R154j12383P6748N5036j21409M0805R1561j15614q464
$$ y = [28987, 71346, -71666, -3637, 94001, -60070, -55729, 90091, -21632, -77999, 70032, 11342, -89119, 27963, 27517, -62675, 16818, 15551, -64478, 26643, 34544, -74870, 16890, 62189, -78224, -15666, 88045, -50995, -47666, 93065, -11354, -74505, 63914, 24589, -59481, 39942, 26919, -50763, 34487, 29810, -50767, 36193, 40543, -66707, 22830, 66980, -67664, -7276, 91650, -47535, -52665, 84453, -5784, -66816, 53999, 14269, -62492, 31401, 17045, -56618, 24800, 16714, -64460, 21791, 32200, -72508, 8382, 56236, -71715, -23857, 74677, -43386, -50453, 71683, -8401, -61005, 51590, 17481, -48874, 35969, 18197, -42468, 40682, 24894, -53349, 38645, 47799, -64584, 12164, 67200, -54209, -13404, 78157, -37457, -45921]
213d5921J17827p7422n5033J05142l1685o0429P8702k4066n6852Q6688j8685q2607
225f4341R2699J3827j09417P4885N4982j21284L7672R5461j07834j5725J11563
236F2488o5952m8619R4137l4835n4988Q0741k3926n8655Q2533j4576p7366Q6042
248B7024J1276j05447P1612N7284j15086K7990R1668r0986j4132R3922o3300l4945
260d3120R0486m0217n0484Q0866k4250n5545P9965j7808p5455Q8937J2360j10591
272f4856O7830O5921j10276J5427Q5814q1914j3969Q8896n9831l5771Q5323l7201
284E393m9350P5487k3313n2805P7988j7379p7765Q7595J8305j07379N7085O2262
296E6124j00951J8272Q1854p9997j3176Q5211n6603l2597Q0993l8855m1240P7664
$$ y = [-45921, 71906, -5516, -60549, 44593, 12908, -47521, 31181, 7115, -49737, 36951, 18266, -64341, 28358, 42185, -67232, 7653, 62635, -58649, -20977, 74484, -33350, -49075, 62488, -3464, -52083, 42054, 7219, -47769, 32972, 9046, -49609, 32924, 18348, -59018, 27024, 38300, -67147, 4465, 61749, -53337, -25347, 66321, -24665, -38797, 55125, -8175, -43120, 47366, 7149, -43335, 37531, 13281, -42264, 37701, 19893, -55562, 33375, 45735, -64856, 2974, 68895, -41381, -25954, 59860, -22054, -36023, 52873, -6958, -42729, 42594, 5393, -43957, 31530, 8217, -44588, 33400, 16021, -61744, 25851, 44156, -63223, -6138, 56124, -44827, -26555, 55299, -24698, -37874, 47337, -9266, -41863, 39130, 275, -40965, 36699]
308C6699l0680n5719Q7396j1468q5245P9426K5936j00248N3763O0575r7693J5216
320b2042Q0085p5810j5150Q1643n1910l0657P4362l9667l8199P7942l0290n8887
332d8580Q0808p528p9389P4468K3851r6768M7326N8313q9856J2773P3402o8446
344a9626j1663P2026n2770k2955P5225m2865m1184P8352k5040n6914P7649o174
356B4061p9025O9954K7257r2761M3321O0002q4208P204O8954o1485r558O7677
368D1393n2661k2707P4430l9105m0611P5306k4609n7734P5022k382p5969O6482
380A6855K6202q8707M0316N5324p9612J0958O5390o4961q477O9797n1189k3766
392c1870P2211m1086m1215P7609k1777o0650P2239J587p6580N8946K9058q0413
$$ y = [36699, 6019, -49700, 37696, 26228, -59017, 20409, 46345, -53903, -140, 60435, -37258, -22042, 58043, -17767, -32917, 48726, -3184, -33841, 40521, 854, -37345, 40597, 10307, -48580, 32228, 24700, -54689, 19779, 43630, -53138, -5812, 52501, -37355, -24582, 48820, -19626, -31289, 40737, -12033, -34988, 40237, -2628, -43812, 34540, 9500, -47414, 30235, 24061, -54964, 14990, 42247, -50514, -7193, 52809, -31399, -24195, 44759, -16726, -26284, 41393, -11268, -33975, 40455, 1350, -39261, 36045, 11436, -46298, 28724, 26342, -49627, 16855, 43057, -45650, -5334, 49990, -29622, -18664, 46726, -18235, -26712, 43085, -8104, -31870, 40341, -745, -41960, 35649, 13872, -46778, 25461, 27048, -49532, 9414, 38472, -41941]
404d1941L5672M9001p4572J2898O1655o2287o503O5542n1625k2683P3379l7772
416G64m1301P3094j9926n7977O8672L135p2452N5158K9012p6643L1770M8709o8775
429b6760J0837N5732o0223l433O7007n0777k5401O9876l3064m1937O8682j6185
441A4354n5179O4118L391o9416N1144K9606p2167K8418M3411o4347J4048N4383
453D1764o1691m585O5220m9744k5858P0111l1020m2487O5857j4690n5203O1795
465A9469N322o6563M7925K5879o8507L1923M2958o7229J2348N5195n8651n165
477b5096O5350m8262k6277O9705l0493m3886O5529r508n4753N4703N992n9279
489c6275M7799K1598o8942L2297M3310o5774J1364N4655n6106o992O1695m6410
$$ y = [-41941, -6269, 42732, -31840, -18942, 42713, -19574, -26077, 39465, -12160, -34843, 38536, 764, -40537, 32557, 12631, -45346, 23326, 26461, -45991, 9167, 38179, -38464, -6694, 42015, -26760, -15923, 39809, -20414, -23847, 43160, -7617, -33018, 36858, 3794, -38143, 30539, 14354, -40825, 23293, 26684, -42732, 8412, 38018, -34149, -5731, 37680, -26667, -12619, 41764, -19927, -24512, 40708, -9036, -34894, 35217, 4197, -38290, 27567, 12877, -42326, 19469, 24791, -41772, 6153, 32032, -36475, -4552, 38406, -28823, -16475, 38720, -19931, -25096, 40254, -8008, -34285, 35420, 4927, -38959, 26570, 17062, -37691, 17012, 23004, -36275, 11524, 33122, -35820, -3523, 39787, -25987, -14623, 40032, -16074, -23066, 38629, -7781]
501g781k4835O8285k8859m5362O1290n832n0639N0118L709n6573M5692K0893o6229
514c6123L2320M2335o4351Q395N3893n3144p338O1114m4216k7148O5492k3520
526G709m2956N6504p272m7871M9093M498n4595M4867J9900o4430L0793M0620o2988
539b6128J0879N4279n4781j0463O2068l8575k8512O0070k2322m0219N5244o661
551A4879m7258M8311M254n3793M2941J9782o2315L2325L9972o6041R307N8535
563D0899n2281j4830N9737l5977k7397N8126k1450l8762N3584q333m7270M7417
575A3463N915n2757M1623J8683o2532L1095M2015o4547O439N7787m8924j6900
587b8640N8956l0218k8941N2085j8090l4834M9633p264m3213M6453L609n2633
$$ y = [-7781, -32616, 35669, 6810, -38552, 22738, 16906, -33733, 16385, 20094, -36479, 9213, 30106, -36123, -3803, 38532, -25819, -17424, 36469, -16675, -24013, 37101, -7115, -34263, 31229, 7709, -35247, 21257, 13985, -33886, 15207, 19705, -34890, 9977, 29877, -34553, -3760, 36860, -26128, -15249, 39030, -15751, -26214, 35854, -2721, -31233, 28837, 6515, -33704, 21540, 14879, -32379, 15932, 20186, -33607, 9334, 29116, -33199, -874, 39098, -26943, -17636, 40899, -11382, -26212, 33525, -2452, -29849, 28277, 6827, -31935, 21649, 13316, -33954, 13463, 19378, -33379, 8244, 26927, -35605, -4510, 37505, -27042, -20603, 37184, -11740, -28640, 30316, 98, -28843, 23242, 5152, -29682, 19951, 12687, -30526, 15927, 19536, -33097]
599c3097M2211K1239o1599K7567M1277n9777M842N6613m7280j8747N6900k7704
611B445l0072N0715j4998l4393M4969q547m0285M7220K381n4786M2226K3848o2757
624c2034K4518M4505n7540m44N4486m2781j7033N4566k7279k9786M8879j3538
636F519l3286M4211q787l8797M6933Q10n4356M5024K4653o6209K1936M8918n5009
649a7440l311N3303l8791j8494N0427k4666k6668M7875j5286l2672M4064p740
661A0601l7984M5458J382n4314M2603K6000o3581K0389M8251n3981p021N2706
673C0509l3473j9140M6022k3039k4796M4724j6473k9891M3873r428m0171M5861
685A4578M816n3900L9035K7545o2679J6095M9993m9358r191N0296k9540k0543
$$ y = [-33097, 9114, 30353, -31246, -3679, 37598, -22179, -17337, 39276, -8004, -26751, 30149, 2445, -27627, 23088, 8090, -26303, 18666, 10119, -30166, 17054, 19435, -35351, 6875, 30723, -32034, -7516, 36989, -20551, -20995, 33491, -9290, -26323, 28243, 964, -28822, 20057, 6519, -26767, 17444, 8657, -30140, 16793, 17603, -36753, 8271, 32924, -33285, -11349, 37569, -17440, -20751, 32552, -6239, -24733, 25694, 1028, -25640, 22235, 6949, -25723, 18341, 10601, -27383, 18075, 19457, -34857, 7746, 33746, -29835, -9446, 38805, -15176, -22197, 30509, -2964, -22104, 23918, 879, -23917, 20807, 4334, -25557, 18316, 8888, -31283, 14578, 19394, -34506, 4529, 32074, -30605, -14510, 35483, -13875, -23066, 27230, -2310, -22853]
697b2853M2508j9048k0506M0082j8443k7430M5999q987m1412M5461N726n5459
709c4362L7348L0166o0306J4469M8886m8964j0983N0240k6623j9419L9082k0059
721e25j8878M1090j8333k8033M6784j0410m3796M6416R873n5429L4192L0555n8905
734b5399J0781M8545m3282j1853M5510k6499j7718L8468k0212j7748L9758k0561
746b10k8107M8165q495m4629M5854J0581n8050L1433L6363n4481N712M5481l8649
759i032j1373M2784k3152j5782L5434k1160j6206M0293j9055k7073M6419r983
771A2114m6156M6612J5321n7260K6148L5967n2050L052M4933l4121j2002L7810
783B0368k2997j3379L4929k0409j5648L8901k1181k8840M9603o226m7713M2813
$$ y = [-22853, 19655, 607, -19899, 20183, 1740, -25690, 20309, 11322, -30090, 15371, 21097, -34362, 2986, 33152, -27154, -12685, 36201, -12763, -23746, 26494, -129, -19548, 19534, -525, -19403, 21687, 3354, -24679, 22105, 11695, -32101, 14315, 24188, -31241, 2951, 33506, -25399, -14618, 33927, -9355, -21208, 24302, -2197, -19915, 18553, -1659, -19407, 20351, -210, -28317, 19848, 11353, -33276, 12578, 23159, -34891, -3458, 32905, -21576, -15864, 29617, -9032, -20405, 22379, -773, -16555, 18879, -2281, -18487, 21806, 2751, -24322, 22097, 12114, -34042, 12570, 27891, -29369, -3221, 32746, -19304, -16252, 28681, -5440, -17442, 20368, -2629, -16008, 18921, -1488, -17136, 21765, 584, -28256, 21347, 15121, -32592, 10221]
795A0221J6307n6976K3954L7819m7708J03M1158l2158j0758L6312k2020j1448
807a5194L3191k3885j5425M3828k0146l1705M9175m922n0068M1778K2148n5357
819b6582J9631L7812m5984j027M1187k8290j0591L2183k2681q915L4671k4400
831b986j5606M4361k1421l4978N0060M72n0418L6699K2051n3489J6634L8100m1312
844a1833l361L7190k7095r932L1507k1229p472L2190k7402j5584M6372j8332l6952
857c1933M8015K878n1527L3307K5911m8540J2055L5237l7956k979L5049k4624
869e107o912K8924k3715p178L5555k5811j6974M6626j8861l8713M7888P014n1307
882b8571L0362K6715m7868R288L5225l3414k728L1034k6110n136L0110k4695o766
$$ y = [10221, 26528, -30448, -6494, 31325, -16383, -16280, 24878, -7280, -18038, 18274, -3746, -15194, 17997, -5888, -21313, 22515, 2369, -29336, 19839, 14917, -35151, 6627, 28775, -26582, -6951, 30861, -15123, -16150, 25037, -3253, -13844, 18339, -4342, -13257, 21414, -2986, -18592, 25769, 4348, -30630, 19430, 19902, -30516, 6183, 28234, -25255, -8621, 29479, -11833, -15194, 21996, -5099, -15031, 16476, -4753, -12225, 19965, -7437, -23021, 23351, 5019, -31933, 16082, 18960, -32567, 740, 26651, -21889, -9834, 25403, -12553, -15532, 19517, -5107, -12019, 16905, -6810, -13988, 21567, -4244, -21218, 25408, 6547, -32166, 15722, 22736, -28571, 1791, 28506, -19362, -10074, 25151, -8263, -10991, 20043, -6067, -11203, 18907, -5788, -12554]
895a2554L6403k8146k0016M7545j4266m0230M6000P251n1840K8133K8342m4206
907a7584P596L2304l3024k104L0634k4955l002K8602k7858p259L8977k5467k1702
920b4842M7759j3508m2844M3263J2858m8498K3007K7134m0938O660L0566k8972
932h355p78K7190k6316k956L0387k5204p117L7585k6492k3439M8244r578m2529
945b9358M0259J3441m8162J9538K8317l5957M858K6373k8712N85K7140k5662k295
958i635K9994k8088r783M0233k3403k4684M5763q544m4056L8392J6022m4916J7639
971e066K5798l5449N295K6642k7164K417K4885k8746r66L3306k7556j0750M0734
984B3380k2835k7636M5825m338m1941L4843J5138m3794J6989K5865l2466N166
$$ y = [-12554, 23849, -4297, -24313, 23232, 8966, -31264, 14736, 21987, -29853, -1720, 26622, -17584, -9988, 22316, -10708, -12812, 17822, -7133, -10135, 18467, -9391, -16650, 22327, -3140, -24842, 22917, 9409, -33435, 9828, 22686, -25812, -2805, 24329, -16609, -9949, 20617, -8355, -9133, 18057, -8259, -11215, 19172, -6032, -13149, 24436, -2056, -25495, 22749, 13171, -29358, 10901, 24342, -23820, -4282, 24035, -11922, -7064, 19309, -9403, -8818, 18322, -7340, -9635, 20359, -7729, -17512, 22721, -682, -25366, 20397, 11853, -32203, 6189, 22211, -22705, -5066, 20732, -14717, -9422, 17220, -9944, -7527, 17358, -11388, -12354, 20952, -6604, -17354, 23380, 545, -27091, 18734, 14396, -27545, 7298, 22436, -21358, -4369, 21496, -10970, -5804]
996e804K3194k8048L899K6032k8413o83L2837k9751j2943M3241j9634k9563M2948
1009A7312k444m2089L2113J6839m0635J5243K3215l1882N453K3275k6494M030
1021f064K3586k9675l0L4450k8472j4446M2306j8342l0750M0881J092l9886K8424
1034C074J5671l7784J4660K2443k9608O247K1092k7738N001K6590k9600j470L4759
1047B3337k8204j6156M3072j5384l1818L9493J768l9432K6826J6511l5297J3163
1059b121J9253k9440R185K0832k9818N863K7033l1621k803L6746k6866j7191M1212
1072B0264j4406l1705L8535L224l9005K4914J5543l3729J3607J8460k9199R561
1084c936K0225l0975O642K9033l0787n615L7049k5028j8610M0915j2271l1549
$$ y = [-5804, 17390, -10658, -6759, 19273, -9140, -9823, 23014, -6737, -19680, 23561, 3927, -25636, 17312, 14868, -27221, 4892, 21731, -18904, -3661, 19554, -12328, -6875, 16400, -10094, -6064, 17522, -12153, -12183, 22267, -6205, -20651, 21655, 3313, -27437, 13444, 14536, -25350, 3074, 18745, -19039, -4379, 18064, -11544, -5297, 15795, -11943, -6942, 19648, -9952, -11422, 23337, -4867, -21023, 22049, 6665, -25153, 14340, 16108, -23324, 3502, 20013, -15284, -2121, 17132, -12308, -3123, 17709, -12109, -6246, 20787, -10834, -13637, 23109, -3757, -20948, 20264, 5858, -25847, 12688, 15912, -23093, 1821, 17364, -16365, -2758, 15702, -13497, -3936, 16289, -14686, -8044, 20989, -9798, -15413, 21636, -3392, -22002, 18913, 6642, -24907]
1096b4907L5455M114l5829K3474J4547l1412J3040J6818k8145J0989K0483l0958
1108a2331N232K9584l0944o039L7601k3558k0093L8805r731l0516L2753M137l4596
1121a9696K1648J4134l1129J3978J6654k9117J0451K0356l1396N820K9993l1301
1133i605p797L7983k0855k1538L7025q113k9949L1733L468l2883K3077J2265l1315
1146a6504J5042J6346k9012J1351K0570l2274N495L1994l1266r151L9196k0468
1158A319k2505L6597o853k8021K9689K616l1444K3186J1433l1509J5396J6803
1170A6707l0046J0244K2109l1279L893L0424k9786r480L8027j8764k2742L4689
1182A3996o154k7920K8295L119k9315K2009R919l0756J6437J7150l1369R907K3237
$$ y = [-24907, 10548, 14662, -21167, 2307, 16854, -14558, -1518, 15300, -12845, -1856, 18627, -12331, -7099, 22485, -8459, -14498, 23103, -455, -20548, 18257, 8526, -21990, 10763, 14900, -19696, 1952, 16086, -15043, -1065, 15589, -13528, -3077, 17279, -14117, -8297, 21696, -9605, -17402, 20581, -274, -21812, 15213, 7100, -22849, 8884, 12352, -20531, 2546, 14811, -16504, -1462, 14884, -14128, -2777, 17793, -14481, -8986, 23008, -8258, -17409, 21787, 1319, -21186, 15411, 8558, -19463, 10226, 12842, -18602, 4584, 16017, -15492, -96, 16707, -13339, -3095, 19014, -12265, -8372, 22052, -7734, -17214, 20813, 2049, -20693, 13996, 7842, -20078, 8217, 11336, -17979, 4030, 13949, -16807, -370, 16780, -14589, -4682, 18555]
1195A8555l0747J590L1286k7114j0666L5637j7812k1333L4135n817k7747K7498
1207G465L257k9035K1781J0071l0286J6240J7006l1327R726K4720l0130l96L1447
1220B0539k5358j0613L4368j6340k0476L2223o247k6155K8054K327k9779K2122
1232D665J0429l0832J6440J7263l2635R323K4886l0691m00L1853k4951j2095L3507
1245A6762j5936j9688L1483o912k5556K8357K066k9410K2631J0251l1174J5401
1257a725J7923l0567Q580K4428k8829j320L0787k3803j1203L2860j5306j9251
1269a7426L0324o697k3857K7772J034k9452K2985J0992l1370J4940J8461k9989
1281a2283O991K4010k7371j531K9759k3044j1968L1923j3928j9199K9546o662
$$ y = [18555, -12192, -10602, 20684, -6430, -17096, 18541, 729, -20604, 13531, 7714, -20033, 7465, 10722, -18313, 3468, 13539, -16747, -507, 16499, -14828, -5102, 19618, -10512, -10908, 20539, -4819, -15432, 18936, 2596, -17880, 14343, 8096, -18059, 9995, 12322, -17457, 4665, 15094, -15738, 702, 17965, -14670, -5347, 19539, -11152, -11552, 20301, -4650, -16745, 16762, 826, -18862, 12621, 5709, -19847, 8510, 10576, -18834, 3797, 14048, -17126, -1725, 16198, -14369, -5789, 18639, -10190, -11510, 19277, -4526, -15729, 17131, 1825, -17426, 12898, 6201, -17656, 10116, 11150, -18302, 4683, 15675, -15695, -755, 17706, -12283, -5292, 18718, -8653, -10184, 19575, -3469, -15437, 16486, 2558, -16641, 12905, 6243]
1293F243k4579K7635J622k9945K2897J1623l1840J3561J9763k9382N673K4215
1305A7486k7114j476K8635k1862j1425L1265j4541j8743L0350o903k4184K7847
1317I335J371l0050K2265J2880l2018J3491J9851k9308N334K4452k5949j956K8135
1330A7833k2029j0301L1316j5090j8165L0291p159k5112K8048K970l0031K1062
1342C633J3117l1378J1968K0392k7903L795K3314k4548j659K6465k1281r980L0127
1355A6062j5463j8509L0585o392k5356K6984K985l0106K0982J3225l0791J1351
1367d443K0231k6818L196K3204k3705j801K5927k1350q550L0888j5796j8792L0846
1380A3037n515k6360K7094M386k9535J9008J3669k9409J0957J9138k5874L748
$$ y = [6243, -18336, 9299, 10921, -19024, 3873, 15496, -16344, -2783, 16980, -12402, -6729, 17486, -9628, -11104, 17531, -4331, -15756, 15509, 968, -17775, 12575, 5672, -18512, 9335, 10706, -19344, 2921, 15801, -16217, -2726, 17125, -12183, -6849, 17603, -8346, -10302, 17833, -4196, -14497, 16819, 1729, -16436, 13855, 6696, -18416, 9632, 12602, -17429, 3633, 16750, -14628, -2660, 17732, -10171, -6376, 16938, -7610, -9269, 17196, -4085, -14065, 16062, 599, -17910, 12675, 6283, -19073, 7911, 10896, -19210, 1772, 14997, -15794, -4443, 15788, -11030, -7834, 15370, -8335, -10136, 15791, -5559, -14109, 16779, 983, -17809, 13037, 7522, -18838, 8256, 12642, -16893, 2115, 15784, -13625, -2668, 16470, -9404, -5656]
1392e656K1441k3034p68K5597k2199q932L0805j5874j9045L1698n499k7865K6707
1405G376O011l0880J8519J4799k9023Q990J9227k5082M107K1452k4478r12K6234
1418A6340k1933r205L0908j5449j9338L0764m332k7319K5983O820l0342J6597
1430e06J5199k6709Q162J7715k3318M218K0034k3156j14K5942k1943r944L1555
1443A7135j4574k0482L0372k506k8124K3676Q319k8410J4984J4293k6043Q317
1455c043J7034k2768M652J8973k2959m00K5959k2631r567L1746j4239k2054L0157
1468A0860o96k8300K2411Q709k7757J4180J3724k4846Q465J6114k2919M905J9488
1481A4338k3742J5K6545k2612j0561L2305j3403k2876L0221rk8132K1446R516
$$ y = [-5656, 15785, -7249, -8017, 17580, -4619, -13551, 17254, 1380, -17665, 14033, 8534, -19331, 7376, 13387, -17493, 1026, 15825, -13198, -4208, 15019, -10063, -5956, 15496, -8982, -9894, 16340, -5593, -14798, 16110, 661, -18677, 12087, 7755, -19564, 6419, 13239, -17103, -506, 14693, -12016, -3854, 13861, -9457, -5239, 14795, -8361, -8475, 17467, -4476, -14420, 17135, 2561, -17921, 12451, 9945, -18179, 5497, 13816, -14594, 390, 14683, -11360, -3043, 13991, -8777, -4125, 14848, -8111, -8511, 17448, -5183, -14750, 16996, 2757, -19297, 10860, 10164, -18136, 4275, 12984, -14773, -593, 13131, -11715, -3250, 12864, -10055, -5150, 14338, -9404, -9389, 17156, -5456, -16017, 16288, 2885, -19991, 10230, 10221, -17911, 3535, 13051]
1494A3051k6561J3193J3198k3220Q487J5085k2652N727J9718k4778j5K7645k2212
1507c334j2288L2526j2169k3208K8704O91k7089J9270R410k5078J2603J2147k2465
1520a0280Q410J4247k2787O125J9288k5034l80K8167k1856j3153L2336j0365k4027
1533a9309K7135J979k5452J8007Q328k3204J1712J1911k1825R227J3758k2958
1545a0691O900J9967k5113p30K8596k1618j4484L2399q728k3832K5001L277k4952
1558a4008J6531Q380k1822J1900R826k1646J0052J3824k3582O893K0007k5904
1570i549j092K9742k0928j5264L1737p799k4894K4331M494k3916J4939P390k0681
1583a1490J2439R271k1664J0875J3520k5200O711K2326k5495l129K9381j9427
$$ y = [13051, -13510, -317, 12881, -10339, -1852, 13233, -9419, -3692, 16026, -8752, -8767, 18878, -3334, -15622, 16904, 4735, -18473, 10231, 10922, -16167, 3103, 12513, -12565, 38, 12185, -10280, -1870, 12377, -10410, -4285, 15003, -10031, -10411, 17756, -4100, -17253, 15083, 4718, -19309, 7826, 9805, -15647, 2360, 10688, -12516, -804, 11107, -10718, -1491, 12267, -10691, -3791, 16176, -8937, -9667, 18929, -2689, -17173, 15226, 6498, -17334, 7667, 10944, -14008, 2523, 10903, -10919, 981, 10807, -10839, -787, 13037, -10545, -3652, 16355, -9549, -10641, 19101, -1827, -17091, 14646, 6847, -18047, 6284, 10778, -13138, 1801, 9191, -11490, 949, 10220, -11444, -569, 12951, -12249, -5538, 16788, -8707, -11836, 17545, -1882]
1595a882j6066L0733n559k4263K2442M077k2360J4333P635j9278J1962P458k1503
1608a2271J1993J4601k4894N480K2434k4891m848L0325j6605j7682K8727n025
1620G344k3049K1246N052k1082J2888N568j8883J3434P775k1844J1739J3388k5938
1633a2362O051K4275k4618o328K9127j6091j7543K8026k741k2400J8899L067j9337
1646a1975J4348N332j8261J2810O559k2981J3436J5692k6787M984K4220k4353
1658f976p290L0331j3439j8413K5383k923k0094J8837L397j8468J3382L150j7934
1671a1057J5134O914k3159J2694J4701k7415M677K6206k2996r330K8061j2584
1683A846j7706K4825j483j9763J6594J398j6785J5123L151j8637J4806O488k3959
$$ y = [-1882, -17948, 12785, 7226, -17037, 5405, 9482, -12878, 1455, 9090, -10188, 1774, 9232, -12271, -278, 14323, -10571, -5091, 17343, -7548, -12396, 17929, 1324, -16358, 12369, 7344, -15705, 5541, 10593, -10489, 2399, 7967, -10916, 2518, 10293, -11551, 188, 13576, -12362, -6311, 17964, -6654, -12982, 16145, 54, -17489, 10537, 7796, -14604, 4295, 7362, -11975, 2373, 7705, -10556, 2254, 8813, -14168, -732, 14960, -11827, -6843, 17377, -6976, -14266, 16065, 2626, -15787, 9596, 6673, -13421, 5416, 8813, -9655, 3727, 6877, -11057, 4077, 10991, -12168, 526, 15227, -12188, -7511, 18695, -4301, -13631, 14430, 1846, -15860, 8965, 7482, -12281, 4313, 5711, -11074, 4049, 7200, -11437, 3369, 9857, -14102]
1696a4102J3043J7075k6512K243K4912k1736q961K8072j0564j7743K1442j853
1708E316j7009J6170J798j5994J3825J452j8625J6724P663k4448J1340J7314k6403
1721a0877K285K5841k0563j0028K6168j0114j6353K1764j345j6880J4351P93j4060
1734i018J5110J260j9438J6548P407k5997J2647J8301k6054M1K4715j8613j0025
1747a3116K5324r404j5730J9468j878j5688J5791l6j5190J5355N92j9041J7195
1760C642Q551k6057J0660J9062k5390r32K5721j6970j1052K3057p935j3826J8754
1773G285k116j4932J5288p36j5371J6793J031j9888J6333Q560k5498J0491J9519
1786A6759k4362k301K3865j4876j0880K1810p108j3720J7462l389j2856J6087
$$ y = [-14102, -1059, 16016, -10496, -8253, 16659, -5077, -14038, 14034, 3470, -14273, 7169, 5316, -11693, 4477, 6275, -9719, 4106, 5558, -13067, 3657, 11320, -13128, -1788, 15526, -10877, -8592, 17249, -3314, -13342, 12826, 2712, -13641, 8123, 6778, -10102, 4249, 5042, -9018, 6092, 7352, -12086, 4462, 11869, -14128, -1481, 16820, -9234, -9193, 15522, -3091, -13116, 12208, 2804, -12926, 6542, 4664, -11024, 4767, 4731, -10459, 4896, 5488, -13553, 3642, 12193, -13864, -3204, 15858, -9532, -10464, 15257, -1713, -12765, 10292, 2357, -11469, 7285, 5169, -9763, 5525, 4789, -10582, 6211, 7242, -12646, 3687, 12247, -13251, -2760, 16759, -7603, -9904, 13961, -915, -11795, 10015, 2907, -10813, 6649, 3260, -9596, 6491]
1798F491k111j5289J6671J268k0246J5945R917k5264Q772J9692k3205l032K4139
1811A3748j4233j0927K0302o916j1731J6792m274j2597J6301k366j6045J7599
1823E653J954k1304J5747J0434k5078P807K0214k1859l694K2437j3162r649J9362
1836H862o917j1445J6203m053j2349J6801k256j6208J7864K262k1930J5560J1646
1849A4040k4777O254J9432k0023l863K1224j2217r649J8053p470j0332J6409n202
1862A879j1773J6869k825j6452J7172L806k2150J3647J2658k3629M879J9534j8620
1875e005m438K0032j1636q527J7923p534r770J6930o107j2102J7376k111j6702
1888a1671J6891M635k2548J2886J3179k2597L717J8915j7607m192J9199j1178
$$ y = [6491, 4380, -10909, 5762, 7030, -13216, 2729, 12646, -12618, -3846, 15846, -7359, -10391, 13748, -485, -11412, 8890, 1974, -9757, 7035, 2761, -9836, 6465, 4099, -11946, 5653, 7607, -13697, 2050, 12484, -12594, -4787, 15427, -6432, -10126, 12311, -851, -10500, 8862, 1945, -9500, 6703, 2650, -9699, 7102, 4846, -11362, 6502, 8764, -13166, 2394, 14040, -10737, -4483, 14949, -5074, -8937, 12287, 70, -9579, 8474, 1004, -9328, 7081, 1879, -9894, 6975, 4150, -12302, 4870, 8676, -13474, 173, 12831, -10798, -5919, 13615, -5005, -9443, 10589, -1047, -9574, 8349, 815, -8955, 7975, 1868, -10234, 7142, 5031, -11671, 5220, 9855, -12693, 193, 13372, -9225, -5508, 13407, -4200, -8392, 10807, -371]
1900c71q163J7267q093r267J6397n411j2823J8100k193j7758J7329M871k2111
1913a2226J1885J3222k1871K954J8429j6353m316J7917j0784o956J6212q225q846
1926h958J6924o527j3015J8324j010j8375J6005O024k1589J0993J3695k1231K838
1939e902J7692j5510m200J7434j0697o298J5826q791q222J7379o068j3541J7666
1952F768k61j8169J5162O468k0243R169J3181j9695K505J6798j4531m108J6478
1965I522j0309o524J5674q451q825J7293n959j3696J7894J31j8709J4456P013
1978I510k0075Q698J2982j8770K044J6095j4754k846J6428j1428n819J6131q975
1991g79q775J7522n640j3919J7655K97j8401J4539O996j9377P992J2972j7981
$$ y = [-371, -8534, 8733, 640, -8627, 7770, 2359, -10464, 7636, 5443, -12315, 5014, 9885, -12226, -341, 12881, -8990, -6036, 12393, -3960, -8276, 9641, -1143, -8099, 8113, -112, -8958, 7966, 1439, -11576, 6748, 5738, -12637, 3368, 9392, -12197, -1204, 12491, -8740, -5902, 11790, -3720, -7920, 9514, -1183, -7481, 8345, -446, -8668, 8711, 2643, -10898, 6768, 6507, -11662, 3500, 9968, -10275, -1106, 12075, -7620, -5115, 11683, -2848, -6956, 9522, -787, -7311, 8363, -88, -8913, 8380, 2421, -11275, 6619, 6750, -11959, 2497, 9510, -10565, -1867, 11115, -7655, -5611, 10484, -4270, -7116, 9312, -2116, -7935, 8196, -779, -9554, 7968, 2328, -11591, 6064, 6361, -12040, 2499, 9495, -9882, -1890, 11082, -6899]
2004f899K381J5214j4359k450J5713j1167n451J6461q904r244J7180m795j4234
2017a0554J6523J385j7976J2919P512j8697P338J2345j7839K183J5090j4271k425
2030f467J5313j0652o306J6326q112j0059J7320m153j5166J6602J913j7286J1654
2043I27P575j7698P044J1641j6222K054J4739j4494k105J5773j0925o154J6478
2056H633q231r648J6774l691j4082J4968K633j7519J1812P186j6869P123J0867
2069I956j6281K846J4062j4402k301J6042j1216o523J6643p521j0471J6222l262
2082C794j4279J4856K293j6516J1206O735j6516P138J0576j6286K725J3948j4548
2095d874k197J6289j1404o682J6782o988j0802J6115k350j3922J3993K222j5902
$$ y = [-6899, -4518, 10696, -3663, -6113, 9600, -1567, -7018, 9443, 539, -8705, 8475, 3680, -10554, 5969, 7354, -10622, 2297, 9809, -8888, -1550, 10795, -7044, -4861, 10229, -4042, -6467, 8846, -1806, -8112, 8214, 102, -9957, 7363, 3210, -11956, 4646, 6559, -10727, 927, 8502, -9196, -2152, 9489, -6733, -4679, 10060, -4434, -6539, 9234, -1691, -7845, 8633, 402, -9246, 7528, 3837, -10245, 4723, 7356, -10163, 1649, 8835, -8034, -911, 9956, -6325, -3479, 10583, -3819, -6120, 9922, -1294, -7817, 8826, 1305, -9166, 7056, 3794, -10485, 4371, 6664, -9852, 1354, 8089, -8427, -1289, 9287, -6999, -4274, 9674, -4874, -7071, 9218, -2186, -8868, 7914, 926, -9876, 6239, 3889, -10033, 3960, 6182, -9720]
2108i720J1027O740j6504P149J0748j5881K422J3969j4005k193J5716j0432p299
2121h263J6770o251j1113J5109j854j3242J3406K082j5171J0569O271j6207P126
2134g68J0516j5936J931J4259j3880l173J6128j0006p491J5759n884j0471J4449
2147E433j871j3269J2962K304j4975J0227O132j5950P756J0573j6401K128J4850
2160I899j3346l848J5912r128p501J5272n403j0320J4091j684j2747J2869J871
2173E937j4483J0322O157j5945P095J0917j6111J716J4669j3064m071J6155q894
2186D00q191J4695m914r831J3672j940j2488J2886J684j4664J0437N688j5927
2199h493P157J0879j6156J713J4750j2993m607J5190p699p702J3542m322r795
$$ y = [-9720, 1307, 8047, -8457, -1308, 9440, -6441, -4019, 9950, -4055, -6248, 9468, -964, -8263, 8507, 2256, -8857, 6252, 4398, -8844, 4562, 6644, -8527, 2042, 8313, -7894, -768, 9748, -6188, -4257, 10002, -3878, -7051, 9077, -929, -8420, 7339, 1455, -9016, 5433, 3562, -9707, 3255, 5559, -9416, 811, 6943, -9007, -1251, 9322, -7079, -4951, 9899, -3447, -7295, 8617, -511, -8012, 7260, 1857, -8463, 5628, 3944, -8803, 4066, 5937, -8546, 1776, 7933, -8012, -917, 10000, -6111, -4395, 10274, -2790, -6861, 9294, 400, -7791, 6904, 1990, -7841, 5831, 3891, -8597, 4289, 5973, -8691, 1746, 7434, -8493, -1336, 9543, -6613, -4900, 9850, -3143, -7750, 7440, -259, -7961, 5581, 1259, -8536]
2212h536J3039j649j1966J2866J639j4560J0241O695j6010O778J1433j6096J126
2225e000J5241j1999n354J5181o849q228J3286m162r032J2466k307j1089J2375
2238D529J563j4879J0538O835j6651O097J2079j5539M20J4767j1625n184J4378
2251G328o449q012J2827m037r015J2681k776j1315J2690J699j5723J0977P474
2264H349j6762N198J2856j5027o93J4763j0865n196J3924o341p232J2348m191
2277A131q152J2207k766j1302J3618J543j5515J0542P930j7062N117J2853j4026
2290c882j581J4338r513n850J3497n860o899J1717n054p485J2436k629j1822J3194
2304D607J664j5615J0289Q156j6908M238J3219j4126j744J4414r350n640J2113
$$ y = [-8536, 4503, 2854, -9112, 3754, 5393, -9167, 1074, 7769, -8241, -1463, 9970, -6126, -5000, 10241, -1758, -7112, 8069, 1220, -7008, 6278, 2116, -6916, 5550, 3243, -7846, 4529, 6092, -8787, 1751, 8586, -8065, -1968, 10111, -5428, -5008, 9759, -1866, -7050, 7328, 879, -7133, 5694, 1657, -7358, 5323, 2547, -8768, 3922, 5621, -10102, 875, 8349, -8413, -3215, 9641, -5386, -6079, 8684, -2181, -7377, 6547, 206, -7026, 5322, 1131, -7021, 5186, 2420, -8882, 4736, 6279, -9236, 1306, 9236, -7826, -2709, 10144, -3882, -5463, 8875, -638, -6488, 7009, 1149, -5750, 5967, 913, -6572, 5864, 3235, -8587, 4607, 6271, -9344, 945, 9101, -7807, -3569, 9650, -4476, -6220, 8194, -1156, -6796, 5317]
2317E317n938n593J1403n130p456J2937l292j2163J4112K023j6141J0413Q265
2330H757j6276L705J3368j3239k409J3799q422n149J2160o226n398J1394n693
2343C71p122J3630l599j2841J3989K883j6533R815R311j6403K604J3001j2233
2356c127k342J2723q206m882J1312n995n024J1435n726p450J3555l311j3134J4379
2370D207L398j7220Q432J0317j5440J946J2564j1382k610J2372p807m145J0821
2383E453o455m985J1899o380p337J4661l467j3588J3864M174j6788Q146J0385
2396I582j4866R55J2468j0213k424J1219p398l809J0733p124m325J2656o687q767
2410h000J4879k832j3857J3322M846j6843O902J0410j3979J054J1676r696k397
$$ y = [5317, -621, -6214, 5189, 59, -7397, 5540, 2248, -9915, 4197, 6220, -9921, 492, 8757, -7519, -3814, 9554, -3685, -6094, 7705, -717, -5866, 6294, 68, -5330, 6064, 371, -6751, 6879, 3280, -9561, 4428, 7311, -9222, 593, 9904, -6499, -3895, 9106, -3127, -5469, 7254, -952, -5834, 5478, -517, -5541, 5894, 168, -7282, 6273, 2962, -10172, 4207, 7605, -9615, -1183, 9134, -6306, -4360, 8204, -3178, -5788, 6584, -1223, -5368, 5453, -1002, -5987, 5912, -468, -7805, 6856, 3389, -10199, 3665, 7839, -8949, -803, 9582, -5284, -4329, 8139, -2074, -4498, 6721, -677, -4486, 6247, -877, -5202, 7454, 767, -8000, 6879, 4047, -9810, 3512, 8358, -8485, -1583, 8827, -5152, -4098, 7578, -2118, -4515]
2423d515J0202p822k314J0637p497m939J2849o776q861J5251j935j5051J2805
2436B034N712j6771O847J0892j3572K51J1141q974j707J0398q072k720J0835p598
2450a304m566J3525o511r881J4959j189j4836J2204P042j6684M969J0923j2258
2463c607K71J0689r256j785R235p580j640J0748q131n415J3810o276j0306J4957
2477E714J7j5655J1009O901j5444M940J0681j2142k83R838q256j025R717q598
2491b586j702J1047q811n386J5165n899j1656J4643O13j4833J0369P589j5298
2504f745L943J0324j1091L19R342q413q62Q900q691j201J2110r112o032J4750
2518G541n654j1320J5011J141j5872R620Q038j4260L361R962j0353l4Q501q925
$$ y = [-4515, 5687, -2135, -4449, 6188, -1309, -6248, 6601, -175, -9036, 6215, 4280, -10771, 2034, 7746, -9025, -2178, 8714, -4858, -4607, 6534, -2440, -4147, 6251, -1821, -4541, 6294, -1304, -5870, 7655, 1144, -8737, 6222, 5033, -9803, 2401, 9443, -7241, -2272, 8651, -3607, -3336, 7353, -1903, -3688, 5547, -2033, -3673, 7075, -1056, -6471, 7339, 1063, -9243, 5714, 5731, -9924, 1085, 7986, -7458, -2518, 8163, -3979, -4262, 5576, -2680, -3705, 6012, -2586, -4288, 6759, -2052, -7438, 7727, 1828, -9828, 4815, 5428, -9405, 964, 8553, -6745, -2802, 7522, -3569, -3250, 6092, -2321, -3183, 5717, -2974, -4175, 7935, -1177, -7209, 7541, 1887, -9433, 5578, 6719, -9153, 467, 8505, -5755, -2394, 7568, -2785, -2819, 5682, -3243]
2532c243O74R660j0100j791J2311q789o628J5378m973j2476J4009J853j5110Q780
2546d45Q478j3893K936Q973r749P36Q659q901J76R007r643j311J3071r036p538
2561h480J5344l778j2825J4068L062j5401P883P243j2216L261Q879j0433J209
2574b184P704q554O60R869j0270k544J3524q585p919J5268k790j3425J2183L668
2588F605j4396P600P717j2254K211Q121r310J559P751r565O93J0584j0809k738
2602f231J4439p868r106J4612k309j2925J1955L640j3588O629O914j0990K877
2615a951P115q807J973P585j0235J532J0708j0463l208J3718p539q704J4694k035
2629D383j2806J0960M034j3085O254O822j1008L376O734r631K865P745j0761Q99
$$ y = [-3243, -2569, 7091, -3009, -4800, 7511, -1278, -7906, 7472, 2499, -9977, 4032, 5885, -9225, -445, 8033, -5860, -2924, 6049, -3700, -2964, 5695, -3206, -3030, 5977, -3666, -4977, 8094, -942, -8480, 6864, 3086, -9739, 4329, 7391, -8010, -127, 7116, -5100, -1839, 7040, -3393, -2184, 5520, -3034, -2374, 7495, -2775, -5319, 8205, -380, -8299, 6969, 4179, -9246, 2937, 6605, -7791, -191, 7526, -4728, -2517, 5604, -3706, -2147, 5604, -3961, -3268, 7316, -3493, -6231, 8208, 340, -8766, 5846, 3537, -9388, 2567, 6207, -7381, -752, 6162, -4828, -1951, 5164, -3643, -1670, 5915, -4320, -2788, 7920, -2543, -5751, 7967, 428, -8276, 6418, 4383, -8423, 2537, 6571, -6514, -260, 6562, -4446, -1070, 5664, -3967, -1102, 6643, -4118, -3219]
2643c219J1222j0570m025J4711p109r933J4058r63j2162R930L680j2281O142O311
2657E792j0990L640O970r760K404Q015j0811R23J1441j0423m389J5199o753j0199
2671h941J3856n14j2384J0025L579j1981O321N621j0652M343O598j0140L059Q239
2685G029j0985L34J2078j0416m835J4668n854j0054J2810pj2021R158L681j1311
2699e725N477N886j0452M171O252j0786L015R261j1101k96J2641j0041n582J4105
2713F825n328j0355J2925J49j1647Q532M011j1342O409M874j0442M662O696j1043
2727e074K663R945j1363q01J2471r185n664J3895m767j0225J2036N63j1152Q599
2741A941K744j0298O348M779j0539M787O596j1209K804R655j1509p99J2545q630
$$ y = [-3219, 8003, -2567, -6592, 8119, 1010, -8923, 5135, 4172, -7990, 1940, 5620, -6661, -519, 5792, -5198, -1558, 5412, -4348, -1944, 6071, -4740, -3817, 7624, -2799, -7188, 8011, 1258, -8941, 4915, 4401, -7983, 2042, 5621, -6360, -39, 5582, -5070, -727, 5871, -4269, -1210, 7029, -3956, -3622, 8456, -1960, -6795, 7873, 2019, -8035, 4775, 4768, -7253, 1905, 5586, -5725, -248, 5638, -4814, -643, 5609, -5177, -2162, 7099, -4002, -4298, 8343, -1698, -7280, 6825, 1497, -8858, 4067, 4216, -7431, 1101, 5112, -6230, 179, 5053, -5389, -727, 5969, -5074, -2411, 7534, -3829, -4630, 7841, -1344, -7008, 6887, 2120, -8105, 3931, 4494, -6658, 1941, 4685, -5613, 735, 5514, -5025, -238, 6358, -4851, -2047, 7608, -3901, -4700, 7845, -785]
2755g85o447J3822m418r532J1016K35j0826Q824K864j0570O570M224j0917N358
2769e82P117j1755K827R971j1239j582J2757q234o454J2906l727r654J1174R9
2783C624j0187Q328K864j0589O620M699j1059N303P179j1749K097J0449j0393
2796b814k251J2404p801o287J2645l831r065J0560N76j0113Q157K336j0401O889
2810A004M691j1350M774P787j1533J590J0456j0242k335J2185p540o724J2907
2823E670l668r105J0393j08r614Q428J725j0365P511M517j1646M819Q119j1431
2837d755J840J0196j0129k342J2083p152o004J1586l353q612J0305k51r614Q787
2851B585J879j0574P061M742j1319M758P767j1251J091J0409r483k421J1032o672
$$ y = [-785, -7232, 6590, 2172, -7360, 3656, 3891, -6935, 1889, 4753, -5817, 753, 4977, -5940, -582, 6535, -5220, -2393, 7578, -3661, -5243, 7514, -720, -7174, 5732, 2005, -7649, 3525, 3624, -6563, 1765, 4629, -5960, 660, 5359, -5700, -397, 6782, -4967, -2870, 7579, -2814, -5065, 7339, -462, -6749, 5896, 2065, -7000, 3560, 4136, -5977, 2180, 4516, -5885, 1004, 5695, -5655, -881, 6906, -4627, -3037, 7419, -2823, -5158, 7027, -513, -7237, 5670, 2002, -7103, 3290, 3182, -6432, 1996, 3721, -6644, 867, 5384, -6262, -1443, 6676, -4755, -2915, 7281, -2848, -5190, 6893, -259, -6263, 5323, 1970, -6642, 3663, 3412, -6202, 2585, 4464, -6110, 951, 5693, -5626, -868, 6899, -4352, -3261, 7148, -2335, -4756, 6276, -396]
2865c96n777J1624l521q365J0149m32r812Q746K334j0829O996N104j1320M099
2879a400Q296j1143N63J0616r060k992J0995o551n657J1509l492q431J0184j47
2893C290r811Q212K754j0925O848N498j1433L732Q552j0570K92J0068q249k936
2907d678J1135o510n532J1032l443q016J0158o35r710R029K646j1329O231N714
2921F092j0917L170Q195r937K63R755q920k417J0957o552n757J1010l523q186
2935f767J0600l50j0264Q498L066j1151O176O105j0994L196Q013r705Q3R561q186
2950b119k722J0785o491n509J1204l639q500J0785J39j0533Q443L289j0824N580
2964a12O064j0318K523Q517r514l52R540q176k197J0460o545n882J1330l349q775
$$ y = [-396, -6173, 5451, 1930, -6435, 3714, 3282, -6530, 2216, 4550, -6279, 717, 5821, -5499, -1400, 6896, -4247, -3684, 6932, -2128, -5120, 5875, -676, -6333, 5176, 1684, -6747, 3437, 3290, -6521, 1691, 4445, -6480, 368, 5866, -5567, -1835, 6717, -3853, -3561, 6507, -1742, -4678, 6457, -53, -5585, 5447, 2004, -6012, 4146, 3511, -6199, 2830, 5476, -5853, 378, 6092, -4825, -1655, 6540, -3397, -3134, 6621, -2299, -4716, 6241, -311, -6068, 4942, 1419, -6767, 3833, 3483, -6781, 1717, 4783, -6368, -192, 5913, -5081, -1885, 6128, -3577, -3494, 6067, -2119, -4841, 5944, -547, -6056, 5148, 1509, -6991, 3794, 3933, -6600, 1843, 5132, -5692, -112, 5952, -4366, -1843, 6674, -2840, -3192, 6348, -1828, -4025, 6435, -110, -5992, 5338, 1989, -6786]
2979f786J0580L45j0650Q157L273j0469N260N718r710K289P806r134K31R142q368
2994b316k407J0755o311n757J0941l073q724J0236N16j0539P868L713j0260M855
3008e03N715r711K643P183r107P95R132q361k515J1010o602n557J1272l296r040
3023f942J0223J030j0194O938M124r921M476N615r525K819P518r527R06Q517q047
3038a990k073J0470o907n711J1240l155q679R635J241j0246O922L581r619M799
3052d92N467r505K953P122r054M59Q965q311k505J0814o283o122J1440k144r565
3067f761R508J588j0322O681M029r575M734M933q783K957O693r064O58R349q893
3082b268k162J1066o619o281J1361k255r184Q962J663r922O569L388q790M306
$$ y = [-6786, 3794, 4139, -6511, 1646, 4919, -5550, -290, 5428, -4282, -1993, 5813, -3321, -3090, 6052, -2316, -4723, 6032, -279, -6036, 4905, 1832, -6892, 3344, 3860, -6679, 1189, 4902, -5358, -503, 5212, -4499, -1856, 5327, -3780, -2985, 6147, -2214, -4729, 6281, -321, -5878, 5394, 2098, -6942, 3281, 4311, -5883, 1055, 5179, -4742, -266, 5349, -4176, -1357, 6161, -3366, -2460, 6057, -1990, -4063, 6407, -500, -6211, 5029, 1874, -6805, 2830, 4071, -6175, 747, 4328, -5291, -492, 4975, -4530, -1577, 5545, -3509, -3050, 5915, -2396, -4901, 5913, -370, -6492, 4948, 2804, -6761, 2747, 4335, -5987, 694, 4723, -4852, -118, 4815, -3968, -1011, 5682, -3382, -2724, 6625, -2268, -4430, 6636, 17, -6264, 5097, 2842, -6342, 2620, 4283, -5639, 930, 4318, -4472, -166]
3096a66M782q996L255O845r412O88R431q756k886J1349n801o835J1007j889r257
3111f641Q633K023r291N531L452q247M666M492r320L534O829r628R92R544q386
3126a817l318J1233n358o972J0428j019q658P391K486r195N621L421q280L898
3140a39N063r269L325P045r768O39R809q641l449J1362n134p260J0442j095q774
3155e844P726J785q656N672K802p717M601L784r010L829O717r570K27J0141q439
3170a952l729J1356m870p083R879m52q946P370J991q045N477K686p888M737L892
3185D423r366M214O866r922J6J0540p945m225J1225m366p354R568o31p667O395
3200A771J761p686N457K171p923N365L373q992L508P182r817M8J0432p706m619
$$ y = [-166, 4616, -4380, -1125, 5720, -3692, -3004, 6427, -2329, -5215, 6134, 333, -6502, 4505, 2616, -6641, 1992, 4015, -5276, 255, 3707, -4540, 126, 4618, -4702, -1168, 5661, -3967, -2975, 6569, -1817, -5135, 6098, 740, -6232, 4196, 3177, -5481, 1910, 4396, -4799, 822, 4243, -4037, -139, 4924, -4345, -1020, 6025, -3743, -3104, 6705, -1936, -5385, 5977, 843, -6417, 4025, 2930, -5844, 1882, 3667, -4989, 683, 3485, -4232, 369, 4153, -4857, -1028, 5689, -3881, -3654, 6487, -1952, -5681, 5675, 805, -6278, 3601, 3149, -5797, 1573, 3564, -4481, 996, 3682, -4206, 531, 4423, -4943, -729, 6137, -3785, -3769, 6771, -1174, -5399, 5826, 1460, -5894, 3674, 3043, -4624, 1771, 3532, -4154, 1303, 3474, -4449, 916, 4289, -4703, -1195, 5987, -3830, -3782, 6650, -1056, -5675]
3215e675J0884m053p290R094k10p816O498R64o572N348J732p977N455M178r475
3230d915L611P565r554p85J0200o877m867J0598l370p081Q046L63p589O615R70
3245B930p144N745J685p824N590M275j0010K998Q216r475j124J0733o983m931
3259e319R688k578o626P591l62o860O276N86o759N810J803q293N542M274r437
3274d664K706Q604r427j812J0164o285m650R178k054o889P448n56o034O322J40
3289B191p042O180K230q472N445M695r950K473Q552q719j674R922n704n292R085
3304C920j895o276O601k22o197O361m2o320O103J850r037N219N589r924K201Q725
3320F656q486k931R638m312n430Q325j802o116O550l35n738O035m4o922O279K168
$$ y = [-5675, 5209, 1156, -6134, 2960, 2750, -5066, 1432, 2396, -4176, 1172, 2904, -5073, 382, 4560, -4915, -1304, 6261, -3293, -4078, 6122, -755, -5622, 4976, 1606, -5475, 2571, 2934, -4655, 1960, 2930, -4214, 1531, 3216, -4608, 982, 5257, -4753, -1755, 6461, -3014, -4138, 6595, -388, -5319, 4369, 1791, -4835, 2756, 2394, -4466, 1810, 2396, -4363, 1447, 3250, -5043, 499, 4773, -4664, -1958, 6646, -2781, -4593, 5571, -714, -5364, 3814, 1760, -5129, 2319, 1763, -4271, 2051, 2191, -4851, 1329, 3559, -4913, 532, 5227, -4723, -2250, 6302, -2417, -4091, 5831, 127, -5165, 3920, 2025, -4251, 2350, 2128, -4069, 2292, 2250, -4070, 2033, 3883, -5154, 65, 5654, -4270, -2069, 6656, -1830, -4761, 4877, 565, -4865, 3460, 1658, -4458, 2092, 1757, -3981, 2054, 2010, -4912, 1367, 3535]
3336C535q974N367N647j0156J632R198q025k839R409m440n135P967j667n212O392
3351B699j207n578O227J14p042O658K300r147M912N733r250J205Q636p762k808
3366d310R035l673n166P566j965n156O189j329n159O718m64p174O066K925r430
3381e327M901O194r384M37Q725p087k583Q398l883m822P249j893m687O227j157
3396A308n746O556J22p445O463L147r317L707O837q852J11Q870o881l192Q170
3411C858k921m345O251j855m404O467k051n266P085j40p770O423L310r382L848
3426h92O737q771k21Q382n888l177P653l479m071O626k646l907O548k109n671
3441d886P311K47p718N878L570r137L282O461p856l11Q062n761k936P159l261
$$ y = [3535, -5439, -72, 5575, -4581, -2949, 6249, -1776, -4615, 4794, 354, -4781, 3186, 1519, -3693, 2699, 1492, -4086, 2141, 2255, -4787, 1871, 4171, -4976, -64, 5669, -3581, -2376, 6260, -1502, -4310, 4725, 1052, -4114, 3452, 1487, -3669, 2520, 1191, -3968, 2750, 2286, -4888, 1178, 4103, -5327, -426, 5768, -3616, -3179, 5546, -1541, -4124, 4274, 391, -4431, 2818, 925, -3762, 2465, 1308, -4438, 2118, 2240, -5205, 1258, 4405, -4912, -1205, 5632, -3220, -3109, 5761, -1120, -4312, 3858, 937, -3408, 2843, 988, -3416, 3051, 1000, -4266, 2819, 2679, -5091, 1332, 4642, -4740, -892, 5845, -2926, -3147, 5235, -653, -3830, 3823, 344, -3727, 2899, 253, -3654, 2894, 785, -4886, 2425, 2672, -5046, 832, 4402, -4735, -1453, 5008, -2848, -3159, 4903, -858, -3794, 3365, 104]
3456A04l305N766k173l970O724k093n542O993O51q453O268L875q787K648O540
3471E246p645m05P253n041k661O800l239l614O496k716l652O456j917n712O652
3486B301J232q589N468M355q999K608O492o953r22P077m998k629O749l226l248
3501c282O272k870m118O701j427n936O750J049q455N278M434q332K186O506p099
3516b343m36O919m832k428O557l627k872O435l050m032P156k011o111O711J618
3531C654q123M858M223p977J997O193o810n68O439m391k372O484l545l197O531
3546C396k870m590P431j605o493O622J496p987M381M917q185J588N860n996m20
3561b455O251m860j847O563l928l299O701k898m178O745j058o235N943K107p787
$$ y = [104, -3201, 2565, 392, -3578, 3146, 1053, -4489, 2504, 3155, -5298, 970, 4845, -3942, -1294, 5246, -2399, -2804, 4449, -592, -3253, 3547, 308, -3306, 3190, 474, -3178, 3278, 1361, -4351, 2301, 3533, -5056, 412, 4767, -4232, -1624, 4868, -2085, -3007, 4070, -928, -3557, 3192, -34, -3282, 2990, 120, -3998, 2703, 1276, -4660, 2090, 3139, -5316, -38, 4396, -3936, -1750, 4756, -2343, -2779, 4140, -692, -3120, 3437, -190, -3062, 3373, 323, -3709, 3447, 1436, -4675, 2036, 3654, -4469, 389, 4612, -3365, -1368, 4825, -1985, -2553, 3886, -505, -2877, 3607, 62, -3135, 3396, 526, -4064, 3367, 1762, -4731, 1891, 3387, -4600, -219, 4698, -3487, -1899, 3961, -2035, -2455, 3796, -1064, -2911, 3652, -276, -3575, 3126, 228, -3950, 2795, 1737, -4498, 1445, 3552, -4235]
3576d235L901M751p411J384N761n789o67O051m779j748O885m003l178O745k731
3591I37m858O789o89o607O015K041p510L792M629p409J392N341n630k97N658n089
3607a495j091N782l471l236O871k639n336P254j123o094N596K100p194L548M441
3622C913o760J401N120n699j79N930n251j252O458m142k879O521k457n111O959
3637B572k66o536N595K105p087L493M211o820J578N274n948j50N842m817j650
3652b604O208l613l699O830k187m774O074j36o242N199K350p120L159M186o709
3667c078J800M793n457l41O005n195j478O496l956l280O791k185n136O286J35
3682B200o073M761K423o908L696L621o600J566N136n858k64O332n176j490O048
$$ y = [-4235, -334, 4417, -2994, -1610, 4151, -1638, -2305, 3746, -1033, -2781, 4104, 101, -3077, 3668, 937, -3921, 2868, 2179, -4428, 1587, 3628, -3882, -90, 4539, -2870, -1478, 3863, -1767, -2064, 3594, -1495, -2586, 3196, -275, -3511, 3360, 721, -4615, 2639, 1516, -4578, 1018, 3118, -4076, -528, 3913, -2847, -1446, 3674, -2025, -2204, 3726, -1525, -2777, 3681, -461, -3340, 3181, 724, -4387, 2572, 2306, -4230, 1365, 3470, -3617, -124, 4087, -2733, -1155, 4119, -1829, -1979, 3863, -954, -2604, 3604, -9, -3708, 3122, 935, -3839, 2235, 2099, -4143, 1056, 3406, -3714, -555, 3631, -3078, -1278, 3515, -1942, -2283, 3722, -1473, -2951, 3545, -411, -3691, 3100, 915, -4221, 2065, 2200, -3873, 888, 3311, -3597, 99, 3720, -2880, -1314, 3822, -2036, -2300, 4032, -1144, -2634, 3414]
3697C414l275l784O445j479n341O253J58o292M976J841o298K954M020o147J563
3712i92M946n659m69O020n052j727O547l681l482O236j433n172N510R84o595M966
3728I47J787o212L342L504o333J789M971o015k35O052m690j913O608l432l639
3743c469N843j218m735N483K64n812M526K113o264L089L747o255J577M980n861
3758a992j35O136m703k288O388l119l787O105j343m438M936J79n459M416K191
3773C087o544L175L689o446J512M830n197p73O380m478k228N738k539l846N861
3788B221j230m732N333L69n628M692J910o466L414L625o371J495N127n521n92
3803b354N825l912k768O257k702l852N994j303m573N430K9n528M287K302o336
$$ y = [3414, 139, -3645, 2800, 1321, -4020, 2233, 2391, -3901, 1075, 2916, -3382, -428, 3592, -2555, -992, 3954, -1705, -2174, 3846, -1206, -2933, 3614, -67, -3549, 2687, 1254, -3918, 1592, 2576, -4019, 947, 2734, -3478, -136, 3368, -2965, -1176, 3795, -2220, -2455, 3597, -1093, -3006, 3602, 170, -3469, 2374, 1156, -3579, 1904, 2168, -3644, 882, 2995, -3269, -180, 3567, -2688, -1111, 3869, -1992, -2127, 4009, -694, -2982, 3406, 287, -3500, 2605, 1262, -3176, 1760, 1939, -3520, 896, 3087, -3457, -282, 3407, -3039, -1527, 3303, -1894, -2667, 3713, -765, -2993, 2745, 206, -3640, 2221, 991, -3741, 1592, 1961, -3667, 1025, 2935, -3531, -117, 3508, -2863, -1368, 3759, -1762, -2354, 3471, -441, -3209, 3048, 346, -3506, 2488, 1185, -3388, 2042, 2071, -3457, 830, 3132, -3204]
3818c204K962L930o459J461N147n246j129N906l915k142N496k541l463N432j062
3833A173m212N155n45n248M959J848o600K916M056o321J163N358n122j162N595
3848C013l431k287N467k611l404N713j434m268N267j39n320M435K297o766L280
3863a88L959o003O96N447n279j110N955l885j902N152k288l317N293j327m466
3878c263N198k3n596M577K476o912K879M792o594O05N491m832j396N426l320k331
3894b823N448k694l006N638k109l861N317J22o057M684K826o967K712M579o124
3909b315M15N430m432j291M973k910k124N110k625k751N046j823m289N908lo260
3925c941M980K451o612K315M767n920K59N279m409j506M973l014j623M546k490
$$ y = [-3204, -242, 3688, -2771, -1310, 3837, -1409, -2538, 3368, -547, -2689, 2807, 266, -3197, 2235, 1173, -3039, 2116, 1571, -3677, 1282, 3130, -3470, -554, 3502, -2819, -1656, 3702, -1420, -2582, 3013, -418, -2705, 2762, 151, -3253, 2460, 1026, -3242, 2025, 1886, -3434, 1001, 3298, -3468, -188, 3771, -2232, -1536, 3911, -1368, -2478, 3477, -408, -2310, 2842, 554, -2763, 2530, 1203, -3263, 1935, 1912, -3684, 893, 3369, -3543, -664, 4128, -2466, -1861, 3630, -1202, -2598, 2828, -492, -2823, 2625, -69, -3075, 2563, 454, -3407, 1910, 2032, -4025, 659, 3485, -3482, -770, 3809, -2315, -1900, 3530, -902, -2193, 2780, -130, -2254, 2856, 231, -2520, 2526, 703, -3586, 2322, 2319, -3941, 1039, 3490, -3122, -807, 3960, -1960, -1701, 3578, -831, -2337, 2636, -378, -2001, 2545, 55]
3940E5l007N555j812m664N937N0o086M740K619o319J705M786n588O6N286m546
3956a223r58M896l463j578M744k623k751N659j719m653N747O21o500L974L217
3971C390o304J818M771n049p66N432l862j228M643l333j786N275k950l080N918
3986B889j405n349N740Q89o503L816L871o851J791M666m899n44M657l527j311
4001b070M488l044j441M674k631l258N830j582n041N804N82n975L573L218n684
4016b557J184M712m961j27M432l733r14M897l977j313N381l004l093O041j591
4031A377n189N473J274o261L137L564n807J162M773m955j00M342l933m76M393
4046B774l444j675N430k931l553O114j278n349N600J253o417L297L159n147O59
$$ y = [55, -2952, 2603, 791, -3873, 2064, 2114, -3972, 768, 3387, -2932, -1227, 3559, -2029, -1963, 3323, -1223, -2181, 2715, -748, -2326, 2418, -205, -2956, 2703, 984, -3669, 2078, 2699, -3801, 173, 3390, -2914, -1096, 3675, -1374, -2140, 3292, -570, -1798, 2845, -488, -2274, 3001, 51, -3029, 2889, 1484, -3865, 1875, 2764, -3739, 77, 3948, -2903, -1112, 3554, -1345, -1889, 2768, -759, -2070, 2418, -626, -2067, 2607, -24, -3282, 2548, 966, -4075, 1729, 2311, -3664, -91, 3127, -2557, -1373, 3339, -1622, -1749, 2683, -1050, -1964, 2933, -1044, -2357, 3024, 20, -3073, 2968, 1377, -3812, 1661, 2935, -3326, -189, 3375, -2432, -1270, 3503, -1452, -1552, 2790, -1143, -1619, 2774, -670, -2345, 3085, 154, -3399, 2715, 1437, -3912, 1688, 2941, -3476, -179, 2980, -2167, -1508]
4061a508M088m003l62M026l344k44L902l370j626N709l659k931N997j244n647
4076d216N151J954n883K608L437n150R43L881m044K93L752l932l39M679m104j319
$$ y = [-1508, 2580, -1423, -1785, 2241, -1103, -1347, 2555, -815, -2441, 3268, -391, -3322, 2675, 1431, -4216, 935, 2889, -2994, -386, 3051, -2099, -1156, 2725, -1319, -1026, 2726, -1206, -1545, 3134, -970, -2289]
$$ [...]
8191d57
##END NTUPLES=NMR FID
##END=
