##TITLE=1H_Pr 3780-3
 CDCl3+DMSO, 8 sc, 
 11.2.2019
##JCAMPDX= 6.0         $$ Bruker NMR JCAMP-DX V2.0
##DATA TYPE= NMR FID
##DATA CLASS= NTUPLES
##ORIGIN= UXNMR, Bruker Analytische Messtechnik GmbH
##OWNER= root
$$ XWIN-NMR		Version 3.5
$$ Mon Feb 11 15:33:39 2019 Russian Standard Time (UT+4h)  she@DPX200
##.OBSERVE FREQUENCY= 200.1313
##.OBSERVE NUCLEUS= ^1H
##.DELAY= (6, 6)
##.ACQUISITION MODE= SIMULTANEOUS
##.ACQUISITION SCHEME= undefined
##.AVERAGES= 8
##.DIGITISER RES= 18
##SPECTROMETER/DATA SYSTEM= spect
##.PULSE SEQUENCE= zg30
##.SOLVENT NAME= CDCl3
##.SHIFT REFERENCE= (INTERNAL, CDCl3, 0, 15.7039)
##AUDIT TRAIL= $$ (NUMBER, WHEN, WHO, WHERE, WHAT)
$$ ##TITLE= Audit trail, XWIN-NMR		Version 3.5
$$ ##JCAMPDX= 5.01
$$ ##ORIGIN= Bruker BioSpin GmbH
$$ ##OWNER= she
$$ F:/spectra/data/she/nmr/H-F/1/audita.txt
$$ ##AUDIT TRAIL=  $$ (NUMBER, WHEN, WHO, WHERE, WHAT)
(   1,<2019-02-11 15:32:25.92 +0400>,<she>,<DPX200>,
      <created by zg, POWCHK disabled, PULCHK disabled
       configuration hash MD5:
       00 E9 B6 7A A2 85 ED C7 34 08 36 98 17 FE 4E 26
       data hash MD5: 16K
       D9 2A EB 30 E3 8F CE C2 D6 EE 89 90 6B 0C 4F 0F>)
$$ ##END=
$$ 
$$ hash MD5
$$ F4 4B 3B 5C 36 6E DD AA 11 5B D5 8C 34 7D E8 AC
##$RELAX= 
##$RELAX= 
##$RELAX= 
##$RELAX= 
##$RELAX= 
##$RELAX= 
$$ Bruker specific parameters
$$ --------------------------
##$DU= <F:/spectra>
##$EXPNO= 1
##$NAME= <H-F>
##$PROCNO= 1
##$TYPE= <nmr>
##$USER= <she>
##$AMP= (0..31)
100 100 100 100 100 100 100 100 100 100 100 100 100 100 100 100 100 100 
100 100 100 100 100 100 100 100 100 100 100 100 100 100 
##$AQSEQ= 0
##$AQ_mod= 1
##$AUNM= <au_zg>
##$AUTOPOS= <>
##$BF1= 200.13
##$BF2= 200.13
##$BF3= 200.13
##$BF4= 200.13
##$BF5= 200.13
##$BF6= 200.13
##$BF7= 200.13
##$BF8= 200.13
##$BYTORDA= 1
##$CFDGTYP= 0
##$CFRGTYP= 5
##$CHEMSTR= <none>
##$CNST= (0..31)
1 1 145 1 1 1 1 1 1 1 1 1 1 1 1 1 1 1 1 1 1 1 1 1 1 1 1 1 1 1 1 1 
##$CPDPRG= <>
##$CPDPRG1= <>
##$CPDPRG2= <>
##$CPDPRG3= <>
##$CPDPRG4= <mlev>
##$CPDPRG5= <mlev>
##$CPDPRG6= <mlev>
##$CPDPRG7= <mlev>
##$CPDPRG8= <mlev>
##$CPDPRGB= <>
##$CPDPRGT= <>
##$D= (0..31)
0 1.2 0 0 0 0 0 0 0 0 0 0.03 0 0 0 0 0 0 0 0 0 0 0 0 0 0 0 0 0 0 0 0 
##$DATE= 1549884745
##$DBL= (0..7)
120 120 120 120 120 120 120 120 
##$DBP= (0..7)
150 150 150 150 150 150 150 150 
##$DBP07= 0
##$DBPNAM0= <>
##$DBPNAM1= <>
##$DBPNAM2= <>
##$DBPNAM3= <>
##$DBPNAM4= <>
##$DBPNAM5= <>
##$DBPNAM6= <>
##$DBPNAM7= <>
##$DBPOAL= (0..7)
0.5 0.5 0.5 0.5 0.5 0.5 0.5 0.5 
##$DBPOFFS= (0..7)
0 0 0 0 0 0 0 0 
##$DE= 6
##$DECBNUC= <off>
##$DECIM= 32
##$DECNUC= <off>
##$DECSTAT= 4
##$DIGMOD= 1
##$DIGTYP= 9
##$DL= (0..7)
0 120 120 120 120 120 120 120 
##$DP= (0..7)
150 150 150 150 150 150 150 150 
##$DP07= 0
##$DPNAME0= <>
##$DPNAME1= <>
##$DPNAME2= <>
##$DPNAME3= <>
##$DPNAME4= <>
##$DPNAME5= <>
##$DPNAME6= <>
##$DPNAME7= <>
##$DPOAL= (0..7)
0.5 0.5 0.5 0.5 0.5 0.5 0.5 0.5 
##$DPOFFS= (0..7)
0 0 0 0 0 0 0 0 
##$DQDMODE= 0
##$DR= 18
##$DS= 0
##$DSLIST= <SSSSSSSSSSSSSSS>
$$ [...]
##$SUBNAM2= <"">
##$SUBNAM3= <"">
##$SUBNAM4= <"">
##$SUBNAM5= <"">
##$SUBNAM6= <"">
##$SUBNAM7= <"">
##$SUBNAM8= <"">
##$SUBNAM9= <"">
##$SW= 20.0189088683792
##$SWIBOX= (0..15)
0 0 2 0 0 0 0 0 0 0 0 0 0 0 0 0 
##$SW_h= 4006.41025641026
##$TD= 16384
##$TD0= 1
##$TE= 0
##$TE2= 300
##$TE3= 300
##$TEG= 300
##$TL= (0..7)
0 120 120 120 120 120 120 120 
##$TP= (0..7)
150 150 150 150 150 150 150 150 
##$TP07= 0
##$TPNAME0= <>
##$TPNAME1= <>
##$TPNAME2= <>
##$TPNAME3= <>
##$TPNAME4= <>
##$TPNAME5= <>
##$TPNAME6= <>
##$TPNAME7= <>
##$TPOAL= (0..7)
0.5 0.5 0.5 0.5 0.5 0.5 0.5 0.5 
##$TPOFFS= (0..7)
0 0 0 0 0 0 0 0 
##$TUNHIN= 0
##$TUNHOUT= 0
##$TUNXOUT= 0
##$USERA1= <user>
##$USERA2= <user>
##$USERA3= <user>
##$USERA4= <user>
##$USERA5= <user>
##$V9= 5
##$VALIST= <valist>
##$VCLIST= <CCCCCCCCCCCCCCC>
##$VD= 0
##$VDLIST= <DDDDDDDDDDDDDDD>
##$VPLIST= <PPPPPPPPPPPPPPP>
##$VTLIST= <TTTTTTTTTTTTTTT>
##$WBST= 1024
##$WBSW= 4
##$XGAIN= (0..3)
0 0 0 0 
##$XL= 0
##$YL= 0
##$YMAX_a= 144925
##$YMIN_a= -221080
##$ZGOPTNS= <>
##$ZL1= 120
##$ZL2= 120
##$ZL3= 120
##$ZL4= 120
##$ABSF1= 10
##$ABSF2= 0
##$ABSG= 5
##$ABSL= 3
##$ALPHA= 0
##$AQORDER= 0
##$ASSFAC= 0
##$ASSFACI= 0
##$ASSFACX= 0
##$ASSWID= 0
##$AUNMP= <proc_1d>
##$AZFE= 0.1
##$AZFW= 0.1
##$BCFW= 1
##$BC_mod= 2
##$BYTORDP= 1
##$COROFFS= 0
##$CY= 11.3945322036743
##$DATMOD= 1
##$DC= 2
##$DFILT= <>
##$DTYPP= 0
##$F1P= 18.9103706918063
##$F2P= -1.10871071338519
##$FCOR= 0.5
##$FTSIZE= 0
##$FT_mod= 4
##$GAMMA= 1
##$GB= 0.15
##$INTBC= 1
##$INTSCL= 1
##$ISEN= 128
##$LB= 0.24
##$LEV0= 0
##$LPBIN= 0
##$MAXI= 10000
##$MC2= 0
##$MEAN= 0
##$ME_mod= 0
##$MI= 1.114404
##$NCOEF= 0
##$NC_proc= 0
##$NLEV= 6
##$NOISF1= 3.799351
##$NOISF2= 2.8
##$NSP= 1
##$NTH_PI= 0
##$NZP= 0
##$OFFSET= 15.70392
##$PC= 1
##$PHC0= -8682.497
##$PHC1= 14.00018
##$PH_mod= 1
##$PKNL= yes
##$PPARMOD= 0
##$PSCAL= 0
##$PSIGN= 0
##$REVERSE= no
##$SF= 200.130013532006
##$SI= 16384
##$SIGF1= 3
##$SIGF2= 2
##$SINO= 400
##$SIOLD= 16384
##$SREGLST= <1H.CDCl3>
##$SSB= 0
##$STSI= 0
##$STSR= 0
##$SW_p= 3612.71676300578
##$SYMM= 0
##$S_DEV= 0
##$TDeff= 0
##$TDoff= 0
##$TI= <>
##$TILT= no
##$TM1= 0
##$TM2= 0
##$TOPLEV= 0
##$USERP1= <user>
##$USERP2= <user>
##$USERP3= <user>
##$USERP4= <user>
##$USERP5= <user>
##$WDW= 1
##$XDIM= 8192
##$YMAX_p= 0
##$YMIN_p= 0
$$ End of Bruker specific parameters
$$ ---------------------------------
##NTUPLES= NMR FID
##VAR_NAME=  TIME,          FID/REAL,        FID/IMAG
##SYMBOL=    X,             R,               I
##VAR_TYPE=  INDEPENDENT,   DEPENDENT,       DEPENDENT
##VAR_FORM=  AFFN,          ASDF,            ASDF
##VAR_DIM=   8192,          8192,            8192
##UNITS=     SECONDS,       ARBITRARY UNITS, ARBITRARY UNITS
##FACTOR=    0.0002496,     1,               1
##FIRST=     0,             0,               0
##LAST=      2.0444736,     0,               0
##MIN=       0,             -221080,         0
##MAX=       2.0444736,     144925,          0
$$ Real data points
##PAGE= N=1
##DATA TABLE= (X++(R..R)), XYDATA
0 0 0 0 0 0 0 0 0 0 0 0 0 1 -8 8 -8 9 -16 16 -24 25 -32 40 -48 56 -64 73 -89 101 -115 134 -153 174 -198 225
34 225 -255 287 -323 360 -404 451 -501 558 -619 685 -758 838 -926 1022 -1125 1238 -1364
51 -1364 1505 -1658 1827 -2018 2234 -2475 2755 -3077 3456 -3906 4457 -5141 6026 -7212 8899
66 8899 -11501 16079 -26545 104774 -53144 -109361 111054 -29985 81850 129150 -92996
77 -92996 -46446 71866 -24093 75403 37772 -113636 13246 27694 -62470 80488 -32285
88 -32285 -177200 44100 61357 -62694 30765 -59706 -91513 104608 15212 -57298 68719
99 68719 -73071 -71494 140037 -6043 -69440 77869 -62131 -46108 144925 -21217 -92363
110 -92363 42302 -17983 25290 70058 -96679 -17560 76735 -58536 39472 73957 -117301
121 -117301 9309 93742 -67804 43803 75508 -103475 16667 79895 -42371 36446 -2614
132 -2614 -90205 76511 24888 -94792 59886 -5042 -95713 90227 15679 -101654 46592
143 46592 -23618 -80509 83300 -9740 -84897 39022 -27837 -7520 100366 -62013 -49468
154 -49468 101990 -35102 -29049 86000 -52443 -21393 88152 -34770 10549 78114 -52775
165 -52775 17015 67095 -53059 36245 27012 -113363 47577 71289 -106660 20474 51284
176 51284 -92921 32894 46353 -87869 17847 8767 -83325 39125 8468 -67798 45454
187 45454 -10906 -38468 96415 -19723 -74405 87060 1173 -50777 65260 -30078 -33603
198 -33603 81888 -34737 -20640 84421 -51780 -23139 77203 -61972 -11861 74094 -87972
209 -87972 -19759 94766 -57277 -22713 63377 -42278 12471 44718 -58324 26908 33831
220 33831 -67530 42672 33164 -70920 47086 19400 -75310 64328 21281 -94755 39318
231 39318 21687 -60631 38361 -16102 -52451 67557 -22316 -58765 73780 -19465 -50769 71917
243 71917 -25047 -35098 83339 -31246 -38233 81888 -17415 -26272 48894 -39543 6451 57434
255 57434 -68384 1807 66523 -65221 2815 57661 -66048 8699 43356 -75175 15915
266 15915 44606 -67370 17484 29605 -49080 46439 10102 -68319 62258 17405 -79812 48205
278 48205 13435 -63820 53419 5335 -51961 63004 -138 -49290 55478 -8771 -33954
289 -33954 48168 -39120 -24372 72587 -40992 -29295 74897 -30543 -20298 57599 -45283
300 -45283 -11039 51755 -60044 -9336 51033 -56302 3971 46081 -55598 23762 43935
311 43935 -73741 19964 48683 -65987 14669 34973 -49642 33942 24117 -47656 49742 18993
323 18993 -53343 44403 3885 -49750 48503 -13860 -50993 64180 -11593 -55381 57472 -8882
335 -8882 -38273 49233 -31162 -29837 58208 -39917 -28913 63865 -32749 -17477 55932 -40992
347 -40992 -2628 58329 -53246 -7188 56154 -46290 -2450 39057 -45632 20125 33906 -61256
359 -61256 23829 36075 -59893 21540 25521 -51356 35529 14992 -56784 48026 21115 -56027
371 -56027 38161 10294 -42671 44815 -7803 -43499 59283 -7174 -47688 51748 -9251 -34371
383 -34371 46030 -28734 -29154 54714 -34499 -30691 54762 -26586 -15987 43362 -41389 -2354 48442
396 48442 -53979 -6582 48836 -46501 1684 38781 -44683 23675 39215 -56936 23594 40518
408 40518 -53542 19520 26779 -44395 37053 18289 -50485 46326 22861 -48217 35748 5380
420 5380 -42550 39398 -15127 -48269 50490 -11075 -48577 43495 -11656 -31726 41890 -30335
432 -30335 -29249 50393 -33868 -29832 48907 -25015 -8313 48229 -34520 4237 56883 -41844
444 -41844 -3306 50386 -37236 569 33413 -41495 18779 34048 -51327 18455 31317 -49520
456 -49520 17428 15527 -50254 31824 12185 -56831 36957 21241 -44569 34588 10044 -32561
468 -32561 41893 -8518 -38104 50266 -9237 -38190 45484 -15324 -28646 48771 -28616 -31273
480 -31273 50137 -30334 -34331 40023 -27188 -15855 36428 -36249 -30 44339 -41681 2117
492 2117 46852 -37258 7729 39551 -39103 19918 41418 -41143 19681 35652 -38039 18689
504 18689 15874 -40002 31097 5240 -52996 36668 10230 -53411 31133 5591 -45368 31366
516 31366 -6825 -44611 36215 -5576 -35339 34444 -10791 -17629 42370 -26809 -16491 55133
528 55133 -29890 -24889 50355 -23211 -13693 44409 -27511 -1810 45408 -33445 -2404 36349
540 36349 -34713 6846 25017 -47190 19181 33177 -53376 16473 37567 -43446 11342 19751
552 19751 -38869 22481 8974 -42730 30307 9146 -36562 34845 282 -32859 46169 -8444
564 -8444 -45863 44933 -1344 -43358 32390 -4369 -23139 32403 -20844 -16946 40885 -27026
576 -27026 -18319 36787 -32123 -8503 41278 -38500 -3379 53556 -31437 -7586 44420 -21049
588 -21049 4293 26774 -30975 19275 25793 -43060 20928 27341 -41551 21528 16257 -48429 23607
601 23607 12921 -53159 17247 11879 -39569 17604 -3036 -27277 36410 -13235 -33942 46657
613 46657 -9501 -35167 44234 -7356 -24570 47819 -10598 -23141 45196 -9464 -17847 30693
625 30693 -19404 -2132 27701 -39102 3315 40562 -42646 -2819 39609 -38448 -1167 31541
637 31541 -39044 5615 31006 -35398 8674 23265 -27763 21771 11478 -35879 33137 9419
649 9419 -48903 28792 14339 -41765 24690 6618 -33892 27441 -2491 -30285 29934 -9357
661 -9357 -24671 31843 -20908 -18400 46980 -23228 -21610 52764 -17095 -24869 41699 -14228 -13946
674 -13946 32306 -22372 -3727 30502 -27309 5440 29295 -33551 12325 25691 -47165 12330
686 12330 31726 -46336 7248 29621 -34786 9355 15852 -29910 23098 6852 -37755 25760
698 25760 2867 -37909 31264 806 -35193 38920 1398 -38802 33919 5988 -27547 24772
710 24772 -6771 -13588 30590 -20793 -9102 44245 -22435 -12917 40928 -27570 -11879 40646
722 40646 -30983 -13700 38559 -26596 -12794 26325 -20669 6298 16391 -35633 16262 20764
734 20764 -44839 16110 26555 -38094 18440 20290 -38169 22888 21192 -34977 17575 11008 -26869
747 -26869 21018 -5862 -24528 39498 -9208 -35527 39786 -4915 -33933 33599 -6992 -25783
759 -25783 33025 -12999 -21353 33372 -10447 -7834 28484 -23927 773 33576 -37560 -2784
771 -2784 43335 -33315 -9227 35557 -27354 -2399 26868 -28567 3699 19999 -31432 8052
783 8052 12571 -29388 24290 10080 -38465 30335 16421 -41243 24195 16757 -32729 19778 3366
796 3366 -26724 28369 -1723 -23853 32121 -9073 -22726 33474 -17958 -22517 41249 -18581
808 -18581 -27901 38475 -10783 -19110 30067 -13888 -5558 25861 -27881 -1004 29001 -31207 3255
821 3255 27796 -35454 7916 30482 -39018 6162 31819 -34330 1514 19558 -26243 14121
833 14121 11310 -27942 26500 10270 -32632 28542 8951 -31519 29645 3063 -34389 29702
845 29702 3464 -31015 25584 -248 -21487 22008 -16196 -16392 30618 -24240 -18955 36666 -21560
858 -21560 -17516 35981 -20282 -9516 35968 -22809 -8756 32058 -19996 -1265 24389 -23296
870 -23296 12186 22478 -35602 15045 27615 -38068 9185 22026 -34887 11388 14858 -32677
882 -32677 18365 13210 -30317 18683 5481 -24268 26755 -4817 -28160 36145 -3936 -32841
894 -32841 34954 1203 -25648 28273 -8147 -20244 29061 -15973 -19017 28849 -17781 -12070
906 -12070 26824 -24497 -3496 34142 -30207 -7761 35668 -24992 -7047 26931 -21026 5903
918 5903 22682 -27723 12078 23881 -28599 13375 16299 -31077 20260 12641 -37308 22979 17456
931 17456 -34994 17136 10993 -26898 19983 -1902 -27372 27149 -5367 -28690 27910 -7047
943 -7047 -22117 30808 -14256 -21849 34847 -14667 -22382 30702 -12606 -12055 26916 -18729 -1055
956 -1055 32395 -24881 -498 33166 -25326 776 28594 -27730 6838 28262 -30779 5896
968 5896 25457 -27349 6702 13949 -28639 14089 6969 -34870 19628 9628 -33598 20013 6559
981 6559 -28837 24145 1701 -28389 27431 206 -25891 25931 -3329 -17515 29970 -11923
993 -11923 -17011 33868 -16283 -20461 31273 -16043 -15606 27740 -20184 -8345 30478 -22455 -5326
1006 -5326 29095 -22352 75 24007 -25251 9131 25633 -29503 11149 26167 -27272 11694
1018 11694 18575 -27682 15574 10298 -33824 17677 8550 -33177 17773 3262 -29818 22225
1030 22225 -2562 -30659 26501 -1951 -29195 25436 -2683 -19504 28792 -7896 -14538 33427
1042 33427 -11021 -14654 31491 -12169 -9534 27824 -19376 -4221 30453 -23392 -4313 29063
1054 29063 -23748 -2168 21992 -28106 4601 22250 -32031 6103 22494 -28943 7952 16657
1066 16657 -27335 14472 11316 -31873 17523 10569 -29331 18692 5995 -24821 23731 -906
1078 -906 -26657 27489 -1421 -25797 25021 -4911 -18049 28061 -11831 -14910 33817 -14080
1090 -14080 -16638 31032 -14675 -10971 27971 -20751 -7076 30445 -21808 -6228 27302 -20200
1102 -20200 -18 19817 -26545 6910 21567 -30623 7459 21714 -27370 9833 15756 -27255
1114 -27255 15106 12362 -30971 14695 9523 -26975 16766 2214 -23951 24469 -2259 -27406
1126 -27406 27893 -822 -25845 25243 -3772 -19465 28081 -8343 -15854 31589 -8803 -13465
1138 -13465 27428 -13630 -7241 27345 -21850 -6384 29630 -23170 -7148 26152 -21598 -2153
1150 -2153 19627 -25919 2912 17785 -28232 7240 16094 -27801 13841 14027 -29465 19672 15062
1163 15062 -32046 18002 14525 -28096 16845 8327 -22577 20952 1396 -22382 23819 -2411
1175 -2411 -21553 24196 -7864 -19499 27367 -11277 -18799 29711 -9527 -16001 25322 -12029
1187 -12029 -8228 23788 -19840 -4265 25894 -24084 -2530 26644 -24338 6 24812 -27105
1199 -27105 1291 23453 -26371 2233 19324 -21726 7989 11489 -21840 18382 9108 -27416
1211 -27416 21414 9294 -28523 20736 6292 -25742 23444 2985 -26484 21733 1155 -21178
1223 -21178 19537 -7938 -15600 24354 -15378 -16312 30826 -13498 -16149 29015 -13192 -11599 26900
1236 26900 -15282 -8102 24678 -16883 -3668 20355 -19005 4571 17950 -27339 7724 20588
1248 20588 -31568 5197 21769 -26393 5670 14983 -23494 12963 12517 -22731 15757 8034 -20500
1261 -20500 19535 557 -21852 28468 450 -27317 26227 2711 -24484 20297 -2711 -18636
1273 -18636 19399 -11499 -16535 21243 -13755 -11043 22802 -19046 -7628 27016 -22348 -7536
1285 -7536 30749 -18375 -7676 24546 -14678 1276 19508 -17817 8844 17767 -24330 9689
1297 9689 16183 -25714 13718 13742 -30257 14248 15222 -28495 11235 12230 -21701 11028 366 -19400
1311 -19400 19290 -3584 -20558 23869 -5432 -20995 25485 -6759 -20014 27266 -7191 -19961
1323 -19961 22778 -6683 -12528 20931 -10870 -4465 21173 -19915 -1806 25707 -21867 -2202
1335 -2202 25216 -22210 -1453 23483 -20621 1379 20756 -19334 3200 12022 -19254 12113
1347 12113 7809 -24150 18607 8080 -28634 19294 10213 -26237 17757 6982 -24484 16615
1359 16615 3214 -19743 17529 -2568 -15461 18909 -11071 -14413 24841 -14286 -17092 26373
1371 26373 -13071 -17386 23455 -9702 -9107 21642 -13127 -3532 20763 -14903 2589 20374 -18425
1384 -18425 7993 20835 -24821 8239 25038 -23994 3390 18823 -21274 3462 9759 -20922
1396 -20922 9520 4943 -23227 12547 942 -22821 18192 -1338 -24920 21780 411 -25122
1408 -25122 20697 3735 -17108 18486 -2094 -10274 21212 -9181 -9048 24654 -13101 -9521 24225
1421 24225 -16446 -7714 26290 -17127 -9484 23763 -14642 -7096 16459 -14492 2803 13429
1433 13429 -20513 8662 16088 -23051 10458 16122 -23659 10928 13745 -24758 10582 12988 -21774
1446 -21774 8834 6376 -17680 12624 -1973 -18255 19472 -4456 -22321 21267 -3082 -20249
1458 -20249 21579 -3702 -16666 21573 -4508 -13892 19499 -5758 -6422 18352 -12724 -1211
1470 -1211 22383 -17829 -2036 25231 -17909 -3663 21637 -17259 -1045 18071 -17466 1869
1482 1869 14168 -17518 5567 8565 -20364 12073 6763 -26129 13706 9200 -25842 12060 8474
1495 8474 -21518 12662 4295 -18183 14848 820 -14925 17400 -3536 -12064 22134 -7285
1507 -7285 -12523 25884 -7224 -14309 22604 -7133 -11449 18661 -9612 -6605 17100 -13767 -3110
1520 -3110 16482 -17568 -38 16890 -20852 1917 17916 -21583 1913 18655 -18248 2890
1532 2890 13682 -15745 7699 8513 -17547 12441 5705 -19760 14224 4176 -20397 16051 2013
1545 2013 -21488 16626 1310 -19796 14623 -226 -13947 15673 -6017 -9570 20296 -9113
1557 -9113 -9169 23025 -9696 -8554 21669 -11417 -6695 21143 -12385 -5860 18103 -12771 -2695
1570 -2695 13194 -16237 2789 12091 -21264 4679 14003 -21375 5151 12906 -19445 7725 10801
1583 10801 -19051 9738 9155 -16908 10855 4616 -14650 15190 169 -16726 18839 -373
1595 -373 -18251 17332 -988 -15134 16886 -4183 -12569 17930 -6063 -10308 17294 -8350 -6238
1608 -6238 17216 -13435 -4202 19791 -15058 -4619 19018 -14392 -3394 15116 -15440 731
1620 731 13492 -17594 2682 11975 -16916 6427 9608 -18091 10762 9461 -19347 11653 10078
1633 10078 -17723 11311 6347 -15478 13541 2499 -15279 15219 81 -15154 14761 -3834
1645 -3834 -13552 16496 -6834 -13628 17654 -6564 -12084 16829 -7418 -7534 16286 -10625 -4910
1658 -4910 17183 -12347 -2589 17282 -13221 -182 15638 -15387 1843 15083 -16633 1782
1670 1782 12799 -15753 4153 9542 -16485 8248 8025 -17681 10005 7024 -17009 11373 4706
1683 4706 -15944 14087 2786 -15583 15252 1330 -14194 14684 -2439 -12386 15627 -5941
1695 -5941 -11594 16439 -7694 -11085 16074 -8959 -7671 15651 -11582 -5323 16493 -12552 -3674
1708 -3674 16111 -12539 -840 14503 -14063 2569 13904 -15336 3330 12795 -15003 5256
1720 5256 10015 -14989 8878 8409 -16759 9906 7175 -16246 10284 4567 -15076 11928 1608
1733 1608 -15121 13261 -259 -14603 13077 -3192 -12770 14169 -6397 -12128 16122 -6776
1745 -6776 -11030 15740 -7030 -6990 15355 -9389 -3713 16586 -10643 -1880 16274 -11060 951
1758 951 14653 -13897 3367 14779 -15855 2275 12648 -14858 3497 8147 -15239 6943
1770 6943 6260 -16664 8499 5517 -15436 10392 2712 -14834 13373 1947 -15488 13654 1861
1783 1861 -12806 12820 -1483 -10220 13784 -6286 -10216 14980 -7936 -9848 14454 -9737 -7551
1796 -7551 15165 -10739 -6190 15928 -10216 -4354 13711 -9240 1491 12706 -11782 5382
1808 5382 13910 -13613 5847 13270 -14505 6312 10247 -15888 6366 8203 -15772 6260 4618
1821 4618 -14854 7533 51 -14790 11180 -1739 -15828 13423 -1302 -14284 13867 -1428
1833 -1428 -11900 14223 -2746 -9396 14497 -4236 -6382 14182 -7432 -3400 15426 -10993 -3395
1846 -3395 17112 -11855 -4062 15589 -10875 -2069 12992 -11493 564 11003 -11758 3511
1858 3511 8610 -13435 6634 7010 -16132 8479 7666 -16850 7716 7368 -15501 7364 4329 -13130
1872 -13130 8688 547 -11886 11124 -2022 -11244 13485 -4102 -11151 15746 -4545 -11329 15885
1885 15885 -4352 -9799 13160 -4776 -5265 12450 -8558 -2158 13493 -10961 -138 14508 -12452
1898 -12452 906 14995 -13169 963 14496 -12103 1239 10947 -11322 3430 5989 -12795
1910 -12795 7164 3614 -15485 8930 2789 -17244 9519 2561 -16604 9873 2102 -14971 9332
1923 9332 1517 -10353 10465 -1605 -6953 13971 -4803 -6715 17452 -5232 -7456 16517 -6101
1936 -6101 -6675 15352 -6867 -5642 12777 -7907 -3622 9331 -10856 1522 9326 -15278 2896
1949 2896 11384 -16129 2836 12313 -14332 3033 10107 -13258 4691 7683 -11373 6832 3752
1962 3752 -11648 9806 -189 -13000 13309 -18 -15395 12170 604 -13901 11438 -238
1974 -238 -10041 11179 -2871 -7285 12168 -4978 -3856 14222 -8536 -3640 16532 -9552 -4593
1987 -4593 17085 -8632 -5143 12997 -8971 -2799 10163 -9847 795 7397 -12950 3942 6794
2000 6794 -14953 6611 7899 -16819 5935 8424 -15010 5826 7461 -11792 6760 3071 -10189
2013 -10189 9881 195 -10069 12791 -2388 -11462 14642 -2461 -11501 15151 -1784 -10939 12201
2026 12201 -2446 -7017 11170 -5254 -3521 11378 -9843 -2062 13130 -11856 -1284 13641
2038 13641 -13202 -2617 12599 -12055 -1349 11054 -10903 223 7140 -10710 5533 5479 -12628
2051 -12628 8546 5402 -15338 9723 6604 -14219 9808 5384 -13464 8514 3498 -10847 8842
2064 8842 137 -8656 9831 -4719 -8162 14066 -5926 -9177 14995 -5489 -9353 13940 -5029
2077 -5029 -6312 12663 -6171 -4027 10807 -8003 -321 10410 -11555 1838 10969 -14677 1255
2090 1255 12296 -14178 642 10477 -12606 1777 7332 -10899 5287 4760 -11233 7670 2824
2103 2824 -11155 11700 1880 -12703 12924 2265 -13611 11381 2197 -10903 9650 -1413
2115 -1413 -8372 10416 -4774 -6750 11914 -7268 -6061 13178 -9250 -5759 15041 -8556 -5967
2128 -5967 13514 -7349 -3791 10668 -7992 264 9189 -10515 2782 8358 -12781 4923 8793
2141 8793 -14411 5047 8659 -14208 5316 8025 -12157 5824 4531 -10047 8285 1772 -10264
2154 -10264 11443 -372 -11280 12716 -1234 -11687 12633 -1960 -11783 11384 -2475 -9244
2166 -9244 10083 -4582 -5530 10112 -8035 -3203 12168 -9923 -2132 13443 -10410 -1249 13311
2179 13311 -10067 -527 12308 -9443 673 9417 -9775 3641 6897 -12238 6083 5792 -13887
2192 -13887 6767 5921 -14501 7198 4944 -13329 7211 3502 -11041 8140 1338 -9142 9993
2205 9993 -1229 -8237 12511 -3542 -8895 13536 -4428 -9252 13149 -4945 -7991 11591 -5902
2218 -5902 -5202 10846 -7806 -2772 10537 -9717 -648 11221 -11145 1264 11823 -11479 1649
2231 1649 11078 -10993 2429 9103 -10269 4134 6248 -11074 6510 4332 -12284 8084 2812
2244 2812 -12912 8816 1657 -13047 9734 1498 -11792 9198 -328 -9338 10165 -2608 -7499
2257 -7499 11728 -4531 -7160 12533 -5333 -6130 13093 -6718 -5020 12643 -7142 -3960 11491
2270 11491 -7344 -1500 10155 -9010 1353 9555 -11079 2693 9402 -12012 3283 8185 -12404
2283 -12404 4105 6902 -12796 4932 4977 -12094 6160 3180 -11477 8189 1036 -11479 10024
2296 10024 553 -10557 10826 -155 -9142 11510 -1675 -8046 11929 -2958 -6471 11101 -5235
2309 -5235 -5285 11690 -7530 -4365 11721 -8457 -3317 11199 -9097 -1762 10742 -9621 -272
2322 -272 10353 -9919 1669 9269 -10394 3808 7696 -11270 5166 6991 -12025 5675 5312
2335 5312 -11988 5926 3216 -11930 7097 1100 -11842 8257 206 -10427 9432 -1061 -9089
2348 -9089 11442 -1965 -7794 12102 -2885 -5923 12193 -4245 -4666 12197 -5716 -4030 11370
2361 11370 -7123 -3029 10676 -8882 -1679 9967 -10214 -597 8729 -11057 1174 7810 -11807
2374 -11807 2417 7277 -11439 4251 6268 -11539 5715 5456 -11230 6816 3834 -10736 8051
2387 8051 1796 -10400 9272 456 -9762 10134 -705 -9095 10419 -2129 -7861 10748 -3516
2400 -3516 -6700 11183 -4700 -4771 10993 -6228 -3814 11138 -7917 -2594 10889 -8828 -1843
2413 -1843 10160 -9189 -147 9288 -9921 1229 7626 -10279 2867 6294 -10909 4989 5382
2426 5382 -11656 5984 5159 -11574 6557 3334 -10976 7399 2142 -10037 8219 218 -8906
2439 -8906 9299 -1374 -8110 10904 -2725 -7511 11771 -3121 -6461 11376 -4133 -4977 10905
2452 10905 -5489 -3333 10080 -7125 -2085 9634 -8889 -679 8950 -10929 -300 9206 -11248
2465 -11248 511 7975 -10264 1567 6520 -10013 3906 5575 -9928 6377 4266 -10026 8221
2478 8221 3387 -10458 9121 2882 -10429 8538 1657 -9520 8394 -512 -8226 8974 -2956
2491 -2956 -7006 9898 -4793 -6076 10852 -5880 -5197 11610 -5551 -4384 10925 -5937 -2749
2504 -2749 9543 -7051 -456 8417 -8581 1253 7787 -10581 2146 7518 -11513 2805 7445
2517 7445 -11240 3169 6254 -10165 4093 4539 -8817 6363 2237 -8539 8508 872 -9018
2530 -9018 9814 88 -9663 10490 -481 -8894 9444 -1309 -7509 8689 -3165 -5388 9108
2543 9108 -5761 -3919 9596 -7232 -3044 10838 -7526 -2740 10580 -7572 -2139 9340 -7166
2556 -7166 -477 7444 -8021 1792 5974 -9628 4032 5605 -11057 5165 5544 -11502 5500
2569 5500 5747 -10432 5388 4305 -8834 6020 1716 -7316 8128 -653 -7359 9656 -2361
2582 -2361 -7824 10539 -2588 -8046 10232 -3206 -7230 8943 -3815 -5009 8350 -5162 -2766
2595 -2766 8384 -7201 -832 9462 -8421 -44 9866 -8814 167 9919 -8229 385 7889
2608 7889 -7773 1800 4987 -8384 4430 3613 -10082 6000 2963 -10796 7277 3022 -10748
2621 -10748 7244 2402 -9082 6779 1651 -7206 7189 -1183 -5911 8933 -3576 -5533 10402
2634 10402 -4540 -5843 10691 -5535 -5546 10252 -5086 -4306 8671 -5309 -1979 7188 -6721
2647 -6721 915 7337 -8405 2074 7839 -9829 2614 8177 -9765 2132 6708 -8996 2626
2660 2626 4899 -7919 4165 2394 -7987 5891 1083 -9012 8033 580 -9645 8514 807
2673 807 -9103 7994 386 -7569 7331 -1229 -5503 7358 -3917 -3668 8440 -6285 -3506 9681
2687 9681 -6569 -3603 10197 -6294 -3515 9096 -5763 -1321 7674 -5873 1064 6080 -7600
2700 -7600 3289 5885 -9199 4299 6137 -10191 3792 5566 -9872 3505 4026 -8881 4009
2713 4009 1934 -7641 5464 -365 -7228 7664 -1494 -7363 9314 -975 -7327 9598 -900
2726 -900 -6790 8597 -1509 -5077 7763 -3420 -3121 7510 -5904 -1665 7995 -7461 -1358 8689
2740 8689 -8085 -1547 8629 -7328 -714 7447 -6865 802 5491 -6560 3238 4436 -7770
2753 -7770 5140 3550 -9003 5505 3820 -9601 5406 3223 -9263 4949 1497 -7578 5360
2766 5360 -182 -6308 6916 -1976 -5537 8626 -3150 -5284 9649 -3335 -5188 9241 -3153
2779 -3153 -4200 8350 -3287 -2433 7304 -4981 -1002 6835 -6780 437 6797 -8456 820 7183
2793 7183 -8640 649 6687 -7958 1091 5089 -7268 2763 3577 -7334 4685 1846 -7754 6132
2807 6132 1360 -8170 6907 1378 -8416 6935 1056 -7184 6378 -9 -5541 6763 -2023 -3918
2821 -3918 7860 -3630 -3299 8795 -4771 -3329 8976 -4786 -3333 8238 -5143 -2442 6698
2834 6698 -5636 -744 5515 -6773 915 5077 -7720 2167 5295 -8406 3172 5583 -8175
2847 -8175 3195 4434 -7339 3835 3068 -6879 4919 1488 -6587 6056 -87 -6897 7021 -784
2861 -784 -7207 7493 -836 -6497 7081 -1413 -5132 6696 -2217 -3367 7025 -3678 -2301 7641
2875 7641 -4934 -1533 7828 -6011 -1482 7734 -6365 -1235 6607 -6265 -283 5076 -6660 799
2889 799 3938 -7336 2537 4076 -7703 3834 3708 -7800 4851 3537 -7181 5018 2706 -6362
2903 -6362 5219 1239 -5701 6051 -570 -5493 6878 -1883 -5528 7302 -2552 -5437 7315 -2835
2917 -2835 -4636 7061 -3281 -3313 6714 -4163 -1659 6727 -5378 -758 6549 -5942 -259 6297
2931 6297 -6632 317 6016 -6832 551 4952 -6635 1816 4085 -6631 3399 3056 -6882 4691
2945 4691 2775 -6867 5375 2021 -6644 5557 1394 -6144 6011 319 -5790 6025 -1026 -5143
2959 -5143 6127 -2528 -4596 6757 -3325 -3989 6946 -3595 -3182 7079 -4035 -2174 6413 -4511
2973 -4511 -1044 6415 -4978 93 5992 -5889 991 5182 -6588 1528 4718 -6986 2223 4073
2987 4073 -6778 2771 3345 -6719 3553 2279 -6360 4622 2047 -6247 5367 997 -5848 5918
3001 5918 -41 -5401 6404 -992 -5063 6126 -1944 -4176 5965 -3478 -4038 6276 -3575 -3031
3015 -3031 6118 -4123 -2231 6231 -4784 -1164 6309 -4831 -137 6078 -5376 1057 5279 -6070
3029 -6070 1688 4573 -6227 2454 4077 -6405 3094 2702 -6657 3670 1913 -6367 4538 1418
3043 1418 -6141 4996 477 -5908 5671 31 -5726 5679 -907 -4510 5994 -1974 -4123 6118
3057 6118 -3267 -3501 6523 -3460 -2420 6248 -4036 -1712 6338 -4319 -1023 5946 -4770 -80
3071 -80 5411 -5052 1005 5106 -6040 1589 4376 -6372 2005 3748 -6487 2604 2936 -6545 2934
3086 2934 2100 -6073 4039 1053 -5450 5217 108 -5535 6004 -114 -5460 5876 -691 -4657
3100 -4657 5973 -1489 -3851 6117 -2198 -3178 5975 -3350 -2207 5897 -4671 -1693 6198 -4813
3114 -4813 -1139 6005 -4690 -293 5584 -4625 687 4818 -4778 1953 4312 -5592 2645 3364 -6242
3129 -6242 3762 2876 -6844 3193 2108 -6442 3310 1177 -5988 3637 -21 -4938 4530 -558 -4365
3144 -4365 5594 -1461 -4284 6873 -1430 -4153 6490 -2058 -3496 6040 -2293 -2250 5585 -3418 -1433
3159 -1433 5101 -4649 -513 5417 -5619 -358 5233 -5670 206 4961 -5337 669 4057 -5290
3173 -5290 1389 2916 -5526 3192 1851 -6043 3939 1684 -6351 4303 1513 -6115 4591 785
3187 785 -5470 4600 123 -4383 4507 -1121 -3209 5464 -2393 -2883 6177 -3123 -3230 6509 -3034
3202 -3034 -2711 5976 -2986 -2030 5327 -3621 -960 4523 -4420 620 4399 -5539 1354 4449 -6157
3217 -6157 1721 4979 -5945 1710 3879 -5419 2220 2446 -4916 3043 1488 -4771 3761 331 -5345
3232 -5345 5062 175 -5958 5388 340 -5358 5005 -238 -4265 4900 -969 -2802 5220 -2198
3246 -2198 -2060 5770 -3733 -1861 5877 -4058 -1967 6423 -4387 -1860 5080 -4363 -699 3928 -4532
3261 -4532 501 3224 -5242 1983 3360 -5747 2670 3333 -6464 3148 3505 -5749 3079 2555 -4914 3120
3277 3120 1312 -4168 4063 -305 -4344 5105 -1492 -4711 5839 -1186 -4657 5609 -1454 -4346
3291 -4346 5387 -1570 -2789 4732 -2179 -1549 4806 -3616 -329 5578 -4695 -282 5247 -5285 -168
3306 -168 5214 -4858 -263 4207 -4776 481 3002 -4607 2116 1904 -5211 3525 1990 -5761 3954
3321 3954 2064 -5570 4375 1768 -5070 3957 737 -4355 4004 -231 -3549 4413 -2021 -2911 5298
3336 5298 -2901 -3183 6003 -2731 -3138 5602 -2435 -2621 4621 -2817 -1414 4426 -3325 -281 4125 -4505
3352 -4505 768 4303 -5792 1092 4481 -5663 766 4139 -5201 1496 3090 -4716 2378 1905 -4372
3367 -4372 3566 992 -4687 4641 759 -4915 5165 441 -5183 4693 221 -4145 4040 -915 -3510
3382 -3510 4183 -2163 -2448 4895 -3508 -2186 5244 -3477 -1697 5864 -3764 -1779 5598 -3344 -1279
3397 -1279 4362 -3287 300 3425 -4405 1440 3151 -5285 1826 3323 -5870 2088 3214 -5798 2378
3412 2378 2808 -4977 2271 1894 -4042 3382 440 -4127 4681 -597 -4244 5184 -666 -4466 5297
3427 5297 -1054 -4413 4813 -1186 -3380 4293 -1893 -2055 4296 -3141 -1299 4755 -4178 -625 5124
3442 5124 -4242 -770 5203 -4089 -292 4403 -3982 559 3698 -3867 1316 2395 -4487 2703 2341
3457 2341 -5193 2967 2157 -5495 3195 2016 -5051 3080 1376 -4497 3663 557 -3637 4201 -1067
3472 -1067 -3262 4459 -1928 -3252 5307 -2014 -3834 5034 -2205 -3257 4898 -2391 -1843 4011 -3160
3487 -3160 -856 4159 -3349 284 4363 -4243 716 4579 -4512 803 4572 -4223 812 3431 -4409
3502 -4409 1332 2191 -4567 2431 1375 -4728 3181 667 -4877 3710 897 -5167 4158 351 -4256
3517 -4256 4263 196 -3193 4005 -1102 -2624 4680 -2194 -2366 4996 -2657 -2433 4943 -3172 -2098
3532 -2098 4408 -3241 -1630 4170 -3387 -831 4009 -3844 184 3631 -4119 1211 3747 -4607 1534
3547 1534 3497 -4748 1815 2703 -4511 2026 2403 -4421 2466 820 -4465 2949 232 -4464 3820
3562 3820 -114 -4200 4233 -162 -3868 4389 -594 -3223 4351 -1165 -2661 4319 -1975 -1626 4601
3577 4601 -2865 -1390 4710 -3459 -1236 4589 -3488 -698 4154 -3696 18 3807 -3735 658 3347
3592 3347 -4068 1079 2683 -4465 1939 2248 -4905 2257 2092 -4785 2620 1458 -4463 3054 898
3607 898 -3907 3460 -37 -3593 3851 -261 -3372 4246 -911 -2859 4483 -1312 -2903 4643 -1640
3622 -1640 -1990 4152 -2486 -1327 4361 -3417 -932 4043 -3548 -643 4037 -3882 179 3670 -3767
3637 -3767 711 3576 -3837 1002 2914 -3792 1796 2390 -4058 2284 1831 -4559 2822 1210 -4158
3652 -4158 3054 563 -4244 3151 26 -4081 3879 -421 -3354 4110 -970 -2835 4444 -1170 -2384
3667 -2384 4624 -1492 -1434 4488 -2127 -1313 4302 -2754 -965 3661 -3359 -907 3424 -3929 -15 3087
3683 3087 -3973 492 2932 -4243 1072 2357 -4127 1780 2381 -4267 2440 1942 -4130 2622 1320
3698 1320 -4090 2933 797 -3607 3513 160 -3365 3697 -507 -3046 3759 -1018 -2744 4017 -1451
3713 -1451 -2407 4133 -1698 -1909 3927 -1888 -1266 4000 -2784 -823 3823 -3113 -151 3536 -3763 16
3729 16 3372 -3767 251 3328 -3810 728 2304 -3901 1477 1847 -3915 2076 1761 -4054 2649 1323
3745 1323 -3660 3229 623 -3990 3140 397 -3222 3277 -258 -2549 3693 -634 -2604 4112 -1233
3760 -1233 -2305 4073 -1778 -1593 3942 -2355 -1810 3864 -2463 -1319 3515 -2645 -565 3026 -3240
3775 -3240 330 2961 -4055 654 2866 -4290 979 2265 -3867 1373 2370 -3702 1761 1728 -3397 2255
3791 2255 1244 -3038 3011 585 -3300 3482 104 -3408 3362 -252 -3270 3539 -520 -2636 3358
3806 3358 -1295 -2059 3191 -1991 -1396 3597 -2483 -1299 3941 -2746 -1047 3849 -2575 -393 3134
3821 3134 -3033 -94 2753 -3092 516 2449 -3506 943 2175 -3896 1717 1936 -4290 1815 1728 -3602
3837 -3602 1878 1418 -2942 2414 851 -2695 3008 -68 -2562 3459 -457 -2665 3691 -670 -2846
3852 -2846 3462 -1020 -2489 3132 -1287 -1743 2967 -1837 -1127 3058 -2616 -507 3263 -2909 -235
3867 -235 3396 -3211 -130 3377 -3125 -158 2678 -2942 559 2020 -2944 1620 1543 -3506 2131 1672
3883 1672 -3534 2561 1410 -3481 2676 891 -3402 2588 769 -2725 2806 -115 -2219 3250 -1312
3898 -1312 -2076 3563 -1587 -2353 3821 -1590 -1908 3459 -1653 -1577 3155 -1794 -1196 2965 -2347 250
3914 250 2658 -2785 465 2859 -3234 937 3048 -3082 646 2215 -3434 975 1830 -3079 1332
3929 1332 1165 -2943 1823 479 -2913 2560 286 -3270 3128 395 -3109 3304 313 -2356 2577
3944 2577 -245 -1864 2707 -884 -1475 2952 -1847 -1181 3385 -2171 -1328 3432 -2248 -1436 3138 -2149
3960 -2149 -650 2528 -2323 145 2357 -2642 948 2110 -2762 1475 2099 -3276 1333 2193 -3358
3975 -3358 1250 1562 -3122 1156 764 -2652 1607 158 -2452 2736 -84 -2644 3104 -292 -2710
3990 -2710 3096 -419 -2541 2877 -626 -1709 2644 -1167 -1084 2524 -1863 -808 2925 -2436 -814
4005 -814 3092 -2488 -285 3099 -2331 -382 2804 -2540 184 1945 -2103 896 1467 -2849 1223
4020 1223 1343 -3348 1813 1202 -3165 1806 1092 -3266 1903 777 -2487 1727 2 -2120 2371 -291
4036 -291 -1937 3238 -913 -2061 3245 -1015 -2120 3237 -942 -1944 2957 -1264 -1173 2076 -1657 -678
4052 -678 2057 -2483 -327 2520 -2806 252 2373 -3051 548 2428 -2461 412 1732 -2542 1308
4067 1308 1189 -2454 1459 937 -2547 1790 494 -2861 2189 339 -2803 2259 340 -2561 2021
4082 2021 65 -2131 2221 -516 -1641 2777 -926 -1276 3321 -1652 -1047 3267 -1433 -1247 2986 -1881
4098 -1881 -1024 2396 -1835 -270 1846 -2199 102 1773 -2452 607 1851 -2770 500 2043 -2944
4113 -2944 947 1671 -2409 900 871 -2264 1437 673 -2137 2089 319 -2266 2520 24 -2133 2600
4129 2600 -114 -2026 2624 -120 -1781 2252 -697 -1473 2405 -1400 -852 2544 -1636 -774 2855 -2038
4145 -2038 -786 2526 -2156 -283 2304 -2052 -257 1744 -2121 393 1404 -2410 803 1437 -2698
4160 -2698 1541 1758 -2464 1209 1277 -2451 1649 973 -2107 1762 441 -2005 1618 -91 -1585 1991
4176 1991 -411 -2003 2540 -954 -1858 2247 -863 -1387 2143 -1044 -885 2293 -1191 -768 2247 -1603
4192 -1603 -347 2310 -2014 -75 1988 -2164 -118 1903 -2148 94 1604 -2084 485 1411 -2307
4207 -2307 845 1113 -2427 1565 780 -2224 1824 440 -2139 1827 627 -2223 1870 164 -1888
4222 -1888 1986 -182 -1650 2215 -535 -1644 2124 -1216 -1241 2112 -1211 -1117 2493 -1161 -1082 2078
4238 2078 -1218 -504 2101 -1501 52 2002 -2089 140 1796 -2124 775 1571 -2420 937 1262 -2196
4254 -2196 971 1146 -2139 1241 663 -1870 1742 273 -2098 1861 271 -1909 1762 -207 -1691
4269 -1691 1949 -310 -1627 2094 -463 -1644 1772 -1056 -1307 1937 -1210 -590 2032 -1349 -537 2142
4285 2142 -1550 -463 2127 -1838 -4 2046 -1892 257 1596 -2114 508 1237 -2182 882 1370
4300 1370 -2028 1005 1071 -2103 1225 824 -2051 1517 539 -1910 1496 451 -1626 1626 -117 -1652
4316 -1652 1781 -253 -1550 1966 -575 -1270 1779 -783 -998 1987 -982 -894 1932 -1359 -861 1882
4332 1882 -1490 -447 1944 -1594 68 1712 -1926 313 1633 -1807 672 1191 -2021 555 1216
4347 1216 -2006 875 1000 -2115 887 487 -1566 1386 174 -1870 1529 -101 -1721 1665 -141
4362 -141 -1332 1930 -63 -1779 2253 -169 -1420 1799 -1020 -1014 1923 -1001 -941 1948 -1226 -650 1748
4379 1748 -1608 -194 1790 -1415 26 1941 -1690 222 1503 -1639 556 1108 -1524 929 836 -1847
4395 -1847 937 870 -1782 817 634 -1754 1423 389 -1521 1246 293 -1524 1455 -228 -1488 1772
4411 1772 -392 -1477 2042 -459 -1183 1642 -808 -1076 1669 -938 -761 1653 -1246 -564 1462 -1460
4427 -1460 80 1741 -1808 93 1609 -1748 253 1580 -1611 449 1153 -1463 803 806 -1557 958
4443 958 876 -1954 1207 495 -1899 974 -66 -1697 1244 345 -1677 1432 -30 -1235 1676 -410
4459 -410 -1333 2040 -428 -796 1718 -923 -829 1957 -939 -702 1858 -1024 -500 1421 -1279 -194 1425
4476 1425 -1393 -60 1285 -1423 281 1355 -1814 568 1149 -1672 625 958 -1377 398 1033 -1437
4492 -1437 1009 613 -1478 1266 24 -1621 1470 169 -1605 1280 -105 -1269 1482 -376 -1398
4507 -1398 1523 -223 -939 1515 -755 -594 1692 -950 -548 1553 -1170 -600 1626 -1343 -584 1576
4523 1576 -1314 -127 1229 -1401 -29 1245 -1725 549 1107 -1638 887 1069 -1894 1068 1135 -1757
4539 -1757 939 741 -1290 843 346 -1223 1026 -86 -1199 1353 -498 -1214 1691 -463 -1287 1549
4555 1549 -617 -1327 1580 -444 -777 1474 -849 -388 1392 -1271 9 1354 -1048 12 1465 -1812
4571 -1812 84 1641 -1543 13 1203 -1296 -84 693 -1334 694 652 -1445 928 611 -1387 1160
4587 1160 401 -1630 1119 282 -1273 1277 274 -1239 942 -171 -1050 1161 -592 -807 1308 -582
4603 -582 -848 1489 -648 -567 1702 -649 -625 1552 -790 -472 1349 -958 -113 1150 -1298 134 1382
4620 1382 -1138 -94 945 -1633 365 953 -1381 528 700 -962 745 358 -1086 910 107 -1436
4636 -1436 1039 338 -1385 1251 209 -1075 1158 176 -1213 1581 -11 -870 991 -495 -699 1063
4652 1063 -932 -881 1697 -1041 -254 1613 -657 -400 1167 -777 -168 1198 -912 246 1046 -1201
4668 -1201 247 722 -1459 215 488 -1489 626 727 -1384 388 836 -1096 537 76 -1106 646
4684 646 102 -1038 992 -107 -920 1444 75 -1145 1339 -342 -1084 1477 -331 -815 886 -634
4700 -634 -465 1012 -772 -273 1260 -749 -270 1318 -1148 -89 1382 -996 12 1185 -1105 -29
4716 -29 1210 -653 296 662 -1216 563 458 -1288 778 703 -1412 594 479 -1351 800 644 -1146
4733 -1146 658 -76 -806 1124 -266 -830 1300 -228 -994 1277 -512 -876 1212 -470 -917 1318
4749 1318 -543 -456 887 -800 -7 894 -893 194 1151 -1084 224 1023 -1310 25 980 -1109 430
4766 430 939 -718 337 409 -1086 489 294 -1102 804 149 -1102 1065 182 -1273 1171 89 -903
4783 -903 994 2 -818 889 -36 -786 858 -469 -623 964 -731 -449 1271 -1013 -548 1352 -820
4800 -820 -385 1010 -670 -163 857 -893 235 660 -758 182 735 -1137 187 715 -1178 554 991
4817 991 -1106 418 520 -1284 566 263 -1022 1015 97 -1179 906 55 -887 1057 48 -993
4833 -993 926 -244 -843 800 -191 -487 1085 -316 -565 1193 -493 -606 936 -654 51 911 -747
4850 -747 -506 1000 -787 -232 976 -935 309 974 -573 507 591 -958 507 731 -1073 534 480
4867 480 -1026 534 436 -825 817 183 -845 426 -244 -1170 879 155 -604 1053 -144 -579 946
4884 946 -357 -606 895 -319 -524 946 -425 -162 768 -695 -340 841 -764 -3 970 -657 -100
4901 -100 813 -1098 73 740 -925 206 627 -961 343 276 -910 355 88 -1084 546 325 -841
4918 -841 825 252 -915 759 317 -802 972 -25 -550 869 -165 -724 769 -278 -788 716 -344
4935 -344 -421 1160 -412 -125 809 -542 61 647 -528 16 636 -713 80 631 -1074 -275 695 -634
4953 -634 43 461 -702 306 481 -620 526 458 -490 393 87 -814 672 269 -1080 757 -22 -736
4971 -736 692 42 -454 775 -32 -667 761 -358 -648 934 -23 -695 1083 -359 -467 714 -588
4988 -588 -299 834 -386 -16 782 -825 -269 405 -952 161 471 -925 309 546 -857 181 295
5005 295 -684 361 283 -670 519 132 -699 578 320 -754 449 -116 -844 715 -84 -613 606 -166
5023 -166 -528 699 -351 -629 507 -351 -375 782 -354 -170 828 -444 -79 482 -279 -242 546 -684
5041 -684 -162 603 -609 -58 654 -784 174 447 -746 348 293 -519 -44 380 -643 109 216 -562 283
5060 283 304 -443 648 -127 -782 735 -87 -382 609 -362 -638 558 -439 -233 819 -384 -377 570 -401
5079 -401 -200 712 -449 -8 712 -377 -231 691 -425 -83 282 -321 99 465 -601 165 659 -786
5097 -786 430 536 -496 558 365 -474 275 419 -534 452 43 -335 759 107 -121 742 51 -498 495
5116 495 -223 -346 458 -378 -549 578 -294 -462 519 -492 -21 683 -416 -105 645 -411 -102 365 -531
5135 -531 86 439 -436 101 620 -481 207 222 -503 154 71 -466 339 233 -551 363 230 -499 381 143
5155 143 -660 224 95 -564 513 -27 -531 345 -248 -371 383 -442 -211 577 -98 -382 479 -129 -83 586
5175 586 -274 131 300 -402 211 628 -489 106 422 -413 197 488 -429 -41 586 -155 133 458 -608
5194 -608 338 422 -385 192 198 -745 595 285 -508 329 137 -424 703 -283 -326 570 -142 -98 486 -94 -334
5215 -334 589 -304 -22 609 -356 -22 621 -454 -392 363 -378 -197 689 -175 2 397 -245 215 351 -463
5235 -463 295 231 -546 260 43 -458 194 142 -678 542 48 -637 206 -55 -223 361 -137 -292 456 -260
5255 -260 -594 362 -183 -347 394 0 18 71 -286 -108 320 -15 -290 213 -441 -153 444 -88 -190 271 -35
5276 -35 -107 643 -338 -169 385 -406 2 539 -494 337 213 -567 285 31 -383 194 -59 -530 127 148 -287
5297 -287 340 148 -244 412 -220 -211 552 -194 -23 522 -35 -71 289 -425 -292 456 -199 65 178 -264 -69
5318 -69 417 -107 -257 415 -289 -112 135 -178 101 52 -318 -41 186 -201 -34 -89 -300 207 363 -155 172
5339 172 96 -725 330 -55 -332 126 -83 -215 134 50 -406 344 -57 -463 240 139 139 402 -437 -112 -22
5360 -22 -4 -166 364 -236 -174 232 -519 -407 328 -295 223 283 -276 178 248 -61 -70 200 -213 411 346 -447 233
5383 233 -27 -414 -44 226 -101 23 153 -51 247 -66 -139 135 -129 -344 34 256 -23 194 -126 -81 139
5404 139 -316 -23 -66 -83 65 216 -82 -103 276 -244 -252 152 -194 40 307 -186 149 295 -327 35 95 -121
5426 -121 152 1 -420 266 25 -211 76 55 -213 200 122 -468 85 27 -392 152 -24 -46 158 -18 -154
5447 -154 86 -129 -47 266 -108 -174 420 -92 125 159 -344 -32 10 -347 281 126 -100 -51 113 -231 42 268
5469 268 -351 213 30 -219 -32 54 -218 271 13 -136 111 92 -23 258 -22 -358 259 37 147 123 -13
5490 -13 -69 208 -225 65 246 -24 85 93 -184 -338 37 22 -70 208 169 134 94 151 -20 200 -242 -93 114
5513 114 -338 41 205 -151 172 39 -35 17 229 -456 -4 -203 303 -92 -76 6 181 -303 75 135 -233 -272
5535 -272 256 9 -131 193 -39 272 0 -112 -39 50 -77 -28 0 -413 15 104 -202 9 -10 -185 -90 72
5557 72 -117 -182 349 -57 -106 -10 260 -117 20 -82 -181 -215 -90 -127 222 -83 99 118 203 147 209 104 315 -63
5581 -63 -67 227 -141 63 219 -177 -155 -42 19 209 8 -135 32 -83 -308 -50 87 -260 -34 87 -251 193
5603 193 50 -46 -78 38 -89 279 250 291 132 232 9 -177 -137 -116 294 -50 101 206 -22 -208 91 230
5625 230 140 83 -232 -114 -94 6 226 -103 -88 4 122 -328 75 202 79 89 222 -246 -130 371 6 -80
5647 -80 -34 -165 57 -90 -130 -106 286 197 34 56 -277 92 -330 -47 140 160 148 221 -42 -354 436 -157 63
5670 63 12 -4 -35 -69 -35 16 266 -307 -57 -177 -205 136 26 35 89 278 52 -82 59 142 -37 70 129 -25
5694 -25 91 22 21 66 123 78 327 -369 -19 -82 18 -47 242 211 -344 -208 13 59 105 86 216 -86 49 339
5718 339 -25 -54 -92 -118 -113 37 -74 108 -194 78 -4 -9 -86 -130 50 343 -76 -155 156 -59 23 -136 22 182
5742 182 387 257 -309 -58 250 18 64 45 -182 -85 -81 114 -56 -134 56 120 -122 -93 -34 116 -42 159 67
5765 67 149 -115 89 101 35 50 42 151 -223 120 110 120 -57 -29 -27 97 24 -115 140 4 37 186 21 61 134
5790 134 -58 -131 108 145 -286 -11 -142 -59 135 -101 -112 -91 -62 -66 108 -73 -122 125 -93 -230 138 83 -87
5813 -87 95 73 -95 93 8 -33 56 -38 28 -155 6 -15 295 -27 -192 107 115 106 229 -305 -89 169 -84 84
5837 84 -31 -92 224 103 -249 -14 69 -72 39 -86 187 132 -51 -146 275 63 -122 148 -177 124 93 -203
5859 -203 37 -73 39 -344 115 -70 -159 -16 129 -65 14 -101 50 25 39 130 -3 -274 217 -82 70 17
5881 17 -265 328 94 168 -228 -225 271 -190 -112 126 -153 75 114 87 -140 -183 -184 -92 -233 -266 130 -278 -11 303
5905 303 -52 -129 -91 -362 -313 285 83 47 34 -349 139 102 -159 -24 187 242 328 7 100 90 -67 36 8 -77
5929 -77 -147 103 157 -80 230 62 190 140 -139 -107 107 143 -202 -116 -220 -99 178 -25 -175 -57 -38 205 198
5952 198 -3 -244 201 21 118 163 82 88 100 -86 -128 35 -59 -41 -54 -104 139 69 -25 295 44 -98 54 -25 -239
5977 -239 252 -162 -18 173 -157 -169 122 188 -59 402 125 -151 257 146 63 205 94 -149 337 -100 -213
5998 -213 165 -164 33 125 -84 59 -34 -66 125 121 -26 -174 -53 -140 113 180 -141 340 -41 -34 87 122 -190
6021 -190 60 -76 90 152 -58 -215 135 -186 -86 279 -48 -41 -195 -207 -325 319 -219 67 77 -166 32 32
6043 32 -215 -161 244 -5 278 112 -168 -127 30 -191 115 29 28 -189 9 32 245 402 -216 -144 101 -21 -151
6066 -151 -123 -327 45 39 -127 44 -112 -77 210 301 -122 275 6 -139 42 -125 -127 533 248 -302 263 -128
6088 -128 -29 260 -362 254 299 -32 195 174 -246 -155 323 8 75 77 -252 339 232 -374 95 180 -213 305 243
6111 243 -197 132 123 -39 -240 -8 -87 302 70 -226 -22 -5 -161 258 167 -232 165 -256 24 -19 155 -49
6133 -49 130 -253 94 50 -249 -199 284 -254 123 -53 -387 -244 242 -273 70 242 -300 161 323 -343 90
6154 90 -96 -234 144 -46 0 71 210 9 140 -110 -163 42 50 -524 172 -11 -315 271 -265 -482 218 -279
6176 -279 -229 262 -78 -166 174 -184 -20 486 6 -35 100 -88 38 56 -150 -113 300 -515 -68 43 -465 139
6198 139 -174 -204 477 146 -148 16 13 -167 240 276 59 279 -196 119 -25 179 -267 409 41 -218 280
6219 280 92 -268 227 -26 16 -3 -83 -40 45 -226 -79 251 -189 194 336 -197 221 218 -317 34 202 -397
6241 -397 285 -2 -234 223 45 -443 256 97 -556 175 33 -327 127 239 -202 -75 -31 -110 -59 65 -68
6262 -68 -3 -250 -203 206 87 -124 282 -406 -131 68 -120 -193 92 -200 -276 489 -222 -190 167 -248 -47 191
6284 191 -118 -340 243 -55 -25 174 -346 36 -112 -463 112 185 -256 134 -80 -320 411 -240 -229 178 91
6305 91 -337 561 72 -207 247 -30 -172 530 -98 -440 256 -62 -291 288 52 -242 202 -41 -19 346 -229
6326 -229 -170 207 -262 -62 325 -404 -75 49 -349 -36 -72 -240 93 80 -298 296 175 -117 232 415 -390
6347 -390 262 11 -51 251 99 -189 296 50 -293 162 81 -14 230 -103 -139 243 -79 -393 249 -52 -307
6368 -307 405 -343 -185 160 -293 -83 357 -216 208 247 -428 -48 305 -245 -127 401 -231 125 87 -266 42
6389 42 197 -386 374 212 -352 142 122 -206 183 98 72 66 194 -98 105 113 -133 192 -377 103 288 -164 172
6412 172 610 -42 -17 464 -191 -146 254 -74 12 348 -136 -103 135 -107 -19 83 -492 -158 67 -60 172 200
6434 200 -235 116 308 -445 353 58 -310 378 127 -128 230 87 -238 188 -44 -146 315 -172 -308 277
6454 277 104 -32 77 -159 -206 239 -219 72 307 -322 128 283 -264 -125 44 -189 -46 409 -257 49
6474 49 124 -307 206 334 -74 208 139 -147 55 -23 -168 382 63 -202 238 262 -275 123 30 -143 241 -147
6496 -147 -301 23 119 -292 363 -194 -66 276 -118 -150 3 -4 -287 215 -124 -62 335 -40 -23 59 -460 -156
6518 -156 242 -474 31 72 -270 270 122 -267 -196 209 -379 267 143 -256 263 -55 -299 393 196 -365 399
6539 399 140 -170 408 12 -475 142 -19 -401 263 -265 -235 331 35 -104 314 -120 -318 109 58 -72 441
6560 441 -24 -66 402 -133 25 102 -91 56 147 -220 270 -1 -544 102 219 -326 25 268 -339 388 95
6581 95 -455 477 -90 -213 331 207 -346 286 -10 -244 444 -20 -311 383 -133 -233 351 4 99 419 64
6602 64 -183 394 -53 165 452 -247 -56 544 -131 302 253 -237 79 340 -139 41 220 -156 311 4 -152
6623 -152 116 77 -407 205 -113 -322 402 71 -246 261 -143 -230 220 -5 -262 320 -32 -215 414 67 -14
6644 -14 227 74 -63 369 -112 -10 257 -53 11 157 -344 -58 385 -211 197 183 -29 115 291 -366 -221
6665 -221 201 -440 96 170 -418 83 -23 -537 62 100 -467 100 -70 -245 308 49 -281 -8 -285 -410 191
6686 191 -125 -30 301 -485 -224 326 -239 -42 325 -300 -288 26 -96 -350 336 -208 -183 391 -244 27 185
6707 185 -323 148 336 -348 -31 278 -443 -39 364 -369 -180 117 -318 400 164 0 81 253 -258 476
6727 476 124 -339 214 -118 -311 206 -9 -242 245 79 -311 367 -137 -138 420 1 -447 324 -105 -151 501
6748 501 -236 -93 322 -151 148 200 -418 -140 24 -259 197 34 -366 276 208 -350 152 596 -341 167 295
6769 295 -363 13 51 -239 391 158 -424 559 -93 -173 505 -26 -338 286 -1 -276 373 10 -318 269 -38
6790 -38 -150 182 -245 -206 126 -138 -30 128 -362 29 254 -260 159 563 -344 -39 159 -290 109 181 -450
6811 -450 121 148 -511 38 -63 -330 124 -118 -543 173 232 -461 131 -54 -170 511 -103 -193 282 -189 -358
6832 -358 351 -310 -296 332 -108 -325 484 -212 -172 565 -350 16 499 -329 6 393 -500 5 475 -328 102
6853 102 247 -48 142 -215 -239 258 255 -319 -83 258 -308 556 17 -188 214 -55 -295 150 -141 -256 3
6874 3 11 -77 216 -270 -62 449 -82 137 294 -377 5 303 -257 -247 333 -171 225 138 -405 -21 123 -239
6896 -239 -83 298 -384 121 329 -356 51 359 -488 -31 102 -320 332 161 -261 310 -17 -372 286 -363
6916 -363 -86 162 72 -256 180 -314 -437 465 -365 -402 193 -2 -276 430 -116 -1 380 -367 88 305 -458
6937 -458 38 455 -302 -34 405 -139 -15 163 -611 41 177 -559 43 206 -241 290 331 -89 291 175
6957 175 -364 138 131 -453 425 147 -312 226 12 -267 255 197 -287 408 4 -113 472 -455 -39 154 -66
6978 -66 -181 372 -407 5 421 -228 71 353 -231 -164 399 -311 -204 177 -511 391 187 -611 14 120 -379
6999 -379 202 221 -370 88 245 -428 313 -48 -105 291 -9 -370 408 13 -385 422 -28 -374 215 -199 -261
7020 -261 50 -35 -313 48 -24 -75 590 -40 -120 250 -274 -25 455 -246 49 288 -362 -8 241 -459 238
7041 238 284 -455 -38 224 -534 92 98 -330 299 -16 -333 405 113 -408 425 176 -183 348 136 -275 202
7062 202 120 -191 253 -67 -307 478 -325 -147 202 -252 -83 315 -408 29 480 -214 -185 177 -221 -35 530
7083 530 -346 297 215 -342 346 97 -395 7 61 -454 192 2 -420 296 111 -22 369 109 -200 55 -284
7104 -284 -145 568 -70 -140 292 -279 -266 474 -51 -353 288 -248 -111 219 -333 -19 534 -359 -274 445 -222
7125 -222 144 294 -183 119 136 -269 -44 1 -279 190 205 -384 306 335 -226 -28 150 -441 92 157 -306 347
7147 347 -4 -396 459 -164 -288 529 -24 -187 317 -335 -59 415 -40 -205 439 -52 -78 453 -81 -160 122
7168 122 -157 269 466 -133 -149 236 -699 -9 305 -277 189 165 -295 -38 471 -360 550 124 -340 486 272
7189 272 -294 239 10 -414 272 138 -197 352 126 -186 372 376 -369 420 -112 -282 441 -81 -132 175 -142
7210 -142 -18 437 -58 -101 247 -436 -90 475 -229 165 261 -309 -182 346 -336 52 236 -389 179 213 -322
7231 -322 148 267 -620 415 -189 -198 337 290 -495 347 -126 -430 440 -23 -176 442 7 -75 336 -158 -207
7252 -207 419 69 -210 361 -20 -48 266 -539 17 509 -152 -237 42 -359 -43 241 -310 254 151 -211 120
7273 120 129 -247 72 163 -572 202 168 -309 48 19 -414 107 223 -429 222 -172 -485 215 250 -507 275 -122
7295 -122 -358 297 -73 -350 513 -169 -248 393 4 75 282 -176 -36 503 -314 -26 325 -320 -28 357 -304
7316 -304 -137 461 -306 -109 385 -342 211 -18 -225 199 247 -607 238 301 -434 415 1 -276 430 88 -521
7337 -521 544 55 -210 380 -105 -225 682 56 -358 543 -218 -177 395 -66 -9 520 -67 -231 349 -250
7357 -250 44 406 -499 196 373 -320 139 418 -631 197 209 -333 -31 239 -69 36 176 -350 156 43
7377 43 -379 266 405 -269 293 46 -355 267 -11 -243 393 -25 -20 443 -208 -180 411 -216 -292 431 -3 -168
7399 -168 284 -136 -73 152 -455 76 223 -119 27 340 -252 270 398 -201 64 430 -421 134 252 -488
7419 -488 259 185 -362 106 244 -331 131 -58 -326 516 338 -242 444 -118 -177 35 134 -298 299 -168 -435
7440 -435 224 -73 -186 326 -221 -96 213 -131 89 259 -272 -84 318 32 -113 292 -365 7 351 -398
7460 -398 133 110 -377 175 174 -288 299 309 -447 135 217 -275 150 297 -356 445 56 -274 586 -34 -246 330
7482 330 -74 -191 -69 -358 -345 468 -173 -224 504 -44 92 427 -456 -60 414 -257 -148 466 -198 -161 190
7503 190 -220 99 518 -250 44 559 -226 99 22 -303 282 118 -704 61 74 -399 208 99 -285 319 324
7524 324 -292 326 364 -51 229 -103 -103 368 -49 -109 332 -168 -242 561 -63 -186 460 -4 6 333 52 -224
7546 -224 51 -249 -127 360 -297 -6 410 -290 448 207 -214 -133 190 -174 267 -81 -317 347 312 -457 256
7567 256 226 -216 465 236 -174 458 82 -251 497 -60 -50 326 -169 -229 360 -161 -108 182 -282 -33 362
7588 362 -502 -257 512 -187 154 332 -514 -218 447 -531 -18 417 -245 -60 492 -192 -1 445 -404 257
7608 257 404 -353 202 142 -208 -70 271 -188 99 287 -90 278 -159 -427 370 -167 -280 407 111 -322
7628 -322 266 -141 -207 337 -53 -43 287 -65 -24 113 -114 130 327 -425 -232 281 -415 -14 111 -389 79
7649 79 360 -323 335 123 -270 103 340 -310 95 287 -96 403 233 -338 372 264 -270 353 -20 -410
7669 -410 378 -71 -306 385 -32 34 261 -65 -134 344 -241 -110 254 -101 -238 135 -367 41 479 32 -52
7690 -52 476 -499 -109 290 -357 96 640 -359 59 566 -311 162 111 -3 194 72 -368 45 -75 -302 362
7711 362 202 -441 364 26 -570 260 17 -276 247 107 -219 524 -219 44 144 -141 130 216 -99 -58 295
7732 295 -184 -25 628 -204 6 355 -378 -28 296 -330 85 166 -119 -2 299 -407 183 122 -218 245 108
7753 108 -465 217 383 -376 323 -215 -285 229 -188 -275 310 96 -322 229 -315 -348 307 -132 247 157 22
7774 22 -101 375 30 94 135 -380 38 303 -203 -55 473 -283 -73 320 -157 -92 209 -104 106 -62 -92 23
7796 23 213 -371 270 218 -454 329 90 -364 182 72 -455 143 -263 -161 275 180 -111 0 35 -176 164
7817 164 27 -372 482 -109 -200 468 -131 -69 332 -166 191 76 -228 -165 641 -294 170 521 -280 -106 467
7838 467 -388 166 52 -186 373 189 3 122 372 -443 343 -180 -286 362 63 -104 177 -136 -472 91
7858 91 -238 -184 334 182 -129 126 0 28 390 -68 -416 180 -18 232 183 -289 -39 363 -496 -20 367
7879 367 -332 1 319 -356 -73 197 -156 61 249 -292 226 125 -524 6 -7 -458 152 240 -237 159 166
7900 166 -104 110 20 -232 321 226 -45 632 -36 -136 204 62 -133 43 -38 -212 329 61 -58 254 -317
7921 -317 18 201 -418 -291 145 -73 -11 265 -333 -1 287 -258 -69 109 -276 60 380 -331 375 81
7941 81 -357 236 -35 -339 225 210 -329 -94 -111 -278 48 -265 -92 282 -61 -479 475 -178 -257 265 -312
7962 -312 18 288 -453 -302 561 -207 -82 252 -30 223 -6 -334 -30 322 -230 273 347 -404 137 263
7982 263 29 131 7 -367 100 204 -241 182 35 -397 300 42 -253 102 -142 -234 254 86 -170 420
8002 420 89 -283 381 -145 4 268 -250 -227 128 -331 0 316 -168 -126 219 -196 -73 408 -228 -211 400
8023 400 -304 43 76 -219 -130 178 -364 338 201 -79 368 154 -528 8 183 -266 27 213 -354 27 135
8044 135 -82 407 -47 -120 210 -57 -117 249 -186 -151 308 -254 -205 304 -97 -143 407 -63 53 352 -65 -201
8066 -201 372 -451 -4 439 -166 61 171 -217 17 197 -227 339 197 -284 244 155 -501 21 311 -166
8086 -166 223 -196 -160 136 289 -241 369 -105 -299 182 -110 -205 207 -34 -182 299 -207 -232 145 -137 -80
8107 -80 161 -8 -39 363 -228 -150 287 -114 222 237 -269 -115 150 -217 86 -41 -293 131 88 -565 298 242
8129 242 -309 59 214 -215 545 -210 -25 32 -117 -285 347 184 -128 -9 -139 -2 458 -132 -137 296 -172
8150 -172 -111 438 -227 -39 346 -208 145 290 -129 4 131 -314 232 88 -142 55 339 -95 204 359
8170 359 -309 262 -35 -238 246 31 -94 138 -10 -384 159 -111 -171 257 6 -169 358 -92 -185 99 -91
8191i1
$$ Imaginary data points
##PAGE= N=2
##DATA TABLE= (X++(I..I)), XYDATA
0 0 0 0 0 0 0 0 0 0 0 0 0 0 8 -8 8 -8 8 -12 16 -16 24 -24 32 -33 40 -48 56 -64 73 -83 97 -108 123 -139 157
35 157 -177 197 -222 248 -275 305 -340 376 -416 460 -507 560 -617 680 -748 826 -909 1002
53 1002 -1105 1224 -1357 1510 -1688 1894 -2141 2443 -2816 3295 -3934 4828 -6169 8390 -12697
68 -12697 23981 -113468 -221080 117180 32712 -4175 102549 -75080 -69344 135561 31456
79 31456 24749 60231 -83506 13578 114025 -27621 45602 37996 -125575 59707 141576 -70767
91 -70767 -23652 -10581 -91311 77565 45812 -115724 17344 -15159 -85149 122214 37708
102 37708 -123787 46832 302 -77815 111616 3255 -141332 39271 37265 -12448 60717
113 60717 -65184 -52753 101252 -26723 -30017 68688 -102385 -50514 114206 -48612 -27446
124 -27446 88028 -78848 -21061 119203 -26944 -12011 37838 -70440 48207 76053 -91318
135 -91318 29199 63633 -79944 66539 75021 -103724 23965 44471 -80832 54474 28456
146 28456 -112623 18084 18611 -45726 65033 -36786 -96774 83803 -2859 -85457 61748
157 61748 -25670 -72866 75237 -15005 -47315 70538 -32043 -26532 85205 -28681 -5742
168 -5742 66073 -70214 22023 118863 -76042 -17457 99442 -59489 -1572 87664 -67568
179 -67568 -11512 58061 -64111 13605 46514 -75864 10710 21551 -67293 47063 1877
190 1877 -107171 54826 37900 -82219 40924 12518 -59330 68157 1479 -61120 71426
201 71426 -16115 -61210 80541 -17118 -47768 85538 -37810 -51534 105008 -25839 -69548
212 -69548 65555 -23049 -36139 50148 -45597 -11354 60128 -49937 10940 67366 -60813
223 -60813 12941 58297 -69194 27015 58173 -88505 16217 70271 -55586 17483 30817
234 30817 -56426 45052 13657 -83118 44268 10666 -84744 44864 7518 -68272 61512
245 61512 2647 -68491 68372 10750 -62162 42944 -9156 -26925 61427 -37342 -27955 85589
257 85589 -30197 -27655 79866 -36035 -25601 65776 -51326 -19413 65545 -54020 -17907
268 -17907 55700 -42668 9476 38779 -66822 28310 49106 -84116 15528 49835 -69621
279 -69621 22196 38918 -63456 34130 30966 -64782 35538 23240 -55014 34898 -2534 -46244
291 -46244 63591 -8661 -58631 68663 524 -51757 57468 -11352 -37039 61706 -25818
302 -25818 -34388 66156 -28720 -28749 58900 -38397 -17168 56108 -58942 -16858 68276 -52878
314 -52878 -20566 56385 -42644 -2652 42601 -51470 13022 39968 -59100 18770 38343 -51100
326 -51100 32688 28564 -53964 48354 25739 -68339 40245 24447 -58679 34588 3354 -49124
338 -49124 52559 -5273 -51740 59430 -5689 -51063 49575 -17953 -38885 56204 -29605
349 -29605 -37259 66340 -20353 -29137 55517 -24049 -10797 48157 -48816 -9669 54012 -51761
361 -51761 -9187 50015 -44164 6695 41599 -53714 18226 44607 -62505 8683 35964 -51264
373 -51264 21116 23221 -50027 42677 26195 -57176 39077 24547 -49465 34443 3506 -46829
385 -46829 47634 -3015 -49662 53703 2618 -40228 43686 -15090 -29741 50742 -32790 -36048
397 -36048 55624 -28472 -30223 48638 -30213 -11202 49045 -47831 -11503 54555 -47850 -13819
409 -13819 45495 -40805 5217 38973 -49011 19552 47628 -50213 14832 37738 -41644 26216
421 26216 22813 -46869 41990 25170 -54909 34474 21053 -45692 31664 -1542 -46882 42120
433 42120 -8152 -52667 42230 -4742 -40663 38031 -20634 -31604 50261 -27859 -34560 55151
445 55151 -18318 -24764 47452 -21365 -5410 49217 -37078 -6427 50872 -38725 -5966 40283
457 40283 -39944 8968 37153 -52466 12084 41952 -51710 5723 28351 -43688 18287 15797
469 15797 -45694 37526 22020 -46852 37955 17762 -40173 41208 3202 -45980 45962 282
481 282 -49351 41220 1345 -35608 35355 -17029 -29387 40613 -31810 -33351 43929 -30492 -27496
494 -27496 42856 -28988 -10863 49885 -32515 -8204 49131 -30090 -3768 37920 -30440 14268
506 14268 34606 -41963 24351 43067 -46693 16912 36060 -45235 14710 20292 -48826 21050
518 21050 18140 -46419 21005 9959 -35878 28922 -7779 -39466 43163 -11033 -49761 43614
530 43614 -1977 -38542 40638 -7813 -26269 44755 -16492 -25792 43845 -18337 -16191 38552
542 38552 -29710 -3050 49285 -39314 -7737 53699 -34347 -13054 37844 -31320 1223 28919
554 28919 -39828 11693 30249 -40492 15343 22867 -40539 26713 15965 -52162 31637 26432
566 26432 -48843 22820 22906 -32925 23509 1720 -31051 35065 -7638 -37558 34910 -11640 -30857
579 -30857 39388 -20607 -30325 48486 -20920 -38030 41608 -12156 -23826 30814 -19635 -2383
591 -2383 39351 -29999 2925 47709 -30335 2764 40124 -36236 8376 40191 -41289 6218
603 6218 38686 -34214 4116 19414 -33015 17650 3487 -48813 26525 7631 -53162 26812
615 26812 12446 -42679 31664 7588 -40970 33790 7904 -35234 27657 967 -17859 32730
627 32730 -16641 -12331 49738 -22741 -23598 47732 -22049 -25051 39154 -25043 -17041 39306 -26067
640 -26067 -13024 35068 -22077 14 25524 -33532 11913 28287 -45411 12665 38322 -38563
652 -38563 9519 30669 -33251 13797 19074 -35628 18173 10221 -36073 21485 126 -33531
664 -33531 36154 -4470 -42444 41082 296 -45761 33517 3624 -32707 29077 -5058 -20598
676 -20598 34401 -11937 -13189 36486 -20618 -9585 36774 -32417 -7040 46838 -32633 -12265
688 -12265 44767 -24900 -9897 30794 -24397 3881 22535 -36319 9791 23522 -38006 15879
700 15879 21815 -40162 19941 19495 -46947 17076 22498 -38518 11230 10407 -25705 22437 -2799
713 -2799 -24025 38443 -5827 -32696 37805 -7081 -29208 41763 -8420 -28500 42866 -5961
725 -5961 -27297 33451 -5713 -12646 23115 -26017 -3839 31903 -36215 -4477 40135 -32768
737 -32768 -5345 33577 -33916 862 33812 -34446 -829 27497 -26899 8258 15921 -25783
749 -25783 27714 11282 -42723 27567 16926 -43802 21554 13221 -36916 22645 5850 -32930
761 -32930 26964 4557 -25581 24123 -9753 -18483 34091 -19985 -20399 48015 -15613 -27752 42222
774 42222 -9609 -19667 33856 -16355 -13717 28810 -22333 -8052 25789 -23984 4780 23378
786 23378 -37259 9426 30395 -42040 4241 32258 -34392 2935 21981 -27710 16461 16665
798 16665 -29893 21364 9971 -32380 25084 3731 -33422 33616 1837 -40204 32804 8463
810 8463 -33547 24727 1459 -22534 24467 -13359 -16782 34268 -16494 -14836 36017 -21470 -11678
823 -11678 38936 -27026 -14204 39745 -25525 -17684 30341 -19508 -4246 22438 -26436 7027
835 7027 22130 -35162 9957 24570 -34714 13146 22339 -34774 18408 24980 -32278 16949 19807
848 19807 -26823 15786 4592 -23908 27231 -4104 -30333 33355 -3646 -33384 31190 -5170
860 -5170 -30012 29466 -11399 -28710 30416 -9263 -19872 27901 -12853 -6761 29750 -25242
872 -25242 -3410 38260 -28697 -8656 36444 -24864 -4423 30398 -25712 2605 27218 -29905
884 -29905 2996 20217 -27870 11184 11733 -33282 22556 14914 -39011 23745 20020 -34155 18012
897 18012 11101 -28089 23161 3550 -27847 26966 949 -24803 26617 -7615 -19878 32445
909 32445 -17254 -27109 35622 -13016 -26224 29248 -10536 -13665 26362 -20272 -6942 30557
921 30557 -23562 -5320 27839 -24906 3282 27880 -31144 7911 33921 -31481 2713 27844
933 27844 -25253 7387 16263 -27898 17238 13909 -32144 20171 12794 -29918 21575 3966 -33006
946 -33006 26063 1695 -35525 24261 2442 -27988 21900 -6393 -19658 28744 -15083 -21640
958 -21640 32669 -15093 -18902 32935 -15533 -10837 35926 -19042 -9517 36276 -17101 -7426 27729
971 27729 -19478 1690 23419 -27633 7748 26348 -31452 5786 22239 -31294 8242 15872
983 15872 -33188 13212 14917 -32902 15070 12876 -26441 20417 4536 -26982 27193 1493
995 1493 -30901 28387 2540 -27488 26302 -3510 -22236 28739 -10058 -23092 27801 -12976
1007 -12976 -19617 25353 -17046 -10037 29890 -22219 -7587 34169 -20609 -5381 30383 -20282
1019 -20282 1731 26712 -25212 8262 28555 -27186 7817 22753 -27888 10910 14930 -33273
1031 -33273 14053 13396 -36444 12854 11592 -30603 15614 4333 -28710 21940 542 -29651
1043 -29651 24442 1015 -23651 25643 -3745 -17195 31943 -8480 -18049 32577 -10049 -16702
1055 -16702 28681 -14716 -9824 30553 -20771 -8997 32411 -20799 -8326 26897 -21547 -1466
1067 -1466 22628 -27548 3181 24758 -27827 5043 20865 -26186 9876 14088 -30410 15340
1079 15340 13615 -32572 14872 10988 -26459 19264 3623 -26270 26178 594 -29691 26204
1091 26204 1041 -24615 25882 -5261 -20500 31100 -7972 -20668 29611 -8230 -15988 24499
1103 24499 -15380 -8113 28976 -21416 -7948 31108 -20003 -5861 26450 -21660 341 23905
1115 23905 -26592 2049 24421 -24460 5316 17968 -24807 12267 12629 -31431 15974 13617
1127 13617 -33755 13262 10634 -28584 17251 5368 -27230 22437 3516 -26392 22055 583
1139 583 -19771 26018 -6626 -18062 32856 -7233 -18995 31252 -7511 -15555 25475 -13977
1151 -13977 -10336 25623 -19378 -7607 25426 -22152 -2927 23258 -26977 1109 24321 -31059
1163 -31059 1074 26113 -27381 2812 22192 -23002 8447 15405 -24860 14161 12869 -26321
1175 -26321 16160 8241 -25744 20614 5037 -27086 23621 4722 -27017 20553 986 -20738
1187 -20738 21645 -6452 -16873 27211 -10422 -16198 30492 -12009 -15293 29033 -15964 -13875
1199 -13875 29011 -17143 -12552 26523 -15916 -7172 19831 -18928 2808 18270 -27214 6469
1211 6469 21288 -28654 7596 21667 -26135 11833 18676 -27638 13067 16974 -24658 12450
1223 12450 7897 -22016 18841 358 -25055 25917 1120 -28558 23897 44 -24933 23038
1235 23038 -3014 -21169 23513 -5530 -16374 23398 -8677 -8660 23484 -17746 -5878 28359
1247 28359 -22565 -8853 30594 -19314 -8962 23795 -18847 -2581 20072 -22404 801 17269
1259 17269 -22805 6724 13685 -24030 16573 15266 -30338 16980 19434 -27038 13178 14637 -21652
1272 -21652 15488 5510 -21205 19806 1461 -20473 20448 -6039 -20654 24199 -10977 -22901
1284 -22901 27931 -9339 -24002 23779 -6254 -14606 20857 -11775 -6897 22482 -18471 -3335
1296 -3335 25990 -19288 522 25422 -23236 2221 28114 -23531 -638 24306 -19525 611
1308 611 13876 -19256 10952 10334 -24001 15185 8848 -26965 17684 7605 -27671 18801 6509
1321 6509 -28286 17209 6811 -21526 16210 -420 -16577 18728 -9253 -14831 26007 -11552
1333 -11552 -16601 27318 -11637 -14967 27555 -11230 -11845 24920 -12549 -9488 19665 -13624 216
1346 216 17260 -20890 5948 19470 -26847 6198 22725 -26076 4808 19404 -24631 6971
1358 6971 17069 -20494 10293 11541 -19399 13788 4013 -20227 20685 402 -25416 22477
1370 22477 1246 -26592 19889 1412 -21519 16604 -5574 -18007 18028 -9136 -12967 20028
1382 20028 -12881 -7858 24034 -17274 -5713 30924 -15952 -8624 28095 -11780 -4617 22175
1394 22175 -12075 2289 18013 -18262 4825 14953 -21694 8398 11537 -27325 10577 11802
1406 11802 -29658 9330 14084 -24626 7275 6794 -19229 13692 920 -18219 20635 -1027
1418 -1027 -19260 22996 -2491 -17395 25990 -4912 -19907 23886 -3567 -17780 18741 -5585
1430 -5585 -8957 16911 -14160 -4119 21090 -18369 -3451 22985 -19390 -2371 23014 -19581
1442 -19581 87 23603 -17584 239 17953 -15193 5169 10593 -18335 12381 8262 -24986
1454 -24986 13798 9527 -25425 13259 7639 -24726 12798 4995 -22869 13094 2988 -17046
1466 -17046 14106 -4069 -12614 21072 -8454 -14123 25542 -8413 -15675 24075 -7479 -12006 22860
1479 22860 -8525 -8090 20992 -10566 -3589 17478 -14828 2503 17025 -21395 3889 20111
1491 20111 -23239 1523 19067 -21107 1991 13582 -20299 5036 9480 -20052 8299 5476
1503 5476 -19084 13634 2464 -20900 18890 3435 -22501 18318 4709 -18796 16766 2069
1515 2069 -13612 17692 -3341 -11171 19020 -7644 -9975 20018 -12363 -9398 22131 -14600 -10180
1528 -10180 22841 -12839 -9137 18684 -12110 -3531 14894 -14798 2908 15212 -17953 5949
1540 5949 15320 -19579 7901 13528 -21945 8286 12841 -22225 7433 9947 -18358 8610 3282
1553 3282 -16736 14007 -523 -18902 17805 -699 -18814 18730 -859 -15627 20642 -2351
1565 -2351 -13925 19850 -2851 -10615 17247 -6954 -5742 17825 -13419 -4527 20556 -15514 -5879
1578 -5879 18903 -15633 -4095 16553 -17174 -1236 15761 -16617 1252 12834 -15503 6601
1590 6601 9726 -18320 10823 9921 -21343 10409 10239 -19219 11004 6319 -17665 13313 3755
1603 3755 -16984 13588 948 -14330 15196 -4143 -12742 19753 -5385 -13753 20349 -5203
1615 -5203 -12036 17906 -7523 -8518 17252 -10920 -6797 16953 -12552 -4108 15346 -15292 -450
1628 -450 15397 -18631 658 16773 -17553 1209 14298 -15636 5329 11625 -16129 8603
1640 8603 10292 -16870 10225 7776 -16144 12428 4627 -17941 14077 3380 -18182 13255 1597
1653 1597 -15492 13118 -3172 -13454 15989 -4991 -12247 17581 -5927 -10138 17343 -8514
1665 -8514 -7837 18647 -10479 -7208 17861 -10261 -4767 15413 -12368 -1244 14486 -16017 573
1678 573 14097 -16557 2076 12190 -16375 5523 11140 -17200 8083 10353 -16906 8909 7877
1691 7877 -15446 11572 5110 -15507 14217 3230 -15908 14167 870 -14737 13913 -3090
1703 -3090 -13017 15361 -5231 -12742 16031 -6117 -10676 15461 -8608 -7824 16241 -10626 -6353
1716 -6353 16365 -11110 -4330 15303 -11916 -580 14682 -14341 1602 14534 -14678 2739
1728 2739 13238 -14445 5285 10855 -15474 8144 9748 -15865 8555 6920 -15789 10141 3406
1741 3406 -15915 12442 1884 -16915 12203 665 -15030 11711 -3144 -13163 14041 -5286
1753 -5286 -11866 15485 -5558 -8892 15476 -8258 -5919 17777 -9814 -5790 17998 -8829 -4087
1766 -4087 15245 -10439 162 13476 -13944 1287 12676 -14651 2399 10395 -15741 5320
1778 5320 9539 -17148 6806 10199 -15513 7062 7201 -13262 10123 3593 -13330 13160 2091
1791 2091 -14454 13505 -188 -13865 13640 -3294 -13980 13619 -4231 -13262 12213 -5354
1803 -5354 -9246 11747 -8852 -5347 15091 -10592 -4100 16761 -10517 -1820 16832 -10555 477
1816 477 16783 -11175 1107 13787 -11074 3065 9853 -13300 6336 7305 -16691 7448 7019
1829 7019 -17661 7166 5643 -16872 7484 3483 -15254 9306 1948 -13221 10830 -786 -10378
1842 -10378 13664 -3930 -10904 16472 -4498 -11457 16235 -3815 -9762 14930 -5255 -6616 13836
1855 13836 -7079 -4011 12994 -9742 -1178 13033 -12714 920 14561 -14280 592 14464
1867 14464 -13314 682 11733 -12610 2796 8166 -12937 5735 5912 -14230 8471 3965 -15142
1880 -15142 10601 3283 -16359 11463 3270 -15532 10070 1788 -11751 10245 -2349 -9479 12450
1893 12450 -5546 -8983 14556 -7322 -8094 16139 -7872 -7772 16848 -6619 -6465 15146 -6245
1906 -6245 -2398 12382 -8194 2119 11650 -11809 4081 12014 -14544 4052 11234 -15764 3457
1919 3457 9668 -16463 2923 7671 -14264 3459 3084 -12465 7748 -67 -13721 12090 705
1932 705 -14277 12964 1495 -12593 13766 1223 -10718 13265 -159 -8250 11649 -3510
1944 -3510 -4431 12601 -9144 -4296 15366 -11030 -5182 15891 -10631 -5687 13733 -10198 -3160
1957 -3160 12363 -9505 -228 9391 -10401 4093 8003 -12786 7645 8160 -16270 7032 8803
1970 8803 -15510 6010 6683 -14112 6012 3067 -12450 7779 550 -10916 10612 -2962 -11157
1983 -11157 14665 -3019 -11704 16049 -1466 -11504 13967 -1426 -7725 12676 -3604 -4760
1995 -4760 11538 -7519 -2040 12195 -10883 -771 13048 -13867 -1844 14203 -12784 -1893
2007 -1893 12361 -11385 -710 8293 -11057 3848 6164 -12520 7008 4490 -14467 9586 5222
2020 5222 -15235 10103 5176 -15164 8779 4770 -11416 8952 1194 -8538 10278 -3042 -7468
2033 -7468 14240 -4742 -8095 15377 -6111 -8536 15299 -5825 -7970 13562 -6426 -6030 10498
2046 10498 -7698 -1673 9350 -11509 779 10047 -14337 1839 12185 -13891 1980 11717
2058 11717 -13386 2234 10288 -10940 3790 6740 -10514 6342 2812 -10842 10492 1298 -13998
2071 -13998 11567 1556 -14742 11163 1827 -12179 10544 -259 -10004 11033 -2333 -6501
2083 -6501 11722 -5963 -5108 14026 -8604 -4848 16018 -8948 -6346 14273 -8109 -4911 11506
2096 11506 -8356 -1925 8756 -10834 855 7953 -11861 4412 7584 -14500 6165 8994 -14597
2109 -14597 5868 9604 -12642 5723 5969 -10589 7926 2714 -10071 10181 -85 -10972 11474
2122 11474 -2145 -11623 13415 -1955 -12725 12475 -1428 -10366 11043 -2862 -6455 10210
2134 10210 -6656 -3691 11612 -8620 -2087 12555 -10901 -1620 13503 -11667 -1884 12891 -10691
2147 -10691 -1364 9510 -9759 2223 7363 -11289 5745 6497 -13000 7703 6377 -13689 8945
2160 8945 6320 -13512 8514 5331 -12036 7778 2525 -9861 8418 -2070 -9117 11317 -4429
2173 -4429 -9509 12914 -5426 -9131 13368 -5701 -8184 13022 -5389 -6270 11894 -5640 -2748
2186 -2748 11144 -8153 133 11535 -10971 999 12204 -12315 929 11349 -12353 1140
2198 1140 9137 -11386 2359 6961 -11153 4931 4521 -11516 7994 2940 -12408 10093 2978
2211 2978 -12747 10667 2803 -11931 9948 796 -10208 10007 -1535 -8593 10835 -4680 -7357
2224 -7357 11390 -6845 -6500 12917 -7602 -6129 13399 -7414 -4668 12130 -7014 -1934 11015
2237 11015 -8227 1186 10065 -10472 3046 9433 -11875 4295 8848 -12979 4561 7875 -13179
2250 -13179 4572 6255 -11869 5660 3347 -11284 7874 1319 -11544 9804 546 -11480 10478
2263 10478 -747 -11013 11241 -1227 -9695 10976 -2279 -7747 10702 -4415 -4995 11516 -6741
2276 -6741 -3693 12346 -7873 -2430 12674 -8470 -1796 12392 -9465 -459 10663 -9841 807
2289 807 8791 -11031 2612 6952 -12271 4692 6391 -13065 5169 5552 -12612 6689 4204
2302 4204 -11897 7859 3049 -10700 8936 1327 -9237 10604 -1034 -9386 11542 -2264 -8964
2315 -8964 11400 -3744 -8079 11367 -4996 -6617 11452 -6166 -5193 11150 -7273 -2949 11273
2328 11273 -8250 -1213 11365 -9161 251 11031 -9654 1438 9816 -10525 2630 7868 -11339
2341 -11339 3795 6161 -12117 4393 4039 -12120 6049 2420 -12485 7038 2010 -11491 8580
2354 8580 927 -9948 9827 -168 -8860 11070 -1196 -7560 11749 -2132 -6509 11903 -4024
2367 -4024 -5311 11835 -6115 -4573 11171 -7659 -3280 10778 -8674 -2173 9928 -9742 -499
2380 -499 9306 -10295 994 8640 -10534 2297 7666 -10823 4568 6662 -11379 5558 5324
2393 5324 -11471 6434 3737 -11452 7341 2471 -10577 8400 1051 -9783 9294 -377 -8676
2406 -8676 10689 -1929 -7687 11729 -3320 -7324 11639 -4316 -5764 11120 -5622 -4388 10913
2419 10913 -6557 -3000 9976 -8209 -786 9606 -9513 259 9410 -10495 1070 8857 -10540
2432 -10540 2402 7531 -10819 3289 6008 -10564 4882 4242 -10996 6706 2858 -11167 8203
2445 8203 1868 -10948 8535 1463 -9471 9472 262 -8113 10068 -1339 -6532 10775 -3054
2458 -3054 -5341 11625 -5176 -5131 11944 -6187 -4767 11224 -6738 -4496 9083 -7784 -2277
2471 -2277 8520 -9010 -426 7836 -9743 1798 7725 -11069 3388 7690 -11015 3863 7345
2484 7345 -10123 4760 5346 -9360 6136 3492 -9758 7177 1246 -9863 8812 -240 -10074
2497 -10074 9577 -578 -9587 9973 -1154 -8182 9736 -2360 -5627 9858 -4448 -3734 10566
2510 10566 -6242 -3034 11011 -7731 -2839 10967 -8329 -2654 9888 -8309 -1544 7625 -8431
2523 -8431 536 6338 -9436 3119 5759 -10454 5030 5497 -11129 6027 5672 -10756 6465
2536 6465 4851 -9638 6371 2831 -8409 7220 335 -7863 8985 -1589 -7824 10278 -2880
2549 -2880 -8166 10619 -2819 -7649 10134 -3093 -5561 9076 -4424 -3098 8761 -6601 -956
2562 -956 9046 -8894 -389 9606 -9817 -126 9564 -9479 38 8038 -9024 1298 6285 -8370
2576 -8370 3851 4564 -8902 6322 3538 -9874 7911 3508 -10615 7845 2829 -9951 7471
2589 7471 2005 -8286 7128 -651 -7061 8206 -3240 -6234 9515 -4982 -6001 10509 -5194
2602 -5194 -5459 11033 -4491 -4929 9735 -4697 -2676 8381 -5952 39 7612 -8171 1729 7659
2616 7659 -9852 2314 8000 -10449 2489 7539 -10139 2219 6070 -8497 3248 3203 -8000
2629 -8000 6040 1882 -8262 8087 890 -9402 9012 923 -9223 9006 177 -8543 7817
2642 7817 -1265 -6608 7548 -3135 -4509 8384 -5661 -3551 9421 -6661 -2904 10358 -6763
2655 -6763 -3254 9992 -6239 -1919 8339 -6251 -225 6419 -7214 2117 5557 -8825 3955
2668 3955 5461 -10707 4468 5827 -10184 4408 5535 -9469 4049 3438 -7557 5534 1161
2681 1161 -7085 7283 -1431 -7349 9178 -1736 -7951 9333 -2146 -7981 8795 -2116 -6424
2694 -6424 8134 -3145 -4240 7366 -4856 -1691 8501 -6659 -558 9385 -7875 -382 9745
2707 9745 -7361 -331 8502 -7174 320 6476 -7524 1980 4400 -7803 3805 2654 -9758
2720 -9758 5318 3142 -10299 5823 3098 -9607 5786 2913 -7951 6238 1545 -6056 6790
2733 6790 -1028 -5073 8559 -2787 -5496 9429 -3666 -6054 9764 -3757 -5582 8727 -4162
2746 -4162 -4285 7208 -4806 -1703 6649 -6335 535 7071 -8109 1653 8109 -8441 1055 7774
2760 7774 -8003 1557 6586 -7666 2014 4201 -7674 4033 2124 -7656 5909 891 -8805 6740
2774 6740 892 -9154 6905 1305 -7807 6836 504 -6180 6622 -1315 -4558 7789 -3166
2787 -3166 -3289 8561 -4937 -3538 9468 -5002 -3674 8935 -5203 -3011 7763 -5197 -1533
2800 -1533 6322 -6414 409 5621 -7367 2432 5354 -8738 2828 5614 -8973 2818 5101
2813 5101 -8515 3355 3876 -7568 3926 2062 -6879 5698 335 -6679 7335 -325 -6849 8142
2827 8142 -259 -6359 7962 -804 -5663 7395 -1730 -4266 6944 -3263 -2784 6675 -5163 -1838
2841 -1838 7367 -6767 -1860 7951 -6507 -1454 7588 -6617 -270 6305 -6170 1376 5067 -6492
2855 -6492 3051 4244 -7359 4201 3608 -8274 4649 3372 -8401 4262 2646 -7421 4549
2868 4549 1127 -6781 5259 -225 -5704 6734 -1501 -5012 8023 -2221 -5083 8355 -2096
2881 -2096 -4677 8007 -2872 -3622 7024 -3626 -2365 6724 -5097 -1304 6245 -6566 -659 6220
2895 6220 -7500 -67 6153 -7541 979 5688 -6832 1692 4503 -6677 3044 3568 -6689 4283
2909 4283 2499 -7094 5478 1858 -7267 6016 1301 -7162 5655 468 -6278 5769 -473 -4984
2923 -4984 6283 -2038 -4396 7091 -2982 -3884 7514 -3720 -3265 7571 -4123 -3104 7134
2936 7134 -4300 -2167 6222 -5451 -762 5657 -6142 344 5488 -6781 1255 5204 -6903 2388
2950 2388 4768 -6756 2836 4015 -6700 3731 2938 -6529 4572 1860 -6348 5169 900 -6638
2964 -6638 5977 24 -6324 5823 -1012 -5664 6235 -1689 -4913 6470 -2502 -3604 6601 -3258
2978 -3258 -2959 7010 -4233 -2025 7012 -4825 -1563 6672 -5163 -905 6160 -5891 102 5251
2992 5251 -6213 1054 4564 -6477 1897 4011 -6361 3077 3590 -6556 3564 3060 -6308 4542
3006 4542 1886 -5843 5471 1048 -5935 5683 83 -5795 5438 -615 -5221 5903 -1663 -4870
3020 -4870 6147 -2418 -4105 6408 -3248 -3389 6485 -3812 -2231 6374 -4257 -1392 6173 -4491
3034 -4491 -119 5821 -5526 809 5360 -5959 1206 4679 -6419 2273 3958 -6509 2904 3298
3048 3298 -6361 3315 2686 -5989 4053 1751 -5853 5004 693 -5989 5324 -247 -5590 5358
3062 5358 -1132 -4694 6051 -1889 -4643 6008 -1966 -3468 5866 -2813 -2347 6255 -4025 -1831
3076 -1831 6742 -4660 -1212 6379 -4920 -517 6132 -5064 216 4984 -5519 851 4153 -6064
3090 -6064 2129 3451 -6544 3169 2913 -6768 3534 2493 -6089 3919 2073 -5933 4496 1268
3104 1268 -4998 5031 -152 -4816 5605 -1250 -4631 6053 -2158 -4673 6245 -2091 -4091 5995
3118 5995 -2700 -3006 5588 -3286 -1525 5605 -3978 -386 5691 -4815 258 6087 -5448 732 5603
3133 5603 -5550 729 4496 -5356 1494 3228 -5725 2056 2094 -6002 3124 1521 -6520 4245 1495
3148 1495 -6379 4775 1136 -5507 4625 644 -4653 5010 -257 -3451 5492 -1444 -3057 6240
3162 6240 -2742 -3311 6412 -3255 -2922 6206 -3394 -2553 5393 -3784 -1487 4772 -3848 -224 4499 -5289
3178 -5289 1210 4717 -5995 1501 4621 -6169 1826 3987 -5911 2005 2946 -5387 2335 1642 -4954
3193 -4954 3535 493 -5066 5030 -223 -5662 5486 157 -5107 5276 -132 -4643 5267 -1026
3207 -1026 -3381 5101 -1952 -2746 5442 -3479 -1661 5895 -4157 -1667 6192 -4385 -1835 5602 -4295
3222 -4295 -710 4703 -4238 257 3926 -4581 1531 3153 -5439 2579 2765 -6473 2629 3038 -6594
3237 -6594 2567 2608 -5579 2826 1294 -4973 3582 332 -4292 4782 -646 -4060 6046 -1074 -4190
3252 -4190 6459 -1263 -4186 5867 -1080 -3233 5042 -2181 -2074 4672 -3471 -1019 4554 -4689 -697
3267 -697 4871 -5376 -291 5134 -5320 -30 4896 -4524 823 3785 -4371 2221 2912 -4793 3286
3282 3286 2070 -5597 3758 1772 -6014 4075 1469 -5880 3914 1289 -4917 3736 -99 -3748 4288
3297 4288 -1248 -2957 5365 -2198 -3114 6078 -2554 -3128 6311 -2628 -2939 5538 -2706 -2072 4491 -3441
3313 -3441 -1020 3906 -4718 258 4180 -5708 962 4592 -5888 1176 4480 -5353 1187 3821 -4825
3328 -4825 2138 2568 -4721 2996 1103 -4392 4447 425 -5324 4845 410 -5680 4740 554 -4897
3343 -4897 4396 -367 -3790 4382 -1220 -2503 4515 -2474 -2002 5282 -3238 -1548 5779 -4216 -2039
3358 -2039 5522 -3627 -1552 4601 -3580 -620 3415 -4350 872 3335 -4722 2146 3112 -5656 2970
3373 2970 3718 -5773 2727 3203 -5223 2516 2373 -4368 3077 893 -3917 3912 -469 -4437 4880 -999
3389 -999 -4739 5260 -1278 -4504 5173 -1098 -3863 4832 -1372 -2419 4216 -2731 -1155 4958 -3775
3404 -3775 -711 5120 -4311 -672 5268 -4560 -599 4654 -4581 -283 3777 -4181 942 2472 -4666
3419 -4666 1923 2207 -5117 3014 2281 -5511 3586 2106 -5024 3834 1873 -4938 3429 974 -4037
3434 -4037 3735 -732 -3456 4617 -1792 -3492 5057 -2018 -3481 5223 -2229 -3132 4946 -2407 -2269
3449 -2269 4726 -2368 -1142 4481 -3451 42 4279 -4628 941 4765 -4778 508 4401 -5103 806
3464 806 3469 -4483 1433 2814 -4395 2040 1676 -4668 3605 1224 -4692 4217 837 -5233 4055
3479 4055 879 -4756 3692 166 -4124 3972 -763 -3310 4210 -1880 -2591 4594 -2818 -2177 5045
3494 5045 -3084 -2105 5420 -2797 -1824 4940 -2820 -707 4245 -3520 271 3874 -4173 1229 3675
3509 3675 -4709 1436 3321 -5345 1789 2966 -5053 1904 2531 -4430 2500 1377 -4353 3668 657
3524 657 -4011 4245 -1 -4066 4474 -97 -4024 4588 -640 -3995 4573 -1124 -3310 4126 -2376
3539 -2376 -2177 4204 -2869 -1437 4692 -3612 -1117 4945 -3361 -777 4489 -3629 214 4323 -3748
3554 -3748 423 3768 -3978 1224 2748 -4771 2039 2513 -5106 2217 2201 -4940 2457 1312 -4563 3034
3570 3034 882 -4330 3578 405 -3390 3922 -312 -3481 4295 -932 -3350 4713 -1166 -3197 4526
3585 4526 -1598 -2367 4565 -2419 -1755 4107 -2766 -1086 4189 -3097 -418 4202 -3666 325 4084
3600 4084 -4125 347 3459 -3933 859 2794 -4240 1382 2355 -4702 2101 1969 -4719 2764 1414
3615 1414 -4459 3208 936 -4325 3523 829 -3737 3650 -197 -3340 4079 -733 -3034 4138 -1321
3630 -1321 -2370 4460 -1976 -2222 4404 -2503 -2153 4372 -2911 -1590 3983 -3097 -614 3814 -3515
3645 -3515 388 3682 -3709 478 3342 -4103 1272 2827 -4155 1510 2528 -4337 1899 1867 -4676
3660 -4676 2440 1153 -4274 2929 669 -4246 3351 249 -3609 3842 144 -3047 4293 -528 -2726
3675 -2726 4417 -1023 -2444 4418 -1590 -1998 4293 -2263 -1788 3934 -2807 -1373 3739 -3432 -919
3690 -919 3462 -3856 -214 3656 -3872 437 2978 -3996 1143 2815 -4378 1520 2638 -3915 1992
3705 1992 1891 -3950 2323 1247 -4246 3025 791 -4127 2996 445 -3636 3333 90 -3299 3841
3720 3841 -805 -3042 3952 -1238 -2228 3942 -1902 -1922 4347 -2038 -1625 4207 -2629 -1332 3448 -2997
3736 -2997 -676 3275 -3461 -109 3198 -3684 734 2850 -3840 1125 2731 -4029 1300 2567 -3963
3751 -3963 1543 1849 -3588 1911 1182 -3431 3075 459 -3720 2988 490 -3620 3407 -111 -3242
3766 -3242 3885 -489 -2677 3765 -854 -2268 3491 -1673 -1559 3611 -2330 -1638 3777 -2782 -1138
3781 -1138 3359 -3021 -844 3340 -3332 -481 3064 -3249 263 2601 -3444 1249 2273 -3628 2163
3796 2163 2237 -3832 2269 2302 -3659 2252 1534 -3580 2634 909 -3295 2603 105 -2980 3310 -622
3812 -622 -2630 3609 -893 -2987 3910 -1130 -2502 3632 -1232 -2235 3547 -1434 -1513 3460 -2327 -790
3828 -790 3323 -2783 -382 3610 -3553 -326 3302 -3592 -110 2970 -3250 348 2394 -3107 1325
3843 1325 1812 -3346 1881 1402 -3275 2593 1325 -3671 2884 1210 -3662 2445 513 -2885 2553
3858 2553 -183 -2847 3174 -805 -2450 3527 -1347 -2477 3812 -1580 -1755 3801 -1806 -1505 3765
3873 3765 -1846 -1338 3000 -2190 -164 2667 -2802 245 2932 -3219 594 2800 -3616 650 2542
3888 2542 -3593 1174 2427 -3039 1263 1635 -2978 2308 971 -3092 2731 451 -3231 3046 433
3903 433 -3388 2918 103 -3067 2658 -241 -2461 2593 -1030 -1690 2887 -1770 -1208 3657 -2297 -1124
3919 -1124 3929 -2288 -1152 3333 -2119 -750 3192 -2100 -229 2478 -2432 621 1981 -2892 1486
3934 1486 1954 -3650 1245 2018 -3423 1317 1836 -3304 1582 1390 -2798 1879 529 -2513 2500 -176
3950 -176 -2397 3221 -315 -2781 3260 -674 -2875 2852 -538 -2323 2932 -1262 -1694 2741 -1545
3965 -1545 -816 2720 -2186 -438 3121 -2631 -567 3339 -2730 -484 3183 -2543 33 2284 -2606
3980 -2606 718 1726 -2773 1014 1073 -3232 1567 1248 -3472 1887 1308 -3345 1827 991 -2668 1855
3996 1855 445 -2218 2301 -349 -2330 3115 -974 -2132 2904 -1362 -2400 2960 -1290 -1872 3114
4011 3114 -1496 -1443 2693 -1486 -584 2358 -2145 122 2343 -2819 380 2505 -2809 112 2473 -3229
4027 -3229 459 2031 -2837 393 1642 -2435 1265 969 -2523 1557 496 -3168 2347 337 -3099
4042 -3099 2428 818 -2594 2553 173 -2145 2474 -216 -1603 2324 -1061 -1222 2592 -1682 -1655 3376
4058 3376 -1870 -1254 3154 -1772 -1292 2551 -1655 -646 2309 -2019 -52 2237 -2445 680 2052
4073 2052 -2608 1221 2302 -2891 814 1801 -2602 929 1456 -2727 1055 996 -2555 1459 103 -2294
4089 -2294 2204 -36 -2247 2826 -370 -2464 2954 -304 -2050 2313 -531 -1299 2362 -1363 -1016
4104 -1016 2444 -1667 -868 2602 -2006 -647 2498 -2082 -699 2810 -2128 -361 2020 -2207 235
4119 235 1620 -2372 720 1556 -2659 1317 1274 -2905 1454 1438 -2847 1546 1114 -2839 1545 622 -2342
4136 -2342 1825 80 -1767 2350 -178 -1775 2687 -366 -2080 2837 -634 -1630 2836 -818 -1502
4151 -1502 2392 -1131 -899 2175 -1582 -372 2063 -2249 -204 2066 -2409 243 2371 -2297 -200
4166 -200 1891 -2255 305 1786 -2073 910 1281 -2066 1321 660 -2365 1818 675 -2616 1883 678
4182 678 -2532 1773 268 -2165 1753 -418 -2057 1928 -613 -1082 2343 -1005 -1029 2708 -1311 -1139
4198 -1139 2524 -1346 -1081 2445 -1105 -549 1731 -1613 48 1882 -1958 -47 1842 -2162 335
4213 335 1925 -2129 454 1771 -2395 608 1426 -1891 953 755 -2215 1453 597 -2178 1770 351
4229 351 -2181 1811 -1 -2090 2065 -206 -1905 1958 -337 -1499 2145 -937 -1058 2464 -980
4244 -980 -792 2431 -1399 -1065 1992 -1598 -444 2026 -1802 -591 1962 -1903 -60 1444 -2000 357
4260 357 1096 -1884 1034 1500 -2269 1009 987 -2205 1290 1019 -1924 1458 671 -2266 1378 256 -2214
4277 -2214 1708 -135 -1770 2108 -49 -1659 1811 -479 -1520 1750 -720 -1122 2276 -807 -892 2372
4293 2372 -1049 -667 2294 -1492 -453 2162 -1673 -272 1991 -1855 288 1524 -1754 257 1550
4308 1550 -1880 577 1408 -2161 1012 1028 -2166 979 887 -1881 1311 400 -1861 1534 205 -1788
4324 -1788 1575 -113 -1562 1938 -416 -1540 1692 -533 -1506 1722 -861 -1018 1922 -1211 -1152 2032
4340 2032 -1104 -447 1912 -1417 -92 1994 -1423 -130 1669 -1840 -40 1607 -1727 265 1460
4355 1460 -2110 726 1382 -2052 703 628 -2154 1179 737 -1750 1348 490 -1842 1709 306 -1770
4371 -1770 1503 202 -1373 1606 -335 -1538 1947 -392 -1240 1918 -716 -1075 1743 -1178 -1024 1657
4387 1657 -941 -653 1607 -1428 -327 1738 -1595 -116 1878 -1902 30 1406 -1717 450 1317
4402 1317 -1857 667 912 -1898 831 748 -1814 1332 681 -1967 1421 558 -1747 1205 197 -1459
4418 -1459 1735 44 -1074 1524 -80 -1117 1827 -497 -1141 1738 -849 -956 1676 -1078 -798 1650
4434 1650 -950 -565 1720 -1250 -179 1829 -1586 111 1697 -1364 453 1358 -1558 787 1274 -2008
4450 -2008 584 1180 -1902 224 643 -1608 824 323 -1491 1306 172 -1571 1517 11 -1554 1755
4466 1755 4 -1225 1710 -208 -1100 1764 -35 -945 1607 -546 -774 1270 -1199 -580 1609 -1211
4482 -1211 -473 1547 -1309 -528 1879 -1267 -453 1259 -1315 28 1152 -1283 709 1106 -1621 621
4498 621 1070 -1744 1137 674 -1898 979 764 -1650 778 643 -1484 1007 208 -1219 1570 -173
4514 -173 -1250 1669 -257 -1087 1662 -327 -1130 1847 -472 -837 1724 -874 -576 1355 -1007 -183
4530 -183 1607 -1356 -8 1679 -1667 -236 1361 -1278 -128 1464 -1448 265 1116 -1387 520
4545 520 960 -1254 686 689 -1479 1245 378 -1531 1165 384 -1750 1236 216 -1259 931 -10 -954
4562 -954 1414 -228 -900 1505 -614 -984 1644 -866 -737 1918 -947 -774 1668 -700 -671 1154 -1017
4579 -1017 -237 1171 -1318 62 1239 -1438 531 1415 -1571 655 1129 -1591 345 1023 -1031 666
4595 666 437 -1312 883 433 -1222 1002 196 -1502 1120 208 -1534 913 93 -1370 1320 -207
4611 -207 -1026 1078 -381 -821 1071 -586 -347 1387 -737 -190 1339 -868 -475 1501 -1026 -501 1327
4628 1327 -949 -446 1062 -1159 168 974 -1313 529 579 -1668 598 949 -1344 828 764 -1349 909
4645 909 807 -1010 884 247 -1120 1080 -282 -1232 1383 -361 -1009 1528 -249 -1158 1402 -192
4661 -192 -883 1460 -87 -527 1414 -676 -221 1338 -881 -70 1116 -952 -246 1325 -1067 28
4677 28 1185 -1032 157 828 -1320 230 679 -1130 443 680 -1380 994 549 -1308 978 301 -1168
4694 -1168 880 520 -1312 765 154 -933 715 -4 -958 1087 -454 -864 1180 -647 -725 1534 -463
4711 -463 -813 1360 -499 -737 1304 -657 -177 1126 -721 -244 1054 -1176 110 1014 -1357 -1
4727 -1 883 -1364 310 932 -1424 285 440 -1263 277 360 -1072 768 208 -972 819 131 -1120
4744 -1120 1077 427 -1283 938 -3 -1064 857 -327 -813 934 -310 -713 1248 -734 -705 1293
4760 1293 -800 -746 1094 -621 -246 1135 -578 -199 1131 -769 -62 664 -1063 351 700 -1137 265
4777 265 934 -1416 316 985 -1205 455 614 -934 749 387 -994 592 234 -936 1018 12
4793 12 -892 1054 -1 -1019 1014 -109 -748 858 -91 -826 963 -649 -349 822 -592 -406 1097
4810 1097 -762 -378 928 -771 -223 993 -607 -76 827 -726 -35 863 -1048 253 538 -1090 474
4827 474 661 -871 688 614 -1283 564 406 -790 746 125 -904 446 -14 -479 934 162 -871
4844 -871 1139 -188 -894 1205 -427 -874 1058 -293 -851 1183 -632 -365 1065 -576 -114 1084
4860 1084 -931 44 1190 -879 -63 897 -730 -134 752 -981 178 861 -996 340 622 -740 739
4877 739 198 -974 702 126 -1263 585 174 -1094 597 280 -884 905 139 -842 863 88 -757
4894 -757 964 -321 -557 734 -458 -440 1091 -561 -286 759 -605 -485 655 -549 -308 801 -661
4911 -661 68 811 -911 214 744 -762 -14 852 -728 231 637 -1061 295 384 -1066 637 335 -876
4929 -876 648 303 -945 858 110 -1044 548 251 -707 689 -217 -702 709 -246 -424 881 -447
4946 -447 -626 937 -633 -108 671 -633 -96 799 -898 -319 828 -698 -102 549 -818 280 677
4963 677 -894 129 451 -742 505 545 -692 264 404 -835 404 -14 -716 582 238 -660 853
4980 853 164 -753 807 2 -888 542 -210 -611 586 8 -513 584 -304 -648 746 -493 -328 831
4998 831 -499 -103 808 -855 148 721 -691 -168 795 -580 -76 598 -1146 259 489 -528 -64
5015 -64 334 -832 293 387 -863 535 176 -770 610 358 -748 624 7 -646 494 -354 -678 537
5033 537 -98 -348 525 -110 -424 794 -325 -442 547 -591 -78 652 -389 -286 829 -841 -4 366
5051 366 -617 45 694 -671 -43 637 -505 293 586 -532 77 385 -569 433 478 -867 252 180 -800
5070 -800 321 -98 -536 262 -98 -558 375 -12 -308 522 117 -494 666 -159 -534 892 -149 -304 595
5089 595 -495 -154 718 -283 -209 368 -434 -214 508 -623 -196 450 -563 -2 344 -544 248 562 -590
5108 -590 364 343 -598 333 200 -611 666 372 -722 457 153 -656 438 59 -615 621 -267 -697 764
5127 764 -394 -288 603 -352 -159 750 -246 -232 702 -135 -46 593 -312 -4 381 -308 -163 422 -686 -107
5147 -107 249 -488 112 254 -532 -11 147 -283 207 407 -199 281 95 -713 374 169 -502 433 288 -598
5167 -598 556 -67 -435 516 -209 -566 422 -5 -317 608 -401 -493 686 -8 -154 334 -373 -48 544
5186 544 -638 -59 736 -203 0 682 -535 -182 492 -463 -45 228 -658 373 145 -662 296 401 -817
5205 -817 408 71 -620 70 96 -381 175 280 -563 263 -98 -341 297 -324 -603 286 -177 -500 601 -27
5225 -27 -193 248 152 -144 349 -360 -217 470 -415 19 441 -404 151 629 -258 -179 578 -584 237 208 -195
5246 -195 52 235 -330 165 147 -457 181 71 -564 363 207 -374 258 119 -484 213 -40 -164 384 1
5266 1 -179 427 -291 -199 582 -177 -206 367 -410 -142 200 -402 -169 169 -264 92 403 -479 45 430 -345
5287 -345 -99 303 -320 175 432 -290 -5 423 -482 41 215 -167 176 38 -340 268 25 -325 527 47
5307 47 -512 487 -37 -206 355 104 -361 400 -33 -453 402 -225 -145 326 -313 -217 167 -356 -50 222 -170
5328 -170 -1 243 -168 -299 204 -211 93 376 -103 94 312 -441 43 397 -599 279 -82 -466 45 211
5348 211 -281 48 279 -393 124 61 -70 311 25 -133 309 -146 -235 473 264 -404 363 -133 -448 206 -547
5369 -547 -185 10 144 -79 275 -170 150 386 -499 -195 287 -659 -186 167 -457 132 -1 -44 138 269
5389 269 -75 6 358 -137 67 101 -151 210 111 -269 52 84 -147 3 195 -63 112 119 -234 -122 -119 -252 164
5412 164 -200 -104 571 -94 26 87 0 -203 259 -377 -53 89 -85 -157 114 -197 26 88 -312 29 150 -248
5434 -248 -51 206 -4 218 31 -44 223 190 -256 -1 -47 -224 118 -94 -354 87 268 -334 315 -51 -106
5455 -106 248 91 88 114 -41 -35 73 -306 147 356 -350 -126 247 -59 -179 -64 -439 214 -23 -23 287 142
5477 142 -176 155 186 -98 217 170 -349 128 -138 41 439 7 -207 33 280 -248 6 -87 -143 23 -212
5498 -212 -90 28 -14 -131 116 -74 -59 117 -179 106 243 -41 83 -61 -96 168 -22 62 63 398 -56 29
5520 29 196 -127 224 42 -177 297 153 -255 125 70 -266 -21 86 -57 -13 -41 -135 26 231 238 197 181 -125
5543 -125 104 40 -23 189 -98 -219 150 -68 -184 3 -106 69 67 6 111 160 -119 244 -17 -10 -19 48 -147 -8
5567 -8 66 -274 81 110 35 168 51 -93 19 47 -268 7 -160 -290 -192 25 -221 96 190 -101 314 -18 -240
5590 -240 247 -178 -262 270 -268 -114 63 -171 118 255 -68 -97 -198 204 8 168 146 54 99 -247 23 -10
5612 -10 -128 -34 59 -65 330 -274 -127 -13 292 65 40 -91 3 256 134 127 -53 131 152 119 -210 -293 -184
5635 -184 -38 -86 99 -194 59 -85 -59 72 60 59 -234 191 -291 188 -24 -17 252 -59 -71 48 94 -116 233
5658 233 217 -128 -80 134 146 31 42 -73 135 123 148 -103 -135 94 -111 -85 215 53 30 127 -132 -134 -82 -81 -322
5683 -322 -69 -158 92 110 -126 -402 -5 79 -26 251 -103 229 150 162 167 -212 -40 39 -7 -105 -184 -142 -65 6 -47
5708 -47 -38 2 168 -226 28 161 269 179 -33 67 -221 39 -41 -133 96 55 -191 7 -155 -31 -180 37 171
5731 171 -40 -268 245 -174 -1 -94 -18 -5 -32 11 393 101 198 62 -23 80 -82 290 -49 -138 -83 205 196 -101
5755 -101 -37 82 150 109 -115 129 -312 -103 -3 -61 -75 197 0 78 -56 26 106 -113 -40 -126 192 -101 37
5778 37 17 68 300 -176 -22 -67 -41 -226 133 119 -30 445 -32 91 -49 9 -10 -13 -229 -80 23 -129 161
5801 161 15 215 26 -82 33 -166 33 -83 -100 164 -85 193 -78 58 19 -108 -133 -100 -25 -33 75 -165
5823 -165 72 -179 45 27 86 -74 1 -65 -113 1 152 -59 19 182 -186 46 77 -164 -20 76 -230 58 -155
5846 -155 -130 166 378 -105 47 -1 -220 -118 14 15 -45 -79 -356 105 57 18 179 -89 -52 167 9 -109 -5
5869 -5 -250 -154 137 -20 104 37 74 -183 -85 -461 173 27 107 160 32 -134 61 34 -47 -49 41 -208 202 -146
5893 -146 -4 100 345 -498 8 196 14 15 39 -211 235 -144 -97 238 -163 -10 209 47 -8 178 -294 134
5915 134 -10 71 -67 50 -246 -265 -45 81 -176 81 144 154 -101 -225 -58 -30 -58 20 31 -173 121 141 -149
5938 -149 135 321 -239 87 -138 -231 91 -136 -46 290 -22 -234 279 -51 23 179 -398 -281 122 18 -183
5959 -183 198 39 -202 -15 -343 -19 77 -56 -75 57 -180 134 265 -332 61 176 -83 228 247 -244 -179
5980 -179 -115 -106 -106 56 -371 -138 252 -60 334 54 -265 394 251 -292 -19 -80 -113 221 -286 -58 47 -42 -109
6003 -109 149 -284 -359 -16 -288 36 119 -223 -281 345 -317 -52 486 -269 -117 566 -268 159 156 -212 56 256
6025 256 -216 43 293 -83 234 218 22 -26 -2 -251 149 120 113 3 26 -142 178 16 -74 225 -223 -17 161
6048 161 -22 143 -59 -341 -71 106 -188 -106 274 -353 48 381 -169 10 162 26 -148 120 -399 -67
6068 -67 74 -100 -66 -58 -85 75 78 -238 138 134 -393 388 153 -167 -176 -21 -265 244 -164 47 118 116 192 327 -213
6093 -213 -111 181 39 104 207 -184 -92 213 -2 34 408 -85 37 76 -267 25 64 -215 13 70 -520 -5
6115 -5 92 -208 336 72 -273 76 141 -71 148 -60 -141 369 224 -265 112 -315 -236 -9 -40 -130 495 -237 -50
6138 -50 497 103 -197 322 -267 -68 479 -294 180 305 -439 -136 195 -140 -332 169 -209 -80 353 -84
6158 -84 112 82 -266 -12 190 34 249 -49 -335 4 292 -251 195 -4 -323 309 -211 -265 290 -248 -192
6179 -192 179 179 -513 -10 75 -239 274 -328 -205 174 -69 -133 307 -144 -201 467 -22 116 154 -480 -196 16
6201 16 -193 -23 250 -219 144 284 -97 -183 -119 -248 144 177 -95 196 -67 -364 129 -104 -211 294 167
6222 167 87 398 -155 -177 -16 -118 6 355 59 -280 284 -342 -61 205 -150 -101 142 -347 -31 172 -339
6243 -339 -258 445 -69 7 334 -139 -96 338 -434 -155 248 -67 -16 76 -447 150 231 -125 -34 -16 -222 341 104
6266 104 98 -72 404 -367 86 100 -273 418 -147 -319 183 91 -384 151 156 5 395 -210 -353 394 -244 -184
6288 -184 338 -198 53 110 -74 150 114 -481 -317 434 -227 -84 329 -305 -88 38 -116 8 25 -360 101
6309 101 132 -174 408 -67 -254 283 164 -281 -49 -200 -132 136 -44 -122 202 134 131 395 -270 -256 46 -124
6331 -124 0 363 95 32 335 -33 19 166 -313 -111 279 -615 19 301 -336 215 373 -376 61 257 -317
6352 -317 47 226 -205 46 69 -16 187 120 -419 -257 131 -69 433 -34 -158 404 -18 -122 -2 108 -249
6373 -249 304 -202 -371 339 0 -2 359 -213 135 128 -362 -74 298 -321 -243 311 -248 38 279 -60 117 109
6395 109 -210 285 346 -331 122 81 -634 -5 193 -274 209 165 -414 69 193 -59 482 -291 -245 397 -58
6416 -58 18 196 -90 -313 105 -14 144 278 -91 15 178 -274 37 10 -23 -46 360 -317 -172 90 -556 -8
6438 -8 45 -238 45 130 71 -71 510 -522 259 149 -496 116 27 -129 325 215 -223 245 287 -125 108 -127
6460 -127 -116 365 -204 -362 185 46 -260 374 -242 -368 145 -288 -436 242 -116 -62 255 -383 65 342 -355
6481 -355 324 313 -522 -168 191 -457 59 301 -180 280 300 -262 5 206 -314 240 200 -306 248 123 -319
6502 -319 152 337 -280 257 -161 -204 67 126 -256 287 46 -138 317 -206 -178 136 -237 -256 167 -79 -71 51
6524 51 -208 136 214 -200 -119 387 -388 76 199 -364 12 329 -503 -42 185 -352 222 104 43 418 289
6545 289 -546 130 240 -242 314 -93 -242 356 74 -237 192 -96 -204 63 -114 -141 74 -424 -10 147
6565 147 -352 -169 227 40 60 377 -3 50 650 -415 -227 188 -322 -34 263 -275 149 91 -466 34 378
6586 378 -240 403 80 -245 317 164 -394 158 212 -290 131 -11 -385 78 70 -225 374 -55 -213 454 22
6607 22 -312 668 -109 -177 382 -324 23 8 -104 -326 350 -342 -41 370 -200 38 156 -430 85 401 -211
6628 -211 -86 273 -448 44 242 -269 17 143 -153 236 -66 -599 337 27 -457 263 93 -137 141 263
6648 263 -226 366 279 -348 323 -166 -211 223 -104 -107 398 -366 -10 310 -75 17 258 -534 32 170 -127 -1
6670 -1 368 -166 -36 437 -291 49 182 -136 34 156 -493 31 -28 -155 -27 183 -153 415 169 -216 481
6691 481 59 -220 398 -127 -321 296 -30 -206 470 -221 -36 222 -85 -317 399 -73 -312 195 -403 -21
6711 -21 392 -288 56 434 -384 180 221 -267 -36 222 -396 79 226 -606 266 144 -370 91 18 -221 231
6732 231 170 -329 18 255 -342 149 119 -347 -9 -51 -71 194 170 -219 211 -154 -434 304 96 -158 -21 -265
6754 -265 -295 381 -253 130 200 -207 52 333 -241 -149 300 -532 129 145 -130 -2 296 -409 41 246 -385
6775 -385 -12 210 -306 226 -57 -339 521 32 -510 547 -36 -308 530 -1 -151 514 -48 -250 246 -331
6795 -331 -187 548 -248 -379 300 -438 -44 126 -77 -149 202 -154 -109 450 12 51 201 -112 429 86 -224
6816 -224 262 547 -332 109 384 -181 -3 -50 -132 111 366 -254 128 127 -362 234 31 -291 301 -17 -214
6837 -214 316 15 -277 211 87 -223 273 -75 -212 92 -418 -265 395 -25 -346 327 -11 -377 585 -429
6857 -429 -174 341 -243 102 210 -364 -119 260 -324 149 234 -467 184 347 -388 -57 143 -454 204 219 -349
6878 -349 273 130 -74 218 39 -373 378 -100 -231 610 146 -59 403 -72 -84 208 -288 -76 634 -359
6898 -359 126 582 -28 146 371 -302 -37 467 -160 68 112 -369 182 226 -566 98 366 -166 111 295 -384
6919 -384 106 497 -299 235 318 -421 406 66 -387 337 106 -149 521 122 -296 210 16 -228 319 -112
6939 -112 -420 377 -136 -323 170 -181 -228 320 -212 -314 88 -294 97 410 -300 -104 122 -218 136 286
6959 286 -683 110 210 -409 296 -138 -533 155 96 -378 100 -36 -126 415 36 -47 626 -273 -572 78 -247
6980 -247 -241 424 34 -331 139 -230 7 156 -131 160 335 -116 -349 397 -197 -111 308 -211 -1 158 -155
7001 -155 134 343 -623 280 153 -388 -67 216 -537 231 195 -478 299 227 -314 473 -59 -402 422 12 -466
7022 -466 181 -3 -500 210 -97 -350 348 -43 -106 328 167 -100 512 -316 -65 120 55 9 477 -403 -223
7043 -223 343 -14 -23 357 -210 -225 250 -246 85 424 -459 180 302 -356 396 86 -432 411 55 -506 338
7064 338 63 -140 169 -86 -547 368 128 -460 337 -58 -425 476 -185 -239 289 -239 -128 318 -167 -243 263
7085 263 -360 -136 420 -511 -123 383 -93 86 175 -417 211 302 -243 274 211 -529 93 267 -489 74 50
7106 50 -383 238 382 -155 183 169 -337 115 -166 -221 478 61 -250 412 101 -401 195 -174 -99 361 -50
7127 -50 -357 277 -57 -302 384 -393 16 364 -571 -307 401 -301 -139 487 -463 73 91 -345 49 -21 -278
7148 -278 146 156 -343 129 114 -321 315 17 -99 410 -79 -204 569 79 -100 594 54 -316 294 25 -126
7169 -126 281 -223 -280 357 -166 -147 215 -195 -319 308 -113 61 466 -274 77 262 -17 -88 395 -613 -77
7190 -77 293 -542 34 90 -273 363 159 -362 87 99 -606 285 148 -171 284 -103 -598 503 -216 -85 229
7211 229 236 -429 408 -133 -182 127 -86 109 287 -113 -102 118 -511 -99 431 -163 -276 651 -192 85 314
7232 314 -386 -132 60 -460 -106 396 17 344 291 -606 440 431 -461 125 177 -321 215 36 -249 431 164
7253 164 -131 526 161 -304 107 -67 -361 337 -138 -292 249 -72 -125 315 -321 -496 245 -471 -114 417
7273 417 -60 -140 388 -353 -351 633 -642 -217 791 -109 228 126 -363 40 -129 -514 485 224 -491 69
7293 69 -23 -409 448 77 -369 459 169 -359 125 -11 -421 299 104 -299 558 -125 -161 125 -346 -168 475
7314 475 243 -97 500 -169 -404 158 -252 -123 303 -569 -54 309 -293 93 317 -344 -1 445 -180 -71
7334 -71 248 -193 116 241 -161 347 -11 -121 487 -79 -410 113 192 -122 399 -76 -552 320 47 -175 195
7355 195 -234 -479 248 -503 -377 480 -305 -370 465 -45 -141 365 -343 104 321 -242 -97 271 -217 -107 198
7376 198 -590 359 261 -135 97 298 -164 188 336 -201 224 222 -497 355 318 -219 525 24 -437 280 -149
7397 -149 -187 614 -63 -635 317 -62 -206 440 -34 203 259 -259 -148 234 -57 16 460 -303 -91 228 -564
7418 -564 -36 176 -330 -141 221 -474 -83 250 -272 82 81 -493 311 273 -129 413 380 -522 174 209 -320 229
7440 229 -91 -66 159 217 -372 677 66 -454 585 4 -222 367 220 -108 316 228 -154 331 -14 -225
7460 -225 385 -221 -119 290 -129 271 456 -351 68 315 -142 -243 272 -452 49 149 -203 259 55 -460
7480 -460 267 -16 -452 189 109 -435 133 206 -452 335 -1 102 68 -298 -183 308 -103 -315 441 -53 -223
7501 -223 322 -406 27 361 -217 -7 531 -262 -268 659 -665 -165 300 -402 69 178 -259 -40 222 -597
7521 -597 2 41 -433 192 294 -560 214 151 -436 349 139 -301 434 120 -496 520 179 -261 52 212
7541 212 3 178 121 -441 307 21 -349 533 -54 -241 454 -128 -141 231 -377 62 653 -334 -77 275 -344
7562 -344 77 31 -585 150 -73 -269 99 82 -293 -78 187 -414 261 198 -147 61 170 -341 34 2 -198
7583 -198 258 46 -230 203 -154 -254 386 -177 -477 389 -388 -45 353 -58 -232 34 -277 -69 352 -137
7603 -137 -12 439 -596 -133 292 84 43 99 -233 35 122 -173 278 114 -682 301 404 -485 266 310 -396
7624 -396 187 97 -406 21 71 -194 84 -68 -401 542 -42 -371 546 -85 -423 331 -176 50 252 -32 -179
7645 -179 254 -199 40 525 -255 -356 204 -526 -62 340 -381 -69 244 -138 252 333 -405 86 281 -329
7665 -329 149 266 -584 130 -8 -344 219 -32 -117 186 104 -249 189 67 -358 356 -121 -408 299 -119 -275
7686 -275 319 127 -211 375 -329 -315 333 -129 -177 405 -53 -76 267 -362 -14 475 -227 82 272 -174 191
7707 191 205 -268 63 208 -450 63 8 -53 156 246 -470 163 33 -267 446 -83 -430 173 136 -21 276 -178
7729 -178 -215 423 -150 -266 324 -263 -164 394 -237 165 437 -194 214 494 -183 -70 150 -226 49 365 -99
7750 -99 140 393 -39 76 254 -420 -2 526 -579 169 160 -217 82 -130 -377 55 -48 -673 202 19 -460
7771 -460 238 149 -244 331 -99 -93 353 55 -286 274 -170 -318 210 -56 -138 70 -538 -195 524 -247 -71
7792 -71 445 -248 184 202 -462 134 214 -469 64 300 -399 -221 185 -692 238 288 -159 77 285 -415 184
7813 184 45 -330 332 -152 -336 410 322 -415 185 75 -397 264 60 -344 226 -138 -142 571 -35 -99 312
7834 312 -273 1 310 -192 -171 521 -254 -99 76 -454 138 272 -252 -159 250 -462 -26 464 -397 -45 111
7855 111 -418 123 42 -456 253 145 -115 376 254 -219 99 -64 -10 580 -26 -89 338 -105 -381 517 -197
7876 -197 -173 320 -164 -140 441 -92 -85 43 -134 -171 158 -51 -121 353 -374 168 411 -296 44 319 -467 -90
7898 -90 90 -90 159 300 -192 -64 193 -317 243 334 -153 281 145 -383 74 -69 -225 254 -97 -165 47
7919 47 -119 -331 186 -50 -172 461 -6 -223 238 -124 -270 1 -145 -9 113 -146 -139 151 -469 -148 118
7940 118 -429 15 417 -581 -82 357 -194 174 262 -362 313 334 -264 383 174 -249 201 182 -418 343 39
7961 39 -105 318 -45 -342 382 -72 -240 80 -102 -366 429 -232 48 331 -258 -103 297 -371 12 404
7981 404 -270 -153 324 -56 135 201 -222 -69 58 -497 119 190 -496 317 161 -380 163 -29 -61 396 -57
8002 -57 -487 141 333 -108 557 67 -296 472 138 -176 374 -226 21 254 -171 -161 179 -243 -99 436 -163
8023 -163 34 311 -198 11 412 -260 -183 278 -431 74 155 -270 70 103 -412 -111 327 -374 210 198 -525
8044 -525 185 249 -170 356 296 -480 80 158 -129 298 354 -393 -50 358 -452 402 28 -201 96 -322 -39
8065 -39 616 -94 -131 334 -175 -110 188 -152 -94 562 -476 39 174 -116 -66 220 -262 43 103 -434 0 176
8087 176 -207 169 440 -263 159 -56 -386 254 -9 -514 350 -60 -391 422 163 -361 247 -90 -183 324
8107 324 -13 6 432 -182 -167 625 -230 -206 377 -211 -189 44 -235 -6 349 -213 -139 75 -265 95 184 -110
8129 -110 106 222 -192 -44 349 -163 3 185 -369 186 334 -130 142 236 -274 10 219 -281 289 29
8149 29 -363 191 13 -370 52 -33 -330 264 -409 -29 361 -167 215 460 -195 255 261 -355 -183 309 -461
8170 -461 167 363 -74 -135 412 -254 195 380 -394 73 237 -214 131 238 -284 206 146 24 297 274 -470
8191d70
##END NTUPLES=NMR FID
##END=
