##TITLE=1H_Pr 3780-2
 CDCl3, 8 sc, 
 12.2.2019
##JCAMPDX= 6.0         $$ Bruker NMR JCAMP-DX V2.0
##DATA TYPE= NMR FID
##DATA CLASS= NTUPLES
##ORIGIN= UXNMR, Bruker Analytische Messtechnik GmbH
##OWNER= root
$$ XWIN-NMR		Version 3.5
$$ Tue Feb 12 13:59:22 2019 Russian Standard Time (UT+4h)  she@DPX200
##.OBSERVE FREQUENCY= 200.1313
##.OBSERVE NUCLEUS= ^1H
##.DELAY= (6, 6)
##.ACQUISITION MODE= SIMULTANEOUS
##.ACQUISITION SCHEME= undefined
##.AVERAGES= 8
##.DIGITISER RES= 18
##SPECTROMETER/DATA SYSTEM= spect
##.PULSE SEQUENCE= zg30
##.SOLVENT NAME= CDCl3
##.SHIFT REFERENCE= (INTERNAL, CDCl3, 0, 15.7039)
##AUDIT TRAIL= $$ (NUMBER, WHEN, WHO, WHERE, WHAT)
$$ ##TITLE= Audit trail, XWIN-NMR		Version 3.5
$$ ##JCAMPDX= 5.01
$$ ##ORIGIN= Bruker BioSpin GmbH
$$ ##OWNER= she
$$ F:/spectra/data/she/nmr/H-F/1/audita.txt
$$ ##AUDIT TRAIL=  $$ (NUMBER, WHEN, WHO, WHERE, WHAT)
(   1,<2019-02-12 13:58:15.01 +0400>,<she>,<DPX200>,
      <created by zg, POWCHK disabled, PULCHK disabled
       configuration hash MD5:
       00 E9 B6 7A A2 85 ED C7 34 08 36 98 17 FE 4E 26
       data hash MD5: 16K
       85 13 E8 99 09 AE 1D 24 05 D6 5F D2 63 F3 3D 1D>)
$$ ##END=
$$ 
$$ hash MD5
$$ 4B 41 92 11 BE FD 79 B2 EF 63 BC 44 D9 36 3A 21
##$RELAX= 
##$RELAX= 
##$RELAX= 
##$RELAX= 
##$RELAX= 
##$RELAX= 
$$ Bruker specific parameters
$$ --------------------------
##$DU= <F:/spectra>
##$EXPNO= 1
##$NAME= <H-F>
##$PROCNO= 1
##$TYPE= <nmr>
##$USER= <she>
##$AMP= (0..31)
100 100 100 100 100 100 100 100 100 100 100 100 100 100 100 100 100 100 
100 100 100 100 100 100 100 100 100 100 100 100 100 100 
##$AQSEQ= 0
##$AQ_mod= 1
##$AUNM= <au_zg>
##$AUTOPOS= <>
##$BF1= 200.13
##$BF2= 200.13
##$BF3= 200.13
##$BF4= 200.13
##$BF5= 200.13
##$BF6= 200.13
##$BF7= 200.13
##$BF8= 200.13
##$BYTORDA= 1
##$CFDGTYP= 0
##$CFRGTYP= 5
##$CHEMSTR= <none>
##$CNST= (0..31)
1 1 145 1 1 1 1 1 1 1 1 1 1 1 1 1 1 1 1 1 1 1 1 1 1 1 1 1 1 1 1 1 
##$CPDPRG= <>
##$CPDPRG1= <>
##$CPDPRG2= <>
##$CPDPRG3= <>
##$CPDPRG4= <mlev>
##$CPDPRG5= <mlev>
##$CPDPRG6= <mlev>
##$CPDPRG7= <mlev>
##$CPDPRG8= <mlev>
##$CPDPRGB= <>
##$CPDPRGT= <>
##$D= (0..31)
0 1.2 0 0 0 0 0 0 0 0 0 0.03 0 0 0 0 0 0 0 0 0 0 0 0 0 0 0 0 0 0 0 0 
##$DATE= 1549965494
##$DBL= (0..7)
120 120 120 120 120 120 120 120 
##$DBP= (0..7)
150 150 150 150 150 150 150 150 
##$DBP07= 0
##$DBPNAM0= <>
##$DBPNAM1= <>
##$DBPNAM2= <>
##$DBPNAM3= <>
##$DBPNAM4= <>
##$DBPNAM5= <>
##$DBPNAM6= <>
##$DBPNAM7= <>
##$DBPOAL= (0..7)
0.5 0.5 0.5 0.5 0.5 0.5 0.5 0.5 
##$DBPOFFS= (0..7)
0 0 0 0 0 0 0 0 
##$DE= 6
##$DECBNUC= <off>
##$DECIM= 32
##$DECNUC= <off>
##$DECSTAT= 4
##$DIGMOD= 1
##$DIGTYP= 9
##$DL= (0..7)
0 120 120 120 120 120 120 120 
##$DP= (0..7)
150 150 150 150 150 150 150 150 
##$DP07= 0
##$DPNAME0= <>
##$DPNAME1= <>
##$DPNAME2= <>
##$DPNAME3= <>
##$DPNAME4= <>
##$DPNAME5= <>
##$DPNAME6= <>
##$DPNAME7= <>
##$DPOAL= (0..7)
0.5 0.5 0.5 0.5 0.5 0.5 0.5 0.5 
##$DPOFFS= (0..7)
0 0 0 0 0 0 0 0 
##$DQDMODE= 0
##$DR= 18
##$DS= 0
##$DSLIST= <SSSSSSSSSSSSSSS>
##$DSPFIRM= 0
$$ [...]
##$SUBNAM2= <"">
##$SUBNAM3= <"">
##$SUBNAM4= <"">
##$SUBNAM5= <"">
##$SUBNAM6= <"">
##$SUBNAM7= <"">
##$SUBNAM8= <"">
##$SUBNAM9= <"">
##$SW= 20.0189088683792
##$SWIBOX= (0..15)
0 0 2 0 0 0 0 0 0 0 0 0 0 0 0 0 
##$SW_h= 4006.41025641026
##$TD= 16384
##$TD0= 1
##$TE= 0
##$TE2= 300
##$TE3= 300
##$TEG= 300
##$TL= (0..7)
0 120 120 120 120 120 120 120 
##$TP= (0..7)
150 150 150 150 150 150 150 150 
##$TP07= 0
##$TPNAME0= <>
##$TPNAME1= <>
##$TPNAME2= <>
##$TPNAME3= <>
##$TPNAME4= <>
##$TPNAME5= <>
##$TPNAME6= <>
##$TPNAME7= <>
##$TPOAL= (0..7)
0.5 0.5 0.5 0.5 0.5 0.5 0.5 0.5 
##$TPOFFS= (0..7)
0 0 0 0 0 0 0 0 
##$TUNHIN= 0
##$TUNHOUT= 0
##$TUNXOUT= 0
##$USERA1= <user>
##$USERA2= <user>
##$USERA3= <user>
##$USERA4= <user>
##$USERA5= <user>
##$V9= 5
##$VALIST= <valist>
##$VCLIST= <CCCCCCCCCCCCCCC>
##$VD= 0
##$VDLIST= <DDDDDDDDDDDDDDD>
##$VPLIST= <PPPPPPPPPPPPPPP>
##$VTLIST= <TTTTTTTTTTTTTTT>
##$WBST= 1024
##$WBSW= 4
##$XGAIN= (0..3)
0 0 0 0 
##$XL= 0
##$YL= 0
##$YMAX_a= 119192
##$YMIN_a= -103535
##$ZGOPTNS= <>
##$ZL1= 120
##$ZL2= 120
##$ZL3= 120
##$ZL4= 120
##$ABSF1= 10
##$ABSF2= 0
##$ABSG= 5
##$ABSL= 3
##$ALPHA= 0
##$AQORDER= 0
##$ASSFAC= 0
##$ASSFACI= 0
##$ASSFACX= 0
##$ASSWID= 0
##$AUNMP= <proc_1d>
##$AZFE= 0.1
##$AZFW= 0.1
##$BCFW= 1
##$BC_mod= 2
##$BYTORDP= 1
##$COROFFS= 0
##$CY= 11.3945322036743
##$DATMOD= 1
##$DC= 2
##$DFILT= <>
##$DTYPP= 0
##$F1P= 18.9103706918063
##$F2P= -1.10871071338519
##$FCOR= 0.5
##$FTSIZE= 0
##$FT_mod= 4
##$GAMMA= 1
##$GB= 0.15
##$INTBC= 1
##$INTSCL= 1
##$ISEN= 128
##$LB= 0.24
##$LEV0= 0
##$LPBIN= 0
##$MAXI= 10000
##$MC2= 0
##$MEAN= 0
##$ME_mod= 0
##$MI= 1.114404
##$NCOEF= 0
##$NC_proc= 0
##$NLEV= 6
##$NOISF1= 3.799351
##$NOISF2= 2.8
##$NSP= 1
##$NTH_PI= 0
##$NZP= 0
##$OFFSET= 15.70392
##$PC= 1
##$PHC0= -8691.721
##$PHC1= 12.80018
##$PH_mod= 1
##$PKNL= yes
##$PPARMOD= 0
##$PSCAL= 0
##$PSIGN= 0
##$REVERSE= no
##$SF= 200.130013532006
##$SI= 16384
##$SIGF1= 3
##$SIGF2= 2
##$SINO= 400
##$SIOLD= 16384
##$SREGLST= <1H.CDCl3>
##$SSB= 0
##$STSI= 0
##$STSR= 0
##$SW_p= 3612.71676300578
##$SYMM= 0
##$S_DEV= 0
##$TDeff= 0
##$TDoff= 0
##$TI= <>
##$TILT= no
##$TM1= 0
##$TM2= 0
##$TOPLEV= 0
##$USERP1= <user>
##$USERP2= <user>
##$USERP3= <user>
##$USERP4= <user>
##$USERP5= <user>
##$WDW= 1
##$XDIM= 8192
##$YMAX_p= 0
##$YMIN_p= 0
$$ End of Bruker specific parameters
$$ ---------------------------------
##NTUPLES= NMR FID
##VAR_NAME=  TIME,          FID/REAL,        FID/IMAG
##SYMBOL=    X,             R,               I
##VAR_TYPE=  INDEPENDENT,   DEPENDENT,       DEPENDENT
##VAR_FORM=  AFFN,          ASDF,            ASDF
##VAR_DIM=   8192,          8192,            8192
##UNITS=     SECONDS,       ARBITRARY UNITS, ARBITRARY UNITS
##FACTOR=    0.0002496,     1,               1
##FIRST=     0,             0,               0
##LAST=      2.0444736,     0,               0
##MIN=       0,             -103535,         0
##MAX=       2.0444736,     119192,          0
$$ Real data points
##PAGE= N=1
##DATA TABLE= (X++(R..R)), XYDATA
$$ [...]
3295c55m964J0543m070o975J0319k181q404R494jr550Q219K096j0165O708M110
3310D824j0513N144N940j0051L044P330r549J259Q890q937j134R656p329l078
3324d504J0408n879n080J0164l949p123J0099k039p998R071K1r632Q432K183j0082
3339e908O314M631j0119M866N975j0365L046P756r487P37R067r064j183R890p686
3354a530l273J0300n792n256J0453m198o725J0154k263q008R199L72r389P807
3368A851K731j0343O570M447j0457M804O084j0002K882P379r520J013Q571q582
3382b572j186R494p174l277J0041n544n058R889l626o580R646k011q104Q939M91
3397C368r099P737K212r633N928M499j0274M612O130r813K510P147r135P78R012
$$ plain form
3295 -355 -5319 5224 1154 -5821 4498 2317 -6087 3407 3406 -6144 2075 4171 -5994 714 4824
3310 4824 -5689 -545 5395 -4656 -1612 5718 -3831 -2572 6318 -2619 -3753 5903 -1426 -4504
3324 -4504 5904 25 -5055 5109 1160 -5963 4136 2097 -5901 3170 3191 -6441 1991 4174 -5908
3339 -5908 406 5037 -5082 -216 5759 -4606 -1560 6196 -3291 -2554 6513 -2551 -3734 6156 -1530
3354 -1530 -4803 5497 -295 -5551 4902 704 -6021 4133 1870 -6138 3061 3433 -5956 1851
3368 1851 4582 -5761 809 5256 -5201 -397 5687 -4315 -1433 5946 -3574 -2561 6010 -2572
3382 -2572 -3758 5736 -1438 -4715 5326 -218 -5276 4613 987 -5593 4053 2042 -6062 2877 3368
3397 3368 -5731 2006 4218 -5415 513 5012 -5262 -650 5480 -4333 -1823 5324 -3811 -3033 5979
3412E979q634j241R522o813l301R619n110n217R777l138p176R711j623q081Q780
3427C054M09r255P674K349r992O153M585j0006M214O138r696K731P498r229K71
3442c102Q945q261j401R579o950l158R857n397n435J0155l485o963R361j339q252
3457e846Q605N58r109P463K571r601O113M019r653M701N605r732K504P744r080
3472c138K23Q573p754j660R404o897l379R855n156n198R668l426o621R076j231
3487B339q023Q269P79r217P558K522r509N864M330r769M385N879r499K166P536
3502E610r035M72Q695p888j788R448o750l277R160m575n355R787l413o643R231
3517C679j599p503P892Q26q779P203K550r548N815M451r713M089N770r074J900
$$ plain form
3412 5979 -2655 -3896 5626 -1187 -4488 5131 21 -5196 4581 1443 -5733 3978 2355 -5726 3054
3427 3054 3463 -5792 1882 4231 -5761 392 4977 -5029 -815 5323 -4373 -1642 5856 -3373 -3102
3442 -3102 5843 -2418 -3819 5760 -1190 -4348 5509 112 -5323 4832 1347 -5616 3745 2406 -5846
3457 -5846 2759 3317 -5792 1671 4242 -5359 754 4773 -4880 -179 5426 -4306 -1802 5942 -3138
3472 -3138 -2915 5658 -2096 -3756 5648 -1249 -4628 5227 71 -5127 4541 1115 -5506 3570 2339
3487 2339 -5684 2585 3364 -5853 1705 4227 -5282 582 4912 -4857 -472 5407 -4092 -1926 5610
3502 5610 -3425 -2953 5742 -2146 -3934 5514 -1236 -4513 4647 72 -5283 4504 1091 -5552 3679
3517 3679 2080 -5423 2469 3295 -5484 1719 4269 -5279 536 4987 -4726 -637 5133 -3941 -2041
3532b041P428q751M34Q434p685j724R219o367l507R678m888n200R521k949p092
3547e490R125j095p920Q319M60q745O874K729r496N483M502r678L741O196r033
3562d028J942P443q480O9Q524p270j925R184o157l433R379m854n047R007k815
3577A539o945R044j359p613P935O00q811O675K914r306N459M126q943L623O259
3592E197q843J720P576q262l7Q271p535j592Q920o295l436R115m516n164Q795
3607C914k800o509Q424q55q090Q073J039q571O570L151r278N278M744r202L329
3622g83O219q751J558P193p992j54Q025p099k115Q836n714l778Q807m124n243
3637e115Q905k652o622Q717p39p683P381J029q357O707K751q838M830M445q862
$$ plain form
3532 -2041 5387 -3364 -2930 5504 -2181 -3905 5314 -1053 -4560 5118 230 -4970 4551 1602 -5490
3547 -5490 3635 2540 -5380 2939 3399 -5346 1528 4257 -5239 244 4746 -4932 -1191 5005 -4028
3562 -4028 -2086 5357 -3123 -3054 5470 -1800 -3725 5459 -698 -4131 5248 394 -4653 4354 1539
3577 1539 -5406 3638 2279 -5334 2601 3201 -5610 1065 3979 -5327 132 4258 -4685 -1062 5197
3592 5197 -3646 -1926 5650 -2612 -2649 5622 -1913 -3505 5415 -880 -4316 4799 283 -4881 3914
3607 3914 1114 -5395 3029 2174 -5916 2157 3196 -5375 1195 4346 -4932 346 5090 -4112 -783
3622 -783 5436 -3315 -1757 5436 -2556 -2710 5315 -1784 -3899 4937 -777 -4555 4252 128 -5115
3637 -5115 3790 1138 -5484 3233 2494 -5189 2192 3221 -5136 1571 4322 -4516 314 4759 -4103
3652d103L269N741q542J676O898p856j04Q069o888j855Q383n365l596R005l952
3667G80n864R120k433o650Q346j082p225P349J053q805O506L069q929M803M371
3682D409q642L460N497q222J474P386p846m71P915o610j859Q268n423l727Q800
3697D409l980n380Q663k364o511Q116o73p631P339J354q403O374K574q459M878
3712C06M303q644L148N984q268J112P144p213n84P589o363k017Q201n367l560
3727d229Q611l788n302Q545k355o339P819o57p374P200J008p825N798K787q322
3742d423M567M390q335K721N997p937R29P333p865n07Q135o474k326Q305n069
3757e59l719Q458l589n434Q442j946o552P494p9p438O743J315p791N835K861q349
$$ plain form
3652 -4103 -834 4907 -3635 -1959 4939 -2917 -3021 5048 -1840 -3695 4688 -677 -4273 4732 780
3667 780 -5084 4036 1603 -5047 3299 2217 -5008 2341 3394 -5411 1095 4164 -4765 38 4409
3682 4409 -4233 -773 4724 -3498 -2024 5362 -2484 -2955 4960 -1650 -3509 4759 -664 -4391 4409
3697 4409 429 -4951 3712 1348 -5163 2953 2280 -5351 1988 3342 -5061 1313 3887 -4572 306
3712 306 4609 -4035 -887 5097 -3171 -2059 5085 -2128 -2712 4877 -1486 -3503 4698 -669 -4229
3727 -4229 4382 594 -4708 3837 1482 -4857 2962 2305 -5069 2131 3139 -4686 1112 3899 -4423
3742 -4423 144 4534 -3801 -1080 4917 -3020 -2091 5242 -2623 -3130 5005 -1469 -3795 4510 -559
3757 -559 -4278 4180 591 -4843 3599 1653 -4899 2595 2516 -4922 1821 3136 -4655 1180 4041 -4308
3773d308L987M794q262K467O253q029J112O841p265l42P143n801j927P803n005
3788e39l517Q045l335n219P993j814o347P435j91p027O205J454p462M999K943
3803C623p862M050M243p824K622N568p252O75O707o587p05P185n563k107P489
3818D262m298m081P856k907n169P402j408o411P161k0p228O323J621p625M937
3833D15L231p932M036M551q025K322N977p236Q96O222o416o78P303n641k660P859
3849D224m188l671P400l098n093P520j618o157O694N01p081N925J642p174M930
3864G56L163p629L649M281p406K034N434o645L49O523o644p74P164n158k548P601
3880D150m335l964P870l180n172P419r05o352O668K60o906N978J833p575M706
$$ plain form
3773 -4308 -321 4473 -3789 -1322 4931 -3098 -1986 4855 -2410 -2752 4391 -1410 -3337 4466 -539
3788 -539 -4056 3989 654 -4565 3428 1614 -4733 2702 2511 -4516 1689 3143 -4319 680 3623
3803 3623 -4239 -189 4054 -3770 -1148 4420 -2832 -2157 4550 -2037 -2742 4443 -1120 -3227 4262
3818 4262 -36 -4117 3739 832 -4337 3065 1657 -4754 2407 2387 -4841 1482 3103 -4522 415
3833 415 3646 -4286 -250 4301 -3724 -1402 4575 -2661 -1765 4457 -1959 -2637 4666 -975 -3635 4224
3849 4224 36 -3635 3765 667 -4426 3094 1476 -4681 2013 2514 -4567 1358 3000 -4174 756
3864 756 3919 -3710 -61 4220 -3186 -1152 4282 -2363 -2014 4509 -2135 -2909 4255 -903 -3451 4150
3880 4150 -185 -4149 3721 541 -4631 2788 1883 -4469 2199 2459 -4447 1531 3364 -4211 495
3895D95L652p727L130M609p189K014N331o933K89O912o379j344P042m927k357
3910c382P124l736l893P385k451n244P141j201n875O389N85p087N742J719p203
3925c987M571L130p168K953M424p345K107N349o611M88O175n826r62O729m906
3940h79k600P447l774m031P225k282n053O874r33o176O300N70o801N302J518o755
3956d048M302L244p215L027M551p105J970N381o237J52O287n824r37O555m727
3971f24k499P111l811l494O326k302m700O366n79n851N780N59o169M830J817o676
3987c916M175L321p019K899M227o207J506N374o667M33O071n720j095O303m475
4002g90k415O611l419l946O741j921m873O409p44n668N792N42o201N048J939o634
$$ plain form
3895 495 4147 -3580 -450 4159 -3030 -1016 4315 -2618 -2329 4583 -1796 -3140 3902 -1025 -3382
3910 -3382 3742 6 -3887 3498 1047 -4197 2944 1743 -4132 2257 2842 -4245 1497 3216 -3987
3925 -3987 584 3714 -3454 -501 3923 -3422 -1315 4034 -2577 -2089 4086 -1740 -2702 4027 -879
3940 -879 -3479 3968 194 -3837 3388 1106 -3947 2927 1994 -4182 2118 2688 -4113 1189 2707 -4048
3956 -4048 254 3498 -3717 -690 3861 -3244 -1274 4107 -2130 -1978 4309 -1515 -2452 4103 -624
3971 -624 -3123 3988 177 -3317 3009 707 -3993 2373 1794 -4057 1723 2282 -3887 943 2760 -3916
3987 -3916 259 3580 -3439 -540 3687 -2520 -1014 4360 -2307 -1874 4197 -1523 -2618 3685 -790
4002 -790 -3205 3406 -13 -3959 2782 861 -4012 2397 1653 -4015 1777 2319 -3882 1166 3105 -3529
4018c529L745L207o521K813M153o675J510N125o044j7N974n046j241O099m421
4033h68k393O837l527l584O274j796m578O025p54n315N603N19n797M384K184o656
4049c442L638L182o788K935M278o671J543N173o004m0N890n091j177O207l960
4064c27k660O215l192l276O140k112m587O285q40n401N270O62n635M255K194o569
4080c578L523L149o247K393M222n997J055N150n611n3N612m707j602O163l909
4095d37k628O295k853l626N787j531m788N924k07n358M903O16n830M715J727n994
4111c285L313L428o177J773M602o305J545M714n209l85N418m572j775N934l780
4126g61k052O137l203l567N981j535m546N452k76n298N359L95n615M484J924n938
$$ plain form
4018 -3529 216 3423 -3098 -285 3868 -2807 -1297 3828 -2216 -2233 3741 -1305 -2546 3553 -868
4033 -868 -3261 3576 49 -3535 2739 943 -3635 2390 1636 -3679 1924 2443 -3354 1030 3214 -3442
4049 -3442 196 3378 -3410 -475 3803 -2868 -1325 3848 -2156 -2196 3694 -1397 -2574 3633 -327
4064 -327 -2987 3228 36 -3240 2900 788 -3799 2486 1646 -3755 1515 2177 -3458 797 2991 -3578
4080 -3578 -55 3094 -3153 -760 3462 -2535 -1480 3670 -1941 -1994 3618 -1089 -2691 3472 -437
4095 -437 -3065 3230 377 -3249 2538 1007 -3781 2143 1936 -3422 1481 2097 -3733 982 2709 -3285
4111 -3285 28 3456 -2721 -948 3654 -2651 -1106 3608 -1601 -1986 3432 -1140 -2915 3019 -761
4126 -761 -2813 3324 121 -3446 2535 1000 -3546 1906 1630 -3668 1691 2086 -3529 955 2879 -3059
4142c059L089L197o181K221M245n936J172M742n273k09N360m346j726N939l734
4157d99k500O053k853l299N469j385m386N490j40n197M752P52n289L542K111n681
4173c060L157L089o118K068M049n339P78M547m937j73N147m106j529N696l486
4188b17k670N874k543l505N434j124m391N248l5n288M257Q20n064M163J656n646
4204c031L080K648n367J670M034m935P44M425m896l78N216m086j466N348l201
4219a95k465N769k671l485N402j070m519M788kn070M800P68n221L756K074n650
4235b991K933K927n383J915L801m999L36M732m768l05N022l997j652N328l160
4250b61k452N337k395l577N417j010m210M719M8m748M320R79m992L238K207n287
$$ plain form
4142 -3059 30 3227 -2954 -733 3512 -2424 -1252 3490 -1783 -1992 3368 -978 -2704 3235 -499
4157 -499 -2999 3054 201 -3098 2371 986 -3400 2090 1950 -3247 1505 2257 -3032 510 2621 -3060
4173 -3060 97 3186 -2932 -864 3185 -2154 -1376 3171 -1766 -1939 3208 -898 -2427 3269 -217
4188 -217 -2887 2987 444 -3061 2373 1249 -3142 2106 2071 -3217 1040 1860 -3204 959 2615 -3031
4204 -3031 49 2697 -2670 -1000 3034 -1901 -1157 3268 -1628 -2006 3210 -876 -2342 3006 -195
4219 -195 -2660 3109 438 -3047 2355 1285 -3234 1554 1552 -3518 1282 2050 -3171 585 2659 -2991
4235 -2991 -58 2869 -2514 -599 3202 -1797 -1461 3271 -1497 -1802 3220 -777 -2429 2899 -261
4250 -261 -2713 2624 229 -3348 2069 1059 -3151 1568 1616 -3132 1188 2167 -2825 413 2620 -2667
4266b667K439L193n214J457L971n190M09M742m527n33M771l545j971N398l028
4281b95k413M894j730l341N062j145m106M790J8m895M292J179m970L209K057n084
4297b478K282K964n117J635L408m515J27M604m402l72M807l707j702N086k809
4312a89k371N142k184l114N055r99l929M132J13m223L624P69m728L438J747m988
4328b705K435L075n140J495L536m759P98M156m304m28M577l293j457M746k781
4343d9k445M980k100l116M563o20m047M009K71m310L611J234m804L175J835n123
4359b936K669K778m505J250L568m575M83M291m054q76M697l363j499M787k599
4374A16k596M808j778l565M694o04l997M188J33m223L802Q78m496K917K131m539
$$ plain form
4266 -2667 -228 2965 -2249 -792 3179 -2011 -1602 3140 -1387 -1920 2851 -694 -2665 2733 -295
4281 -295 -2708 2186 456 -2885 2177 1032 -3074 1716 1734 -3161 1131 2310 -2660 549 2606 -2478
4297 -2478 -196 2768 -2349 -714 2694 -1821 -1694 2910 -1492 -1864 2943 -764 -2466 2620 -189
4312 -189 -2560 2582 398 -2716 2339 1340 -2589 1543 1656 -2567 1057 1826 -2902 536 2283 -2705
4328 -2705 -270 2805 -2335 -840 2696 -2063 -1265 2891 -1413 -1841 2736 -557 -2014 2732 -49
4343 -49 -2494 2486 386 -2730 1833 1213 -2834 1175 1446 -2864 747 1981 -2823 352 2187 -2936
4359 -2936 -267 2511 -1994 -744 2824 -1751 -1268 3023 -1031 -1907 2790 -573 -2072 2715 116
4374 116 -2480 2328 550 -3015 1679 1075 -2922 1266 1399 -2824 978 1856 -2640 277 2408 -2131
4390b131J934L023m945J162L931m386J65L953m179m05M484l295j796M644k117
4405D2k687M649j659k884M294p60l679M128L04m215L267J368m582K887K206m831
4421b152J787L059m821J170L545m160K21M153l762r67M641l314j692M718k408
4436A8k559M701j781l112M786r16l986M187L31m227L216J337m545K591K416n022
4452b565K031L055m316Q08L418l908J05M097l737p18M281l025j567M546k425k517
4468b437M479j401l305M034m5l974L926K86m021L293J324m589K604K331m745J779
4484d61K976m353J016L372l999J70L910l461j015M473l137j555M182j998k501
4499b381M155j190k934L867m59l834L920O37m450L026J804m707K824K120m576
$$ plain form
4390 -2131 -197 2826 -2119 -957 2974 -1412 -1247 2706 -1473 -1878 2606 -689 -2485 2159 42
4405 42 -2645 2004 345 -2539 1755 995 -2684 1444 1748 -2467 800 2168 -2414 473 2679 -2152
4421 -2152 -365 2694 -2127 -957 2588 -1572 -1351 2802 -960 -1927 2714 -600 -2292 2426 18
4436 18 -2541 2160 379 -2733 2053 1137 -2849 1338 1669 -2558 658 1995 -2550 41 2457 -2565
4452 -2565 -534 2521 -1795 -987 2431 -1477 -1372 2725 -1012 -1730 2551 -474 -2041 2505 80 -2437
4468 -2437 2042 641 -2664 1370 1325 -2649 1277 1563 -2458 835 2159 -2430 174 2505 -2240 -461
4484 -461 2515 -1838 -822 2550 -1449 -1279 2631 -830 -1845 2628 -509 -2064 2118 120 -2381
4499 -2381 1774 584 -2350 1517 1058 -2776 1144 1781 -2669 357 2161 -2546 278 2398 -2178
4514b178K059K484m198Q56L663m108K18L558l367p05M005k700j791M364k073k540
4530b453M334j331l082M103k49l992L774N66m021K845J546m273K271K194m296
4545b064J622L001m393R21L319l883J63L470k819j087M277k978j691M465j941
4560C82k574M054j107l291L865j44l606L711L64m038K925J354m280K379K562m784
4576b228J588K882m004N25L862m053L82L735l618m47L696k567j668M326k170k686
4592b445M292r31l426L842j48l617L139J113m287L060J326m029K134K236m237
4607a978J531K951m286Q03L764l715o21L937l021r88L913k672j686M228j838k907
4623b585M143r81l072L833k88l472L213P14l732K696J580m135K274K076m062J354
$$ plain form
4514 -2178 -119 2365 -1833 -977 2686 -1422 -1204 2354 -1013 -1718 2287 -413 -2204 2160 87 -2453
4530 -2453 1881 550 -2532 1571 1322 -2670 1104 1670 -2351 494 2040 -2233 38 2232 -2064
4545 -2064 -442 2559 -1834 -913 2406 -1477 -1314 2156 -663 -1750 2527 -451 -2142 2323 382
4560 382 -2192 1862 755 -2536 1329 1185 -2421 1290 1654 -2384 541 1895 -2385 -6 2556 -2228
4576 -2228 -640 2242 -1762 -1237 2625 -1428 -1046 2689 -929 -1376 2320 -247 -1915 2411 241 -2445
4592 -2445 1847 916 -2510 1332 1184 -2433 706 1819 -2468 592 1918 -2111 23 2259 -1978
4607 -1978 -447 2504 -1782 -979 2785 -930 -1551 2386 -635 -1623 2290 -382 -2068 2160 322 -2585
4623 -2585 1558 577 -2495 1338 1050 -2422 791 1505 -2227 469 2049 -2086 188 2264 -1798 -444
4639d44K632l810Q64L197l535l89L859l029j276L832j997k060M267j881k466L846
4655A610p92l315M118l79l671L424N71l908K869J349m222K455K093m174J270L179
4671B477l809K32L177l307l00L863k846j575M155k136j953L965j763k500M161
4686A841r05l146L330J82l467K881R72l839K367J763l875J664K329l982J398K596
4702B109l713P17L197l676j76L627k522j082L570k232j781L720j297k617L618
4717A462n28l159L465l4l395K886J174m035K326J592l899J886K306l879J120L023
4733B311l599M35L203l174l76L599k901j272L849k211k017L879j426k402L435
4748A333n15l093L283J18l888L124J123l889K497J835m100J890K230l336R24K940
$$ plain form
4639 -444 2188 -1622 -758 2439 -1096 -1485 2374 -655 -1931 1901 -96 -2156 2111 230 -2236 1610
4655 1610 818 -2497 1621 1242 -2429 995 1566 -2342 527 1876 -2346 109 2202 -1972 -702 2477
4671 2477 -1332 -1100 2077 -1230 -1530 2333 -513 -2088 2067 -69 -2022 1943 180 -2320 1841
4686 1841 936 -2210 1120 1302 -2165 716 1688 -2151 216 1979 -1896 -232 2097 -1885 -487 2109
4702 2109 -1604 -887 2310 -1366 -1542 2085 -437 -1519 2051 -181 -1962 1758 461 -2156 1462
4717 1462 934 -2225 1240 1206 -2189 697 1871 -2164 162 1754 -2145 -259 2047 -1832 -712 2311
4733 2311 -1288 -853 2350 -824 -1200 2399 -502 -1774 2075 -136 -2153 1726 300 -2102 1333
4748 1333 818 -2275 1008 1126 -2762 362 1485 -2404 93 1928 -2172 -282 1948 -1388 -464 2476
4764B476l603K83L390l429k31L177k570j061L395j916k067L544j108k600L627
4779A307m68l264L627Q8l705L189J008l741K525J325l780J576K383l353P61K548
4795B026l400K19L229k931m81L414k608j246L518j653k124L870j200l010L878
4810A501m42l195L087R9l276K851J098l949K505J444l607J623K249l510Q93K762
4826B133l492J02L417k920p21L734k662j195L655k254j862L886j363k691L405
4841A172j22k969K922J92l216K447J188l711K232J539l507J552K267l383R43K417
4857A963l105q5L160k716o37L584k387j261L332j810j901L498j084k461L414p68
4873G36l024L067J56l035K546Q90l140K128J675l589J204K491l388P26K471l011
$$ plain form
4764 2476 -1127 -844 2546 -883 -1114 2063 -507 -1568 1827 -89 -2156 1388 280 -2320 1307
4779 1307 839 -2425 1202 1290 -2415 774 1782 -1959 566 1891 -1889 -313 2070 -1283 -522 2026
4795 2026 -1374 -1155 2074 -857 -1338 2076 -532 -1778 1740 87 -2037 1833 633 -2377 1501
4810 1501 1059 -2136 951 1050 -2226 625 1723 -2226 279 1723 -1884 -261 1988 -1522 -629 2133
4826 2133 -1359 -1257 2160 -760 -1481 2253 -409 -1604 2051 -203 -2065 1821 458 -2233 1172
4841 1172 1050 -1919 1003 1195 -2021 426 1614 -2097 135 1674 -1833 -281 1986 -1397 -454 1963
4857 1963 -1142 -1227 1933 -783 -1420 2164 -223 -1484 1848 38 -1863 1635 551 -1910 1504 736
4873 736 -2288 779 935 -2100 446 1336 -1804 324 1999 -1590 -386 2105 -1283 -557 1914 -1097
4889a097O6L089k812q60L914k631j317L395j553k205L464j035k322L074Q8l378
4905b120K983M84l325K735P15l292J960J712l434J117K637l448N13K683k874m3
4921i97K839k528q91L491k136j483L223j361j896L203q40k589L292n76k714K787
4937H24M50l199K328J177l386J902J619l200J017K321l134M13K682k714j93K989
4953A896k488r22L295k080j212L237j531j886L163r56k278L052m86k930K871K90
4969A035k995K222J022l000J615J752l306J107K559l285M80K605k558m73L036
4984A816k334n93K858k118j265L092r43k241L124r02k160K446L52k947K423N09
5000A117l059K323J114l516J994J683l343J317K258l003M55K816k956j88K768
$$ plain form
4889 -1097 -1031 2058 -754 -1614 2300 -331 -1648 1747 194 -2011 1453 418 -1904 1170 1258 -2120
4905 -2120 863 1347 -1978 757 1472 -1820 140 1852 -1582 -465 2172 -1276 -763 1920 -954 -997
4921 -997 1842 -686 -1577 1914 -222 -1705 1518 157 -1739 1464 624 -1965 1327 751 -1963 824
4937 824 1274 -1925 403 1580 -1806 96 1715 -1485 -468 1853 -1281 -868 1814 -900 -1093 1896
4953 1896 -592 -1514 1781 -299 -1511 1726 195 -1691 1472 516 -1762 1290 804 -2126 745 1035
4969 1035 -1960 262 1284 -1716 -101 1651 -1655 -548 2011 -1274 -794 1811 -747 -1220 1816
4984 1816 -518 -1111 1747 -371 -1636 1456 513 -1728 1396 494 -1666 780 1132 -1815 608 1117
5000 1117 -1942 381 1495 -2021 -27 1656 -1687 -370 1888 -1115 -660 2156 -800 -988 1780
5015A780k182q43K891j775j384K909j293j859L115o80k420K671J88k805K238N69
5031A120k833J957J242l213J326J947k708P57K153k846N52K557k975k73L048k519
5047g08q11K993j822j086K707r72k033K937p38j927K330nk362J963P93k930J779
5064A08J260k942J402J863l053J162K079k862K60K482k607l26K978k205p88K834
5080A645j781j496K948j108j908K965o26k390K660R0k710K193O32k531J482J082
5096A147k733J608J161k593R98K038k720J73K531k586L6K272j709j068K848j412
5112ij430K680r30j627K393o15k396K743L30k737J824Q75k716J780J232k918J271
5129b50J816k673N36K270k610J53K436k091m21K652k021j136K918j613j520K666
$$ plain form
5015 1780 -402 -1245 1646 -129 -1513 1396 103 -1756 1359 679 -1741 930 1118 -1687 551 1120
5031 1120 -1713 244 1486 -1727 -401 1546 -1162 -405 1748 -1098 -546 2011 -964 -1237 1811 -708
5047 -708 -1519 1474 -348 -1434 1273 301 -1732 1205 467 -1460 870 865 -1497 466 1259 -1671 108
5064 108 1368 -1574 -172 1691 -1362 -200 1879 -983 -723 1759 -848 -1174 1804 -401 -1189 1645
5080 1645 -136 -1632 1316 208 -1700 1265 639 -1751 909 999 -1711 482 1114 -1417 65 1147
5096 1147 -1586 22 1183 -1410 -412 1626 -1094 -921 1610 -976 -940 1332 -377 -1445 1403 -9
5112 -9 -1439 1241 311 -1316 1077 462 -1934 809 1139 -1598 226 1101 -1615 165 1397 -1521 -250
5129 -250 1566 -1107 -571 1699 -911 -758 1678 -413 -834 1818 -203 -1339 1579 -34 -1554 1112
5145A112q34k077K649j84k285K113K72k273K140O06k809J711J214k673J487J391
5161A560k398O45J699k347J25K287k043p88K835j856r64K494j518r57K315p75
5177C14j886K538l21k117K275J71k283J617P59k564J472J494k497P12J888k448
5193h76K12K169k371J44K060j970m89K568j784q37K571j498j336K479o52j795
5209a405K361k77k263J991K93k001J627Q15k581J587J065k151N84J623k374N81
5225e25K261k501J20J916j692m93K328j475j256K464j092j511K529o76j742K022
5241F77l10j857J869M75k027J407R12k329R30J897k609Q02J415k047M13J765k013
5258f30j29K133j821n91K091j349q41K240r52j402K307o46j848K101J46k158J875
$$ plain form
5145 1112 278 -1799 850 666 -1619 494 766 -1507 633 1239 -1570 141 1355 -1318 169 1560
5161 1560 -838 -193 1506 -841 -716 1571 -472 -1260 1575 -281 -1245 1249 -269 -1226 1089 314
5177 314 -1572 966 645 -1472 803 974 -1309 308 1067 -1497 -25 1469 -1028 -316 1572 -876
5193 -876 -664 1505 -866 -722 1338 -632 -1121 1447 -337 -1174 1397 -101 -1437 1042 390 -1405
5209 -1405 956 679 -1584 407 700 -1301 326 1141 -1440 147 1212 -939 -355 1268 -1106 -525
5225 -525 1736 -765 -645 1271 -421 -914 1414 -61 -1317 1147 55 -1456 1073 397 -1345 677
5241 677 367 -1490 379 854 -1173 234 1146 -1183 -253 1644 -965 -163 1252 -795 -382 1383 -630
5258 -630 -759 1374 -447 -1038 1053 -296 -1137 1103 151 -1251 1056 410 -1438 663 809 -1349 526
5275E26J78j939J228J295k302J065J148k052L17J815k204L57K151k106k52J906
5291A131j541p34K199j091j287K356p05j854K396m45j711J768L58k107J742M05
5307H80j996J315R29k179J010J422k193N59J549j833m7J905j910k8J864j877j90
5324h20J856j352p59K110q89j305J909l81j443J833l27j544J689L19j840R52R85
5341I93k009J000J089j940O37J231j714K8J800j668k38J825j196q58K254j292
5357e8j065K237r55j337K016k60j641J653J78k040J622O57k438J479R53k019R09
5374a09J207k248Q54J345j936M41J671j568m93J853j124p69J849r44r43J978q66
5391A98j394J826m95j517J692L96j770J438J46j407J079R91k083Q20J063j903
$$ plain form
5275 526 704 -1235 -7 1288 -1014 51 1199 -853 -536 1279 -925 -568 1583 -523 -775 1131
5291 1131 -410 -1144 1055 -36 -1323 1033 328 -1526 870 425 -1286 482 840 -1267 475 880
5307 880 -1116 199 1128 -1051 -41 1381 -812 -253 1296 -537 -584 1321 -589 -617 1247 -630 -820
5324 -820 1036 -316 -1075 1035 146 -1159 750 369 -1074 759 432 -1112 577 896 -944 8 993
5341 993 -1016 -16 1073 -867 -230 1001 -713 -685 1115 -553 -791 1034 -162 -1020 1234 -58
5357 -58 -1123 1114 159 -1178 838 578 -1063 590 768 -1272 350 1007 -1431 48 1001 -1018 -109
5374 -109 1098 -1150 -296 1049 -887 -446 1225 -343 -836 1017 -107 -876 973 29 -914 1064 198
5391 198 -1196 630 135 -1382 310 706 -1064 374 520 -887 192 1183 -900 -80 983 -920
5407i20O80J357j695n0J763j551l64J692q16q85J748q14j370J914l52j614K163
5424H86l84j574J635J97j676J042O82j543N36J303j953P36J231j871N18J264j813
5441g84L59J793j661n66K023j335o06J659o99j244J832m14j319J720k01j684J736
5458F09K93j842J070Q15j890Q49J186j955N33J442j861N88J359j432n57J817j248
5475b24o83K038j272p00J669p82j186J925k08j642J616J91j908J678K08j884J438
5492B74O16j829J059Q51j707K86J611j874J68J487j514O4J691j458n46J730r26
5509a7q16J671n66j532J940m53j319J820k3j749J325M45j722J156O91j763P33
5526a79Q98j474P00R95j464J57J627j787l26J927j137o85J830j019r87J743p60
$$ plain form
5407 -920 -240 1117 -578 -628 1135 -416 -780 912 96 -789 959 145 -1225 689 337 -1277 886
5424 886 502 -1072 563 760 -916 126 808 -735 -199 1104 -849 -113 1118 -753 -235 1029 -784
5441 -784 -425 1368 -293 -859 1164 -171 -777 882 183 -1061 771 357 -962 758 557 -1127 609
5458 609 902 -940 130 945 -945 -96 1090 -865 -332 1110 -751 -163 1196 -236 -793 1024 -224
5475 -224 -907 1131 -141 -841 828 46 -1140 785 577 -1065 551 742 -1166 512 720 -1164 274
5492 274 890 -939 120 971 -736 -450 1161 -713 -545 942 -572 -508 1183 -275 -821 909 -17
5509 -17 -833 838 272 -1260 680 227 -1092 728 705 -1044 281 726 -996 160 851 -912 -179
5526 -179 719 -755 -55 940 -524 -367 1260 -527 -853 1074 -63 -748 1082 63 -924 819 59
5543E9j135J860m36j150J311J2j363J202L33j532O94J126j788Q21Q69j388Q6J251
5561H32j376j75J863j440k31J596j038o88J504r34j003J667m95j199K027m92j389
5578i71J605m2j456J355K97j873J138P13j708P63J351k094M91J370j641M43J328
5595A069j273m70J687j116q28J769o76r88J558m73j110J537j95j370J331J90j590
5612i48J138N41j643J044O02j493Q30R70j732M01J201j400l3J589j304m09J403
5629G57r98o26J740r33o89J296k03j564J894j66j546J503L8j360J130N65j686
5646h48Q75J033j610K94J350j793L4J721j282l58J560j239m15J664q17j119J706
5663G56n80j249J612m32q27J193l32j096J373J22j389J083O23j832R48P16j277
$$ plain form
5543 59 -1076 784 348 -802 509 521 -842 360 693 -839 -145 981 -807 14 883 -505 -419 832
5561 832 -544 -719 1144 -296 -527 1069 31 -657 847 -87 -1090 577 82 -1117 910 418 -971
5578 -971 634 592 -864 491 788 -1085 53 766 -942 -179 1172 -922 -431 939 -702 -259 1069
5595 1069 -204 -674 1013 -103 -931 838 162 -826 732 259 -851 686 491 -879 452 642 -948
5612 -948 190 731 -912 132 734 -759 71 1041 -691 -290 911 -489 -522 1067 -237 -646 757
5629 757 -241 -867 873 -60 -749 547 344 -1220 674 508 -1038 465 503 -857 273 838 -848
5646 -848 27 1060 -550 -256 1094 -699 -665 1056 -226 -584 976 -263 -678 986 169 -950 756
5663 756 176 -1073 539 107 -720 473 141 -955 418 540 -849 234 857 -975 -27 689 -588
5680e88N07Q30j459L72J355j878L03J523j351k81J542j046n24J379p68q24J421
5697E13j75j129J307k9j363J135L37j159O41N49j306O78R76j622M40R74j337J01
5715d69J215q92o19J476r20m18J285m73q57J248l59j275J646p7j337J437l2j618
5733a039J373L64j404R29M71j539Q36P37j332M16R13j328L79P60o13n81J547r79
5751i0p44J771r86o98J438n51j014J503k48j286J393l4j368J161L28j264O97N93
5769F01j507O89J157j459K69J304j394j15J380j357o7J432j007p24J575n39j008
5786g70J348k51j210J360k95j320J743k15j438J252K51j275O58Q13j139K49J041
5803H02j374J89J594j549k23J634j587k96J707p58r58J747r64o86J178k27j325
$$ plain form
5680 -588 -81 749 -710 -338 1017 -861 -558 965 -386 -667 875 -171 -695 684 -84 -908 513
5697 513 338 -791 516 487 -876 259 596 -563 78 627 -679 -1 975 -647 -207 767 -570 -469
5715 -469 746 -146 -765 711 -209 -627 658 185 -672 576 217 -1058 588 511 -826 611 579 -1039
5733 -1039 334 698 -706 223 694 -845 -9 728 -604 -188 725 -603 -224 536 -77 -658 889 -90
5751 -90 -834 937 -49 -747 691 140 -874 629 381 -905 488 454 -914 247 575 -689 8 601
5769 601 -906 -217 940 -519 -250 1054 -340 -455 925 -432 -499 933 -74 -798 777 238 -770
5786 -770 578 327 -883 477 182 -1138 605 390 -1048 204 455 -820 -162 651 -488 -239 802
5803 802 -572 -383 1211 -338 -561 1073 -514 -810 897 139 -819 928 -36 -722 456 229 -1096
5820a096J670k09j180J223J55j332R65M68j424Q95O61j646O22J127j615L11J390
5837I85j353j68J353r98m06J471r63o35J275l22j158J449j87j185J497l20r94
5854f59R52J92j447J086M68j261P01M12j257N25Q44r80J46J096j153j0J196j019
5872a68m27J311n68o23J074l43q98J242n02r88J329q6j104J222J95j500J195O8
5890D29j115R07O59j361K79R75j175L76P62r70j73J254j073k48J525r59q23J384
5908F53l94j147J336j22j187J301L5j474J240M07j412R92K59j160O96P34j399
5925f42L39J273j676K92J362j486O0J301q84m56J180p00p15J338j61j144J202
5942D83m2j303J321j08j191Q23M68r48O55O46j447M59J129j389Q4R79r53r6J159
$$ plain form
5820 -1096 574 365 -815 408 563 -769 196 664 -760 135 796 -850 -228 899 -716 -405 985
5837 985 -368 -536 817 -181 -587 884 -79 -714 561 239 -919 530 343 -842 655 335 -659
5854 -659 293 485 -962 124 592 -669 32 444 -813 -288 556 -424 -278 818 -335 -345 851 -168
5872 -168 -595 716 148 -475 599 256 -642 600 98 -890 439 353 -751 471 666 -834 361 429
5890 429 -686 221 880 -481 -202 773 -402 -26 736 -234 -407 847 -226 -474 1051 92 -731 653
5908 653 259 -888 448 326 -861 440 475 -999 241 648 -764 228 487 -673 23 757 -642
5925 -642 -303 970 -706 -414 948 -538 -478 823 -61 -517 663 -37 -752 586 425 -719 483
5942 483 441 -862 459 351 -840 -17 451 -497 158 804 -643 -184 945 -444 -360 619 -334 -430 729
5961G29r47l95J317q92m21J259p49p19J394m22j202J391J62j398J362J0j322J059
5979B16P65j863J041O57j494M72P57j130N02R02j322j62J490j239j30J224r52
5996b66m55J485p07r65J825p21r93J216k36q09J033K72j479Q29P23j402P45O35
6014G30j172L66P16j086J18J303j475J84R99j014m89J718q84p26J375o51o98J486
6032H00m89j114J241l4j204J144L7j148J068K37j349R14M60j144J79R74q84j41
6050d53J148j030P0R13o75n07J475q53o95J383p27r21J296k74j087J312J02j233
6068g56J051Q5j133J125L06j341Q83N14j332M24J011r55j10J030j134o4J090p67
6086g3m97J235o74n64J267n44r15J191p6j000J303l14j283J272K98j291Q11M96
$$ plain form
5961 729 -218 -613 704 -188 -609 650 -99 -818 576 154 -1048 343 505 -893 469 479 -843 216
5979 216 981 -882 159 816 -678 -206 551 -579 -77 825 -497 -659 831 -408 -538 686 -266
5996 -266 -721 764 57 -908 917 196 -797 419 183 -626 407 679 -800 29 752 -650 95 730
6014 730 -442 -76 640 -446 -328 975 -500 -316 683 -331 -820 898 14 -712 663 12 -686 800
6032 800 311 -803 438 404 -800 344 381 -767 301 538 -811 103 563 -581 -402 572 -312 -453
6050 -453 695 -335 -265 648 -27 -534 941 88 -607 776 49 -872 424 150 -937 375 477 -756
6068 -756 295 380 -753 372 678 -663 220 734 -598 -174 837 -118 -228 802 -332 -396 694 -73
6086 -73 -570 665 -9 -573 694 150 -765 426 350 -650 653 339 -944 328 626 -665 146 642
6104F42j203L62Q89j107K23Q29j488L57J321r22l21J363j256j54R58l76q56J496
6122G57q36o52J165j62j050J207k6j067R88K48j355N63J017j531O20P05j155K48
6140c16J011j012j37J161q97j80J122p03q11J401l41j035J391n01j031J247k35
6157A34j054J232j9r53R46K69j381P70N00j104N62Q77j300K10J082j027n3J089
6175G80q60n91J289o34p04J540o16j060J112L2p55Q66k4j334J251j18q81Q60M44
6194E97j426Q05O20j123K22J069j218J75R59r49j95R93n40m14J099n90n78J060
6212E66j01j111R82p3j108J058q0q82J036J27j116J033K14j079O28L21q94K91
6230a88J148j366O0J136j185N9J197j134l47J301o34q32J378l16j149J350m2j170
$$ plain form
6104 642 -561 -199 690 -417 -194 635 -853 -496 825 -97 -418 945 -311 -465 493 117 -739 757
6122 757 -79 -731 434 272 -778 429 403 -664 324 572 -783 -220 797 -734 -114 591 -564 -316
6140 -316 695 -317 -454 707 -190 -370 752 49 -762 639 298 -737 654 153 -878 369 134
6157 134 -920 312 293 -660 286 555 -826 -56 444 -660 -98 779 -521 -311 771 -256 -309 780
6175 780 -80 -671 618 -16 -720 820 204 -856 256 288 -467 399 375 -959 292 174 -707 153 597
6194 597 -829 -24 596 -527 -305 764 -454 -279 680 -269 -464 529 -11 -425 674 84 -494 566
6212 566 465 -646 336 263 -845 213 133 -749 287 414 -702 331 545 -534 94 415 -479 -188
6230 -188 960 -406 -346 790 -395 -336 861 -273 -620 681 47 -785 593 277 -872 478 436 -734
6248g34J085K49j428J250K9r57P44N01j552M12J012r46J81R96j171J01J220j349
6266c57K51Q68q89k88J286o55p38R92l40q29J270m84o90Q36R0j125R91L48j096
6285e59N70N39j259O20O51r57K08J043j385k0J212p17m29J203p41n54J310q90
6303a55n07J302n82n72J081m81o76R28J25j172R45L75j317O29N82j181O46Q75
6321H45j336L92P86j125k35J313q67k33J161p35o81J489n57r13J040p6j026J283
6339E25R6j302J137R4j021Q60J01j219P87O12j136M95Q15j174J56P00q75j13R70
6358E08o24n55J234o84o38J387o91l83J015k91r02R04R1j082J000K39j189N40
6376a21M85j047O65P44j358L34P56r22n4J350r95l61J128o68m92J253p55q08J503
$$ plain form
6248 -734 351 600 -828 422 451 -506 238 739 -813 -401 611 -335 -154 842 -329 -228 992 -357
6266 -357 -106 762 -127 -415 871 216 -522 470 130 -699 571 87 -603 233 323 -802 189 537 -559
6285 -559 11 550 -709 -89 562 -395 -187 856 -529 -549 663 -54 -483 720 -21 -575 735 -155
6303 -155 -662 640 58 -514 567 86 -590 338 463 -709 236 611 -706 -77 505 -676 -30 845
6321 845 -491 -99 687 -438 -673 640 -227 -460 701 -34 -715 774 217 -696 344 268 -758 525
6339 525 621 -681 456 550 -471 389 490 -729 58 670 -466 29 844 -330 -174 526 -349 -462 508
6358 508 -116 -671 563 -121 -759 628 -63 -446 569 278 -624 280 371 -711 289 528 -661 -121
6376 -121 364 -683 -18 726 -632 -298 458 -464 -518 832 -163 -524 604 -64 -556 697 -58 -866 637
6395F37m05q96J191m37p68J462m77j125J120J65j040P88M72r93L62P99j267J72
6413b40P65j005j38J230q72o7J015q77j87Q66l85n96J305n98j085J130K4j063
6431g78J099Nq11N78L24r50M77O89j314N47Q75j375M79R83j381J71J156j122j48
6450d96J378j091l82J360r44n67J374o23o15R84J5j130J004J1q70R49K83j133
6468d93M94P64j650P50J007j437M15Q48r84J10Q22r15j92J134q75l75J300p92
6486f9n84J293l42p76Q31k77m58O48L41j389P49N86j106P14L62j204Q19O45j316
6505e33K64J196j237J36Q22q53k55J159q66o56J539n78p30J119m03p71J084k58
6523A79r63R66J31q72P31L12j162Q69K08j034M53Q56j267J00J045r51N4J115r60
$$ plain form
6395 637 232 -664 527 90 -678 784 307 -818 302 467 -573 215 687 -306 56 855 -412 -240
6413 -240 525 -480 -618 612 -260 -327 688 -189 -376 490 105 -491 814 216 -869 261 285 -778
6431 -778 321 326 -485 93 417 -533 -56 633 -681 -134 741 -634 -155 828 -553 -382 774 -348 -496
6450 -496 882 -209 -591 769 -175 -742 632 9 -606 378 393 -737 267 278 -592 357 640 -493
6468 -493 1 765 -885 -135 872 -565 -150 698 -286 -176 646 -269 -461 673 -202 -577 723 -69
6486 -69 -653 640 298 -478 353 76 -382 266 607 -782 -33 553 -553 161 523 -681 138 783 -533
6505 -533 -269 927 -310 -174 648 -205 -460 699 -167 -823 716 138 -592 527 124 -647 437 179
6523 179 -784 182 313 -559 172 484 -678 191 399 -635 -182 674 -593 -493 552 -399 -345 770 -190
6542a90k30J111m87q28J230p12n37J237m52q59J207j14j187Q19M35j330P78Q03
6560F94j530R04N33j341N28R88j182O6Q58j014J50J066p83l51J130n27q23J086
6578D52k22r56J288l79r86J018J76j035Q01L09j275R37N21j355Q83L74q05p7R19
6597E88j171K92J101j392K05R56p34j03O70m46p01J093j46j018J357m55p21J059
6615D34r0r08Q47J25j336J161M83j047L09P38j436N44Q20j004k44J233j026M10
6633A3N63o93j37J103q99o03J317o38o88Q33J85q13R04j14q93M84P71j343N97
6652e1P65j380M56R26j212J97R38q35J59N34p39m11J441q41k31J034q10n71J300
6671F69l21q16Q90k44p84P61K63r11O86K18j161P75N22j144L55P12p15P1R41j141
$$ plain form
6542 -190 -420 691 204 -624 606 -106 -643 594 142 -717 490 376 -811 8 443 -887 -109 694
6560 694 -836 68 601 -740 -212 776 -406 -340 518 -496 -346 720 -63 -414 716 189 -634 452
6578 452 230 -726 562 183 -803 215 391 -644 157 466 -809 128 649 -706 177 551 -254 -331 588
6597 588 -583 -291 810 -582 -377 579 -155 -258 412 -34 -735 358 212 -806 551 96 -625 434
6615 434 344 -564 283 408 -928 233 716 -331 -22 716 -720 -176 644 -360 -604 629 -397 13
6633 13 576 -117 -254 849 -50 -653 664 26 -662 171 356 -457 447 333 -560 -76 695 -648 -51
6652 -51 714 -666 -210 716 -496 -299 639 -196 -37 497 -242 -653 788 -53 -284 750 -60 -631 669
6671 669 348 -468 422 178 -606 155 418 -493 193 411 -750 25 547 -597 -242 470 -245 -174 767 -374
6691c74k78J206p29m66J233p00n00J291l35j016J367o38p76J071J85j305R79J20
6709C35o61N46K86j091P36M80j074K74P49q72L3J153j365N5J226j138j65J155
6727F62p25m63J195n91q38J414l82q51P67j37q93J056L57j336R10M97j102N20
6745F0Q26j442L47R09j245L41R94j224k06J093o31k24Q70m96o14J091l18q02J254
6764E83k73r80J036o9j063J147L25j319J004L50j302P05M06j059K09R78j034K26
6782a30R32j191k17J208r52l40J264m82o58J256n94n40Q53l46o51J119l08r55
6800g32Q46M21j109Q69J44j009O27L99r30L08Q81r42j75J156j224J24J292j008
6818f2n83J152k81j048J352j94j135J182p2r93R85J63j323J096L46j414J025M99
$$ plain form
6691 -374 -652 554 -175 -641 592 -108 -608 683 348 -668 699 61 -715 356 541 -764 215 335
6709 335 -326 220 506 -585 151 631 -443 -169 580 -292 -259 894 -471 -416 810 -328 -493 662
6727 662 -63 -526 669 78 -760 654 272 -579 188 51 -842 214 571 -765 145 642 -460 60
6745 60 886 -556 -209 700 -545 -204 790 -434 -640 453 -178 -402 468 -28 -642 449 131 -671 583
6764 583 310 -670 366 297 -766 381 706 -613 391 741 -561 144 550 -509 -300 678 -356 -130
6782 -130 802 -389 -606 602 -350 -690 574 92 -566 690 96 -444 409 63 -588 531 223 -732
6800 -732 114 535 -574 295 439 -570 57 456 -474 -166 715 -227 -402 754 -470 -346 946 -62
6818 -62 -645 507 226 -822 530 336 -799 383 311 -682 303 466 -857 239 585 -829 196 695
6836F95j243M15J259j500J94J037j269K41P04p63p9Q61n45n89J333r28p16J360
6854D67l23o45Q35j14q96Q04M68j254Q79K59j083Q47L23j182O04P81j317K80R36
6873F69j055Q8J332j600J76Q97p34m05J350r11n96J391o23p61Q69M7q37R75M31
6892G03j314Q40M60j357M25Q10j199N88Q30j459K85J396j513j01J302r36l83J295
6910F72q82m44J308k32j152J273m08j086J515k02j336J350q8j315J153K24r26
6927e76M43N40j023N51P64j278oJ469j465J19J241r88l65J228o26m80R98l51j023
6946h28J494n32j032J347R4j397J195j12j086J059O29j561P56P38j314M41N64
6963D55j025K55R71j098j21J497r47o17J443q63o27J443q28p47J314n3j061J131
$$ plain form
6836 695 -548 -133 1126 -374 -180 857 -412 -171 533 -230 -309 552 7 -582 751 -177 -893 467
6854 467 144 -501 334 220 -676 128 596 -658 221 480 -603 244 567 -615 -11 770 -547 -267 669
6873 669 -386 -298 1034 -566 -390 507 -227 -632 718 -193 -789 602 -21 -782 87 134 -703 272 703
6892 703 -611 229 689 -668 -243 567 -632 -44 786 -673 -388 1008 -505 -606 696 -240 -623 672
6910 672 -210 -654 654 422 -730 543 135 -951 564 362 -974 376 288 -1027 126 350 -576
6927 -576 -133 407 -616 -65 699 -579 -585 884 -581 -462 779 -209 -574 654 28 -452 546 195 -828
6946 -828 666 134 -898 449 543 -854 341 229 -857 202 831 -730 26 764 -550 -109 455
6963 455 -570 -315 656 -442 -563 934 -13 -630 813 -50 -677 766 -62 -809 505 452 -609 522
6981E22j39j326J094J89j128O99Q42j296O27Q59j544N17Q99j340K4J244j055j84
6999d96J376j244j07J167o72p88J353m49j046J576j75j204J405j86j305R97L87
7016E89j183O59O64j397M05R38j607N38J003j045N5J061j055J69Q77q37m16J322
7034G40o76o53J382q36o85J285l25j149J473m21p61R70R2j363J083K60j236Q86
7052F6O75j171K41J064j479L02Q94r86j99J487r81n38J326p27o56J387p26n73
7070e94J307l49j158J405L6j274R41K22j347R99M72j336P36Q03j325L99Q64j405
7088f04L13Q38q07j18J396j203m97J371q65m37J208m27r30J515n03r82J194j0
7106D52j265J051Pq76Q27M30j365P98Q32j384K27R85j449O38J143j528n9J194
$$ plain form
6981 522 383 -943 151 340 -788 -89 753 -543 84 943 -601 -84 815 -525 -501 743 -312 -496
6999 -496 880 -364 -471 696 24 -764 589 140 -906 670 495 -709 696 510 -795 202 589
7016 589 -594 65 729 -668 -263 675 -932 -394 609 -436 -381 680 -375 -206 671 -166 -582 740
7034 740 64 -589 793 -43 -728 557 232 -917 556 135 -626 344 436 -927 156 416 -820 66
7052 66 741 -430 -189 875 -604 -302 592 -394 -593 894 -87 -625 701 -26 -682 705 -21 -594
7070 -594 713 364 -794 611 647 -627 314 536 -811 188 660 -676 60 863 -462 -63 801 -604
7088 -604 -291 547 -260 -378 1018 -185 -682 689 -176 -613 595 168 -762 753 250 -732 462 452
7106 452 -813 238 245 -631 196 626 -739 59 891 -493 -266 719 -730 -92 1051 -477 -536 658
7124F58r57k82J355p10q80J299l38r53J320k18j075J189n5j209J232K13j346J060
7142C03K35j053M45R67j333J93J252j601J03J324j301j87J548j068m85J324o97
7159c1n17J209m00r66J474k67j183J056J14j221Q14O41j611J181N09j507O78N55
7177E28j291L45J123j146p6J430j226l71J643j314m80J607j123m16J339n64q30
7194h22J386j02j284J429q9j513Q35Q04j362P64M31j401O28J019j131R5J238j517
7212e92Q9J495j280k19J338q32p42J357n38j039J629n13j138J797n61j321J517
7229D47nj385J222N56j477R08L33j300P02P52j355L59R88j261J9J412j266k80
7247f31J659j345m53J555q62o56J549n60j367J666j95j278J398j71j502J342M15
$$ plain form
7124 658 -299 -581 774 64 -816 483 145 -808 512 294 -781 408 353 -856 376 589 -757 303
7142 303 538 -515 -70 897 -436 -243 1009 -592 -489 835 -466 -653 895 -173 -658 666 -31
7159 -31 -548 661 261 -705 769 502 -681 375 489 -732 82 723 -888 293 802 -705 -27 528
7177 528 -763 -418 705 -441 -517 913 -313 -684 959 -355 -835 772 -351 -767 572 8 -822
7194 -822 564 462 -822 607 518 -995 -160 644 -718 46 477 -924 -296 723 -408 -313 925 -592
7212 -592 -503 992 -288 -507 831 -1 -743 614 76 -963 666 153 -985 812 251 -1070 447
7229 447 442 -943 279 835 -642 266 599 -701 1 753 -602 -243 745 -516 -497 915 -351 -631
7247 -631 1028 -317 -770 785 -77 -733 816 256 -1111 555 360 -918 480 309 -1193 149 564
7264E64j332Q15O22j513P90P69j347J08J437j424j65J597j057n50J646j163n70
7281g73J567q98n97J511k34j685J719k07j469J634N9j444J230J52j205P76O19
7298G55j729Q19Q75j171J92J491j720k2J454j387j55J574j078p68J781q10r94
7315h93J717n31j280J481j58j379J816l39j313J120N78j556P80R07j799O52J004
7332H07j608L38J419j505J57J236j180k91J535j042m91J315o15j006J607k10j356
7349h90J247j23j031J016L30j522J116O87j715R29P50j579N42J042j267K11R07
7366F50r55j46J508j369m23J417q02m59J210q51m37J321l66j234J404J37j399
7383g94J212lj236J066M15j628Q58Q39j144N9J114j096J6J070j531K88J244j065
$$ plain form
7264 564 -768 47 669 -844 -54 715 -632 -524 913 -511 -676 921 -136 -686 960 -203 -773
7281 -773 794 -104 -701 810 576 -1109 610 403 -1066 568 627 -817 413 565 -640 136 755
7298 755 -974 -155 720 -451 -259 1232 -488 -510 944 -443 -598 976 -102 -870 911 101 -893
7315 -893 824 293 -987 494 336 -1043 773 434 -879 241 819 -737 43 950 -849 -197 807
7332 807 -801 -463 956 -549 -392 844 -336 -627 908 -134 -625 690 75 -931 676 466 -890
7349 -890 357 234 -797 219 549 -973 143 830 -885 44 794 -785 -243 799 -468 -257 650
7366 650 -305 -451 1057 -312 -735 682 -120 -579 631 -220 -657 664 298 -936 468 605 -794
7383 -794 418 415 -821 245 660 -968 -110 729 -415 -356 758 -338 -322 748 -783 -495 749 -316
7401c16k74J319p87n42J354p15q84J411j39r38R02J71j556J409L46j465Q66O59
7419H21j495O87J097j895N78Q64j205J74J088j156j86J288j104p5J367r96o42
7436g90J490p20n54J300m21r07J028k4j339J433K16j261O14Q39j589P03O57j182
7454e07O63P31j454J82J094j014k65J432j095l75J710j282n75J293m51p85J188
7471D90j81j295J407j80j166J301L56j425P69O27j360O62O05j293M37J314j621
7488e53K02J268j198l93J453j026o16J357m39o33J251n95q68J216j66r97J170
7505D33J37j367J108K82j448J128N33j503P85N92j335N61Q58j339P0J312r59m66
7523f18J258q96l75J347o23r63J735o02j036J629n33j055J323k46j365J220M03
$$ plain form
7401 -316 -590 729 -58 -600 754 39 -845 566 427 -511 391 562 -994 415 761 -704 162 821
7419 821 -674 13 1110 -785 -207 657 -548 -374 714 -442 -628 660 -444 -519 848 -148 -790
7436 -790 700 -20 -574 726 305 -602 426 402 -937 496 712 -549 65 904 -685 18 675 -507
7454 -507 156 887 -567 -385 709 -305 -570 862 -233 -608 1102 -180 -755 538 87 -698 490
7471 490 309 -986 421 241 -925 376 732 -693 76 703 -657 5 610 -683 -246 1068 -553
7488 -553 -351 917 -281 -674 779 -247 -863 494 55 -578 673 78 -790 426 260 -737 433
7505 433 570 -797 311 593 -855 273 806 -697 88 680 -655 -94 764 -575 -505 807 -152 -618
7523 -618 640 -256 -631 716 93 -870 865 263 -773 856 323 -732 591 345 -1020 200 603
7540F03j536J108N79j439O40O86j313N32J043j328k3J189j099p6R97r20l33J729
7558A039j036p44J439l78j137J696k35j300J038N6j252J014O67j568Q20P09j520
7575f92O40R98j441J06J093j129j40J501j331L5J574j292n92J298o89o34J393
7592F98p89q29J546k66j260J461q1j413J179J26j082Q80O74j568N57J117j559
7609f09N45Q83j197J79J165j266l83J479p43q04J535j051n70J488m61j032J323
7626D81k29j264J497Q0j278R07L63j299P61M95j075N06N33j333M58J323j498L51
7644b21J010j061l04J367j055o22J691q18o99J386m40j113J500m26j014J264j92
7661B53j139J005L37j215Q56M85j172L90J147j505M46J013j469J62J252j022l12
$$ plain form
7540 603 -933 175 754 -685 -45 641 -672 -140 903 -425 -448 741 -358 -434 563 -357 -690 1039
7558 1039 3 -741 698 320 -817 879 644 -656 382 438 -814 200 867 -701 119 828 -692
7575 -692 -52 946 -495 -389 704 -425 -565 936 -395 -360 1214 -78 -670 628 -61 -695 698
7592 698 -91 -920 626 360 -900 561 480 -933 246 372 -710 170 844 -724 -167 950 -609
7609 -609 -64 819 -378 -199 966 -300 -683 796 53 -751 784 -267 -837 651 190 -842 481
7626 481 252 -1012 485 565 -713 194 557 -742 19 514 -561 -55 478 -855 -397 926 -572 -221
7644 -221 789 -272 -576 791 -264 -886 805 -13 -712 674 234 -879 621 195 -819 445 253
7661 253 -886 119 456 -759 97 582 -590 -200 947 -558 -112 901 -568 -406 846 -176 -488
7678d88J127p73n03J393o93p84J361o28n79J223k31j075Q74K63j488J008P32j587
7696h48Q80O95j288N99P79j208O2J022j180jJ200r59k5J165r83m84J390o44j005
7715h33J624o12j105J517k30r65Q85J76r83O70L60j356Q76N58j066N82P80j212
7733c34J31R81j234J81J242j085m05J330j015m62J076m41p41J320m33p49J157
7750E19k61r42Q82M71j302Q10M40j489R51P99j597N93O70j033M69J000j481N1
7768d50J398j283n6J091o76p47J418p67o09J075j36j046J176J60j531J470p4j164
7786g51R80L86j342P58P28j653P67P88j187K83R14r10q0J373j336k62J308r26
7804a62m61J175k69q05J369o20r15J292l01j535J500P9j014P70M41j346N87J191
$$ plain form
7678 -488 639 -134 -637 756 63 -721 640 12 -567 656 425 -650 224 487 -1001 7 739 -848
7696 -848 32 727 -561 38 817 -391 -329 693 -487 -488 712 -247 -272 893 -90 -574 816 172 -833
7715 -833 791 179 -926 591 361 -604 281 457 -526 144 504 -852 24 582 -484 98 878 -334
7733 -334 -203 778 -456 -275 967 -118 -523 807 -208 -670 406 -35 -776 544 111 -638 519
7750 519 258 -684 198 669 -633 177 617 -872 79 878 -719 -126 544 -489 -20 980 -501 -450
7768 -450 948 -335 -391 700 24 -723 695 -72 -681 394 258 -788 388 548 -983 487 413 -751
7786 -751 229 615 -727 31 759 -894 -127 661 -526 -243 671 -239 -319 1054 -282 -544 764 -162
7804 -162 -623 552 283 -522 847 227 -688 604 303 -1232 268 347 -667 103 544 -802 -215 976
7822I76j519N32O42j239J87J244j622L32J216j017k69J125p59m02J246m81j064
7839h72J417j30j063R99N6j379J335J66j141R35N24j488O72P79j397N23R68j628
7857g24M06J287j616L14Q42q67l36J402o36o48J238m68j073J680o43r45J239l36
7875A16j113J515l3j208Q52L90j117P29N14j261N36P61j478P74R02j345r7J305
7893G42q99m14J550q98p94J442p66q24J584m96q01R38J51j339J017K36j265J051
7911B15M55j336Q01M63j175K36J139j338J90J007q55k49J084p64o36J410n87o75
7929f15J275m20j016J481k31j267J118K15j407J272J99j317P45O12j235N83P51
7946G43j593N12J315j433p6J156j069q4J386r44o21J586q98n64J361m74j016J512
$$ plain form
7822 976 -543 -11 631 -608 -421 823 -799 -467 749 -268 -537 588 -171 -573 673 192 -872
7839 -872 545 415 -648 351 407 -972 363 529 -612 323 847 -641 31 810 -587 -64 904 -724
7857 -724 -318 969 -647 -333 509 -358 -694 708 72 -576 662 194 -879 801 158 -787 452 116
7875 116 -997 518 485 -723 129 519 -598 131 645 -616 -80 681 -797 -23 879 -466 -563 742
7893 742 -157 -571 979 81 -713 729 -37 -861 723 227 -574 364 515 -824 193 429 -836 215
7911 215 670 -666 135 598 -577 -341 798 -540 -350 657 -198 -447 637 -127 -763 647 60 -615
7929 -615 660 240 -776 705 474 -793 325 540 -867 405 604 -713 32 644 -591 -8 743
7946 743 -850 -338 977 -456 -532 624 -445 -529 857 -87 -708 878 -20 -584 777 303 -713 799
7964G99o29r32J354k95j113R25O07j593R00O33j323O94P75j326J72J114j255p4
7982e67J455j238M6J072q48m43J342q77n86J357l03j246J405m68r38J210O1j317
8000h83J109K40j154P57N53j102N42P00j421K28J028j035P6J142j108J59Q39r55
8018b85m19J439m70j028J385o24q61J493k97j375J415K15j376J001N38j221M63
8035gO04j340O17R54j479K80J088j036j4R93j167r5J200p35m77J096k81q83J324
8054F42m72r28J334n4j146R88n4j202J076L39j186Q52N30j438O75R49j420M9J194
8073G28j216J66R41p07m99J250r12k44J394r41o65J456o31q53J036q9j146J276
8091C44J03j305J233Q3j415R38P34j215N92P39j459O04O98j172K07Q10p54l34
$$ plain form
7964 799 170 -762 592 297 -816 109 716 -877 23 656 -667 27 802 -524 -352 762 -493 -567
7982 -567 888 -350 -304 768 -80 -523 819 -58 -644 713 410 -836 569 101 -837 373 434 -883
8000 -883 226 466 -688 69 622 -480 62 762 -659 -431 597 -438 -362 780 -328 -169 670 -285
8018 -285 -704 735 265 -763 622 -2 -863 630 333 -1042 373 588 -788 213 751 -470 -7
8035 -7 597 -743 -126 828 -651 -371 717 -319 -333 660 -507 -602 598 -137 -614 482 201 -682 642
8054 642 170 -758 576 522 -624 364 310 -892 184 523 -663 189 719 -719 -44 905 -515 -466 728
8073 728 -488 -322 619 -88 -587 663 -249 -493 901 -40 -705 751 120 -733 303 214 -932 344
8091 344 447 -858 375 458 -957 -19 715 -500 92 831 -628 -24 674 -498 -291 519 -235 -569
8109e69J291p81n30J235m93r18J358m15q73J004r5q43P44L81j075Q06Q7j076Q64
8128A02L35j048N09P82j190L19J091j225L9J023q44n67J461q40n28J303q81m06
8146e65J126m45p85J096k63q25J142J03j550J234M52j264M14R07j229M80Q22j467
8164f17K01J304j514L12J100j047k00J078q77j88J211p03q86J501m11j112J392
8181E44k83j064J227Pj119R68L44j383Q00P24
$$ plain form
8109 -569 722 -59 -589 646 153 -765 593 178 -695 309 214 -629 115 496 -579 227 314 -762 102
8128 102 437 -611 -102 680 -510 -191 900 -325 -286 737 -107 -674 787 -53 -581 722 -159 -565
8146 -565 561 116 -669 427 164 -661 481 584 -966 268 720 -544 -130 777 -452 28 850 -617
8164 -617 -416 888 -626 -314 786 -261 -461 617 -260 -448 763 60 -826 675 264 -848 544
8181 544 261 -803 424 431 -688 280 624 -759 41 765
8191G65
$$ Imaginary data points
##PAGE= N=2
##DATA TABLE= (X++(I..I)), XYDATA
0@%%%%%%%%%%%%%jOj3J6j6J6j9K7l2L5m3N1o0O9p8R2j08J23j38J57j77J98k24
36a19K52k81L15l52L91m34M82n34N89o51P18p92Q74r62J059j168J290j422J570
55H25j738J928k150K407k707L070l518M080m813N810p248R518j3611K3126q3669
70f8690j4582J97166j42056l3561J55792j02706o0537J71223q9856r2966J62041
81H1268m1153j16813J36721l0046j20886J32299l398j41527J26646L0483j51500
92i7906J06406O1539j60777Q7690R7419j68821M3895J34266j49204k278J41503
103I3732j21046k3016J52291j09730o7585J56668o6911r4636J31431m2627q9286
114h0715J37751l2687j22387J35408J0120j36928J10184L6350j37765J00162O1755
$$ plain form
0 0 0 0 0 0 0 0 0 0 0 0 0 0 0 -1 5 -8 8 -8 8 -11 16 -16 19 -24 27 -33 36 -42 50 -58 65 -73 84 -93 105 -119
36 -119 133 -148 167 -185 206 -228 254 -280 309 -342 376 -416 458 -504 555 -613 677 -745 825
55 825 -913 1015 -1135 1272 -1435 1635 -1883 2197 -2616 3194 -4054 5464 -8147 14979 -68690
70 -68690 -83272 113894 -28162 -61723 94069 -8637 -69174 102049 12193 -80773 81268
81 81268 40115 -76698 60023 29977 -90909 41390 37992 -103535 23111 53594 -97906
92 -97906 8500 70039 -90738 -3048 94371 -74450 -30555 103711 -45493 -47771 93732
103 93732 -27314 -50330 101961 -7769 -75354 81314 14403 -80233 51198 8571 -80715
114 -80715 57036 24349 -98038 37370 47490 -89438 20746 57096 -80669 19493 81248
125H1248j55361O9623R6197j51515L1283J15506j35375L866J31480j20221k7370
136f0639J44665r3874n8719J38507o8438p2907J35860n4186r7879J41434j5537
147C8287j20442J14964J2277j19242J03868K6381j38957R0786O8985j40719N0589
158a3223Q5139j25470L3682R5809j27260R579J23771j08139k4946J27286q5795
169i567m6345J28004p3177p2363J32664m2592r6513J20912j1812j04084J09472
180C4599O579j17898R9317L8215j27948O9080N9823j16702N3651O8218j24179
191e7245L9206R8089j21479Q15J10971r8111j5822J16467r2994m1268J33793o9453
203B969p7764J24181l4767q6161J14692j5630j00615J08768J3141j14546Q4052
$$ plain form
125 81248 -74113 -4490 91707 -59808 -28525 86981 -48394 -44528 86952 -33269 -60639
136 -60639 84026 -9848 -68567 69940 1502 -71405 64455 10269 -87610 53824 38287
147 38287 -82155 32809 45086 -74156 29712 56093 -82864 7922 76907 -63812 -13223
158 -13223 71916 -53554 -19872 75937 -51323 -41744 82027 -26112 -51058 76228 -9567
169 -9567 -55912 72092 -1085 -73448 59216 16624 -79889 41023 29211 -74873 34599
180 34599 41178 -76720 22597 60812 -67136 1944 61767 -54935 -1284 66934 -57245
191 -57245 -18039 80050 -41429 -40614 70357 -27754 -43576 72891 -20103 -61371 72422 2969
203 2969 -74795 49386 14619 -71542 43150 27520 -73095 35673 48814 -65732 18320
214A8320L5547j11587O6680M6238j15207N5481P0489j17987K8374Q8957j04105
225c8800Q550R6503j00692j0186J18251q6246m7631J20343n4429o4547J08784
236D9900l9662p8453J13242j3705r9828R5463J5682r8601P5936K3679j04666O9654
248H641M6487j13516M7772O9095j03522K8834P8329j02831J2731R8716r7530k0005
260d6799J10976p3328m1960J07243n8828n7563J13042l8082q3312J04878o377
271B9890q8715Q7421N791r3694Q3635K4857j09233O2887N0565j03277M2618O0048
283E2793j00568L3258P9744j02676M456R6173q4617j9389R6728p1162l4033J06069
295E6776n6340o0113J05389k8009p3770R1952j2231p9786Q8336N385r6329P4475
$$ plain form
214 18320 53867 -57720 8960 55198 -60009 -4528 65961 -52026 -23652 65305 -38800
225 -38800 -30250 66253 -34439 -44625 73626 -12620 -60251 60092 5663 -58884 49900
236 49900 10238 -68215 45027 31322 -68506 26957 42639 -55962 19974 43653 -61013 8641
248 8641 55128 -58388 -10616 58479 -45043 -16209 62120 -40711 -27980 70736 -26794 -46799
260 -46799 64177 -9151 -51111 56132 -2696 -60259 52783 14701 -68611 36267 29890
271 29890 -58825 28596 34387 -59307 24328 49185 -60048 2839 53404 -49873 -7255 52793
283 52793 -47775 -14517 65227 -37449 -32993 63180 -21437 -40826 55902 -15260 -49293 56776
295 56776 436 -59677 45712 17703 -56067 35885 23654 -56132 32204 37589 -58740 15735
307A5735L0677r7769N3601M1594r4935M5708N9366j00337K5211Q1670q8873j81
319b8533Q4574p8766j3292R4841p1899l8067J03955m7255n8243R5114k9100o6690
331e3361R2888j4732q5082Q6313J1810r2553O6412K6947r1303N7984M1536r9261
343e2402M1996O5539r2312J8592P2689q2310N647Q1992q1575j7317R5571o2843
355f733m0162R1653m3909m9036R2207l2566o8380R1088o486q2018P3439J0924
367C0021q0747O5419K3531r0559N4524M7668r0673L1378N8280q1823K0755O7072
379E4846q3618K023Q3095p2098k2940Q4002n5867l2786Q7587m6644n0839R3200
391C9961k3571o8330Q0063m483p1653P2783O358q3301O6217L0162q8811M5726
$$ plain form
307 15735 46412 -51357 2244 43838 -51097 -5389 53977 -46360 -21149 60521 -28352 -28533
319 -28533 56041 -22725 -36017 58824 -13075 -51142 52813 5558 -52685 42429 13329 -53361
331 -53361 39527 24795 -60287 26026 37836 -54717 11695 38642 -52661 5323 46859 -52402
343 -52402 -10406 55133 -37179 -18587 54102 -28208 -22561 59431 -22144 -39461 56110 -6733
355 -6733 -46895 44758 849 -48187 44020 11454 -56926 34162 27676 -54342 19097 30021
367 30021 -50726 14693 38224 -52335 2189 49857 -40816 -9438 48842 -32981 -12226 54846
379 54846 -28772 -26749 56346 -15752 -38692 45310 -10557 -43343 44244 -2400 -53239 39961
391 39961 16390 -51940 28123 23640 -48013 24770 31128 -52173 14044 44206 -44605 1121
403A121M4495q3068L3508N3309q6708J8881P1619p9532n543P7438o4684j7130
415c6294Q0586n7698l2877R0475l8984n2738Q4059j9279n9637P6631r583p2183
427d7522P2469J0689q2769N5775K8771p9638M3771L7964q2700L3050N6420q1362
439c5082J0992O7545o7582k421P0593o2668j5056Q1934n1413l6921Q2043l2505
451I459m6477P5634k3870n8366P6595p782p4887O4731J3098p5112N2887K3853
463B9763p7885M7220M2931q2016K7191N8104p2656J1306O1332o8448O46P3351
475E0839o2862k1214P7901m5531l3797P3847l7254m3956P8628k3530o2464P1951
487B2558j564o7543O0991R164p1189N7021K6809p8875M0692M5015p2297K3052
$$ plain form
403 1121 45616 -37452 -3944 49365 -37343 -18462 53157 -26375 -31918 45520 -19164 -36294
415 -36294 44292 -13406 -46283 44192 5208 -47530 36529 17250 -42387 34244 24661 -47522
427 -47522 24947 35636 -47133 8642 37413 -42225 1546 39510 -43190 -10140 46280 -35082
439 -35082 -24090 43455 -24127 -26548 44045 -18623 -33679 48255 -3158 -40079 41964 9459
451 9459 -37018 38616 14746 -43620 32975 25193 -49694 15037 28135 -46977 5910 29763
463 29763 -48122 -902 42029 -39987 -12796 45308 -27348 -16042 45290 -23158 -22512 50839
475 50839 -12023 -33237 44664 -867 -34664 39183 1929 -42027 36601 13071 -49393 22558
487 22558 20994 -46549 14442 23606 -47583 9438 36247 -42628 -1936 43079 -29218 -6166
499f166M9245p0372J3582O0917o8394o424O9985n3151k0025O8402m4998k8846
511c6245P5586l6033m7412P4375j5191n7266O4760l923o2565O2684J0958p4098
523d4370N0346L0938p2057L4213L8401o9870K6204M9830p2282Q827O2551o1162
535a8431o819O4159n2899j5391P2161m6985l3966P5792k9090m7954O8262j6801
547A2038n4657O7246m262o7064N9776J6576o9313M4270K7025o7365L7266L7813
559C9349p2006K3395N2134o5410N053N6553n8369k819O4078n5145j9879P2255
571C9189l9265l6026O7277k6820m2522O6840j6702n6291O3915L193o2626N1347
583A1509J4673o2116M5657K4407o9522L4860M0757o8243J7767M8050o2693Q821
$$ plain form
499 -6166 43079 -27293 -13711 47206 -21188 -27612 42373 -10778 -30803 37599 -7399 -36245
511 -36245 39341 3308 -44104 30271 15080 -42186 22574 18651 -43914 18770 29728 -44370
523 -44370 5976 36914 -35143 -930 37471 -32399 -6195 43635 -28647 -19820 42731 -18431
535 -18431 -25250 38909 -13990 -29381 42780 -4205 -38171 37621 8531 -39423 28839 12038
547 12038 -42619 24627 20365 -46699 13077 29653 -39660 4610 31635 -35730 1536 39349
559 39349 -32657 -9262 42872 -22538 -17485 39068 -19301 -22120 41958 -13187 -33066 39189
571 39189 -76 -36102 31175 4355 -38167 28673 11971 -44320 19595 22788 -39838 11509
583 11509 26182 -35934 9723 34130 -35392 -532 40225 -28018 -10251 37799 -24894 -16073
595a6073N6073o1584o228O8220m9282k3797O7374l6269l1692O7011k8548m4910
607c9705O7590j1506n6332N8192K049n7627N2890J1284o5819M6133K8408o9370
619c3813L0193L9020o3998K0123M6769o5103P514O0776n7137j1229O3209m3852
631g528k0108O3343l8035l2542O7224k3878m6683O0759r541m9452N5993j489n7713
644c9650N3794J5876o5424L9577K8897o2636K9282L5626o5058J9455M9890o2005
656b2376J214N6898n0624q627N8256m6334j8580O5497l5747l5219O3616k0786
668G188m1457N9869j3801n0062O0780J737o1711M9700J7427o1619L8611K4724
680C1386o5083L0619L9499o5835J3701M9679n5472K859N2098n1820n068O1126
$$ plain form
595 -16073 40000 -21584 -27812 40408 -8874 -32671 34703 -1566 -33258 33753 5205 -39705
607 -39705 27885 16379 -39953 18239 20288 -37339 15551 26835 -38984 7149 35557 -33813
619 -33813 -3620 35400 -28598 -8475 38294 -26809 -19295 41481 -15656 -26885 36324 -7528
631 -7528 -27636 35707 -2328 -34870 32354 8476 -38207 22552 13011 -36441 19552 18063 -39650
644 -39650 14144 30020 -35404 4173 33070 -29566 -284 35342 -29716 -10261 39629 -22376
656 -22376 -21162 35736 -14888 -23515 34741 -11593 -30173 35324 -423 -35642 27974 7188
668 7188 -34269 25600 11799 -38263 22517 24254 -37457 12243 29670 -31949 6662 31386
680 31386 -33697 -3078 36421 -29414 -15713 33966 -21506 -18647 33451 -18369 -23437 37689
692C7689m5069k2235O3019l1551l1000N9963k4851m0372O2526j1797n4227N5142
704A7237N419n7275M5195J4231o0593L9179K7922o4457K4450M0294n6955J3265
716a2088M4377n3981O121N3352n0830r349N8872m0055k0877N7937l4266l0498
728c1285O2650k4195m5629O0614p001n1954N1765L598n5895M7727J6739o2697
740c5563L6130L0943n9282K3141L6009n6510J6843M5367n6841K827N4128m8025
752a0833j0192N5349m2077j9215O0391l5319l4270O2542j8848m4054N6159p082
764A2551m8180N3069L898n7241M5032J9654n8166L1859K6883n6450K5462L5303
776C3674n8962J3616M7184n2637k02M9521m6195p638N5390m2582k2193O1195k8935
$$ plain form
692 37689 -7380 -29615 33404 1853 -29147 30816 5965 -34407 28119 16322 -37905 17237
704 17237 22656 -34619 10576 24807 -35786 3393 31315 -33142 -8692 31602 -25353 -12088
716 -12088 32289 -21692 -15571 37781 -13049 -22398 36474 -3581 -24458 33479 -787 -31285
728 -31285 31365 7170 -38459 22155 15154 -36800 14965 18563 -37332 10395 27134 -35563
740 -35563 567 31510 -27772 -4631 31378 -25132 -8289 37078 -19763 -16936 37192 -10833
752 -10833 -21025 34324 -7753 -26968 33423 -1896 -36166 26376 7528 -36526 19633 12551
764 12551 -35629 17440 21338 -35903 9129 28783 -29383 2476 29359 -27091 -1629 33674
776 33674 -25288 -11672 35512 -17125 -17327 32194 -14001 -21639 33751 -8831 -31024 30171 1236
789A236l4141N6940j7748l9251N6684q699n0104N2490O872n5362M0620J5935n5357
802b9885L4764K4780o0712K5334L8784n7654J1351M4339n1160L467N0772m9458
814a5278r679N9082l8857k3686N7352k8333k9628N7706k1193m1184N7496o146
826A7652n0148M7593N053n1918M2247J3146n7987L5377K8463n8955K1732L6810
838B9065n3024J3767M3252n2717K403N2973m5431j2557N3890l5480k0122N4632
850C0651l0220l0951N7485j7659m1915N1850n641m5532M7738J859n3069M4267
862H863J6371n7697L2318K7729n4640K3661L4701n5567J4570M5986n2313j143
874a7161N0480m3467j0046N2031l9533j9733N7682k9133l2980N5517j6289l8515
$$ plain form
789 1236 -32905 24035 6287 -32964 23720 15021 -35083 17407 24279 -31083 9537 25472 -29885
802 -29885 4879 29659 -31053 -5719 33065 -24589 -13238 31101 -20059 -16592 34180 -15278
814 -15278 -24957 34125 -4732 -28418 28934 601 -29027 28679 7486 -33698 23798 17652
826 17652 -32496 15097 20150 -31768 10479 23625 -34362 1015 29478 -29477 -7745 29065
838 29065 -23959 -10192 33060 -19657 -17254 35719 -9712 -22269 31621 -3859 -23981 30651
850 30651 431 -30520 26965 9306 -32609 19241 13600 -31932 15806 17665 -35404 8863
862 8863 25234 -32463 -145 27584 -27056 -3395 31306 -24261 -9691 36295 -16018 -17161
874 -17161 33319 -10148 -20194 31837 -7696 -27429 30253 1120 -31860 23657 7368 -31147
886c1147N1881q780m6201N0646M408n4276M1078J7100n4049L1838K5082n5664
898b8084K4178L7500n5566R543M4943m7953l96M7007m4182r277N3966l7213k2401
911b7935N4767k4972k9697N2076j7812l7275N2475o602m7931M6389O336n0334
923c0515L8357J4574n3319L3216K6824n6171K0909L7361n1205R545M1537m8466
935a7353J685M9175m4507j2427N3431l3776k1535N2233k7175k8920N5113j8074
947G870m0959N2137m360m5897M4632M082m9698M1291J5804n5981L1767K8519n3172
960b3965J9635L4182n1158J1878M2583n0146j403M9314m0113j2857M9350l3514
972f214j9123N3301k6723l1361N3189j3469l8837M7141n134m3220M5178M692n1101
$$ plain form
886 -31147 20734 11954 -34247 16399 20807 -33469 7609 24709 -29340 2498 27580 -28084
898 -28084 -3906 33594 -21972 -12429 32514 -15439 -15835 31172 -13010 -22287 31679 -5534 -27935
911 -27935 26832 1860 -27837 24239 6427 -30848 21627 15025 -32906 13483 19819 -30515
923 -30515 7842 22416 -30903 2313 29137 -27034 -6125 31236 -19969 -10424 31113 -17353
935 -17353 -15668 33507 -11000 -23427 30004 -3772 -25307 26926 -249 -29169 25944 7870
947 7870 -33089 19048 14688 -31209 13423 17505 -32193 9098 24902 -31079 688 29207 -23965
960 -23965 -4330 29852 -21306 -9428 33155 -16991 -18394 30920 -9193 -22050 27300 -6214
972 -6214 -25337 27964 1241 -30120 23069 9600 -29237 17904 12770 -30450 14728 19420 -31681
985c1681L8079J8380n1613K7388K5945n0929K1110L4242n2399Q992M3832m5554
997a4208l060M5907l9417r818N0212l4457k1868N3306k3148l1065M9370j4979
1009F775l6118M9355p237m5261M5349P075m9884L6371J6373n0565L0974K5168
1021B8375n3453K0053L6598n0250P077M0939m4849l00M5678m1263j1563N0834
1033B7876l1512k1991M9342k3078k7358M9472j6144l6891M8965l683m4257M1725
1045A2466O544m6140L6296J4509n0900K8875K7098n1597J6228L4115m6857P807
1057a1556L9095m4838j537M6964l7982j2549M7938k9336j9022M9106k4430k8302
1069b6449N0732j3870l8160M5615l470m1818M1552M229m8426L7102J6977n1767
$$ plain form
985 -31681 6398 24778 -26835 553 26498 -24431 -3321 30921 -21478 -12486 31346 -14208
997 -14208 -17268 28639 -10778 -20596 29616 -4841 -26709 26597 3449 -27616 21754 6775
1009 6775 -29343 20012 12775 -32486 12863 19938 -29946 6425 22798 -27767 3207 28375
1021 28375 -25078 -5025 31573 -18677 -11600 29339 -15510 -15810 29868 -11395 -22958 27876
1033 27876 -3636 -25627 23715 637 -26721 22751 6607 -30284 18681 14998 -29259 12466
1045 12466 19010 -27130 9166 23675 -27225 1650 28748 -22849 -6621 27494 -19363 -11556
1057 -11556 27539 -17299 -18836 28128 -9854 -22403 25535 -3801 -22823 26283 1853 -26449
1069 -26449 24283 10413 -27747 17868 14398 -27420 14132 18361 -30065 7037 24014 -27753
1081b7753K5677K6564m8403J7608L2532m8275R734M1550m3887k952M5570l5816
1093g851r958M6382l1686j9217N0032k3237l0530M7472j2873l5935M4310n483
1105A1426m2455M2455O655m7724L3261J7525m6843K5642K4201m7792J8537L4038
1117B8926m6617O220L9948m0066k156M2357l7018j0407M7542l0653k2201M7132
1129B3007k0302k8559M5261j4006l5088M5448l207m2700L9648Q685m4424L2651
1141F414J5175m6910K7396K5144m8696J6038L3429m4668O967L7266m2172p39M3978
1154B8622l7551j2707M6952k8374k0481M5907k1514k7448M7117j2660l6626M3850
1166A5087j039m0123L7258O556m3129L3505J5309m7759K3928K5519m5343J4585
$$ plain form
1081 -27753 -2076 24488 -23915 -6307 26225 -22050 -12316 29234 -14653 -17605 27965 -7851
1093 -7851 -17809 28573 -3113 -22330 27702 4465 -26065 21407 8534 -27401 16909 11426
1105 11426 -31029 11426 18081 -29643 3618 21143 -25700 -58 24143 -23649 -5112 28926
1117 28926 -17691 -11471 28477 -11589 -13745 28612 -8406 -18813 28729 -1924 -24125 23007
1129 23007 2705 -25854 19407 5401 -29687 15761 12554 -30146 9502 18187 -26237 6414
1141 6414 21589 -25321 2075 27219 -21477 -5439 27990 -16678 -9711 27555 -14617 -15356 28622
1154 28622 -8929 -21636 25316 -3058 -23539 22368 854 -26594 20523 7863 -28763 15087
1166 15087 14048 -26075 11183 17739 -25390 8115 23424 -24335 -407 25112 -20231 -5646
1178e646L0634m4121P980L8354m1445l539M3448l3134j2230M3634k7022j9574
1190b2661M6376k0339k9372M5228r557l4869M0313k043l8676L7259O421m4515
1202b6435L1098J7390m5623K2304K3472m4382J6368L1299m4726O602L9496l8732
1214a1869l702M1533l3316j0549M4585k8378k1408M6241j8425k8979M2676j0853
1226G556l3246M1247k893m0481L7455P769m2820K9303J5792m3583K3802K3420
1238B3321m5149J5352L2940m2176N022L6800l7103k519M0411l3825j2567M4230
1250B4737k5159k1912M2002j7103k6289M1719j0765l3852M0391O8l9073L3699
1262H463P732m0207K9920J4778m4109K2560K5220m3415J2735L0896m0076N824
$$ plain form
1178 -5646 24988 -19133 -11153 27201 -14244 -17783 25665 -7469 -19699 23935 -3087 -22661
1190 -22661 23715 3376 -25996 19232 9675 -25194 15119 13076 -25600 11659 18080 -26435
1202 -26435 4663 22053 -23570 -1266 22206 -22176 -5808 25491 -19235 -12633 26863 -11869
1214 -11869 -15571 25962 -7354 -17903 26682 -1696 -23104 23137 4712 -24267 18409 7556
1226 7556 -25690 15557 12664 -27817 9638 17407 -25413 3890 19682 -23901 -99 23321
1238 23321 -21828 -6476 26464 -15712 -10690 26110 -10993 -13512 26899 -6926 -19493 24737
1250 24737 -422 -22334 19668 2565 -23724 17995 7230 -26622 13769 13837 -25236 8463
1262 8463 16195 -24012 5908 20686 -23423 -863 24357 -19058 -6323 24573 -15503 -9679
1274i679L5489l7734l923M1460l1150j4070M1685k3646j9466M1924j8512k7011
1286b4633M2785r038l3872L7723m57l6405L4228N780m1451K9868J6733m3654J9910
1299b483K4636m1147J3410L0097m0688N064L7240l5606n780L8754k9079j1558
1311a7140L9859k4547j9768M1895j6348k7687L9472p896l1609L6805j337l6845
1323b5146L4000Q446m1062K6532J7076m0396J9981K3022m1378J3154L1384l9376
1335a3763K499L5412l3496m620L7024k9802j1949M0676k3408k0610L9986j4845
1347C104k5625L8977r280l1536L8132n20l7350L2362Q623l8844K6051J5426m0753
1360b1233K0523K3835m1111J1121L0281l6776L012L3474l3883l613L7558k8906
$$ plain form
1274 -9679 25810 -11924 -15847 25613 -5537 -19607 22078 -1568 -21034 20890 2378 -24633
1286 -24633 18152 9114 -24758 12965 12508 -23897 10331 16111 -25340 4528 21261 -22393 -2483
1299 -2483 22153 -18994 -5584 24513 -16175 -11111 26129 -9477 -15257 23497 -5582 -17140
1311 -17140 22719 -1828 -21596 20299 3951 -23736 15736 7840 -23769 13036 11699 -25146
1323 -25146 8854 17300 -23762 2770 19846 -20550 -569 22453 -18925 -5771 25613 -13763
1335 -13763 -11264 24148 -9348 -13968 23056 -6746 -18695 21981 -1427 -22037 17949 3104
1347 3104 -22521 16456 7176 -24360 13772 13252 -24098 8264 16887 -21957 4094 19520 -21233
1360 -21233 -710 23125 -17986 -6865 23416 -13360 -10348 23126 -10757 -14370 23188 -5718
1372e718j3172L9591k1287j9614L8449j5528k4942L8881q262l2064L4886J591
1384A2811l4998K9702P740l7854K6179J6205l9941J8175K3751l7551R988K8207
1396B2414l5820L703L3325l3175n615L6596k6329j3010L7177k1398j8514L8699
1408A8053j5177k6025L7588n707l0663L3390K86l3825L1371P784l8439K4847J6680
1421B0163l8088J7252K1594l7658J1464K7793l6937K418L3564l1557n424L4883
1433A9467k6106j1200L7663k1224j9320L8287j2135k4988L5125o334k8808L2889
1445A3316L49l4841K8734R328l6961K2364J5012l6622J6849K1825l7524R529K9064
1458B0422l3708J553L1859k9533m431L5369k5809j2539L7516j8348j9796L5580
$$ plain form
1372 -5718 -18890 20701 -586 -20200 18249 2721 -22221 16660 8398 -23666 11220 12811
1384 12811 -22187 7515 15255 -22599 3580 19785 -20156 -1981 21770 -15781 -5793 22414
1396 22414 -13406 -9703 23622 -9553 -15168 21428 -4901 -17911 19266 -2132 -20646 18053
1408 18053 2876 -23149 14439 8732 -21931 11459 11745 -22080 9291 17075 -21364 3483 20163
1421 20163 -17925 -673 20921 -16737 -5273 22520 -14417 -11999 21565 -9992 -15416 19467
1433 19467 -6639 -17839 19824 -1400 -20720 17567 5432 -19556 15569 9235 -19573 13316
1445 13316 13665 -21176 7558 16886 -20075 2289 17301 -19321 -2472 19353 -18171 -8642 20422
1458 20422 -13286 -11733 20126 -9407 -13838 21531 -4278 -16817 20699 2351 -17445 18135
1470A8135j2462k4287L4092o712l0381L2102J662l3691K6601Q268l4995K3076
1482A408J5242l7096J7394K2927l5674R044K7690l2443K830L1320l0401n258L5251
1495B2234k4470j3601L4933j8491j8401L4862j3461k4864L4427n502k9555L0024
1507H135K253l1470K6917Q085l4549K2915J6047l5354J5167K1858l3587Q776K6113
1520B1306l2620J490L1481k8753o825L2930k3096j2111L3720j8369j8385L5070
1532A5838j1609k4823L2411m515k6939K9450J326l1270K6817Q903l3778K0048
1544A859J5639l3689J5038K0130l3889Q942K6473l2233R73L0227k7435n352L2018
1557A8701k3512j1443L4475j8039j8532L3510j0623k2937L1548n654k7233L0099
$$ plain form
1470 18135 5673 -18614 15478 8766 -21615 10487 12149 -21542 5059 13327 -21668 1408
1482 1408 16650 -20446 -3052 19875 -15799 -6755 20935 -11508 -8678 22642 -7759 -13017 22234
1495 22234 -2236 -15837 19096 605 -17796 17066 3605 -21259 13168 7666 -21889 8135
1507 8135 10388 -21082 5835 13920 -20629 2286 18333 -17021 -1854 20004 -13583 -4807 21306
1520 21306 -11314 -9824 21657 -7096 -13921 19009 -4087 -16198 17522 -847 -19232 15838
1532 15838 4229 -20594 11817 7302 -19637 9813 11139 -20131 6686 15589 -18189 1859
1544 1859 17498 -16191 -1153 18977 -14912 -5970 20503 -11730 -10757 19470 -7965 -13317 18701
1557 18701 -4811 -16254 18221 182 -18350 15160 4537 -18400 13148 7494 -19739 10360
1569A0360J972l1802K4868R000l1817J9584J3975l3189J5230K0532l3317P479
1581g125K6031k9359J078K8229k6753m929L2260k2605j2891L3251j6010j7783
1593a6606L1625j0981k2569L1234m361k8114K7835L430k9521K3045Q220l1429
1605a8192J9920J5173l3117J3274K0867l0717O876K4389k9301J418K9118k6515
1617f807o543L1535k1025j1940L1620j6789j7157L2111j0783k3178L0548l574
1629H018k6770K6806K423k9269K4144Q995l2139J8515J5924l1409J2527J9494
1641A7259l0171O994K4602k8803O6K8608k4712o162K9396k0169j1568L1052j6089
1654C03j7893L1353r270k2394K8766l434k5313K6569K451k9376K2757R906l0679
$$ plain form
1569 10360 12332 -19470 5398 14398 -17419 2165 16140 -17049 -1819 18713 -14604 -7125
1581 -7125 18906 -10453 -9375 18854 -7899 -12828 19432 -3173 -16064 17187 1177 -16606
1593 -16606 15019 4038 -18531 12703 8342 -19772 8063 11493 -18028 5017 13237 -18192
1605 -18192 1728 16901 -16216 -2942 17925 -12792 -5916 18473 -10828 -9410 19708 -6807
1617 -6807 -13350 18185 -2840 -14780 16840 51 -17106 15005 4222 -18956 11592 8018
1629 8018 -18752 8054 10477 -18792 5352 14347 -17792 723 16647 -14762 -2235 17259
1641 17259 -12912 -5918 18684 -10119 -10053 18555 -6157 -12319 17077 -3092 -14660 16392 303
1654 303 -17590 13763 4493 -17901 10865 7431 -17882 8687 11138 -18238 4519 14425 -16254
1667a6254J7103J4543l0253J2527J9572l0377O758K4369k7278m62K7080k3501
1679f173n460K9220k0630j1757L0991j4808j7634K9505r123k1377K8488l862k5803
1692a8423K6322L271k8645K1641Q846k9145J7807J3586l0309J2217K0067k9047
1704a1812N534K3624k6489O93K6285k4276n858K9491j9286j2371K9036j3976j6574
1717a5979K9016r220k1419K7921k716k4960K4427L452k6935K1225Q275k9215J6801
1730F73J4933k9010J0111J9489k7457N851K2458k6468n0K6858k2907o682K7908
1743A5707j8167j1129K8360j4023j6725K8960q352k1200K6419k818k3786K4207
1755G453K449k6956K1205R254k9071J5806J4397k8107J1075J8539k7730N843K3192
$$ plain form
1667 -16254 849 15392 -14861 -2334 17238 -13139 -6381 17988 -9290 -9752 17328 -6173
1679 -6173 -11633 17587 -3043 -14800 16191 1383 -16251 13254 4131 -17246 11242 7380 -18423
1692 -18423 7899 11170 -17475 4166 13012 -16133 1674 15260 -15049 -2832 17235 -11812
1704 -11812 -6278 17346 -9143 -8450 17835 -6441 -12299 17192 -2094 -14465 14571 595 -15979
1717 -15979 13037 3817 -17602 10319 7603 -17357 7070 10522 -16413 4812 13087 -16128 673
1730 673 15606 -13404 -3293 16196 -11261 -5410 17048 -9420 -9470 17388 -5519 -12201 15707
1743 15707 -2460 -13589 14771 748 -15977 12983 4631 -16569 9850 7032 -16754 7453
1755 7453 9902 -17054 4151 13405 -15666 140 14537 -13570 -2495 16044 -11686 -5843 17349
1768A7349k5405r04K5351k1570n780K6437j8394j1264K8485j3532j7137K7666
1780A1302p304k0232K5679k599k4003K4408L857k7089J9910R383k6944J4990J3633
1793A4991k7771J0609J8776k6995M149K2475k4335j213K4317k1149o505K7040
1805A4389j7330j1718K7275j1568j5899K6812p705j9668K5923j719k3831K2489
1817G450M282k5854J8672Q429k7189J4891J3797k8046R273J8621k5597M017K1383
1830A4129k3388m93K5001k0826o364K6940j6312j0776K6362j2104j5474K6880
1842A3575p732k0335K4488j526k3519K1373L181k5286J8455Q912k7229J3713J4467
1855A2537k5566Q583J8274k4469M674K1811k3010j104K4379j9016p035K5264j5831
$$ plain form
1768 17349 -8056 -8960 16391 -5179 -10959 15478 -2916 -14180 14305 773 -16364 11302
1780 11302 3998 -16234 9445 6846 -17157 7251 11108 -15981 3929 13312 -13632 1358 14991
1793 14991 -12780 -2171 16605 -10390 -6241 16234 -8101 -9314 15003 -6146 -12651 14389
1805 14389 -2941 -14659 12616 1048 -14851 11961 4256 -15412 10511 8792 -15039 7450
1817 7450 11732 -14122 4550 12979 -14210 681 14478 -13568 -4295 14326 -11271 -7254 14129
1830 14129 -9259 -9752 15249 -5577 -11941 14999 -1313 -12089 14273 2169 -13305 13575
1842 13575 5843 -14492 9996 8470 -15049 6324 9505 -15781 2674 11586 -15643 -1930 12537
1855 12537 -13029 -4446 13828 -10641 -5967 15844 -7166 -8270 16109 -2907 -9942 15322 -509
1868e09j1090K5883j2301j6441K5469o207k0294K2963j110k2759K1623L691k4938
1881a6020J8159R474k5599J3735J3816k5362R776J7420k4781L958K1679k2601
1893f346j679K3108j9678n876K4515j5962j1589K6265j1419j6095K4795o143j8984
1906a5088K3530j399k2438K1480M148k4474J6878R319k4871J3603J3047k5490
1918a1755Q394J7936k3892L522K0366k1712j216K2618j9149o392K4892j4612j1630
1931a2630K4781j0470j5430K4553o368j9141K2874p57k1978J9747M489k3868J6807
1944B609R037k4920J3212J3258k4703Q169J7488k3258L462K0599k1963j272K3525
1957A5243j9148o698K3961j4635j0818K4457j1028j5522K4473n668j9501K2699
$$ plain form
1868 -509 -11599 14284 1983 -14458 11011 4804 -15490 7473 6363 -16396 5227 8918 -16020
1881 -16020 2139 11613 -13986 -251 13565 -11797 -2021 15399 -9382 -5424 16255 -6346
1893 -6346 -8025 15083 -4595 -10471 14044 -1918 -13507 12758 1339 -14756 10039 3896 -15088
1906 -15088 8442 7043 -15395 6085 10233 -14241 2637 11956 -12915 688 13735 -11755
1918 -11755 -3361 14575 -9317 -5795 14571 -7141 -8357 14261 -4888 -11280 13612 -1000 -12630
1931 -12630 12151 1681 -13749 10804 4436 -14705 8169 7412 -14566 5181 9670 -14198 2609
1944 2609 11646 -13274 -62 13196 -11507 -3338 14150 -9108 -5646 14953 -7010 -8282 15243
1957 15243 -3905 -10603 13358 -1277 -12095 12362 1334 -14188 10285 4617 -14884 7815
1969G815q94k1308J9823M007k3296J6714Q880k4285J2355J3323k3822P722J6831
1982A3865k2980L353K0450k1325k254K2627j7781o348K3614j4741j1159K4815
1994A2136j0378j5702K3671m871j8431K1407r67k0950J9342M471k3298J5594R335
2007A1359k3159J1619J3152k3982P924J7152k2670K389K0130k0010j851K1682
2019A3735j7961o489K4200j4575j1193K3822r851j5015K2825n183j8599K2125
2031G841q68k1033J8973M756k2860J5872Q580k3734J2661J3148k3900P314J6757
2044A3507k2007K723J9485k0325k168K2154j7167p224K3255j3186j1046K3221
2056A1222r722j4681K2843m953j8217K0863L72k0721J8170M490k2475J5487Q974
$$ plain form
1969 7815 6921 -14387 5436 9443 -13853 2861 11741 -12544 -189 13134 -10688 -2966 13865
1982 13865 -9115 -5762 14688 -6637 -8891 13736 -4045 -10393 13221 -1520 -12679 12136
1994 12136 1758 -13944 9727 4856 -13575 7832 6865 -14085 5257 9728 -13570 2024 11359
2007 11359 -11800 -181 12971 -11011 -3087 14065 -8605 -6216 13914 -6096 -7947 13735
2019 13735 -4226 -10715 13485 -1090 -12283 11539 1688 -13327 9498 4315 -14284 7841
2031 7841 6973 -14060 4913 9669 -13191 2681 11261 -12473 188 13336 -10564 -3250 13507
2044 13507 -8500 -5777 13708 -6617 -8785 13369 -3798 -11022 12233 -953 -11999 11222
2056 11222 1500 -13181 9662 4709 -13508 7355 7727 -12994 5176 9666 -12809 2678 11652
2069A1652k3601J1282J3097k2425O434J6500k1834K688J9207j9652k019K1609
2081A2938j6389o814K2758j3193j0687K2982r135j5075K2576m544j8163K0262
2093G516k05k0689J8484M439k2884J5000R143k3139J1121J3089k2595P154J6511
2106A2945k1398K440J9441j9052k367K1464j6313o691K2413j3093j1276K2922
2118A1435q817j5226K1794m769j7914K0264l0k0599J7580N299k1981J4063R697
2131A0796k2415J0611J3295k2224O453J6881k0518J543J9011j8629k346K0833
2143A3291j6222p223K2386j2768j1370K2218q751j4587K1657m387j8191K0141
2155F194J000k0368J7337N081k1370J4358R192k2569J0645J3377k2007N938J6147
$$ plain form
2069 11652 -11949 -667 12430 -9995 -3561 12939 -8895 -6207 13000 -6652 -8671 12938
2081 12938 -3451 -10265 12493 -700 -11387 11595 2460 -12615 9961 5417 -12746 7516
2093 7516 7311 -13378 5106 9545 -13339 1661 10804 -12335 -1214 11875 -10720 -3566 12945
2106 12945 -8453 -6013 13428 -5624 -7991 13473 -2840 -9531 12882 -211 -11487 11435
2118 11435 2618 -12608 9186 4417 -13497 6767 6737 -13862 3718 9017 -12964 1099 10796
2131 10796 -11619 -1008 12287 -9937 -3484 13397 -7121 -5578 13433 -5196 -7542 13291
2143 13291 -2931 -10154 12232 -536 -11906 10312 1561 -13026 8631 4244 -13947 6194
2155 6194 7194 -13174 4163 9244 -12126 2232 11424 -11145 -500 12877 -9130 -3192 12955
2168A2955k0457J762J9014j9046k867K1053j5718p456K1866j2003j0956K2191
2180A0338q566j4687K1638l671j8065J9711R20j9760J6916N067k1663J3872R323
2193A1373k1903R366J3072k1294N410J6397k0421J060J9380j7837l675K0693j4466
2206b845p411K1512j1274j1306K1998p528j5118K0698k854j7919J8819P45k0112
2219a2595J6606N413k1682J2880R922k1682R268J3086k1238N527J6762j9901R64
2232f670J9445j7387l377K0758j4750p305K1308j1499j1509K1369p072j5192K0156
2245H275l494j7704J8831R74j9811J6102N463k0907J3185R336k1244R250J3789
2258A2045k0720M746J6882j9514O23J8987j7336l676K0558j4746p709K0934j0851
$$ plain form
2168 12955 -7502 -5740 13274 -5772 -8639 12414 -3304 -10760 11106 -897 -11853 10338
2180 10338 1772 -12915 8723 5052 -13013 6698 7618 -12142 4774 9841 -11822 2050 11373
2193 11373 -10530 -1164 11908 -9386 -3976 12421 -8000 -6940 12440 -5397 -9072 11621 -2845
2206 -2845 -10256 11256 -18 -11324 10674 3146 -11972 8726 5872 -12047 6772 7517 -12595
2219 -12595 4011 9424 -12258 622 10544 -11138 -1870 11216 -10022 -4495 12267 -7634 -6670
2232 -6670 12775 -4612 -7989 12769 -1981 -9286 12022 523 -10986 10383 3311 -11881 8275
2245 8275 4781 -12923 5908 6882 -12929 3173 8636 -12271 914 10250 -10994 -1744 12045
2258 12045 -8675 -3929 12953 -6561 -5938 13049 -4287 -7963 12595 -2151 -9860 11074 223
2271B23j2051K1061p050j4667J9982k579j7814J8374J768j9427J5565N999k0713
2284a1329J2788R558k1360R242J3173k0657M623J6410j9228P25J8527j7371l540
2297h439K0287j4160p710K0887j0810j1301K1163p241j4858K0049k722j7390J8374
2310F129P50j9052J5645N571k0469J2074J0112k1121Q756J3035k0247M593J6510
2323A2286j8999L92J8485j6374m155K0058j3475q079K0872j0609j1599K0460o359
2336B904j4860J9126k094j7392J8034J752j9606J5073O305k0211J1616R850k0246
2349i749Q273J3256k0056M365J6033j8251j70J8392j6311l891J9554j3513q164
2362a0232K0677j0067j1737K0354o436j4371J9284k147j7420J7544J966j9060
$$ plain form
2271 223 -11828 9233 2183 -12484 7498 4919 -12895 5479 7247 -12180 3385 9384 -11329
2284 -11329 1459 11017 -10343 -1101 12072 -8585 -3962 12448 -6780 -6055 12472 -4899 -8439
2297 -8439 11848 -2312 -10022 10865 55 -11246 9917 2676 -12182 7867 5145 -12245 6129
2310 6129 6879 -12173 3472 9043 -11426 648 10760 -10361 -1605 11430 -8817 -4224 12286
2323 12286 -6713 -6321 12164 -4210 -8365 11693 -1782 -9861 11011 402 -11197 9263 2904
2336 2904 -11956 7170 5076 -12316 5718 7470 -12136 2937 9242 -10969 647 10497 -9749
2349 -9749 -1476 11780 -8276 -3911 12122 -6129 -6299 12093 -4218 -8109 11445 -2068 -10232
2362 -10232 10445 378 -11359 8995 2559 -11812 7472 5325 -12095 5449 7415 -11645
2374a1645J4652O297j9932J1161J0117k0487Q149J3449j9858L935J5707j7794
2386f249J9J8182j6173m126J9592j3152p976K0184r619j1790J9913n880j4859
2399a1934J8699j337j7352J6829K298j8603J3899O599j9787J1143J0158j9929
2411i317P305J3489j8905L357J5690j7483m65J7992j5609m467J9262j2807q040
2424i998J9925r460j1606J9696n584j4524J8034j104j6702J6469K646j8660J4082
2437C214O133j9406J0799R795j9628P209J3077j8920L146J5666j7546n83J7880
2450A0836j4972m357J8746j1951q372K0138r154j1355J9239m907j4712J8253j506
2463E926j6963J6074K733j8398J3075O228j9057J0243R862j9145O785J2980j8224
$$ plain form
2374 -11645 3007 9304 -10628 533 10650 -9837 -1688 11761 -8097 -4162 11545 -6249
2386 -6249 -6230 11952 -4221 -8347 11245 -1907 -9883 10301 682 -11108 8805 2925 -11934
2399 -11934 6765 5428 -11924 4905 7203 -11400 2499 9098 -10689 454 10612 -9317
2411 -9317 -2012 11477 -7428 -4071 11619 -5864 -6329 11663 -3946 -8413 10849 -1958 -9998
2424 -9998 9927 467 -11139 8557 2973 -11551 6483 5379 -11323 5146 7792 -10868 3214
2437 3214 9347 -10059 740 10535 -9093 -1884 11193 -7727 -4581 11085 -6461 -7044 10836
2450 10836 -4136 -8493 10253 -1698 -10070 10068 914 -10441 8798 3891 -10821 7432 5926
2463 5926 -11037 5037 7770 -10628 2447 8675 -10382 -139 9723 -9422 -2637 10343 -7881
2476g881K916J5761j6777p89J7880j4591m492J8858j1341q402J9021q289j1619
2489i745J8144m691j4512J7652j636j6698J5507L032j8208J2820O348j8502J0303
2502a86R912j8659O561J3411j8187K956J5653j6542r30J7428j4060n159J8463
2515A0661j1505q449J8720q427j1534J8179m658j4465J7477q69j6543J5468K866
2528F921j7528J2632O469j8198R482J0342j8202N975J3079j7369K548J4805j5847
2541d891j314J6835j3752m990J7936j1307q068J8102p735j1166J7759m369j3882
2554a0842J6656n84j5629J4635L178j7600J2604O384j8126R457R805j7943N769
2567b236J2462j7371K670J4933j5640j132J6551j3501m772J7623j0761p846J7760
$$ plain form
2476 -7881 -4965 10796 -5981 -6770 11110 -3481 -7973 10885 -456 -8858 10163 1874 -9745
2489 -9745 8399 3708 -10804 6848 5212 -11486 4021 7053 -11155 1665 8013 -10489 -186
2502 -186 9726 -8933 -2372 11039 -7148 -4192 11461 -5081 -6011 11417 -2643 -7802 10661
2515 10661 -844 -9293 9427 1000 -10534 7645 2987 -11478 5999 5130 -11413 4055 6921
2528 6921 -10607 2025 8494 -9704 -222 10120 -8082 -2107 10972 -6397 -3849 10956 -4891
2541 -4891 -6205 10630 -3122 -8112 9824 -1483 -9551 8551 816 -10350 7409 3040 -10842
2554 -10842 5814 5230 -10399 4236 7414 -10186 2418 8802 -9324 133 9938 -8005 -2236
2567 -2236 10226 -7145 -4475 10458 -5182 -6314 10237 -3264 -8036 9587 -1174 -9020 8740
2580H740p449j1030J7494m193j3652J6184n94j5680J4446L174j7235J1751O706
2593H662j7979Q897R666j7843N857J2471j6570K015J4725j4699j513J6368j2825
2606b768m732J7442j0350q275J7439o933j1295J6787l744j3376J5411l58j5507
2619a0259J3624L348j6835J1241O840j7057Q338R851j6820N343J2133j5872K003
2632d122J4256j4200j844J5944j2321n152J6854r787q201J6804o858j0945J6355
2645F783l644j3339J5123J92j5510J3716L179j6290J1365O648j6924Q175R713
2658I187j6431N082J2033j5619J433J4065j3776k051J5674j2094n014J6197r388
2671g02p922J6162n984j0934J5580k883j2977J4381O67j5081J3063L615j5905
$$ plain form
2580 8740 1291 -9739 7755 3562 -10090 6094 5500 -10180 4266 7440 -9795 1956 8662
2593 8662 -9317 -420 9246 -8597 -2740 9731 -6839 -4824 9901 -4798 -6311 10057 -2768
2606 -2768 -7500 9942 -408 -8683 8756 1823 -9472 7315 3571 -9805 5606 5248 -10259
2619 -10259 3365 6713 -10122 1119 7959 -9098 -760 9091 -7729 -2386 9747 -6125 -4122
2632 -4122 10134 -4066 -5910 10034 -2287 -7439 9415 -372 -8573 8231 1373 -9572 6783
2645 6783 3139 -10200 4923 5115 -10395 3321 6500 -9790 1575 8223 -8701 -526 9187
2658 9187 -7244 -2162 9871 -5748 -4315 9750 -4026 -6077 9597 -2497 -7511 8686 -702
2671 -702 -8624 7538 1554 -9380 6200 3317 -9660 4721 5388 -9693 3370 6985 -8920
2684h920J0350O509j6259P686R629j5992M296J2168j5376J524J3764j3614j751
2697e986J5297j1559n024J6140r059q285J6160o304j0426J5623l041j2965J4208
2710D779M52j4664J2618L325j5563J0239O543j5604P241R287j5692M335J1930
2723I226j4790J167J3755j3183j757J4502j1053m705J5423q574q156J5462n669
2736A648j0465J4819k421j2982J3911P19j4267J1871L702j5275R649O684j5379
2749g786P182R004j5064M231J1388j4318J123J3582j3071k053J4475j0655n239
2762g201J5336q076q081J4957n130j0537J4500k385j2299J3008R34j4019J1531
2775B538L704j4447R088O762j4957O586R099j4716M044J0931j3292K40J3018j1924
$$ plain form
2684 -8920 1430 7939 -8320 -634 8995 -6997 -2701 9467 -5909 -4385 9379 -4235 -5986
2697 -5986 9311 -2248 -7272 8868 -191 -8476 7684 1380 -9046 6577 3536 -9429 4779
2710 4779 5231 -9433 3185 6510 -9053 1186 7729 -7875 -634 8653 -7039 -2704 9226
2723 9226 -5564 -4397 9358 -3825 -5582 8920 -2133 -6838 8585 11 -8145 7317 1648
2736 1648 -8817 6002 3581 -9401 4510 5229 -9038 2833 6535 -8740 909 7593 -7786
2749 -7786 -604 8400 -6664 -2433 8955 -5363 -4240 9342 -3729 -5782 8693 -1962 -7201
2762 -7201 8135 59 -8022 6935 1805 -8732 5768 3383 -8916 4092 5026 -8993 2538
2775 2538 6242 -8205 883 7645 -7312 -726 8373 -6343 -2299 8632 -4660 -4420 8598 -3326
2789c326k148J4084j0494n184J4669p809p948J4697m921j0351J4163k096j2031
2802h695J2766J143j3610J1165L780j4519Q924O541j4375O147Q910j4190L550
2815b463J0764j3158M74J2648j1711k458J3705r396n424J4089p142p840J4612
2828F700m707j0203J3807j918j1752J2219J256j3300J0589L892j4148Q340O599
2841G374j4421O008Q604j3735L299J0618j2797M69J2553j1285k388J3565r275
2854a411m873J3822p107p692J3944m261j0162J3249j886j1564J2122O36j2957
2867h140J0097M020j3787P967O690j3748N246R036j3366L048J0724j1961J83J2208
2881H217j0676k734J3310r134n285J3600o686p773J3440m576r501J2694j579j1567
$$ plain form
2789 -3326 -5474 8610 -1884 -7068 7601 -208 -8156 6541 1620 -8731 5432 3336 -8695
2802 -8695 4071 5214 -8396 2769 6549 -7970 954 7495 -6880 -733 8177 -6013 -2463
2815 -2463 8301 -4857 -4383 8265 -3446 -5904 7801 -1595 -7019 7070 -72 -7912 6700
2828 6700 1993 -8210 5597 3679 -8073 4146 5402 -7898 2691 6583 -7565 775 7374
2841 7374 -7047 -1039 7565 -6170 -2871 7747 -5050 -4581 7972 -3313 -5701 7864 -1411
2854 -1411 -6284 7538 431 -7261 6683 2422 -7740 5509 3623 -7941 4181 4817 -8140
2867 -8140 1957 5977 -7810 157 6847 -6901 -1655 7381 -5985 -2937 7787 -4174 -3991 8217
2881 8217 -2459 -5193 8117 -1017 -6302 7298 612 -7161 6279 1703 -7798 4896 3317 -8250
2895h250J1410J291j2439R718L975j3038P763O379j3130N183R118j3016K777J0140
2909G881j1813J09J1928j0557k774J2593q347n537J3082o458p422J3072l998r549
2923g790J2103r95j1250J1355J277j2123R670M065j2988P326O672j3162M695Q879
2937G734j2572K122J0266j1703j68J1876j0447k800J2643q397n219J3229o178
2950C86p621J2851l745r331J2112r29j0933J0734J635j2179R117L958j2612O713
2964A56O679j2974M810Q279j2306K315J0005j1092j68J1387r599k588J2068q029
2978a057n058J2701n736p344J2436l501r274J1680j172j0769J0258J472j2061
2991g425Q823M275j2622O767O505j2198M254Q385j1846J930J0238j0657m27J1100
$$ plain form
2895 -8250 3160 4451 -7988 1730 5705 -7333 430 6809 -6321 -1138 7980 -5036 -2259 7881
2909 7881 -3932 -3823 8105 -2452 -5226 7367 -980 -6517 6565 107 -7315 5757 1759 -7790
2923 -7790 4313 3318 -7932 3423 4700 -7423 2247 6312 -6676 650 7322 -5840 -1145 7734
2937 7734 -4838 -2716 7550 -4153 -4321 7555 -2892 -5692 6951 -1446 -6665 6564 386
2950 386 -7235 5616 1871 -7460 4652 3723 -7210 3524 5159 -7020 2097 6055 -6557 156
2964 156 6835 -6139 -1329 6950 -5356 -3041 6964 -4128 -4296 7091 -2508 -5096 6972 -1057
2978 -1057 -6115 6586 850 -6494 5942 2441 -6833 4847 3675 -7094 3164 4636 -7425
2991 -7425 1398 5673 -6949 -182 6323 -5875 -1621 6764 -5082 -3152 7086 -3571 -3998 7102
3005G102r232k621J1780p619n347J2288n469p525J1900l189r395J1345p30j0622
3019g334R983J921j1823Q507M199j2129O504O577j1896L972Q486j1470J922R757
3033G176j0699l98J0947r209k857J1728p596n175J1950n396p448J2031k858r467
3047g271J1046l74j0536J0051J566j1566Q578M124j1837O348O248j1821M001Q186
3061F743j1051J485R743j0298o81J1034r192k950J1438p022n227J1944n077p415
3075f526J1394k560r157J0811m43j0100R099K088j1241P965M134j1390N793N981
3089E848j1181L525Q444j0980J515R542r981q07J0866q528l339J1556o942n349
3103e811J1463m757p546J1481k695q834J0254l2j0325R256K026j0913P632M226
$$ plain form
3005 7102 -2130 -4751 7029 -590 -5937 6351 882 -6643 5257 2068 -7327 4018 3288 -7334
3019 -7334 2649 4570 -7253 1254 5453 -6676 -172 6405 -5491 -1519 6967 -4503 -2581 7176
3033 7176 -3523 -3921 7026 -2183 -5040 6688 -908 -6083 5867 471 -6977 5054 2196 -7271
3047 -7271 3775 3401 -7135 2916 4482 -7084 1494 5618 -6219 129 6377 -5444 -1443 6743
3061 6743 -4308 -2823 6920 -3378 -4059 6975 -2217 -5167 6271 -751 -5978 5966 889 -6526
3075 -6526 4868 2308 -6849 3962 3519 -6581 2518 4606 -6635 1330 5464 -5926 -133 5848
3089 5848 -5333 -1808 6636 -4344 -2829 6713 -3268 -4075 6791 -1737 -5076 6480 -462 -5811
3103 -5811 5652 895 -6651 4830 2135 -6699 3555 3523 -6802 2454 4480 -6433 1199 5425
3117E425j1466O103O114j1431L787Q282j0646R99R611r883q19J0605q362l298
3131d979J1123o617n297J1293m807p137J1356k615q920J0152j8j0213R026K172
3145D519j0963P600M160j1159N608O111j0921L497Q132j0527J118R584r701j080
3159d022J0442q053l365J0798o184n506J1002m383p285J1136k478q593R599J49
3173C257r927R047K153j0651P202M472j1090N576O073j1040L426P990j0135P88
3187b859R349r228j501J0153p871l016J0543o314n152J1033l995p637J0843k277
3201B071q432J0046L6j0005Q750K631j1068P074M617j1017M978O440j1103K823
3215b159Q250r961N46R420r073j339J0059p432l355J0737n934n493J0794l695
$$ plain form
3117 5425 -6041 62 6176 -5255 -1468 6814 -3832 -2833 6778 -3105 -3924 6681 -1681 -4979
3131 -4979 6144 -473 -5770 5523 716 -6421 4935 2320 -6600 3552 3534 -6679 2347 4519
3145 4519 -6444 1156 5316 -5843 -235 5876 -5045 -1548 6584 -3943 -2825 6759 -2942 -4022
3159 -4022 6420 -1633 -4998 5800 -384 -5890 5112 729 -6556 4580 2102 -6491 3108 3257
3173 3257 -6670 2377 4530 -6121 1081 5553 -5537 39 6112 -4928 -1502 6488 -3647 -2859
3187 -2859 6490 -2738 -4239 5914 -1957 -4973 5570 -744 -5896 5137 1142 -6495 4348 2071
3201 2071 -6361 3685 3721 -6284 2466 5097 -5971 1103 5720 -5297 -319 6121 -4982 -2159
3215 -2159 6091 -3870 -3324 6096 -2977 -4316 5743 -1689 -5044 5693 -241 -5734 5060 1365
3229A365p425J0931k281q453R357M29r891Q038K672j0996O874M503j1129N020
3243i86O846j0769K801Q187r554K84R523q927j539J0288p254l656J0658n621n424
3258e143J0484l953p414J0400k162q528R177L95r774Q160K559j0475O665M639
3272E030j0787M816O630j0160K905P966r705L98R324q825j360R891p043l804J0148
3287E424n432n633J0552l811p359R793j296r028R624N94r746Q151K748j0437O674
3302H18M620j0589M755O227j0098K436Q099r439Q4R188q581j556R835p006l961
3317e168J0531n521n993J0775l523p344J0226j738q631R686K28r568Q165K269
3331D394r885O110M653j0401M552O425j0370K601P949r670M81R220q801j386R935
$$ plain form
3229 1365 -6060 4871 2590 -5863 3494 3923 -5968 2070 4742 -6254 620 5123 -6006 -986
3243 -986 5860 -4909 -2108 6079 -3475 -3191 6332 -2595 -4134 6154 -1100 -4756 5902 281 -5143
3258 -5143 5341 1388 -6026 4374 2212 -6316 2861 3256 -6518 1642 4201 -6274 391 5030
3272 5030 -5757 -941 5689 -4471 -1566 6400 -3305 -2907 6417 -2408 -3768 6123 -920 -4724 5424
3287 5424 -8 -5641 4911 1100 -6259 3534 2238 -6790 2834 3428 -6318 1833 4581 -5856 818
3302 818 5438 -5151 -396 5831 -4267 -1831 6268 -3171 -3087 6101 -2480 -4036 5799 -1207 -5168
3317 -5168 5363 -158 -6151 4624 1101 -6243 3983 2245 -6386 3300 3528 -6040 2125 4394
3331 4394 -5491 619 5272 -5129 -577 5848 -4522 -1921 6028 -3642 -3161 6059 -2742 -4128 5807
3346E807o991l797J0381n155n511R976l457p112R817j218q711Q996O56r606P494
3361A569K815j0203O484M428j0262M124O739r962K348P717r194K92Q979q095j704
3376c925R721o628l638R787n129n356R804l338p072R605j146q805Q942L92r314
3391f100P514K878j0074O047M776j0070M136O570j0041K510P764r069J82Q990
3405F013q012k000R711o703l731R667m731n710R823l042p031R302j495q091Q643
3420B613R32r461P430K946r980N899M793r915L942O358r469J910Q042q939r3Q832
3436E840p960j832R355o325m058J0040m881n493R656k881p098R216j015q445Q403
3451B522J339r356P016K936r590N357M811r910L877O572r625J957P614q492L7
$$ plain form
3346 5807 -1184 -4981 5400 245 -5266 4710 1253 -5859 3958 2740 -5971 3025 3681 -5925 1569
3361 1569 4384 -5819 665 5093 -5169 -1045 5694 -4268 -1920 5797 -3397 -3105 5874 -2221 -3925
3376 -3925 5796 -832 -4470 5317 188 -5168 4636 1298 -5774 3831 2685 -6120 2822 3214 -6100
3391 -6100 1414 4292 -5782 265 5041 -5029 -893 5677 -4364 -1854 5910 -3159 -2977 6013
3405 6013 -1999 -3999 5712 -991 -4722 4945 214 -5496 4327 1285 -5746 3556 2061 -6030 2613
3420 2613 3545 -5916 1514 4460 -5520 379 5172 -4743 -801 5557 -3912 -2002 6040 -2899 -2992 5840
3436 5840 -2120 -3952 5403 -922 -4980 5060 179 -5314 4342 1461 -5637 3579 2564 -5881 2522
3451 2522 3861 -5495 1521 4457 -5133 224 5035 -4875 -998 5574 -4051 -2094 5520 -2972 -2935
3466b935Q780q277j617R493o305m121R851m323n909R905k885p373R405j172q383
3481e866Q266J033r054P142K741r558N792M630r689L560O427r285J810P786q708
3496b973N2Q721p650k017R155n827m104R807m741n727R450k424p328R060r29q148
3512e623P928J062q929O809K833r396N495M866r323L360O488r607J900P880q583
3527b840l32Q610o816k415Q963n878l902R422m452n747R330k548p103Q724p80
3542B236q207Q281J257r188O740L266r354N173M609r238L673O192q960J782P440
3557E702q352n76Q775p357k260R081n968l736R260m228n683R470k743p040Q651
3572B996l77q223P969J622r097O545L076r390N244M784r232L270O095r152J648
$$ plain form
3466 -2935 5845 -2432 -4049 5444 -861 -4982 4869 546 -5363 4542 1657 -5716 3689 2517 -5866
3481 -5866 2400 3433 -5621 1521 4262 -5296 496 5126 -4563 -1003 5424 -3861 -2051 5735 -2973
3496 -2973 -2921 5800 -1850 -3867 5288 -539 -4643 5164 423 -5304 4146 1722 -5606 3454 2525 -5623
3512 -5623 2305 3367 -5562 1247 4080 -5316 179 5045 -4278 -918 5570 -4037 -2137 5743 -2840
3527 -2840 -3172 5438 -1378 -3793 5170 -708 -4610 4812 360 -5387 3943 1395 -5708 3016 2236
3542 2236 -5971 2310 3567 -5621 1119 4385 -4969 204 4813 -4425 -752 5440 -3520 -1738 5702
3557 5702 -2650 -3226 5549 -1808 -4068 5013 -955 -4691 4569 341 -5342 4128 1385 -5655 2996
3572 2996 2619 -5604 2365 3987 -5110 1435 4511 -4879 365 5149 -4083 -813 5282 -3870 -2222
3587b222P406p956o05Q494p120k496R418n391m272R264l915n641R127k423o840
3602e172Q510l69p974P423J269q502O131K881r127M809M973r293L177O132q525
3617c657J167P681q118l00Q448o701k543R158n425l825Q810l892n571Q930k159
3632B003p016Q136m56q119P448J410q750O055L387q958M426M914q927L139O568
3647E260q448J090P479p849n72Q255o505k538Q980n485m091Q797l596n657Q465
3662C585j941o861Q083m53p556P046J834q784N950L433q806M922M410q851K711
3677a278O492q507J346P092p279q26Q331o810k601Q786n039m335Q675l335n816
3692e104Q629j923o743P942o2p751O711J916q318N316L558q755M206N167q699
$$ plain form
3587 -2222 5184 -2772 -3377 5117 -2003 -4499 4919 -472 -4744 4520 605 -5036 4091 1668 -5172
3602 -5172 3338 2969 -5005 2418 3687 -4815 1316 4197 -4930 -121 4852 -4441 -1264 4868 -3657
3617 -3657 -2490 5191 -2927 -3227 5221 -1480 -4023 5135 -290 -4115 4695 803 -4768 4162 2003
3632 2003 -5013 3123 2667 -5452 1996 3406 -5344 711 4098 -4860 -434 4480 -4447 -1308 5260
3647 5260 -3188 -2098 5381 -2468 -3040 5215 -1290 -3828 5152 -333 -4424 4373 777 -4880 3585
3662 3585 1644 -5217 2866 2413 -5143 1903 3737 -5047 903 4336 -4470 452 4862 -3989 -1278
3677 -1278 5214 -3293 -1947 5145 -2134 -2960 5371 -1439 -4040 4746 -293 -4628 4047 712 -5104
3692 -5104 3525 1602 -5141 2801 2739 -5012 1699 3615 -4703 613 4171 -4584 -378 4789 -3910
3707c910K373O495p753N04P233p253q27Q169o489k513Q492m529m460Q561l399
3722F94n496Q586j879o985P754j15p597O891J411q133N639L357q623M106M822
3737D432q197K549N977p897Q45P291p151j021P790n885k481Q140m500m172Q481
3752D201l248n679P909j567o186P077Q3p472O718J937q538N342L382q157L503
3767f95N130q161K570N986p680O26P203o937j137P607n492k755Q212m694m289
3782d506Q459l084n376P886j901o483P366Q3p397O428J990q182N263L437p944
3797c961L706M974q375K326O028p256L50P186o922r84P547n733k871Q122m321
3812a84m078P638k655n378P597j086o569O993L55p212N998K229p993N048L479
$$ plain form
3707 -3910 -1537 4958 -2795 -2291 4942 -2311 -3138 5031 -1458 -3971 4521 -8 -4468 4093 694
3722 694 -4802 3784 1905 -5080 2674 2559 -5038 1853 3264 -4869 770 4127 -4496 -390 4432
3737 4432 -3765 -1216 4761 -3136 -2291 5000 -2151 -3172 4618 -1267 -3748 4392 -108 -4280 4201
3752 4201 953 -4726 3183 1616 -4570 2507 2590 -4882 1836 3773 -4765 577 3959 -4198 -695
3767 -695 4435 -3726 -1156 4830 -2850 -2224 4979 -1958 -3095 4512 -980 -3735 4477 -217 -4506
3782 -4506 3953 869 -4507 3379 1478 -5005 2361 2444 -4953 1475 3465 -4717 546 3983 -3961
3797 -3961 -255 4719 -3656 -1330 4698 -2558 -2208 4978 -1944 -2928 4619 -1114 -3985 4137 -184
3812 -184 -4262 3376 721 -4657 2940 1854 -4715 2278 2633 -4579 1419 3648 -4345 703 4182
3827D182p924L184N086p680J646N974p030M36O503o192j431P653n299l066P976
3842D018m077m363P862k347n696P525r40o562O826O52p415N843K164p742M596
3857C44L736p681L240M613p500J946N720p064L06O632o170r97P155n010k782P633
3873D121l917m149P568k525n356P037n92o323O171M89p108N735K132p121L796
3888d2L742p619L093M947p561J797N921o725l8P011o110j415P327m723k953P549
3904D201l824m327P407k352n272O579r54n833O251M99o524N189J937o964M198
3919B11L898p587K881M800p009J401N765o156l67O354n473j619O834m617l053
3934c737P435l714m048P279k330n074O761p48o060O010P74o571N169K039o806
$$ plain form
3827 4182 -3742 -558 4528 -3152 -1506 4468 -2562 -2126 4377 -1815 -3246 4407 -892 -3958 4018
3842 4018 -59 -4422 3440 1093 -4603 2922 1982 -4580 2246 2898 -4517 1326 3490 -4252 344
3857 344 4080 -3601 -361 4252 -3248 -1302 4418 -2646 -2340 4292 -1878 -2875 4280 -730 -3512 4121
3873 4121 204 -3945 3623 1098 -4258 2779 2187 -4136 2035 2524 -4584 1151 3283 -3838 -42
3888 -42 3700 -3919 -826 4121 -3440 -1643 4278 -2447 -2485 4526 -1584 -2999 4328 -395 -3348 4201
3904 4201 377 -3950 3457 1105 -4167 2412 1458 -4375 1876 2375 -4149 1040 2977 -3987 211
3919 211 4109 -3478 -597 4203 -2806 -1405 4360 -1796 -2163 4191 -1282 -2901 3933 -684 -3737
3934 -3737 3698 -16 -4064 3215 885 -4189 2572 1824 -4236 1774 2548 -4023 1146 3185 -3621
3949c621L981L387o959K371N257p187J447N714o716J03O475n755j443O731m674
3964h89k658P035l377m233O983j875m923O589n16n706N484O29o499N211J846o713
3980c612L833L449o949K614M287o626J249N818n958n96O584n434j329O465m379
3995e84k535O589l442l651O601j542n147O241p36n607N528Q53o467M740K071o483
$$ plain form
3949 -3621 360 3747 -3212 -841 4416 -2771 -1324 4390 -2326 -2223 4252 -1503 -2946 3785 -889
3964 -889 -3547 3488 111 -4122 2861 986 -3937 2652 2136 -3570 1914 2543 -3956 1255 3101 -3612
3980 -3612 221 3670 -3279 -665 3622 -3004 -1755 4063 -1895 -2491 4093 -1341 -2670 3795 -584
3995 -584 -3119 3470 28 -3623 2978 1436 -3711 2530 1794 -3813 1715 2568 -3899 841 2912 -3571
$$ [...]
8191e20
##END NTUPLES=NMR FID
##END=
