##TITLE=1H_Pr 3754
 CDCl3
 8 sc, 
 7.10.2024
##JCAMPDX= 6.0         $$ Bruker NMR JCAMP-DX V2.0
##DATA TYPE= NMR FID
##DATA CLASS= NTUPLES
##ORIGIN= UXNMR, Bruker Analytische Messtechnik GmbH
##OWNER= root
$$ XWIN-NMR		Version 3.5
$$ Mon Oct  7 15:38:17 2024 Russian Standard Time (UT+4h)  she@DPX200
##.OBSERVE FREQUENCY= 200.1318
##.OBSERVE NUCLEUS= ^1H
##.DELAY= (6, 6)
##.ACQUISITION MODE= SIMULTANEOUS
##.ACQUISITION SCHEME= undefined
##.AVERAGES= 8
##.DIGITISER RES= 18
##SPECTROMETER/DATA SYSTEM= spect
##.PULSE SEQUENCE= zg30
##.SOLVENT NAME= CDCl3
##.SHIFT REFERENCE= (INTERNAL, CDCl3, 0, 15.7039)
##AUDIT TRAIL= $$ (NUMBER, WHEN, WHO, WHERE, WHAT)
$$ ##TITLE= Audit trail, XWIN-NMR		Version 3.5
$$ ##JCAMPDX= 5.01
$$ ##ORIGIN= Bruker BioSpin GmbH
$$ ##OWNER= she
$$ F:/spectra/data/she/nmr/H-F/1/audita.txt
$$ ##AUDIT TRAIL=  $$ (NUMBER, WHEN, WHO, WHERE, WHAT)
(   1,<2024-10-07 15:37:00.04 +0400>,<she>,<DPX200>,
      <created by zg, POWCHK disabled, PULCHK disabled
       configuration hash MD5:
       00 E9 B6 7A A2 85 ED C7 34 08 36 98 17 FE 4E 26
       data hash MD5: 16K
       97 64 1F 2B 70 51 94 69 FF C0 D1 76 B2 34 6B F5>)
$$ ##END=
$$ 
$$ hash MD5
$$ B7 E1 3E C5 DA D6 BA 1E 5F 3D 9E DB 34 D5 D4 34
##$RELAX= 
##$RELAX= 
##$RELAX= 
##$RELAX= 
##$RELAX= 
##$RELAX= 
$$ Bruker specific parameters
$$ --------------------------
##$DU= <F:/spectra>
##$EXPNO= 1
##$NAME= <H-F>
##$PROCNO= 1
##$TYPE= <nmr>
##$USER= <she>
##$AMP= (0..31)
100 100 100 100 100 100 100 100 100 100 100 100 100 100 100 100 100 100 
100 100 100 100 100 100 100 100 100 100 100 100 100 100 
##$AQSEQ= 0
##$AQ_mod= 1
##$AUNM= <au_zg>
##$AUTOPOS= <>
##$BF1= 200.13
##$BF2= 200.13
##$BF3= 200.13
##$BF4= 200.13
##$BF5= 200.13
##$BF6= 200.13
##$BF7= 200.13
##$BF8= 200.13
##$BYTORDA= 1
##$CFDGTYP= 0
##$CFRGTYP= 5
##$CHEMSTR= <none>
##$CNST= (0..31)
1 1 145 1 1 1 1 1 1 1 1 1 1 1 1 1 1 1 1 1 1 1 1 1 1 1 1 1 1 1 1 1 
##$CPDPRG= <>
##$CPDPRG1= <>
##$CPDPRG2= <>
##$CPDPRG3= <>
##$CPDPRG4= <mlev>
##$CPDPRG5= <mlev>
##$CPDPRG6= <mlev>
##$CPDPRG7= <mlev>
##$CPDPRG8= <mlev>
##$CPDPRGB= <>
##$CPDPRGT= <>
##$D= (0..31)
0 1.2 0 0 0 0 0 0 0 0.06 0 0.03 0 0 0 0 0.0002 0 0 0 0 0 0 0 0 0 0 0 0 
0 0 0 
##$DATE= 1728301019
##$DBL= (0..7)
120 120 120 120 120 120 120 120 
##$DBP= (0..7)
150 150 150 150 150 150 150 150 
##$DBP07= 0
##$DBPNAM0= <>
##$DBPNAM1= <>
##$DBPNAM2= <>
##$DBPNAM3= <>
##$DBPNAM4= <>
##$DBPNAM5= <>
##$DBPNAM6= <>
##$DBPNAM7= <>
##$DBPOAL= (0..7)
0.5 0.5 0.5 0.5 0.5 0.5 0.5 0.5 
##$DBPOFFS= (0..7)
0 0 0 0 0 0 0 0 
##$DE= 6
##$DECBNUC= <off>
##$DECIM= 24
##$DECNUC= <off>
##$DECSTAT= 4
##$DIGMOD= 1
##$DIGTYP= 9
##$DL= (0..7)
0 120 120 120 120 120 120 120 
##$DP= (0..7)
150 150 150 150 150 150 150 150 
##$DP07= 0
##$DPNAME0= <>
##$DPNAME1= <>
##$DPNAME2= <>
##$DPNAME3= <>
##$DPNAME4= <>
##$DPNAME5= <>
##$DPNAME6= <>
##$DPNAME7= <>
##$DPOAL= (0..7)
0.5 0.5 0.5 0.5 0.5 0.5 0.5 0.5 
##$DPOFFS= (0..7)
0 0 0 0 0 0 0 0 
##$DQDMODE= 0
##$DR= 18
##$DS= 0
##$DSLIST= <SSSSSSSSSSSSSSS>
$$ [...]
##$SUBNAM2= <"">
##$SUBNAM3= <"">
##$SUBNAM4= <"">
##$SUBNAM5= <"">
##$SUBNAM6= <"">
##$SUBNAM7= <"">
##$SUBNAM8= <"">
##$SUBNAM9= <"">
##$SW= 24.0689170037331
##$SWIBOX= (0..15)
0 0 2 0 0 0 0 0 0 0 0 0 0 0 0 0 
##$SW_h= 4816.95568400771
##$TD= 16384
##$TD0= 1
##$TE= 0
##$TE2= 300
##$TE3= 300
##$TEG= 300
##$TL= (0..7)
0 120 120 120 120 120 120 120 
##$TP= (0..7)
150 150 150 150 150 150 150 150 
##$TP07= 0
##$TPNAME0= <>
##$TPNAME1= <>
##$TPNAME2= <>
##$TPNAME3= <>
##$TPNAME4= <>
##$TPNAME5= <>
##$TPNAME6= <>
##$TPNAME7= <>
##$TPOAL= (0..7)
0.5 0.5 0.5 0.5 0.5 0.5 0.5 0.5 
##$TPOFFS= (0..7)
0 0 0 0 0 0 0 0 
##$TUNHIN= 0
##$TUNHOUT= 0
##$TUNXOUT= 0
##$USERA1= <user>
##$USERA2= <user>
##$USERA3= <user>
##$USERA4= <user>
##$USERA5= <user>
##$V9= 5
##$VALIST= <valist>
##$VCLIST= <CCCCCCCCCCCCCCC>
##$VD= 0
##$VDLIST= <DDDDDDDDDDDDDDD>
##$VPLIST= <PPPPPPPPPPPPPPP>
##$VTLIST= <TTTTTTTTTTTTTTT>
##$WBST= 1024
##$WBSW= 4
##$XGAIN= (0..3)
0 0 0 0 
##$XL= 0
##$YL= 0
##$YMAX_a= 60047
##$YMIN_a= -47416
##$ZGOPTNS= <>
##$ZL1= 120
##$ZL2= 120
##$ZL3= 120
##$ZL4= 120
##$ABSF1= 10
##$ABSF2= 0
##$ABSG= 5
##$ABSL= 3
##$ALPHA= 0
##$AQORDER= 0
##$ASSFAC= 0
##$ASSFACI= 0
##$ASSFACX= 0
##$ASSWID= 0
##$AUNMP= <proc_1d>
##$AZFE= 0.1
##$AZFW= 0.1
##$BCFW= 1
##$BC_mod= 2
##$BYTORDP= 1
##$COROFFS= 0
##$CY= 11.3945322036743
##$DATMOD= 1
##$DC= 2
##$DFILT= <>
##$DTYPP= 0
##$F1P= 15.6554695791079
##$F2P= 12.8336369535428
##$FCOR= 0.5
##$FTSIZE= 0
##$FT_mod= 4
##$GAMMA= 1
##$GB= 0.15
##$INTBC= 1
##$INTSCL= 1
##$ISEN= 128
##$LB= 0.24
##$LEV0= 0
##$LPBIN= 0
##$MAXI= 10000
##$MC2= 0
##$MEAN= 0
##$ME_mod= 0
##$MI= 1.114404
##$NCOEF= 0
##$NC_proc= 0
##$NLEV= 6
##$NOISF1= 3.799351
##$NOISF2= 2.8
##$NSP= 1
##$NTH_PI= 0
##$NZP= 0
##$OFFSET= 15.70392
##$PC= 1
##$PHC0= -26350.71
##$PHC1= 15.78747
##$PH_mod= 1
##$PKNL= yes
##$PPARMOD= 0
##$PSCAL= 0
##$PSIGN= 0
##$REVERSE= no
##$SF= 200.130013532006
##$SI= 16384
##$SIGF1= 3
##$SIGF2= 2
##$SINO= 400
##$SIOLD= 16384
##$SREGLST= <1H.CDCl3>
##$SSB= 0
##$STSI= 0
##$STSR= 0
##$SW_p= 3612.71676300578
##$SYMM= 0
##$S_DEV= 0
##$TDeff= 0
##$TDoff= 0
##$TI= <>
##$TILT= no
##$TM1= 0
##$TM2= 0
##$TOPLEV= 0
##$USERP1= <user>
##$USERP2= <user>
##$USERP3= <user>
##$USERP4= <user>
##$USERP5= <user>
##$WDW= 1
##$XDIM= 8192
##$YMAX_p= 0
##$YMIN_p= 0
$$ End of Bruker specific parameters
$$ ---------------------------------
##NTUPLES= NMR FID
##VAR_NAME=  TIME,          FID/REAL,        FID/IMAG
##SYMBOL=    X,             R,               I
##VAR_TYPE=  INDEPENDENT,   DEPENDENT,       DEPENDENT
##VAR_FORM=  AFFN,          ASDF,            ASDF
##VAR_DIM=   8192,          8192,            8192
##UNITS=     SECONDS,       ARBITRARY UNITS, ARBITRARY UNITS
##FACTOR=    0.0002076,     1,               1
##FIRST=     0,             0,               0
##LAST=      1.7004516,     0,               0
##MIN=       0,             -47416,          0
##MAX=       1.7004516,     60047,           0
$$ Real data points
##PAGE= N=1
##DATA TABLE= (X++(R..R)), XYDATA
$$ plain form
0 0 0 0 0 0 0 0 0 0 0 0 0 0 -8 8 -8 8 -8 9 -16 16 -17 24 -25 32 -35 41 -47 53 -60 68 -77 86 -96 109 -120
35 -120 134 -151 167 -185 205 -227 252 -280 309 -343 380 -422 468 -522 583 -656 742 -846 974
54 974 -1138 1355 -1658 2121 -2914 4707 -22749 24047 16012 -6409 32241 14382 -1525 -5594
68 -5594 10765 -1094 -37004 -9666 -3015 -47416 -8806 14109 -9698 4329 15095 18391 14674
81 14674 5172 19531 -11834 -30900 4628 -10457 -19361 6973 -2421 572 7082 10739 24695
94 24695 4666 6715 14546 -20265 -8809 6802 -13513 -6106 -5312 -4382 6663 1749 18538 10467
108 10467 -13160 11294 1905 -17391 4693 -1008 -10162 -6489 -4063 10030 -1013 4297 21088
121 21088 -13787 -10431 17442 -7047 -9804 2681 -4058 -5333 -5366 14982 11353 -12799 15030 9886
$$ packed form
0@%%%%%%%%%%%%qJ6j6J6j6J7k5L2l3M1m9N7o7P6q8J00j13J28j45J63j82K05k29
35a20K54k85L18l52L90m32M79n32N89o52P23q02Q90r90J105j239J398j588J820
54I74k112K493l013L779n035P621k7456M6796q035k2421L8650j7859j5907m069
68e594J6359j1859l5910K7338O651m4401L8610K2915k3807J4027J0766L296l717
81A4674r502J4359l1365j9066L5528j5085q904K6334r394K993O510L657J3956
94B4695k0029K049P831l4811J1456J5611k0315P407P94R30J1045m914J6789q071
108A0467k3627K4454r389j9296K2084n701r154L673K426J4093j1043N310J6791
121B1088l4875L356K7873k4489k757J2485o739j275l3K0348l629k4152K7829n144
$$ plain form
135 9886 -21854 4513 9741 -11630 -9058 -4670 2394 -5160 1985 24342 -4123 -9812 20049 -786
149 -786 -10174 4911 -4284 -9998 -13387 -402 7806 -9272 9585 16751 -11403 5151 15796 -1713
163 -1713 -2127 -6374 -5224 -8298 -11417 8811 -571 -10422 13291 5198 -2235 12561 5626 1169 -5173
178 -5173 -8099 1489 -9749 -3335 8147 -12288 -3096 11915 1009 5472 5643 1116 117 -7767
192 -7767 4150 708 -12800 5998 -691 -12763 6521 6803 710 1919 -908 3662 -5529 -769
206 -769 11951 -10316 -7451 9979 -4966 -2803 7461 2344 -1678 -5911 3647 3078 -10403 7656
220 7656 5791 -14557 2517 8874 -712 1567 723 2520 -5733 -5905 9903 -5666 -10559 8306
234 8306 -3103 -6052 7337 6547 4370 -2420 1096 4623 -9084 717 5503 -13312 -5217 3480
$$ packed form
135I886l1740K6367N228k1371K572M388P064p554P145K2357k8465n689K9861k0835
149g86r388J5085r195n714l389J2985Q208j7078J8857P166k8154J6554J0645j7509
163a713m14m247J150l074l119K0228r382r851K3713q093p433J4796o935m457o342
178e173k926R588j1238O414J1482k0435R192J5011j0906M463J71m527r99p884
192g767J1917l442j3508J8798o689j2072J9284K82o093J209k827M570r191M760
206g69J2720k2267K865J7430j4945K163J0264n117m022m233R558n69j3481J8059
220G656j865k0348J7074O357r586K279q44J797q253j72J5808j5569m893J8865
234H306j1409k949J3389p90k177o790L516L527j3707R801M786j8815Q095Q697
$$ plain form
248 3480 -2171 2564 3483 6398 3132 -3683 8307 1922 -8157 4214 -4634 -12079 -556 -236 1434
263 1434 712 527 7120 -927 3998 10913 -5972 -3723 1704 -8911 -4466 -816 -1122 -16 -3547
278 -3547 5645 4729 -1364 11301 3765 -8925 1445 -654 -4699 -2580 -3339 164 -5628 -381 11320
293 11320 -1622 672 10753 -3004 -4171 2468 -116 -2072 -6608 -474 569 -7326 7240 8131
307 8131 -6335 2740 5189 -1768 -207 118 1593 -5315 -6490 5179 -2226 -4121 8859 337 -4224
322 -4224 3466 2783 2301 -2568 -1087 1367 -8069 -356 5917 -5486 121 4269 -1239 640 1525 3430
338 3430 430 -5742 1815 -1354 -5478 5536 242 -5166 2193 1366 1912 1402 455 2680 -4781 -1855
354 -1855 4540 -5083 -770 3985 -4189 -994 2262 2580 2470 -1609 2741 -391 -5700 4973 975
$$ packed form
248C480n651M735R19K915l266o815J1990o385j0079J2371q848p445J1523L20J670
263A434p22j85O593q047M925O915j6885K249N427j0615M445L650l06J106l531
278c547R192r16o093J2665p536j2690J0370k099m045K119p59L503n792N247J1701
293A1320j2942K294J0081j3757j167O639k584j956m536O134J043p895J4566Q91
307H131j4466R075K449o957J561L25J475o908j175J1669p405j895J2980q522m561
322d224P690o83m82m869J481K454r436P713O273j1403N607M148n508J879Q85J905
338C430l000o172P557l169m124J1014n294n408P359q27N46n10r47K225p461K926
354a855O395r623M313M755q174L195L256L18j10m079M350l132n309J0673l998
$$ plain form
369 975 -6900 1069 196 -2678 583 1723 3660 -2092 -1096 5652 -3383 -1781 6168 -3754 -4590 656
385 656 508 613 -2052 2580 1963 -5360 3828 4935 -4902 1418 2353 -3317 -2064 16 3048 -1792
401 -1792 -3660 3972 -1527 -2813 7169 998 -3260 1288 327 576 -1785 310 2273 -5377 -818 4073
417 4073 -3147 1468 3948 -1999 -793 -196 2355 1076 -3287 1914 -1434 -4504 4014 385 -3091
432 -3091 1964 180 -36 190 1204 3543 -2784 -1078 2988 -4189 -384 3811 -3053 -1407 779 881
448 881 1223 -675 3284 583 -4464 3560 1262 -4588 1821 463 -2556 -1283 935 3513 -1131 -785
464 -785 4101 -3065 -1890 5309 -1536 -3156 -130 -485 -445 -2032 2714 2516 -3986 2183 3175 -3517 1682
481 1682 2559 -2206 -2368 -1382 2217 -770 -2415 3698 -1021 -2636 4382 1093 -1926 826 2 -603
$$ packed form
369I75p875P969q73k874L261J140J937n752R96O748r035J602P949r922q36N246
385F56j48J05k665M632o17p323R188J107r837O320R35n670J253K080L032m840
401a792j868P632n499j286R982o171m258M548r61K49k361K095J963p650M559M891
417D073p220M615K480n947J206N97K551j279m363N201l348l070Q518l629l476
432c091N055j784k16K26J014K339o327J706M066p177L805M195o864J646K186J02
448H81L42j898L959k701n047Q024k298n850O409j358l019J273K218K578m644L46
464g85M886p166J175P199o845j620L026l55M0j587M746j98o502O169R92o692N199
481A682Q77m765j62R86L599k987j645O113m719j615P018l289l019K752q24o05
$$ plain form
497 -603 -2752 67 2648 -3568 -737 2526 -2720 1443 3633 -565 -656 -975 747 -207 -2323 2078
513 2078 -778 -3679 2505 487 -1307 2686 839 -127 -594 42 2390 -2035 -963 1984 -3956 -902
529 -902 3148 -1314 -311 594 761 294 -1273 2449 704 -3803 1662 328 -3428 1722 1289 -1221
545 -1221 -997 -119 2631 -818 -665 3518 -2238 -1808 3208 -696 -1388 786 6 -718 -2254 1396 2048
562 2048 -3037 981 2300 -2747 1041 2253 -120 -1178 -1042 1056 -799 -2044 2693 -541 -2615
577 -2615 2245 676 -597 1328 832 138 -1734 -284 2052 -2388 -352 1438 -2925 -308 1851 -29
593 -29 583 -293 1078 370 -1521 2025 41 -2534 1129 -896 -2434 1143 887 300 -235 -57 2259
610 2259 -792 -175 1978 -2479 -857 1675 -1587 -542 344 587 69 -1243 2301 1409 -1712 1580
$$ packed form
497f03k149K819K581o216K831L263n246M163K190m198r1l19J722r54k116M401
513B078k856k901O184k018j794L993j847r66m67O36K348m425J072K947n940L054
529i02M050m462J003R05J67m67j567L722j745m507N465j334l756N150m33k510
545a221K24Q78K750l449J53M183n756M30N016l904o92K174p80p24j536L650O52
562B048n085M018J319n047L788J212k373j058J36K098j855j245M737l234k074
577b615M860j569j273J925m96o94j872J450K336m440K036J790m363K617K159j880
593b9O12q76J371p08j891L546j984k575L663k025j538L577k56n87n35J78K316
610B259l051O17K153m457J622K532l262J045Q86K43n18j312L544q92l121L292
$$ plain form
626 1580 362 -2695 915 756 -984 -802 -308 1592 -751 -325 3184 -1195 -1116 1961 -850 -1223 86
643 86 167 -365 -1861 541 2287 -1477 1455 1770 -2204 119 903 -718 -790 -1182 730 -969 -1686 2652
661 2652 530 -933 2021 -31 -862 744 -112 -120 -2035 -984 1056 -1523 363 1801 -955 700
677 700 1788 -218 415 -358 -164 -922 -2270 489 30 -1311 1908 343 -788 1840 1019 482 -270
694 -270 -405 309 -1716 -1017 1148 -1932 -276 1471 -861 507 1423 1099 414 -1498 744 -45 -2237
711 -2237 591 -265 -2521 449 770 330 303 639 1718 -823 -690 1880 -984 -1475 708 -885 -858 464
729 464 902 581 -892 686 1629 -1230 895 1231 -1598 -320 218 -661 -488 -325 807 -58 -1119 1475
747 1475 685 -741 1271 -521 -937 -29 100 250 -578 24 946 -908 237 1668 -883 588 503 -756
$$ packed form
626A580j218l057L610j59j740J82M94J900k343M26L509m379P9L077k811l73J309
643H6Q1n32j496K402J746l764K932L15l974K323P84j621p2l92J912j699p17M338
661B652k122j463K954k052q31J606q56qj915J051K040k579J886J438k756J655
677G00J088k006O33p73J94p58j348K759m59j341L219j565j131K628q21n37p52
694b70j35P14k025O99K165l080J656J747k332J368R16l24o85j912K242p89k192
711b237K828q56k256K970L21m40k7L36J079k541J33K570k864m91K183j593K7J322
729D64M38l21j473J578R43k859K125L36k829J278N38q79J73J63J132q65j061K594
747A475p90j426K012j792m16R08J29J50q28O02R22j854J145J431k551J471q5j259
$$ plain form
765 -756 139 227 859 44 -1292 752 -2 -1002 1342 -97 -847 263 -38 -16 -56 108 960 -1001 -139
784 -139 1338 -651 -94 892 -868 -405 372 679 105 -706 884 480 -882 1352 875 -1218 373 154
802 154 -573 -664 34 954 -628 -887 1556 -79 -228 1317 -290 -648 -53 182 -28 -933 23 556 -1636
821 -1636 494 1262 -248 132 382 -286 -437 -304 381 -315 -1401 1013 -170 -433 919 80 -350 624
839 624 -35 496 -494 189 671 -1042 -177 679 -550 406 832 -291 539 75 573 -252 -1178 630 -367
858 -367 -1466 967 388 -22 771 233 95 -261 379 682 -1132 -450 807 -1160 -155 1010 -253 166
876 166 213 898 485 -440 743 -223 -1778 408 -56 -1262 24 50 -268 102 359 1435 -339 -742 861
895 861 -715 -997 294 -471 -771 -210 256 570 -442 992 1061 -704 121 581 -659 -103 -250 -575 -378
$$ packed form
765g56Q95Q8O32q15j336K044p54j000K344j439p50J110l01K2m0J64Q52j961Q62
784a39J477j989N57R86j760M63P77L07n74q11J590m04j362K234m77k093J591k19
802A54p27r1O98R20j582k59K443j635j49J545j607l58N95K35k10r05R56N33k192
821a636K130P68j510L80K50o68j51J33O85o96j086K414j183k63J352q39m30R74
839F24o59N31r90O83M82j713Q65Q56j229R56M26j123Q30m64M98q25r26J808r97
858c67j099K433n79m10P93n38j38l56O40L03j814O82J257j967J005J165j263M19
876A66M7O85m13r25J183r66j555K186m64j206J286K6l18L70K57J076j774m03J603
895H61j576k82J291p65l00N61M66L14j012J434O9j765Q25M60j240N56j47l25J97
$$ plain form
914 -378 -364 600 166 -258 1058 -55 -494 537 -21 -147 -35 -643 -299 -447 44 715 -612 40 660
933 660 -524 -9 767 -184 -302 -619 -140 -349 -803 842 -49 -751 982 326 -325 701 184 -395 -441
952 -441 -62 421 -1082 -586 683 -482 -146 783 -171 -92 -95 35 -23 -718 643 72 -1371 229 176 -653
972 -653 323 422 251 209 -298 775 -397 -421 686 -598 -815 575 -40 -54 -300 -119 2 -609 319 323 -898
993 -898 -330 287 -257 192 406 -24 99 -85 225 -15 -450 932 -35 -736 451 -192 -40 361 -248 118
1013 118 -497 -45 499 -381 -154 661 -476 -54 480 -399 186 -29 419 -89 -441 791 -48 -463 267
1032 267 -177 -253 460 63 45 -318 357 460 -647 -3 824 -614 -264 672 -97 221 -206 254 75 -634
1052 -634 327 412 -867 187 12 -388 55 35 180 122 -238 313 -371 -283 733 -102 -497 183 -31 65 -135
$$ packed form
914c78J4R64m34m24J316j113m39J031n58j26J12o08L44j48M91O71j327O52O20
933F60j184N15P76r51j18l17M79k09m54J645q91p02J733o56o51J026n17n79m6
952d41L79M83j503M96J269j165L36R29r54P9lJ30n8o95J361n71j443J600n3q29
972f53R76R9j71m2n07J073j172k4J107j284k17J390o15j4k46J81J21o11R28Mj221
993h98N68O17n44M49K14m30J23j84L10k40m35J382r67p01J187o43J52M01o09L66
1013A18o15M52N44q80K27Q15j137M22N34q79N85k15M48n08l52J232q39m15P30
1032B67m44p6P13l97j8l63O75J03j107O44Q27j438L50R36p69L18m27M60j79p09
1052f34R61Q5j279J054j75m00M43k0J45n8l60N51o84Q8J016q35l95O80k14R6k00
$$ plain form
1073 -135 -5 137 -280 40 198 -303 17 410 -393 -150 -155 -5 35 -25 471 -161 -142 309 -95 -283 237 -182
1095 -182 -126 80 -150 119 -281 -192 228 -277 218 448 -330 149 505 -315 268 175 185 -421 -337 651 493 -319
1117 -319 615 378 -254 284 -234 128 -219 52 305 -445 -226 703 28 -62 183 82 133 43 316 44 -777
1138 -777 173 -97 -355 278 53 -159 -58 25 405 -7 241 196 -110 -302 271 -148 -328 253 -221 11 -214
1159 -214 380 263 -252 5 170 41 -223 128 -409 -20 -94 -95 -27 -4 531 -167 -230 70 118 -476 281 -230
1181 -230 -172 131 -160 -158 -210 170 17 -111 -48 128 -304 -142 39 -596 -108 -354 177 10 -337 424 -215 -65
1203 -65 100 -160 -296 90 113 -130 -251 -75 272 -170 -85 126 -156 -144 33 -7 15 -45 135 18 -394 107
1225 107 14 -485 248 -295 -148 150 -44 -68 -157 -134 177 -328 -100 70 -355 5 314 81 229 68 215
$$ packed form
1073a35J30J42m17L20J58n01L20L93q03K43nJ50M0o0M96o32J9M51m04j88N20m19
1095a82N6K06k30K69m00Q9M20n05M95K30p78M79L56q20N83r3J0o06Q4R88j58q12
1117c19R34k37o32N38n18L62l47K71K53p50K19R29o75r0K45j01N1r0K73k72q21
1138g77R50k70k58O33k25k12J01Q3L80m12K48m5l06j92N73m19j80N81m74K32k25
1159b14N94j17n15K57J65j29k64L51n37L89p4jO8K3N35o98o3L00M8n94P57n11
1181b30N8L03k91Kn2L80j53j28O3J76m32J62J81o35M88k46N31j67l47P61o39J50
1203f5J65k60j36L86K3k43j21J76L47m42Q5K11k82J2J77m0K2o0J80j17m12N01
1225A07r3m99P33n43J47K98j94k4q9K3L11n05K28J70m25L60L09k33J48j61J47
$$ plain form
1246 215 530 -202 67 306 4 -216 -80 -511 18 -222 -53 19 -102 105 -22 97 237 304 -249 167 -317
1267 -317 -20 -251 -143 -195 -161 162 -60 89 127 253 -253 136 43 161 -175 -136 -11 176 -246 426 154 -163
1289 -163 393 -237 151 58 195 -357 112 188 100 -374 109 180 -93 -314 153 -9 25 -218 4 257 -371 100
1311 100 -409 -1 211 132 -5 68 -163 -5 -57 -119 107 -252 -152 294 93 -62 465 -154 -138 -110 -13 411
1333 411 97 6 172 3 -377 70 -31 5 -117 131 165 106 58 63 -18 121 -74 22 562 -22 -71 0 -145 178
1357 178 67 -8 15 -83 -33 -216 146 -46 141 -78 -46 -58 134 206 -170 298 -62 -144 -107 194 -101 110 -104
1380 -104 -76 -209 -103 190 35 11 55 -180 148 -222 -114 -436 -218 -19 178 151 284 -247 -271 242 118 34
1402 34 307 -145 19 126 -58 7 -48 6 33 -215 -148 -274 331 -106 -91 -7 -76 -131 157 -17 -294 188 -241
$$ packed form
1246B15L15p32K69K39l02k20J36m31N29k40J69P2j21K07j27J19J40O7n53M16m84
1267c17K97k31J08n2L4L23k22J49L8J26n06L89r3J18l36L9J25J87m22O72k72l17
1289a63N56o30L88r3J37n52M69P6q8m74M83P1k73k21M67j62L4k43K22K53o28M71
1311A00n09M08K12p9j37P3k31J58n2o2K26l59J00M46k01j55N27o19J6K8R7M24
1333D11l14r1J66j69l80M47j01L6j22K48L4n9m8Nq1J39j95R6N40n84m9P1j45L23
1357A78j11p5K3r8N0j83L62j92J87k19L2j2J92P2l76M68l60q2L7L01k95K11k14
1380a04K8j33J06K93j55k4M4k35L28l70J08l22K18J99J97k7J33n31k4N13j24q4
1402C4K73m52J64J07j84O5n5N4K7k48O7j26O05m37J5Q4o9n5K88j74k77M82m29
$$ plain form
1425 -241 152 150 -303 -125 109 -182 234 -335 117 211 -285 -78 -133 -173 148 -88 11 -25 -306 83 -13 -280 -39
1448 -39 -15 -211 -351 427 -252 -183 105 250 -277 24 125 27 -85 18 117 -219 77 -185 -35 -198 -270 374
1470 374 -126 -212 168 -30 -78 35 -123 111 13 42 227 95 -26 -211 -239 -72 -132 32 -84 -155 -67 -271 -251
1493 -251 463 -127 -231 103 -394 80 129 -157 143 -120 148 -91 -86 58 -75 -245 33 -206 -203 131 -231 110
1515 110 -36 -147 68 239 -165 -96 107 94 438 55 204 19 -148 155 -45 467 -79 -109 -16 54 -157 -310
1537 -310 -100 -101 87 151 -7 129 215 -198 -60 201 288 -228 -228 -38 -356 119 -385 204 2 -61 132 116 -55
1560 -55 -37 95 -28 -86 -292 29 -51 74 142 115 -12 53 171 -97 -141 -200 -12 81 -80 12 -217 -276 -42 231
1584 231 -78 -49 -301 218 106 61 -111 -77 75 -116 10 -92 -39 -159 -79 105 -76 64 15 -108 -170 99
$$ packed form
1425b41L93km53J78K34k91M16n69M52R4m96K07n5m0L21k36R9l6k81L89r6k67K41
1448c9K4j96j40P78o79O9K88J45n27L01J01r8j12J03R9l36K96k62J50j63p2O44
1470C74n00q6L80j98m8J13j58K34r8K9J85j32j21j85k8J67o0J64j16p1Q8k04K0
1493b51P14n90j04L34m97M74M9k86L00k63K68k39NJ44j33j70K78k39LL34l62L41
1515A10j46j11K15J71m04O9K03j3L44l83J49j85j67L03k00N12n46l0R3P0k11j53
1537c10K10jJ88O4j58J36Q6m13J38K61Q7n16%J90l18M75n04N89k02o3J93j6j71
1560e5J8J32j23n8k06L21q0J25O8k7j27O5J18k68m4n9J88R3j61R2k29n9K34K73
1584B31l09K9k52N19j12m5j72L4J52j91J26j02N3j20Q0J84j81J40m9j23o2K69
$$ plain form
1606 99 61 -111 -44 155 190 -178 119 67 -5 -116 -123 -38 -234 141 -179 132 -226 -24 61 271 189 323 26 -235
1630 -235 68 -92 -78 -159 -101 -64 82 -133 -124 -135 -38 -71 27 295 -252 -132 180 99 -277 242 230 -420 21 334
1654 334 -100 -379 -23 -297 -88 254 -347 140 136 120 -135 41 -258 -122 8 1 200 -242 -89 -81 83 -208
1676 -208 -63 -44 -8 -6 133 -84 -78 114 196 245 -412 115 30 79 -44 44 -75 -64 -210 56 39 -175 -200 -78 60
1701 60 -138 90 -108 -167 -111 -56 -43 -184 -189 147 74 253 -206 -233 -160 167 -38 72 423 -134 91 -4 -67 -94
1725 -94 -405 125 85 155 -325 -98 -3 -172 -285 145 278 -235 107 -63 94 150 -296 109 -37 12 -205 -170
1747 -170 28 -92 154 -15 94 -380 31 273 -128 -14 -198 -37 -161 -243 164 164 -4 55 -168 -276 20
1768 20 -53 128 -193 77 65 -75 6 109 -163 -64 49 -241 209 -35 -38 369 -172 -53 104 8 331 -111 253
$$ packed form
1606I9l8j72O7J99L5l68K97n2p2j11pQ5j96L75l20L11l58K02Q5K10q2J34k97k61
1630b35L03j60J4q1N8L7J46k15Rj1R7l3R8K68n47J20L12q1l76N19j2o50M41L13
1654C34m34k79L56k74K09L42o01M87mj6k55J76k99J36J30pJ99m42J53QJ64k91
1676b08J45J9L6KJ39k17OJ92Q2M9o57N27q5M9j23Q8j19J1j46K66j7k14k5J22J38
1701F0j98K28j98n9N6N5J3j41nL36p3J79m59k7P3L27k05J10L51n57K25r5o3k7
1725i4l11N30m0P0m80K27R5j69j13M30J33n13L42j70J57N6m46M05j46M9k17L5
1747a70J98j20K46j69J09m74M11K42m01J14j84J61j24q2M07%j68N9k23j08K96
1768B0p3J81l21K70j2j40Q1J03k72R9J13k90M50k44lM07n41J19J57r6L23m42L64
$$ plain form
1791 253 75 1 492 119 64 106 -112 253 11 -312 -64 -43 112 95 -291 -78 -137 2 247 345 -142 9
1813 9 220 160 -78 8 -75 110 -277 -248 -24 7 140 87 -38 308 -242 -124 61 -118 -141 -36 28 78 126 -86
1837 -86 68 265 -114 -46 32 283 -16 -48 -85 -40 -121 66 58 -24 -80 314 128 -174 113 346 179 145 175 25
1861 25 -2 -13 171 106 -255 -31 -31 -141 419 22 153 390 -341 211 76 22 20 -132 26 158 -185 43 130
1884 130 84 -353 36 53 -21 -296 -38 -38 221 205 -4 158 36 115 78 -196 -21 -195 18 76 -110 -1 304
1907 304 -15 -21 -128 -113 35 105 13 -60 -94 209 4 -80 2 304 270 -62 1 -271 94 -225 -255 81 -6 38 151
1932 151 -48 -47 -270 -90 144 -154 -271 -264 -100 -58 -195 -166 79 -306 64 43 -385 97 -121 -6 -72 -119 47
1955 47 -125 80 -47 324 8 288 -225 -237 183 0 -106 -35 36 -357 14 -152 -19 -102 127 154 50 67
$$ packed form
1791B53j78p4M91l73n5M2k18L65k42l23K48K1J55j7l86K13n9J39K45R8m87J51
1813IK11o0k38Q6q3J85l87K9K24L1J33n3j25L46n50J18J85j79k3J05O4N0M8k12
1837h6J54J97l79O8P8K51k99l2l7M5q1J87qq2n6L94j86l02K87K33j67l4L0j50
1861B5k7j1J84o5l61K24%j10N60l97J31K37p31N52j35n4kj52J58J32l43K28Q7
1884A30m6m37L89J7p4k75K58%K59j6k09J62j22P9l7k74J75j74K13N8j86J09L05
1907C04l19oj07J5J48P0r2p3l4L03k05q4Q2L02l4l32O3k72L65l19l0L36q7M4J13
1932A51j99Jk23J80K34k98j17PJ64M2j37K9K45l85L70k1m28M82k18J15o6m7J66
1955D7j72K05j27L71l16K80n13j2M20j83j06P1P1l93L71j66J33q3K29K7j04J7
$$ plain form
1977 67 -88 7 -28 16 -37 24 502 283 29 187 6 169 55 -22 443 196 -22 72 49 -68 80 51 -70
2000 -70 86 52 -32 139 87 -138 -265 43 -27 3 269 -83 386 -224 137 118 209 385 -117 -200 3 85 -3 10
2024 10 -156 42 90 -145 43 -62 -197 -76 -265 247 -54 164 -167 151 -125 -223 206 -58 24 -166 38
2045 38 251 -344 -30 -95 -260 -134 -541 289 101 -290 48 137 39 -17 -330 -59 12 -63 -87 39 -44 -127 -6
2068 -6 -132 161 -185 -144 55 -143 -161 57 8 -134 117 -138 51 36 -24 326 243 -64 134 169 -135 44 -151
2091 -151 14 -43 -36 62 128 -134 78 104 -23 -90 -5 49 114 357 -208 -190 137 44 -156 265 -176 124 332 -79
2115 -79 125 -268 175 204 114 -107 85 150 -95 11 24 129 18 26 -30 -90 186 -65 -85 -225 -170 284 156 55
2139 55 -357 73 -165 131 -4 52 37 -153 -205 -7 -56 -12 99 -230 -147 45 163 -305 -155 -98 -31 -182 -252
$$ packed form
1977F7j55R5l5M4n3O1M78k19k54J58j81J63j14p7M65k47k18R4k3j17J48k9j21
2000g0J56l4q4J71n2k25j27L08p0L0K66l52M69o10L61j9R1J76n02q3K03Q2q8J3
2024A0j66J98M8k35J88j05j35J21j89N12l01K18l31L18k76r8M29k64Q2j90K04
2045C8K13n95L14o5j65J26m07Q30j88l91L38Q9r8n6l13K71P1p5k4J26q3q3J21
2068fj26K93l46M1J99j98j8K18m9j42K51k55J89j5o0L50q3l07J98L5l04J79j95
2091a51J65n7PR8O6k62K12K6j27o7Q5N4O5K43n65J8L27r3k00M21m41L00K08m11
2115g9K04l93M43K9r0k21J92O5k45J06J3J05j11Qn6o0K76k51k0j40N5M54j28j01
2139E5m12M30k38K96j35N6j5j90n2J98m9M4J11l29Q3J92J18m68J50N7O7j51p0
$$ plain form
2162 -252 -330 -137 150 16 -27 145 -36 13 25 83 93 -8 -2 -242 -114 -163 -314 -451 70 80 173 -58 -43 -52 78
2187 78 -31 88 -17 115 -256 -57 -257 -95 -311 -57 225 151 -111 86 142 1 -7 12 -335 28 -205 262
2209 262 -67 -78 105 221 -198 -32 -174 -177 -186 12 -79 59 333 -182 -265 44 145 -127 174 -329 -58 68
2231 68 77 -99 417 -202 -122 -19 212 34 -2 150 132 43 401 -204 -274 344 186 -158 81 -19 6 -165 -156 -276
2255 -276 -4 116 71 192 46 232 41 33 154 67 -35 -360 -327 71 -39 159 -290 -24 -1 29 185 -203
2277 -203 -363 10 -8 105 -181 381 0 -128 -151 47 -9 51 62 -175 -84 -135 -174 153 50 -60 -89 22 77
2300 77 -94 -16 207 51 375 -32 68 31 107 153 140 169 -39 57 29 -153 -201 -105 19 -133 55 -199 -17 -323
2324 -323 -228 -118 -6 -110 260 -268 -55 -35 -176 -18 372 -4 165 121 -255 264 10 -111 -2 8 -59 160
$$ packed form
2162b52p8J93K87j34m3J72j81M9J2N8J0j01Ok40J28m9j51j37N21J0R3k31J5rJ30
2187G8j09J19j05J32l71J99k00J62k16K54K82p4k62J97N6j41qJ9l47L63k33M67
2209B62l29j1J83J16m19J66j42lrJ98r1J38K74n15q3L09J01k72L01n03K71J26
2231F8Rj76N16o19Q0J03K31j78l6J52j8q9L58o05p0O18j58l44K39j00K5j71Rj20
2255b76K72J20m5J21j46J86j91qJ21q7j02l25L3L98j10J98m49K66K3L0J56l88
2277b03j60L73j8J13k86N62l81j28k3J98n6O0J1k37R1n1l9L27j03j10k9J11N5
2300G7j71P8K23j56L24m07J00l7P6M6j3K9k08R6k8j82m8R6J24j52J88k54J82l06
2324c23R5J10J12j04L70n28K13K0j41J58L90l76J69m4l76N19k54j21J09J0o7K19
$$ plain form
2346 160 -61 -43 193 -125 29 -21 27 -131 -41 250 -206 20 -70 -4 117 77 12 -118 115 1 -103 218 -175
2369 -175 244 183 -9 -17 -90 -2 11 108 -5 58 89 120 33 8 -201 -231 184 222 -177 -73 57 -338 74 -6 166
2394 166 -55 73 290 -54 -157 425 -4 212 -210 -105 289 -220 -109 -55 -353 139 329 -141 78 -137
2414 -137 60 -216 -205 53 -31 83 -68 -86 -50 130 -15 137 -11 -162 134 37 105 145 222 -33 -25 59 174 21
2438 21 225 52 -77 -109 -289 -22 57 -83 -57 -285 -150 106 68 66 234 79 -161 99 238 -111 -190 -221 -157
2461 -157 156 159 164 155 128 486 -44 -57 -22 33 29 -99 68 -42 -226 -429 9 78 -324 -436 105 -143 100 185 115
2486 115 -173 56 185 -122 -432 36 -229 -64 68 -175 103 142 -209 -102 -255 116 -100 -128 219 -161 201
2507 201 -62 -62 294 -102 -18 175 -12 -226 38 -63 -84 -43 -87 260 429 164 437 -64 56 -111 113 -23
$$ packed form
2346A60k21J8K36l18J54n0M8j58R0K91m56K26r0O6J21m0o5j30K33j14j04L21l93
2369a75M19o1j92qp3Q8J3R7j13O3L1L1q7k5k09l0M15L8l99J04J30l95M12q0J72
2394A66k21J28K17l44j03N82m29K16m22J05L94n09J11N4k98M92J90m70K19k15
2414a37J97k76J1K58q4J14j51j8L6J80j45J52j48j51K96r7O8M0P7k55QQ4J15j53
2438B1K04j73j29l2j80K67P9j40K6k28J35K56l8kJ68j55k40K60J39l49p9l1O4
2461a57L13LNrk7L58n30j3L5N5mj28J67j10j84k03M38O9m02j12N41k48K43Q5p0
2486A15k88K29J29l07l10M68k65J65J32k43K78L9l51J07j53L71k16k8L47l80L62
2507B01k63%L56l96Q4J93j87k14K64j01k1M1m4L47J69k65K73n01J20j67K24j36
$$ plain form
2529 -23 26 69 -85 26 -39 -218 -61 9 136 79 -267 255 81 288 -96 -69 -46 -86 167 -297 -155 249 -6
2552 -6 208 106 -174 25 -231 12 -70 50 -11 -97 -3 -175 277 -121 29 5 140 -123 -179 5 275 -30 217
2575 217 79 158 -48 68 -302 49 35 -127 -71 157 12 164 -163 78 251 -73 105 -199 -35 3 229
2596 229 -104 108 59 133 -56 149 247 75 -153 -167 -84 -64 -48 81 -405 -16 -243 50 -374 157 271 -89
2618 -89 -54 59 230 154 -242 195 -316 14 50 81 -86 -7 -57 101 129 104 99 -138 423 -44 63 -24 14 -237
2642 -237 265 12 78 20 -42 -144 20 -348 -201 280 212 -72 144 15 -437 -487 154 54 199 72 15 46
2664 46 115 -178 -147 -56 -201 52 259 304 152 301 -105 57 175 108 351 147 -19 -247 -9 131 28 -85
2686 -85 56 -97 149 184 115 30 -135 134 70 350 -231 -101 55 -80 -67 -324 0 3 104 8 81 38 7 160
$$ packed form
2529b3M9M3j54J11o5j79J57P0J27n7l46N22j74K07l84K7K3m0K53m64J42M04k55
2552fK14j02k80J99k56K43q2J20o1q6R4j72M52l98J50k4J35k63n6J84K70l05K47
2575B17j38P9k06J16l70L51j4j62N6K28j45J52l27K41J73l24J78l04J64L8K26
2596B29l33K12m9P4j89K05R8j72k28j4Q3K0J6J29m86L89k27K93m24N31J14l60
2618h9L5J13J71p6l96M37n11L30L6L1j67P9n0J58K8k5nk37N61m67J07q7L8k51
2642b37N02k53O6n8o2j02J64l68J47M81o8k84K16j29m52n0O41j00J45j27n7L1
2664D6O9k93L1R1j45K53K07M5j52J49m06J62J18o7K43k04j66k28K38J40j03j13
2686h5J41j53K46L5o9q5j65K69o4K80n81J30J56j35J3k57L24LJ01r6P3m3l1J53
$$ plain form
2710 160 83 -38 82 273 -163 -157 71 116 192 -204 101 -58 295 45 276 -153 -9 -228 -82 92 110 198
2732 198 17 56 9 25 371 101 121 162 -70 -9 36 33 12 -42 29 122 -141 -223 189 26 -27 224 -77 -39 128
2757 128 65 159 -174 146 -71 154 7 -155 -362 -32 -46 54 -215 8 188 394 79 19 -114 -127 -141 -43
2779 -43 -123 -92 -175 -24 218 149 -35 -364 -24 92 57 -110 -109 -293 36 137 105 72 201 -47 205 -147 24
2802 24 -17 263 -237 117 -191 45 -16 -79 81 -1 109 9 22 50 94 80 -47 -27 356 -79 -36 68 -152 -179
2826 -179 48 165 -101 -168 93 -199 19 188 66 -30 -71 170 16 -161 12 45 -171 2 134 141 224 -185
2848 -185 105 -246 -10 -119 -165 407 -317 -61 158 37 -50 91 34 -134 -21 134 -175 -342 -56 59 -34
2869 -34 21 -340 -61 -82 -328 -388 -13 -233 -6 -23 35 8 -267 -116 266 -51 249 -76 45 -154 41 2 -287
$$ packed form
2710A60p7j21J20J91m36OK28M5P6l96L05j59L53k50K31m29J44k19J46J74J8Q8
2732A98j81L9m7J6L46k70K0M1k32O1M5lk1n4P1R3k63q2M12j63n3K51l01L8J67
2757A28o3R4l33L20k17K25j47j62k07L30j4J00k69K23J80K06l15o0j33j3j4R8
2779d3q0L1q3J51K42o9j84l29L40J16l5j67Jj84L29J01l2l3J29k48K52l52J71
2802B4m1K80n00L54l08K36o1o3J60q2J10j00J3K8M4j4j27K0L83m35M3J04k20k7
2826a79K27J17k66o7K61k92K18J69j22r6m1K41j54j77J73L3k16J73J32PQ3m09
2848a85K90l51K36j09m6N72p24K56K19j21q7J41n7j68J13J55l09j67K86J15r3
2869c4N5l61K79k1k46o0L75k20K27j7N8k7k75J51L82l17L00l25J21j99J95l9k89
$$ plain form
2892 -287 -118 358 168 13 -104 3 -98 221 72 -31 -114 -120 -85 -102 -100 -226 75 -215 193 113 -80 -55 94
2915 94 -3 10 153 -157 -123 56 -252 -42 62 98 -327 -50 216 117 -60 19 -10 130 37 -17 -134 151 120 -19
2939 -19 10 121 -96 88 338 132 68 -241 -44 -13 -32 -310 -78 2 56 -436 137 113 -36 -78 104 76 179
2962 179 134 68 228 137 -404 -3 79 -119 -35 13 244 12 -78 -231 -54 -76 -186 231 91 -296 29 150 -116
2985 -116 15 -138 -26 239 -59 264 74 231 162 299 99 -79 19 231 -224 -36 -122 141 42 190 -135
3006 -135 -373 -115 132 31 -40 -140 243 62 -198 218 5 98 -153 143 -293 -119 453 -85 -148 -71 178
3027 178 -66 44 -280 35 -45 -7 227 -179 -1 -167 264 -27 84 -269 120 -64 -368 143 -85 124 57
3048 57 16 -57 -59 -38 18 -80 -130 134 -317 -28 331 185 -7 -206 -33 -232 258 74 60 89 -300 54 -121 60
$$ packed form
2892b87J69M76j90j55j17J07j01L19j49j03q3oL5j7Kj26L01k90M08q0j93K5J49
2915I4r7J3J43l10L4J79l08K10J04L6m25K77K66r9j77P9k9J40r3n4j17K85l1j39
2939a9K9J11k17J84K50k06o4l09J97L1j9k78K32Q0N4m92N73k4j49m2J82k8J03
2962A79m5o6J60r1n41M01Q2j98Q4M8K31k32r0j53J77k2j10M17j40l87L25J21k66
2985a16J31j53J12K65k98L23j90J57o9J37k00j78R8K12m55J88q6K63r9J48l25
3006a35k38K58K47j01p1j00L83j81k60M16k13R3k51K96m36J74N72n38o3P7K49
3027A78k44J10l24L15q0L8K34m06J78j66M31k91J11l53L89j84l04N11k28K09o7
3048E7m1p3kK1N6r8n0K64m51K89L59j46j92j99J73j99M90j84j4K9l89L54j75J81
$$ plain form
3072 60 64 -89 174 12 15 7 -75 -96 347 14 -170 -105 -50 192 -223 266 141 -109 43 121 -147 67 -273 -22
3096 -22 199 -242 -263 -45 -92 90 136 200 115 58 69 335 -53 -127 28 27 -33 65 -50 -129 210 99 -20 -181 82
3121 82 252 132 -148 24 211 -108 -129 -205 417 141 93 60 212 322 -54 83 -123 -53 -220 -89 -60 146
3143 146 -75 -39 -255 147 82 -22 219 -105 -314 255 29 43 -247 124 76 -102 136 -97 -226 -83 194
3164 194 74 91 139 111 -300 68 -180 28 -231 -252 -152 183 246 -50 319 55 -65 -164 292 58 -84 153
3186 153 -82 207 -32 -49 243 140 110 -27 118 -198 -20 -72 -68 121 -210 54 -143 130 -167 11 235 120
3208 120 -87 -246 285 196 -103 -20 -128 -159 -170 -324 -40 -228 139 -248 -193 83 129 219 196 -7 -62 -69 -230 -224
3232 -224 126 247 214 20 12 127 -83 192 372 -80 5 -124 -250 84 167 116 16 -165 -145 43 -32 -16 -183
$$ packed form
3072F0Mj53K63j62Lqq2k1M43l33j84O5N5K42m15M89j25k50J52P8k68K14l40K51
3096b2K21m41k1K18m7J82M6O4q5n7J1K66l88p4J55jo0R8j15p9L39j11j19j61K63
3121H2J70j20k80J72J87l19k1p6O22k76m8l3J52J10l76J37k06P0j67J31K9K06
3143A46k21L6k16M02o5j04K41l24k09N69k26J4k90L71m8j78K38k33j29J43K77
3164A94j20J7M8k8m11L68k48K08k59k1J00L35O3k96L69k64j20r9M56k34j42K37
3186A53k35K89k39j7K92j03l0j37J45l16J78n2MJ89l31K64j97K73k97J78K24j15
3208A20k07j59N31q9k99Q3j08l1j1j54K84j88L67l87N5K76M6R0k3k03n5pj61O
3232b24L50J21l3j94qJ15k10K75J80m52Q5j29j26L34Q3n1j00j81K0J88p5J6j67
$$ plain form
3255 -183 320 -105 143 123 -373 237 12 114 43 -296 20 -354 -10 -59 -172 -98 -214 73 -113 -406 -81
3276 -81 135 -245 95 -170 15 233 -217 -373 149 -82 -38 -416 407 228 115 49 189 250 53 255 -62
3297 -62 286 113 73 -7 -72 -223 -130 -62 -170 41 48 4 215 -238 234 -127 -63 75 -246 -118 -31 -95 99 -140
3321 -140 202 226 -126 -62 -355 116 -41 43 51 -31 -170 8 -70 -208 85 86 -62 -146 273 295 15 -36 448 149
3345 149 -29 -15 -243 377 -140 31 155 -13 77 14 -94 231 80 18 1 -106 310 6 85 15 152 -60
3367 -60 -146 52 -109 -311 25 -280 -69 -136 -32 133 -42 -18 -239 -31 153 217 213 149 104 59 -93 -161 125 165
3391 165 340 246 -54 106 -13 -299 -108 301 149 25 -37 41 -366 247 -131 363 160 2 -177 -244 -151 -137
3413 -137 -294 0 -66 55 -134 13 28 -24 -90 213 286 -66 117 123 -315 204 95 140 -283 -45 -74 174 -312
$$ packed form
3255a83N03m25K48k0m96O10k25J02p1l39L16l74L44m9j13P4j16K87j86k93L25
3276h1K16l80L40k65J85K18m50j56N22k31M4l78Q23j79j13o6J40O1j97K02l17
3297f2L48j73m0q0o5j51R3O8j08K11Pm4K11m53M72l61O4J38l21J28Q7o4J94k39
3321a40L42K4l52O4k93M71j57Q4Qq2j39J78p8j38K93Jj48q4M19K2k80n1M84k99
3345A49j78J4k28O20n17J71J24j68R0o3j08L25j51o2j7j07M16l04P9p0J37k12
3367f0q6J98j61k02L36l05K11o7J04J65j75K4k21K08J84O4mo4m5m5j52o8K86M0
3391A65J75r4l00J60j19k86J91M09j52j24o2P8m07O13l78M94k03j58j79o7R3J4
3413a37j57K94o6J21j89J47J5n2o6L03P3l52J83Om38N19j09M5m23K38k9K48m86
$$ plain form
3436 -312 -155 -79 26 -212 -197 -146 162 196 -195 -315 -224 -99 78 -36 215 24 387 -204 -56 141 20 -115
3458 -115 -261 193 273 282 314 156 -89 -19 42 220 -101 47 68 4 121 -118 -246 -57 63 143 36 119 -202
3481 -202 228 -83 -89 -206 -15 296 -101 -2 -113 -113 -315 -74 -398 159 225 190 152 -56 445 506 -139 -117 -20 39
3505 39 -100 -54 -67 -133 -237 -11 124 -232 0 -103 74 37 -102 23 6 -336 -27 16 -216 -221 142 -193 -310
3528 -310 114 283 124 80 -42 122 52 20 117 82 -154 -170 149 167 -312 4 -117 169 -7 -60 303 -70 135
3551 135 -62 -149 -88 -296 8 21 81 57 -237 -282 124 55 -21 321 -144 -133 6 -103 98 274 6 43 15 32
3575 32 8 -64 265 76 121 51 247 209 317 -54 27 -106 77 127 131 115 320 -36 -11 -166 145 408 -118 -52
3599 -52 27 -118 73 193 -109 319 163 101 69 -19 242 72 160 81 -13 -47 220 143 130 110 -262 134 -120 -258
$$ packed form
3436c12J57P6J05k38J5N1L08L4l91j20R1J25J77j14K51j91L63n91J48J97j21j35
3458a15j46M54Q0RL2j58k45P0O1J78l21J48K1o4J17k39j28J89J20Q0j07Q3l21
3481b02M30l11oj17J91L11l97R9j11%k02K41l24N57O6l5l8k08N01O1o45K2R7N9
3505C9j39M6j3o6j04K26J35l56K32j03J77l7j39J25j7l42L09M3k32nL63l35j17
3528c10M24J69j59m4j22J64p0l2R7l5k36j6L19J8m79L16j21K86j76n3L63l73K05
3551A35j97q7O1k08L04J3O0k4k94m5M06o9p6L42m65J1J39j09K01J76k68L7k8J7
3575C2k4p2L29j89M5p0J96l8J08l71Q1j33J83N0Mj6K05l56K5j55L11K63n26O6
3599e2P9j45J91J20l02M28j56o2l2q8K61j70Q8p9r4l4K67p7j3k0l72L96k54j38
$$ plain form
3623 -258 28 -225 333 -186 -5 -135 1 257 -70 209 29 -92 25 -10 -319 129 151 -2 49 -119 -452
3644 -452 -233 36 139 85 -4 78 23 -221 -86 -118 -89 -140 -281 -65 -70 97 -63 337 39 260 67 82 73 36
3668 36 -5 228 -216 172 41 -159 17 -199 20 65 3 -113 -215 58 179 -215 -188 -55 -181 -78 -85 -24 64
3691 64 103 -42 -60 -43 131 -166 12 73 -214 -150 -225 223 78 197 -92 261 -280 -215 -34 79 101 75 250
3714 250 51 -313 -118 -4 70 -75 -65 -72 135 -149 55 150 14 5 64 -101 117 -69 -48 -14 -19 -2 45 136 -181
3739 -181 -55 -429 51 -118 -38 -22 83 265 -379 203 467 -353 -33 -80 -118 283 -45 191 -410 -29 -150
3760 -150 -3 261 35 96 -80 -42 184 -86 -261 165 290 137 -113 52 -177 358 -274 -238 113 -44 70
3781 70 -36 -36 30 -10 98 -88 -51 79 286 262 24 -278 -147 -9 137 121 174 -175 -13 95 -146 24 42
$$ packed form
3623b58K86k53N58n19J81j30J36K56l27K79j80j21J17l5l09M48K2j53N1j68l33
3644d52K19K69J03n4q9Q2n5k44J35l2K9n1j41K16nJ67j60M00k98K21j93J5rl7
3668C6m1K33m44L88j31k00J76k16K19M5o2j16j02K73J21l94K7J33j26J03pO1Q8
3691F4L9j45j8J7J74k97J78O1k87O4p5M48j45J19k89L53n41O5J81J13K2k6J75
3714B50j99l64J95J14P4j45J0pK07k84K04R5j36rN9j65K18j86K1L4nJ7M7R1l17
3739a81J26l74M80j69Q0J6J05J82o44N82K64q20L20m7l8M01l28K36o01L81j21
3760a50J47K64k26O1j76L8K26k70j75M26J25j53k50J65k29N35o32L6L51j57J14
3781G0j06%O6m0J08j86L7J30K07k4k38l02J31J38J46j6N3l49J62J08k41J70J8
$$ plain form
3804 42 -16 108 0 80 2 -139 -48 -256 79 130 25 -25 -192 227 -117 6 170 -101 319 53 -179 103
3826 103 -88 256 9 -2 -125 -286 62 323 -143 -281 -152 -121 -37 -157 -6 -45 -162 -162 -112 65 209 65
3848 65 -281 -55 -24 -165 129 -299 -17 177 -63 -148 94 113 -139 245 104 0 -232 -74 190 -92 -179 41
3870 41 -3 -184 -155 39 158 -177 242 79 -217 140 117 85 47 61 187 -7 102 -240 63 19 125 -68 179
3893 179 152 37 -10 141 -1 58 176 160 -42 -68 -68 -67 45 78 155 49 -102 -29 94 101 -78 23 133 -81 33
3918 33 109 176 -65 111 58 62 -191 -97 223 -177 -64 -91 -221 -302 -100 -207 81 341 25 -39 -93 -263 143 97
3942 97 146 251 147 30 -31 188 25 20 46 -129 -107 73 40 336 -27 -278 87 125 138 -32 47 -152 -138 -62
3966 -62 -13 153 -160 -115 -33 140 -50 -71 274 92 232 2 -25 254 -48 76 19 210 78 14 62 169 -36
$$ packed form
3804D2n8J24j08Q0p8j41R1k08L35N1j05n0j67M19l44J23J64k71M20k66k32K82
3826A03j91L44k47j1j23j61L48K61m66j38J29L1Q4j20J51l9j17%N0J77J44j44
3848F5l46K26L1j41K94m28K82J94k40q5K42J9k52L84j41j04k32J58K64k82q7K20
3870D1m4j81K9J94J19l35M19j63k96L57k3l2l8J4J26j94J09l42L03m4J06j93K47
3893A79k7j15m7J51j42N9J18j6k02k6%JJ12L3P7j06j51P3J23Pj79J01J10k14J14
3918C3P6O7k41J76n3Mk53R4L20m00J13k7j30q1K02j07K88K60l16o4n4j70M06m6
3942I7M9J05j04j17o1K19j63nK6j75K2J80l3K96l63k51L65L8J3j70P9j99J4P6
3966f2M9J66l13M5Q2J73j90k1L45j82J40k30k7K79l02J24n7J91j32o4M8J07k05
$$ plain form
3989 -36 -170 138 -123 -139 -91 75 -203 -296 305 -120 152 102 94 -128 -116 341 23 -221 -55 -212 233 45 -96
4012 -96 -24 4 59 3 -12 90 146 20 6 -157 -55 451 279 289 132 -149 -15 -81 -151 67 149 39 -28 -275
4036 -275 159 -278 -15 -74 -100 77 -192 -69 -149 -73 -149 97 -45 130 86 157 -235 140 288 118 -79 89
4058 89 109 -38 154 72 -123 -101 273 -42 53 -40 113 156 26 -93 205 190 -305 -584 -20 -68 196 244 41
4081 41 49 245 151 -77 -131 25 -126 -55 -119 -176 132 -189 34 -36 -217 267 69 -43 236 -270 -233 101 -32
4104 -32 -120 82 -161 -217 -140 151 23 19 36 -148 166 78 74 -28 -25 -127 52 -164 -151 -76 -19 140 181 90 50 -122
4130 -122 -145 24 -273 -196 -33 5 34 113 -291 -92 -346 308 321 -5 23 -60 -103 287 39 -150 94 -16 -155
4153 -155 194 133 -270 -310 78 -63 236 -18 43 162 23 43 128 25 -64 -249 11 22 -24 251 112 316 23
$$ packed form
3989c6j34L08k61j6M8J66k78r3O01m25K72n0qk22J2M57l18k44J66j57M45j88j41
4012i6P2K8N5n6j5J02N6j26j4j63J02N06j72J0j57k81J34o6p0K18Q2j10o7k47
4036b75M34m37K63n9k6J77k69J23q0P6p6K46j42J75m4P1l92L75J48j70j97J68
4058H9K0j47J92q2j95K2L74l15R5r3J53M3j30j19K98j5m95k79N64m8K64M8k03
4081D1QJ96r4k28n4J56j51P1o4n7L08l21K23p0j81M84j98j12K79n06L7L34j33
4104c2q8K02k43n6P7K91j28mJ7j84L14q8mj02Lj02J79k16J3P5N7J59M1r1m0j72
4130a22k3J69k97P7J63L8K9P9m04J99k54O54J3l26K8q3m3L90k48j89K44j10j39
4153a55L49o1m03m0L88j41K99k54O1J19j39K0Q5j03q9j85K60J1m6K75j39K04k93
$$ plain form
4176 23 165 205 -34 1 76 -36 160 -118 -105 102 -212 -88 264 170 66 -8 33 173 145 129 -118 -246 145
4199 145 -32 -161 -10 -40 -34 -69 -11 111 96 133 -19 -90 -246 18 -171 67 -281 -93 94 281 -201 -346 -159
4222 -159 -143 -68 -37 184 -160 -133 21 -271 -61 -40 97 350 -189 24 235 -157 110 361 -151 214 35 -134
4244 -134 -409 -132 -89 36 -96 320 170 -3 -130 68 -213 -9 59 -160 -31 157 127 -367 18 -156 33
4265 33 38 14 93 -147 33 249 -244 45 -101 -74 93 -245 -193 -153 233 -199 147 -377 -92 168 -12 286 -173
4288 -173 328 66 -119 152 -2 80 21 -177 348 38 -185 -244 -110 -223 -280 -23 -61 51 44 -73 125 4
4310 4 -180 197 -293 88 -96 -118 -171 -416 -25 121 65 154 -63 -34 -88 -137 7 163 68 113 17 -125 -135 -84 -121
4335 -121 30 169 107 247 33 -174 126 -95 -254 -260 -68 -76 -193 19 62 -11 -119 131 58 85 -79 -144 -9
$$ packed form
4176B3J42M0k39L5P5j12J96k78J3K07l14J24L52r4j04p4M1J40k8j6k47j28L91
4199A45j77j29J51l0Ol5N8J22j5L7j52p1j56K64j89K38l48J88J87J87m82j45J87
4222a59J6P5L1K21l44K7J54k92K10K1J37K53n39K13K11l92K67K51n12L65j79j69
4244a34k75K77M3J25j32M16j50j73j27J98k81K04O8k19J29J88l0m94L85j74J89
4265C3Nk4P9k40J80K16m93K89j46K7J67l38N2M0L86m32L46n24K85K60j80K98m59
4288a73N01k62j85K71j54Q2n9j98N25l10k23n9J34j13n7K57l8J12pj17J98j21
4310Dj84L77m90L81j84k2n3k45L91J46n6Q9k17K9n4m9J44J56r5M5r6j42j0N1l7
4335a21J51J39o2J40k14k07L00k21j59oJ92qj17K12M3p3j08K50p3K7j64o5J35
$$ plain form
4358 -9 7 45 25 -24 100 81 71 -37 -194 151 -347 -74 -112 59 61 -306 48 -103 47 152 -247 54 48 142 36
4383 36 452 -228 30 -61 -93 338 -120 -25 201 147 -202 60 163 -14 14 10 129 -53 166 221 155 -52 82
4406 82 111 -16 133 -218 49 89 -14 100 140 -18 225 -270 9 52 5 88 -130 -22 53 -194 -184 170 -41
4429 -41 57 -158 -283 5 258 55 268 -43 13 4 18 -168 -154 -136 -67 110 -63 105 -120 -59 151 -221 87
4452 87 140 50 -80 -95 -47 11 -13 -64 14 114 120 126 289 -127 -29 111 79 110 283 54 33 12 -74 -77 -82 7 -63 203
4480 203 188 -266 -88 -155 -110 26 175 22 38 248 77 38 65 -241 27 -217 -169 -21 -170 163 226 26 33
4503 33 81 118 173 34 -51 -192 -188 147 52 -12 44 -142 -8 134 -98 -25 -182 270 128 -64 209 8 24 337
4527 337 -212 -60 41 63 155 -171 -27 54 -23 281 -60 197 40 -85 50 -10 -75 -81 -78 38 -104 -98 -50 -89 38
$$ packed form
4358iJ6L8k0m9J24j9j0j08j57L45m98K73l8J71Kl67L54j51J50J05l99L01oR4j06
4383C6M16o80K58r1l2M31m58R5K26n4l49K62J03j77K8mJ19j82K19N5o6k07J34
4406H2K9j27J49l51K67M0j03J14M0j58K43m95K79M3m7Q3k18J08P5k47J0L54k11
4429d1R8k15j25K88K53k03K13l11N6rJ4j86J4J8O9J77j73J68k25O1K10l72L08
4452H7N3r0j30j5M8N8k4n1P8J00OOJ63m16R8J40l2L1J73k29k1k1q6lnQ9p0K66
4480B03j5m54J78o7M5J36J49j53J6K10j71l9K7l06K68k44M8J48j49L33O3k00P
4503C3M8L7N5j39q5j41ML35r5o4N6j86J34J42k32P3j57M52j42j92K73k01J6L13
4527C37n49J52J01K2R2l26J44Q1p7L04l41K57j57j25J35o0o5oLJ16j42OM8l9J27
$$ plain form
4552 38 429 86 142 235 172 202 407 21 -181 -4 -46 -211 17 40 135 231 -118 -8 -54 -321 -51 -361 -40
4575 -40 -79 -93 -253 -32 31 33 209 199 51 163 -366 42 -16 -140 489 -2 259 -290 48 -66 14 -250 -67
4598 -67 -188 -168 123 192 150 -180 -95 1 7 -134 -127 36 75 -132 -9 -259 268 -158 380 -374 -197 -282 -90 -83 321
4623 321 -262 -126 206 168 414 9 135 -34 78 -125 -18 -28 -301 220 -35 -86 143 -120 69 -119 127
4644 127 283 -23 69 -194 95 204 -131 75 -55 -194 -148 -96 -294 -79 -102 -240 -309 171 187 -252 112 104 -64
4667 -64 2 262 76 167 88 -70 -254 161 72 145 2 -157 -97 -98 -67 -43 -42 -29 58 -38 -126 -53 44 135 66 342 -90
4694 -90 57 -174 -159 -353 122 -18 -6 256 -371 -125 252 -86 -96 -90 136 -27 -287 45 -208 -10 351 74
4716 74 62 62 -323 -125 114 111 182 -70 151 350 29 -317 10 300 178 -206 -6 114 250 -102 -197 -57 94
$$ packed form
4552C8L91l43N6R3o3L0K05l86k02J77m2j65K28K3R5R6l49J10m6k67K70l10L21
4575d0l9j4j60K21O3KJ76j0j48J12n29M08n8j24O29m91K61n49L38j14Q0k64J83
4598f7j21K0K91O9m2l30Q5R6Oj41PJ63L9k07J23k50N27m26N38p54J77q5J92PM04
4623C21n83J36L32l8K46m05J26j69J12k03J07j0k73N21k55n1K29k63J89j88K46
4644A27J56l06R2k63K89J09l35K06j30j39M6N2j98K15k3j38o9M80J6m39L64qj68
4667f4O6K60j86R1p9j58j84M15q9P3j43j59O0jL1K4JJ3Q7r6q8P3R7R1o9K76m32
4694i0J47k31J5j94M75j40J2K62o27K46L77l38j0OK26j63k60L32k53J98L61k77
4716G4j2%l85J98K39lP1k52K21J99l21l46L27K90j22l84K00J20J36l52r5J40J51
$$ plain form
4739 94 419 -112 -110 -20 186 -27 129 -11 108 249 -16 164 165 -272 69 -80 -147 157 -310 -439 9 -178
4761 -178 22 -50 -103 100 -227 -6 258 -364 -99 -263 -217 49 18 -90 -221 51 86 -444 66 -28 49 -78
4783 -78 137 -69 38 -253 -105 83 -15 98 -178 18 74 202 24 -115 -180 32 10 57 90 110 74 -143 -137 120
4807 120 37 -131 -12 75 3 157 48 199 -174 -156 -80 276 -57 189 245 -86 -251 -87 -188 -3 61 -160
4829 -160 -137 -68 130 142 323 -116 256 -260 24 83 -86 -25 -106 -126 -54 97 -32 268 193 -115 0 -135 203
4852 203 -204 172 132 -244 284 -290 -193 -9 81 -129 80 336 -42 -136 54 85 -14 -126 -39 246 -282 -70
4874 -70 -297 -146 277 12 -161 -211 -244 10 6 27 -134 157 6 -143 129 -177 -116 -183 147 157 -22 -78 -148 57
4898 57 -64 87 -17 -87 -79 86 -295 -236 9 169 -86 210 -123 -6 5 -261 -179 -191 43 -177 80 16 -168
$$ packed form
4739I4L25n31KR0K06k13J56j40J19J41k65J80Jm37L41j49o7L04m67j29M48j87
4761a78K00p2n3K03l27K21K64o22K65j64M6K66l1j08j31K72L5n30N10r4P7j27
4783g8K15k06J07k91J48J88r8J13k76J96N6J28j78j39o5K12k2M7L3K0l6k17OK57
4807A20q3j68J19Q7p2J54j09J51l73J8P6L56l33K46N6l31j65J64j01J85O4k21
4829a60K3O9J98J2J81m39L72n16K84N9j69O1q1k0P2J51j29L00p5l08J15j35L38
4852B03m07L76m0l76N28n74R7J84R0k10K09K56l78r4J90L1r9j12Q7K85n28K12
4874g0k27J51M23k65j73n0l3K54mK1j61K91j51j49K72l06O1o7L30J0j79n6p0K05
4898E7j21J51j04p0QJ65l81N9K45J60k55K96l33J17J1k66Q2j2K34k20K57o4j84
$$ plain form
4921 -168 -69 -120 141 5 335 -29 -281 149 27 -31 12 -339 -48 100 261 -170 115 126 -208 408 2 -171
4943 -171 119 46 -64 -107 -120 83 -12 2 208 24 -140 31 168 135 17 178 -79 -158 168 334 53 4 -303
4966 -303 -294 -161 -85 -184 99 -234 -120 -20 -132 -156 -165 248 -80 -111 -33 60 190 24 -80 18 57 162 -116 -63
4990 -63 -235 81 -83 398 358 76 -108 31 161 -182 168 272 -405 -269 73 -202 -175 -282 -4 -28 -193
5011 -193 -33 114 235 -133 120 482 -138 -145 -2 46 -58 69 -157 59 211 325 178 -92 226 -251 114
5032 114 -277 -193 72 -156 200 -156 31 -176 -155 -249 222 -255 -119 89 -280 249 68 12 61 -147 -185 -271
5054 -271 11 78 -369 -142 -67 25 -166 189 -78 -99 -99 90 -101 -147 270 105 184 46 180 -39 74 -35 -48
5077 -48 -133 -157 -92 -202 -199 116 -20 -192 79 -129 313 45 -333 219 264 55 4 -115 44 -145 -2 -91 129
$$ packed form
4921a68R9n1K61j36L30l64k52M30j22n8M3l51K91J48J61m31K85J1l34O16m06j73
4943a71K90p3j10m3j3K03r5J4K06j84j64J71J37l3j18J61k57p9L26J66k81m9l07
4966c03RJ33P6r9K83l33J14J00j12k4rM13l28l1P8R3J30j66j04R8L9J05k78N3
4990f3j72L16j64M81m0k82j84J39J30l43L50J04o77J36L42k75K7j07K78k4j65
5011a93J60J47J21l68K53L62o20pJ43M8j04J27k26K16J52J14j47k70L18m77L65
5032A14l91Q4K65k28L56l56J87k07K1r4M71m77J36K08l69N29j81n6M9k08l8q6
5054b71K82O7m47K27P5R2j91L55k67k1%J89j91m6M17j65P9j38J34k19J13j09j3
5077d8q5k4O5j10LL15j36j72K71k08M42k68l78N52M5k09n1j19J59j89J43q9K20
$$ plain form
5100 129 -12 -73 -24 439 -59 -59 -201 -180 -31 -229 -112 -267 25 -23 84 71 -109 2 44 -216 139 96 60
5123 60 218 -41 -19 -117 -181 139 104 139 31 -188 219 250 3 31 -65 -193 -112 31 31 -184 141 11 244 318
5147 318 118 -62 -24 430 -137 29 -261 -483 -196 48 147 6 90 -75 -335 46 -58 231 139 42 -174 -16
5169 -16 -140 15 45 129 -79 -198 -74 -118 80 -92 -74 300 -292 -74 213 250 -62 -277 -24 -123 108 -41
5191 -41 50 234 75 164 -10 49 -74 402 230 -106 158 119 63 -267 -237 -395 109 -145 -251 72 68 -139 481
5214 481 184 -118 37 -281 -340 -18 66 93 -72 -174 15 64 -63 -125 -247 -22 20 138 -119 -47 47 165 117
5237 117 29 268 42 -185 -159 -41 14 -34 -96 139 182 -206 -93 9 131 -48 -58 -23 -49 -263 92 138 -136
5260 -136 51 9 2 -317 284 10 -51 10 -272 -9 -198 96 225 -211 128 146 50 246 -241 313 62 58 -184
$$ packed form
5100A29j41o1M9M63m98%j42K1J49j98J17j55K92m8J07j3j80J11M2k60L55m3l6
5123F0J58k59K2r8o4L20l5L5j08k19M07L1k47K8r6j28Q1J43%k15L25j30K33P4
5147C18k00j80L8M54n67J66k90k22K87K44R9j41Q4j65k60L81j04K89r2r7k16J58
5169a6j24J55L0Q4k08j19J24m4J98j72J8L74n92K18K87L7l12k15K53r9K31j49
5191d1R1J84j59Q9j74N9j23M76j72l36K64l9n6l30L0j58N04k54j06L23mk07O20
5214D81k97l02J55l18n9L22Q4K7j65j02J89M9j27o2j22K25M2J18k57P2R4J18m8
5237A17q8K39k26k27K6J18N5m8o2K35M3l88J13J02J22j79j0L5k6k14L55M6k74
5260a36J87m2pl19O01k74o1O1k82K63j89K94J29m36L39J8r6J96m87N54k51mk42
$$ plain form
5283 -184 1 -63 -426 281 0 -53 -13 134 322 -14 93 195 -66 26 -78 -122 51 -42 -55 257 -178 18
5305 18 -35 463 134 -304 -44 -77 295 -11 -59 30 83 -183 12 -188 -48 -102 -64 32 -129 145 231 -27 -4 20
5329 20 -155 29 174 34 -7 -333 -179 -163 88 290 186 -32 -139 -113 296 29 44 183 81 16 -280 59
5351 59 -31 -288 211 -137 54 243 42 202 29 198 -188 350 -111 -149 -15 -90 91 11 103 233 -7 -222
5373 -222 102 57 202 40 -66 6 130 75 -32 -29 52 147 -175 100 -204 -5 71 -335 113 -143 -378 168 -80
5396 -80 -35 116 182 -1 -141 -40 73 303 130 -144 -116 255 393 -68 87 98 -306 212 -89 -10 -37 -31 168
5419 168 -106 65 -17 -273 -194 -48 -132 -115 176 88 -129 53 -33 29 -190 -8 -189 -25 149 -161 -150 -160 241
5442 241 -70 -16 22 1 128 -162 91 -304 341 -184 -61 -148 -50 44 -5 -67 61 37 -109 261 13 86 72 27
$$ packed form
5283a84J85o4l63P07k81n3M0J47J88l36J07J02k61R2j04m4J73r3j3L12m35J96
5305A8n3M98l29m38K60l3L72l06m8Q9N3k66J95k00J40n4L8R6j61K74Q6k58K3K4
5329B0j75J84J45j40m1l26J54J6K51K02j04k18j07K6M09k67J5J39j02o5k96L39
5351E9r0k57M99l48J91J89k01J60j73J69l86N38m61l8J34p5J81q0R2J30k40k15
5373b22L24m5J45j62j06P2J24n5j07LQ1R5l22K75l04J99P6m06M48k56k35N46k48
5396h0M5J51O6j83j40J01J13K30j73k74K8L71J38m61J55J1m04N18l01P9k7OJ99
5419A68k74J71q2k56P9J46q4J7K91q8k17J82q6O2k19J82j81J64J74l10J1j0M01
5442B41l11N4L8k1J27k90K53l95O45n25J23q7R8R4m9o2J28k4j46L70k48P3j4m5
$$ plain form
5466 27 78 -31 297 -252 44 272 -342 -323 54 -48 -18 120 388 253 100 -59 -204 90 -150 -5 -107
5487 -107 30 -77 134 -175 -54 72 -8 -64 -115 -52 -85 -116 -22 31 -7 -35 227 198 -221 -170 88 73 77 -145 -82
5512 -82 111 -108 42 149 -187 12 -132 -95 -42 -22 -10 -10 159 -92 94 83 93 -22 219 50 -110 372 -242
5535 -242 -88 -69 21 27 178 38 313 219 -13 49 -59 15 -19 248 128 17 45 -45 -43 36 167 45 -548 -33
5559 -33 -97 -38 -145 217 145 -259 -167 -27 -120 33 355 -22 -239 46 -159 -59 -21 -259 195 123 -267 -31 -199
5582 -199 210 -128 -70 -2 -169 -43 87 -152 219 143 -235 70 107 -31 128 -215 -143 172 246 -6 109 -131
5604 -131 -148 -90 36 381 -83 88 -120 -127 -71 74 97 300 -130 83 -103 -241 187 179 -115 -36 -106 -18 34 -8
5628 -8 48 -144 -10 -103 -249 -52 -199 354 -45 -217 44 354 -114 138 -210 258 -7 -75 91 163 27 -370
$$ packed form
5466B7N1j09L28n49K96K28o14J9L77j02L0J38K68j35j53j59j45K94k40J45j02
5487a07J37j07K11l09J21J26q0n6n1O3l3l1R4N3l8k8K62k9m19N1K58j5Mk22O3
5512h2J93k19J50J07l36J99j44L7N3K0J2%J69k51J86j1J0j15K41j69j60M82o14
5535b42J54J9R0OJ51j40K75r4k32O2j08P4l4K67j20j11K8r0KP9J31j22n93N15
5559c3o4N9j07L62p2m04R2J40r3J53L22l77k17K85k05J00L8k38M54p2l90K36j68
5582a99M09l38N8O8j67J26J30k39L71p6l78L05L7j38J59l43P2L15P4k52J15k40
5604a31j7N8J26L45m64J71k08pN6J45K3K03m30K13j86j38M28qk94P9p0Q8N2m2
5628hN6j92J34r3j46J97j47N53l99j72K61L10m68K52l48M68k65o8J66P2j36l97
$$ plain form
5650 -370 10 320 -45 -38 308 60 -259 77 4 112 -19 29 76 39 -50 -166 101 -51 302 -3 137 -66
5672 -66 265 11 265 -249 39 -144 -164 -224 -30 -174 -107 20 344 205 120 -167 32 277 60 -233 139 250
5694 250 -58 198 -189 246 41 -230 -392 416 -141 53 -211 70 -211 -2 -225 63 -87 84 -48 57
5714 57 81 -332 70 -72 107 66 -65 212 207 -340 33 155 -48 33 -241 -111 124 -46 28 -323 141 -162
5736 -162 -20 14 -100 438 54 -195 -54 -221 -137 -284 -93 13 -115 -106 -194 -284 38 -76 -106 -34 -262 -22 -387
5759 -387 -213 169 -146 30 -140 110 -87 -91 -229 -202 270 130 88 -318 -92 190 -18 -168 65 63 203 24
5781 24 -207 -191 -10 -65 -82 -51 -1 -105 -340 -91 67 66 -156 -115 182 25 -48 173 84 14 -40 139 -18 -3 -25
5806 -25 -242 -102 -53 -135 -37 83 82 -148 -97 96 -15 -111 17 251 -60 -126 33 -62 -60 -245 -55 -86 -69 85 -311
$$ packed form
5650c70L80L10l65PL46k48l19L36p3J08j31M8M7l7q9j16K67j52L53l05J40k03
5672f6L31k54K54n14K88j83k0o0J94j44O7J27L24j39q5k87J99K45k17k93L72J11
5694B50l08K56l87M35k05k71j62Q08n57J94k64K81k81K09k23K88j50J71j32J05
5714E7K4m13M02j42J79m1j31K77nn47L73J22k03Q1k74J30K35j70P4l51M64l03
5736a62J42L4j14N38l84k49J41j67Q4j47J91J06j28Rq8r0L22j14l0P2k28K40l65
5759c87J74L82l15J76j70K50j97mj38K7M72j40m2m06K26K82k08j50K33kJ40j79
5781B4k31J6J81n5j7L1N0j04k35K49J58jk22M1K97j57p3K21q9p0n4J79j57J5k2
5806b5k17J40M9q2R8J20jk30N1J93j11r6J28K34l11o6J59r5Kj85J90l1J7J54l96
$$ plain form
5831 -311 -139 98 375 -73 379 -17 128 -11 -241 63 72 100 -6 199 -293 122 -99 15 217 85 137
5852 137 -94 -246 18 273 33 -471 84 -78 -42 -177 235 -63 317 -84 23 97 -23 -85 28 18 46 102
5874 102 -102 12 82 303 359 -54 6 93 38 -203 -210 93 -198 145 166 -97 -76 -261 -112 -28 -5 37 20 -131
5898 -131 -22 220 64 -193 222 -6 56 -430 174 67 -126 -290 -241 230 88 146 -70 -108 -463 180 -41
5919 -41 -50 5 -23 21 -207 181 150 126 -345 -259 101 -114 48 -262 2 69 25 92 -27 -125 30 -371 157 52
5943 52 -164 -149 -45 -14 31 10 40 20 254 -151 -44 26 -369 29 104 178 11 132 77 50 206 143 203 131 -88
5968 -88 -20 -189 102 -141 -187 -100 -214 -92 -124 -103 -38 79 -358 0 12 -170 -302 211 8 40 45 -46 162 -64
5992 -64 150 105 39 19 -89 -43 -3 111 57 203 -98 174 83 34 75 -199 49 -83 215 -138 238 -25 -153
$$ packed form
5831c11J72K37K77m48M52l96J45j39k30L04RK8j06K05m92M15k21J14K02j32N2
5852A37k31j52K64K55k40n04N55j62L6j35M12k98L80m01J07P4j20o2J13j0K8N6
5874A02k04J14P0K21N6m13O0Q7n5k41pL03k91L43K1k63K1j85J49Q4K3M2j7j51
5898a31J09K42j56k57M15k28O2m86O04j07j93j64M9M71j42N8k16l8l55O43k21
5919d1rN5k8M4k28L88l1k4m71Q6L60k15J62l10K64O7m4O7j19r8J55m01N28j05
5943E2k16J5J04L1M5k1L0k0K34m05J07P0l95L98P5P4j67J21n5k7J56o3O0p2k19
5968h8O8j69K91k43m6Q7j14J22l2K1O5J17m37L58J2j82j32N13k03L2Nr1K08k26
5992f4K14m5o6k0j08M6M0J14n4J46l01K72r1m9M1k74K48j32K98l53L76k63j28
$$ plain form
6015 -153 -112 63 19 79 -49 134 -15 -82 -62 328 26 35 164 31 113 -196 309 -256 -524 35 43 310 160
6038 160 -197 -32 185 -63 -40 12 70 47 76 -109 70 35 -92 -28 -100 177 248 -273 253 109 -10 -128 45
6061 45 133 1 201 -70 -235 -46 100 18 -253 -24 235 -152 97 -162 -111 -181 92 203 96 -181 -270 2
6083 2 -181 177 -249 80 32 128 94 28 326 0 270 -11 -115 -17 -79 198 -120 -205 -184 -140 36 96 247 30
6107 30 319 -58 401 245 -409 -276 139 20 -122 14 -47 33 98 -206 -41 -246 -178 -164 -243 1 17 -33 47
6130 47 -5 30 22 -18 105 -71 5 -7 -267 -292 27 -332 -53 -10 304 -120 -149 -83 64 -69 299 -20 39 -81
6154 -81 119 -154 -233 -260 119 77 -80 10 46 117 45 -54 102 344 28 279 72 195 -99 -260 188 131 -6
6177 -6 19 157 28 219 126 -244 352 -148 -46 16 -80 -428 -369 -90 13 -70 -178 -544 79 107 -260 59 -206
$$ packed form
6015a53M1J75m4O0j28J83j49o7K0L90l02RJ29j33Q2l09N05n65k68N59QK67j50
6038A60l57J65K17k48K3N2N8k3K9j85J79l5j27O4p2K77P1n21N26j44j19j18J73
6061D5Q8j32K00k71j65J89J46q2k71K29K59l87K49k59N1p0K73J11j07k77q9K72
6083Bj83L58m26L29m8R6l4o6K98l26K70k81j04R8o2K77l18q5K1M4J76O0J51k17
6107C0K89l77M59j56o54J33M15j19j42J36o1Q0O5l04J65k05O8J4p9K44J6n0Q0
6130D7n2L5qm0J23j76P6j2k60k5L19l59K79M3L14m24k9O6J47j33L68l19N9j20
6154h1K00k73p9k7L79m2j57R0L6P1p2r9J56K42l16K51k07J23k94j61M48n7j37
6177fK5J38j29J91r3l70N96n00J02O2r6l48N9K79J03q3j08l66O23K8l67L19k65
$$ plain form
6200 -206 104 58 -192 -7 -43 35 -40 -109 77 90 -25 -19 -80 42 -318 182 127 -174 -221 -95 135 46 -24 -68 -70
6225 -70 7 182 -86 47 91 123 8 339 -227 49 158 -149 41 -126 254 -33 171 -114 -217 -43 -190
6246 -190 -2 295 -317 44 -101 -203 -333 -398 20 -117 135 -79 32 166 33 233 -48 25 -120 5 -73
6267 -73 27 -245 -21 70 157 94 -104 -55 -177 215 -150 34 -147 -118 7 175 -343 -137 17 38 284 54
6289 54 -5 -102 79 -46 -237 78 233 41 188 -211 196 -86 -19 -69 -338 218 91 -26 -67 185 -145 99
6311 99 404 -25 279 -24 -173 15 -267 127 -451 -107 -99 -273 232 -187 376 -193 199 1 -59 -83 -211 -102
6333 -102 -55 174 202 32 156 -115 10 227 -110 -114 84 -151 28 -19 329 279 -283 79 83 120 25 -396 1
6356 1 183 -89 -131 144 194 -46 22 -90 -125 -23 212 -59 -472 -139 -238 81 -189 -15 -44 -148 -73 91 116
$$ packed form
6200b06L10m6k50J85l6P8p5o9J86J3j15Oo1J22l60N00n5l01m7J26K30q9p0m4k
6225g0P7J75k68J33M4L2j15L31n66K76J09l07J90j67L80k87K04k85j03J74j47
6246a90J88K97o12L61j45j02j30o5M18j37K52k14J11J34j33K00k81P3j45J25p8
6267g3J00k72K24R1Q7o3j98M9j22L92l65J84j81K9J25J68n18K06J54K1K46k30
6289E4n9r7J81j25j91L15J55j92J47l99M07k82O7n0k69N56j27j17m1K52l30K44
6311I9L05m29L04l03j49J88k82L94n78L44Qj74N05m19N63n69L92j98o0k4j28J09
6333a02M7K29K8j70J24k71J25K17l37mJ98k35J79m7L48n0n62L62ML7r5m21L97
6356AJ82k72m2K75N0k40O8j12l5J02K35k71m13L33r9L19k70J74k9j04P5J64K5
$$ plain form
6379 116 -59 176 239 191 -152 54 114 41 -299 -77 42 -242 134 226 170 -114 133 -52 13 -70 57 -142 -199
6402 -199 -12 -82 213 -173 -59 302 152 200 29 177 -29 205 208 -280 14 -249 257 -89 180 -113 -88 -57
6424 -57 185 98 -264 -207 24 -138 -47 286 110 76 -61 -91 -448 -155 100 -73 -160 205 -135 74 193 455
6446 455 -275 115 339 47 -88 -13 128 -22 115 -149 90 186 92 61 260 -342 -156 102 85 74 56 -34 332
6469 332 -47 8 -11 13 9 29 26 220 -199 -87 -1 6 237 -166 -109 -168 30 63 -39 115 389 52 57 -110 210
6494 210 -59 -164 -139 -20 -183 42 -87 111 33 26 -56 -136 -96 46 141 9 -433 -111 73 -2 -41 -67 -215 43
6518 43 51 -357 -15 -245 -125 -69 127 -59 51 -116 61 -122 142 40 -191 39 62 -350 -117 174 115 -28
6540 -28 -26 -310 -155 341 -135 -5 -62 -41 -263 118 56 -107 -183 127 -174 -184 -89 -25 -79 -49 6 189 107 -56 -486
$$ packed form
6379A16j75K35O3m8l43K06O0p3l40K22J19k84L76R2n6k84K47j85O5q3J27j99n7
6402a99J87p0K95l86J14L61j50M8j71J48k06K34Lm88K94k63N06l46K69k93K5L1
6424e7K42q7l62N7K31j62R1L33j76l4j37l0l57K93K55j73q7L65l40K09J19K62
6446D55p30L90K24k92j35P5J41j50J37k64K39R6r4l1J99o02J86K58j7j1j8r0L66
6469C32l79N5j9K4mK0lJ94m19J12Q6PK31m03N7n9J98L3j02J54K74l37Nj67L20
6494B10k69j05K5J19j63K25j29J98p8pq2q0M0J42R5j32m42L22J84p5l9k6j48K58
6518D3Qm08L42k30J20N6J96j86J10j67J77j83K64j02k31K30K3m12K33K91n9j43
6540b8Kk84J55M96m76J30n7K1k22L81o2j63p6L10l01j0R5O4n4L0N5J83q2j63m30
$$ plain form
6565 -486 42 169 -67 128 -116 -295 -201 -107 -139 179 7 -173 536 62 186 6 132 -236 -62 -130 -29
6586 -29 -118 -33 2 -15 -108 -13 295 44 -38 -240 35 -471 -71 75 69 -70 -88 139 78 180 -155 195 114 -65
6610 -65 142 -119 -106 118 123 -113 -144 -108 193 157 8 188 -280 -50 -138 -75 -317 -235 95 -114 103 -51 25 -249
6634 -249 -165 145 235 168 -18 84 -1 -339 90 91 9 -24 -117 -61 17 -82 -142 -89 164 -87 100 -87 -337 83 137
6659 137 63 -183 -194 -215 47 202 -76 84 9 -186 -78 49 -120 106 -59 95 -196 -109 -25 66 -261 136
6681 136 -34 208 80 -207 181 75 -5 324 156 -109 4 -49 -24 -216 18 191 -351 222 -78 49 -88
6702 -88 -145 84 63 83 65 -14 -48 -142 -221 352 -67 36 -82 -45 -78 158 -2 149 45 -53 142 149 186 191 25 62
6728 62 272 103 -26 -29 13 172 70 424 -103 -246 125 -28 -126 119 220 139 -305 -127 272 -203 15 -126
$$ packed form
6565d86N28J27k36J95k44j79R4R4l2L18j72j80P09m74J24j80J26l68J74o8J01
6586b9q9Q5L5j7r3R5L08k51q2k02K75n06M00J46oj39j8K27o1J02l35L50q1j79
6610f5K07k61J3K24Nk36l1L6L01l6j49J80m68K30q8O3k42Q2L30k09K17j54P6k74
6634b49Q4L10R0o7j86J02q5l38M29Jq2l3r3N6P8r9o0N3K53k51J87j87k50M20N4
6659A37p4k46j1k1K62J55k78J60p5j95J08J27j69K26j65J54k91Q7Q4R1l27L97
6681A36j70K42j28k87L88j06q0L29j68k65J13n3K5j92K34J73n42N73l00J27j37
6702h8n7K29k1K0j8p9l4r4p9N73m19J03j18L7l3K36j60J51j04r8J95PL7Nj66L7
6728F2K10j69j29lM2J59j02L54n27j43L71j53r8K45J01q1m44J78L99m75K18j41
$$ plain form
6750 -126 145 211 187 -83 -18 69 -105 -175 -124 36 -22 8 14 -136 -145 62 -150 -49 -127 103 178 179 107 -156 -69 -131
6776 -131 151 71 145 233 -257 56 165 -91 6 235 -96 106 -44 2 30 68 -67 95 159 -41 -54 63 34
6799 34 -105 23 24 -2 -131 -216 -24 3 -25 30 70 64 -53 184 -140 97 -107 -35 24 -224 -110 240 -96 -50 -163
6824 -163 0 30 30 61 -16 -211 143 32 -329 -142 -121 -94 -93 -62 15 119 70 263 -144 338 32 -259 -210 -272 -18
6849 -18 182 -135 22 21 -82 15 104 126 -31 -207 59 154 153 180 148 -102 2 -93 -107 221 42 -113 -9 -206
6873 -206 248 -70 107 112 -228 53 90 -225 60 -201 -76 -61 224 -229 33 95 14 -161 121 -261 -182 139
6895 139 340 347 163 -183 -129 -65 -35 68 52 -40 -354 -228 -180 -154 228 -75 -36 -128 18 -32 7 109 185 -169 236
6920 236 -319 36 118 -169 156 -243 -32 -74 60 -431 -109 -376 171 93 69 68 -250 -222 -57 -84 288 -100 33
$$ packed form
6750a26K71O6k4k70O5Q7j74p0N1J60n8L0Oj50rK07k12J01p8K30P5Jp2k63Q7o2
6776a31K82q0P4Q8m90L13J09k56R7K29l31K02j50M6K8L8j35J62O4k00j3J17k9
6799C4j39J28Jk6j29q5J92K7k8N5M0oj17K37l24K37k04P2N9k48J14L50l36M6j13
6824a63J63L0%L1p7j95L54j11l61J87K1K7JL1P7J04m9J93m07M82l06k91M9o2K54
6849a8K00l17J57jj03R7Q9K2j57j76K66R5jK7l2k50J04r5j4L28j79j55J04j97
6873b06M54l18J77Nl40K81L7l15K85k61J25J5K85m53K62O2q1j75K82l82P9L21
6895A39K01Pj84l46N4O4L0J03j6r2l14J26M8K6L82l03L9r2J46n0L9J02P6l54M05
6920B36n55L55Q2k87L25l99K11m2J34m91L22k67N47p8k4jl18K8J65k7L72l88J33
$$ plain form
6943 33 -15 187 -50 86 -96 11 46 -3 25 -30 -175 -4 14 -174 -50 -143 -327 68 -92 -28 -163 107 48
6966 48 -135 234 51 74 -30 -37 182 -104 103 -136 155 379 -222 -180 144 85 93 -278 86 -58 59 -14 62
6989 62 2 -57 291 122 45 3 -105 72 -142 -53 13 -189 -143 -118 62 151 398 -141 -31 -51 8 -122 -160 72
7013 72 8 -143 74 -162 179 229 12 173 -25 197 -197 -129 -104 -210 111 -31 44 349 -286 -83 -20 64 -139
7036 -139 195 111 86 259 2 58 -17 -10 -147 85 -37 -36 35 93 52 10 147 45 408 -184 -10 355 37 145
7060 145 -87 -156 -57 44 -140 85 -100 129 -46 154 -7 -22 39 -199 -204 -85 -179 -137 92 256 49 -37 50
7083 50 -127 133 298 207 219 -348 -225 203 -43 52 -26 -15 -324 -83 278 165 -19 -209 428 -39 -70 190
7105 190 -56 -77 -191 209 -167 -131 -45 57 -94 -89 304 25 -50 -307 -18 -91 194 -162 15 277 -65 409
$$ packed form
6943C3m8K02k37J36j82J07L5m9K8n5j45J71J8j88J24r3j84L95j60O4j35K70n9
6966D8j83L69j83K3j04pK19k86K07k39K91K24o01M2L24n9Ql71L64j44J17p3P6
6989F2o0n9L48j69p7m2j08J77k14Q9O6k02M6K5J80Q9K47n39J10k0N9j30l8K32
7013G2o4j51K17k36L41N0k17J61j98K22l94O8K5j06L21j42P5L05o35K03O3Q4k03
7036a39L34q4k5J73k57N6p5Pj37K32j22JP1N8m1m2J37j02L63n92J74L65l18J08
7060A45k32o9R9J01j84K25j85K29j75K00j61j5O1k38nJ19r4M2K29J64k07q6Q7
7083E0j77K60J65r1J2n67J23M28k46R5p8J1l09K41L61j13j84j90O37m67l1K60
7105A90k46k1j14M00l76L6Q6J02j51NL93k79p5k57K89p3K85l56J77K62l42M74
$$ plain form
7127 409 -85 58 267 64 -77 22 211 -78 -107 -35 -160 273 -87 14 3 47 89 -209 68 -189 -243 134
7149 134 55 -1 32 331 54 -207 110 111 -15 81 -70 -13 75 35 -30 8 244 -117 -51 49 -192 292 -208 6
7173 6 71 117 -179 -101 27 135 -144 9 108 -331 -108 -324 -21 -172 -163 -300 106 -130 -198 46 116 334 -65
7196 -65 335 -189 96 -109 78 -120 -171 -302 -65 -44 -211 205 -166 -349 -87 223 -169 -137 -53 -171 -65 -319
7218 -319 -73 -170 -97 297 -25 84 231 -363 -80 174 -234 231 -21 -209 -243 -121 4 -178 11 49 -253
7239 -253 82 -1 84 158 -87 69 -104 24 76 72 -131 -212 122 -497 -19 -228 65 34 -88 6 -55 -262 -81
7262 -81 37 274 161 -23 15 -162 182 79 17 -47 -173 71 60 136 7 -113 141 109 97 -301 112 -90 104
7285 104 339 -41 -62 -401 35 -185 159 -83 -81 -109 104 102 -160 -225 78 61 150 -76 25 163 -39 -216 90
$$ packed form
7127D09m94J43K09k03j41R9J89k89k9P2j25M33l60J01j1M4M2k98K77k57n4L77
7149A34p9n6L3K99k77k61L17Jj26R6j51N7Q8m0o5L8K36l61O6J00k41M84n00K14
7173FO5M6k96P8J28J08k79J53R9m39K23k16L03j51Rj37M06k36o8K44P0K18l99
7196f5M00n24K85k05J87j98n1j31K37K1j67M16l71j83K62L10l92L2Q4j18J06k54
7218c19K46r7P3L94l22J09J47n94K83K54m08M65k52j88l4J22J25j82J89L8l02
7239b53L35q3Q5P4k45J56j73J28N2mk03q1L34o19M78k09K93l1j22R4o1k07J81
7262h1J18K37j13j84L8j77L44j03o2o4j26K44j1P6j29j20K54l2j2l98M13k02J94
7285A04K35l80k1l39M36k20L44k42Kk8K13kk62o5L03j7Q9k26J01J38k02j77L06
$$ plain form
7308 90 -190 -45 -93 15 -81 12 227 197 -110 220 -387 -76 -312 -279 230 -5 49 68 -85 26 -11 -56 -234
7331 -234 203 -173 -11 186 -2 32 -65 -142 290 215 -34 -235 187 151 182 239 -120 120 48 3 6 -371 62 -64
7355 -64 -36 -164 -47 11 48 143 48 -231 81 22 -416 6 -355 44 426 293 278 177 -116 51 -163 -79 10
7378 10 318 19 -230 -167 -91 35 -39 58 -19 -162 244 -168 374 -108 -11 -60 -229 359 -252 100 354 217 65
7401 65 -46 -228 -239 24 23 82 97 239 15 -149 12 12 -138 -182 -26 59 324 -376 -137 374 -166 -80 133 -133
7425 -133 -298 -86 132 -330 40 122 0 -54 131 -373 -113 175 45 20 373 -35 -108 -249 129 4 -84 -95
7447 -95 64 19 -139 -96 -139 -65 100 365 44 237 -61 -181 -242 20 31 104 68 13 -54 -4 170 -79 -84 17 397
7472 397 -14 -127 41 -242 -84 38 -271 -43 52 -117 138 -166 40 -242 97 -187 -313 -121 101 -144
$$ packed form
7308I0k80J45m8J08r6R3K15l0l07L30o07L11k36L3N09k35N4J9j53J11l7m5j78
7331b34M37l76J62J97j88L4r7p7M32p5k49k01M22l6L1N7l59K40p2m5Ll77M33j26
7355f4K8j28J17N8L7R5r5k79L12n9m38M22l61L99L82j33j5j01k93J67k14Q4Q9
7378A0L08k99k49O3P6J26p4R7p7j43M06m12N42m82R7m9j69N88o11L52K54j37j52
7401F5j11j82j1K63jN9J5J42k24j64J61%j50m4J56Q5K65p00K39N11n40Q6K13k66
7425a33j65K12K18m62L70Q2j22n4J85n04K60K88j30k5L53m08p3j41L78j25q8j1
7447i5J59m5j58M3m3P4J65K65l21J93k98j20o1K62J1P3l6n5o7N0J74k49nJ01L80
7472C97m11j13J68k83J58J22l09K28R5j69K55l04K06k82L39k84j26J92K22k45
$$ plain form
7492 -144 208 36 19 90 110 -229 -164 -166 -425 -42 -198 147 296 89 119 155 101 174 209 19 283 -21 -223 -113
7516 -113 29 -82 31 149 118 -150 16 -111 94 177 -98 132 -133 -13 92 131 -102 162 -61 -25 -137
7537 -137 178 -15 28 -38 -93 -192 -23 -122 -280 -207 -456 271 369 -261 -79 -117 210 121 95 -42 -271 -11 258
7560 258 -187 0 -168 -170 196 351 51 -45 156 5 -228 -344 -18 9 78 -227 -103 68 262 -34 64 -95
7582 -95 100 -11 12 207 110 -21 -53 -59 -266 -186 206 -207 525 -26 161 -75 178 80 24 -85 105 -135 -132 40
7606 40 60 253 39 298 40 -102 -48 -88 140 -225 5 38 93 -211 -119 -169 -39 20 28 303 115 -3 -168 253
7630 253 -110 164 -133 96 -13 138 -187 244 74 -119 -31 218 -76 112 197 -463 223 -96 -70 159 158 72
7652 72 -230 21 32 263 -24 -222 -10 -15 -18 -204 -100 241 123 119 203 229 60 -74 -89 58 74 114 -78 -93 -181
$$ packed form
7492a44L52j72j7P1K0l39O5kk59L83j56L45J49k07L0L6n4P3L5j90K64l04k02J10
7516a13J42j11J13J18l1k68J66j27K05Q3k75K30k65J20J05L9k33K64k23L6j12
7537a37L15j93M3o6n5r9J69r9j58P3k49P27R8o30J82l8L27q9k6j37k29K60K69
7560B58m45J87j68kL66J55l00r6K01j51k33j16L26K7O9l05J24J71J94k96R8j59
7582i5J95j11K3J95r7j31l2ok07Q0L92m13P32n51J87k36K53r8n6j09J90k40LJ72
7606D0K0J93k14K59k58j42N4m0K28l65K30L3N5l04R2n0J30N9QK75j88j18j65M21
7630B53l63K74k97K29j09J51l25M31j70j93Q8K49k94J88Q5o60O86l19K6K29jq6
7652G2l02K51J1K31k87j98K12nlj86J04L41j18mQ4K6j69j34j5J47J6M0j92j5q8
$$ plain form
7677 -181 -73 -84 -4 -133 118 -107 -199 -171 27 -47 51 39 47 -131 -169 221 6 43 169 55 -35 183 -224 153
7701 153 -127 -108 215 -52 -115 -70 -202 206 3 246 -222 -28 108 -91 -405 55 -157 75 -112 39 -39
7722 -39 21 -130 -52 -21 -285 138 73 14 157 -155 -123 -43 77 -20 -30 93 -44 68 132 -120 -327 46 -336 14
7746 14 -19 -132 -315 283 10 21 11 28 126 24 274 131 292 -148 292 -32 108 34 148 204 -275 119 -472
7769 -472 -166 72 77 -382 -208 -37 -185 -57 59 -282 198 224 -141 -249 -265 -245 174 309 32 93 -182 159
7791 159 -29 -33 -63 194 -18 -23 -172 47 -67 -5 -33 -57 -98 -17 21 -80 48 -38 72 -60 -204 -20 -408 -41
7815 -41 330 168 222 -16 82 -37 130 -37 -368 -158 237 -45 153 38 -97 27 -226 -87 105 193 -129
7836 -129 -26 -57 204 212 17 70 7 -6 43 -247 -177 234 -317 46 14 -236 283 76 23 -43 443 30 -3 9
$$ packed form
7677a81J08j1Q0j29K51k25r2K8J98p4R8j2Qj78l8L90k15L7J26j14r0K18m07L77
7701A53k80J9L23k67o3M5j32M08k03K43m68J94J36j99l14M60k12K32j87J51p8
7722c9O0j51P8L1k64M23o5n9J43l12L2Q0J20r7j0J23j37J12O4k52k07L73l82L50
7746A4l3j13j83N98k73J1j0J7R8j02K50j43J61m40M40l24J40p4J14N6m79L94n91
7769d72L06K38Nm59J74J71j48J28J16l41M80K6l65j08j6K0M19J35k77O1k75L41
7791A59j88ml0K57k12nj49K19j14O2k8k4m1Q1L8j01J28q6J10j32j44J84l88L67
7815d1L71j62N4k38R8j19J67j67l31K10L95k82J98j15j35J24k53J39J92Q8l22
7836a29J03l1K61Qj95N3o3j3M9k90P0M11n51L63l2k50N19k07n3o6M86m13l3J2
$$ plain form
7860 9 18 -278 -84 -11 35 132 -10 39 -19 -85 188 -170 124 73 92 -332 -260 94 -59 -243 -57 -40 -28 -12 202
7885 202 -382 49 -45 -38 372 -122 -86 -32 -68 -29 148 -123 169 -92 80 -127 0 52 -87 220 42 -299 -146
7908 -146 56 -247 174 -432 -117 95 -377 -233 -410 -87 -443 -73 -209 -106 -399 -216 318 -132 -38 -100 403
7929 403 -21 132 -80 29 104 189 240 36 115 -53 -197 43 -8 -39 250 211 -247 149 -49 -88 86 218 284
7952 284 159 -126 258 -1 39 -135 94 -61 -30 350 271 109 147 170 8 3 -148 -17 193 -8 -66 21 106
7975 106 34 39 19 169 116 72 -24 -339 -47 -52 213 345 -75 -221 -56 -190 209 -60 101 230 -52 -139 -110 37
7999 37 -91 -45 63 163 63 33 381 171 73 -50 -275 83 -86 101 -262 68 -195 -322 68 267 -73
8020 -73 82 -6 144 -184 116 -27 179 113 -42 288 49 -63 177 37 -277 -334 286 59 230 -189 -27
$$ packed form
7860IRk96J94P3M6R7j42M9n8o6K73l58K94n1J9m24P2L54j53j84J86J7J2J6K14
7885B02n84M31r4PM10m94L6N4l6L9J77k71K92k61J72k07J27N2j39L07j78l41J53
7908a46K02l03M21o06L15K12m72J44j77L23l56L70j36J03k93J83N34m50R4o2N03
7929D03m24J53k12J09P5Q5N1k04P9j68j44K40n1l1K89l9m58L96j98l9J74J32O6
7952B84j25k85L84k59M0j74K29j55L1L80p9j62L8K3j62nj51J31K10k01n8Q7Q5
7975A06p2Nk0J50n3m4r6l15K92nK65J32m20j46J65j34L99k69J61J29k82q7K9J47
7999C7j28M6J08J00j00l0L48k10r8j23k25L58j69J87l63L30k63j27L90J99l40
8020g3J55q8J50l28L00j43K06o6j55L30k39j12K40j40l14n7O20k27J71m19J62
$$ plain form
8041 -27 -1 -29 -103 -91 127 -3 -26 117 141 361 97 -66 -289 -94 -73 -95 -15 -134 -243 44 0 -9 105 -142
8065 -142 -37 -45 124 -70 -45 -36 3 -58 98 54 -58 173 92 -109 17 -153 40 174 -156 19 -180 -19 84
8088 84 -239 186 -9 19 -26 -64 114 -258 52 13 9 -30 44 -119 -29 -95 306 -168 110 -129 -73 -119 -384 75
8112 75 -9 372 158 -179 45 -198 124 387 -154 234 -257 -361 -198 191 -19 82 -174 -246 123 187 -93
8133 -93 -145 135 -146 187 355 -93 -113 379 288 144 -204 -163 -500 17 102 -216 -19 -270 316 -18 -195 185
8155 185 11 -29 104 -41 -257 179 -86 -152 -13 -151 142 -116 9 -142 23 116 173 -53 -360 -54 8 -102
8177 -102 256 -204 96 52 -117 102 199 -86 47 -30 -114 139 -196 75
$$ packed form
8041b7K6k8p4J2K18j30k3J43K4K20k64j63k23J95K1k2Q0j19j09K87m4rJ14k47
8065a42J05qJ69j94K5RL9o1J56m4j12K31q1k01J26j70J93J34l30J75j99J61J03
8088H4l23M25j95K8m5l8J78l72L10l9ml9P4j63R0o6M01m74K78k39N6m6k65M59
8112G5q4L81k14l37K24k43L22K63n41L88m91j04J63L89k10J01k56p2L69O4k80
8133i3n2K80k81L33J68m48k0M92r1j44l48M1l37N17Q5l18J97k51N86l34j77L80
8155A85j74m0J33j45k16M36k65o6J39j38K93k58J25j51J65R3N7k26l07L06O2j10
8177a02L58m60L00m4j69K19R7k85J33p7q4K53l35K71
8191G5
$$ Imaginary data points
##PAGE= N=2
##DATA TABLE= (X++(I..I)), XYDATA
$$ plain form
0 0 0 0 0 0 0 0 0 0 0 -1 8 -8 8 -8 9 -16 16 -17 24 -25 31 -33 41 -47 54 -61 69 -79 90 -101 114 -128 145
33 145 -161 179 -200 222 -245 273 -302 335 -370 410 -455 503 -558 620 -693 773 -867 980 -1115
52 -1115 1281 -1490 1766 -2144 2697 -3587 5253 -9446 41050 60047 -8085 27459 10738 -15672
66 -15672 -14066 -2089 -6248 -32790 -15675 15751 -23858 -200 38459 3724 2039 17714 5234
79 5234 -358 -15474 -8772 -18999 -39168 868 6712 -15896 13560 11860 1344 12787 8078
92 8078 12557 -1996 -14860 2103 -20042 -17919 13521 -4889 -4879 8809 3395 14129 8013 8672
106 8672 8309 -18588 -1704 6660 -19332 1033 7440 -9545 213 3626 11137 6058 -3700 12801
120 12801 -10072 -20486 15981 -974 -15987 5765 1081 -2690 2253 11619 12365 -14590 350
$$ packed form
0@%%%%%%%%%jRj6J6j6J7k5L2l3M1m9N6o4P4q8J01j15J30j48J69j91K15k42K73
33A45l06L40l79M22m67N18n75O37p05P80q65R58j061J178j313J466j640J847k095
52a115K396k771L256l910M841o284Q840j4699N0496J8997o8132L5544j6721k6410
66a5672J606J1977m159k6542J7115L1426l9609K3658L8659l4735j685J5675j2480
79E234n592j5116O702j0227k0169M0036N844k2608K9456j700j0516J1443m709
92H078M479j4553j2864J6963k2145K123L1440j8410J0J3688n414J0734o116O59
106H672l63k6897J6884Q364k5992K0365O407j6985R758L413P511n079r758J6501
120A2801k2873j0414L6467j6955j5013K1752m684l771M943R366P46k6955J4940
$$ plain form
133 350 11331 -23036 -4946 15288 -11579 -8252 4206 7116 5014 1835 18353 -720 -19615
146 -19615 12754 2262 -20059 1636 -848 -9443 -3592 5151 15298 -859 3086 17417 -11236
159 -11236 -6355 13479 -7937 -11535 -5948 -5942 -622 -3648 10465 10350 -8207 10944 11109 -8297 5704
174 5704 2046 -9175 -7850 -9331 1968 -1109 -3926 11983 -2795 -4172 16745 3681 -1593 2780
188 2780 -5191 -3590 -6601 -343 4425 -10800 2555 7984 -10347 6461 11891 -2853 -1030 -2054
202 -2054 379 -1705 -3701 8820 -5090 -11800 11971 1074 -6477 8132 1604 -4134 -4322 1165
216 1165 5878 -7791 1942 9815 -11858 -584 13565 -2241 -2896 -338 -1245 -3576 -6471 7986
230 7986 590 -11393 8852 5094 -6384 7977 6711 -1308 -4355 -4165 2471 -6619 -4689 7667
$$ packed form
133C50J0981l4367J8090K0234k6867L327J2458K910k102l179J6518j9073j8895
146a9615L2369j0492k2321K1695k484q595N851Q743J0147j6157L945J4331k8653
159a1236M881J9834k1416l598N587ON320l026J4113j15j8557J9151J65j9406J4001
174E704l658j1221J325j481J1299l077k817J5909j4778j377K0917j3064n274M373
188B780p971J601l011O258M768j5225J3355N429j8331J6808N430j4744J823j024
202b054K433k084j996J2521j3910o710K3771j0897p551J4609o528n738j88N487
216A165M713j3669R733P873k1673J1274J4149j5806o55K558r07k331k895J4457
230G986p396j1983K0245l758j1478J4361j266q019l047J90O636r090J930J2356
$$ plain form
244 7667 -8859 -5328 11485 2769 2542 5102 1979 1093 -5985 938 1874 -11709 -1199 601 -9781
259 -9781 3836 7372 2980 4127 768 4948 471 -2629 5508 -7568 -10508 2535 -4865 -3708
273 -3708 5034 2385 3219 662 4506 7224 -3885 2826 2597 -13513 -2841 2530 -5499 -848 485
288 485 2124 1146 866 11163 1415 -5751 6612 -3311 -9392 2299 -314 -2961 -4036 254 5331
303 5331 -2525 4814 10039 -7117 -2053 6021 -3671 -2910 -744 -757 -2906 -5385 5877 3669 -4640
318 -4640 7457 3050 -6651 2638 2691 -1131 -3210 -3553 1786 -3512 -1110 8778 -2860 -2209 6273 -1339
334 -1339 -951 1526 185 -559 -5655 -226 2104 -4335 4452 3618 -5640 2596 3693 72 834 -1898
350 -1898 49 -3428 -3408 4791 -2173 -3027 5858 -1984 -2163 4871 1746 842 -2327 -978 1022 -5528
$$ packed form
244G667j6526L531J6813q716k27K560l123q86p078O923R36j3583J0510J800j0382
259i781J3617L536m392J147l359M180m477l100Q137j3076k940J3043p400J157
273c708Q742k649Q34k557L844K718j1109O711k29j6110J0672N371q029M651J333
288D85J639r78k80J0297r748p166J2363r923o081J1691k613k647j075M290N077
303E331p856P339N225j7156N064Q074r692P61K166j3k149k479J1262k208q309
318d640J2097m407r701R289N3l822k079l43N339n298K402R888j1638O51Q482p612
334a339L88K477j341p44n096N429K330o439Q787q34r258Q236J097l621P62k732
350a898J947l477K0Q199o964q54Q885p842j79P034l125r04l169J349K000o550
$$ plain form
366 -5528 2349 3887 -7202 339 4256 -1749 1782 2580 2104 -1477 -3295 4311 -1559 -4818 5308
381 5308 -1902 -6668 2664 2287 605 -524 1061 2937 -4161 1000 6046 -5150 -2515 3395 -3885
396 -3885 -1876 1194 2270 -150 -3631 3480 1581 -3933 5310 1835 -5976 563 967 -516 -782 -994
412 -994 2577 -3165 -1695 5859 -1247 -882 4487 -1966 -1952 848 903 686 -4157 -410 760 -4004 3347
429 3347 3053 -4019 1280 1909 -916 1103 191 1830 -1728 -3481 2740 -2143 -1738 5009 -1599 -2749
445 -2749 2779 1061 1383 -656 481 799 -4712 1309 2904 -4851 535 2427 -2602 55 1690 2877
461 2877 -110 -2571 2862 -1168 -3850 4408 -502 -4769 960 980 275 -6 1516 2946 -3333 -249
477 -249 4433 -3614 -1011 2707 -2807 -2341 405 2459 1304 -2501 2878 1220 -3649 3837 1827 -3752
$$ packed form
366e528P877J538j1089P541L917o005L531P98m76l581j818P606n870l259J0126
381E308p210m766R332l77j682j129J585J876p098N161N046j1196K635N910p280
396c885K009L070J076k420l481P111j899n514R243l475p811O539M04j483k66k12
412i94L571n742J470P554p106L65N369o453J4K800N5k17m843L747J170m764P351
429C347k94p072N299O29k825K019r12J639l558j753O221m883M05O747o608j150
445b749N528j718L22k039J137L18n511O021J595p755N386J892n029K657J635J187
461B877k987k461N433m030k682Q258m910m267N729K0p05k81J522J430o279L084
477b49M682q047K603L718n514M66K746K054j155l805N379j658m869P486k010n579
$$ plain form
493 -3752 -301 -163 -1086 -1284 -376 3038 -1601 -1557 4033 -786 -536 3838 -1649 -2638 -476 -152 427 -2347
511 -2347 502 1316 -3199 2172 2880 -1872 1917 1215 -1453 -512 -724 1502 -878 -2706 2147 -1467
527 -1467 -1450 4288 -295 -1643 1542 42 362 -834 988 1548 -3767 456 2096 -3116 830 2545
543 2545 -1671 -509 531 1934 225 -2028 2597 -778 -3492 2906 317 -2697 852 197 -549 -1067
559 -1067 901 3089 -2031 -585 3129 -2305 -371 2831 -1339 -1739 -616 1001 354 -2060 2218 1099
575 1099 -2932 1862 1558 -1708 1123 203 -880 -1564 -1051 2184 -1416 -1864 2170 -1162 -449 3005 21
592 21 83 328 -68 253 -1758 785 972 -2913 657 1079 -1628 1663 1892 -639 -86 173 1393 -291
610 -291 -1467 1337 -2149 -2072 2043 -309 -640 1566 269 80 -794 1025 1584 -2378 -312 527 -2734
$$ packed form
493c752L451J38r23j98R08L414m639M4N590m819K50M374n487r89K162L24N79k774
511b347K849Q14m515N371P08m752L789p02k668R41k12K226k380j828M853l614
527a467J7N738m583j348L185j500L20j196J822N60n315M223J640n212L946J715
543B545m216J162J040J403j709k253M625l375k714O398k589l014L549o55p46n18
559a067J968K188n120J446L714n434J934L202m170m00J123J617o47k414M278j119
575A099m031M794l04l266K831r20j083o84N13L235l600m48M034l332P13L454k984
592B1O2K45l96L21k011K543J87l885L570M22k707L291K29k531N53K59J220j684
610b91j176K804l486P7M115k352l31K206j297j89q74J819N59l962K066Q39l261
$$ plain form
627 -2734 515 1897 -927 -332 34 1792 412 -989 2074 -451 -2684 1638 -600 -2018 1054 732
643 732 69 -726 460 2649 -1014 -224 2051 -2200 -893 1221 -773 -769 -502 657 814 -972 2360
660 2360 1396 -2038 578 -56 -1952 146 -232 -1041 -801 -714 1901 539 -313 2453 -613 -521 1326 -880
678 -880 -671 -483 -864 -248 -1452 747 1590 -955 1903 1364 -1230 1316 690 -1277 -581 -1431 -277 -882
696 -882 -920 2081 -587 -618 2339 199 -118 1437 122 -578 -1660 -365 590 -2013 211 1183 -1506
713 -1506 644 2077 -174 383 355 514 -875 -1670 838 -392 -1985 957 184 -836 1528 915 495
730 495 -536 -11 1557 -1405 -432 1078 -1676 -632 938 -480 192 412 850 291 -1237 873 754
747 754 -1450 493 -80 -1472 556 17 237 -168 -349 1003 -249 -505 1671 -547 -950 628 -906
$$ packed form
627b734L249J382k824N95L66J758j380j401L063k525k233M322k238j418L072l22
643G32o63p95J186K189l663P90K275m251J307K114j994MK67J159J57j786L332
660B360r64l434K616o34j896K098l78q09K40Q7K615j362q52K766l066R2J847k206
678h80K09J88l81O16j204K199Q43k545K858n39k594K546o26j967O96q50J154o05
696h82l8L001k668l1K957k140l17J555j315p00j082J295R55k603K224R72k689
713a506K150J433k251N57k8J59j389p95K508j230j593K942p73j020K364o13m20
730D95j031N25J568k962R73J510k754J044J570j418O72K20M38n59j528K110j19
747G54k204J943n73j392K028n39K20m05j81J352j252k56K176k218m03J578j534
$$ plain form
764 -906 -50 407 -194 152 -934 422 825 -1133 633 404 -1175 386 405 -320 170 39 617 -255 -652
783 -652 1270 -359 -663 794 -720 -529 813 395 322 -839 322 883 -1359 655 893 -1487 -198
800 -198 213 -661 69 492 695 -115 -1052 1544 601 -1171 797 -6 -1341 5 -70 -105 -493 14 1048
819 1048 -913 -130 1787 -721 -206 428 -385 -218 11 -51 227 -1112 814 1080 -892 1221 604 -1005
837 -1005 98 -105 -257 -130 -309 678 -151 -442 1205 -237 -91 675 -504 -287 78 -130 -435 -487 90
856 90 533 -716 716 617 -624 333 135 -329 -193 -33 461 -560 -680 1032 -522 -442 1348 10 -469
875 -469 521 263 -126 -1063 -90 380 -1680 -81 885 -716 517 862 -18 301 237 701 -468 -1475 468
894 468 -279 -1271 760 -129 -668 750 462 610 287 29 555 -1128 -212 832 -1008 -600 499 -358
$$ packed form
764i06Q56M57o01L46j086J356M03j958J766k29j579J561J9p25M90j31N78q72l97
783f52J922j629l04J457j514J91J342m18p3j161J161N61k242K014K38k380J289
800a98M11q74P30M23K03q10r37K596r43j772J968q03j335J346p5l5l88N07J034
819A048j961P83J917k508N15O34q13J67K29o2K78j339J926K66j972K113o17j609
837a005J103k03j52J27j79R87q29k91J647j442J46P66j179K17L65k08l05n2N77
856I0M43j249J432r9j241R57j98m64J36J60M94j021j20J712j554Q0J790j338m79
875d69R90k58l89r37R73M70k060J599R66j601J233L45q80L19o4M64j169j007J943
894D68p47r92K031q89n39J418k88J48l23k58N26j683R16J044j840M08J099q57
$$ plain form
912 -358 -286 439 868 478 -459 990 102 -897 567 -320 -926 108 -217 -54 145 484 895 232 -233 933
932 933 -388 -257 96 -706 -497 -164 -390 101 -368 541 608 -723 701 552 -938 2 -78 -526 -348 -338
952 -338 576 -668 -652 1187 86 -198 962 147 -143 154 -222 -430 -502 -7 943 -903 21 644 -553
971 -553 23 525 -10 -279 -582 333 -102 -669 804 117 -544 889 298 -157 165 -41 148 -364 -221 406
991 406 -824 -369 664 -173 106 577 65 97 -427 286 103 -548 122 396 -615 324 116 -441 568
1010 568 -354 125 -284 -177 421 -224 -351 287 -91 -149 176 46 -3 -202 -9 132 -440 211 313 -441 102
1031 102 301 -225 23 75 -639 -283 -153 189 -201 -357 376 -205 -464 464 -68 -135 41 -288 164 -550 217
1052 217 769 -707 -60 793 -541 105 464 -255 119 43 184 -20 -744 378 -277 -588 264 27 -65 156
$$ packed form
912c58P2P25M29l90r37J449q88r99J464q87o06J034l25J63J99L39M11o63m65J166
932I33j321J31L53q02K09L33k26M91m69R09O7j331J424j49j490R40q0m48J78J0
952c38R14j244J6J839j101k84J160q15k90K97l76k08p2M95R50j846R24O23j197
971e53N76N02n35k69l03R15m35n67J473o87o61J433n91m55L22k06J89n12J43O27
991D06j230M55J033q37K79M71n12L2n24P13j83o51O70K74j011R39k08n57J009
1010E68r22M79m09J07N98o45j27O38l78n8L25j30m9j99J93J41n72O51J02p54N43
1031A02J99n26K48N2p14L56J30L42l90j56P33n81k59R28n32o7J76l29M52p14P67
1052B17N52j476O47Q53j334O46L59p19L74p6J41k04p24J122o55l11Q52k37r2K21
$$ plain form
1072 156 -135 325 -190 137 575 -505 -351 533 -649 -43 414 -90 135 -100 289 34 -346 623 379
1091 379 -708 162 -210 -307 412 165 122 47 90 524 71 -84 780 -279 -701 -3 -395 -59 281 -156 99
1112 99 -188 536 411 -405 219 399 -234 360 195 -311 232 -213 81 40 -361 884 -36 -543 344 -58
1132 -58 -324 -42 -163 -38 -336 131 256 -277 -58 558 -189 -76 101 -89 9 -242 377 125 -348 300 64
1153 64 -241 381 21 12 40 -78 150 -77 -274 351 -300 -232 559 152 -208 202 -104 230 153 175 181 -342 79
1176 79 210 -271 253 84 -89 106 -59 332 -266 75 716 -273 -73 420 -292 -273 -47 -420 -7 -87 -53
1197 -53 -3 -227 263 145 -261 311 120 -236 -148 168 -316 -299 -44 197 147 -315 453 -99 -95 349 -271 -251 38
1220 38 143 -79 -293 156 203 -300 -47 126 -155 115 -96 -177 108 -60 61 -169 -181 257 216 -157 136 176
$$ packed form
1072A56k91M60n15L27M38j080J54Q84j182O06M57n04K25k35L89k55l80R69k44
1091C79j087Q70l72r7P19k47m3p5M3M34m53j55Q64j059m22O98l92L36L40m37K55
1112I9k87P24j25q16O24J80o33N94j65n06N43m45K94m1m01J245r20n07Q87m02
1132e8k66K82j21J25k98M67J25n33K19O16p47J13J77j90R8k51O19k52m73O48k36
1153F4l05O22l60rK8j18K28k27j97O25o51O8P91m07l60M10l06L34p7K2On23M21
1176G9J31m81N24j69j73J95j65L91n98L41O41r89K00M93p12J9K26l73M13q0L4
1197e3N0k24M90j18m06N72j91l56Q8L16m84J7K55K41n0m62P68n52MM44o20K0K89
1220C8J05k22k14M49M7n03K53J73k81K70k11q1K85j68J21k30j2M38m1l73K93M0
$$ plain form
1242 176 -208 -186 171 -56 -55 -41 106 -171 83 216 -287 102 169 -49 235 -51 -101 199 -353 187 -82 -447
1264 -447 -79 -10 -238 -19 162 -11 -38 -1 268 -240 -329 423 -283 25 -73 -362 -83 -165 101 -146 -381 -56
1286 -56 190 -202 -73 37 -310 -155 -136 193 -222 -140 203 -33 7 145 -93 -194 285 2 -322 -242 -77 -23
1308 -23 -177 -26 275 -156 11 393 -129 83 -91 -121 117 -508 174 5 -55 19 -49 -12 330 -139 -6 -22
1330 -22 171 236 -154 58 25 -282 -101 -92 -223 95 99 39 -196 -173 0 99 -357 -57 26 -248 -203 123 -43 137
1354 137 91 -9 197 15 -39 21 -320 128 -248 -188 -223 217 18 -51 100 52 40 -26 323 -480 225 80 -74
1377 -74 -265 507 -119 126 -116 -88 -148 -149 274 30 15 30 98 -142 -46 222 129 -252 -68 -65 -574 -104 69 -227
1401 -227 -155 265 -51 338 -91 81 -20 198 301 36 100 232 139 -74 -26 75 390 89 -10 -78 -84 262 81
$$ packed form
1242A76l84K2L57k27JJ4J47k77K54J33n03L89O7k18K84k86n0L00n52N40k69l65
1264d47L68O9k28K19J81j73k7L7K69n08q9P52p06L08r8k89K79q2K66k47k35L25
1286e6K46l92J29J10l47J55J9L29m15Q2L43k36M0J38k38j01M79k83l24Q0J65N4
1308b3j54J51L01m31J67L82n22K12j74l0K38o25O82j69o0P4o8L7L42m69J33j6
1330b2J93O5l90K12l3l07J81Rj31L18Mo0k35K3J73R9m56L00Q3k74M5L26j66J80
1354A37m6j00K06j82n4O0l41M48l76O0l5M40j99o9J51m8j2o6L49q03P05j45j54
1377g4j91P72o26K45k42K8o0jM23k44j5J5O8k40R6K68r3l81J84Ln09M70J73k96
1401b27P2M20l16L89m29J72j01K18J03k65O4J32r3k13M8J01L15l01r9o8oL46j81
$$ plain form
1424 81 43 -36 -101 -257 -128 -178 33 153 -236 156 -222 -320 -106 7 -45 178 -160 -151 183 26 53 -189 -364
1447 -364 163 -148 237 236 -25 188 -62 291 156 -99 69 -86 -202 -254 105 52 -61 -193 -26 -179 -143 -57
1469 -57 -258 64 91 -338 -458 -27 23 -283 -128 222 -74 -68 -129 -91 5 78 123 -76 -12 279 -64 241 -6 7
1493 7 -112 -171 -68 205 244 -191 -329 -164 -115 51 12 -123 120 -154 407 176 -219 0 53 246 -43 -18 -128
1516 -128 -19 -121 216 -183 -109 106 -193 -175 -136 102 -47 2 -408 -208 82 -449 14 -96 -64 241 93 -77
1538 -77 170 165 154 -18 19 271 -382 -369 -207 52 275 179 -76 79 189 -90 122 112 97 11 238 -1 -43 -140
1562 -140 153 -176 425 293 -31 -177 228 193 24 -91 -142 22 -79 146 -225 101 -12 31 -117 260 7
1583 7 -29 98 -119 -116 192 -44 91 154 221 -3 -12 119 263 169 128 38 -158 -88 185 2 -41 -118 -10 -143 -20
$$ packed form
1424H1l8p9o5j56J29n0K11J20l89L92l78r8K14J13n2K23l38RL34j57K7k42j75
1447c64N27l11L85jk61K13k50L53j35k55J68j55j16n2L59n3j13j32J67j53L6Q6
1469e7k01L22K7m29j20M31N0l06J55L50k96Oo1L8R6P3M5j99O4K91l43L05k47J3
1493Gj19n9J03K73L9m35j38J65M9J66l9j35K43k74N61k31l95K19N3J93k89K5j10
1516a28J09j02L37l99P4K15k99J8L9K38j49M9m10K00K90n31M63j10L2L05j48j70
1538g7K47nj1j72L7K52o53J3J62K59K23r6k55J55J10k79K12j0j5q6K27k39m2r7
1562a40K93l29O01j32l24j46M05l5j69j15n1J64j01K25l71L26j13M3j48L77k53
1583Gl6J27k17LL08k36J35O3O7k24rJ31J44r4m1r0j96P0K73j83m3p7J08j33J23
$$ plain form
1608 -20 -13 10 35 -203 -24 -158 7 244 47 -57 -114 -182 -438 -64 211 -102 180 -3 293 54 -143 205
1630 205 -363 -224 -136 -135 -28 115 66 -83 -55 -138 164 -89 70 247 -247 -200 102 214 127 161 -19 244 162
1653 162 20 297 -191 111 -139 101 -13 -42 194 -294 -20 -145 221 -65 122 -240 -183 84 -147 141 -12
1674 -12 -49 84 -168 -153 -206 119 -160 -234 -37 44 213 -244 -45 -337 194 106 96 60 297 -44 107 -204 356
1697 356 64 -98 189 -115 92 135 170 -73 200 58 106 167 207 139 -143 -113 -76 -169 138 231 -48 39 -179 41
1721 41 -151 216 85 -166 -3 35 2 313 -268 -37 -85 64 -68 -87 56 -74 -139 -88 -65 -395 52 37 -156
1744 -156 -62 266 115 -274 99 -50 121 -142 63 14 -120 97 -57 -154 183 -25 16 -175 -60 -7 127 -157
1766 -157 -159 132 173 138 44 -351 4 -141 102 -321 -107 261 12 254 215 11 2 60 -35 -338 102 277 -148
$$ packed form
1608b0PK3K5k38J79j34J65K37j97j04n7o8k56L74K75l13K82j83K96k39j97L48
1630B05n68J39Q8JJ07J43m9j49K8q3L02k53J59J77m94M7L02J12q7L4j80K63q2
1653A62j42K77m88L02k50K40j14k9K36m88K74j25L66k86J87l62N7K67k31K88j53
1674a2l7J33k52J5n3L25k79p4J97Q1J69m57J99k92N31q8j0l6K37l41J51l11N60
1697C56k92j62K87l04K07M3L5k43K73j42M8O1M0o8k82L0L7r3L07R3k79Q7k18K20
1721D1j92L67j31k51J63L8l3L11n81K31m8J49j32j9J43j30o5N1K3l30M47j5j93
1744a56R4L28j51l89L73j49J71k63K05m9j34K17j54r7L37k08M1j91J15N3J34k84
1766a57kK91M1l5r4l95L55j45K43m23K14L68k49K42l9k04rN8r5l03M40J75m25
$$ plain form
1789 -148 19 -367 134 38 224 -282 228 -179 11 209 -192 15 77 -76 250 -1 -111 66 138 54 97 333
1811 333 -58 -109 73 224 -20 162 399 -124 -126 -130 -179 -126 130 -111 174 -181 -265 122 31 -79 258 -43 323
1834 323 55 5 -45 -282 79 138 -16 241 -3 -10 -276 141 123 -147 -244 43 147 -85 -5 -37 46 -41 -82 -226
1858 -226 -64 -124 125 -58 -2 -110 53 138 -208 29 21 -97 44 114 50 368 163 -104 31 394 -163 10
1880 10 5 152 -131 145 26 -20 69 34 70 65 85 -45 -104 142 -20 15 -139 -74 -139 -192 251 -143 -47 126 72 -40
1906 -40 392 86 -60 -51 -204 7 -175 267 182 -294 -21 5 309 -184 -30 -55 113 -259 -30 -54 -29 -60 -66 -8
1930 -8 61 146 -1 -53 154 -26 250 -39 216 12 188 70 32 -41 -37 135 -341 -21 212 -10 -450 78 -30
1953 -30 -213 140 -13 -187 84 -94 224 97 -18 23 185 -80 134 260 -74 -2 -207 -82 -157 -125 -195 23
$$ packed form
1789a48J67l86N01r6J86n06N10m07J90J98m01K07O2j53L26k51j10J77P2q4M3K36
1811C33l91n1J82J51k44J82K37n23kmm9N3K56k41K85l55q4L87r1j10L37l01L66
1834C23k68n0n0k37L61N9j54K57k44pk66M17j8k70r7K87J04k32Q0l2Q3q7m1j44
1858b26J62o0K49j83N6j08J63Q5l46K37qj18J41P0o4L18k05k67J35L63n57J73
1880A0nJ47k83K76j19m6Q9l5L6nK0j30n9K46j62L5j54O5o5n3M43l94R6J73n4j12
1906d0M32l06j46Rj53K11j82M42q5m76K73K6L04m93J54k5J68l72K29k4K5l1oN8
1930hO9Q5j47n2K07j80K76k89K55k04J76j18l8p3MJ72m76L20K33k22m40N28j08
1953c0j83L53j53j74K71j78L18j27j15M1J62k65K14J26l34P2k05J25p5L2p0K18
$$ plain form
1975 23 239 127 -27 15 -43 101 5 -138 -53 263 -75 216 51 -136 59 10 173 15 88 198 -276 62
1997 62 245 -159 -243 49 -81 -306 101 -48 22 55 10 -37 -11 76 58 222 -188 92 -173 40 26 252 -78
2020 -78 226 0 -87 87 143 -26 -238 64 74 -149 468 -111 4 123 -208 22 361 267 13 -266 216 40
2042 40 -2 115 108 369 -49 -105 -10 -132 -86 281 -243 -45 107 300 -141 183 -146 261 -27 65 -18 -140 167
2065 167 -407 -162 144 79 -163 -31 41 216 -218 4 161 -16 -166 112 -212 -273 -101 -117 42 160 339
2086 339 197 -246 -129 -101 -32 196 -3 16 31 -112 198 490 -213 208 145 -3 253 -76 18 -115 -81 -157 17
2109 17 -23 -23 -188 155 -83 69 64 123 -124 -223 -136 -10 93 15 -2 393 -70 -50 -94 22 143 -13 37 -82 131
2134 131 -6 -77 229 278 -36 11 -50 -66 132 -188 72 -37 -122 86 -73 -195 -47 16 187 161 -107 2 236
$$ packed form
1975B3K16j12j54M2n8J44r6j43Q5L16l38K91j65j87J95m9J63j58P3J10m74L38
1997F2J83m04q4K92j30k25M07j49P0L3m5m7K6Q7j8J64m10K80k65K13j4K26l30
2020g8L04k26q7J74N6j69k12L02J0k23O17n79J15J19l31K30L39r4k54k79M82j76
2042D0m2J17pK61m18n6R5j22M6L67n24J98J52J93m41L24l29M07k88R2q3j22L07
2065A67n74K45L06o5k42J32P2J75m34K22J57j77j50K78l24o1J72j6J59J18J79
2086C39j42m43J17K8O9K28j99J9J5j43L10K92p03M21o3j48K56l29R4j33L4p6J74
2109A7m0%j65L43k38J52nN9k47r9Q7J26J03p8j7L95m63K0m4J16J21j56N0j19K13
2134A31j37p1L06M9l14M7o1j6J98l20K60j09q5K08j59j22J48O3J71k6k68J09K34
$$ plain form
2157 236 291 28 30 71 111 17 -181 -60 40 205 143 84 -119 -162 5 73 38 -187 -337 -69 6 -163 225 -79
2181 -79 409 11 145 43 169 -40 236 22 30 -222 187 92 173 393 217 -156 -251 126 68 362 -12 -65 231
2204 231 -9 313 -243 140 201 340 -161 62 -94 157 -231 -159 186 200 201 -76 184 178 -147 75 -37 -21 162
2227 162 173 383 -187 188 -261 -176 92 101 -248 80 149 34 79 -244 64 -84 197 -83 -83 -60 -66 -98 -29 -5 -320
2252 -320 -136 -364 34 -101 -327 95 -30 -210 31 -66 -68 -66 201 128 -54 135 405 -127 -219 297 251 417 99
2275 99 109 119 7 -60 48 4 -318 -103 -51 43 27 82 -124 192 -38 206 -101 65 -106 73 205 30 277
2298 277 -100 138 81 121 19 -73 177 -28 -9 147 242 87 -86 -97 50 -54 -195 -28 -175 -155 -90 74 58
2321 58 191 51 87 -100 -171 102 150 158 -84 105 50 285 224 196 -50 132 -77 110 158 -5 48 115 18 -42 -210
$$ packed form
2157B36N5k63KM1M0r4j98J21J00J65o2n9k03m3J67O8l5k25j50K68P5j69L88l04
2181g9M88l98J34j02J26k09K76k14Qk52M09r5Q1K20j76l73r5L77n8K94l74n3K96
2204B31k40L22n56L83O1J39n01K23j56K51l88P2L45J4Jk77K60ol25K22j12J6J83
2227A62J1K10n70L75m49Q5K68Rl49L28O9j15M5l23L08j48K81k80%K3ol2O9K4l15
2252c20J84k28L98j35k26M22j25j80K41r7kKK67p3j82J89K70n32r2N16m6J66l18
2275I9J0J0j12o7J08m4l22K15N2R4j6N5k06L16k30K44l07J66j71J79J32j75K47
2298B77l77K38n7M0j02r2K50k05J9J56R5j55j73j1J47j04j41J67j47K0O5J64j6
2321E8J33j40L6j87p1K73M8Qk42J89n5K35o1k8k46J82k09J87M8j63N3O7r7o0j68
$$ plain form
2346 -210 127 54 -20 250 168 114 184 16 154 -375 15 125 248 170 -54 -236 -36 -270 -81 -130 -142 153 -69
2369 -69 -89 -184 -26 -71 5 -58 -39 -83 235 -11 -84 -468 -32 -209 381 244 93 -358 -194 44 58 180 -33
2392 -33 135 -77 308 -71 16 -88 52 18 -38 -196 -80 335 -157 -95 168 167 155 51 -86 70 -39 -169 168
2415 168 -122 -9 -33 -105 43 -28 81 -20 78 210 -104 40 -26 -55 -225 -296 1 128 -299 136 3 29 99
2438 99 69 146 77 15 59 131 -23 -98 -69 -57 -277 -8 -117 8 122 -90 202 8 -229 16 17 150 -153 101
2462 101 -74 -157 7 -95 -138 173 -37 45 26 -6 67 54 -98 118 -326 190 258 -14 -51 138 112 -165 33
2485 33 146 310 78 95 -23 -63 231 -20 -89 460 -67 157 253 77 63 -147 153 -139 34 302 177 -78
2507 -78 -9 -262 84 94 124 -346 192 -189 -81 -7 -59 257 326 45 4 -30 -393 387 -513 129 135 178 183 -124 193
$$ packed form
2346b10L37p3p4K70q2n4P0j68J38n29L90J10J23p8k24j82K00k34J89m9j2K95k22
2369f9k0r5J58m5P6o3J9m4L18k46p3l84M36j77N90j37j51m51J64K38J4J22k13
2392c3J68k12L85l79Q7j04J40l4n6j58J16M15m92O2K63jj2j04j37J56j09j30L37
2415A68k90J13k4p2J48p1J09j01R8J32l14J44o6k9j70p1K97J27m27M35j33K6P0
2438I9l0P7o9o2M4P2j54p5K9J2k20K69j09J25J14k12K92j94k37K45JJ33l03K54
2462A01j75q3J64j02m3L11k10Q2j9l2P3j3j52K16m44N16O8k72l7J89k6k77J98
2485C3J13J64k32J7j18m0K94k51o9N49n27K24R6j76j4k10L00k92J73K68j25k55
2507g8O9k53L46J0L0m70N38l81J08P4n2L16O9k81m1l4l63P80r00O42OM3Nl07L17
$$ plain form
2532 193 -1 86 -99 -143 402 243 9 335 83 19 129 -101 217 90 -108 124 -462 -91 140 169 85 66
2554 66 -46 77 0 -51 69 -211 -63 -92 261 -109 -82 -130 -191 -38 -12 -14 274 10 52 -179 -22 -325 190 -101
2578 -101 175 47 -212 280 292 13 112 -237 175 -183 -141 70 180 157 134 366 -147 -257 337 -210 -170 123
2600 123 -105 -136 73 56 132 129 -12 6 -290 -24 -18 256 -26 -294 -142 -61 184 41 150 -190 -106 -368 -264
2623 -264 279 219 -141 -230 119 10 -321 74 209 -89 18 24 -49 74 190 87 -78 78 69 -49 -201 44
2645 44 205 12 -42 117 12 -180 47 -88 276 119 8 -133 303 10 -208 -28 7 33 18 -36 17 -25 171
2668 171 -86 68 -386 -83 -250 -239 70 -97 -38 -79 55 -32 -100 -19 14 -119 123 -126 104 -95 -310 112
2690 112 140 221 -111 47 -22 91 -43 11 -89 167 2 -229 143 170 457 -198 143 -9 11 -6 -1 -47 30 -18
$$ packed form
2532A93j94Q7j85m4N45j59k34L26k52o4J10k30L18j27j98K32n86L71K31K9q4j9
2554F6j12J23p7n1J20k80J48k9L53l70K7m8o1J53K6kK88k64M2k31J57l03N15k91
2578a01K76j28k59M92J2k79R9l49M12l58M2K11J10k3k3K32n13j10N94n47M0K93
2600A23k28l1K09j7P6lj41J8k96K66OK74k82k68J52Q1K45j43J09l40Q4k62J04
2623b64N43o0l60q9L49j09l31L95J35k98J07Op3J23J16j03j65J56rj18j52K45
2645D4J61j93n4J59j05j92K27j35L64j57j11j41M36k93k18J80L5K6j5n4N3m2J96
2668A71k57J54m54L03j67J1L09j67N9m1J34q7o8Q1L3j33K42k49K30j99k15M22
2690A12K8Q1l32J58o9J13j34N4j00K56j65k31L72K7K87o55L41j52K0j7Nm6P7m8
$$ plain form
2714 -18 324 -170 -217 -79 36 142 -203 114 -86 -343 -12 129 397 -144 241 -32 -31 -185 -100 -57 139 232
2736 232 -35 180 -156 -211 118 -25 -312 -112 147 -62 -27 -123 27 -28 43 114 131 148 273 274 -236 7 -122
2759 -122 -169 -24 -38 193 82 92 -176 -67 -83 -103 -87 -119 118 -122 -128 106 280 72 317 -150 -177 -80 -72 49
2783 49 -114 37 -106 76 4 300 -139 278 38 111 -48 184 -134 100 -129 49 -5 -54 226 210 -126 78
2805 78 -248 -103 -37 -320 200 -127 272 -188 111 96 -2 265 -267 254 -182 75 -21 -163 75 -97 -297 174
2827 174 161 174 -160 117 293 -275 241 129 -95 -25 -52 -208 -3 339 -152 -301 74 189 118 212 -157 202
2849 202 -178 53 220 310 -125 -307 13 164 -262 -131 120 -33 -91 -65 243 -169 -327 193 454 -99 -114
2870 -114 48 -103 -15 -22 80 -129 123 270 254 126 -146 29 -85 -91 168 -5 69 211 -26 -51 36 2 13 90
$$ packed form
2714a8L42m94m7J38J15J06l45L17k00k57L31J41K68n41L85k73Jj54Q5M3J96R3
2736B32k67K15l36n5L29j43k87K00K59k09L5r6J50n5P1P1J7J7J25Jn10K43j29
2759a22m7J45j4K31j11J0k68J09j6k0J6l2K37k40oK34J74k08K45m67k7R7QJ21
2783D9j63J51j43J82p2K96m39M17k40P3j59K32l18K34k29J78n4m9K80j6l36K04
2805G8l26J45O6k83N20l27L99m60K99j5r8K67n32N21m36K57r6j42K38j72k00M71
2827A74j3J3l34K77J76n68N16j12k24P0k7j56K05L42m91j49L75J15p1R4l69L59
2849B02l80K31J67R0m35j82L20J51m26J31K51j53n8K6L08m12j58N20K61n53j5
2870a14J62j51Q8pJ02k09K52J47j6j28k72J75j14oK59j73P4J42k37k5Q7l4J1P7
$$ plain form
2894 90 -64 65 86 -44 -56 100 -225 200 -36 151 176 155 16 7 -137 54 -103 13 -92 85 263 -221
2916 -221 -23 29 80 143 -4 265 97 212 154 197 316 126 207 -21 -23 -151 62 490 -215 10 100 -139 63
2939 63 -155 209 -93 158 -63 -100 203 189 74 55 167 158 -119 71 287 172 -112 -234 -316 52 -265 -375
2961 -375 8 -155 -65 104 -135 -192 197 30 119 -108 -61 259 111 317 -223 -135 -134 -36 -145 -245 -150 21 110
2984 110 149 160 170 94 24 -93 -47 -54 55 -129 -75 213 -57 228 115 -60 -209 -109 -242 -47 -27 162 -120
3007 -120 -150 -188 -15 -3 -33 -32 -122 220 -51 -57 -155 -93 83 -182 -171 -168 -312 -10 -450 -64 3 -11 129 -2 -132
3032 -132 -13 -167 -53 -108 -166 31 -19 10 75 116 154 254 107 32 -177 -118 160 -29 -137 164 169 -89 -9 -243
3056 -243 -122 268 -24 299 432 -97 -174 149 134 177 -172 233 198 -84 115 -50 30 198 -134 27 -101 37
$$ packed form
2894I0j54J29K1j30j2J56l25M25k36J87K5k1j39rj44J91j57J16j05J77J78m84
2916b21J98N2N1O3j47K69j68J15n8M3J19j90Q1k28kj28K13M28p05K25R0k39K02
2939F3k18L64l02K51k21l7L03j4j15j9J12rk77J90K16j15k84j22q2L68l17j10
2961c75L83j63R0J69k39n7L89j67Q9k27M7L20j48K06n40Q8JR8j09j00R5J71Q9
2984A10L9J1J0p6p0j17M6pJ09j84N4K88k70K85j13j75j49J00j33J95K0J89k82
3007a20l0l8J73J2l0Jr0L42k71or8O2J76k65J1Lj44L02m40L86O7j4J40j31j30
3032a32J19j54J14n5n8J97n0K9O5M1L8J00j47p5k09N9K78j89j08L01Nk58Q0k34
3056b43J21L90k92L23J33n29p7L23j5M3l49M05l5k82J99j65Q0J68l32J61j28J38
$$ plain form
3078 37 -66 36 -39 31 161 12 -5 -41 48 -245 133 -181 144 105 254 56 320 -48 -314 2 -188 87
3100 87 -152 83 -240 44 205 -230 23 211 -177 -171 -138 223 98 -203 -56 5 448 196 -119 -25 42 -22 280
3123 280 46 12 -22 -179 46 255 196 -90 34 -44 150 -63 227 -51 -73 2 68 165 -160 -131 202 57 -262
3146 -262 -141 -250 85 30 247 -139 -200 397 -9 -101 -97 -5 322 -76 -162 54 10 -169 -74 92 -190 397 88
3169 88 -265 153 45 320 -34 167 -19 -125 74 -110 41 -48 -69 -197 120 -12 88 243 -89 15 96
3190 96 136 177 -112 -92 -67 177 -95 -88 245 283 -159 -21 50 -34 274 19 173 30 -109 55 220 -258 166
3213 166 -90 362 218 37 109 124 84 145 76 160 45 33 329 34 -357 -88 238 21 -39 -17 -227 71 277
3236 277 143 -62 -100 22 10 103 -57 -15 -162 61 112 -133 -5 -219 -401 -41 99 -165 288 170 94 92 -25
$$ packed form
3078C7j03J02p5P0J30j49j7l6Q9k93L78l14L25l9J49j98K64l68k66L16j90K75
3100H7k39K35l23K84J61m35K53J88l88OL3L61j25l01J47O1M43k52l15R4O7o4L02
3123B80k34l4l4j57K25K09n9k86J24p8J94k13K90k78k2P5O6R7l25K9L33j45l19
3146b62J21j09L35n5K17l86o1N97m06r2MR2L27l98q6K16m4j79R5J66k82N87l09
3169H8l53M18j08K75l54K01j86j06J99j84J51q9k1j28L17j32J00J55l32J04Q1
3190I6M0M1k89K0K5K44k72PL33L8m42J38P1q4L08k55J54j43j39J64J65m78M24
3213A66k56M52j44j81P2J5m0O1o9Q4j15j2K96k95l91K69L26k17o0K2k10K98K06
3236B77j34k05l8J22j2R3j60M2j47K23N1k45J28k14j82L60J40k64M53j18p6kj17
$$ plain form
3259 -25 -35 -300 144 -123 233 -113 187 -68 -159 271 154 -236 15 -114 215 52 -7 102 -322 198 72
3280 72 -296 -39 -11 321 92 88 105 200 76 -206 -15 -323 98 -321 64 209 -21 0 -228 83 -52 -88 133
3303 133 273 -234 -56 93 -210 61 -182 118 -1 -179 121 157 397 -146 288 -58 87 -122 -85 -204 -62
3324 -62 -97 82 -80 244 39 -28 58 297 -53 -77 289 110 -107 -46 102 93 112 101 103 -141 197 -278 118 36
3348 36 61 -47 -94 28 -313 -215 119 -113 61 -187 90 38 128 -54 -60 -147 253 -309 -45 -43 106 120 360 84
3372 84 251 27 -145 79 3 -117 113 273 -1 -155 -46 273 -79 153 -183 -136 -21 -261 -133 -14 116
3393 116 -8 187 -32 -32 -188 -246 231 -8 180 82 261 -127 119 -174 -13 68 -91 -20 182 279 -12 -76 -90
3416 -90 64 115 367 272 -1 -45 -92 147 -257 -251 112 -16 -37 293 98 -84 388 19 -311 368 -103 36 -34
$$ packed form
3259b5j0k65M44k67L56l46L00k55r1M30j17l90K51j29L29j63n9J09m24N20j26
3280G2l68K57K8L32k29mJ7R5j24k82J91l08M21m19L85J45k30K1k28L11j35l6K21
3303A33J40n07J78J49l03K71k43L00j19j78L00L6K40n43M34l46J45k09L7j19J42
3324f2l5J79j62L24k05o7Q6K39l50k4L66j79k17O1J48rJ9j1Kk44L38m75L96q2
3348C6K5j08m7J22l41R8L34k32J74k48K77n2R0j82oq7M00n62K64KJ49J4K40k76
3372H4J67k24j72K24p6j20K30J60k74j54J09L19l52K32l36M7J15k40J28J19J30
3393A16j24J95k19%j56n8M77k39J88r8J79l88K46k93J61Q1j59P1K02R7k91o4j4
3416i0J54N1K52r5k73m4m7K39m04OL63j28k1L30j95j82M72l69l30O79m71J39p0
$$ plain form
3439 -34 95 -187 47 88 -224 44 158 141 -282 74 -327 72 145 -181 88 -183 -193 11 -127 132 217 -259
3461 -259 4 43 17 -163 251 33 -145 5 22 83 235 -91 340 -109 -113 13 -41 -109 -11 132 -29 -35 135 120
3485 120 -258 -162 117 38 -260 150 52 6 156 -109 -149 49 -299 295 -71 8 22 153 116 -103 52 -101 208
3508 208 -188 186 80 261 186 -16 -27 223 -73 255 144 93 -173 0 357 -178 -54 42 -270 -156 56
3529 56 -227 239 119 26 -25 371 -115 25 -285 134 364 18 -87 400 -63 -104 101 32 47 -170 28 102
3551 102 -8 150 201 243 -96 237 -85 -182 107 -122 131 -149 -28 174 210 -77 77 2 253 -20 -308 -88
3573 -88 -119 88 -20 16 -19 -83 94 38 -23 -308 25 -562 177 -112 239 95 -120 14 -273 166 97 95 -37
3596 -37 146 -21 52 86 -31 -439 246 -84 39 38 -22 -181 -322 -158 16 56 -52 26 -117 119 -23 -44 -41 17
$$ packed form
3439c4J29k82K34M1l12K68J14j7m23L56m01L99P3l26K69k71j0K04j38K59Q5m76
3461b59K63L9k6j80M14k18j78J50J7O1J52l26M31m49mJ26n4o8R8J43j61oJ70j5
3485A20l78R6K79p9k98M10r8m6J50k65m0J98l48N94l66P9J4J31l7k19J55j53L09
3508B08l96L74j06J81p5k02j1K50k96L28j11n1k66J73L57n35J24R6l12J14K12
3529E6k83M66j20r3n1L96m86J40l10M19K30l46j05M87m63m1K05o9J5k17J98P4
3551A02j10J58N1M2l39L33l22r7K89k29K53k80J21K02L6k87J54p5K51k73k88K20
3573h8l1K07j08L6l5o4J77n6o1k85L33n87P39k89L51j44k15J34k87M39o9kj32
3596c7J83j67P3L4j17m08O85l30J23jo0j59j41J64J74M0j08P8j43K36j42k1LN8
$$ plain form
3620 17 -23 227 42 -281 -23 -48 -80 38 -237 408 -169 19 -309 39 28 170 78 124 77 -34 232 15 221
3643 221 -30 51 328 162 173 -118 -61 -85 289 134 -28 250 154 -110 314 -190 -29 -71 108 25 219 -366
3665 -366 125 -20 240 379 13 316 70 -53 48 183 -62 198 8 -97 19 113 114 166 -98 -78 82 -86
3687 -86 -29 -69 -155 125 -113 -23 -72 254 -66 49 35 -30 324 39 -106 -96 100 -76 -96 -277 103 -205 455
3710 455 87 130 83 218 -117 -1 138 -32 -129 184 -302 -88 259 132 86 34 -115 27 -99 94 11 -87
3732 -87 121 94 16 -133 64 199 290 -156 86 -99 130 -136 -140 -15 179 -275 -374 220 -132 47 44 -76 -141
3755 -141 208 163 56 190 16 -387 -40 -80 -100 -32 -152 -86 87 171 -54 132 59 -40 -85 98 51 177 119 -92
3779 -92 -147 -105 84 -87 -72 163 -200 187 55 73 -73 260 31 -21 26 65 -91 -5 -306 87 143 -197 50
$$ packed form
3620A7m0K50j85l23K58k5l2J18k75O45n77J88l28L48j1J42r2M6m7j11K66k17K06
3643B21k51Q1K77j66J1k91N7k4L74j55j62K78r6k64M24n04J61m2J79q3J94n85
3665c66M91j45K60J39l66L03k46j23J01J35k45K60j90j05J16R4JN2k64K0J60j68
3687h6N7m0q6K80k38R0m9L26l20J15j4o5L54k85j45J0J96j76k0j81L80l08O60
3710D55l68M3m7J35l35J16J39j70r7L13m86K14L47j27m6n2j49J42j26J93q3r8
3732h7K08k7p8j49J97J35R1m46K42j85K29k66mJ25J94m54r9N94l52J79lj20o5
3755a41L49m5j07J34j74m03L47m0k0O8j20O6J73Q4k25J86p3r9m5J83m7J26n8k11
3779i2n5M2J89j71J5K35l63L87j32J8j46L33k29n2M7L9j56Q6l01L93N6l40K47
$$ plain form
3802 50 -34 132 162 262 -238 22 148 -41 -107 103 145 -50 -91 127 0 -257 76 -108 -74 -136 119 66 82
3825 82 8 36 56 -168 35 54 133 -407 224 -155 -137 156 98 -108 -296 197 33 84 -468 -119 85 -135 -36
3848 -36 46 289 -82 -66 -28 353 -218 -62 120 -163 -49 93 33 191 40 102 -33 224 -210 82 -159 102
3870 102 105 54 -121 -282 20 -236 -39 -48 235 281 33 176 109 -155 133 -16 260 -288 154 -310 -53 -107 26
3893 26 -74 -213 29 -26 -98 -28 -268 360 -84 268 -17 -113 115 128 43 -195 -113 45 154 9 145 -216 236
3916 236 265 346 120 266 -251 187 41 121 -154 -174 -174 196 229 84 -237 -14 -144 -133 -59 -26 270 237 8 -42
$$ packed form
3802E0q4J66L0J00n00K60J26j89o6K10M2j95m1K18j27k57L33j84L4o2K55n3J6
3825H2p4K8K0k24K03J9P9n40O31l79J8K93n8k06j88M93j64N1n52L49K04k20R9
3848c6Q2K43l71J6L8L81n71J56J82k83J14J42o0J58j51O2j35K57m34K92k41K61
3870A02Ln1j75j61L02k56J97rK83M6k48J43o7k64K88j49K76n48M42m64K57n4J33
3893B6j00j39K42n5p2P0k40O28m44L52k85r6K28J3q5k38Q2J58J09j45J36l61M52
3916B36K9Q1k26J46n17M38j46Q0k75k0%L70L3j45l21K23j30J1P4L3K96l3k29n0
$$ [...]
8191A41
##END NTUPLES=NMR FID
##END=
