##TITLE=1H_Pr 3752-H
 200.13MHz, CDCl3,
 8 sc
 
 29.1.2025
##JCAMPDX= 6.0         $$ Bruker NMR JCAMP-DX V2.0
##DATA TYPE= NMR FID
##DATA CLASS= NTUPLES
##ORIGIN= UXNMR, Bruker Analytische Messtechnik GmbH
##OWNER= pz
$$ XWIN-NMR		Version 3.5
$$ Wed Jan 29 14:26:18 2025 Russian Standard Time (UT+4h)  she@DPX200
##.OBSERVE FREQUENCY= 200.1313
##.OBSERVE NUCLEUS= ^1H
##.DELAY= (6, 6)
##.ACQUISITION MODE= SIMULTANEOUS
##.ACQUISITION SCHEME= undefined
##.AVERAGES= 8
##.DIGITISER RES= 18
##SPECTROMETER/DATA SYSTEM= spect
##.PULSE SEQUENCE= zg30
##.SOLVENT NAME= DMSO
##.SHIFT REFERENCE= (INTERNAL, DMSO, 0, 14.3821)
##AUDIT TRAIL= $$ (NUMBER, WHEN, WHO, WHERE, WHAT)
$$ ##TITLE= Audit trail, XWIN-NMR		Version 3.5
$$ ##JCAMPDX= 5.01
$$ ##ORIGIN= Bruker BioSpin GmbH
$$ ##OWNER= she
$$ F:/spectra/data/she/nmr/H-C/1/audita.txt
$$ ##AUDIT TRAIL=  $$ (NUMBER, WHEN, WHO, WHERE, WHAT)
(   1,<2025-01-29 14:25:30.67 +0400>,<she>,<DPX200>,
      <created by zg, POWCHK disabled, PULCHK disabled
       configuration hash MD5:
       00 E9 B6 7A A2 85 ED C7 34 08 36 98 17 FE 4E 26
       data hash MD5: 16K
       6D 98 39 DA D1 41 5B 33 71 A0 AC DE 5A E0 F2 63>)
$$ ##END=
$$ 
$$ hash MD5
$$ FC B7 2F 9A 90 86 D6 DA 62 B7 AA 3B C9 FC FF 88
##$RELAX= 
##$RELAX= 
##$RELAX= 
##$RELAX= 
##$RELAX= 
##$RELAX= 
$$ Bruker specific parameters
$$ --------------------------
##$DU= <F:/spectra>
##$EXPNO= 1
##$NAME= <H-C>
##$PROCNO= 1
##$TYPE= <nmr>
##$USER= <she>
##$AMP= (0..31)
100 100 100 100 100 100 100 100 100 100 100 100 100 100 100 100 100 100 
100 100 100 100 100 100 100 100 100 100 100 100 100 100 
##$AQSEQ= 0
##$AQ_mod= 1
##$AUNM= <au_zg>
##$AUTOPOS= <>
##$BF1= 200.13
##$BF2= 200.13
##$BF3= 200.13
##$BF4= 200.13
##$BF5= 200.13
##$BF6= 200.13
##$BF7= 200.13
##$BF8= 200.13
##$BYTORDA= 1
##$CFDGTYP= 0
##$CFRGTYP= 5
##$CHEMSTR= <none>
##$CNST= (0..31)
1 1 145 1 1 1 1 1 1 1 1 1 1 1 1 1 1 1 1 1 1 1 1 1 1 1 1 1 1 1 1 1 
##$CPDPRG= <>
##$CPDPRG1= <>
##$CPDPRG2= <>
##$CPDPRG3= <>
##$CPDPRG4= <mlev>
##$CPDPRG5= <mlev>
##$CPDPRG6= <mlev>
##$CPDPRG7= <mlev>
##$CPDPRG8= <mlev>
##$CPDPRGB= <>
##$CPDPRGT= <>
##$D= (0..31)
0 0.7 0 0 0 0 0 0 0 0 0 0.03 0 0 0 0 0 0 0 0 0 0 0 0 0 0 0 0 0 0 0 0 
##$DATE= 1738146329
##$DBL= (0..7)
120 120 120 120 120 120 120 120 
##$DBP= (0..7)
150 150 150 150 150 150 150 150 
##$DBP07= 0
##$DBPNAM0= <>
##$DBPNAM1= <>
##$DBPNAM2= <>
##$DBPNAM3= <>
##$DBPNAM4= <>
##$DBPNAM5= <>
##$DBPNAM6= <>
##$DBPNAM7= <>
##$DBPOAL= (0..7)
0.5 0.5 0.5 0.5 0.5 0.5 0.5 0.5 
##$DBPOFFS= (0..7)
0 0 0 0 0 0 0 0 
##$DE= 6
##$DECBNUC= <off>
##$DECIM= 32
##$DECNUC= <off>
##$DECSTAT= 4
##$DIGMOD= 1
##$DIGTYP= 9
##$DL= (0..7)
0 120 120 120 120 120 120 120 
##$DP= (0..7)
150 150 150 150 150 150 150 150 
##$DP07= 0
##$DPNAME0= <>
##$DPNAME1= <>
##$DPNAME2= <>
##$DPNAME3= <>
##$DPNAME4= <>
##$DPNAME5= <>
##$DPNAME6= <>
##$DPNAME7= <>
##$DPOAL= (0..7)
0.5 0.5 0.5 0.5 0.5 0.5 0.5 0.5 
##$DPOFFS= (0..7)
0 0 0 0 0 0 0 0 
##$DQDMODE= 0
##$DR= 18
##$DS= 0
##$DSLIST= <SSSSSSSSSSSSSSS>
$$ [...]
##$SUBNAM0= <"">
##$SUBNAM1= <"">
##$SUBNAM2= <"">
##$SUBNAM3= <"">
##$SUBNAM4= <"">
##$SUBNAM5= <"">
##$SUBNAM6= <"">
##$SUBNAM7= <"">
##$SUBNAM8= <"">
##$SUBNAM9= <"">
##$SW= 18.0517328524113
##$SWIBOX= (0..15)
0 0 2 0 0 0 0 0 0 0 0 0 0 0 0 0 
##$SW_h= 3612.71676300578
##$TD= 16384
##$TD0= 1
##$TE= 0
##$TE2= 300
##$TE3= 300
##$TEG= 300
##$TL= (0..7)
0 120 120 120 120 120 120 120 
##$TP= (0..7)
150 150 150 150 150 150 150 150 
##$TP07= 0
##$TPNAME0= <>
##$TPNAME1= <>
##$TPNAME2= <>
##$TPNAME3= <>
##$TPNAME4= <>
##$TPNAME5= <>
##$TPNAME6= <>
##$TPNAME7= <>
##$TPOAL= (0..7)
0.5 0.5 0.5 0.5 0.5 0.5 0.5 0.5 
##$TPOFFS= (0..7)
0 0 0 0 0 0 0 0 
##$TUNHIN= 0
##$TUNHOUT= 0
##$TUNXOUT= 0
##$USERA1= <user>
##$USERA2= <user>
##$USERA3= <user>
##$USERA4= <user>
##$USERA5= <user>
##$V9= 5
##$VALIST= <valist>
##$VCLIST= <CCCCCCCCCCCCCCC>
##$VD= 0
##$VDLIST= <DDDDDDDDDDDDDDD>
##$VPLIST= <PPPPPPPPPPPPPPP>
##$VTLIST= <TTTTTTTTTTTTTTT>
##$WBST= 1024
##$WBSW= 4
##$XGAIN= (0..3)
0 0 0 0 
##$XL= 0
##$YL= 0
##$YMAX_a= 61896
##$YMIN_a= -69779
##$ZGOPTNS= <>
##$ZL1= 120
##$ZL2= 120
##$ZL3= 120
##$ZL4= 120
##$ABSF1= 10
##$ABSF2= 0
##$ABSG= 5
##$ABSL= 3
##$ALPHA= 0
##$AQORDER= 0
##$ASSFAC= 0
##$ASSFACI= 0
##$ASSFACX= 0
##$ASSWID= 0
##$AUNMP= <proc_1d>
##$AZFE= 0.1
##$AZFW= 0.1
##$BCFW= 1
##$BC_mod= 2
##$BYTORDP= 1
##$COROFFS= 0
##$CY= -3
##$DATMOD= 1
##$DC= 2
##$DFILT= <>
##$DTYPP= 0
##$F1P= 0
##$F2P= 0
##$FCOR= 0.5
##$FTSIZE= 0
##$FT_mod= 4
##$GAMMA= 1
##$GB= 0.15
##$INTBC= 1
##$INTSCL= 1
##$ISEN= 128
##$LB= 0.25
##$LEV0= 0
##$LPBIN= 0
##$MAXI= 10000
##$MC2= 0
##$MEAN= 0
##$ME_mod= 0
##$MI= 1.114404
##$NCOEF= 0
##$NC_proc= 0
##$NLEV= 6
##$NOISF1= 3.799351
##$NOISF2= 2.8
##$NSP= 1
##$NTH_PI= 0
##$NZP= 0
##$OFFSET= 14.38212
##$PC= 1
##$PHC0= 246.946
##$PHC1= 19.59223
##$PH_mod= 1
##$PKNL= yes
##$PPARMOD= 0
##$PSCAL= 0
##$PSIGN= 0
##$REVERSE= no
##$SF= 200.129724274929
##$SI= 16384
##$SIGF1= 3
##$SIGF2= 2
##$SINO= 400
##$SIOLD= 16384
##$SREGLST= <1H.CDCl3>
##$SSB= 0
##$STSI= 0
##$STSR= 0
##$SW_p= 3205.1282051282
##$SYMM= 0
##$S_DEV= 0
##$TDeff= 0
##$TDoff= 0
##$TI= <>
##$TILT= no
##$TM1= 0
##$TM2= 0
##$TOPLEV= 0
##$USERP1= <user>
##$USERP2= <user>
##$USERP3= <user>
##$USERP4= <user>
##$USERP5= <user>
##$WDW= 1
##$XDIM= 8192
##$YMAX_p= 0
##$YMIN_p= 0
$$ End of Bruker specific parameters
$$ ---------------------------------
##NTUPLES= NMR FID
##VAR_NAME=  TIME,          FID/REAL,        FID/IMAG
##SYMBOL=    X,             R,               I
##VAR_TYPE=  INDEPENDENT,   DEPENDENT,       DEPENDENT
##VAR_FORM=  AFFN,          ASDF,            ASDF
##VAR_DIM=   8192,          8192,            8192
##UNITS=     SECONDS,       ARBITRARY UNITS, ARBITRARY UNITS
##FACTOR=    0.0002768,     1,               1
##FIRST=     0,             0,               0
##LAST=      2.2672688,     0,               0
##MIN=       0,             -69779,          0
##MAX=       2.2672688,     61896,           0
$$ Real data points
##PAGE= N=1
##DATA TABLE= (X++(R..R)), XYDATA
$$ plain form
0 0 0 0 0 0 0 0 0 0 0 0 0 0 0 0 0 0 0 0 0 0 0 0 0 -2 6 -6 8 -8 8 -8 8 -10 14 -14 14 -18 18 -22 24 -24 31 -32 37 -40 46
45 46 -47 55 -57 64 -71 79 -87 96 -106 119 -133 147 -165 186 -211 243 -283 334 -407 512 -676
66 -676 963 -1563 3303 -18354 -69779 -3591 36664 8570 20835 40421 7065 13954 61896
79 61896 33284 -24875 729 26169 -17415 -29493 -1560 -22355 -37794 -2028 -7363 -44494
91 -44494 -15290 27315 769 -22923 3795 12259 1947 22547 25024 -12732 -6439 33404 18916
104 18916 -12248 1703 10101 -3255 5785 12801 -11531 -16324 10468 7185 -19692 -12712 2113
117 2113 -8101 -9758 -1370 -14870 -18502 3923 6393 -9067 -3099 9986 7055 7695 14367 8510
131 8510 3883 15915 16546 885 1087 7589 -1634 -6563 -3569 -11553 -14626 -3924 -5266 -16528 -12904
$$ packed form
0@%%%%%%%%%%%%%%%%%%%%%%%kQj2J4j6J6j6J6j8K4k8K8l2L6m0M6m8N5o3O9p7Q6
45D6r3J02j12J21j35J50j66J83k02K25k52K80l12L51l97M54n26O17p41R19j188
66f76J639k526M866k1657n1425O6188M0255k8094J2265J9586l3356O889M7942
79F1896k8612n8159K5604K5440m3584j2078K7933k0795j5439L5766n335l7131
91d4494K9204M2605k6546k3692K6718Q464j0312K0600K477l7756O293L9843j4488
104A8916l1164J3951Q398j3356R040P016k4332m793K6792l283k6877O980J4825
117B113j0214j657Q388j3500l632K2425K470j5460N968J3085k931O40O672n857
131H510m627J2032O31j5661K02O502r223m929K994p984l073J0702j342j1262L624
$$ plain form
146 -12904 -3220 -3162 -1453 5346 1792 -1753 9725 13789 3861 3740 9604 4129 2946 7747 1908
161 1908 -4960 595 1820 -6322 -5843 2113 -397 -5945 -2556 -2178 -5759 -531 2993 -4610 -6136 537
177 537 958 -602 968 186 -1734 2472 7323 4848 1468 3975 4961 2592 3344 3354 266 -247 -1359
194 -1359 -4472 -4450 -3935 -5480 -4804 -4269 -6100 -4156 1202 1724 -1182 341 4437 4664 5775 6924 2114
211 2114 266 6178 4461 -3120 -1153 793 -4649 -4867 -428 -3975 -7939 -1222 2091 -4182 -3186 4505
227 4505 1813 -1084 5428 3641 -2662 3664 7727 -1701 -4102 3457 1553 -4477 -587 680 -6197
242 -6197 -3289 5167 -1536 -7712 1792 4700 -2016 511 4021 -1445 -385 6862 2395 -5033 263
257 263 5723 -889 -3330 1515 -1884 -4074 2207 915 -7014 -2820 3429 -437 -2918 866 595 -1173
$$ packed form
146a2904R684N8J709O799l554l545J1478M064r928j21N864n475j183M801n839
161A908o868N555J225q142M79P956k510n548L389L78l581N228L524p603j526O673
177E37M21j560J570p82j920M206M851k475l380K507R86k369P52J0l088n13j112
194a359l113K2N15j545O76N35j831J944N358N22k906J523M096K27J111J149m810
211B114j848N912j717p581J967J946n442k18M439l547l964O717L313o273R96P691
227D505k692k897O512j787o303O326M063r428k401P559j904o030L890J267o877
242f197K908Q456o703o176R504K908o716K527L510n466J060P247m467p428N296
257B63N460o612k441M845l399k190O281j292p929M194O249l866k481L784k71j768
$$ plain form
273 -1173 3296 4659 -1584 -1582 5851 3565 -1416 998 1391 -1608 919 1830 -3844 -4586 90 378 -3221
290 -3221 -2674 -1125 -2104 40 3105 -822 -2302 3130 4280 816 1145 2039 1253 1983 2606 -382 -2509
307 -2509 -427 1160 -1798 -3044 -1751 -2742 -1635 917 -1236 -3137 314 2602 905 424 745 1622
323 1622 1838 2227 1536 -880 -357 1675 188 -1713 -1047 -1540 -1214 79 -1202 -2214 -894 746 716
340 716 -426 -19 1513 1426 1018 1332 609 565 1363 191 -246 -247 -1027 -853 -930 -1171 -870 -1047 -1147 -89 -360
361 -360 -108 376 583 663 1358 1111 1216 848 292 1317 1038 -165 -517 -571 -791 -500 -1184 -1531 -1298 -836
381 -836 134 -481 -1330 260 1118 521 1049 1034 277 606 1516 1026 -371 -457 658 551 -969 -700 -189 -772
401 -772 286 279 -1333 -877 873 865 -554 -681 712 649 -454 706 466 -1268 488 1833 -737 -1383
$$ packed form
273a173M469J363o243KP433k286m981K414L93k999K527R11n674p42M676K88l599
290c221N47J549r79K144L065l927j480N432J150l464L29Q94p86P30O23k988k127
307b509K082J587k958j246J293r91J107K552k153j901L451K288j697m81L21Q77
323A622K16L89o91k416N23K032j487j901O66m93L26J293j281j012J320J640l0
340G16j142M07J532q7m08L14p23m4P98j172m37jp80J74p7k41L01j77j00J058k71
361c60K52M84K07Q0O95k47J05l68n56J025k79j203l52n4k20K91o84l47K33M62
381h36R70o15q49J590Q58n97N28j5p57L29R10m90j397q6J115j07j520K69N11n83
401g72J058pj612M56J750qj419j27J393o3j103J160k40j734J756J345k570o46
$$ plain form
419 -1383 1043 477 -505 272 669 -459 34 1650 362 -1428 704 1492 -1382 -447 1231 -964 -1509
436 -1509 1290 373 -2028 -820 1176 -474 -1247 591 101 -1567 883 1659 -1350 -414 2348 461
452 461 -1318 1545 1506 -731 616 2058 -618 -1385 1306 544 -2882 -1138 524 -2379 -1766 221 -1736
469 -1736 -2509 773 933 -1135 755 3176 950 582 3527 2743 -11 2277 2802 -856 -556 1186 -1634
486 -1634 -3151 -1279 -1833 -3947 -2201 -646 -2666 -2613 1186 790 -1330 2161 3686 1020 1832 4199
502 4199 1782 855 2775 1106 -1539 -257 777 -2486 -3700 -732 -1697 -4003 -1146 -130 -3130 -875
518 -875 2342 80 -574 2391 2555 254 1483 3045 517 -229 2223 344 -2560 474 1537 -2106
534 -2106 -2523 353 -871 -1757 -264 -51 -1868 -820 1983 30 -1972 557 1581 -633 146 1440
$$ packed form
419a383K426n66r82P77L97j128M93J616j288j790K132P88k874R35J678k195n45
436a509K799r17k401J208J996j650p73J838m90j668K450P76l009R36K762j887
452D61j779K863l9k237J347J442k676p67K691p62l426J744J662k903O13J987j957
469a736p73L282J60k068J890K421k226l68K945p84k754K288N25l658L00J742k820
486a634j517J872n54k114J746J555k020N3L799l96k120L491J525k666Q12K367
502D199k417r27J920j669k645J282J034l263j214K968r65k306K857J016l000K255
518h75L217k262o54K965J64k301J229J562k528p46K452j879k904L034J063l643
534b106m17K876j224q86J493K13j817J048K803j953k002K529J024k214P79J294
$$ plain form
550 1440 -175 -208 1902 486 -1348 123 2478 441 -1348 349 892 -799 126 576 -1737 -1743 1374
567 1374 437 -2149 -1559 962 191 -702 400 -6 -1637 1227 2228 -1725 -1816 1910 1789 -777 -23
584 -23 1145 -721 -55 2330 473 -2324 663 2274 -1393 -1506 1368 -51 -1909 385 -238 -2692
600 -2692 -1264 1894 -1075 -3412 673 1760 -1041 602 2355 -596 -344 3801 2613 -1252 511
615 511 2046 -434 -444 1579 -1281 -3926 -66 512 -3724 -2181 885 -1792 -2351 1315 876 -963 1407
632 1407 2850 126 383 3636 2411 -478 1136 1657 -1554 72 1828 -2128 -3265 -222 -309 -2328
648 -2328 -1028 -185 -2207 -941 1979 479 -1443 1501 2179 -197 1418 2357 -68 64 2375 259
664 259 -1664 770 995 -1666 -1299 327 -1285 -1535 1096 -210 -2535 494 2095 -1280 -723 1662
$$ packed form
550A440j615l3K110j416j834J471K355k037j789J697N43j691R25M50k313oL117
567A374r37k586N90K521p71q93J102m06j631K864J001l953r1L726j21k566P54
584b3J168j866O66K385j857k797K987J611l667j13K874j419j858K294o23k454
600b692J428L158k969k337M085J087k801J643J753k951K52M145j188l865J763
615E11J535k480j0K023k860k645L860N78m236J543L066k677n59L666m39j839K370
632A407J443k724K57L253j225k889J614N21l211J626J756l956j137L043q7k019
648b328J300Q43k022J266K920j500j922K944O78k376J615R39k425J32K311k116
664B59j923K434K25k661L67J626j612k50K631j306k325L029J601l375N57K385
$$ plain form
680 1662 -183 -771 1776 913 -1835 22 2299 -424 -1554 1311 638 -1708 711 1186 -1745 -457
696 -457 2445 -554 -1874 1380 1280 -1298 61 1400 -1396 -1750 1793 524 -2810 -540 1448 -1265
712 -1265 -933 1085 -782 -1446 1540 1678 -1224 -115 2244 757 -762 1465 1102 -1156 557 1535
728 1535 -1267 -1556 1158 -108 -2194 -1146 -65 -1104 -929 334 -475 -1166 1174 1577 -421 93 1415
745 1415 911 790 1166 631 -255 312 845 32 -1124 -474 -67 -917 -741 -636 -1154 -928 -24 -359 -662 -337
765 -337 610 606 187 409 1186 377 264 1121 623 -114 410 472 -38 -770 -617 -88 -988 -192 -56 -1182 -989
786 -989 633 150 -572 100 463 237 560 1245 337 -678 708 1181 -232 -605 77 -473 -206 70 -718
805 -718 -1215 59 572 -275 -691 383 928 17 508 649 -354 583 1325 -84 -793 -116 72 -99 -119
$$ packed form
680A662j845n88K547q63k748J857K277k723j130K865o73k346K419M75k931J288
696d57K902k999j320L254j00k578J359J339k796l54L543j269l334K270J988k713
712a265L32K018j867o64K986J38k902J109K359j487j519K227l63k258J713R78
728A535k802k89K714j266k086J048J081j039J75J263q09o91K340M03j998N14J322
745A415n04j21L76n35q86N67N33q13j156O50M07q50J76J05n18K26R04l35l03L25
765c37R47mm19K22P77q09j13Q57m98p37N24O2n10p32J53N29r00P96J36j126J93
786i89J622m83p22O72L63k26L23O85r08j015J386M73j413l73O82n50K67K76p88
805g18m97J274N13q47m16J074N45r11M91J41j003R37P42j409p09O77J88j71k0
$$ plain form
824 -119 -988 -971 -148 561 -268 -1090 222 910 394 465 888 -4 508 1330 90 -459 389 254 -419 -607
844 -607 -880 -1198 -556 49 -472 -1216 -11 420 -86 108 741 225 662 1142 441 -93 435 632 -197 -131
864 -131 215 -255 -938 -378 -475 -1168 -539 7 -473 -550 274 497 -254 374 795 409 416 878 558 -168 400 588
886 588 -415 -154 -47 -548 -861 -445 -591 -810 -717 -73 6 -568 108 318 296 526 772 537 533 693 471 214
908 214 489 120 28 -483 -500 -616 -532 -736 -703 -790 -244 -290 -160 -33 102 148 1011 696 491 605 582 639 595 308
932 308 78 110 -11 -361 -751 -506 -394 -838 -571 -206 -207 -369 -84 247 263 415 199 367 503 532 176 -1
954 -1 84 467 -182 -339 61 -348 -530 99 -109 108 -364 -144 54 -151 191 287 -284 -181 67 299 -255 -415
976 -415 -289 53 42 -227 -205 -21 172 227 168 -6 507 882 574 274 320 8 340 -24 -56 -421 -457 -23 -413
$$ packed form
824a19q69J7Q23P09q29q22J312O88n16P1M23q92N12Q22j240n49Q48j35o73j88
844f07k73l18O42O05n21p44J205M31n06J94O33n16M37M80p01n34N28J97q29O6
864a31L46m70o83N60r7o93O29N46m80p7Q24K23p51O28M21l86PM62l20p26N68J88
886E88j003K61J07n01l13M16j46k19R3O44P9n74O76K10k2K30K46k35mJ60k22k57
908B14K75l69r2n11j7j16Q4k04L3q7N46m6J30J27J35M6Q63l15k05J14k3N7m4k87
932C08k30L2j21l50l90K45J12m44K67L65jj62K85L31J6J52k16J68J36K9l56j77
954aQ5L83o49j57M00m09j82O29k08K17m72K20J98k05L42R6n71J03K48K32n54j60
976d15J26L42j1k69K2J84J93N5n9j74N13L75l08l00M6l12L32l64l2l65l6M34l90
$$ plain form
999 -413 -726 -490 -201 -251 -14 -161 -514 -49 723 533 464 361 668 684 592 524 319 93 626 193 -504 -350
1021 -350 -269 -370 -377 -613 -1278 -750 48 -262 -684 -171 303 310 459 977 566 278 1052 935 256 693 715 -56
1043 -56 39 24 -351 -770 -609 -219 -1089 -1366 -262 -392 -864 12 190 -454 412 971 553 301 1155 948 186
1064 186 752 917 -191 -461 606 -126 -1103 -231 -45 -1054 -1024 -335 -653 -375 209 223 -645 65 1042 179
1084 179 -218 885 395 -487 562 748 -470 -245 400 27 -697 89 165 -631 -53 620 63 -464 539
1103 539 315 -423 137 388 -290 8 438 10 -637 -119 541 -452 -308 364 -83 -172 324 221 -200 407
1123 407 483 -79 129 208 136 -187 124 15 -452 -206 -65 -304 -418 -288 -284 -523 78 36 -270 -57 274 366
1145 366 317 403 334 173 316 508 -145 -21 351 -256 -401 -88 -276 -439 -351 6 -436 -119 77 77 -82 280
$$ packed form
999d13l13K36K89n0K37j47l53M65P72j90o9j03L07J6r2o8k05k26N33m33o97J54
1021c50Q1j01pk36o65N28P98l10m22N13M74PJ49N18m11k88P74j17o79M37K2p71
1043e6R5j5l75m19J61L90q70k77J104j30m72Q76J78o44Q66N59m18k52Q54k07p62
1064A86N66J65j108k70J067p32r77Q72J86j009L0O89l18K78N84J4q68P10R77q63
1084A79l97J103m90q82J049J86j218K25O45l73p24P86P6p96N78O73n57n27J003
1103E39k24p38N60K51o78K98M30m28o47N18O60r93J44O72m47q9M96j03m21O07
1123D07P6n62K08P9p2l23L11j09m67K46J41k39j14J30Mk39O01m2l06K13L31R2
1145C66m9Q6o9j61J43J92o53J24L72o07j45L13j88j63Q8L57m42L17J96%j59L62
$$ plain form
1167 280 385 39 -2 742 391 120 714 521 68 83 -7 -147 -193 -151 -181 -536 -151 -148 -517 -524 178 -54 -470
1190 -470 119 606 205 292 435 174 -66 466 550 90 -457 266 -128 -600 -169 -175 -790 -337 217 -30 -608
1211 -608 87 629 243 193 814 394 -183 677 275 -369 -115 236 -191 -711 -174 -263 -645 -209 37 -578 -664
1232 -664 553 592 -66 219 610 251 494 832 404 -99 366 574 -223 -660 3 -423 -552 -72 -188 -708
1252 -708 -236 474 -146 -384 90 497 -63 329 449 114 296 599 278 -409 82 530 -386 -470 112 -106
1272 -106 -353 89 6 -587 -443 273 -194 -423 337 146 64 230 455 186 174 582 168 -367 229 316 51
1293 51 -260 184 -122 -433 218 -167 -588 -13 98 -78 -136 -24 140 217 310 191 -161 97 379 -5 -155
1314 -155 239 257 -5 -63 110 -38 -48 49 -102 -277 258 334 176 -106 209 -135 100 395 -61 -301 -234 78
$$ packed form
1167B80J05l46m1P44l51k71N94j93m53J5r0j40m6M2l0l55L85Ll69pP02k32m16
1190d70N89M87m01Q7J43k61k40N32Q4m60n47P23l94m72M31oo15M53N54k47n78
1211f08O95N42l86n0O21m20n77Q60m02o44K54L51m27n20N37q9l82M36K46o15q6
1232f64J217L9o58K85L91l59K43L38m28n03M65K08p97m37O63m26j29M80j16n20
1252g08M72P10o20k38M74M07n60L92J20l35J82L03l21o87M91M48r16q4N82k18
1272a06k47M42q3n93J44P16m67k29P60j91q2J66K25k69j2M08m14n35N96Q7k65
1293E1l11M44l06l11O51l85m21N75J11j76n8J12J64P7R3j19l52K58K82l84j50
1314a55L94J8k62n8J73j48j0R7j51j75N35P6j58k82L15l44K35K95m56k40O7L12
$$ plain form
1336 78 -150 -416 -20 -160 -29 -54 157 56 -46 525 -97 310 344 546 260 419 248 -344 -119 -66 -315
1357 -315 -447 -392 -166 -579 -506 -41 -475 -42 197 369 -11 281 521 215 274 541 321 260 239 -14 -164 -79
1379 -79 -196 -337 -528 -132 -114 -482 -392 -76 -170 -99 138 91 21 211 534 359 344 231 373 97 178 285 -12
1402 -12 -119 -125 -85 -251 -393 -139 -282 -399 -304 -129 -154 49 337 -97 17 282 323 184 191 174 192 100 212 33
1426 33 -25 39 260 -500 -284 -218 -81 -176 -30 -48 -141 -32 270 129 -148 151 83 111 -54 6 -94 -198 28
1449 28 29 -20 -212 -53 -76 -2 -223 -95 -116 86 -44 114 332 157 234 -102 149 141 -26 -241 -61 -98 -193 -426
1473 -426 -236 -98 73 -195 -318 47 199 -76 99 324 299 270 294 467 93 -82 72 83 -54 -234 -279 -322
1495 -322 -298 -298 -325 -482 -33 348 -87 4 101 161 319 270 295 202 227 152 433 -177 -198 -7 27 -173 -319 -380 -254
$$ packed form
1336G8k28k66L96j40J31k5K11j01j02N71o22M07L4K02k86J59j71n92K25N3k49
1357c15j32N5K26m13P3M65m34M33K39J72l80K92K40l06N9K67k20o1k1k53j50Q5
1379g9j17j41j91L96J8l68R0L16r4P1K37m7p0J90L23j75j5j13J42k76Q1J07k97
1402a2j07oM0j66j42K54j43j17R5J75k5K03K88m34J14K65M1j39Pj7J8r2J12j79
1426C3n8O4K21p60K16O6J37r5J46j8r3J09L02j41k77K99o8K8j65O0j00j04K26
1449B8Jm9j92J59k3P4k21J28k1K02j30J58K18j75P7l36K51qj67k15J80l7r5k33
1473d26J90J38J71k68j23L65J52k75J75K25k5k9K4J73l74j75J54J1j37j80m5m3
1495c22K4%k7j57M49L81m35R1R7O0J58m9K5r3K5p5K81o10k1J91L4k00j46o1J26
$$ plain form
1520 -254 -94 -169 -370 6 -74 41 65 112 67 96 216 313 -91 -91 -299 98 -240 -199 -98 -434 -274 -67 176
1543 176 19 57 -46 130 86 43 418 166 14 25 -186 -101 -154 -3 -206 -52 -126 -132 8 57 -227 -107 81
1566 81 108 50 -113 168 71 347 267 64 41 194 143 -229 -127 -177 -204 -267 -328 -209 -303 6 -168 -258 -314 121 204
1591 204 159 113 222 396 293 384 145 350 102 228 89 70 -194 -177 -141 -357 39 -400 -79 -25 -281 -83
1613 -83 114 218 257 187 282 185 -80 -45 422 208 51 290 70 -103 -270 -41 -249 -244 -288 -408 -259 -11 -172
1636 -172 -33 -5 -98 70 51 153 421 162 34 389 88 49 116 -70 -114 103 -262 -92 -179 -43 -111 -259 202
1659 202 120 -24 9 251 101 100 226 169 -100 23 106 0 -116 86 24 -168 113 -55 -265 -240 107 108 -105
1682 -105 99 158 -137 39 123 -155 -33 83 121 -299 -91 40 -206 -181 324 -334 -317 163 -4 -93 99 576
$$ packed form
1520b54J60p5k01L76q0J15K4M7m5K9J20R7m04%k08L97l38M1J01l36J60K07K43
1543A76j57L8j03J76m4m3L75k52j52J1k11Q5n3J51k03J54p4oJ40M9k84J20J88
1566H1K7n8j63K81r7K76q0k03k3J53n1l72J02n0k7o3o1J19r4L09j74r0n6M35Q3
1591B04m5m6J09J74j03R1k39K05k48J26j39j9k64J7L6k16L96m39L21N4k56J98
1613h3J97J04L9p0R5r7k65L5M67k14j57K39k20j73j67K29k08Nm4j20J49K48j61
1636a72J39K8r3J68j9J02K68k59j28L55l01l9O7j86m4K17l65J70q7J36o8j48M61
1659B02q2j44L3K42j50jJ26n7k69J23Q3j06j16K02o2j92K81j68k10K5L47Jk13
1682a05K04N9k95J76Q4k78J22J16L8m20K08J31k46K5N05o58J7M80j67q9J92M77
$$ plain form
1704 576 -79 -135 330 170 -241 76 105 -113 -81 22 -158 -311 180 104 -267 -207 112 -143 -200 258 -46 -60
1726 -60 194 341 120 -17 283 280 -219 118 156 -291 -288 128 -78 -324 40 417 -215 -324 -155 -109 -221 231
1748 231 170 -161 203 654 163 -52 -111 175 127 180 190 -249 -281 65 -217 -275 -194 58 50 -312 -356 -314 -26 26
1772 26 298 90 46 157 331 233 -73 47 195 289 -47 16 -157 -128 105 -62 -391 -32 79 41 39 -39 -145
1795 -145 22 68 106 131 -76 247 114 135 23 45 17 -19 -58 -249 -20 -7 74 -174 -44 78 -66 -44 40 68
1819 68 109 171 224 171 124 25 184 17 -213 -52 -335 -362 -2 -60 -151 -120 -136 38 45 151 148 129 -224 129 165 107
1845 107 1 -94 109 -21 -186 -254 -72 -12 -76 64 -132 -100 100 59 -80 -48 187 100 199 136 -126 -47 333 -10
1869 -10 -214 161 203 -168 24 -205 -217 -243 -117 141 -275 -223 169 121 35 130 37 14 74 300 8 -97 156 50
$$ packed form
1704E76o55n6M65j60m11L17K9k18L2J03j80j53M91p6l71O0L19k55n7M58l04j4
1726f0K54J47k21j37L00lm99L37L8m47LM16k06k46L64L77o32j09J69M6j12M52
1748B31o1l31L64M51m91k15n9K86m8N3J0m39l2L46k82n8Q1K52ql62m4M2K88N2
1772B6K72k08m4J11J74r8l06J20J48R4l36O3j73K9K33j67l29L59J11l8kp8j06
1795a45J67M6L8K5k07L23j33K1j12K2k8l6l9j91K29J3Q1k48J30J22j44K2Q4K8
1819F8M1O2N3n3m7r9J59j67k30J61k83k7L60n8r1L1j6J74PJ06lj9l53L53L6n8
1845A07j06r5K03j30j65o8J82O0o4J40j96L2K00m1j39L2K35q7R9o3k62P9L80l43
1869a0k04L75M2l71J92k29j2k6J26K58m16N2L92m8q6R5r3k3O0K26k92j05K53j06
$$ plain form
1893 50 -185 -114 -125 -189 -89 -131 53 -287 96 150 -126 -105 306 178 -118 30 198 31 -170 140 96 -129 131
1916 131 28 -308 63 -108 -340 -134 180 151 -203 -90 69 -63 5 307 242 94 93 216 121 -62 -52 110
1938 110 -144 102 45 -259 -259 -17 -219 -106 -23 -156 -274 -106 202 58 174 119 181 145 216 128 66 125 122 -141
1962 -141 -40 114 -38 -155 -94 -205 -70 -372 -188 -68 -73 15 -91 -134 205 29 265 107 -30 204 132 46
1984 46 -24 -74 -210 -39 -100 -213 1 -159 -33 -249 167 95 -379 -30 18 28 22 106 53 -242 -105 -30 54 56 93
2009 93 -185 -99 -143 -76 -146 103 66 46 203 93 139 -19 242 55 2 -41 91 -89 -98 -46 109 -55 -13 -113 -163
2034 -163 -79 36 204 96 48 207 260 197 134 195 112 172 172 -13 -37 -68 -56 -25 -173 -211 -208 -286 -143 -70 52 35 156
2061 156 223 -126 87 -60 201 -56 13 127 120 94 -148 -128 -13 224 -135 -91 -131 162 -90 -176 -22 18 7 71
$$ packed form
1893E0k35P1j1o4J00m2J84l40L83N4k76K1M11j28k96J48J68j67k01L10m4k25K60
1916A31j03l36L71j71k32K06L14k9l54J13J59j32O8L02o5j48jJ23r5j83J0J62
1938A10k54K46n7l04%K42k02J13Q3j33j18J68L08j44J16n5O2l6P1q8o2N9lk63
1962a41J01J54j52j17O1j11J35l02J84J20nQ8j06m3L39j76K36j58j37K34p2q6
1984D6p0n0j36J71o1j13K14j60J26k16M16p2m74L49M8J0oQ4n3k95J37P5Q4KL7
2009I3k78Q6m4O7p0K49l7k0J57j10M6j58K61j87n3m3J32j80rN2J55j64M2j00n0
2034a63Q4J15J68j08m8J59N3o3o3O1q3O0%j85k4l1J2L1j48l8Lp8J43P3J22j7J21
2061A56O7l49K13j47K61k57O9J14pk6k42K0J15K37l59M4m0K93k52q6J54M0j1O4
$$ plain form
2085 71 187 -143 -40 -93 192 228 42 2 102 -89 37 91 -59 83 -16 -120 -213 124 -229 -222 -15 -97 -44 3
2109 3 173 -65 99 85 14 -168 -124 -51 -118 145 170 -82 31 141 131 -41 6 -1 -95 143 313 -90 165 48
2133 48 131 73 141 34 -82 -68 76 -35 -391 -9 -107 10 -209 -56 64 10 183 393 -134 240 189 115 -29
2156 -29 -13 -95 31 -13 -129 -18 43 -71 -11 -184 -430 -24 101 -223 64 109 -119 200 303 281 145 104 -8
2179 -8 -44 136 89 128 -39 95 -63 -85 -52 -159 -313 -312 -10 -145 -136 3 15 -96 -5 84 233 -86 211 84 240
2204 240 256 135 -12 125 61 -114 -163 11 -90 -263 64 -149 -49 -124 -149 -172 -223 243 -91 46 -22 176 125
2227 125 -153 106 91 -144 -326 -40 100 -347 98 -75 62 -66 129 -49 -187 -90 179 -60 121 246 -77
2248 -77 141 189 266 0 111 -59 -151 -57 62 -89 -73 -132 17 -151 -182 -7 41 -36 77 -2 16 6 214 136 -33
$$ packed form
2085G1J16l30J03n3K85L6j86m0J00j91J26N4j50J42r9j04r3L37l53PK07q2N3M7
2109CJ70k38J64j4p1j82M4P3o7K63K5k52J13J10j0j72M7pr4K38J70m03K55j17
2133D8Q3n8O8j07j16J4J44j11l56L82r8J17k19J53J20n4J73K10n27L74n1p4j44
2156b9J6q2J26m4j16J11O1j14O0j73k46M06J25l24K87M5k28L19J03k2j36m1j12
2179hl6J80m7L9j67J34j58k2L3j07j54JL02j35RJ39J2j11R1Q9J49l19K97j27J56
2204B40J6j21j47J37o4j75m9J74j01j73L27k13J00p5k5k3n1M66l34J37o8J98n1
2227A25k78K59j5k35j82K86J40m47M45j73J37j28J95j78j38R7K69k39J81J25l23
2248g7K18M8P7k66J11j70r2R4J19j51J6n9J49j68l1J75M8p7J13p9J8j0K08p8j69
$$ plain form
2273 -33 123 -58 -69 103 55 -174 121 236 169 54 -37 163 25 55 184 114 -165 168 76 -39 -250 276 -120
2296 -120 -88 -39 -22 -140 194 -85 -222 54 -251 89 -132 -81 63 19 71 87 -27 63 113 -88 53 -106 -75
2319 -75 -67 -101 -108 -286 28 -93 -5 -86 -22 167 -112 69 50 45 -32 61 103 213 68 265 -39 6 -177 -109 -31 -78
2345 -78 102 -114 -79 260 -337 -67 -142 112 181 -6 181 101 17 137 257 85 104 -16 -127 7 -49 -66 -135
2368 -135 -125 33 -227 -13 -84 -75 -277 -70 -66 6 132 -35 151 71 -43 34 24 143 -214 -68 11 127 -10 -259
2392 -259 -66 -134 -135 -13 37 42 -19 196 44 171 203 -12 64 36 128 86 51 -72 -37 124 -73 -269 48 95 39
2417 39 42 -135 -70 -53 229 50 71 220 -79 -26 -80 -68 -49 -23 -8 -35 -167 -141 87 -238 -40 0 36 -37 59 149
2443 149 -63 125 10 -89 33 68 122 -249 168 -221 47 61 -3 -33 111 -2 160 58 -51 82 35 -101
$$ packed form
2273c3J56j81j1J72m8k29K95J15o7j15r1K00j38L0J29p0k79L33r2j15k11N26l96
2296a20L2M9J7j18L34k79j37K76l05L40k21N1J44m4N2J6j14R0N0k01J41j59L1
2319g5Ql4pj78L14j21Q8q1O4J89k79J81j9np7R3M2J10j45J97l04M5j83O8P8m7
2345g8J80k16L5L39n97K70p5K54O9j87J87q0q4J20J20j72J9j20j11J34n6j7o9
2368a35J0J58k60K14p1Rk02K07MP2J26j67J86q0j14P7j0J19l57J46P9J16j37k49
2392b59J93o8jJ22N0No1K15j52J27L2k15P6k8R2m2l5j23L5J61j97j96L17M7n6
2417C9Lj77O5J7K82j79K1J49k99N3n4J2J9K6J5k7j32K6K28l25J98M0L6p3R6R0
2443A49k12J88j15r9J22L5N4l71M17l89K68J4o4l0J44j13J62j02j09J33m7j36
$$ plain form
2465 -101 11 101 -67 -77 50 190 130 166 32 114 50 5 136 -49 -372 -211 43 113 -73 2 -155 48 -208
2488 -208 -60 -43 42 184 273 78 64 -103 88 -180 99 -195 -238 -181 -41 -147 31 -63 -6 226 -158 120 112
2511 112 -49 78 -1 -38 -36 117 -99 -72 -34 42 -116 -155 53 -74 -193 32 -322 -59 35 -59 106 147 142 -59
2535 -59 6 31 33 142 98 79 113 -154 -33 -136 93 -105 -115 -166 103 30 -38 -294 58 269 90 -98 -156 -52
2559 -52 -153 -131 20 95 195 -163 -125 59 16 -185 -16 249 -6 291 -229 -20 10 -47 139 6 -28 354 162
2582 162 -296 262 -153 -15 52 25 152 -225 -36 46 -70 -12 51 4 -19 -58 -91 118 45 81 -12 80 145 -90 101
2607 101 -35 144 -39 172 -64 -150 -110 -162 -39 -241 60 -80 -100 -168 -195 -128 -143 0 62 74 131 -13 -68 -36
2631 -36 179 -118 45 243 -70 -39 -120 82 -161 -174 -11 67 -216 -95 81 48 -191 272 -22 194 33 21
$$ packed form
2465a01J12R0j68j0J27J40o0L6j34Q2o4m5J31j85l23J61K54P0j86P5j57K03k56
2488b08J48J7Q5J42Q9j95j4j67J91k68K79k94m3N7J40j06J78r4N7K32l84K78q
2511A12j61J27p9l7KJ53k16K7L8P6j58l9K08j27j19K25l54K63R4r4J65M1nk01
2535e9O5K5KJ09m4j9L4k67J21j03K29j98j0n1K69p3o8k56L52K11j79j88n8J04
2559e2j01K2J51P5J00l58L8J84m3k01J69K65k55K97n20K09L0n7J86j33l4L82j92
2582A62m58N58m15J38O7k7J27l77J89Q2j16N8O3m7k3l9l3K09p3L6r3R2O5k35J91
2607A01j36J79j83K11k36q6M0n2J23k02L01j40k0o8k7O7j5J43O2J2N7j44n5L2
2631c6K15k97J63J98l13L1q1K02k43j3J63P8k83J21J76l3k39M63k94K16j61j2
$$ plain form
2653 21 211 -202 -36 55 144 90 -92 -99 -91 -84 203 -20 15 -126 -165 138 166 -172 58 -158 -101 1 73 154 -39
2678 -39 -161 154 -143 -87 171 -8 -104 48 182 69 -79 257 82 -18 12 99 -43 -23 -36 113 10 14 127
2701 127 -42 -201 -136 -53 -241 -154 12 -18 154 75 -7 88 130 169 -26 -20 64 -47 -154 -90 47 -152 -25 15 27
2726 27 14 -68 -87 51 -140 -41 -66 49 108 212 99 180 26 208 40 -73 -12 16 -46 10 27 -151 -137 -15 25
2751 25 16 -89 -82 -51 -39 166 118 276 103 -80 197 248 132 46 273 81 -37 -68 -13 -63 -95 -115 -45 -17 -25 -122 -166
2778 -166 28 61 -67 88 130 2 60 29 28 137 -119 -2 122 157 57 73 79 68 -27 -158 44 173 -119 20
2802 20 330 -165 -62 -13 230 -73 148 139 16 -47 -96 -87 56 106 -20 135 96 -9 -69 -101 31 -30 -92 -35 99
2827 99 135 67 -20 131 -156 -112 -20 -77 -39 -31 41 -181 -105 45 -100 131 52 -102 -34 104 167 -168 364 87 195
$$ packed form
2653B1J90m13J66R1Q9n4j82pQPK87k23L5j41l9L03K8l38K30k16N7J02P2Q1j93
2678c9j22L15k97N6K58j79r6J52J34j13j48L36j75j00L0Q7j42K0j3J49j03MJ13
2701A27j69j59O5Q3j88Q7J66l0J72p9q2R5M2L9j95OQ4j11j07O4J37j99J27M0J2
2726B7j3q2j9J38j91R9k5J15N9J04j13Q1j54J82j68j13O1K8o2N6J7j78J4J22M0
2751B5rj05PL1J2K05m8J58j73j83K77N1j16q6K27j92j18l1N5n0l2k0P0K8qr7m4
2778a66J94L3j28J55M2j28N8l1jJ09k56J17J24L5j00J6Oj1r5j31K02J29k92J39
2802B0L10m95J03M9K43l03K21rj23o3m9RJ43N0j26J55l9j05o0l2J32o1o2N7J34
2827I9L6o8q7J51k87M4R2n7L8QP2k22P6J50j45K31p9j54O8J38O3l35N32k77J08
$$ plain form
2852 195 144 -95 179 -62 -220 -27 -127 -165 14 -266 4 137 -73 -12 6 36 31 240 129 118 207 26 180
2875 180 149 198 -7 -86 21 16 -52 -147 -246 -74 -4 134 84 80 177 28 12 3 74 -82 139 -171 52 199 -9 -195
2901 -195 164 20 -114 -79 -144 55 -173 -134 -109 -171 -113 118 56 20 52 190 -171 -86 163 160 -25 -139 70 254
2925 254 -143 -34 -60 -39 -87 -195 2 -74 336 -474 13 88 -44 -186 16 -16 25 24 -77 213 43 74 -257
2948 -257 26 -169 38 103 -76 133 -96 113 -67 77 223 107 36 34 -155 -30 257 33 -92 -32 57 -203
2970 -203 102 -160 29 30 66 -35 -95 12 162 -55 -161 -39 0 -133 -62 72 -85 -26 165 -96 60 131 -117
2993 -117 -104 -53 38 34 -158 -42 -24 108 230 -65 -192 -22 45 -223 6 32 41 -98 8 -24 -133 69 5 -184
3017 -184 -110 60 -157 -49 73 42 -7 144 -17 -116 28 191 -121 -186 -50 -133 40 88 64 57 -103 -104 -42 58
$$ packed form
2852A95n1k39K74k41j58J93j00l8J79k80K70J33k10O1J8L0nK09j11j1Q9j81J54
2875A80l1M9k05p9J07no8r5r9J72P0J38n0mR7j49j6rP1j56K21l10K23J47k08j86
2901a95L59j44j34L5o5J99k28L9K5o2N8K31o2l6L2J38l61Q5K49lj85j14K09J84
2925B54l97J09k6K1m8j08J97p6M10q10M87P5j32j42K02l2M1jj01K90j70L1l31
2948b57K83j95K07O5j79K09k29K09j80J44J46j16p1kj89J25K87k24j25O0Q9k60
2970b03L05k62J89JL6j01o0J07J50k17j06J22L9j33P1J34j57N9J91k61J56P1k48
2993a17J3N1R1mj92J16J8J32J22k95j27J70O7k68K29K6Rj39J06l2j09K02o4j89
3017a84P4J70k17J08J22l1m9J51j61r9J44J63l12o5J36q3J73M8k4pj60jO2J00
$$ plain form
3041 58 30 71 -137 -131 121 -68 -131 109 76 46 71 270 -199 -18 -126 -16 -210 170 122 -64 -115 -231 -111 84
3065 84 33 122 38 43 128 323 15 -146 -7 109 203 115 29 58 -39 128 182 -49 150 -201 -132 -52 140 96 -54
3090 -54 36 -141 28 198 64 180 -14 120 55 175 153 -254 62 113 -347 -139 147 -40 -256 -179 -46 -74
3112 -74 178 -28 142 56 152 247 11 142 82 80 -70 -137 -6 -69 25 36 -129 -26 -52 182 152 -60 24 -92 26
3137 26 3 92 147 -121 -91 116 -121 -10 49 -46 -76 -207 -157 23 -53 66 9 42 -81 40 -177 24 14 100 31
3162 31 -119 -8 -154 43 33 -238 -115 -67 25 -159 -70 106 -178 -20 -36 63 93 58 32 -8 -3 34 -20 157 54
3187 54 -31 36 -195 129 183 -123 90 22 -122 0 -135 -32 85 60 -77 26 125 -58 -112 24 -85 50 -70
3210 -70 -187 58 -90 -214 -18 40 209 16 78 46 61 -114 176 66 -21 119 16 -109 122 -65 68 131
$$ packed form
3041E8k8M1k08OK52j89o3K40l3l0K5J99m69J81j08J10j94L80m8j86n1j16J20J95
3065H4n1Q9q4NQ5J95l08j61J39J16R4q8q6K9r7J67N4k31J99l51O9Q0J92m4j50
3090e4R0j77J69J70j34J16j94J34o5J20k2m07L16N1m60K08K86j87k16P7J33k8
3112g4K52k06J70q6R6R5k36J31o0kj50o7J31o3R4J1j65J03k6K34l0k12Q4j16J18
3137B6k3Q9N5k68L0K07k37J11N9r5l0j31N0J80p6J19n7L3j23J21k17K01j0Q6o9
3162C1j50J11j46J97j0k71J23M8R2j84Q9J76k84J58j6R9L0l5k6m0NL7n4J77j03
3187E4q5O7k31L24N4l06K13o8j44J22j35J03J17k5j37J03R9j83n4J36j09J35j20
3210g0j17K45j48j24J96N8J69j93O2l2J5j75K90j10q7J40j03j25K31j87J33O3
$$ plain form
3232 131 -77 -107 -36 59 -49 -70 25 45 -62 -132 -205 -149 102 -44 72 -70 -223 179 33 -17 271 -87 74
3255 74 -238 76 46 -146 7 -188 141 -104 103 -8 12 -182 -55 13 62 -70 -171 256 -49 98 128 -44
3277 -44 -12 -49 -14 165 -218 100 -118 -179 -71 -128 7 -89 33 198 -169 153 -169 36 -24 33 186 30 23 59
3301 59 -96 -67 -27 -200 110 73 79 23 81 -139 97 -26 59 158 220 188 40 242 125 -143 94 94 -24 -102 56
3326 56 -60 14 37 144 -4 68 62 145 204 -33 -39 44 163 65 -47 15 73 59 -101 155 -55 32 -62 -184 26 28
3352 28 -36 -119 -109 81 -20 120 178 -136 37 -193 -4 -9 101 -145 41 -185 -10 113 -37 -85 -210 88 -8
3375 -8 33 49 16 -27 44 22 263 6 -102 110 187 1 165 -61 -23 -187 19 81 -99 -171 -82 151 0 61 -12
3400 -12 -40 -56 219 34 -61 129 52 8 -6 -298 -49 215 84 349 67 -25 -27 -17 -70 -270 10 -13 -111 -45 -68
$$ packed form
3232A31k08l0P1R5j08k1R5K0j07p0p3N6K51j46J16j42j53M02j46n0K88l58J61
3255G4l12L14l0j92J53j95L29k45K07j11K0j94J27O8M9j32j01M27l05J47L0j72
3277d4L2l7L5J79l83L18k18o1J08n7J35r6J22J65l67L22l22K05o0N7J53j56pL6
3301E9j55K9M0j73L10l7On6N8k20K36j23Q5R9O2l2j48K02j17k68K37%j18p8J58
3326E6j16P4K3J07j48P2oQ3N9k37oQ3J19r8j12O2N8j4j60K56k10Q7r4j22K10K
3352B8o4q3J0J90j01J40N8l14J73k30J89nJ10k46J86k26J75J23j50m8j25K98r6
3375hM1J6l3m3P1k2K41k57j08K12P7j86J64k26L8j64K06O2j80p2Q9K33j51O1p3
3400a2k8j6K75j85r5J90p7m4j4k92K49K64j31K65k82r2kJ0n3k00K80k3r8O6k3
$$ plain form
3425 -68 105 134 -46 124 92 -63 7 81 106 160 -70 26 49 230 -56 24 -23 120 66 -32 57 -42 -114 9 -83 127
3451 127 41 178 73 -70 122 -196 -34 -74 11 -138 -124 -78 -159 -71 -141 178 116 41 70 257 -136 -19 36 120
3475 120 -12 -146 150 -104 17 -229 -124 -53 -120 -56 127 -118 -224 2 -216 -174 26 -127 -76 -81 52 215
3497 215 -121 240 -82 69 -31 -129 158 36 31 95 -98 -33 304 141 -42 -45 -78 -227 -18 -28 -107 328 -23
3520 -23 38 97 35 -229 68 -174 -205 76 -108 10 -288 -24 -54 50 47 -25 -44 -25 -47 124 -51 -90 -102 19 -187
3545 -187 -7 -64 102 -26 83 139 110 -271 -25 -71 -111 -5 101 82 60 -82 8 167 128 192 99 61 -249 0
3569 0 -144 78 30 146 -177 186 128 -87 -75 59 -140 73 -72 205 54 179 94 33 -132 -87 141 90 -78
3592 -78 -110 87 -243 -66 -57 -107 35 131 -126 -125 89 123 -87 -278 -66 -109 -10 24 -2 36 -124 22 7 99 68 113
$$ packed form
3425f8J73K9j80J70l2j55P0P4K5N4k30R6K3J81k86Q0m7J43n4r8Q9r9p2J23r2K10
3451A27q6J37j05j43J92l18J62m0Q5j49J4M6q1Q8p0L19o2p5K9J87l93J17N5Q4
3475A20j32j34K96k54J21k46J05P1o7O4J83k45j06K26k18M2K00j53N1nJ33J63
3497B15l36L61l22J51j00r8K87j22nO4j93O5L37j63j83ll3j49K09j0p9M35l51
3520b3O1N9o2k64K97k42l1K81j84J18k98K64l0J04lp2j9J9k2J71j75l9j2J21k06
3545a87J80n7J66j28J09N6k9l81K46m6m0J06J06j9k2j42R0J59l9O4r3l8l10K49
3569@j44K22m8J16l23L63n8k15J2J34j99K13j45K77j51J25q5o1j65M5K28n1j68
3592g8l2J97l30J77Rn0J42R6k57JK14L4k10j91K12m3R9L4k6L8j60J46j5R2l1M5
$$ plain form
3618 113 -10 -242 -12 -114 272 14 -30 26 71 -70 -50 -25 42 211 27 -103 -12 2 87 -93 -40 67 53 -190
3642 -190 -162 -73 -93 -315 5 48 75 29 207 -74 203 137 -90 -161 17 46 -38 5 29 -96 -160 118 -33 59 -10
3667 -10 16 -81 -25 -79 -190 212 118 193 208 21 -62 -11 169 38 30 17 137 -101 45 -79 93 1 -146 -133 131
3692 131 87 -9 72 -138 142 -117 8 -120 145 -68 147 30 -112 -99 -39 28 -151 -23 18 5 -72 -154 -32
3715 -32 9 46 15 6 -8 117 129 68 61 79 -71 -117 -34 145 -72 -41 -96 37 -40 -44 -108 11 155 -54 41 340 -41
3742 -41 -48 -167 -28 -17 103 -107 92 -27 -169 36 30 -78 -34 -111 25 344 -17 -6 -112 -79 -163 48 -110 -136
3766 -136 157 -86 -175 145 -7 -153 -142 116 240 160 31 89 -155 -47 31 -165 80 -188 -84 63 -21 38
3788 38 -17 -50 114 70 -288 -20 -185 15 82 -287 -138 -37 172 94 -92 6 158 44 137 -4 195 237 -85
$$ packed form
3618A13j23k32K30j02L86k58m4N6M5j41K0K5O7J69j84j30R1J4Q5j80N3J07j4k43
3642a90K8Q9k0k22L20M3K7m6J78k81K77o6k27p1J78K9q4M3K4j25o4K78j51R2o9
3667a0K6r7N6n4j11M02r4P5J5j87q3N1J80j31qj3J20k38J46j24J72r2j47J3K64
3692A31m4r6Q1k10K80k59J25j28K65k13K15j17j42J3O0O7j79J28M1j3p7q2J22
3715c2M1L7l1rj4J25J2o1pJ8j50m6Q3J79k17L1n5J33p7mo4J19J44k09R5K99l81
3742d1pj19J39J1J20k10J99j19j42K05oj08M4p7J36L19l61J1j06L3q4K11j58k6
3766a36K93k43q9L20j52j46J1K58J24q0j29N8k44J08P8j96K45k68J04J47q4N9
3788C8n5l3J64m4l58K68j65K00O7l69J49J01K09p8j86R8J52j14R3j41J99M2l22
$$ plain form
3811 -85 64 40 68 -107 -53 64 -13 24 -33 183 176 11 -79 102 -31 224 53 -151 -124 -111 -244 -53 -14 18 68
3836 68 -165 226 175 -97 9 22 -17 -18 -61 97 -24 -184 -129 31 -105 52 -57 0 217 -3 147 24 215
3859 215 -31 -72 -18 23 -122 -140 -77 34 180 315 -99 -51 -30 147 -46 181 -26 -63 -66 -111 -165 -78 -129 -34 55
3884 55 16 228 -251 -63 -97 204 -249 -32 40 -96 -83 -123 33 171 70 60 65 214 -74 -125 -155 59 -184 -206
3908 -206 -98 -72 -21 -127 127 -9 43 -20 88 34 26 -43 114 5 46 -49 -267 60 -127 -50 122 -14 135 2
3932 2 -54 129 -78 -51 -14 -253 -106 7 -65 -75 48 79 -87 24 -26 -101 -89 8 37 -75 18 163 49 -78 30
3957 30 -335 -5 -2 115 -57 -102 108 5 79 -41 31 -47 -61 -10 112 -137 -217 11 -114 -15 42 -52 -83 0 124
3982 124 -170 55 -86 -42 99 24 142 50 31 -260 35 104 -81 56 33 -22 -86 201 159 -27 -111 118 121 203
$$ packed form
3811h5J49k4K8j75N4J17p7L7n7K16pj65r0J81j33K55j71k04K7J3j33J91L9L2N0
3836F8k33L91n1k72J06J3l9jm3J58j21j60N5J60j36J57j09N7K17k20J50j23J91
3859B15k46m1N4M1j45j8O3J11J46J35m14M8K1J77j93K27k07l7lm5n4Q7n1R5Q9
3884E5l9K12m79J88l4L01m53K17P2j36J3m0J56J38j01j0NJ49k88n1l0K14k43k2
3908b06J08K6N1j06K54j36N2o3J08n4qo9J57j09M1r5k18L27j87P7J72j36J49j33
3932Bn6J83k07K7L7k39J47J13p2j0J23L1j66J11n0p5J2R7K9j12R3J45j14j27J08
3957C0l65L30LJ17j72m5K10j03P4j20P2p8j4N1J22k49q0K28j25R9N7r4l1Q3J24
3982A24k94K25j41M4J41p5J18r2j9k91K95O9j85J37k3n5o4K87m2j86q4K29LQ2
$$ plain form
4006 203 -134 -18 116 121 12 -8 -184 -235 -79 64 -92 -108 -215 120 155 -4 37 -192 165 22 -80 24
4028 24 -47 -66 270 40 -173 82 -2 -160 -117 151 -14 -13 55 173 -5 94 83 -208 37 -70 122 -118 197
4051 197 221 -24 101 -178 79 43 315 181 59 160 -332 94 10 -37 -85 -150 -25 -33 129 -12 -151 -142 48
4074 48 140 104 18 107 60 39 -6 -132 189 181 226 -253 16 -68 75 145 -68 27 117 -19 -320 -153 79 -22 -78
4099 -78 20 -201 166 -93 -44 192 -40 77 79 -141 -48 55 97 -257 -30 15 34 158 81 -20 -9 169 -73 -275
4123 -275 -160 44 -41 181 -78 -47 -181 71 -118 9 -84 -160 -145 149 39 -31 227 -194 125 27 25 27 -81 5
4147 5 -268 -3 -43 -18 -129 -13 83 -61 111 92 -169 39 -75 -111 -27 -75 -101 -113 30 50 -14 -41 -85 -38 -83 -44
4173 -44 27 -134 132 -83 108 -49 61 -60 -20 16 -88 40 38 99 55 -90 96 95 -38 -163 -165 -57 127 4
$$ packed form
4006B03l37J16J34Nj09k0j76n1J56J43j56j6j07L35L5j59M1k29L57j43j02J04
4028B4p1j9L36k30k13K55q4j58M3K68j65JO8J18j78R9j1k91K45j07J92k40L15
4051A97K4k45J25k79K57l6K72j34j22J01m92M26q4m7m8o5J25qJ62j41j39RJ90
4074D8R2l6q6Q9m7k1m5j26L21qM5m79K69q4J43P0k13R5R0j36l01J67K32j01n6
4099g8R8k21L67k59M9K36k32J17Kk20R3J03M2l54K27M5J9J24p7j01J1J78k42k02
4123b75J15K04q5K22k59L1j34K52j89J27r3p6J5K94j10p0K58m21L19r8kKj08Q6
4147Ek73K65m0K5j11J16R6j44J72j9k61K08j14l6Q4m8k6j2J43K0o4k7m4M7m5L9
4173d4P1j61K66k15J91j57J10j21M0L6j04J28kO1m4j45J86jj33j25kJ08J84j23
$$ plain form
4197 4 22 -105 114 -112 61 106 -8 29 -209 259 208 20 38 88 137 -270 -127 66 115 -10 17 -65 -106 -225
4221 -225 -1 -51 -90 -125 -89 -14 57 -19 1 81 154 -24 87 49 -231 -85 168 -1 26 -148 55 202 196 -155 253
4246 253 -130 -95 -58 -146 118 -207 -24 -169 -114 -18 58 75 283 -47 60 3 70 78 -85 118 -7 -16 -78 -97 41
4271 41 -18 -44 32 -56 43 24 59 -153 119 79 167 -114 91 -288 -218 51 10 69 -101 153 -80 -50 -40 -97 -150 -109
4297 -109 -7 18 -58 -215 -40 201 96 -145 -127 -3 160 -5 -23 72 -151 -27 -33 -99 -37 -65 -96 47 -80 -125
4321 -125 -18 39 -130 206 146 -173 104 -101 -28 28 57 40 -222 29 -78 110 67 -12 -135 109 -162 87 10
4344 10 34 27 -234 74 -105 18 -102 -212 -134 78 -158 52 -87 -21 -94 17 30 7 156 47 -146 -134 193
4367 193 4 -7 -255 -9 -9 92 6 27 79 271 24 129 41 45 -85 54 113 -42 -22 -163 -181 50 -189 172
$$ packed form
4197DJ8j27K19k26J73M5j14L7k38M68n1j88J8N0M9m07J43J93M9j25K7q2m1j19
4221b25K24n0l9l5L6P5P1p6K0Q0P3j78J11l8k80J46K53j69K7j74K03J47ol51M08
4246B53l83L5L7q8K64l25J83j45N5R6P6J7K08l30J07n7O7Qj63K03j25ro2j9J38
4271D1n9k6P6q8R9j9L5k12K72m0Q8k81K05l79P0K69m1N9j70K54k33L0J0n7n3M1
4297a09J02K5p6j57J75K41j05k41J8J24J63j65j8R5k23J24oo6O2k8l1J43j27m5
4321a25J07N7j69L36o0l19K77k05P3N6K9j7k62K51j07J88m3p9j23K44k71K49p7
4344A0K4pk61L08j79J23j20j10P8K12k36K10j39O6p3J11J3k3J49j09j93J2L27
4367A93j89j1k48K46%J01q6K1N2J92k47J05q8Mj30J39N9j55K0j41j8K31k39L61
$$ plain form
4391 172 196 -76 89 34 -42 -170 26 172 -23 -26 22 149 76 106 67 -124 192 -128 -100 356 -47 -111 -88 -114
4415 -114 -60 -129 -41 -7 -124 -184 211 71 -4 255 198 -302 -98 -78 27 130 148 -7 54 -39 5 -121 28 91
4439 91 103 -53 -79 14 -212 -172 62 55 84 54 -5 150 104 110 -126 -57 141 60 12 -92 76 5 -40 53 43 95 2
4466 2 -167 -34 -123 -150 -55 27 64 -100 -54 -29 18 131 -109 -113 -121 175 -69 -104 127 -28 -108 -155 -68 -74 -59 155 51
4493 51 180 -133 -107 -121 -58 264 -54 -32 116 -135 118 -85 -114 -83 -50 -15 160 273 -83 -13 -46 -88 60 13
4517 13 121 117 12 81 79 132 -199 17 -10 188 258 -167 -164 -54 150 -140 155 -120 36 -175 156 -99 -60 -19
4541 -19 1 76 14 -120 -204 235 -186 86 -195 68 139 -172 8 319 -17 61 -290 75 -212 -33 41 -4 -124
4564 -124 -94 72 -145 -101 -204 -136 226 -43 48 -93 -180 -124 -64 -190 -162 167 -8 -201 16 77 16 -25 175 28
$$ packed form
4391A72K4k72J65n5p6j28J96J46j95lM8J27p3L0l9j91L16l20K8M56m03o4K3k6
4415a14N4o9Q8L4j17o0L95j40p5K59n7n00K04K0J05J03J8j55O1r3M4j26J49O3
4439I1J2j56k6R3k26M0K34pK9l0n9J55m6Ok36O9J98q1m8j04J68p1m5R3j0N2r3
4466Bj69J33q9k7R5Q2L7j64M6K5M7J13k40mqK96k44l5K31j55q0m7Q7oJ5K14j04
4493E1J29l13K6j4O3L22l18K2J48k51K53k03k9L1L3L5J75J13l56P0l3m2J48m7
4517A3J08mj05O9kN3l31K16k7J98P0m25LJ10K04k90K95k75J56k11L31k55L9M1
4541a9K0P5o2j34q4M39m21K72k81K63P1l11J80L11l36P8l51L65k87J79P4m5j20
4564a24L0J66k17M4j03O8L62k69R1j41q7N6O0j26K8L29j75j93K17O1o1m1K00j47
$$ plain form
4588 28 32 -45 96 49 93 189 -206 97 -128 122 -155 -75 185 43 156 -50 -188 -11 -18 -162 -106 171 96 103 40
4613 40 56 118 -70 -57 -21 -63 -70 70 -25 -114 -46 297 46 -224 -17 11 34 1 -225 -58 -27 -66 65 31 65 108
4639 108 -1 181 53 -78 -34 -59 27 -83 -105 -129 -135 -138 -67 27 1 -79 64 157 43 -30 18 -4 -36 -5 -36 -146 10
4666 10 142 -25 64 47 -141 -14 38 104 31 194 95 -51 -21 -15 92 5 239 64 42 192 -13 -173 -46 -43 186
4691 186 175 -134 -24 10 -252 4 53 2 -42 -6 -20 -91 28 169 36 152 -74 -156 0 134 51 -93 -41 -93
4715 -93 108 -10 -29 -11 12 -33 5 -80 56 65 130 -133 -87 157 27 -77 93 -75 8 25 100 56 4 265 -46
4740 -46 87 -107 104 63 85 29 -131 68 57 46 67 36 -81 -21 -42 16 107 24 67 137 -1 148 17 -79 -54 113
4766 113 108 -31 86 -14 -39 93 -31 62 116 -69 229 44 161 -49 102 19 34 -96 -44 -169 233 -7 105
$$ packed form
4588B8Mp7J41m7M4R6l95L03k25K50k77Q0K60j42J13k06j38J77pj44N6K77p5Po3
4613D0J6O2j88J3L6m2pJ40r5q9O8L43k51k70K07K8K3l3k26J67L1l9J31l4L4M3
4639A08j09J82j28j31M4k5Q6j10k2k4olP1R4k6q0J43R3j14p3M8k2l2L1l1j10J56
4666A0J32j67Q9j7j88J27N2O6p3J63r9j46L0OJ07q7K34j75k2J50k05j60J27LK29
4691A86j1l09J10L4k62K56M9n1m4L6j4p1J19J41j33J16k26q2J56J34q3j44N2n2
4715i3K01j18j9J8K3m5L8q5J36RO5k63M6K44j30j04J70j68Q3J7P5m4n2K61l11
4740d6J33j94K11m1K2n6j60J99j1j1K1l1j17O0k1N8R1q3M3P0j38J49j31r6K5J67
4766A13nj39J17j00k5J32j24R3N4j85K98j85J17k10J51q3J5j30N2j25M02k40J12
$$ plain form
4789 105 51 -322 -18 1 -308 -277 2 43 42 83 -53 113 -178 -141 7 143 66 -84 115 112 -16 -5 8 103 57
4814 57 32 -72 7 7 -12 -42 187 -28 91 -65 254 4 -147 246 103 -12 76 -39 72 -10 -48 297 145
4837 145 72 147 -134 -30 -78 -147 29 25 129 85 -101 111 159 -184 58 23 121 171 -59 104 151 156 41 -172 208
4862 208 -90 209 -26 -19 57 20 -17 -167 172 -40 170 92 -25 94 -39 -42 -49 23 25 110 -241 -59 -107 -76 -19 -261
4888 -261 80 25 -234 -45 185 -87 -153 -28 23 84 -146 -15 87 68 2 -118 5 26 168 60 8 93 29
4911 29 74 93 134 -76 231 -104 72 215 102 -69 130 -84 -117 -182 -95 16 -19 56 -135 28 24 -96 18 -155
4935 -155 58 -95 42 39 -124 14 51 224 12 21 7 16 -77 -4 -201 142 -71 63 47 -8 -161 22 -21 -65 -125
4960 -125 -115 60 42 68 28 93 14 207 -117 -12 18 25 -37 -153 55 -231 -62 60 -58 189 -206 -14 128
$$ packed form
4789A05n4l73L04J9l09L1K79M1jM1j36J66k91L7J48J36p7j50J99lj28J1J3R5m6
4814E7k5j04P9%j9l0K29k15J19j56L19k50j51L93j43j15Q8j15J11q2l8L45j52
4837A45p3P5k81J04m8o9J76mJ04m4j86K12M8l43K42l5R8N0k30J63M7Nj15k13L80
4862B08k98K99k35PP6l7l7j50L39k12K10p8j17J19j33lpP2KQ5l51J82m8L1N7k42
4888b61L41n5k59J89K30k72o6J25N1O1k30J31J02j9o6j20J23K1J42j08n2Q5o4
4911B9M5J9M1k10L07l35J76J43j13j71J99k14l3o5Q7J11l5P5j91J63mj20J14j73
4935a55K13j53J37lj63J38L7J73k12Rj4Rr3P3j97L43k13J34j6n5j53J83m3m4o0
4960a25J0J75j8K6m0O5p9J93l24J05L0Po2j16K08k86J69J22j18K47l95J92J42
$$ plain form
4983 128 160 251 -13 -5 41 39 120 18 43 -13 130 13 70 -163 -38 2 53 -92 -191 -36 39 37 203 216 -39 -34 45
5010 45 -2 144 -16 -40 47 -79 254 100 -32 -148 -65 -29 -124 -61 -62 158 25 -199 189 -83 42 0 -147 62
5034 62 -76 74 77 -53 113 -135 -58 134 0 110 231 -79 62 115 67 -50 -171 -195 31 -18 13 3 24 -117
5058 -117 -127 -6 -127 158 -128 37 137 -135 -15 -123 125 -149 -177 70 -46 131 7 -70 -224 -164 -55
5079 -55 104 15 106 -22 -176 -69 259 36 12 135 -172 -229 -63 88 -142 176 -101 -194 125 -115 19 -40
5101 -40 106 41 -182 -85 40 -65 -163 49 127 115 -99 150 -11 -27 -97 20 -152 118 52 18 -55 43 85 -187
5125 -187 -68 17 80 53 100 93 -62 -71 -45 149 -139 199 177 -85 39 -214 20 -236 -7 115 -93 -47 -8 -65
5149 -65 -116 163 2 -88 44 -56 81 -145 -90 157 75 -273 79 51 -246 58 -96 50 24 -111 -29 -50 -38
$$ packed form
4983A28L2R1k64QM6kQ1j02K5n6J43j17N7k33J25M0N1j45r9J55P5kJ66J3k55NP9
5010D5m7J46j60k4Q7j26L33j54j32j16Q3L6r5O3jK20j33k24L88k72J25m2j47K09
5034F2j38J50Lj30J66k48P7J92j34J10J21l10J41N3m8j17j21k4K26m9L1j0K1j41
5058a17j0J21j21K85k86J65J00k72J20j08K48k74k8K47j16J77j24p7j54O0J09
5079e5J59q9R1j28j54J07L28k23k4J23l07n7J66J51k30L18k77r3L19k40J34n9
5101d0J46o5k23R7J25j05r8K12P8j2k14K49j61j6p0J17j72K70o6l4p3R8M2k72
5125a87J19Q5O3k7M7pj55rK6J94k88L38k2k62J24k53K34k56K29J22k08M6L9n7
5149f5n1K79j61r0J32j00J37k26N5K47q2l48L52k8k97L04j54J46k6j35Q2k1J2
$$ plain form
5172 -38 140 0 76 -6 147 61 132 196 145 92 -118 -117 -93 -25 210 140 -149 -162 105 -167 -54 -79 107 6 129
5197 129 18 -113 -137 33 95 173 32 312 144 -181 -102 -5 -72 -109 0 -95 -22 84 -63 140 243 39 19
5220 19 55 77 71 65 44 -33 75 54 -179 -130 41 51 -192 -13 -238 -31 75 -136 106 -73 140 -31 -284 -77
5244 -77 30 123 -20 -122 159 129 -131 41 -110 46 245 -2 9 50 -112 -4 -291 -156 -53 98 -137 -138
5266 -138 -41 -125 0 62 -75 -80 -16 0 -192 -82 -2 -207 191 190 77 116 52 173 -108 80 85 115 -15 27 -35 18
5292 18 134 73 102 123 -67 -115 46 257 212 168 199 134 94 -149 204 -117 -40 9 25 142 -2 115 -180 148
5316 148 -93 -118 -40 180 35 -262 69 -20 -54 -71 79 135 -117 -42 31 -133 -168 17 -15 90 -129 -221 40 28
5340 28 -168 94 103 85 66 -50 -40 -42 171 -141 -59 26 1 93 14 -181 62 -112 -89 -42 28 55 -48 72 56 222
$$ packed form
5172c8J78j40P6q2J53q6P1O4n1n3k10JK4O8K35p0k89j3K67k72J13k5J86j01J23
5197A29j11j31k4J70O2P8j41K80j68l25P9R7o7l7J09r5P3J06j47K03J03k04k0
5220A9L6K2ook1p7J08k1k33M9J71J0k43J79k25K07J06k11K42j79K13j71k53K07
5244g7J07R3j43j02K81l0k60J72j51J56J99k47J1M1j62J08k87J35J03J51k35j
5266a38R7q4J25O2j37nO4J6j92J10Q0k05L98jj13L9o4J21k81J88NL0j30M2o2N3
5292A8J16o1K9K1j90m8J61K11m5m4L1o5m0k43L53l21P7M9J6J17j44J17k95L28
5316A48k41k5P8K20j45k97L31q9l4j7J50N6k52P5P3j64l5J85l2J05k19r2K61j2
5340B8j96K62Rj8j9j16J0kK13l12Q2Q5k5R2p9j95K43j74K3M7P0K7j03J20j6J66
$$ plain form
5366 222 -201 -89 186 -70 -133 75 -139 -28 -197 156 -429 146 -22 6 53 91 -206 -128 -139 -149 20 -16 50
5389 50 -84 51 -18 -43 5 141 275 -81 48 -106 118 -101 164 3 -137 28 73 181 36 -100 19 -138
5411 -138 4 42 130 116 52 -31 -37 37 67 -174 -2 97 -8 88 -55 8 62 24 33 -246 -9 -68 4 25 -87 107
5437 107 -92 59 -68 -147 124 137 119 -13 -37 -67 76 47 258 -7 -15 292 144 179 153 226 -55 191 79 -158
5461 -158 -54 29 188 -10 -24 -38 167 -72 87 -1 190 223 108 72 377 -80 -92 32 59 -102 -80 -67 21 52
5485 52 124 -80 56 202 10 -26 -100 56 79 -3 15 60 -25 -27 99 11 104 50 -104 26 145 -99 -10 140 17
5510 17 60 -89 140 -112 7 -97 70 -124 -227 -53 61 43 72 -129 -191 -79 -58 -25 40 207 71 73 -90
5533 -90 -23 133 94 -30 167 -100 -14 -27 3 153 -92 -101 -274 -81 -43 93 -207 -65 -137 -138 284 11 -34 -29 5
$$ packed form
5366B22m23J12K75k56o3K08k14J11j69L53n85N75j68K8M7L8k97P8j1j0J69l6O6
5389E0j34J35o9k5M8J36J34l56J29j54K24k19K65j61j40J65M5J08j45j36J19j57
5411a38J42L8Q8j4o4q3oP4L0k41J72R9j05R6j43O3N4l8Rk79K37n9P2K1j12J94
5437A07j99J51j27p9K71J3j8j32k4l0J43k9K11k65qL07j48L5k6P3k81K46j12k37
5461a58J04Q3J59j98j4j4K05k39J59q8J91L3j15l6L05m57j2J24K7j61K2J3Q8L1
5485E2P2k04J36J46j92l6p4J56K3q2J8M5q5kJ26q8R3n4j54J30J19k44Q9J50j23
5510A7M3j49K29k52J19j04J67j94j03J74J14j8K9k01o2J12K1L3O5J67j36Kj63
5533i0O7J56l9j24J97k67Q6j3L0J50k45rj73J93L8J36l00J42p2jM22k73m5NL4
$$ plain form
5558 5 -64 151 -10 -28 -215 15 -184 -202 -72 18 -108 -135 175 66 -230 -13 -128 111 243 -205 72 -43
5580 -43 93 -153 -219 107 -182 -41 82 -41 -296 -9 60 -6 -83 81 -107 97 2 120 15 -3 152 -143
5602 -143 98 128 213 -99 213 -29 60 -59 105 150 -38 79 60 6 25 -20 -74 -90 -104 87 -146 105 -42 91
5626 91 42 -76 163 154 -143 88 -60 41 43 143 -49 239 123 -70 43 -200 -40 -275 -74 -79 107 -136 -114
5649 -114 89 133 -54 130 -25 -94 -23 199 128 143 188 -113 97 -78 188 -121 -141 127 -160 15 229 -96
5671 -96 -85 -47 91 146 95 28 170 -17 -131 -11 -20 -175 35 28 -105 -176 -139 104 2 -159 -99 137 -4 120
5695 120 -145 179 -18 -149 -159 -48 -54 -73 231 -95 216 2 208 58 -9 -1 38 -90 -70 163 264 234 -26
5718 -26 -19 -141 -8 -326 47 34 -145 -17 -95 169 -172 32 34 -77 159 21 -161 -93 106 -190 -54 -54 203
$$ packed form
5558Eo9K15j61j8j87K30j99j8J30R0j26k7L10j09k96K17j15K39J32m48K77j15
5580d3J36k46o6L26k89J41J23j23k55K87O9o6p7J64j88K04r5J18j05j8J55k95
5602a43K41L0Q5l12L12k42Q9j19J64M5j88J17j9n4J9m5n4j6j4J91k33K51j47J33
5626I1m9j18K39rk97K31j48J01KJ00j92K88j16j93J13k43J60k35K01nJ86k43K2
5649a14K03M4j87J84j55o9P1K22p1J5M5l01K10j75K66l09k0K68k87J75K14l25
5671i6J1L8J38N5n1o7J42j87j14J20rj55K10pj33p1L7K43j02j61O0K36j41J24
5695A20k65L24j97j31j0J11oj9L04l26L11k14K06j50o7QL9j28K0K33J01l0k60
5718b6Pj22J33l18L73j3j79J28p8K64l41K04Kj11K36j38j82O8J99k96J36%K57
$$ plain form
5741 203 150 -137 12 56 -159 75 170 -38 -5 131 47 26 -50 111 -57 -154 -84 45 95 -86 -21 258 -171 89
5765 89 -69 -199 2 74 -356 62 1 34 139 45 -13 -27 67 -90 65 -149 -123 -48 146 133 0 -101 -192 256
5789 256 -281 41 -51 -34 24 35 69 -120 -186 44 -41 -131 -115 -204 102 62 -110 -52 38 -39 -94 -46 -63 -78 -158 101
5815 101 -77 -36 -79 -112 16 235 -111 110 98 135 -57 -41 192 1 -45 -33 62 138 21 19 119 50 43 -209 0
5840 0 4 128 30 10 109 244 17 29 207 -5 18 123 225 0 -38 43 -184 -80 41 -32 113 -134 -55 31 131
5865 131 -256 -24 -5 -41 -147 12 16 200 -134 178 254 -274 -83 104 -42 -48 230 -52 116 79 23 -174 -38
5888 -38 96 43 105 31 103 120 -243 53 -219 5 -25 107 142 164 -189 1 42 118 -214 -201 -14 -7 -15 -165 5
5913 5 5 108 -22 99 163 33 115 -103 55 -260 4 93 37 -154 57 -28 68 -168 -10 87 3 40 230 -19
$$ packed form
5741B03n3k87J49M4k15K34R5k08L3J36q4k1p6J61j68r7P0J29N0j81O5K79m29K60
5765H9j58j30K01P2m30M18o1L3J05r4n8j4R4j57J55k14K6P5J94j3j33j01r1M48
5789B56n37L22r2J7N8J1L4j89o6K30q5r0J6q9L06m0j72N8R0p7n5M8j7j5q0K59
5815A01j78M1m3l3J28K19l46K21j2L7j92J6K33j91m6J2R5P6j17kJ00o9pk52K09
5840@MJ24r8k0R9J35k27J2J78k12K3J05J02k25l8Q1k27J04J21p3J45k47P9Q6J00
5865A31l87K32J9l6j06J59MJ84l34L12P6n28J91J87j46oK78k82J68l7n6j97J36
5888c8J34n3O2p4P2J7l63K96k72K24l0J32L5K2l53J90M1P6l32J3J87Pqj50J70
5913E%J03j30J21O4j30Q2k18J58l15K64Q9n6j91K11q5R6k36J58R7q4L7J90k49
$$ plain form
5937 -19 -174 -88 34 139 42 -32 -91 136 -98 -32 3 -117 -44 -34 -247 -170 55 -42 -104 127 -84 39 -142 -180
5961 -180 -80 -225 150 161 148 175 13 -71 -203 24 -67 131 102 87 -40 -51 -131 11 -97 92 -41 6 -59 77
5985 77 183 74 123 -61 -121 154 -160 35 -89 -216 -18 -79 68 -9 -172 94 23 12 66 -113 160 36 -68
6008 -68 -291 -19 346 -131 -12 -106 -130 -19 -36 -74 -78 -83 36 -235 173 31 203 -33 -28 139 53 86 65 16 -36
6033 -36 -271 -105 140 -167 -149 -58 62 -194 75 -22 226 -192 5 283 168 -55 -147 76 -50 6 -15 -2 -134
6056 -134 59 20 -185 134 -7 176 -46 -7 189 -110 -92 -75 -143 22 -85 -73 56 125 -131 -52 221 -121 -68
6079 -68 -5 294 -88 26 67 59 143 17 86 -146 -1 -186 28 -53 -15 72 29 -38 -232 -37 -130 121 -98 -180 -97
6104 -97 -3 -94 -135 92 68 -57 -121 -135 27 -95 -68 7 -387 -15 -64 -73 -186 6 -121 10 57 41 -67 -78 -2
$$ packed form
5937a9j55Q6J22J05r7p4n9K27k34O6L5j20P3J0k13P7K25r7o2K31k11J23j81l8
5961a80J00j45L75J1j3K7j62q4j32K27r1J98k9j5j27j1q0J42j08J89j33M7o5J36
5985G7J06j09M9j84o0K75l14J95j24j27J98o1J47p7j63K66p1j1N4j79K73j24j04
6008f8k23K72L65m77J19r4k4J11j7l8mnJ19k71M08j42J72k36NJ67q6L3k1m9n2
6033c6k35J66K45l07J8R1J20k56K69r7K48m18J97K78j15k23r2K23j26N6k1J3j32
6056a34J93l9k05L19j41J83k22L9J96k99J8J7o8J65j07J2J29O9k56P9K73l42N3
6079f8O3K99l82J14M1qQ4j26O9k32J45j85K14q1L8Q7m3o7j94J95r3K51k19q2Q3
6104i7R4r1m1K27k4j25o4j4J62j22K7P5l94L72m9rj13J92j27J31M7j6j08j1P6
$$ plain form
6129 -2 -25 135 57 -170 -15 170 -296 -30 -169 -136 -197 -14 30 99 26 15 -27 -108 -78 -25 38 101 24 -239 -24 -154
6155 -154 57 61 85 -68 -131 -27 144 176 -41 -48 117 -70 75 -114 -60 -61 -107 131 -174 -24 77 -129 22 -88
6179 -88 -129 55 87 57 129 57 -3 57 3 183 -148 -13 -65 -217 -121 -69 59 -17 109 58 -63 73 -157 -34 -15
6204 -15 -199 36 -70 29 -62 46 143 11 -126 -137 -96 -253 -42 174 49 -210 -65 -116 -1 -166 -61 136
6226 136 21 -186 -2 61 -88 36 127 115 -175 125 161 41 -134 -165 -181 -152 191 -60 -56 -164 -110 -156 -132 -78
6250 -78 152 -134 -33 -76 63 -49 -16 -70 -56 -160 -40 -43 -126 40 67 -28 30 -97 -92 57 -49 -27 -2 94 20 106
6276 106 -9 -4 -221 28 -29 -192 -145 204 14 -141 134 -231 80 179 28 -104 -63 -80 -60 -32 110 -105 -26
6299 -26 -23 -35 -107 -30 105 -99 199 -76 -169 -91 59 158 -177 -33 -99 141 -149 -84 -207 21 -54 -214 -44 6
$$ packed form
6129bk3J60p8k27J55J85m66K66j39L3o1J83M4O9p3j1m2q1L0N3O3O3p7k63K15j30
6155a54K11MK4j53o3J04J71L2k17pJ65j87J45j89N4jm6K38l05J50J01k06J51j10
6179h8m1J84L2l0P2p2o0O0n4J80l31J35n2j52R6N2J28p6J26n1j21J36k30J23J9
6204a5j84K35j06R9r1J08R7j32j37j1M1j57K11K16j25k59J45n1J15j65J05J97
6226A36j15k07J84O3j49J24R1j2k90L00L6j20j75l1j6K9L43k51Mj08N4m6K4N4
6250g8K30k86J01m3J39j12L3n4J4j04J20lq3J66K7r5N8j27NJ49j06K2K5R6p4Q6
6276A06j15Nk17K49n7j63M7L49j90j55K75l65L11R9j51j32M1j7K0K8J42k15P9
6299b6Lj2p2P7J35k04K98k75r3P8J50R9l35J44o6K40k90O5j23K28p5j60J70N0
$$ plain form
6323 6 28 29 152 -201 115 -155 2 -62 75 -184 150 129 6 184 -174 -93 169 78 -17 -9 -184 -6 29 147
6347 147 -24 -69 -50 18 252 84 43 -111 -16 -73 -48 -55 -5 150 11 100 -9 -33 -37 -118 14 153 34 -73 -215
6372 -215 -112 -13 -15 266 -88 -75 170 -243 48 157 -9 -116 19 -64 -317 69 62 7 -54 5 -62 -67 190 -99
6396 -99 -8 41 66 41 -56 12 -178 157 -96 54 -60 266 135 8 -51 1 -95 -20 -109 -10 -94 -35 35 23 137 94
6422 94 208 216 -121 11 -32 -2 78 -22 113 -267 74 -253 30 146 75 -119 -12 -26 -121 -8 -25 -60 97 -85
6446 -85 -61 32 107 -63 23 120 -44 14 -36 103 64 54 59 -54 32 136 142 -50 -13 85 -109 -234 -175 -184 123 165 160 202
6474 202 -122 110 -118 23 65 -43 -25 69 33 -129 58 -21 -69 216 70 -159 -28 73 -131 -190 -173 60 195
6497 195 -155 1 -153 30 37 18 -254 -111 20 -195 -13 59 37 -11 -131 15 62 -28 -123 109 154 257 41
$$ packed form
6323FK2JJ23l53L16k70J57o4J37k59L34k1j23J78l58Q1K62r1r5Qj75J78L5J18
6347A47j71m5J9O8K34j68m1j54R5n7K5pN0J55j39Q9j09k4mq1J32J39j19j07j42
6372b15J03R9kK81l54J3K45m13K91J09j66j07J35q3k53L86pn5o1N9o7nK57k89
6396i9R1M9K5k5r7O8j90L35k53J50j14L26j31j27n9N2r6P5q9R9q4N9P0j2J14m3
6422I4J14Ql37J32m3L0Q0j00J35l80L41l27K83J16p1j94J07j4r5J13j7l5J57j82
6446h5K4R3P5j70Q6R7j64N8n0J39l9j0Nj13Q6J04Oj92L7R8j94j25N9rL07M2nM2
6474B02l24K32k28J41M2j08J8R4l6j62J87p9m8K85j46k29J31J01k04n9J7K33J35
6497A95l50J56j54J83Pj9k72J43J31k15J82P2k2m8j20J46M7r0r5K32M5J03k16
$$ plain form
6520 41 90 -123 131 -291 90 180 -189 12 11 -37 -117 -1 37 76 66 -37 -24 14 -3 114 0 -9 -171 146 25
6545 25 46 155 -91 12 137 139 33 -81 99 -151 184 38 -43 48 -135 -29 -149 -67 97 -43 254 61
6567 61 -19 11 -31 10 -162 -72 -154 -7 24 -142 -259 42 90 -211 -53 228 134 63 174 -3 -76 152 -100 1
6591 1 -18 -96 140 -47 42 -143 -47 262 124 -6 132 -1 -92 33 -51 105 76 -242 184 40 -40 -90 -20 72
6615 72 -32 -114 44 58 83 124 -154 166 31 39 -61 5 18 -147 255 155 144 -149 -1 163 115 -92 29 56
6639 56 99 0 -110 112 70 -265 -56 -230 -12 -40 95 8 -104 -186 16 -87 -81 -125 116 20 -73 87 35 -146
6663 -146 -103 80 -100 77 55 67 125 -3 -54 30 -179 -96 173 22 -188 21 1 -180 -39 39 -2 -34 3 42
6687 42 242 -92 31 -8 -209 -132 -9 -274 -129 177 -124 89 65 113 56 97 7 52 -157 111 -80 -31 41 -139
$$ packed form
6520D1M9k13K54m22L81R0l69K01jm8q0J16L8L9j0j03J3L8j7J17j14rj62L17j21
6545B5K1J09k46J03J25Kj06j14J80k50L35j46q1R1j83J06j20Q2J64j40K97j93
6567F1q0L0m2M1j72R0q2J47L1j66j17L01M8l01J58K81r4p1J11j77p3K28k52J01
6591Aj9p8K36j87Q9j85R6L09j38j30J38j33r1J25q4J56k9l18M26j44q0n0P0R2
6615G2j04q2J58J4K5M1k78L20j35Qj00O6J3j65M02j00j1k93J48J64m8k07J21K7
6639E6M3r9j10K22m2l35K09j74K18k8J35q7j12q2K02j03Om4K41r6r3J60n2j81
6663a46M3J83j80J77k2J2N8j28n1Q4k09Q3K69j51k10K09k0j81J41P8m1l2L7L9
6687D2K00l34J23l9k01P7J23k65J45L06l01K13k4M8n7M1r0M5k09K68j91M9P2j80
$$ plain form
6711 -139 -35 11 -106 39 88 -9 111 -154 -89 28 167 50 273 -146 66 -72 -4 194 28 80 -4 64 -105
6734 -105 -159 -88 221 -82 140 -334 5 81 4 -217 -66 -111 139 -3 122 48 107 -47 -11 101 11 -19 16 -63
6758 -63 13 42 81 -76 -183 -58 -39 61 233 -100 12 -164 62 -110 -91 31 -100 -33 29 -122 -10 134 -52
6781 -52 -74 11 56 122 -123 36 164 -68 187 -86 239 -6 38 19 266 -30 -15 -115 -72 -3 9 -47 -54 -126 -68
6806 -68 20 -299 -275 -80 75 -4 -2 52 33 -143 -16 -248 145 6 60 306 105 -105 176 50 -154 -127 -303
6829 -303 22 -64 31 326 14 130 -91 99 -133 103 -23 -43 260 17 -47 -20 -181 -35 -116 -143 -124 -167 133
6852 133 -30 232 184 34 118 17 -28 65 -145 203 -151 -28 56 90 120 61 63 -121 5 -162 -70 133 81 -24
6876 -24 -24 -59 -55 -126 -81 -131 -80 -309 111 70 12 -66 -21 259 -80 32 84 -147 -146 30 75 76 -32 69 58 -188 118
$$ packed form
6711a39J04M6j17J45M9r7J20k65O5J17J39j17K23m19K12j38O8J98j66N2q4O8j69
6734a05n4P1L09l03K22m74L39P6p7k21J51m5K50j42J25p4N9j54L6J12r0l0L5p9
6758f3P6K9L9j57j07J25J9J00J72l33J12j76K26j72J9J22j31O7O2j51J12J44j86
6781e2k2Q5M5O6k45J59J28k32K55k73L25k45M4j9K47k96J5j00M3O9J2n6pp2N8
6806f8Q8l19K4J95J55p9KN4j9j76J27k32L93j39N4K46k01k10K81j26k04K7j76
6829c03L25q6R5K95l12J16k21J90k32K36j26k0L03k43o4K7j61J46q1k7J9m3L00
6852A33j63K62m8j50Q4j01m5R3k10L48l54J23Q4L4L0n9Kj84J26j67R2K03n2j05
6876b4%l5Mp1M5n0N1k29M20m1n8p8M5K80l39J12N2k31JJ76M5Jj08J01j1k46L06
$$ plain form
6903 118 -51 158 82 -177 175 187 76 -198 63 -6 -168 -48 -141 -50 75 80 -179 163 223 -92 -190 -145 -117 146
6927 146 0 -110 124 31 127 30 -5 -60 88 124 -88 -12 -55 107 197 -111 13 147 -217 -190 30 -11 26 -73
6951 -73 131 -50 -134 61 55 69 86 240 3 -72 -217 50 -89 40 -106 93 -81 -8 3 79 101 -130 103 -32
6975 -32 77 52 234 -134 6 52 -28 48 1 100 -46 1 -170 -99 -70 -23 6 -12 156 41 -29 150 34 -77 -134
7000 -134 -185 -18 105 -26 -134 81 94 -94 -75 30 70 -32 -1 -74 -60 -198 75 180 -67 -86 -48 41 21 -138
7024 -138 -25 196 88 -110 20 -42 -145 166 114 114 -61 125 4 47 -103 -136 26 160 3 15 -137 122
7046 122 -154 -13 -118 11 44 13 22 -166 198 -223 47 197 -4 22 -199 -102 -221 -19 75 -215 -123 -209 -130
7069 -130 -77 -33 -158 -31 -55 -95 -12 78 -5 -236 -25 -129 344 36 193 -41 107 -110 -109 0 122 11 66
$$ packed form
6903A18j69K09p6k59L52J2j11k74K61o9j62J20r3R1J25Nk59L42O0l15r8M5K8K63
6927A46j46j10K34r3R6r7l5n5J48L6k12P6m3J62R0l08J24J34l64K7K20m1L7r9
6951g3K04j81q4J95oJ4J7J54k37p5j45K67j39J29j46J99j74P3J1P6K2k31K33j35
6975c2J09k5J82l68J40M6q0P6m7R9j46M7j71P1K9M7K9j8J68j15p0J79j16j11n7
7000a34n1J67J23j31j08K15J3j88J9J05M0j02L1p3J4j38K73J05k47j9L8Q9k0j59
7024a38J13K21j08j98J30o2j03L11n2%j75J86j21M3j50l3J62J34j57J2j52K59
7046A22k76J41j05J29L3l1Rj88L64m21K70J50k01K6k21R7j19K02R4k90R2q6P9
7069a30N3M4j25J27k4m0Q3R0q3k31K11j04M73l08J57k34J48k17JJ09J22j11N5
$$ plain form
7092 66 76 -146 20 167 146 21 -54 -55 -94 20 -58 -52 115 -49 3 168 157 -22 -82 89 -47 34 50 -91 40
7117 40 -41 -85 -42 231 -89 22 -26 -132 -4 20 -67 31 2 -16 -12 225 79 -95 119 -43 -47 -17 116 90 189 -85
7143 -85 133 24 -74 41 -138 -124 82 6 136 39 85 -190 49 63 54 -163 81 -238 -60 166 104 4 -6 66
7167 66 0 15 -127 86 110 71 -101 -221 -51 8 170 215 18 -25 15 -66 98 101 102 -48 -92 157 39 -205 -137
7192 -137 -94 -62 -29 272 -27 166 164 -86 -73 -160 108 6 -276 27 -54 -124 97 221 159 -230 46 107 -260 28
7216 28 217 -103 -44 -88 -100 46 128 -211 -61 -24 -171 163 149 -123 33 -166 0 118 -48 -33 -10 -7 -26 18
7240 18 67 -34 20 110 -9 54 -36 -276 170 75 54 -102 0 -6 -16 104 67 61 -135 127 -92 63 36 63 47 169
7266 169 357 -163 37 150 -17 -46 0 -103 43 -34 100 71 1 -59 -28 42 -87 -63 -161 56 -11 203 151 -27
$$ packed form
7092F6J0k22J66J47k1j25p5jl9J14p8OJ67j64N2J65j1j79o0J71j36Q1J6j41J31
7117D0q1m4M3K73l20J11m8j06J28K4q7R8k9j8MK37j46j74K14j62mL0J33k6R9k74
7143h5K18j09r8J15j79J4K06p6J30r7M6k75K39J4rk17K44l19J78K26o2j00j0P2
7167F6o6J5j42K13K4l9j72j20J70N9J62M5j97m3M0q1J64LJj50m4K49j18k44O8
7192a37M3L2L3L01k99J93kk50J3q7K68j02k82L03q1p0K21J24o2l89K76O1l67K88
7216B8J89l20N9m4j2J46Q2l39J50L7j47L34j4k72J56j99J66J18j66J5K3Lj9M4
7240A8M9j01N4R0j19O3r0k40M46r5k1j56J02oj0J20l7oj96K62k19J55k7K7j6J22
7266A69J88n20K00J13j67k9M6j03J46p7J34k9p0o0L1P0j29K4r8K17o7K14n2j78
$$ plain form
7290 -27 -22 15 -11 -49 37 91 -159 -10 -188 191 206 139 105 -61 -59 15 85 -212 94 116 -1 -31 -51 -182 -190 174 164
7317 164 -145 -81 -170 178 12 30 -135 -133 111 45 -14 -28 -190 -105 230 -49 153 -27 96 -24 59 -38 139 7
7341 7 20 -297 -11 105 -149 -124 -180 -85 27 -161 111 -25 -84 6 62 -23 -50 -2 -69 138 34 36 133 145 52 69
7367 69 -65 63 186 95 79 -93 103 48 167 152 -50 -93 123 -4 -85 39 -85 -39 36 88 80 121 -53 -44 98
7392 98 -50 27 40 11 -96 154 -164 165 303 -102 62 168 -48 228 144 55 8 202 -41 -148 36 -65
7414 -65 99 280 -135 134 37 49 -23 127 -55 139 170 -136 76 -33 64 -174 335 -123 -59 -210 -41 26 53
7437 53 -43 -63 75 71 30 162 -124 -188 42 74 216 32 -197 -50 21 75 129 83 64 -60 134 44 266 76 -60
7462 -60 -166 115 -114 -131 -4 -192 99 -180 -132 -120 -200 -28 -131 41 245 -9 -178 -74 30 20 -14 77 -128
$$ packed form
7290b7NL7k6l8Q6N4k50J49j78L79J5o7l4j66KP4P0k97L06K2j17l0k0j31qL64j0
7317A64l09O4q9L48j66J8j65KK44o6n9j4j62Q5L35k79K02j80J23j20Q3r7J77j32
7341GJ3l17K86J16k54K5n6R5J12j88K72j36n9R0N6q5k7M8o7K07j04KR7J2r3J7
7367F9j34J28J23r1j6j72J96n5J19j5k02m3K16j27q1J24j24M6P5N2qM1j74RJ42
7392I8j48P7J3k9j07K50l18L29J38m05J64J06k16K76q4q9m7J94k43j07J84j01
7414f5J64J81m15K69r7J2p2J50j82J94L1l06K12j09R7k38N09m58O4j51J69O7K7
7437E3r6k0J38mm1J32k86o4K30L2J42j84k29J47P1N4N4m6j9j24J94r0K22j90j36
7462f0j06K81k29j7J27j88K91k79M8J2q0J72j03J72K04k54j69J04J04j0l4R1k05
$$ plain form
7485 -128 31 16 -38 -29 -55 -72 50 45 173 77 -140 -129 -2 -133 96 10 186 -98 26 -137 -8 108 -50 262
7509 262 167 -50 -97 71 -40 24 145 25 -118 -131 247 -73 -61 15 -170 -65 19 104 193 5 -53 94 94 -180
7533 -180 146 -48 -35 -17 144 268 146 -87 167 54 -55 237 -31 -18 -54 -60 176 -141 -167 -12 220 88
7555 88 70 135 74 30 -157 -187 -85 -47 28 -73 -49 -1 34 -85 -186 19 -60 140 -129 17 -69 -63 42 -48 214
7580 214 -57 35 129 -80 -65 -104 13 20 -113 50 -80 -46 52 -219 23 -111 -171 25 -172 -90 34 132 56 -157
7604 -157 -59 11 11 -8 -85 -78 32 -131 -36 16 -206 -127 -246 -150 -82 276 133 -109 -36 -81 -47 60 -110 68 96 -26
7630 -26 -23 86 -28 -17 -36 87 30 57 -89 -82 -30 155 78 -33 3 165 52 58 -189 -129 245 24 -123 -243 -56
7655 -56 73 9 0 -44 63 -152 -33 51 -56 111 -11 -38 42 -192 10 -38 218 -97 -2 71 -32 -33 15 -108 -11
$$ packed form
7485a28J59j5n4Rk6j7J22nJ28r6k17J1J27j31K29q6J76k84J24j63J29J16j58L12
7509B62r5k17m7J68j11O4J21j20j43j3L78l20J2P6j85J05Q4Q5Q9j88n8J47%k74
7533a80L26j94J3J8J61J24j22k33K54j13j09K92k68J3l6oK36l17k6J55K32j32
7555H8j8O5o1m4j87l0J02L8P5j01K4M8L5j19j01K05p9K00k69J46q6OJ05r0K62
7580B14k71R2R4k09J5l9J17Pj33J63j30L4R8k71K42j34o0J96j97Q2J24R8p6k13
7604a57R8P0%j9p7PJ10j63R5N2k22P9j19R6O8L58j43k42P3m5L4J07j70J78K8j22
7630b6LJ09j14J1j9J23n7K7j46PN2J85p7j11L6J62j13Ok47O0L74k21j47j20J87
7655e6J29o4rm4J07k15J19Q4j07J67j22k7Q0k34K02m8K56l15R5P3j03jM8j23R7
$$ plain form
7680 -11 109 62 -79 26 -85 -124 -45 52 20 -23 -1 78 -27 13 93 3 -62 -74 -120 -228 25 61 -69 -29 -213 -90
7706 -90 22 98 -257 -42 -3 -156 -25 174 -215 -4 -20 -37 -88 -84 -77 303 274 -58 -57 116 -24 -156 191 -41
7730 -41 -43 -176 32 110 83 186 -66 -73 77 -91 -159 -50 47 96 24 -14 8 107 40 99 119 -27 -32 91 181 76 -284
7757 -284 219 153 -61 -38 -93 -164 -123 -99 -122 -69 30 -125 -57 -141 61 -131 -201 136 -60 85 158 -3 -31 29 -61
7782 -61 -110 7 26 89 142 242 80 47 38 -27 -63 231 -66 65 -45 -245 -127 32 213 110 -40 73 144 -34
7806 -34 16 -3 106 55 28 102 17 110 34 56 -133 -135 -141 -113 102 11 -59 52 -178 -56 5 -43 -162 34 1 -124 42
7833 42 72 -43 -41 0 9 -63 -53 133 -35 -46 89 281 168 96 21 21 96 215 193 84 67 2 -154 -20 55 -214
7859 -214 -216 42 -51 106 -47 107 22 -48 41 -14 -64 -145 46 13 -131 69 -40 -161 -123 -172 -110 -28 -16 46 40 -97
$$ packed form
7680a1J20m7j41J05j11l9P9R7l2m3K2P9j05M0Q0r0o5j2m6j08K53L6j30M0j84J23
7706i0J12P6l55K15L9j53J31J99l89K11j6j7n1MPL80k9l32JJ73j40j32L47k32
7730d1kj33K08P8k7J03k52pJ50j68o8J09R7M9p2l8K2R9o7N9K0j46nJ23R0j05l60
7757b84N03o6k14K3n5p1M1K4k3N3R9j55O8q4K02j92p0L37j96J45P3j61k8O0r0
7782f1m9J17J9O3N3J00j62l3ro5l6K94k97J31j10k00J18J59J81j03j50J13P1j78
7806c4N0j9J09n1k7P4q5R3p6K2j89koK8K15r1p0J11k30J22O1m8j19J96l3j25J66
7833D2L0j15KM1Rp2J0J86j68j1J35J92j13p2p5%P5J19k2j09j7o5j56J34P5k69
7859b14kK58r3J57j53J54q5p0Q9n5n0q1J91l3j44K00j09j21L8m9O2Q2J2O2oj37
$$ plain form
7885 -97 29 -29 -27 52 50 266 -58 -27 -192 -254 65 -247 117 157 24 -53 -16 -98 84 -207 -72 -135 151 124 -103
7910 -103 -36 51 -97 -178 20 -247 146 -135 -71 137 72 97 -44 -130 -20 -37 -148 -102 97 34 -45 184 -84 -92
7934 -92 127 11 -90 -57 4 -177 -61 -136 -22 -77 -224 -69 225 13 -103 -36 42 52 -69 -35 34 134 156 42
7958 42 -144 47 63 207 247 -106 -49 118 -160 -24 -122 82 -173 -232 -7 -67 95 -13 -21 -193 -149 -22 20 -7
7982 -7 -72 -67 -18 -146 17 -13 -24 -2 11 -36 211 -148 150 82 -16 16 114 84 51 -109 -69 -51 75 -148 20 9 -15
8009 -15 -100 -9 -223 -126 -37 88 93 122 -117 21 48 -151 262 -58 114 -41 -6 19 -23 -262 -46 -123 274 -70
8033 -70 -75 -7 -75 -32 46 -162 -48 -17 124 45 -76 67 130 314 6 -5 -127 -119 -212 137 -22 44 -22 -54 -99 27
8059 27 -32 -39 162 -48 75 -46 -47 112 95 55 101 -139 1 147 60 12 -66 -28 41 -55 142 -245 -6 -85 -103 -107
$$ packed form
7885i7J26n8KP9kK16l24L1j65o2L19l12L64M0j33p7L7q2J82k91J35o3K86k7k27
7910a03O7Q7j48q1J98k67L93k81O4K08o5K5j41q6J10j7j11M6J99o3p9K29k68q
7934i2K19j16j01L3O1j81J16p5J14n5j47J55K94k12j16O7P8J0j21L4O9J00K2j14
7958D2j86J91J6J44M0l53N7J67k78J36r8K04k55n9K25o0J62j08qj72M4J27M2k7
7982go5NM9j28J63l0j1K2J3m7K47l59K98o8r8L2R8l0l3j60M0J8J26k23J68j1k4
8009a5q5R1k14R7Q9J25NK9k39J38K7j99M13l20J72j55L5K5m2k39K16p7L97l44
8033g0nO8o8M3P8k08J14L1J41p9j21J43O3J84l08j1j22Qr3L49j59O6o6l2m5J26
8059B7n9pK01k10J23j21jJ59j7m0M6k40J40J46q7m8p8L8O9r6J97l87K39p9j8m
$$ plain form
8085 -107 220 181 -199 -31 107 59 84 21 245 101 -148 36 99 -119 128 -68 56 57 95 -84 52 249 5
8108 5 -344 -12 -141 178 45 191 -32 -142 37 -73 224 172 -14 -154 -127 -76 144 19 39 134 -69 -36 77
8131 77 -56 13 24 64 152 38 88 -185 -96 -43 68 -253 186 -86 -164 225 35 182 161 -52 -255 55 39 -35
8155 -35 42 60 21 -1 28 -23 -12 -82 -226 -127 -112 -15 99 -122 18 24 -282 163 24 175 -1 -124 148 117 -58
8180 -58 -96 -74 -49 -39 -165 -184 51 4 80 -19 83
$$ packed form
8085a07L27l9l80J68J38m8K5o3K24j44k49J84O3k18K47j96J24JL8j79J36J97k44
8108El49L32j29L19j33J46k23j10J79j10K97n2j86j40K7N1K20j25K0R5k03L3J13
8131G7j33O9J1M0Q8j14N0k73Q9N3J11l21M39k72p8L89j90J47k1k13k03L10j6p4
8155c5P7J8l9k2K9n1J1p0j44R9J5R7J14k21J40Ol06M45j39J51j76j23K72l1j75
8180e8l8K2K5J0j26j9K35m7P6r9J02
8191H3
$$ Imaginary data points
##PAGE= N=2
##DATA TABLE= (X++(I..I)), XYDATA
$$ plain form
0 0 0 0 0 0 0 0 0 0 0 0 0 0 0 0 0 -8 8 -8 8 -8 16 -16 16 -24 24 -32 37 -40 48 -56 64 -72 80 -93 104 -118 133
37 133 -148 165 -182 205 -227 251 -280 307 -339 376 -415 456 -504 555 -612 674 -743 821 -910
56 -910 1009 -1125 1258 -1416 1604 -1837 2129 -2510 3030 -3790 5000 -7246 12866 -62001 -61493
71 -61493 18783 -31983 -26473 1054 -7060 -8201 46586 31348 -16358 11586 58207 19406 -832
84 -832 30045 20720 -10389 14215 11894 -30525 -17681 20985 -11613 -45910 -18038 1835 -14420
97 -14420 -4537 4645 -22538 -17747 25941 16843 -18264 -2331 18737 4977 6011 16188 -1452
110 -1452 -7512 18929 19513 -8509 -3638 16946 6326 -4406 3192 -5801 -14334 2143 3182 -18452
124 -18452 -17608 -3439 -7550 -12201 -4969 -5077 -8009 5287 11771 661 3398 16975 12746 6744
$$ packed form
0@%%%%%%%%%%%%%%%qJ6j6J6j6K4l2L2m0M8n6O9p7Q8j04J20j36J52j73J97k22K51
37A33k81L13l47L87m32M78n31N87o46P15p91Q71r60J059j167J286j417J564j731
56i10J919k134K383k674L020l441L966m639N540o820Q790j2246K0112p4867N08
71f1493Q0276n0766N510K7527q114j141N4787j5238m7706K7944M6621l8801k0238
84h32L0877r325l1109K4604k321m2419J2844L8666l2598l4297K7872J9873j6255
97a4420R883R182k7183M791M3688r098l5107J5933K1068j3760J034J0177j7640
110a452o060K6441N84k8022M871K0584j0620j0732P598q993q533J6477J039k1634
124a8452Q44J4169m111m651P232j08k932J3296O484j1110K737J3577m229o002
$$ plain form
138 6744 12466 8954 3335 9769 6604 -8606 -9139 -956 -5109 -10412 -7665 -9870 -14137 -4788 1707
153 1707 -7120 -6725 4254 3416 1526 8329 6068 -186 5460 8918 1336 125 7324 4658 -3208
168 -3208 -959 1761 -2589 259 3675 -3644 -6846 470 1162 -3817 -3814 -3571 -5596 -2601 1017 -1617
184 -1617 -4942 -1368 2050 1069 2991 5160 3801 4189 5699 3987 3798 4518 2025 343 -310 -3409
200 -3409 -3929 -1749 -3555 -8127 -7187 -2948 -2095 -2593 -155 -1440 -1608 5529 6914 578 2650 7443
216 7443 3257 911 4731 1403 -4298 -257 2410 -5090 -6714 437 -1368 -6389 -741 1025 -4844
231 -4844 632 6953 -478 -3578 5426 5754 -1424 1279 4289 -2038 -1839 5062 -459 -8505 -351 4359
247 4359 -4299 -4311 1619 -2145 -2778 4516 1947 -5040 476 7468 1525 -2707 3344 2593 -1539 3015
$$ packed form
138F744N722l512n619O434l165j5210n33Q183m153n303K747k205m267R349O495
153A707q827L95J0979q38j890O803k261o254N646L458p582j211P199k666p866
168c208K249K720m350K848L416p319l202P316O92m979LK43k025K995L618k634
184a617l325L574L418r81J922K169j359L88J510j712j89P20k493j682o53l099
200c409n20K180j806m572R40M239Q53m98K438j285j68P137J385o336K072M793
216G443m186k346L820l328n701M041K667p500j624P151j805n021N648J766n869
231d844N476O321p431l100R004L28p178K703L010o327J99O901n521q046Q154M710
247D359q658j2N930l764o33P294k569o987N516O992n943m232O051p51m132M554
$$ plain form
263 3015 3635 -4780 -2602 4389 -469 -4923 -1574 -136 -3155 -826 1149 -3701 -3789 3882 3035 -2797
279 -2797 452 3507 771 2457 4319 -339 -1346 3472 3199 -1694 -2348 78 -1192 -1755 267 -3318
295 -3318 -5607 -58 2057 -2431 -2336 702 983 1606 2744 1176 -257 2570 4213 1323 -904 746
311 746 268 -693 756 -1601 -4278 -1262 720 -1755 -2674 -1508 -218 267 867 642 -221 604 3128
328 3128 1934 -113 779 897 560 1067 -427 -2217 -849 414 -629 -1859 -1859 -393 -133 -944 -152 -69
346 -69 182 1428 941 496 1348 1098 814 878 352 87 -161 -875 -656 -728 -1360 -937 -1111 -1334 -558 -362 -359 276
368 276 93 1026 1639 517 729 1429 1348 995 487 -1 -334 -82 -189 -672 -1787 -837 -54 -1107 -1018 -305
388 -305 -838 -20 1208 289 -324 177 1419 1514 -121 40 1143 373 264 520 -915 -784 716 381 -1330
$$ packed form
263C015O20q415K178O991m858m454L349J438l019K329J975m850q8P671q47n832
279b797L249L055k736J686J862m658j007M818k73m893o54K426j270n63K022l585
295c318k289N549K115m488R5L038K81O23J138j568j433K827J643k890k227J650
311G46m78r61J449k357k677L016J982k475r19J166J290M85O00k25q63Q25K524
328C128j194k047Q92J18l37N07j494j790J368J263j043j230%J466K60q11P92Q3
346f9K51J246m87m45Q52k50k84O4n26k65k48p14K19p2o32M23j74k23P76J96LO35
368B76j83R33O13j122K12P00q1l53n08m88l33K52j07m83j115R50P83j053Q9P13
388c05n33Q18J228r19o13N01J242R5j635J61J103p70j09K56j435J31J500l35j711
$$ plain form
407 -1330 -991 711 384 -613 217 322 -880 318 1618 -692 -1818 918 572 -727 -618 389 -698
424 -698 -508 1420 290 -1492 572 1894 -523 -721 1701 114 -1161 1364 1197 -1723 -544 1730
440 1730 -28 -1633 136 435 -1593 -187 1119 -1937 -1788 1769 143 -2366 501 1292 -1090 -158
456 -158 2095 418 -705 2347 2533 -1011 241 2811 236 -859 1160 -655 -2708 -362 -525 -3075
472 -3075 -2188 -88 -1680 -2637 413 1022 -1420 661 3133 945 807 3953 2345 256 2255 2321 -724
489 -724 -211 933 -1908 -3309 -976 -1530 -4433 -2315 -282 -2677 -2024 1303 473 -417 2652 3006 814
506 814 2545 4457 1643 -87 2238 1735 -1590 -600 468 -3151 -2825 -85 -2069 -3706 -1117 142
522 142 -2029 -807 1647 586 -421 2180 2079 -565 1680 3685 -188 -1342 1976 1169 -1005 90
$$ packed form
407a330L39J702l27r97Q30J05j202J198J300k310j126K736l46j299J09J007j087
424f98J90J928j130j782K064J322k417j98K422j587j275K525j67k920J179K274
440A730j758j605J769K99k028J406J306l056J49L557j626k509K867P91k382R32
456a58K253j677j123L052J86l544J252K570k575j095K019j815k053K346j63k550
472c075Q87K100j592r57L050O09k442K081K472k188j38L146j608k089J999O6l045
489g24N13J144k841j401K333n54k903K118K033k395O53L327q30q90L069L54k192
506H14J731J912k814j730K325n03l325R90J068l619L26K740j984j637K589J259
522A42k171J222K454j061j007K601j01k644K245K005l873j154L318q07k174J095
$$ plain form
538 90 199 -1679 -850 957 -732 -2819 -313 1174 -1411 -1092 988 -481 -1097 1137 344 -1841 -6
555 -6 2271 503 -1466 361 1930 -149 101 1309 -283 -665 1727 1065 -1846 -1111 1181 487 -1439
572 -1439 -365 -440 -1409 91 1525 -1804 -2490 1563 1761 -1309 -797 1083 -176 -569 1560 827 -1919
589 -1919 574 3035 -407 -1339 2199 1379 -1059 751 1399 -1444 -498 2088 -412 -3522 -298 1454
605 1454 -2071 -2077 603 -1826 -2257 2261 1480 -2361 -94 3054 1316 482 2598 1491 -1149 1884 3116
622 3116 -1243 -1574 1504 -1021 -3507 -325 -386 -3297 -1519 126 -2169 -2295 1415 1572 -1350 816
638 816 2759 550 1169 3756 716 -1225 2185 1963 -989 -669 313 -1744 -1768 622 -776 -3577 -674
655 -674 747 -1586 -797 1345 -457 -510 2087 1077 -816 1600 2661 -110 -499 1609 445 -704
$$ packed form
538I0J09j878Q29J807j689k087K506J487k585L19K080j469o16K234p93k185J835
555fK277j768j969J827J569k079K50J208j592l82K392o62k911P35K292o94j926
572a439J074p5r69J500J434l329o86M053J98l070N12J880j259l93K129p33k746
589a919K493K461l442r32L538q20k438J810O48k843R46K586k500l110L224J752
605A454l525oK680k429m31M518p81l841K267L148j738q34K116j107k640L033J232
622C116m359l31L078k525k486L182o1k911J778J645k295j26L710J57k922K166
638H16J943k209O19K587l040j941L410k22k952L20R82k057k4K390j398k801K903
655f74J421k333P89K142j802n3K597j010j893K416J061k771l89K108j164j149
$$ plain form
671 -704 861 232 -2241 -341 1838 -1451 -1927 1043 -120 -1671 1024 1190 -1772 -470 2093 169
687 169 -1800 1208 1214 -1700 258 1562 -1474 -1048 2170 -212 -2061 927 1873 -1165 -722 1888 -27
704 -27 -1286 2056 1251 -2039 -444 2159 -526 -1457 706 -447 -1972 684 786 -2054 -1504 1581 137
721 137 -1809 565 1604 -658 436 2235 144 -478 2079 1417 -900 -172 1036 -284 -994 25
737 25 -824 -1797 -254 483 -1722 -1570 367 -212 -502 520 499 -288 460 1797 865 -253 694 1183 507
756 507 259 427 -147 -302 195 -468 -935 -1054 -572 -320 -888 -883 -205 -345 -196 442 383 100 601 1059 658
777 658 212 249 960 313 33 605 -544 -785 419 -82 -1308 -642 -251 -238 -407 120 -76 -918 513 1236
797 1236 90 -359 798 667 145 631 212 -595 172 654 -546 -940 -430 213 -230 -407 -211 -181 52
$$ packed form
671g04J565o29k473J900K179l289m76K970j163j551K695J66k962J302K563j924
687A69j969L008Ok914J958J304l036M26L218k382j849K988R46l038M43K610j915
704b7j259L342q05l290J595K603k685r31K163j153j525K656J02k840N50L085j444
721A37j946K374J039k262J094J799k091o22K557o62k317P28J208j320p10J019
737B5q49r73J543P37k205J52J937n79k90J022k1p87P48J337r32j118R47M89o76
756E07k48J68n74j55M97o63m67j19M82K52n68NO78j40J49O38n9k83N01M58m01
777F58m46L7P11o47k80N72j149k41J204n01j226O66L91J3j69N27j96q42J431P23
797A236j146m49J157j31n22M86m19q07P67M82j200l94N10O43m43j77J96L0K33
$$ plain form
816 52 1243 196 -629 597 916 270 193 -312 -319 235 326 -353 -1393 -554 96 -710 -712 -65 -494 166 810
837 810 356 -21 676 905 628 303 282 232 281 339 -319 -1178 -105 68 -900 -1146 -407 -610 -598 168 -36 -425
859 -425 404 778 370 83 491 770 68 362 322 -281 -39 542 -237 -1079 -133 -259 -978 -606 -280 -398 -643
880 -643 258 238 -272 518 937 107 228 919 376 -194 326 349 -138 -368 -338 -715 -952 -481 -337 -654 -414
901 -414 -312 -428 -288 295 42 61 823 894 434 633 501 707 362 408 188 -352 -235 -299 -643 -777 -606 -835
923 -835 -404 -499 -440 -121 120 285 467 559 412 553 772 583 487 271 209 21 -250 -14 -372 -806 -564 -317
945 -317 -708 -457 -407 -190 -107 11 100 311 348 641 196 131 383 257 209 79 260 -169 -419 -196 230 -5
967 -5 7 14 -89 -120 207 434 -288 -242 24 312 -58 -306 -324 -143 0 99 -305 -553 -36 212 -105 -286 45
$$ packed form
816E2J191j047q25J226L19o46p7n05pN54R1o79j040Q39O50q06kO47m29O60O44
837H10m54l77O97K29k77l25k1n0M9N8o58q59J073J73r68k46P39k03J2P66k04l89
859d25Q29L74m08k87M08K79p02K94m0o03K42N81p79q42R46j26p19L72L26j18k45
880f43R01k0n10P90M19q30J21O91n43n70N20K3m87k30L0l77k37M71J44l17K40
901d14J02j16J40N83k53J9P62P1m60J99j32K06l45M6k20n40J17o4l44j34J71k29
923h35M31r5N9L19K41J65J82R2j47J41K19j89r6k16o2j88k71K36l58m34K42K47
945c17l91K51N0K17Q3J18Q9K11L7K93m45o5K52j26m8j30J81m29k50K23M26k35
967eJ2Pj03l1L27K27p22M6K66K88l70k48j8J81J43R9m04k48N17K48l17j81L31
$$ plain form
990 45 329 581 514 201 423 265 650 491 -79 -40 173 144 -105 -511 -1142 -735 -201 -456 -515 -423 -10 -201
1012 -201 149 124 133 678 901 988 378 525 701 416 377 409 -154 -191 404 -281 -967 -834 -543 -590 -883 -431 -425
1035 -425 -787 4 324 -340 61 873 522 438 928 721 467 621 1106 -142 -571 377 -198 -1024 -671 -207
1055 -207 -1179 -629 9 -637 -833 184 139 -272 396 1067 203 116 1440 800 -204 619 1108 -301 -552
1074 -552 309 -283 -721 -103 -116 -970 -613 448 -307 -828 319 92 -519 455 858 46 -523 788 484
1093 484 -271 290 549 -368 -499 422 -97 -653 341 183 -565 -257 464 -62 -126 362 52 -276 282 416
1113 416 -182 -519 106 -67 -685 39 -26 -610 -107 475 -141 77 445 392 142 361 468 252 100 510 299
1134 299 -286 -1 -48 -600 -57 -274 -639 -416 -100 -226 -367 9 -90 -127 92 489 45 -26 725 225 52
$$ packed form
990D5K84K52o7l13K22j58L85j59n70L9K13k9k49m06o31M07N34k55n9R2M13j91
1012b01L50k5RN45K23Q7o10J47J76k85l9L2n63l7N95o85o86J33K91m7k93M52O
1035d25l62P91L20o64M01Q12l51q4M90k07k54J54M85j248m29R48n75q26L53M64
1055b07r72N50O38o46j96J017m5m11O68O71q64q7J324o40j004Q23M89j409k51
1074e52Q61n92m38O18j3q54L57J061p55n21J147k27o11R74M03q12n69J311l04
1093D84p55N61K59r17j31R21n19n56R94j58p48L08P21n26o4M88l10l28N58J34
1113D16n98l37O25j73o18P24o5n84N03N82o16K18L68n3k50K19J07k16j52M10k11
1134B99n85K85m7n52N43k17l65K23L16j26j41L76r9l7K19L97m44p1P51n00j73
$$ plain form
1155 52 481 270 26 65 -131 -156 -325 -56 -347 -502 -198 61 -550 -489 17 66 -361 253 287 -68 70 327
1177 327 383 215 484 532 -91 -17 325 -332 -516 76 -330 -614 -423 72 -282 -389 96 -164 -31 236 740
1198 740 52 -41 439 481 134 372 296 -393 -245 263 -34 -629 -450 -51 -286 -439 59 -4 -351 352 564
1219 564 53 197 802 467 -27 173 248 -336 -202 117 -378 -1035 132 75 -949 -804 78 -230 -41 541
1239 541 254 -165 223 1051 294 -166 590 838 -174 326 172 -615 -165 250 -591 -1151 -219 251 -494 -629
1259 -629 -9 -231 -144 503 272 -476 351 1070 -118 7 225 490 93 114 149 -330 -151 404 -49 -827 -196
1280 -196 193 -352 -111 10 -348 -159 515 104 39 220 684 106 21 214 364 99 356 265 -509 -197 439
1301 439 -198 -502 -237 -91 16 -96 -169 -342 28 402 184 -238 333 471 -71 133 61 -158 73 215 -191
$$ packed form
1155E2M29k11k44L9j96k5j69K69k91j55L04K59o11O1N06M9m27O14L4l55J38K57
1177C27N6j68K69M8o23P4L42o57j84N92m06k84J91M95l54j07M85k60J33K67N04
1198G40o88r3M80M2l47K38p6o89J48N08k97n95J79L99k35j53M98o3l47P03K12
1219E64n11J44O05l35m94K00P5n84J34L19m95o57J167n7j024J45Q82l08J89N82
1239E41k87m19L88Q28p57m60P56K48j012N00j54p87M50M15q41n60R32M70p45j35
1259f29O20k22Q7O47k31p48Q27P19j188J25K18K65l97K1L5m79J79N55m53p78O31
1280a96L89n45K41J21l58J89O74m11o5J81M64n78q5J93J50k65K57r1p74L12O36
1301D39o37l04K65J46J07j12p3j73L70L74k18m22N71J38n42K04p2k19K31J42m06
$$ plain form
1322 -191 -423 -259 176 -50 -309 -68 76 309 390 190 -171 378 422 -315 109 -24 8 -187 -406 -98 -329
1343 -329 -225 -134 -454 -427 143 -39 164 443 296 396 429 512 345 53 232 192 26 -201 -188 -494 -403 -70
1365 -70 -465 -614 -261 9 -421 -319 154 303 122 187 444 360 401 543 87 166 485 300 -118 -322 -305 28
1387 28 -220 -340 -295 -472 -392 100 -130 -386 205 194 183 385 379 334 377 273 226 141 49 151 170 -226 34 -40 -125
1412 -125 -260 -252 -266 -192 -68 125 -42 -326 262 71 179 119 236 49 335 472 242 205 4 2 56 -135 -203
1435 -203 -151 -17 -16 51 -217 -216 -61 -79 43 50 17 176 316 296 42 -93 198 -6 -101 79 -229 -161 -129 113 -179
1460 -179 -105 -81 11 222 18 177 161 100 189 369 4 190 -12 48 64 -299 -267 -225 -191 -150 -252 -341 -363 -47 -155
1485 -155 -40 38 -103 421 300 151 361 75 69 346 -76 67 -58 -132 138 -283 -203 -355 -121 -167 -148 -110 -105
$$ packed form
1322a91k32J64M35k26k59K41J44K33Q1k00l61N49M4p37M24j33L2j95k19L08k31
1343c29J04R1l20K7N70j82K03K79j47J00L3Q3j67k92J79m0j66k27J3l06R1L33
1365g0l95j49L53K70m30J02M73J49j81O5K57q4M1J42m56P9L19j85m18k04J7L33
1387B8k48j20M5j77Q0M92k30k56N91j1j1K02om5M3j04m7q5r2J02J9l96K60p4q5
1412a25j35Qj4P4J24J93j67k84N88j91J08o0J17j87K86J37k30l7k01kN4j91o8
1435b03N2J34JO7k68JJ55j8J22Pl3J59J40k0k54j35K91k04r5J80l08O8L2K42k92
1460a79P4K4R2K11k04J59j6o1Q9J80l65J86k02O0J6l63L2M2L4M1j02q9k2L16j08
1485a55J15P8j41N24j21j49K10k86oK77m22J43j25p4K70m21Q0j52K34m6J9L8N
$$ plain form
1508 -105 99 277 387 28 260 151 613 -3 27 174 -194 50 -3 -251 -171 -240 -284 -190 -257 -293 3 110 134
1531 134 -8 26 208 408 101 -51 72 -240 120 103 -261 -378 -29 -17 -87 -178 -11 -4 173 89 264 76 106
1554 106 262 203 56 105 184 -31 21 -258 -284 -103 26 -132 -307 -352 -207 -257 18 177 -97 215 241 303 209
1577 209 227 259 239 219 -40 -210 -59 43 -99 -20 -262 -319 -170 -264 -388 -309 -271 -31 67 -55 136 23 359
1600 359 67 274 60 178 288 166 -1 126 -62 -130 -159 -248 -295 -327 -298 -233 -123 -162 -131 -47 91 160 8 76
1624 76 91 299 206 286 133 24 220 26 -142 -176 -15 -295 -209 -148 -171 -168 -49 10 -259 -122 355 -52 108 389
1648 389 196 306 144 1 192 138 -6 121 -151 -254 28 -275 -208 35 -239 -17 135 80 22 74 176 121
1670 121 83 176 98 -189 134 -33 -104 -175 202 -211 -184 -78 53 -87 -67 291 -127 -92 291 291 -289 215 177 -30
$$ packed form
1508a05K04J78J10l59K32j09M62o16L0J47l68K44n3k48Q0o9m4R4o7l6K96J07K4
1531A34j42L4J82K00l07j52J23l12L60j7l64j17L49J2p0r1J67PJ77q4J75j88L0
1554A06J56n9j47M9P9k15N2k79k6J81J29j58j75m5J45n0K75J59k74L12K6O2r4
1577B09J8L2k0k0k59j70J51J02j42P9k42n7J49r4j24P9L8K40R8j22J91j13L36
1600C59k92K07k14J18J10j22j67J27j88o8k9q9m7l2K9O5J10l9L1Q4J38O9j52O8
1624G6J5K08r3Q0j53j09J96j94j68l4J61k80Q6O1k3LJ19N9k69J37M77m07J60K81
1648C89j93J10j62j43J91n4j44J27k72j03K82l03O7K43k74K22J52n5n8N2J02n5
1670A21l8R3p8k87L23j67p1p1L77m13K7J06J31j40K0L58m18L5L83%n80N04l8k07
$$ plain form
1694 -30 -170 429 16 -109 -52 -115 -328 -248 44 -1 -186 115 196 -155 26 377 72 -17 139 315 -245 -95
1716 -95 233 -405 -123 83 139 -369 -26 -231 -460 12 133 -225 -273 164 239 -144 136 369 -89 64 423
1737 423 90 -64 309 301 -362 -305 100 99 -357 -144 -8 -376 -154 336 84 72 125 285 137 123 610 75 118
1760 118 383 98 -69 226 10 -247 -145 -347 -148 -310 -109 -147 -425 59 174 145 88 -120 100 -29 155
1781 155 232 136 24 -13 273 111 -401 -135 100 -184 -395 -410 -278 -44 -220 -103 -104 -193 49 -13 188 141 -6
1804 -6 175 288 120 -61 52 113 253 -21 -205 -59 -148 -163 -134 -19 -252 126 -148 201 183 -131 168 223 347
1827 347 181 58 39 57 -222 -24 -9 -220 12 -58 -150 -51 -95 -40 -3 251 73 25 123 178 51 3 141 -27
1851 -27 4 176 -33 -32 -62 13 17 -278 -235 -46 -234 8 -90 -74 -40 159 129 -88 55 272 -233 -54 141 71 -154
$$ packed form
1694c0j40N99m13j25N7o3k13Q0K92m5j85L01Q1l51J81L51l05q9J56J76n60J50
1716i5L28o38K82K06N6n08L43k05k29M72J21l58m8M37P5l83K80K33m58J53L59
1737D23l33j54L73qo63N7M05jm56K13J36l68K22M90k52j2N3J60j48j4M87n35M3
1760A18K65k85j67K95k16k57J02k02J99j62K01l8k78M84J15k9n7k08K20j29J84
1781A55P7r6j12l7K86j62n12K66K35k84k11j5J32K34j76J17jq9K42o2K01m7j47
1804fJ81J13j68j81J13O1J40k74j84J46q9j5K9J15k33L78k74L49j8l14K99N5J24
1827C47j66j23j9J8k79J98J5k11K32p0r2R9m4N5L7K54j78m8R8N5j27m8J38j68
1851b7L1J72k09Jl0P5Mk95M3J89j88K42r8J6L4J99l0k17J43K17n05J79J95p0k25
$$ plain form
1876 -154 42 -85 -92 -84 133 -14 -238 -88 -40 -100 35 230 143 -43 363 301 -164 -37 81 13 123 289 112
1899 112 -75 154 222 -64 -96 108 62 -93 -38 10 -114 -76 147 -3 -177 106 340 44 186 224 -30 -148
1921 -148 -29 10 -68 -287 -12 65 -102 -242 -149 -100 18 213 -8 50 228 85 250 101 212 -7 162 255
1943 255 156 -53 -155 32 -250 -253 -46 -126 -120 -28 104 -103 -227 215 233 157 173 222 -10 93 25 -60 -74 -61 43
1968 43 -108 10 -129 -274 -114 129 -219 -316 52 -78 135 -178 -39 110 239 59 -84 -77 -6 69 53 113 -23
1991 -23 67 -396 -48 -83 -88 180 111 33 -61 -29 17 75 292 -216 70 -53 -98 -9 -85 10 405 -15 -99 -231 -9
2016 -9 59 -73 120 -339 -110 72 22 -111 90 49 232 7 -38 52 9 119 -134 -226 -236 -149 -68 -312 -126 92
2040 92 30 104 43 -2 53 271 -12 -86 186 316 184 -191 -30 -62 -54 79 -89 -124 -252 -277 -59 -82 -125 -25 101
$$ packed form
1876a54J96j27pQK17j47k24J50M8o0J35J95q7j86M06o2m65J27J18o8J10J66j77
1899A12j87K29O8k86l2K04m6j55N5M8j24L8K23j50j74K83K34k96J42L8k54j18
1921a48J19L9p8k19K75P7j67j40R3M9J18J95k21N8J78j43J65j49J11k19J69R3
1943B55r9k09j02J87k82lK07q0OR2J32k07j24M42J8p6J6M9k32J03o8q5j4J3J04
1968D3j51J18j39j45J60K43l48r7L68j30K13l13J39J49J29j80j43PP1P5j6O0j36
1991b3R0m63L48l5nK68o9p8r4L2M6N8K17n08K86j23m5Q9p6R5L95m20q4j32K22
2016iO8j32J93m59K29J82n0j33K01m1J83k25m5R0m3J10k53r2j0Q7Q1k44J86K18
2040I2o2P4o1m5N5K18k83p4K72J30j32l75J61l2QJ33j68l5j28k5K18k3m3J00J26
$$ plain form
2065 101 65 -126 -122 129 259 -87 241 47 166 4 -64 33 114 25 122 155 -33 -213 58 -166 -201 -5 -4 47
2089 47 1 -68 -37 181 163 -7 85 -156 76 220 -29 14 102 -27 53 74 -75 -436 -80 68 -124 -40 37 -124
2113 -124 215 -81 -4 107 175 -2 -42 -32 -64 327 -40 -117 -91 -203 -5 -74 -124 2 -158 83 19 22 2 222
2137 222 111 23 42 -329 58 173 -124 -266 -148 -198 -151 -238 -133 -220 -51 21 46 2 50 147 -1 201 259 137
2161 137 125 109 141 -66 52 -19 -205 -193 -78 -68 -59 -105 -164 -143 79 1 -14 20 9 235 26 194 165 122 16 229
2187 229 26 -197 -88 1 83 -102 85 -121 -68 11 102 -72 -105 185 -23 -58 -22 182 288 353 323 -136 294
2210 294 50 184 72 47 226 90 -212 -41 23 -212 -185 10 -94 -123 0 -205 -90 -86 251 -59 -98 173
2232 173 100 135 32 59 -124 -147 348 44 -26 -95 81 -287 -86 239 66 114 215 238 52 10 9 40 98 185 114
$$ packed form
2065A01l6j91MK51J30l46L28j94J19j62o8R7Q1q9R7L3j88j80K71k24l5J96JN1
2089D7m6o9L1K18j8j70R2k41K32J44k49M3Q8j29Q0K1j49l61L56J48j92Q4P7j61
2113a24L39k96P7J11O8j77m0J0l2L91l67p7K6j12J98o9n0J26j60K41o4Lk0K20
2137B22j11q8J9l71L87J15k97j42J18n0M7q7J05q7J69P2K5m4M8R7j48K02N8j22
2161A37j2j6L2k07J18p1j86J2J15J0Rm6n9K1K22p8j5L4j1K26k09J68k9m3j06K13
2187B29k03k23J09Q9Q2j85J87k06N3P9R1j74l3K90k08l5L6K04J06O5l0m59M30
2210B94k44J34j12k5J79j36l02J71O4k35K7J95j04k9J23k05J15ML37l10l9K71
2232A73p3L5j03K7j83k3M95l04p0o9J76l68K01L25j73M8J01K3j86m2jL1N8Q7p1
$$ plain form
2257 114 -151 0 -53 -145 -163 -94 -35 -13 -2 -126 188 33 358 179 -183 62 119 -140 -4 99 -38 -184 126
2280 126 -133 -275 -115 -12 -70 -138 51 84 -6 69 57 -24 -13 37 76 148 29 64 -24 -61 -63 -348 -16 -236 -317 23
2306 23 -33 -83 3 -95 -116 173 -1 66 371 140 108 -31 151 192 96 210 -62 -105 136 -247 107 85 -64 -83
2330 -83 -50 -194 -337 -195 -139 -106 58 58 -148 120 62 31 204 -40 61 30 -128 133 132 -210 -71 -162 -305 -86
2354 -86 164 -152 -381 -13 -98 -240 17 80 118 56 176 303 -160 57 5 154 44 -53 -66 11 -244 40 -327
2377 -327 -138 214 -67 61 73 -44 136 86 195 113 -168 -10 49 157 -135 195 50 35 79 21 -250 -12
2399 -12 3 -104 -2 -27 116 -21 -247 131 -122 -78 91 -3 -162 -51 -108 -133 26 -36 -261 -178 -239 -82 -108 -87
2423 -87 -67 24 46 -80 128 145 11 116 -71 -76 56 -202 63 -93 -238 -67 -117 116 95 -163 -150 128 20
$$ packed form
2257A14k65J51n3r2j8O9N9K2J1j24L14j55L25j79l62K45N7k59J36J03j37j46L10
2280A26k59j42J60J03n8o8J89L3r0P5j2q1J1N0L9P2j19L5q8l7kk85L32k20q1L40
2306B3n6n0Q6r8k1K89j74O7L05k31l2j39J82M1r6J14k72m3K41l83L54k2j49j9
2330h3L3j44j43J42N6L3J64%k06K68n8l1J73k44J01l1j58K61jl42J39r1j43K19
2354h6K50l16k29L68q5j42K57O3L8o2J20J27m63K17n2J49j10r7j3P7k55K84l67
2377c27J89L52k81J28J2j17J80n0J09q2k81J58N9J08k92L30j45j5M4n8k71K38
2399a2J5j07J02k5J43j37k26L78k53M4J69r4j59J11n7k5J59o2k25Q3o1J57k6K1
2423h7K0R1K2j26K08J7j34J05j87nJ32k58K65j56j45J71n0K33k1k58J3K78j08
$$ plain form
2446 20 -56 172 68 198 137 -47 32 96 103 85 -116 115 51 -146 72 -37 -115 -233 -76 -121 -6 19 76 86 54
2471 54 35 -11 -34 139 0 141 -25 -53 -25 64 -52 -140 -314 -80 18 -187 -151 -141 13 26 108 75 89 124 141 43
2497 43 -160 -59 100 47 -76 -152 -24 38 -113 -20 -119 -104 239 -72 -62 72 20 128 158 4 61 191 106 -253
2521 -253 -77 -57 122 61 60 70 -33 -228 30 -132 -202 -59 68 -20 32 71 -29 167 27 129 74 -99 50
2544 50 -256 71 95 -40 -56 -192 41 80 29 56 -25 153 -117 36 -156 -67 18 -135 -120 -49 74 308 54 -102
2568 -102 8 -209 -29 25 1 73 62 -135 -125 -107 -106 -103 36 55 239 38 -171 163 -56 -13 54 193 64 -171
2592 -171 -62 -22 -130 -114 44 -117 70 81 -235 -42 -33 -38 115 22 20 38 27 46 -62 -39 -86 92 121 48 63 60 -42
2619 -42 -65 110 -72 -179 -403 115 -116 192 -2 71 168 -184 -184 -134 190 44 -83 12 54 -148 18 -142 55
$$ packed form
2446B0p6K28j04J30o1j84P9O4Pj8k01K31o4j97K18j09p8j18J57m5J15K5N7J0l2
2471E4j9m6k3J73j39J41j66k8K8Q9j16q8j74K34R8k05L6J0J54J3Q2l3J4L5J7r8
2497D3k03J01J59n3j23p6J28O2j51R3r9J5L43l11J0J34n2J08L0j54N7J30q5l59
2521b53J76K0J79o1jJ0j03j95K58j62p0J43J27q8N2L9j00J96j40J02n5j73J49
2544E0l06L27K4j35j6j36K33L9n1K7q1J78k70J53j92Q9Q5j53J5P1J23K34k54j56
2568a02J10k17J80N4k4P2j1j97J0J8JLJ39J9J84k01k09L34k19M3O7J39j29k35
2592a71J09M0j08J6J58j61J87J1l16J93RnJ53r3kJ8j1J9j08K3m7J78K9p3J5lj02
2619d2k3J75j82j07k24N18k31L08j94P3R7l52%N0L24j46j27R5M2k02J66j60J97
$$ plain form
2642 55 -159 -37 -80 0 5 81 -27 -118 -49 271 202 22 104 152 209 -162 29 -181 -89 29 77 -162 -126 -95 -6 -118
2668 -118 -50 -256 -19 137 141 -61 54 -7 -95 337 -95 -190 -199 -234 23 89 -52 58 -99 75 101 44 -11 240
2692 240 245 -51 -175 123 281 195 60 0 -221 99 4 79 -179 91 65 -136 -24 77 -69 -145 62 32 39 -34
2716 -34 70 -51 176 156 84 32 -6 14 192 -268 84 -59 -147 -141 -59 -257 -178 -146 92 -71 -189 25 172 31
2740 31 116 133 153 209 207 -111 28 287 -19 -55 144 200 -88 8 -144 -162 17 46 -26 -48 -73 89 142 81 -46 77
2766 77 33 120 207 -12 86 -89 -53 -38 14 -6 -70 -56 -190 -114 -192 148 192 -149 103 134 -133 129 -32 193 -81
2791 -81 204 51 -86 172 -14 170 -193 -66 -348 13 -56 61 296 -69 -95 114 98 14 28 115 -19 -58 38
2814 38 -133 209 39 6 60 -7 135 -153 -180 -153 95 28 -77 -64 -50 -38 -165 24 39 39 19 86 -171 -17 48
$$ packed form
2642E5k14J22m3Q0NP6j08r1O9L20o9j80Q2M8N7l71J91k10R2J18M8k39L6L1Q9j12
2668a18O8k06K37J56Mk02J15o1q8M32m32r5rl5K57O6j41J10j57J74K6n7n5K51
2692B40Nk96j24K98J58q6j35o0k21L20r5P5k58K70k6k01J12J01j46p6K07l0Pp3
2716c4J04j21K27k0p2n2l8K0J78m60L52j43q8OQ2j98P9L2K38j63j18K14J47j41
2740C1Q5J7K0N6kl18J39K59l06l6J99N6k88R6j52j8J79K9p2k2k5J62N3o1j27J23
2766G7m4Q7Q7k19R8j75L6J5N2k0o4J4j34P6p8L40M4l41K52L1k67K62j61K25k74
2791h1K85j53j37K58j86J84l63J27k82L61o9J17K35l65k6K09j6q4J4Q7j34l9R6
2814C8j71L42j70l3N4o7J42k88k7K7K48o7j05J3J4J2j27J89J5%k0O7k57J54O5
$$ plain form
2839 48 -41 122 -13 85 54 -11 -81 -65 16 -110 62 111 18 -6 203 94 73 66 -14 -168 -66 -124 -189 114 -72 -103
2865 -103 57 83 -62 -117 -23 167 -146 64 136 88 -18 112 -81 -1 54 114 63 -154 57 -1 -75 136 -103 -24
2889 -24 -163 195 -122 117 310 -44 30 -192 -36 99 54 -88 119 -111 13 66 -190 -79 -33 -33 -117 -116 -186 42
2913 42 -186 -184 -25 57 138 128 123 -27 24 106 -82 43 57 2 22 -202 -28 22 154 173 -32 -89 131 61 -63 24
2939 24 155 -75 191 164 152 197 -11 73 -46 74 136 79 2 -169 -13 133 30 -374 -131 21 121 -1 95
2962 95 26 -82 33 108 -57 -33 290 184 -208 15 76 -105 32 126 -9 162 -61 149 -43 -144 -245 95
2984 95 54 116 -277 -49 92 -82 29 7 62 -56 10 -21 -25 -116 31 -41 -45 99 66 -126 47 -108 83 -143 131
3009 131 95 -127 -69 277 9 -49 44 -80 2 -81 151 -63 -285 5 -70 -153 -77 52 150 81 -54 33 -153 -217
$$ packed form
2839D8q9J63j35R8l1o5p0J6Q1j26J72M9r3k4K09j09k1pq0j54J02n8o5L03j86l1
2865a03J60K6j45n5R4J90l13K10P2m8j06J30j93Q0N5O0n1k17K11n8p4K11k39P9
2889b4j39L58l17K39J93l54P4k22J56J35m5j42K07k30J24N3k56J11M6%q4Jp0K28
2913D2k28KJ59Q2Q1j0nj50N1Q2j88J25J4n5K0k24J74N0J32J9k05n7K20p0j24Q7
2939B4J31k30K66k7j2M5k08Q4j19J20O2n7p7j71J56J46j03m04K43J52J00j22R6
2962I5o9j08J15P5j65K4L23j06l92K23O1j81J37R4j35J71k23K10j92j01j01L40
2984I5m1O2l93K28J41j74J11k2N5j18O6l1mr1J47p2mJ44l3j92J73j55J91k26K74
3009A31l6k22N8L46k68n8R3j24Q2q3K32k14k22K90p5q3P6J29R8o9j35Q7j86o4
$$ plain form
3033 -217 48 -7 22 -52 89 -120 -179 40 78 -138 -164 -26 74 59 -210 -12 -145 30 106 14 210 90 -25
3056 -25 -81 -166 131 -27 21 -107 -47 26 -101 82 13 -9 131 107 -119 -169 130 -6 -10 78 13 71 -84 105 -115
3081 -115 -38 12 73 51 -31 47 37 122 -97 -62 -19 -82 279 67 173 19 97 124 81 -24 106 144 185 -82 -16 -2
3107 -2 34 31 -128 83 51 -11 -1 -71 -68 53 99 121 73 37 188 -6 12 67 -143 -5 98 -28 -39 85 -117 -277
3133 -277 -140 -205 -232 92 6 9 169 122 47 -21 25 -120 -81 78 13 90 35 -135 -30 5 57 -4 -157 -70 243 -101
3159 -101 28 54 8 -127 130 -45 -319 124 43 0 102 141 -45 15 -2 -12 -53 18 2 -123 -52 -18 -160 71
3183 71 2 131 -9 -93 -63 21 -91 -1 -67 82 -104 -18 14 16 152 -43 54 -4 -159 -225 -41 299 -115 -39 53
3208 53 196 173 -30 89 -68 96 -72 196 -105 58 178 147 -16 -66 273 -228 193 -186 46 -32 -251 186
$$ packed form
3033b17K65n5K9p4J41k09n9K19L8k16k6J38J00j5k69J98j33J75P6r2J96j20j15
3056b5n6q5K97j58M8j28O0P3j27J83o9k2J40k4k26n0K99j36mQ8o5N8j55J89k20
3081a15P7N0O1k2q2P8j0Q5k19L5M3o3L61k12J06j54P8K7m3j05J30L8M1k67O6J4
3107bL6lj59K11l2o2J0p0LJ21M6K2m8l6J51j94J8N5k10J38J03j26j1J24k02j60
3133b77J37o5k7L24q6LJ60m7p5o8M6j45L9J59o5P7n5j70J05L5N2o1j53Q7L13l44
3159a01J29K6m6j35K57j75k74M43q1m3J02L9j86O0j7j0m1P1j6j25P1L4j42K31
3183G1o9J29j40q4L0Q4j12R0o6J49j86Q6L2KJ36j95R7n8j55o6J84L40m14P6R2
3208E3J43k3k03J19j57J64j68K68l01J63J20l1j63n0L39n01M21l79K32p8k19M37
$$ plain form
3230 186 -51 123 16 -1 23 -5 -22 -27 -74 78 -170 -36 -22 -224 -35 52 -48 1 16 -70 66 54 65 64 116 -77
3256 -77 115 45 -21 115 48 -32 25 127 -155 108 -46 -204 -217 -126 156 162 -98 -94 73 228 135 15 -22 -103 113
3281 113 156 -13 -134 -40 137 -60 -94 -83 4 -100 -49 -75 101 -164 -56 -34 121 -188 1 172 159 112 123 70
3305 70 -84 -130 -280 -161 -38 23 -51 -67 -19 39 193 -113 -65 65 33 53 94 -32 -197 -3 43 36 -80 111 -31
3330 -31 52 88 84 -24 75 -181 14 54 78 -136 -29 264 70 214 32 -27 62 -19 23 -192 150 -82 129 -98
3354 -98 -69 -16 1 -50 100 35 83 -29 -46 -1 11 17 69 6 161 -65 -227 146 1 68 107 4 33 -184 88 16
3380 16 -107 -44 -22 -120 93 46 167 -2 212 -1 -228 54 -36 5 58 -81 51 -148 -53 -110 -27 28 28 -82 -106
3405 -106 178 -76 -36 50 -123 -170 -113 179 110 69 42 109 162 -139 60 -4 -182 3 65 43 28 -35 -2 19 -9 -27
$$ packed form
3230A86k37J74j07j7K4k8j7nm7J52k48J34J4k02J89Q7j00M9J5q6J36j2J1jN2j93
3256g7J92p0o6J36o7q0N7J02k82K63j54j58j3R1K82Ok60MJ67J55r3j20l7q1K16
3281A13M3j69j21R4J77j97l4J1Q7j04N1k6J76k65J08K2J55l09J89J71j3m7J1n3
3305G0j54m6j50J19J23O1p4j6M8N8J54l06M8J30l2K0M1j26j65J94M6pj16J91j42
3330c1Q3L6mj08R9k56J95M0K4k14J07K93j94J44j82n9Q9q1M2k15L42k32K11k27
3354i8K9N3J7n1J50o5M8j12j7M5J2ON2o3J55k26j62L73j45O7L9j03K9k17K72p2
3380A6j23O3K2r8K13m7J21j69K14k13k27K82r0M1N3j39J32j99R5n7Q3N5%j10k4
3405a06K84k54M0Q6j73m7N7K92o9m1k7O7N3l01J99o4j78J85O2k2j5o3L3K1k8j8
$$ plain form
3431 -27 49 196 -56 37 33 -189 48 33 105 134 45 118 -147 -20 27 -45 -5 -75 -51 50 -76 110 10 -146 -22
3456 -22 256 -103 222 27 -184 -20 144 21 -35 128 159 -29 -88 -11 -168 -56 -137 -29 105 98 79 28 36 97
3480 97 -112 164 -3 -113 36 42 -41 -81 -108 -32 18 -41 59 142 -143 49 26 97 -18 7 38 -94 -55 24 -26 58
3506 58 228 -47 122 -129 143 -71 14 303 -169 1 189 -91 -3 15 -118 324 11 -143 118 13 177
3527 177 0 -223 -78 -73 55 -139 170 50 44 -92 -24 78 -146 66 -135 68 3 23 93 -36 -32 -26 129 -14
3551 -14 -53 41 48 178 86 66 7 94 -300 165 -165 -14 57 18 -66 28 130 -72 -74 13 -27 6 -131 -21 -79 -177 201
3578 201 167 -52 -49 -14 91 19 18 -17 -101 -68 -120 102 56 -63 78 -54 -59 136 -113 72 -106 -16 165 20 -179
3603 -179 263 80 -59 183 -26 -56 113 171 -102 -56 -242 -68 -115 216 -25 -16 -130 16 -83 82 43 -186 -148
$$ packed form
3431b7P6J47k52R3mk22K37j5P2K9q9P3k65J27M7p2M0p0K4J01j26J86j00j56J24
3456b2K78l59L25j95k11J64J64j23n6J63L1j88n9P7j57J12q1J08J34pj9n1QO1
3480I7k09K76j67j10J49Oq3m0k7P6N0n9J00Q3k85J92k3P1j15K5L1j32L9P9n0Q4
3506E8J70k75J69k51K72k14Q5K89m72J70J88k80Q8J8j33M42l13j54K61j05J64
3527A77j77k23J45NJ28j94L09j20oj36O8J02k24K12k01K03o5K0P0j29MOJ55j43
3551a4l9R4PJ30r2k0n9Q7l94M65l30J51P1l9q4R4J02k02kQ7m0L3j37J10n8r8L78
3578B01l4k19LL5J05p2jl5q4L3n2K22m6j19J41j32nJ95k49J85j78R0J81j45j99
3603a79M42j83j39K42k09l0J69N8k73M6j86J74m7L31k41Rj14J46r9J65l9k29L8
$$ plain form
3626 -148 98 -108 57 -39 84 26 -120 26 7 49 23 176 49 82 156 36 107 -103 -187 -51 -112 74 -157
3649 -157 213 188 81 186 37 21 31 -89 94 42 150 7 -50 -84 -90 69 82 -54 -59 57 -104 150 -70 -92
3673 -92 -26 152 -27 -38 93 136 -23 -6 16 -197 21 45 -83 160 -47 152 -31 -82 -3 66 -143 19 1 -66
3697 -66 104 11 -232 -31 5 121 191 -43 26 102 -6 -123 48 -12 -143 56 241 97 -11 26 114 107 30 -73
3721 -73 -120 252 -153 -6 46 -9 -129 -93 -29 47 106 59 35 -144 -75 -243 99 28 146 88 -16 -2 -212 67 78
3746 78 34 103 -112 -66 -63 -11 196 -1 -18 -227 -29 -105 -21 127 -18 -8 186 124 -135 -80 7 -59 70 149 -155
3771 -155 3 -131 180 163 49 -75 -126 19 30 -88 61 55 74 -22 -20 127 -224 131 -207 93 -193 2 -49
3794 -49 27 88 155 -183 -141 138 37 121 108 11 -100 -39 77 35 -117 41 57 106 146 211 -15 -197 67 -132 124
$$ packed form
3626a48K46k06J65r6J23n8j46J46j9M2k6J53j27L3P4j20P1k10q4J36o1J86k31
3649a57L70k5j07J05j49j6J0j20J83n2J08j43n7l4oJ59J3j36nJ16j61K54k20k2
3673i2O6J78j79j1J31M3j59J7K2k13K18K4j28K43k07J99j83n1P9O9k09J62j8o7
3697f6J70r3k43K01L6J16P0k34O9P6j08j17J71o0j31J99J85j44j08L7Q8pp7j03
3721g3m7L72m05J47N2n5j20L6O4P6N9m7k4j79O9j68L42p1J18n8j04J4k10K79J1
3746G8m4O9k15M6LN2K07j97j7k09J98p6Q4J48j45J0J94o2k59N5Q7o6J29P9l04
3771a55J58j34L11j7j14j24n1J45J1j18J49oJ9r6KJ47l51L55l38L00k86J95n1
3794d9P6O1O7l38M2K79j01Q4j3r7j11O1J16m2j52J58J6M9M0O5k26j82K64j99K56
$$ plain form
3819 124 -59 -40 19 30 -12 -268 -74 -36 113 -92 -49 107 -62 -23 89 -77 205 45 41 56 -98 106 252
3842 252 63 18 156 -118 -234 -122 77 -32 114 74 20 -32 -31 127 -12 118 -27 70 40 112 -3 -118 -3
3865 -3 -83 -28 42 87 35 -74 -74 -46 23 82 -113 128 247 -88 227 -26 -8 -55 149 -153 -124 175 20 -3 -207
3890 -207 -14 -32 135 29 -38 56 -17 -126 66 -164 -74 -96 23 -209 7 154 -52 -126 0 7 -266 50 123
3913 123 -10 -88 189 84 -66 -125 114 -150 30 -68 -309 25 36 93 -25 7 -67 -135 50 137 -87 91 -117
3936 -117 171 -283 -57 107 -143 25 17 82 -132 -21 0 -54 2 -11 -56 97 -83 -91 -194 -281 -199 -61 310 111
3960 111 75 -10 218 -180 -71 -110 104 221 181 167 181 -117 40 48 0 4 -23 141 -11 97 15 109 15 316 -50
3985 -50 65 -265 68 -58 -48 0 -165 84 0 50 55 31 93 -40 -65 15 -32 -52 176 51 122 -58 70 116 31
$$ packed form
3819A24j83J9N9J1m2k56J94L8J49k05M3J56j69L9J12j66K82j60mJ5j54K04J46
3842B52j89m5J38k74j16J12J99j09J46m0n4n2JJ58j39J30j45R7l0P2j15j15J15
3865cq0N5P0M5n2j09%K8O9N9j95K41J19l35L15k53J8m7K04l02K9K99j55k3k04
3890b07J93j8J67j06o7R4p3j09J92k30R0k2J19k32K16J47k06p4J26Pk73L16P3
3913A23j33p8K77j05j50n9K39k64J80r8k41L34J1N7j18L2p4o8J85Q7k24J78k08
3936a17K88m54K26J64k50J68qO5k14J11K1n4N6j3m5J53j80qj03q7Q2J38L71j99
3960A11l6q5K28l98J09l9K14J17m0j4J4k98J57Qm8Mk7J64j52J08q2R4r4L01l66
3985e0J15l30L33j26J0M8j65K49q4N0Nk4O2j33k5Q0m7k0K28j25P1j80J28M6q5
$$ plain form
4010 31 -25 181 -126 13 -35 17 -107 68 74 99 -221 -118 2 -47 24 245 20 18 -1 142 -95 5 -92 124
4034 124 193 -149 104 -85 -31 -44 -200 -9 110 59 141 45 -372 -84 181 -115 143 -141 -59 -52 42 63 10 -180
4058 -180 -222 -46 191 -215 67 35 -187 -1 171 6 -71 316 -195 -62 22 -189 -103 -128 3 34 -45 51 23
4081 23 119 -20 -51 1 -36 -82 128 189 -95 125 -23 139 -1 -18 20 164 48 155 119 101 47 -23 -40 48 -129
4106 -129 13 3 42 149 47 -114 -84 -75 108 68 36 -147 186 -50 -136 25 66 107 -56 59 139 -105 -125 -28
4130 -28 -114 52 12 109 41 -86 316 114 -81 183 -13 201 121 -181 -171 -26 -48 417 73 -301 72 22 -72
4153 -72 140 -111 7 53 -93 -88 23 -95 -9 -67 15 192 124 60 -140 132 257 162 -11 -295 -81 -118 -61 -81
4177 -81 23 172 -67 -43 -141 -32 -106 -176 114 39 58 26 197 -32 16 38 -81 -77 -229 -79 -2 -7 -17 -89 6 -84
$$ packed form
4010C1n6K06l07J39m8N2j24J75OK5l20J03J20m9P1K21k25kj9J43k37J00r7K16
4034A24O9l42K53j89N4j3j56J91J19n1Q2r6m17K88K65k96K58k84Q2PR4K1n3j90
4058a80m2J76K37m06K82l2k22J86J72j65p7L87n11J33Q4k11Q6k5J31L1p9R6k8
4081B3R6j39l1N2l7m6K10O1k84K20j48J62j40j7L8J44j16J07l6j8n4p0j7Q8j77
4106a29J42j0L9J07j02j61L0RJ83m0l2j83L33k36q6J61M1M1j63J15Q0k44k0R7
4130b8q6J66m0R7o8j27M02k02j95K64j96K14q0l02J0J45k2M65l44l74L73n0r4
4153g2K12k51J18M6j46NJ11j18Q6n8Q2J77o8o4k00K72J25r5j73k84K14l7N7k0
4177h1J04J49k39K4r8J09p4p0K90p5J9l2J71k29M8K2j19Mj52J50P7nj0p2R5r0
$$ plain form
4203 -84 158 160 -204 79 -116 184 269 5 86 155 60 -185 120 59 -55 95 74 26 133 44 69 -148 77 5
4227 5 -92 -49 75 -85 -8 10 -133 82 -137 257 -46 34 159 3 -60 82 140 30 -238 67 -124 124 -135
4250 -135 -125 -50 -75 -65 -181 168 21 30 -73 84 -109 -101 -70 -47 -132 3 44 109 53 104 -20 21 -70 168 9 -26
4276 -26 160 -27 -207 120 143 35 -9 -157 39 71 6 -6 98 54 -171 96 -99 -50 194 105 -74 -7 -306
4299 -306 -11 247 102 28 186 23 -101 78 -164 -139 -33 -155 -26 -154 88 43 -4 -98 -164 -21 132 -10
4321 -10 -66 -55 -17 81 109 31 37 23 93 78 248 172 202 12 -206 -18 -114 65 83 41 -38 128 133 -122 57 -43 129
4348 129 -81 39 122 -17 124 -3 -211 10 -202 -7 56 19 130 -31 93 178 19 -115 82 -142 -83 122
4370 122 235 215 -163 -25 -180 -11 234 28 -75 -137 -89 -44 125 -51 -160 67 10 80 185 97 -178 87
$$ packed form
4203h4K42Kl64K83j95L00Q5k64Q1O9r5k45L05o1j14J50k1m8J07q9K5k17K25p2
4227Er7M3J24j60P7J8j43K15k19L94l03Q0J25j56o3J42N8j10k68L05j91K48k59
4250a35J0P5k5J0j16L49j47Rj03J57j93QL1K3q5J35M1O5n6N1j24M1r1K38j59l5
4276b6J86j87j80L27K3j08m4j48J96L2o5j2J04m4k25K67j95M9K44q9j79O7k99
4299c06K95K58j45p4J58j63j24J79k42K5J06j22J29j28K42m5m7r4o6J43J53j42
4321a0n6J1L8R8K8p8Oj4P0j5J70p6L0j90k18J88r6J79J8m2p9J66Nk55J79j00J72
4348A29k10J20Q3j39J41j27k08K21k12J95O3l7J11j61J24Q5j59j34J97k24N9K05
4370A22J13k0l78J38j55J69K45k06j03o2M8M5J69j76j09K27n7P0J05q8k75K65
$$ plain form
4392 87 95 -44 -36 -64 -136 -151 77 -251 34 -63 -133 124 131 16 205 85 19 99 -27 101 16 122 -134 114 -64
4417 -64 81 161 -216 24 70 59 -69 -74 27 12 163 222 127 101 95 -132 -222 -205 105 -15 -84 -172 231 83 53 64
$$ packed form
4392H7Qj39Qk8p2j5K28l28K85r7p0K57Pj15J89j20o6Q0j26J28q5J06k56K48j78
4417f4J45Q0l77K40M6j1j28nJ01j5J51N9r5k6ok27r0J7L10j20o9q8M03j48l0J1
$$ [...]
8191A11
##END NTUPLES=NMR FID
##END=
