##TITLE=1H_Pr 37
 DMSO
 8 sc, 
 5.04.2022
##JCAMPDX= 6.0         $$ Bruker NMR JCAMP-DX V2.0
##DATA TYPE= NMR FID
##DATA CLASS= NTUPLES
##ORIGIN= UXNMR, Bruker Analytische Messtechnik GmbH
##OWNER= root
$$ XWIN-NMR		Version 3.5
$$ Tue Apr  5 15:51:59 2022 Russian Standard Time (UT+4h)  she@DPX200
##.OBSERVE FREQUENCY= 200.131346
##.OBSERVE NUCLEUS= ^1H
##.DELAY= (6, 6)
##.ACQUISITION MODE= SIMULTANEOUS
##.ACQUISITION SCHEME= undefined
##.AVERAGES= 8
##.DIGITISER RES= 18
##SPECTROMETER/DATA SYSTEM= spect
##.PULSE SEQUENCE= zg30
##.SOLVENT NAME= DMSO
##.SHIFT REFERENCE= (INTERNAL, DMSO, 0, 15.7039)
##AUDIT TRAIL= $$ (NUMBER, WHEN, WHO, WHERE, WHAT)
$$ ##TITLE= Audit trail, XWIN-NMR		Version 3.5
$$ ##JCAMPDX= 5.01
$$ ##ORIGIN= Bruker BioSpin GmbH
$$ ##OWNER= she
$$ F:/spectra/data/she/nmr/H-F/1/audita.txt
$$ ##AUDIT TRAIL=  $$ (NUMBER, WHEN, WHO, WHERE, WHAT)
(   1,<2022-04-05 15:51:01.50 +0400>,<she>,<DPX200>,
      <created by zg, POWCHK disabled, PULCHK disabled
       configuration hash MD5:
       00 E9 B6 7A A2 85 ED C7 34 08 36 98 17 FE 4E 26
       data hash MD5: 16K
       0B DB 99 0E BF 25 44 3D 3A 88 5D 9D 6C B0 5C F1>)
$$ ##END=
$$ 
$$ hash MD5
$$ F0 DA D0 15 D1 DF B9 37 34 7D FD 5B 64 42 F2 67
##$RELAX= 
##$RELAX= 
##$RELAX= 
##$RELAX= 
##$RELAX= 
##$RELAX= 
$$ Bruker specific parameters
$$ --------------------------
##$DU= <F:/spectra>
##$EXPNO= 1
##$NAME= <H-F>
##$PROCNO= 1
##$TYPE= <nmr>
##$USER= <she>
##$AMP= (0..31)
100 100 100 100 100 100 100 100 100 100 100 100 100 100 100 100 100 100 
100 100 100 100 100 100 100 100 100 100 100 100 100 100 
##$AQSEQ= 0
##$AQ_mod= 1
##$AUNM= <au_zg>
##$AUTOPOS= <>
##$BF1= 200.13
##$BF2= 200.13
##$BF3= 200.13
##$BF4= 200.13
##$BF5= 200.13
##$BF6= 200.13
##$BF7= 200.13
##$BF8= 200.13
##$BYTORDA= 1
##$CFDGTYP= 0
##$CFRGTYP= 5
##$CHEMSTR= <none>
##$CNST= (0..31)
1 1 145 1 1 1 1 1 1 1 1 1 1 1 1 1 1 1 1 1 1 1 1 1 1 1 1 1 1 1 1 1 
##$CPDPRG= <>
##$CPDPRG1= <>
##$CPDPRG2= <>
##$CPDPRG3= <>
##$CPDPRG4= <mlev>
##$CPDPRG5= <mlev>
##$CPDPRG6= <mlev>
##$CPDPRG7= <mlev>
##$CPDPRG8= <mlev>
##$CPDPRGB= <>
##$CPDPRGT= <>
##$D= (0..31)
0 1.2 0 0 0 0 0 0 0 0.06 0 0.03 0 0 0 0 0.0002 0 0 0 0 0 0 0 0 0 0 0 0 
0 0 0 
##$DATE= 1649159460
##$DBL= (0..7)
120 120 120 120 120 120 120 120 
##$DBP= (0..7)
150 150 150 150 150 150 150 150 
##$DBP07= 0
##$DBPNAM0= <>
##$DBPNAM1= <>
##$DBPNAM2= <>
##$DBPNAM3= <>
##$DBPNAM4= <>
##$DBPNAM5= <>
##$DBPNAM6= <>
##$DBPNAM7= <>
##$DBPOAL= (0..7)
0.5 0.5 0.5 0.5 0.5 0.5 0.5 0.5 
##$DBPOFFS= (0..7)
0 0 0 0 0 0 0 0 
##$DE= 6
##$DECBNUC= <off>
##$DECIM= 32
##$DECNUC= <off>
##$DECSTAT= 4
##$DIGMOD= 1
##$DIGTYP= 9
##$DL= (0..7)
0 120 120 120 120 120 120 120 
##$DP= (0..7)
150 150 150 150 150 150 150 150 
##$DP07= 0
##$DPNAME0= <>
##$DPNAME1= <>
##$DPNAME2= <>
##$DPNAME3= <>
##$DPNAME4= <>
##$DPNAME5= <>
##$DPNAME6= <>
##$DPNAME7= <>
##$DPOAL= (0..7)
0.5 0.5 0.5 0.5 0.5 0.5 0.5 0.5 
##$DPOFFS= (0..7)
0 0 0 0 0 0 0 0 
##$DQDMODE= 0
##$DR= 18
##$DS= 0
##$DSLIST= <SSSSSSSSSSSSSSS>
##$DSPFIRM= 0
$$ [...]
##$SUBNAM2= <"">
##$SUBNAM3= <"">
##$SUBNAM4= <"">
##$SUBNAM5= <"">
##$SUBNAM6= <"">
##$SUBNAM7= <"">
##$SUBNAM8= <"">
##$SUBNAM9= <"">
##$SW= 18.0517287032376
##$SWIBOX= (0..15)
0 0 2 0 0 0 0 0 0 0 0 0 0 0 0 0 
##$SW_h= 3612.71676300578
##$TD= 16384
##$TD0= 1
##$TE= 0
##$TE2= 300
##$TE3= 300
##$TEG= 300
##$TL= (0..7)
0 120 120 120 120 120 120 120 
##$TP= (0..7)
150 150 150 150 150 150 150 150 
##$TP07= 0
##$TPNAME0= <>
##$TPNAME1= <>
##$TPNAME2= <>
##$TPNAME3= <>
##$TPNAME4= <>
##$TPNAME5= <>
##$TPNAME6= <>
##$TPNAME7= <>
##$TPOAL= (0..7)
0.5 0.5 0.5 0.5 0.5 0.5 0.5 0.5 
##$TPOFFS= (0..7)
0 0 0 0 0 0 0 0 
##$TUNHIN= 0
##$TUNHOUT= 0
##$TUNXOUT= 0
##$USERA1= <user>
##$USERA2= <user>
##$USERA3= <user>
##$USERA4= <user>
##$USERA5= <user>
##$V9= 5
##$VALIST= <valist>
##$VCLIST= <CCCCCCCCCCCCCCC>
##$VD= 0
##$VDLIST= <DDDDDDDDDDDDDDD>
##$VPLIST= <PPPPPPPPPPPPPPP>
##$VTLIST= <TTTTTTTTTTTTTTT>
##$WBST= 1024
##$WBSW= 4
##$XGAIN= (0..3)
0 0 0 0 
##$XL= 0
##$YL= 0
##$YMAX_a= 478817
##$YMIN_a= -675039
##$ZGOPTNS= <>
##$ZL1= 120
##$ZL2= 120
##$ZL3= 120
##$ZL4= 120
##$ABSF1= 10
##$ABSF2= 0
##$ABSG= 5
##$ABSL= 3
##$ALPHA= 0
##$AQORDER= 0
##$ASSFAC= 0
##$ASSFACI= 0
##$ASSFACX= 0
##$ASSWID= 0
##$AUNMP= <proc_1d>
##$AZFE= 0.1
##$AZFW= 0.1
##$BCFW= 1
##$BC_mod= 2
##$BYTORDP= 1
##$COROFFS= 0
##$CY= 11.3945322036743
##$DATMOD= 1
##$DC= 2
##$DFILT= <>
##$DTYPP= 0
##$F1P= 2.36226072786647
##$F2P= -0.459571619588291
##$FCOR= 0.5
##$FTSIZE= 0
##$FT_mod= 4
##$GAMMA= 1
##$GB= 0.15
##$INTBC= 1
##$INTSCL= 1
##$ISEN= 128
##$LB= 0.24
##$LEV0= 0
##$LPBIN= 0
##$MAXI= 10000
##$MC2= 0
##$MEAN= 0
##$ME_mod= 0
##$MI= 1.114404
##$NCOEF= 0
##$NC_proc= 0
##$NLEV= 6
##$NOISF1= 3.799351
##$NOISF2= 2.8
##$NSP= 1
##$NTH_PI= 0
##$NZP= 0
##$OFFSET= 15.70392
##$PC= 1
##$PHC0= -17677.51
##$PHC1= 21.00078
##$PH_mod= 1
##$PKNL= yes
##$PPARMOD= 0
##$PSCAL= 0
##$PSIGN= 0
##$REVERSE= no
##$SF= 200.130013532006
##$SI= 16384
##$SIGF1= 3
##$SIGF2= 2
##$SINO= 400
##$SIOLD= 16384
##$SREGLST= <1H.CDCl3>
##$SSB= 0
##$STSI= 0
##$STSR= 0
##$SW_p= 3612.71676300578
##$SYMM= 0
##$S_DEV= 0
##$TDeff= 0
##$TDoff= 0
##$TI= <>
##$TILT= no
##$TM1= 0
##$TM2= 0
##$TOPLEV= 0
##$USERP1= <user>
##$USERP2= <user>
##$USERP3= <user>
##$USERP4= <user>
##$USERP5= <user>
##$WDW= 1
##$XDIM= 8192
##$YMAX_p= 0
##$YMIN_p= 0
$$ End of Bruker specific parameters
$$ ---------------------------------
##NTUPLES= NMR FID
##VAR_NAME=  TIME,          FID/REAL,        FID/IMAG
##SYMBOL=    X,             R,               I
##VAR_TYPE=  INDEPENDENT,   DEPENDENT,       DEPENDENT
##VAR_FORM=  AFFN,          ASDF,            ASDF
##VAR_DIM=   8192,          8192,            8192
##UNITS=     SECONDS,       ARBITRARY UNITS, ARBITRARY UNITS
##FACTOR=    0.0002768,     1,               1
##FIRST=     0,             0,               0
##LAST=      2.2672688,     0,               0
##MIN=       0,             -675039,         0
##MAX=       2.2672688,     478817,          0
$$ Real data points
##PAGE= N=1
##DATA TABLE= (X++(R..R)), XYDATA
$$ [...]
1689A51m68M25K00p45M71k3n1L85m11K45j51o2o1J62k44L12m07J61M03m98J68
1710c8L55k48O2k33J79j06l31M26K32o54O23p9j16K36o26J78J24M4L22k29k7J58
1732B52l09j20J44L3rL30m42N98n14n8K44j06NK33l51K17o8j34L54m64j79N43
1754A99m48L70nj13M03k84j83M85p13L61J72k95MK66m04N42j99j82L58n76L34
1775I2k75L98p1L1m52K68J04l67O42l23K88l66MK90j89j94J24j16nL04k75M14
1797C26j71k35J85k27J58Mk46O4L9j05M05m86K37K64o11M51N6l23L75j96J20R6
1819A80k10J9J37j47q7Mj16J47l8O3J51k48j06M68l45L12k23l55P50m72j7K56
1841A23k62M36k75j1K77l95N8J43p1M3l8q2K84j06j79J62m6k13K35k58L03k62
$$ y = [151, -317, 108, 308, -437, 34, 11, -40, 345, -66, 179, 28, -34, -95, 67, -177, 135, -272, -111, 292, -206, -38, 317, 69, 131, -102, 77, -29, -360, 66, 298, -356, 267, 188, 72, 308, -318, -140, -16, 28, 350, 121, 94, 252, -57, -177, -33, 0, -9, 321, -121, 477, -37, -95, 149, 43, 48, 281, -70, 147, 79, -55, 299, -165, -344, 199, -249, 121, 116, 3, 406, 122, -61, 424, -289, 72, 244, -51, -47, 219, -185, 357, 158, -24, 334, -242, 92, -183, 215, 144, 175, -277, -9, 95, -272, 370, 47, 335, -31, -27, 263, 74, -120, 4, -112, -117, 187, -88, 326, 155, -80, 105, -122, 36, 40, -206, -142, -103, -208, 197, -289, -52, 212, -399, 52, 108, -215, 160, -36, 84, 180, -30, -11, 126, -21, -108, -104, -220, -73, -111, -48, 103, -145, -251, 217, -128, 184, -39, -394, 356, -116, -133, 123, -139, 297, 22, 11, 288, -107, -49, 94, 23, 66, 28, -54, 230, 124, -55, 107, 61, -152, 83, -175, 128, -134]
1863a34k18N46k90J67j45p9K41j9l11N09k54j68J63j61K95O7k17K52k17Q8J27
1884B42l28p4L01j14j01K8j6N4N1o5N5l5j8j76O8K81l59J67O9l05L91p9k35K45
1908D7N5n32N65m7k17K32j11J62ok34O5j12J00J26k86K98K21j88n1K4k17R2O1
1931D7K31k81j26N66k49l30J92K76m31L76o08M33K7j26J00j19j37L18k11J31%
1952G9l75M6N70m55K96j41r7K56k80R1Q8j08J64j2j41J95k05K3N2j18Q3J95j79
1975B7K69l01j87O4p4K70O1j74N5p4R3J17k21j30L65k86r1J00P1M02m75P4K10
1998A65j82J44kk36K46k53K05K2m13L11o3J5J57M4l40L00k86N0R7m6k0MO0J60
2022A39Rl16M66l50K16o1k39l3L30l15L01k7k81M89m28K61q8j49J64oj81N76n44
$$ y = [-134, -352, 194, -96, 71, -74, -153, 88, 69, -242, 267, 13, -155, 8, -153, 142, 209, -8, 244, 27, 115, 242, -86, -160, 141, 27, -74, -46, -62, -8, 43, -22, 33, -2, -20, -196, -128, 153, -206, -39, 30, -275, 116, 37, -198, 47, 102, -430, 135, 88, -129, 103, -8, 154, 148, -86, -21, -133, -33, 93, -193, 105, 326, 138, 87, 111, -106, -14, 47, 278, -3, -129, 437, 188, -142, 50, 326, -105, 271, -337, 96, 123, -3, 97, -22, -159, 159, -52, 79, 79, -296, -250, 320, -135, 161, 20, -77, 179, -101, -10, 78, -30, 134, 122, -19, 176, -29, -6, 46, -72, 11, 206, 27, 296, -5, -192, -128, -202, 68, 129, -45, 10, -64, 29, 146, -75, -205, 160, -126, -217, -117, -46, 356, -119, -45, 165, -17, 127, 125, -111, 135, -118, 87, 109, -304, 7, -56, -41, 116, 160, -180, 120, -166, -116, -19, -65, -85, -81, -21, 139, 148, -168, 298, -52, 164, 103, -136, -169, 161, -154, 147, 120, -161, 328, -100, 161, 73, -76, 88, 82, -99, 477, -67]
2045f7K2R9j70j3K41l14O4L76n19J76Q9j66P3J85j73J70j40K08p4j28J38j41j5
2068g9K23L9K5l31L29j14j80J38K8k21J69j18l1J92n7j83K20K1j14K65j47K70
2090C44m27K6K48j49j01J0J54j37N0O7R7M7k26J32j08k26O0L41k69j23P4J94j91
2113a13J88n6r6J39j0k53K79k05q1K78k3OL52n50K6j91K36J63j26j23J03j29K3
2136a63L70k75K71m0o7J60n55L09O8m2L7m5k51J25K39Pk4j49N2O5j45J63j55N3
2160HJ77l47J39K28k30o1L9n3K71k61K48k13j7K56j5k07O2j45N7J82k42M32k71
2183C7r6M19r9k63J84k8k28J9K5K35l49J86N7Q3m67M37q9M1K5m09K15P7J68j29
2207E1j56K96j5j69j93J6m1K90p5k23L60r3l12K28J18J90k50j45N25o58J61J89
$$ y = [-67, -45, 54, -116, -129, 112, -202, -138, 238, -281, -105, -16, -182, -109, 76, -97, 73, -67, 141, 67, -61, 77, -64, -79, 144, 183, 208, -123, 206, 92, -88, 50, 78, -143, 26, -92, -123, 69, 12, -171, 49, 70, -44, 221, 74, 344, -83, -57, 191, 42, -59, -49, 105, -32, 18, 85, 182, 229, 3, 135, 27, -199, -139, 202, -67, -190, -116, 78, -113, 75, 19, -77, 62, 52, -201, 78, -127, -208, 70, 47, 53, 405, -145, -119, -310, -74, 89, -37, -160, -57, -186, -163, 207, -68, 203, 163, 96, 256, -299, 10, 78, 36, 73, 28, -223, -98, 141, 148, 124, -25, 27, 92, -53, 110, -45, 8, 185, -162, -23, 205, -25, -86, -47, -100, 171, -90, 158, -55, -72, 184, 169, -38, 24, -121, -64, 118, -124, 308, 37, -59, 360, 261, -2, 182, 154, -74, -55, -30, 205, -144, 42, 99, 182, -285, 152, 63, 104, 129, -280, -65, 12, 180, 51, -105, 191, 176, 7, -186, -170, -211, 79, 4, -219, 141, 48, -264, -36, 82, 272, 22, -123, 402, -256, -95, 94]
2229I4n4n3l3j30J58j74L84O2m18OR3M0k07K28J06K88n18L7K98n27K65K6j41K56
2253H6j76J87j43Q4p3j37K14O5p4j39L07l45J07K03j98J51M0L6k62J06J76k34
2275a9j63J38M1k2j11L27j74j55K02j04K29j36j0O4j88M4k08K40j4j57K27k2M
2298C3m9Q4q7J63j45L1L33l98q2K34j88J32j36M3o5O3Q6J15j86nj04O2O8j80L15
2323A37j77o0N20m80j59J65j14P2J34K1J92j94k05J17l7m1L50r0m85L43p6QR4
2346C5O3M0l00k9K07P7j86J91l18K85j48J32n3q6N4M4j85K46J25l4J16k23r1L09
2370B71m54M08Lk38n5k1L4k5K6O7NO3q3m6l2J56j33j00L21k16K48k67q5R9J25
2395G1K1p6N6J9K6k69L78p0k34K28l7k05n8J06p8K71k35R3K57k96J20j07J19q9
$$ y = [94, 40, -13, -46, -176, -18, -192, 192, 254, -164, -158, -65, -25, -232, -4, 102, 390, -128, -91, 207, -320, -55, -29, -170, 86, -90, 97, -46, 38, -35, -172, 42, 107, 33, -106, 201, -144, -37, 166, -32, 119, 159, 195, -67, 39, 215, -19, -182, -44, -3, -25, -136, 191, 17, -138, 64, -40, 189, 53, 43, 107, -81, -37, -245, -5, -19, -176, 51, 29, 33, -16, 68, -19, 144, -1, 30, 363, -35, -117, 117, -71, 61, -75, -32, -97, -34, 52, 167, -19, -24, -128, -66, 2, -178, 137, -40, -100, 420, -60, -219, -54, -168, -96, 38, 59, 251, 57, -148, -31, -68, -109, 241, 151, -334, 9, -67, -59, 35, 98, 138, -162, -191, 16, 93, -93, 98, -220, 65, -83, 49, -4, -90, -36, 8, -177, 69, 194, 160, 276, 53, -38, 271, -183, 225, 228, -10, -65, -86, -52, -77, -51, 16, 21, 84, 1, -45, -77, 79, -54, -154, 167, -49, 199, -68, -153, -54, 71, 92, 16, 72, 91, 117, -152, 226, 156, -78, 150, 113, -92, -150, -44, -122, 149, -86, 7, 264, -32, 88, -19, 100, 11]
2419A1j82L77k56P1Q5r5O7K03m47O3J58j6J52k03R0q8m4J76J39k88J50l9k74K10
2443B0k3nJ6Q0j57J02j36j55M21j84m5M2j51L30l59J98R0r2j5L7j00K63k01P2
2467D8J27j49k99M42l69K67l84J55J25J36qQj60K89k09Q5p7n2qL6K3j07J43j08
2491d6K56l17l4N1R2J4j82J78l6n4M9K26j75j61J31j2J20j20R3j42Q6l41L15j99
2515b08J78J70q7j53J25L7k10j52L65m0k61L44j03p1l1l8kK05k4m2m0k15L05P3
2539A25o4j66J13K04p3k14P7j11LJ47k73L21k05L39j61Nj87j98K74O1p0K66k99
2562h6o3J19R1l6j55M73l94n7O12n67J75K6o4r4M4k06o1L7O3K56k66M19l62o3
2586a59L58j16j55K04k20K12j61j0j21n7K39L4k5j04M7j42J72J73k58K30j41J50
$$ y = [11, -171, 206, -50, 21, 106, 11, 78, 281, -166, -103, 55, 39, 191, -12, 78, -10, -54, 122, 261, -27, 123, 84, -190, 20, -3, -8, 8, 88, -69, 33, -103, -258, 163, -21, -66, -24, -175, 155, -204, -6, 84, -8, -23, 14, -86, 177, -24, 48, 175, 26, -273, 169, -200, 67, -317, -162, -37, 99, 91, 99, -61, 228, 19, 104, 27, -25, -33, 3, 26, -81, 62, -46, 210, -107, -141, -90, 2, 16, -166, 12, -24, -78, -29, 197, 22, -139, -8, -20, 100, -20, 73, -69, 17, -324, -9, -208, -30, 140, 53, -100, 25, 62, -148, -300, 65, 25, -236, 108, 5, -66, -97, -135, -137, 68, 44, 2, -38, -253, 52, 125, 61, -105, 8, 212, 139, -75, 2, -109, -106, 41, -232, 89, -116, 223, 62, 67, -120, -318, -44, 17, -53, 213, -86, -149, -30, 61, 25, -130, 343, -51, -108, 504, -63, 112, 138, 74, -20, 24, -182, -243, -206, -143, 113, -153, 266, -96, -159, 199, 83, -72, 132, -88, 124, -37, -47, -168, -225, 14, 48, 23, -81, -34, -176, -4, 169, -89, 141, 0, 150]
2608A50j88j48L53k62J28k04L19m51K17RJ40k21l3Q8K8R4k05J43O0J82k85J45
2630E9j19RK53l87J63K78m48K30j15J9K18j30m15M45j25P7P6j27K52k05j61K57
2652A04O9j61j21J27p9K75k27N2J35k29k00M93j76L6j21P5j46j6P1Q9n5J74k62
2675i3K75K2m28qJ9K9j21M63O7k98L1m7L6J05k39k23M74P9l97L96o4j86j4o6K49
2700F1J7j87K37k05P2%r2m6L28n71K20K88k36J22O1K9m9j62K45J99n48J06M9J47
2724H5j12q7J42R2j46K91r0l61J53L40l90J26J50l6k61J84k10n5J23P5J80l76
2746a83K05j21o3J93j20o9K05n8n2k45L45J11k46K92j90j61K39j99QJ21p0J49
2768I1J62j43j40K33l64K38L0q9jj7p3j64K37o9J77k33J79p2q0q8J15o2O0r6L15
$$ y = [150, -38, -186, 167, -95, 33, -171, 148, -303, -86, -77, 63, -158, -191, -103, -75, 19, -186, -43, 17, 199, -86, 59, -60, -51, 202, -185, -22, 256, -192, 38, -77, -58, 160, 30, -385, 60, -65, 12, 88, -39, 213, 8, -153, 104, 173, 12, -109, 18, -61, 214, -13, 39, 174, -55, -255, 238, 62, 98, -23, 52, -94, -110, -39, 50, -5, 169, -93, 182, 204, -224, -232, -213, -184, -305, 158, 225, -73, -42, -89, -53, 52, -187, -410, 64, 143, -254, 142, 78, -108, -122, -188, 61, 78, -109, 128, -77, -5, -5, -97, -143, 185, -386, -166, 122, -114, 8, 69, 98, 49, -113, 132, 331, -217, -111, -62, 85, -27, -114, 28, 120, -26, 265, 175, -186, -33, 307, -83, 43, 193, 157, -104, 80, -130, -185, -62, 13, 193, -183, 22, -99, -162, 31, -89, -158, 47, -11, -63, -308, 37, 148, -98, 194, 4, -157, 82, -117, -109, 12, -58, 91, 253, 110, -30, 203, -161, 77, 107, 18, 17, 0, -73, -237, 0, -69, 108, -125, 54, -18, -98, -186, -71, -133, -73, -169, 146]
2793A46k09j0K16j31j13L32j91J76k80o3J26kJ92j79o8J67j14k7J8m9K55M9l97
2816a56J26Kj11P2P0L2l8OR2j44o6l5K69k78Q4L7j28K38k16M7Q4J98j06j59J70
2841I0lk24P8Qj8P4J42q5J68k13M0J99k97K82m8j12j20J8J48r1N4L7j27J96k06
2866a0J74m6r7N0j37J76o4r6QJ34j24K02j27P9o2L2j27p7L27j01j02Q6l1j34M0
2891b7r6k6J66O4r5Oj34J3K00k0j18K03p9J35l72K04K9j77L23m11R2Q5M5L82k96
2916I6k45M05l38P5Q3n2q6J03j69J04o1JJ22J27k31J72p2j10J21N2k37J1J67J13
2940A51l30N29m11m5P6j33ML49k07j9j27j18M44k56J30l3p6P8o5j15M48L4k68
2963D0j09l29M14J0q9L78l91k9L25j26p9j7J69k04P0k45L16j63j00K10J00j96
$$ y = [146, -63, -73, 143, 12, -101, 231, 40, 216, -64, -127, -1, -3, 189, 10, -58, 109, -5, -32, -14, -63, 192, 241, -156, -30, -28, -139, -67, 3, 35, -3, 3, 95, -49, -115, -150, 119, -159, -75, -38, -166, 72, -144, -97, -13, 185, 79, -80, 90, 87, -137, -59, -51, -69, 5, 147, 62, 230, 17, 57, 256, -41, 241, 193, 81, -39, -21, 127, 36, 90, 127, 0, 196, -10, 164, 118, 21, 71, -66, 110, 46, -50, -42, 92, -32, 170, 43, 122, 60, 92, -35, -112, 215, 114, 12, 98, 67, -67, -27, -123, -149, 17, 81, -14, -8, -142, -129, 71, 51, -67, 136, 57, 192, -180, 24, 53, -124, 199, -212, -120, -35, 10, 392, 96, -149, 256, -82, -7, 76, 24, -62, 41, -128, -24, -85, -84, 38, 165, -66, 106, 34, -76, 45, 97, -140, -129, 38, 151, -179, 350, -61, -106, -30, -163, -159, 190, -17, -36, -163, -281, 163, -93, 37, 4, -72, 6, -59, -174, 274, 308, 40, -69, -398, 16, 26, -63, 315, -76, -105, 220, 94, 15, -2, 167, -37, 33, -212, 104, -59, -159, 51, 151, -45]
2985d5Q9N6k8j83J88K37r0m81P3O7JN1j65K32r8j5R4j7J78m5l36L20j5m1j36J69
3011F0l06L11k32L24m8pj99K69N6k02q3kM8l9q4J85k2l8J61k21J71j04q7J20k34
3036b03J86K34k55m5K4J32L8k37L08k25K20k60k5O5P3k6l5P3j73J14K6J6Q5l42
3060b32N70j83J10l1k70L33j95j15j29L86k71J33j10J19j19K7j25J5J46M8j51
3081d4J30j07o6K20r7j89J12K26n09K19J34n2K16l65P3J55j83K85k80j26J21J63
3103C6j85K68p1j48L59k38J72j08j15J10lj90K07j50J71j93o9q2K62p7q3J13J69
3126A55j99J43j91P6k39L26N4j47l9k32K08L16l01M3j24L40k21K30j18j11Rj6
3148c8o2o2K14K25k83j31j6J78o2O9q5k14K30J58r4l8k9k82M56O5k43L33m53k9
$$ y = [-45, 44, 100, 72, -111, 77, 314, 224, -257, -184, -117, -116, -65, -230, 2, -96, -111, -17, -34, 144, 99, -237, 83, 68, 27, -109, 60, -246, 65, -167, 157, 109, 102, -97, 172, 228, 26, -57, -59, -11, -50, -134, 51, 29, -9, 152, -69, 102, -2, -89, 31, -203, -17, 217, -38, -83, -59, 73, 111, -126, 182, -43, 177, -83, -108, -43, 30, 4, -31, 42, -131, -17, 9, 25, 110, -232, 338, 155, 265, 234, -36, 297, 102, -13, -142, 244, -27, 106, -4, 115, -4, 23, -102, -87, 59, 107, -44, 86, -21, -87, 133, 36, -153, -41, 185, -324, -105, 29, -23, 193, -172, -99, 56, -127, 158, -122, -248, -127, 36, -149, 119, 48, -100, 259, 21, 193, 85, -30, 80, 77, -113, 94, -56, 115, -78, -147, -229, 33, -44, -127, -14, 155, -44, 99, -92, -16, -255, 71, 125, -22, -61, -293, -85, 231, -70, -27, -151, 189, -32, 198, 80, -31, -22, -38, -100, -162, 52, 277, -6, -137, -153, 25, -37, 32, -53, -267, -37, 121, 27, -11, -40, -322, 134, 199, -44, 289, -164, -193]
3172a93J57r5J19k1l1J71j42M6O3q1P5n0j88J93J01l20K93k56J19J77j46m0R1
3195D2k67K2K29j53lJ52N9N5l45K24O7j03J62j92m6K27p5M5j01k3l3J75l6n9l12
3220b89L47P7k33K05k95K39J72r0j33J45j56O9K1Q6O5k64J20J06j30N7R2l69L3
3243a25N4J00r6o3L86j22q0j94J40Q5NK5l27J86j66lR4j43L31m9M3k88J93r5K13
3268A04k40j58L05N6M2p2nQ9N7l16J47Mk04K03j36j0J26L00r4k84n3J83j69L05
3292A80k24Q4k3K1Nj01J17j97J87L4j70J83k22L14j04M8j89J22RJj22K46j62J22
3316A59n8k62M50r8k25J91j22J14n3j90K70k93m7J34m1j15K75j31N4l3j6k0K37
3339A80r7j60J23J06r3J3Qj86p0M38j67J72j66jj02P6m7OL6j71K02j39l7R3j77
$$ y = [-193, -36, -131, -12, -33, -64, 107, -35, 11, 74, -7, 68, 18, -170, 23, 124, -196, 97, -159, -40, 137, -9, -49, 42, -225, -203, 26, -127, -130, 22, 81, 136, -209, 15, 82, -21, 141, -51, -97, 130, 55, 100, -1, -24, -57, 118, 82, 23, -289, 58, 135, -98, 107, -188, 51, 223, 133, 0, 145, -11, 58, 79, 165, 230, -34, 86, 192, 62, 119, 211, -158, -125, -71, 29, -67, -130, 256, 134, 54, -140, 0, 85, 90, 115, -212, -26, -192, -195, -101, -244, 87, 38, 81, -207, -14, -109, 104, -136, -294, 11, 67, 109, 37, 32, 121, 178, -138, 9, 13, -191, 12, -124, -134, -8, 292, 198, -86, -139, 44, -125, 180, -44, 40, 17, 38, 43, -58, 59, -138, 49, 83, -87, 96, -126, 188, 84, 132, -57, 65, 74, 75, -47, 199, 37, 159, 101, -161, 289, 191, -34, 157, 35, 149, 96, -94, 176, -117, -164, -30, -71, -186, 89, -42, 12, -21, -37, -57, 180, 83, -77, 46, 152, 59, 72, 80, -106, -176, 262, 95, 267, 101, 100, -2, 74, 27, 33, 69, -102, 100, -39, -76, 17, -160]
3364a60K36n0L3J93k25r3J74n2j61K75j86K0J79l31N2J48k68K04j19N83m64l8
3386e0J70l3l56K09j44L81n5p3m8n5m8J7M5J57k20j23K63l0pol1o7K89r9o7q5
3412f6J50M2o4j99n8k8J21J9J58k45K14j35k5J95l2j8k34K63P5m5l4p7j02K06
3436H1j5j29j3l6o9L36k79N7r5L1L22k75K5k60K44J67j79J33O1l68K48q0J96l51
3460b48L72r1J72k99J00Nj97L07jk99K42j54k5O5o9P4LJ68J8k41j9O9P3k01J49
3485b7L7k1o9j15L95k01l7R2l30J47L30k08j99P4K15P2j15j11l7L13l04j8K19
3508A02j09J59j41l1J42j87k03K72k26L28k45J14K7j50K92o6n9j99K78k2r3q9
3530a06J81k05M4K00l88M08k86j05N42m98K13K27l63J43p8q1J27k52J18J14m2
$$ y = [-160, 76, 26, 59, 252, 27, -66, 108, 56, -105, 170, -16, 4, 183, -148, -96, 52, -216, -12, -131, 452, -12, -50, 120, 87, -269, -60, -204, 177, 122, 49, 1, -54, -102, -85, -40, 117, -103, -226, 37, 7, 0, -6, -37, -104, 185, 86, 19, -66, 84, 126, 62, -137, -195, -223, -102, -83, 75, -170, 44, -91, -116, 79, 47, 29, -205, 58, 133, 88, 54, -23, -125, 81, 66, -63, -76, -112, -181, 155, -124, -67, -162, -131, 191, -84, -59, -319, -75, 92, -87, 46, 107, -261, -13, -93, 103, -248, 124, 33, 205, -94, 6, 11, -186, 121, 120, -179, 63, -91, -116, -51, -120, -46, -43, 125, 143, -98, -117, -48, 25, -176, -27, 10, -11, -80, -195, 200, -1, -38, 54, -276, -129, 201, -7, -206, -132, 83, 155, 40, -71, -108, 205, -99, -117, 102, -7, 152, 11, -20, 122, -65, -268, 4, -222, 106, -139, -25, 2, -148, 144, 78, 19, -180, 98, 76, -17, -106, 75, -130, -86, 114, -274, 134, -152, -257, 285, -213, 0, 227, -136, 7, -71, -152, -25, -277, -159, -45, -87]
3551h7O7K01p9J30l16J52l90K07J07nj02K27j55r2P7J27kj79J03O4j42K46j62
3574cj09q3J64Q1J9r4j94L62k98O2K46j20j38j81M48k11k55P1L23k4j52J70K24
3597C08k14J77n68J73J41Q5q0j38L44n0o4j01j18k17K88j7r9J06M27k50j76o6
3619a09J16J58j42R5m4l24L56j24O3l7R0l31K53M8k1J00l52K18Q5k30m8J78K3
3642B1l14K76J11J29j25l58K52r0J09r0kN8J53p3p2J13J1j94O7O5j8R5j19l4N7
3667B8L7J68k39o1R7j18j55K97l39K47q5J97k24J29pJ44k58K39j08qK8r2m9K06
3691G4j97j3O3L1L2R1k94K64%n2N0N8j11R2j20J04j69J29J54l45J82j24j6M7J20
3716E0j48M1j12J33J26j6j2r0P3k0K3j13K28l25J59j09J3K83l72k5L73Kj84K33
$$ y = [-87, -20, 181, 102, 232, -84, 68, -322, -115, -8, -13, -115, 112, -43, -135, -58, 69, 67, -112, -9, 55, -87, 159, -3, -112, -195, -31, 50, 69, -25, -219, 143, -155, -93, 153, 33, -105, -286, 162, -49, -304, -233, 90, 66, -86, 84, 308, 94, 271, -297, -124, 17, 102, 22, -116, 228, 178, 114, 13, -105, -322, -34, -51, -150, -44, 383, 133, -43, -109, 7, 165, 23, 118, 74, -250, 106, -18, 45, 8, 98, -233, 20, 68, 47, 147, -205, 13, 98, -132, -180, -2, 21, -293, -17, 94, 223, 98, -260, -8, -98, 11, -79, -81, -23, 130, 57, -15, 98, 109, -85, -18, 47, 29, 124, 5, -29, 28, 65, 233, -6, -67, 30, -88, -243, 54, -285, -38, -123, 74, -150, -21, -28, 116, -142, 97, -11, -19, 9, -83, -132, 74, -123, -136, -73, -42, -10, 81, -213, 51, 51, -1, 49, 107, -4, 88, -32, 72, -97, 32, 186, -159, 23, -101, -117, -70, 50, -98, -57, -169, -36, 90, 74, 62, -28, 45, 25, 48, -65, 163, -162, -3, -112, -99, 184, -188, -213, 160, 162, -22, 211]
3740B11o4r7J70k36Q7k96P1M44l43L3j32N8L70n22M59k86J48m16M79n9o0q4r0
3763a55M34m01L3L2j46L84m31J65J27l0k64K59K20k7m2o5j21K15N6k14p6K33r4
3786I2j95L41l09k4J51Q0J08l54M4o4J44J33j35J53j64Ll4j09N5P2j6j62K90r7
3810Cj4O2J40j37j23J15L4n5j83L85m30J15r9K36m0J32p5k10K09J81m03k3K45
3833F5o7J55P0k22J8j94J41J34l3R6k94n3K84q8k5Q2l08M25P6j24r5k99J60J37
3857D1Q2k05L0j58J11J08K34k89R6r4P1j12L1J08R7j13J77l23L01K9j40j62o6
3880a46K10k12K85o7o05O47m3l49M94k50p7L9J25M2j75j49K58J0m79L02K7P5M
3903c4O1N2j32K48l81J31J57l41K56J59j02rJ9J11k75j5J06Q4j15j27J37N7j98
$$ y = [211, 147, 50, 220, -16, 71, -225, -154, 290, -53, -20, -152, -94, 276, -246, 213, -73, 75, -341, 138, 79, 19, -65, -155, 279, -122, -89, -57, -203, 181, -250, -85, 42, 12, -252, 7, 227, 200, 158, 93, -28, 187, 243, 29, -47, 186, 92, -103, 238, -71, -95, 56, 136, 244, -110, -66, -130, 14, 147, 12, 165, 1, 4, -30, -139, -84, -12, -28, -190, 100, 3, -11, 51, 191, 54, -69, 46, 80, 25, -158, 227, -203, -88, -187, 49, 9, 141, 66, -144, 65, 246, -157, -180, 65, -2, 153, 223, 1, 19, -175, -34, 100, 67, 163, -131, -184, 100, 12, -13, 69, -239, 186, 262, 138, 43, -256, -96, 41, 123, -82, -52, -210, -99, 9, 243, -46, 50, -44, 27, -85, -54, 54, 151, 38, 215, -108, 193, 222, 82, -80, -146, 64, -148, 137, 70, -535, 112, 69, -280, 214, -36, -113, -74, 51, 93, -82, -231, 27, 37, -442, -140, -113, -38, -34, 27, 79, -53, 195, -186, -55, 102, -239, 17, 176, 74, 65, 84, 195, -80, -95, 11, 95, -20, -147, -10, 47, -151]
3926a51J72J37k42K64lj68J75j75L7j51L0J12j3j68J70J8qj44N4K90m62K90L2
3949I6q3l6J15j75j17R3J76p2j6j3j23L14ro1j90N4rR4Jj14J29%j30k1J1M13k62
3976F5k29J4J86j02J70J8j53R2rj78K39j19K02k40K6R2J38l29M4J7J88j65M8K29
4000B44j69k42JL82j87M2l99K75k31K29j00r3K40k07K25P2j98j47L13j65J64L1
4022H0p6j24K24m3k6k2j53J93k11K11k73J09P3k8L8j26K16j57J12J8l2J53r9P
4046F4L20k78j38J66l11P1L12j86j02K59j37J52m2q9j48j37K89j36P1J0K75j93
4068I2o2J36l63J99R4K3l5k28n6k1J57Q4O8k60L50j45K51k35j51J4k5P4k8O9m4
4093d2O5j36J78k57K15j27J33j21r1k44N36l43K50P4M1%j32p7K13l83K65k0q3
$$ y = [-151, 21, 158, -84, 180, 177, 9, 184, 9, 46, -105, -75, 37, 24, -144, 26, 44, 36, -108, -54, 236, -226, 64, 96, 13, -23, 92, -83, -200, -107, 69, -3, -19, -32, -155, 159, 150, 89, -101, -47, -56, 38, 39, -75, 54, 54, -76, -97, -86, 327, 65, -164, -150, 36, -66, 104, 122, -31, 61, 52, -126, 113, -6, 196, -44, -18, 74, 212, -117, -73, -56, 132, -33, 15, 244, 75, -167, -166, 216, 29, 71, -328, -53, -284, -55, -155, -248, -8, -215, 10, 82, -116, -263, 50, -115, 49, 80, 4, -120, 104, 61, 35, 13, -140, 53, -158, 53, -220, -111, -38, -66, -28, -154, 62, -95, 17, 35, 3, 156, 57, 64, 384, 106, -32, 134, -177, -106, 206, 20, -82, 177, 40, 192, 150, 61, -87, -224, 65, -71, 0, 10, 285, 92, 30, 166, -197, 2, 96, 119, 84, -144, -200, -221, -64, 20, 88, -172, 178, 33, 284, 49, -102, -88, -113, -39, -67, 2, -42, 23, -113, 65, -192, 23, -104, 29, -92, -183, -427, 109, -234, 16, 90, 131, 131, -1, -78, 135, -248, 17, -3, -86]
4116h6J96Kk50L12j37N0Mj48J78j32J36L8l18K78k63P0O8J14R2j43O2k06L08j24
4140A01R8k17J10n9L7j39LJ77j09K1k5L4j57Q3P5p3m6J2K5J60j20q0O3Q0o6K16
4166B04l95J86M7j45J13m5M1R7m28L97%Jm1j84j11K07P6j99J95m2K3J27r2j49
4190a17K12o1nj78J34J77j21J9j31L18l27J37k26K63j54K29q9p9L4r4n9L04j81
4213EL46j82j43l0J36k57L83l86j29L66k16J08q4n6J14J13j47J9J45j29j5L02
4235B63j15J08k92J05j70N7J5n3J79k37J84j18J93j19P2L3j79J15j80J87j8j70
4257a40J02j36Q2J07j10K00o3j36m0K12K9j42r0J77j6k50L08n7l5N1k74L12j44
4280e3P9j93n3k2J49j17K69j78K3L44l12Q4Mj28k4J13k87K28J3R6Q9r7k2j17j96
$$ y = [-86, 110, 112, -138, 174, 37, 87, 91, -57, 121, -11, 125, 163, -155, 123, -140, -70, -2, 112, 204, 61, 123, -83, 225, 101, 199, -18, 92, 33, 70, -69, -66, 111, 2, 23, -2, 32, -125, -42, 33, -40, -86, -74, -49, 111, -9, -89, -26, 54, -12, 204, -191, -5, 42, -103, 10, -35, 6, 103, -325, 72, 72, 73, 32, -152, -263, -56, 20, -179, 16, -26, -3, 124, 32, -117, 95, 34, 29, -149, -15, 162, 41, 60, -71, 247, -80, 57, -169, 94, -60, 169, 80, 1, 35, -59, -118, 186, 5, 351, 169, 26, -4, 132, -125, 258, -128, -257, 109, -107, 1, -83, -139, -25, 88, -59, -40, 105, -24, -39, 263, 148, 256, -36, 69, -101, -44, -29, -82, 97, -140, 44, -74, 119, 0, 72, 105, -74, 41, -139, 48, 30, -140, -38, -174, -92, 15, -95, 105, 42, -94, -134, 78, 107, -35, -125, 52, 36, -214, 94, 37, 2, 53, -221, 91, -53, 26, -167, -220, -242, -93, -210, 59, -119, -96, 248, -64, 20, 24, -104, -128, -15, -302, -74, -61, 35, 124, 27, 5, -112, -308]
4305c08K57M8K57j80r9k46L77J62m28J45j63L08k0p7k1K49j48k06j21J36J90j88
4327g6J15K03k91J5O5J23n9j11Q6k10N5R4K11k53L5k14L02j31P8j08Q0j26K0P6
4351b1j31J81q9J11j84K21o3K7K4K2K13k80J05k88K19J30k21Q9j12J93J1K9m9
4374A37N5k37O5k03J72J94k63K40J4l40L11j30j5j63L55l60J00M3o6J49q0j03
4396a25K13j82K6L56m51M28l28K7m2K29J66k05j69k31M05l09K3M4J09r4J43J44
4418A77k04J93k62L42l73k8L73k63j85K42R1k78J76n6j2k8q5J41Ro9P1M3Q1k4
4442G2QJk41J03J56J73m08J35K38k11K49j01k06M0j66N2K59k65N5K0LL3J04j59
4466e6K03j15j00K12m50M01p9o1J13j28K43l9j95n8J7q6J39JN2M0k5N3k1P8j71
$$ y = [-308, -51, -3, 254, 74, -25, -271, 106, 268, -160, -15, -178, 130, 110, 33, 12, 261, 113, -93, -214, -78, 112, -76, 39, 242, -49, -34, 31, 154, 95, -16, 70, -140, -85, 9, 220, -33, 2, -212, 90, -41, 37, -71, 9, -117, -97, -21, -152, 29, -60, 51, -133, 88, 25, 52, 76, 98, 311, 31, 136, -152, 67, 197, -24, 65, -47, 146, 157, 186, 137, 192, -45, 20, -183, -11, 183, -80, 160, 174, -166, 145, 15, 0, -163, 192, -168, -68, -25, -91, 58, -22, -125, 88, -94, -68, 288, -163, 265, -63, -36, -78, 151, 317, 112, -57, -288, 117, -192, -169, -125, -16, -110, 33, 177, -27, 166, -96, 246, -127, -155, 218, -45, -230, 12, 103, -175, 1, -55, -67, -95, -180, -39, -30, -99, -28, 15, 96, 72, 80, 81, -160, -57, 99, 272, -136, -1, 237, 26, 275, 174, -32, 8, -158, -106, 153, -112, -57, -37, -34, -1, 103, -56, 147, 32, -68, 144, -306, 95, 16, -45, 68, -60, 183, 144, -51, -109, -92, -178, -39, -38, 14, 54, 29, 82, 61, 139, -32]
4491c2K44N9l72J63p3J05k15Q2j33J25N1J8j78L70l27K12n4j06K9J24K8l49K00
4514b9Q5j7n6m2N28n05J27o1P1m2K4n6pJ63j43M6Jk7L3o7k1J19j90nR0M2p8K2
4542Ej14Q4l8j15M8J18Q8j36J51R3l08J6K75j38J38j55j5M2j10Q6P6q1j79Q2J04
4567A7R8J16k22l1L9j58O6Q5Jp6r6R0J04k02M6J50k80K50n7N1l0K7n1Qp2P7R9
4594D9p0L8r2J27L7K8J13j47n0j07pP1j6P9k2Q9M8k97L7Q3j3P7k46K77o6L3N0
4621A03k74L78k76m8L3J06R0m5J12l74K2L05j31p6J86j6k6J31j10j72K60j98J04
4644H4n1k30j0J90p5K39o7ok14R6K80j80J76R3m47K11J57k60M4j26O1j30l4J47
4668e2P1J24j46J38N4o39N40k06J55R0j72jL0p6J07L5m7nJ16Q1j69j85Q0K13M7
$$ y = [-32, 212, 271, -101, 62, -11, 94, -121, -39, -172, -47, 4, 22, -156, 214, -113, 99, 45, -61, -32, 92, 120, -229, -29, 56, 39, -17, -59, 469, -36, 91, 30, 101, 59, 83, 27, 20, 183, 40, 86, 87, 60, 93, 26, 5, 124, -66, -71, 19, 61, -17, 5, -109, -25, -63, -178, -130, -12, 76, -60, 91, 184, -124, -108, 167, 29, 167, 12, -3, 39, -71, 15, 91, 10, -169, -87, 17, 115, 231, 9, -22, 17, -141, -75, 10, 11, -65, -161, -71, 33, -169, -123, 27, -253, -3, -60, -9, -39, -12, -63, -55, -127, -50, 49, -21, 17, -75, 52, 89, 117, 230, 83, 33, -74, -81, -10, -26, 53, 31, 120, 168, -129, -92, -9, -22, 55, -191, 86, 20, 53, 103, -171, 207, -69, -117, -84, 22, 112, 67, 179, -195, -173, 132, 1, -75, 111, 95, 69, 200, 90, -82, 178, -20, 84, 33, -197, -207, -17, -92, 147, 80, 74, -140, -44, 236, 56, 232, 325, -122, 89, 246, -14, 30, -96, -35, -165, -199, -52, 19, 143, -3, 135, 189, -450, 90, -116, 39, 129, -43, -44, -14, -90, 17, 52, 5, 0, 116, 197, 28, -157, -77, 136, 183]
4693A83k88J26k93J09K63k16J87j65K39K1k94K3j95K2Q3J83J25nm7j67J66j51
4715i1p2J18L20k54p2M9J69j62q6q0J37p9n7Q9m0M9Kj26K67j57Q5j79K34j20L24
4740B68k44j04J99k20K00nj53K9J37j86K80k46n0Nj23J06J55k40J02L23l73J79
4762C9Q5k60J46J01k75L18j88Q1l5K6j10p3K05j19J27N3j09j0O1k81J51n6kK85
4786A60j68J69l18J76j60M2J00k5k16J39R4j11Q0n7j06K05k41M2O9O2l5K57k46
4809h8K86k21j33L11J52m08r6K95j14J43j62o3J06J84k32K07j03j7J2j50o7M4
4831a14K4L32l26J31j19K9r2J36N4m1O1J05Kj18j50m1L28k63k03O9L70l65L01
4854A10J7lL5k48J28p4J74m14K90K66m11K17j90L50j32k07K15p8j17J02j17K28
$$ y = [183, -105, 21, -272, -163, 100, -116, 71, -94, 145, 166, -128, -105, -300, -278, -195, -12, 113, 108, 61, -106, 60, -91, -163, -45, 275, 21, -51, -2, 167, 5, -81, -161, -24, -103, -160, -71, -111, -62, -60, -186, 81, -76, 9, -170, 64, -56, 268, 24, -80, 119, -101, 99, 94, -59, -30, 107, -79, 201, -45, -95, -90, -213, -107, 48, -192, -90, 233, -140, 39, 124, -136, 10, 111, -164, 154, -34, 47, 12, 38, -72, -145, 60, -59, 68, 121, 12, 2, 63, -218, -67, -123, -125, 160, -8, 161, -157, 19, -141, -99, 1, -24, -240, -101, -7, -118, -38, -95, -201, 4, -237, -195, -126, -64, -99, 158, -88, 198, -23, -156, 155, 307, -101, -197, 98, -16, 127, -35, -98, 8, 192, -40, 167, 64, 47, 59, -91, -158, -114, -90, 242, -84, 47, -72, -43, -135, 1, 55, 14, 75, 180, 182, 64, -86, -127, 201, -62, -265, -196, 174, -191, 110, 127, 124, 159, -89, 39, -35, 139, -275, 15, 281, -130, 87, -103, 247, 115, -92, 123, 45, -72, 30, -87, 141]
4876A41k76r3K78r3J9N2j76k0J13L46k84J42J14l32L38j66j95K7J11r6l6J87k82
4899a81K17k1Q7O0P8l33PJ0J94K32l11k1r6J91j02J80m22J82j63J72J96l14M26
4922B68k56R4j80k0OJ4P7q8K24l92J5L08n2J63k58j71J75J54om7J4J07q8K20j25
4947A56l70K21k70J16K94j91J00K45n75K32J72j20P0J60k29K79l99Q8L8r6J10
4968C1O5j40K4M4R8o8l0ok73K66j53J36n5K24j73J84k18J75Rj7j33J39j16O1j53
4993g9L61j63Q3k03q2O2j90J58Q9N1j31q6L41k30K19k43M4N9lN6r9j35R0J1J8
5018bN9r2J24j12L2j8j84L88k98l9L2L20k91J44k16K33j58K75k41j28M1K73j06
5041C6nq4J7j42J57nJ78K20l93J51k15K9J39n9k2K80m29l3J05P2l5P7r6K7L8K16
$$ y = [141, -135, -228, 50, -43, -24, 28, -148, -168, -55, 291, 7, 149, 263, -69, 269, 103, -92, -65, 46, -50, -86, 101, -181, 36, 15, 102, 162, 240, -93, -86, -76, 118, 350, 39, 18, -78, 113, 11, 191, -231, -49, -212, -40, 156, -158, 268, 12, 106, -74, -94, -88, -74, 3, -85, 139, -253, -238, 70, 18, 181, -77, -248, -73, 81, 75, 28, 42, 149, 61, 281, 156, -214, 7, -263, -147, 147, -44, 56, 301, -274, -42, 130, 10, 80, 240, 11, 290, -109, -21, 17, -79, 31, 96, -44, -20, 24, 122, 54, 24, 18, -255, 11, -142, -6, -61, 163, -10, 174, -44, 131, 140, 123, -10, 129, 13, 74, -79, 282, 119, 202, -1, -83, -21, -211, -53, 36, 87, -44, -130, 211, -19, 200, -43, 1, 60, 57, 113, 14, -121, -31, -20, -2, 57, -35, 89, -23, 9, -9, -193, 195, -103, -142, -110, 210, -81, 63, -153, 80, -78, 197, -44, -172, -131, 142, 36, 31, -53, -36, -178, -21, -26, 152, 372, -21, 130, -85, -56, 83, 24, 2, 282, -147, -180, -75, -3, -38, 39, -57, -30, 8, 224]
5067B24k87L9j47L37p1k91N6J73p2J87m34L43J11l30J22K76k66J5N2o9K97k19
5089D6p3J44L4q1P6l8k52J33J65j09j74K98j15k41J60j24M4J37j78K69q0j7K12
5112B36j99J55k57j30K59j95J23J10k16J72j41J78j41j5o2K58l33LK01m5P9J37
5134A77j41P9O9m76J14m9J9J95J54lk35q4M00j81m5k57K07j41K28P5N0j01J08
5157A62j42K46n55K38LO8j13m2J62j70L06o1k11l7J44K15m4k14m6k5K87j83k64
5180b76L17J03o3q9p6o3j2L55l13P4%M3n4L1J72k33r7M83k69r7J23j0O7R1p8k35
5206a06o4K63Nl72K80p9J0K3j17n3Q1K65p6j8k55J30j24L30k73K0K14r3Qk79K43
5231c7Q4j54R2J1J41K4k82J12l5J9J00k05p0n4J83L13j90m2o7L3J10j58K41j63
$$ y = [224, -63, -24, -171, 166, 95, -196, -140, 33, -39, 148, -286, 57, 168, -162, -40, 236, -30, -15, 37, -32, 265, 46, -27, 117, 151, 70, 146, 108, -144, -11, 154, 45, -129, 169, 54, -187, -27, -151, -107, 30, -148, 121, 41, 24, 236, 37, 192, -65, -195, 64, -131, -8, 102, -114, 58, -83, 95, -46, -61, -123, 135, -198, -195, 6, -39, 40, 177, 36, 115, 184, -292, -178, -227, -208, -13, 141, 138, -97, -181, 219, 38, -7, -264, -57, -198, 30, 105, 155, 54, 162, 20, 266, -289, -51, -48, 20, -93, -135, 27, -143, 163, 102, -109, -146, -2, 213, 169, -45, -91, -116, 171, -12, -276, 41, 144, 81, -8, -84, -147, -159, 196, -117, -43, -43, 0, -54, -23, 149, -84, -181, 302, 33, -64, 59, 49, 116, 207, 129, -106, -170, 93, 98, -274, 6, -73, -63, -40, -157, -210, -129, 136, 60, 42, -213, -83, -207, 123, -150, -130, 84, -9, -1, -280, -37, 47, -107, -15, -4, 137, 161, -121, -9, -44, -25, 75, -130, -200, -254, -71, 242, 52, 10, -57, -24, 86, -72, 169, 6]
5255FQ1n4M0k94J29K43k23Q6P2j79k00K62j25K27oj5k02M03j13J6j82lJ60k52
5279a23j25M20k82K69k06R0K28j52l16j8K86n5PP4j63q5L18m01L18j67K2j26L15
5302A28k90L97l50K06q9j69J71Q4K33l32Q4j15K5l4J21J28j65j06J32k00K16M3
5324A18k15M9J62k42K27r0O7O0m2j18J35k35K55l50L67k69L04j25j36N5J26k06
5346a03J39Mmr3L1J20l6j04J18k27JO3J86j07J1M7j55J96nj65K29j93l9J10p6
5371e2j26J11R0l30K49k9K96n3k14R0pP5k33Q9l2J06K9J14j51o0M1j23J36q1k0
5396h5J73J13k63MK25p0L1j77J55m7L9l56L21k2Q9J4q5OJ3k17J78Jj28J0J52j72
5422i8L88o8l47J75J66m03J07P9q7m3J0L24k20J36k5r5j45J34j21Jj54J63J50
$$ y = [6, 87, 33, 73, -221, -92, 151, -72, 14, 86, -93, -293, -31, -156, 71, 65, 50, -152, 251, 138, 154, -28, -31, 129, -123, -248, 172, -110, 159, -47, 43, 271, 119, -197, -215, 71, 16, 23, 97, -66, -151, 167, -234, 84, -83, -61, -187, 128, -162, 235, -115, 91, 2, -167, 4, 88, 321, -11, 73, -42, -17, -51, 70, 198, 33, -73, 59, -141, 75, 118, -97, -48, 114, -128, 99, 9, 76, 136, 94, -24, 111, -124, 131, -219, 148, -121, 183, 58, -78, -23, 103, -103, 36, 40, 36, -57, -26, 94, 58, -46, 72, -155, -154, -91, 95, -12, -1, 46, -109, 87, 82, -83, 146, -47, -86, 24, -52, -178, -67, 23, -307, -58, -87, 209, 156, -58, 32, 25, 100, -133, -44, -76, 30, 59, 173, 22, -38, 3, -120, 16, -65, -85, 88, 201, -62, -58, 167, 97, 128, -49, 106, 59, 98, -258, 63, 41, 130, 144, 59, 65, 78, -139, 39, 40, -88, -78, 74, -98, 290, 222, -125, 50, 216, -187, -80, -1, -88, -131, -121, 203, -17, 119, 94, -1, -146, -12, -133, -132, -286, -123, 27]
5445B7KJ37L8l48L1L11p0M8k71Q4q1J26o2O8P5l52K31NK02j92J65k34K17Qj07
5470E8j22Q7m3R1k61l2K5K51K0J7q9J02J43j90j75K07j79J47K28l89M05m25J75
5493E1J06j41n3K9jM7Q9j57m7MM2K91J1l29QJN0Q5M7l07J76O6m4JJ5j02k1P8J9
5522A4%J46k91j3L2K10r7L1QN2Q0k02j02N7j7J67j33J01J39j31J21k05Q8j3Lk04
5548a59K07j02kK02j25o0J0j9J00K44k74o7n8k5J01j8J87j60L4n4k4J56q7k23
5572b16K83J03o4j60p4R7J4L5ko5O1j55Q5J62q3j27o8L38j75q5L5O7N8p5Q9j19
5598d1J91k23m4K18j52K5j73L64J8k30k03M38j93J76j7p8j64N0n0J04l5n9j3L07
5622B16j7k94K69j07j19J00K07l02J8O3k37J53J63k51J38J37L8l7j88q0N9M1l1
$$ y = [27, 29, 166, 204, -144, -113, 198, 128, 176, -95, -11, -92, 34, -28, 40, 115, -237, -6, -1, 201, 9, 174, -60, 157, 165, 58, -64, 23, -20, 71, -190, -222, -197, 54, 74, 91, 2, 104, 247, 57, -118, 89, -90, 57, 285, -104, 301, -124, 51, 157, 16, -37, -8, -9, 38, 127, -30, -77, -73, -31, 260, 271, -58, -50, -49, 1, 86, 133, -174, 2, 68, 24, 25, 40, -62, -83, -5, 14, 14, 160, -131, -144, -112, 98, 1, 32, 40, 92, 172, -30, -132, -75, -92, 75, -58, 43, 182, 51, 172, -33, 55, 42, 45, -159, 48, -54, -56, 146, 21, -39, -29, -48, 52, 296, 22, -45, -103, -128, -27, -45, 142, -18, 16, -38, -62, 94, 7, -216, 67, 170, 106, -54, -128, -31, -17, 18, 16, -49, 12, -143, -58, 104, 21, -106, -174, 164, -11, -96, -61, 6, 64, -11, 78, -41, 150, -73, -117, 101, -51, -26, -199, 165, 183, -47, -250, 188, -5, 171, 154, 76, -88, -38, -88, 16, -19, -78, -91, 216, 199, -95, 174, 67, -52, 48, 255, -47, -29, 34, -203, -50, 113, -138, 0, 137, 175, 138, -50, -130, -71, -30, -61]
5645f1kJ31k83J03j63K50K15l16j93K98R3j69J04j0K02j29J24r4j54N0m5J06j3
5668D4J27k33Q6L4n8K43p2k20J38j06om9j53M12j37j17J06k96N9K86k51K43j46
5691f6N8L3P7j45j06j72L34J0j39J62j34J84q2J26m9j57J6k04J64J8N6J10N9j68
5715a5j6j93J52n7Q9n3m3K06K06l20p3P3q2K39j65J0N5K1j36J33j98J50k00J57
5739f0K64l52K90k10j7K03j3N7j32O4MQ1k80M3nN0K90j58j20J72j39j81M7J68
5763F6R7j27L5j46K2%R7J07j89L3J4k01K79l45M16j30j57J57K60m07K17j32L1
5786cj87K91l40J30K27k47J45j0q6J40o2j5N6QK19k53O4o0l8o2J49j23q0q5L95
5811A73j81lk8q0k4J79L4K59k97j54J04K42k35k52J29KQJ17o4K36j87q6M36r7
$$ y = [-61, -63, 68, -215, -112, -275, -25, 190, -126, -319, -21, 72, -97, 7, -3, 199, 70, 194, 100, -54, -4, -49, 57, 44, 171, -62, 24, 58, 0, 243, 171, -49, 89, -17, -23, -72, -225, 187, 50, -67, 39, -257, -198, 88, -163, 80, -66, -8, 25, 102, -43, -149, -321, 13, 23, -116, 46, -88, 96, 14, 140, 91, -66, -50, -254, -90, -72, -16, 94, 153, -15, -31, -224, -72, -129, -40, -93, -136, 70, 276, -44, -117, -44, -126, 113, -52, -42, 13, 34, -102, 31, -167, -17, -217, -60, 204, -148, 142, -68, -85, 118, 105, 162, 30, 94, 98, 179, -101, -58, -63, -13, 277, 119, -1, 171, 32, -149, -102, 66, 163, 36, 71, -75, -53, -53, 44, 151, -38, -5, 9, -192, 87, -258, 158, 28, -129, 28, 288, -119, 98, -34, -3, -190, 101, -239, -109, 118, -129, 16, 6, -80, 60, -2, -17, 39, 47, 266, 13, 77, 17, -21, -83, 66, -57, -137, -222, 173, -8, -11, -39, -119, -143, 36, 70, 329, 32, -122, -18, 224, -11, -263, -134, -132, -124, -7, -71, 165, -22, -108, 328, 231]
5835B31l86K3P6K64l05L28j36k38J57Q7J1P6m99L21n0j96M73k97R8J87p5j44p1
5858f5L0J79j27j20O3J21j97R7j00J80j23j90L73j54RJo9j3M30o1l97K43j00j5
5882en0R6j2J25J32l74J89m23M60K2k54o3J73m2O9p4J63n9l00L42j66q8Q0J94
5906A35p2k39k6M25k02j23K00k16K99l23k1M1K71m8J0k99K95r0K80q4l20O2J04
5929E9n8k07K39j28M04l15o7K1q1L10q1m2k0J17n14J78jK61j8l8J37j35K40j98
5953F3o6Mm7J21K3r3N1j76J63K8j93N4m1K24j16j6JN0k21K2K55k92R6J19Pm06
5979c86M57J11k61L38l89J50l59K17J05n6J08j13L74m04Q9j46J70j1j81J59p0
6000i8J55l7k6O2o1P2j90MJ18L48k53k07K45k49N2J02k88K93m6n5l1j32N4J20
$$ y = [231, -155, -132, -56, 208, -97, 231, 95, -143, 14, 101, 112, 188, -311, 10, -40, -236, 237, -60, 38, 225, 150, 6, -65, -35, 144, 17, -103, -40, 81, -116, -19, -119, 61, -62, -252, 121, -33, -24, -23, -92, -105, 325, 264, -133, 110, 10, -5, -55, 41, 29, 154, 286, -88, 101, -322, 138, 160, -94, -157, 16, -26, 43, -31, 132, 73, -227, 115, -51, -139, -59, 135, 63, -176, -202, 223, 21, -102, 98, -118, 181, -142, -163, -122, 149, 101, 111, -188, 107, 17, 297, 213, -107, -45, 59, 1, -206, 33, -95, 309, -6, -73, -52, -133, 177, 96, 54, 34, 151, -363, -185, -186, 75, 57, 19, 156, 21, 261, 63, -3, 1, -46, 75, 98, 5, 56, -120, 43, 71, -122, -68, -109, 115, -1, -17, -16, 34, -187, -165, 90, -202, -106, 13, 20, -386, 71, 182, -79, 259, -130, 20, -339, -122, -17, -73, 35, -78, 296, -108, -19, -165, 5, -6, -187, -28, -98, 57, 20, -6, 56, -5, 67, -123, -119, -1, 347, 94, -113, 132, -117, -65, 37, -251, 42, -4, -59, -90, -222, -168, -48]
6024d8J42k4n1L3K05k97J40n8qR3j76J29K2l0M9l4m2o1K8R8j23r5K05Q2k49J01
6050C1lr1J51J30j96j50O0N2K12k53J64j02J6J70m51L95k07J98k43J46k33J62
6072d2l8R0MJ34l4k86J40q8K40j54rj2K6L4O2p1P0j12p1J61P0j76o2n6J32r3j23
6099b64L25k26K30P3j27J17J24l23P3K1q8m5R7n9nJ10J55k68J48k09J86M9M7j32
6123Ik53K25n1k4J10J42j35L3K1J05n5m7O2N1j32n2j68J37l81L05r2J72K21l01
6147i8J19R9l6L4j03k40N5Q2J12o4j49M48j52j09j01L2J67J56j08l4K2j77N0j5
6171a0o3K39j09m6j1n5J25P1J14r6j91p4J04k79K72m3N3N0k5j42J80o7k0l3k77
6196c33J77J41l9J85j34K55k82o3l0Q1r0J70j92J94J63q9k26K22k00R7l2K22N0
$$ y = [-48, 94, 70, 19, 52, 257, -40, 100, 42, 34, 127, -49, 80, 102, 72, 121, 87, 45, -16, 12, 110, -13, -108, 97, 179, -70, 31, 28, -63, 88, 218, 22, -128, -68, -16, 196, -57, 107, 5, 21, 191, -260, 135, -72, 126, -117, 29, -204, -42, -80, 10, 14, 148, 114, -172, -32, -120, 120, -34, -43, -55, -29, 5, 67, -4, 66, -46, -117, 44, 114, -62, -124, -180, -48, -141, -264, 61, -165, 65, 138, 11, 128, 252, -71, 2, 23, -65, -110, -13, -72, -77, 33, 188, -80, 68, -141, 45, 94, 141, 9, -244, -19, -70, -94, 16, 158, 23, 56, 77, 182, 127, 80, 142, 193, 61, 9, -159, -22, -403, -98, -190, -18, 203, -98, 21, 120, 84, 118, 15, -225, -170, -88, 24, -40, -189, 259, 107, -2, -103, -71, 96, 252, 144, 110, 132, -45, 5, -10, -73, 166, 57, 11, 0, -55, 70, 141, 255, 159, -32, -106, -2, -281, -9, -52, 1, 51, 26, -116, 64, -3, -23, -56, -333, -156, -15, -54, 131, -3, 252, -30, -93, -123, -42, -132, 38, -154, 40, 203, 114, -112, 110, -90, 7, -25, 197, 247]
6219B47m3m7k98J27M5o0K3N7q5r6J03o9O4J67k74O8J99k76J28k6J90j05O9k49
6243a41K5nK32l7j97J32qL4j1k03L20j56r9j22P9K35P4j12j1N6k35J20Q4L%j52
6269i5K1K4n2q6J29m2Q4k34L10j12m4J59j85J60M4J4m0R2l67l3J90m1n4L17J01
6294B60k46p1OJL6o8j1l0qR2r2o6K75J62q7k12L6j43J78l1j37M04m62L9K39j03
6320c9J85Q2k28Q0P3j95j76K43j79J91J42k91l2L88k24R1p7j92R9J9R6j25k54
6343c23L64l17M74k01O6k20l0J32j43L66j54Q9J15K4l10M4o4L6K0j30R5J3R4K8
6367F8N2m5j59J91N3j07o7J4o6j54L91j66k14L90K8l95J53J09j88p0J57J01j82
6390a06M4r9J81j67K80k27N9J76k5j30L00j52oo0q3J39p3l8J79l09J51k63j9J50
$$ y = [247, 204, 157, -141, -14, 31, -29, -6, 51, -34, -130, -27, -96, -32, 135, -139, -71, 128, -148, -20, -46, 144, 39, 108, -141, -116, -121, 111, 74, -123, 9, 1, 35, 24, -179, 141, -15, -114, -236, -157, 78, 152, 40, 29, 85, -150, -30, 54, 57, 57, -95, -74, -50, -102, -188, -59, -101, -17, -251, 59, -53, -97, 62, -123, 37, 81, 95, 55, 147, -220, -253, -63, -104, -158, 159, 260, 14, -57, -51, -50, -14, -82, -93, -123, -131, -39, -131, -197, 78, 240, 153, -59, -23, -166, 12, -19, -156, 248, -214, -175, 64, -39, 146, 228, 0, 80, 153, -42, -218, 25, -154, 37, 179, -112, -144, 244, 20, 111, 34, -158, -59, -40, 56, -69, -323, 41, -276, 198, -3, 63, -157, -187, -55, -198, 168, 14, 103, 218, 242, -68, -24, -88, -52, -32, -162, -67, -54, 40, 68, 120, 75, -84, 107, 160, 53, -14, 0, -66, -220, 171, 5, -209, 181, 209, -186, -33, 76, -112, -182, -25, 76, -106, -62, -161, 20, -147, 133, -94, -35, 141, 116, -14, 286, 134, 128, 68, -15, 124, 51, 13, 192, -117, 34, -229, -248, -98]
6414i8K11J6k71K19P5j60qJ18k5j42j86J67M6K75k99K81k56J75m18L6K18p1N3
6437d4J02J32k77j0K17k72J09K78j91p8K23j20j14Q3k81J85j17M56N0l39ok1m2
6460g7r6K31k53J22O1n0K2QM0j21R3KJ2J21o4j71qP9J26j37R2k68o9K35N4oK9
6487GJ74l96m5L92k93J23q9P3p2k1RL37j60NJ8k18L03j90qK24k26J58k20K8L38
6512B51m02j59L92l8j0j86K01n9Q2J48k15m1q2J61j60Q3r0J41QM7k62O0K30r9
6536AQ7k9ML9L3J84j56k81J59K2n2P2k26J51j9qM0j87q6L49l36K96J67l48l3J7
6562a40J96l6k79J06Q5r8K20l73L77k25Qj8L04j52K8P5Or7j61P3P6J01j37n0K09
6587I8k24K76j57K21l88K15J02o1K1j48J26j46M73m42k30L37o5J00k28M3J47j95
$$ y = [-98, 113, 129, -142, 77, 152, -8, -16, 102, 77, -65, -251, -84, -38, 237, -62, 219, -37, 138, -280, -244, -26, -97, -44, 58, 190, -87, -97, 120, -152, -43, 235, 44, -34, 189, 69, -45, 38, -243, -58, -175, 281, 331, -8, -14, -35, -77, -173, 58, -195, -73, -12, -62, -40, -32, 8, -113, -20, -18, -6, 115, 51, -120, -128, -49, 77, -60, 32, -236, -305, -70, -16, -22, 7, 181, -215, -260, 132, -161, -38, -127, -54, -126, -147, -138, 199, 39, 44, 62, -156, 147, -43, -51, 173, -53, 105, -115, -87, 251, -151, -310, 82, 44, 34, -152, 49, -10, 72, 220, 5, -36, -118, 43, -117, -34, -124, 17, 25, 72, -190, -130, 100, 1, 88, 59, 63, 102, 135, 319, 163, -118, 41, 63, 11, 83, -143, 8, -11, -19, 21, -166, -252, 97, -239, 57, 224, -124, -157, -140, 56, 20, -259, -153, -68, -166, 54, -319, 58, -167, -159, -177, 127, -25, 3, 78, 84, -13, -174, -101, -25, 76, -61, -111, 98, -126, 150, -7, 214, -174, 41, 143, 82, 103, -45, 81, -65, 408, -34, -264, 73, 8, 108, -120, -77, 70, -125]
6609a25J44j39j03K98n7r9J23J46k71M0J13k8k0J24J56j67q9j10J38O3k29l9J42
6632A1j21L73k52m9J40j00M4k70K15q3p6L46j81j9P0K7R3j9J4j95J2m7J91J5R0
6657B29j21r3J95k03M0r7N3J8o5j8M6j50L63j71n2j82q2K97j67J26O7j2o4K27
6681A84l0j56j00Rj1m3kJ34J6M7J6n8J11j60%l7J23m4J32j40n6L8J00k3M2j21
6707b9L3j11L67j63p4R7l38K27k32K10oN2R2L7j36M4R9n7nO7l47K36p0p6k16M05
6733A06r2Qj68J5J64k45L33J0r6n3J24l8j06L32l96K28j92L33m05M9j05J18R8
6756B2j44J7K00j14j11Q7K6J83l07J47j19P4Q6l57m1K55J06jj06O3J29q9n6K25
6780A75l04J47k34M50m07K01O1K8j4k12N9n4K02r0j05j26N2Q3J22K0k22J32K45
$$ y = [-125, 19, -120, -223, 75, 18, -81, 42, 188, -83, -43, 70, 42, 22, 146, 302, 135, 46, -64, 74, 137, -92, -131, 11, -110, 263, 11, -38, 102, 2, 46, -224, -9, -92, -168, 178, -3, -22, 48, 75, 168, 149, 163, -32, -20, -67, 124, 139, 229, 108, 15, 210, 7, 47, -50, 3, 21, -44, -62, -16, -166, 197, 26, -26, -208, -290, 7, -160, -34, 33, 21, -43, 184, 154, -2, -102, -93, -104, -147, -149, -15, 1, 48, 64, 6, 117, -43, -43, -80, 43, -1, 131, -9, -65, -27, 73, 50, 92, -29, 4, -107, 260, 97, 23, 120, -218, 9, -223, -13, -19, 33, 125, 162, 26, 70, 169, 112, 107, 174, -173, 63, -7, -83, -299, 106, 14, 22, -146, -131, 33, -212, 121, 131, 35, -18, 106, 68, -38, 294, -102, 126, -66, 267, -138, -89, -194, -76, 22, -122, -105, 95, -19, -130, -43, -17, 166, -141, 6, -113, -39, 47, -310, -351, -96, 10, 9, -97, -34, 95, 6, -50, 175, -129, 18, -216, 234, -173, 28, 89, 117, 103, -109, -50, -104, 98, 8, -97, -223, -171, -88, 34, 54, -168, -36, 209]
6803B09p3j22J95k81J42l20Q3J38J96r3Q5k02PQ8j50M2L2L3M2k39P9J38k74K98
6827E3N9j84j9P7p3O5L00l18k00K54k9k1j80K52p5J1k7M1m9R1j12K4P6j06j08
6852a98J23Q9l12J95K37k41M6j23L93l87J85j06J21j00l8J06p4P7m3kL0k0j05
6875a47M11j93J2P1L0m13l1K49J50k38K12k19J85J41m54K15Q9j38K3O4J7J47j99
6898a6M8k6K6J0q6J18j15L1P5j0k21N0J05L4k21R9k40N12p6k11P7J45j9K04k57
6923C6M9j58K08R2k01L6j97j32K60M9L4j98L32q2Nj93m3K6p7J44n2J78Qk90J66
6948@P4j93J98k47R7L1j37L25j23mj9j25l6m7L23k27R9j0J43m4K1p5J77l35J04
6973c0J27k64J83r8K59j77L2kj49K55k82K01j02j08J77p0N7m9r7J90j32J2P9J18
$$ y = [209, 136, 14, 209, -72, 70, -250, -167, -29, 167, 74, 159, -43, -36, 52, -98, -56, -24, 9, 51, -188, -109, 29, -245, 53, 112, -72, -91, -14, -87, -22, 278, -40, -240, 14, -15, -36, -216, 36, -39, -28, -55, -14, -63, 28, -84, -60, 16, -90, -198, -75, 14, -298, -103, 134, -107, -61, -184, 209, -178, 7, -99, 22, -78, -116, -10, -84, -7, -50, -52, -22, -42, -147, 264, 71, 83, 154, 184, -229, -260, -11, 139, -99, 113, -106, 79, 220, -234, -19, 70, -68, -45, 19, 36, 183, -16, 32, 6, 32, 42, -44, 74, -41, -10, 65, 55, -166, -116, -11, 23, -198, -99, -339, 173, 97, -114, -37, 108, 89, 293, 36, 85, -73, 135, 227, 26, 62, -135, -267, -7, 42, 76, -122, 210, 128, 133, -60, -103, -77, -154, -10, -62, 116, 124, -166, 0, 74, -119, 79, -168, -71, -40, -177, 148, 25, 21, 2, -123, -159, -206, 117, -110, -11, -21, 122, 78, 99, 24, 201, -134, -30, 97, -167, 16, -82, 177, 0, 32, 30, -119, 136, -146, 55, -47, -155, 22, -48, 9, -40, -137, 53, -79, -67, 12, 130]
6997A30k78K9kJ61J38l53L8L17j6j65j10KK24j08k71M46j66q5J07l0j81K09r6
7020f0n3M7k1Q9j31R0P6P7K5M2j08j95K1J03jK20k64jM1K2M4J83k07m1J21k03
7046h4P5O4j0J53m09K94m66O09l59J28R4n1j51K87j21j02k41M25j1k26K34k52
7068a20j6K08j48J28qj90J30M8j67M7l8O1O7j14K85l85R0O0k1O6P4J34l20J71
7092D2O7QJ19Q2m59k76N05j4j92N7r9J73k04K34J79q3j49k95M84j35NN1J98k97
7116Ar0L2K3p0j48K75p5j0O6m1k36L32J16q6n7p1J56o0j45J29J71k14jk79L82
7141A00J00k68J5K13m8k17O5j55L05k27O9R3m15K04M7L4j4k9K90NN4j52j53L48
7165B64k77MN3j96K13j49K08k6j12P2O4l69M38l14R2P0J18k70J02q8p4K68pO4
$$ y = [130, -148, -119, -121, 40, 178, -175, -137, 180, 164, -1, -111, -109, 115, 7, -264, 182, 16, -69, 38, 8, -173, 36, -60, -113, -66, -87, 2, -129, -39, 37, 114, 139, 181, 73, -122, -101, 2, 1, 221, -43, -44, -3, 19, 63, 246, 39, -2, 119, -84, -9, 55, 45, 198, -211, 83, -383, 226, -133, -5, 89, 38, -113, 174, 53, -49, -290, 135, 124, -102, 132, -120, -136, 72, -76, 52, 44, -146, -16, 32, -135, -88, -126, -65, 2, -112, 173, -212, -122, -62, -83, -17, 57, 191, -129, 42, 109, 117, 236, 318, -141, -417, 88, 74, -118, -61, -160, 13, -191, 43, 222, 139, -10, -305, 179, 44, 49, 100, 298, 1, -89, -57, -34, -104, -252, 23, -52, -62, 4, -37, -273, 59, 175, 89, 32, -39, 117, 57, -88, 41, 212, -2, -3, -282, 100, 200, -68, -53, 160, 112, -105, -40, -195, 110, -117, -48, 45, -370, -166, -119, -85, -99, -128, 162, 167, 221, 69, -84, 264, -13, -9, 44, -152, 61, -88, 120, 94, -18, 54, 118, -251, 187, -127, -35, 35, 153, -117, -15, -103, -177, 91, 84, 148]
7189A48l07L78j80k01M08k97J56j50r4K94o1k65M4K97j14k15K79o4k13K48j46
7210e5K07j29J0oP6j47K35k45q2L42J9k01O1O9l6o1j57n0J7M8o5K10j03Q4j80
7235a39J90j04P5k7j40K76L3p0j36pk33K90j68L88k54q1J78J35k17J64j18r7R5
7258C3J37k64J35O7J0j47P7j33J24jj22Q9l7j66J85J06Q2j99l4j1Q6k5j94M94
7282B92m95J26K13l23J14J21o9J20l05J89p8J98lq5j42K14k50j6L16l7l78K32
7304d6L06j46r8j04K3P0K5J92j52j09k7k0oJ77j75L07l14J8J75k32M7R7J05l34
7328b21J54QK2j82L48j94K30k15R3N2k1o7P2j59k2J63M7m03J29m6K57j02o1RO9
7353d0N2K93l24J31P7k50k5J25K80l75M1%J07k44K2K02j53J58J33j18j4l2j20
$$ y = [148, -159, 219, 39, -162, 246, -51, 105, -45, -139, 155, 94, -171, -127, 170, 56, -159, 120, 56, -157, 91, -55, 152, 23, 33, 27, 103, -44, 191, -54, -136, 206, 225, 24, 85, 154, 118, 57, -100, -150, -133, -85, -150, 60, -43, 41, -139, 51, -53, 22, -5, -145, 131, 164, 94, -42, -49, -282, 8, -160, 228, -26, -107, 71, 206, -11, 153, 35, -62, 33, 170, -94, 41, 108, 118, -29, 48, -85, 39, 38, -84, 5, -32, -198, -13, 93, 175, -24, -58, -69, 17, -8, -202, 292, -203, -77, 136, -187, -73, 48, -21, 99, -206, -17, -95, 103, 100, 15, -127, 87, -163, -179, 137, 100, -278, -46, 260, 114, 16, -88, -65, 5, 30, 222, 70, -39, -66, -86, -92, 85, -90, 217, -97, -79, 96, -136, -89, 8, 113, -221, -67, -59, -37, -219, 129, -65, 165, -50, 43, 95, 74, 7, 79, -80, -102, 61, 108, -295, -166, -212, 45, -57, -118, -109, -40, 12, 305, -19, 112, 189, -61, -86, 39, 319, -56, -15, -15, 92, -152, -130, 72, -81, 77, 210, 92, 78, 46, -74]
7376g4J52L0l18L84k63N9M3n7J66j07pR1j62K10p9k01M46l85R1p3p3J5PJ16j0
7401Ao4j7n1J86j14Lm9N1o5K25n2n8K0j18J99p6J3j34L4j16K5J18J25Q5m5j28
7427bJ4O2r1j73J75j9N3l9R6PK08n25J44L2L4K0o8R5K66k92J77o7m1j65J59j43
7453h3O4j52K42o1N1o8j03j41K79Q2k7l3P8r6q1p2J2J95k66J04J03J08k39J10
7477FKr6K23k61K23k03q5L50n0j72m1J75j78J04j10O1k47K94J7N7O5k02O7N4j65
7502a12K47q5J65o1P7l67j38K76j27N2J18r3J8K8J5R8l47J9L56k13pMR0p5J33
7527G1n9q5J30j13K95n01J14J75j21P1L08m71J01J08J56k1m8N4k77q6J79K8j17
7550a09Q7j18J22m5P6j9J36o1J46j82j33P2K79m1k96J60m3k19J48L53j54m67M05
$$ y = [-74, 78, 108, -210, 174, -89, -30, 13, -44, 122, 15, 8, 99, -63, 147, 68, -133, 313, -72, 19, -54, -127, -112, -105, 11, 1, -63, -80, -131, 55, -59, -56, -105, -54, -119, 106, 54, -4, 16, -102, 97, 21, 34, -100, -66, -182, -157, -39, 86, 171, 126, -2, 12, 74, -17, -190, -15, -34, 19, -20, 76, 83, 291, -234, -90, -58, -24, -4, -72, 23, 289, -3, 174, 107, 66, -99, 60, -83, -19, -171, 71, 10, 61, -7, -110, -251, 28, 110, 83, 50, 128, 32, -49, -121, -109, 86, -180, -76, 27, 135, -104, 6, 8, -88, 135, -126, 97, -106, -191, 159, 109, -63, -104, 71, -107, -3, -113, -52, -299, -5, 12, 69, 134, -68, -1, 53, -112, 135, 50, 215, 154, 231, -136, -274, 2, -125, -73, 45, -48, -30, -2, 13, 111, -236, -217, 139, -74, -81, -77, 13, -62, 71, 12, -73, 57, -56, 239, -262, -148, 27, -94, -23, 285, -186, -85, 23, 179, 158, 110, 164, -113, -199, -20, 8, -109, -22, -140, -18, -63, 13, -6, 130, 69, 215, 33, -100, -28, 251, 210, -86, 74, 31, -188, -40, 313, 159, -308, 97]
7573I7k0J43k99K56N3k05o3j16M72j87k66L9J80O9j75R9j72J73O5l32O5K0o7J68
7597cN3j34J75J0q6J0j17K9m5o4J80L6J00j58j02K01j3j38R4n7J0j71l3J65K62
7622B04l02K8ro5q3j7M49m75J22J67j08J45po1J7j11K5q9M8K65j06k3ro7OOj23
7649a73K34l06K26J83j81K63n27J35K90j18k88K01k02J86j29K39k11M46m12J82
7669C8K00j14o5j47NJ07n7J12q6N6j40J21J4p8k6K23l13m4K37k8j86mK14j63J3
7694a11J96j3J82k11j25J39j55K98k08r1P6R1k25K60j94J76l69L32o2p5J94k35
7716a30J01Q3R5j53J38P3k69k39K43J04n3L9j62J90J02l2j49j40M4j5k4J11K23
7739A80k48M6j51K55m9J8j8r9J47r4r0J97p5k53K51l72M88kl08K38o2p2Q6q8Q5
$$ y = [97, 77, 220, -79, 177, 230, 25, -38, -154, 318, 131, -135, -96, 84, 153, -22, 77, -95, 78, 143, -189, -124, -104, -171, -3, 50, -84, 91, 101, 15, 25, -92, -63, -108, -172, 8, 44, 144, -14, -116, 85, 72, -66, 28, -29, -19, -190, -223, -58, 204, -98, -70, -79, -144, -227, -244, 205, -270, -148, 19, -89, 56, 49, -12, 5, -106, -81, -170, -122, 143, 37, 14, 5, -62, -56, -50, -173, 61, -245, -19, 164, -17, 246, -281, -146, 144, 26, -262, -61, -263, -77, -206, 33, -178, 268, -144, 38, 238, 124, 59, -88, -83, 24, -33, 79, -7, 49, -91, 30, 44, -34, -60, 163, -150, -194, 43, 15, -171, -175, 39, -124, -111, 85, 72, 254, 43, -82, 57, -98, 200, -8, -99, -23, 68, -157, 103, -91, 85, -284, 48, -14, -89, 105, -130, -29, 54, 149, -4, 134, 207, -62, -301, -58, 46, -7, 32, -130, 60, 162, 130, -19, -159, -115, -130, -154, -43, 180, -68, -22, -173, 82, 33, 51, 33, -66, 81, -13, -103, 94, 19, -234, 17, -355, 133, 131, -177, 61, -1, -73, 13, -75, 10]
7764A0l04L70l51M05k24J60m7o3L45o5j21O1l87J38Q4J34l8k97L14q8N7J16k54
7787d5K9P0k8N6L8o5l9P7j19J55n2R8j80M3j95K60j99l0L7N6J67j20P4Nj16k37
7813b60L44m0J39j39k45M19l92J87K00l88m8K60p6K31k40J06j50o4J02j90K21
7834b3J01kk31P9k3M3j93K82j77J71M0l32J54J70P8K10k30k10J06j44M2L3J03
7857D7M2j5k25J19j92R0K13j5j94j52L12LO9j77K43j79L7j41j8J68J9m9k6J57
7881A36L2m08N6RK79m32J7N04L2k98j09L68j24o6j09K98l21K16m9K11m8k10K5
7904In8M5p2L32k39J24l47K66K0M5k34jJ66R9k00Q9p4R4l2J67Q1l42M2q5J26o9
7930d8R1k22J70M3k96O01k84j8J58k38N3J88l7l54J24R2k46J62j31K70j14K7j01
$$ y = [10, -294, 76, -275, 130, -94, 66, 19, -44, 301, 236, 115, 176, -211, -73, 11, 145, 107, -190, 124, 36, 93, 209, -45, -16, 54, 26, 82, 120, 55, 16, 93, -26, 129, 77, 175, -5, 38, -157, 103, -96, -126, -89, -33, 134, 14, 88, 93, -23, -260, 84, 44, 183, 44, -201, 218, -174, 13, 213, -175, -223, 37, -39, 192, -48, 58, -92, -156, -54, -244, -23, 78, 76, -155, -76, -99, -56, -249, 33, -144, 27, 67, -265, -111, 59, 137, 347, 117, -93, 13, -131, -89, -56, 47, 89, 74, -151, -32, -224, -134, 79, 64, -130, -282, 30, 33, 102, -75, 168, -11, 26, -115, -133, 35, 54, 5, -21, 136, 168, -240, -184, -175, 104, -328, -311, 193, 225, -73, -182, 186, 62, -4, -113, 185, -136, 80, 31, 242, 194, -16, 9, -49, -4, -76, 256, 17, 141, -206, 60, 80, 125, -109, -110, 56, 155, -45, 44, -30, 64, 32, 199, 280, -62, -20, -105, 21, -48, 43, -179, -9, 34, -262, 339, 55, 37, 195, -43, 10, 198, 161, -193, -69, 23, -223, -61, -192, 78, -36, -9, -110]
7953a10k7J30r8q4J43q3J40O2j40j83K59or9P3k9k7J85M7l32K96n16L93j20o8
7977a94K14P5k04L5J17j90j19L65p5k30K91p1L5k48J13J88j92J55O2j38N0j76
7999a37L2K77k47J1l5r2J49J36j10j36K74q0j28L0p9J63q2K52p2r9k46J55m5J75
8023F6j89J24J72l54N7J50N8r0j13Q6j03j65O09k09p8L9%k01K52k06L5J35l1K3
8047F7k60K27j18J21K61k48p3k05K41%m0J6k14K74m6P3L3l18J80J36j97O6m3Q7
8071B0K7K6J31j70j01L31l54J53j44o3L9j7J77J26j98j9l2K19N1j81K9o4L4N4
8095G4lk30K91j71q0J34J77k50J31r1K27P2l87K87k35N3j99p9J57K69k27L0L48
8118B98l35O3r8K00rl46L06j65k2N1RL1J61l02Q0q3O6K2N3N5L47m52L2J53Q8j62
$$ y = [-110, -137, -7, -105, -189, -46, -129, 11, 73, -67, -250, 9, 3, -96, -23, -52, -79, 106, 153, -179, 117, -399, -6, -126, -194, 20, 95, -109, -74, 43, -147, -266, 99, 24, -206, 85, 14, 49, -199, -86, 102, -90, 65, 127, -11, 39, -137, -105, 172, -75, -64, -99, -191, -42, 94, -16, -152, 122, 42, -86, -56, -135, 28, -54, 198, 126, 27, -219, -64, -109, 66, -123, 1, 173, -181, -124, 26, 84, -6, -119, -33, -136, -301, 308, 99, 21, 60, 60, -141, 111, -95, -60, 75, 44, 67, -193, 34, -84, 37, 298, 50, -23, -228, 13, 13, -27, -11, -225, 49, 3, 76, 109, -209, -29, 107, -90, -24, -67, 20, 47, 73, 204, 34, -67, 264, -90, 63, -81, -144, -105, -122, 55, 181, -17, -36, -68, 151, 202, 21, 50, -14, 20, 74, 71, -159, 132, -39, -119, 15, 192, -58, 73, -18, 209, 281, -106, 181, -54, -1, -200, -279, -122, 147, -80, -50, 298, -37, 26, -72, 128, 119, -227, 79, -86, -108, -57, -48, -17, 144, -158, -78, -161, -95, -73, -20, 35, 382, -70, -38, 115, 203, 41]
8144D1q8q2J27l3L5R9l63L16N2l5Q4l79J43M0K31j17j59mJ01J58o3j22k27J28
8168a17J9J48l35K72JJ76j48o6K96m38n0N11m93M04k68O9p7K07L2j12j75J67J6
$$ y = [41, -47, -129, -2, -35, 0, 99, -264, 52, 104, 69, 153, -226, -83, -43, 188, 71, -88, -92, 9, 167, 104, -18, -245, -117, -98, 50, -285, -13, -12, 164, 16, -50, 246, -192, -242, 269, -224, 180, -88, -19, -96, 111, 143, 31, -144, 23, 39]
8191C9
$$ Imaginary data points
##PAGE= N=2
##DATA TABLE= (X++(I..I)), XYDATA
0@%%%%%%%%%%Qj6J6j6J6j6K4l2L9m7N6o8P6q8J05j22J42j66J91k19K50k84L23
33A72l64M10m61N18n82O49p22Q03q89R84j091J205j331J469j618J781j960K160
51A133k380K625k900L205l551L948m406M943n580O353p312Q533j0153J2407j5756
66h891K1237l1692N8284k44689m69288P24524M29332n21224l54323M80141L31975
77D15386l64913l16417J48777J12660K4494O6378o2188j19617J41233J94549k23281
88A7061l70884K01605M16314j35578l15744J44546K69416j20779k81890K0062
98a55871J56227K1083M0208L0099j19669j8070J38125l9479k35670k810L14269
109A28442Q6518k66029o4149J94590K0263j66981p4390Q9497J09636M4006k8833
$$ y = [0, 0, 0, 0, 0, 0, 0, 0, 0, 0, 0, 8, -8, 8, -8, 8, -8, 16, -16, 23, -24, 32, -36, 40, -48, 57, -65, 77, -89, 102, -117, 133, -151, 172, -192, 218, -243, 275, -307, 342, -380, 423, -466, 518, -573, 632, -699, 770, -848, 933, -1027, 1133, -1247, 1378, -1522, 1683, -1868, 2080, -2326, 2617, -2963, 3390, -3922, 4611, -5542, 6865, -8891, 12346, -19346, 38938, -205751, -675039, 49485, 478817, -42407, -396730, 83411, 415386, 50473, -265944, -117167, -4507, 19987, 86365, 24177, -95440, 45793, 240342, 17061, -353823, -152218, 264096, 128518, -187226, -42680, 226736, 105957, -175933, -155871, 356, 21439, 61647, 91746, -27923, -45993, 92132, 52653, -183017, -185827, 128442, 214960, -51069, -115218, 79372, 99635, -67346, -141736, -52239, 57397, 101403, 72570]
120G2570j25909k7234J74979j6945k70303J5881L44677O8609l28303q4156L13278
131A37144J5295l46669l821L22588L7695k24749j611J78783o7262j79058P2764
142e8901J05277o3564J659J00107k3577j15692K0506Q2892r6358p4466J66129
153D4012Q8207j41836n1299J19067J482j65014o622J77158Q099j13402M9247P5123
165H4222q4226q5441N7600N7465o2271L553J16373k1245j17928J5204O7416l7553
177f831o7219M9152R5104j9367n4537L251j6094r136K4955j8009k2472O1055Q0249
190A00101n7167j34805L9890J26151o6639j15020Q4451J39268m4712j38252J7819
201d8915R3894m1980o3643M1158M8524N927o454j6591l7500j7518M8662J2781
$$ y = [72570, -53339, -80573, 94406, 77461, -192842, -176961, 167716, 236325, -91978, -176134, 137144, 152439, -194230, -198051, 124537, 162232, -62517, -64128, 114655, 47393, -131665, -58901, 46376, -17188, -15529, 84578, 61001, -54691, -34185, 48707, -47651, -122117, 44012, 132219, -9617, -60916, 58151, 59633, -105381, -112003, 65155, 73254, -40148, 9099, 84222, -4, -85445, -27845, 29620, -32651, -29098, 87275, 66030, -51898, -36694, 30722, -6831, -74050, -24898, 70206, 50839, -3698, -447, -16541, -25677, -722, -18731, -41203, 19852, 100101, 42934, -91871, -51981, 74170, 7531, -107489, -23038, 116230, 71518, -66734, -48915, 44979, 2999, -60644, -19486, 29038, 34965, 28511, 11920, -25580, -43098, 5564, 18345]
213A8345o1722K6157R2450k0776r2809r978O1660n915n5636M0558O2983l4556
225B0761k8957K2650j4697m7289J0813O8325j207n7870L3834N4020n5076o3991
237e8684K3903N2830m154k8649K6428K3462k6627j3693j3143k0425K5581L9698
249B6527k883l1799P132M2279l4578p0305L2267O2928j2970l3104J9130L5853
261D0477l0914m9065K0778K1450j3743J3003K1684m737j8927m993O216k2664j0734
274c2169M2126J5705k1151K683P463j4570k4664K532K5934l894m54K9705r501
287A9745l4509K18J5336p090j9472K1682M2855j8871l5053J3757Q873j9502j4353
300b6384J7665K9095m304j1263N335j4213j0276P355l609J531J7250J6782o873
$$ y = [18345, -43377, -17220, 75230, 54454, -38355, -48333, 13327, 7412, -48224, -7666, 55317, 20761, -8196, 14454, -243, -47532, -36719, 31606, 30399, -27471, 6363, 60383, 5307, -58684, -34781, 18049, 13895, -14754, 11674, 35136, 8509, -5184, -18327, -38752, -13171, 26527, 23644, -8155, -1023, 41256, 6678, -63627, -31360, 31568, 18598, -14506, 4624, 40477, 9563, -39502, -18724, 2726, -11017, 1986, 23670, 18933, 6, -4987, 1229, -21435, -32169, 9957, 25662, 4511, 7194, 14657, 87, -24577, -22045, 3889, -5, -459, 29246, 19745, -14764, -14546, 790, -6300, -25772, -4090, 38765, 19894, -15159, -1402, 7471, -12031, -26384, -8719, 20376, 16072, 4809, 10144, -4069, -14345, -6990, -10599, -9068, 8182, 24964, 18091]
313A8091l0786O25J9657j9208j2803K5999K1374n629k0460R44Q304k0689n074
326a9655J9867M811K865N592l275j0320j5066M838R746r335J0264J9557o489j2525
340H75p255P2j092p153J4029J5319q254L77J158j3479p587J339J0861M967n204
355a027J3017M918k1054o915M333J492O83Q56J5090N761j6039m747r52n639M346
370e877K425O292Q566k156k176j1150j0842J1594L450o849P923J0826L269j3860
384A435j6045R530N671q220M646Q028P374j166j4798m285J033j83P691n97J499
399A613J0755l362j0758p829k049J1033K180l128Q261J993l572n070j0972J756
413i149O778L010O132k320j368L978q779o690L04J387J1273M113m623o73m281
$$ y = [18091, -12695, -12070, 7587, -11621, -24424, 1575, 22949, 17320, -3140, -2196, 6108, -14581, -19655, 212, 5023, 7888, 13480, 10205, -115, -15181, -10343, -597, -9932, 332, 19889, 13400, 875, -6380, -6308, -7400, -14553, -524, 14795, 6541, 6918, 8076, -5403, -12990, -11651, -790, 4177, -1027, 11990, 16908, -4146, -11061, -6728, -5236, -4553, -3697, 11393, 17154, 1115, -3632, -4584, -10223, -5877, -3452, 2840, 11406, 9250, 7074, -4076, -14918, -3324, 126, -6723, 1200, 12026, 15295, 1435, -14610, -5080, 591, -7629, -2983, 5045, 12419, 11253, -3545, -7830, -6797, -6980, 711, 114, 1613, 12368, 9006, -1752, -9581, -11630, -597, 1583, -1545, 6716, 8709, 5137, 67, -10905, -9149, -2371, 639, 6771, 4451, 3083, 7061, -1718, -8408, -8104, -6717, 4556, 8669, 4046, 3373, -908]
428i08N41j013j1759N258J5792L561n958j0178K996P430j2288n931R977Q221N482
443A1223n952p650O40k900K840J572r113Q385J6682l033j7148j1488J4371J4013
457A2442j8690r676J9919J6264q069k4655l026K0656J065j1888k479Q604J5503
470A5970l239k1288o485R246J5069k016k0190N708K5416k40k5886j7244J9933
483e246K5998j6644k2044J4440K3422l170l0183j0020K5953J1154j3919p260N996
496a523J3172j737j6607o523M006J4601J0142j7330j1353J7342J3815j5175k8121
509b5291Q805L7750l048l2188Q60K6271N276k8646j4170K5553J4210j2995o058
522c671K556N355n27p437k998j519Q897J5162j1054j6536R305J3035p527j9179
$$ y = [-908, -367, -1380, -13139, -7881, 7911, 11472, 5514, -4664, -1668, 5762, -6526, -12457, -2480, 5741, 11223, 5271, -2379, -1739, -4639, -1799, -227, -9340, -955, 15727, 12694, -4454, -15942, -1571, 12442, -6248, -15924, 3995, 20259, 12190, -12465, -15491, 5165, 6230, -5658, -8137, 467, 15970, 12731, -8557, -15042, -5796, 9273, 7257, -12933, -7225, 18191, 17951, -7935, -25179, -5246, 20752, 4108, -17936, -3496, 19926, 16756, -13427, -23447, 2506, 13660, -259, -7519, -1523, 11649, 9912, -6695, -13218, -9212, 5389, 15531, -1799, -13152, 4190, 18005, 2830, -25291, -16486, 21264, 18216, -13972, -13112, 13159, 18435, -10211, -24381, 1172, 15382, 2387, -3671, -1115, 4240, 3713, -3724, -6722, -8241, 656, 15818, 4764, -11772, -2467, 10568, 3041, -16138]
536a6138M724K6608k227k1177L031J1913j993j3659j271J6133P43r612N443L526
550F044p093n873J780R406k835p083R762N317q705p139N60P768k57o893P633N028
566G420o869k057Q75l43m589n39J3777J522j5502J950J2543k255j5832m837K1425
581F689R155j9646n306J3531M488j0212j0545P334J0845k326n96l826n748Q441
595B278M768j0834r391R501K1683p293k6476O166K3461m711k2827k562K5837R346
609A8946k2295q915J2956O885n728j0888J781J2882K789m133q714l807J1584L581
623F924j1308m379Q408J2564l978j7467K88J2826K625q450q355R394J4635p760
637E967j4534k06J0669O569j1216p294J2769P169n655r737l171R847M184o324
$$ y = [-16138, -11414, 15194, 12967, -8210, -5179, 6734, 4741, -8918, -10189, 5944, 6687, -2925, 2518, 6044, -1049, -6922, -5142, 4264, 1429, -5654, 4108, 9425, 720, -6419, -5859, 1909, 1652, -5241, 2392, 7420, 551, -1506, -631, -974, -5563, -6102, 7675, 9197, -6305, -4355, 8188, 5933, -9899, -14736, 6689, 15844, -3802, -9108, 4423, 8911, -1301, -11846, -4512, 6333, 4007, 3411, -415, -6163, 2278, 7046, -3788, -13179, -3678, 18005, 10712, -15764, -9598, 13863, 9152, -13675, -16237, 9600, 18946, -3349, -12264, 692, 7577, 1849, -9039, -7258, 5624, 8413, 4280, -4434, -8241, 3343, 6924, -4384, -8763, -355, 12209, 8231, -9236, -8948, 3878, 6503, -1947, -10302, -908, 13727, 5967, -8567, -8773, 1896, 8465, -2751, -10045, 2724, 9893, 4238, -5499, -8670, 1177, 5361, -963]
651i63l166K306Q465J843j4388m630J1638O011o057r067P398J2476r575j1382
665i091N022O815N95n873j63P566j865l893j50k695J633M047n68o76j352K259
681A611K378p092k304N752J063r9j318Q7L071l209k618J246j140M083K008m150
697f31L27J407m42j730m083M463N246m203j048J356N07l37m645Q39N057j000M5
714A128k72j754L049k523l405K303K113J905j122l419L722O5m836P52J432K402
730A540K92k651K225k78l409J815m16q20K730J21R77j282l150K583l86k285K030
747c64P81J329R23l558R9O47r95J644j818L82M737j895k898o68M61K894k780k047
765c126N278Q88k256j617j828L431l08k611K239J176L41M33l807J68K314j395
$$ y = [-963, -4129, -1823, 6642, 8485, -5903, -10533, 1105, 7116, 1059, -8008, -610, 11866, 2291, -9091, -4069, 2746, 3341, -2532, -2695, 4871, 3006, -887, -1037, -3732, -2099, 1948, 1380, 704, -648, 1611, 3989, -3103, -5407, 345, 1408, 1309, -9, 78, 3149, -60, -2678, -1432, -2572, 1511, 3519, -631, -304, 1103, 661, -1069, -5152, -689, 4557, 354, -694, 662, 1169, 832, -3813, -2974, 2083, 1083, 1128, 856, -898, 2151, -372, -3777, -1474, 639, 2544, 1422, -1997, 1725, 1790, -3046, -2294, -862, 1540, 1832, -819, 1406, 1128, -2281, -466, -882, -1702, 1028, 1149, 2126, 844, -2306, 277, -109, -2394, -364, 417, 1746, 2669, -889, -790, -143, -1138, 506, -1312, -930, 3807, 1912, -986, -1654, -1193, 1701, -1079, -3126, 2152, 3040, 784, -833, -2661, 770, 462, -2149, 90, 1266, 1607, 2040, -1767, -1599, 715, -680]
781f80O08n33Q59L046l201j918J512j046J428K8q37K927j284r57K99k780J763
798g66K176j651R07q6M86J182m272J0K696q05L88l14j64K615k232k184J257m93
816a250K418k12k542K588O89j719j269j178K971J875l867J619J605j012m20k448
832b152Q13K817j418K38P19j296J710j393k506J913M72J478n12k142K673n1l169
849a806R72o9R76J259j637J229l18j948K004j282j223K279L88K51q58j586K476
866A107p58k247J951J10M12P90j822O01j43j296J854j190k58K750p23r82m13r13
884a170J521m90q68K120r27N8J055k069n51R28P98J058k790N65L568k222k136
901a552K73O93J894j257j344K407n17k09J79k878J203K338j19q30k012K303K589
$$ y = [-680, -72, -605, 254, 3300, 99, -1819, -307, -1353, 75, 103, -734, 2193, 909, -48, 251, -2529, -766, 1410, -241, 666, 580, 1066, 2248, -2024, -2014, 682, -123, 265, -49, -213, 2402, 170, -2014, -757, -1250, 1168, 956, -1586, 1002, 1691, -28, -1297, -2475, 496, 2371, -1496, 123, 1728, 716, 296, -2152, -1339, 1478, 60, 298, 1017, -279, 1431, 38, -2468, -555, -83, 1395, 883, -1259, 1414, 1363, -1806, -834, -903, 73, 1332, -305, 924, 606, -1342, 662, -620, -1843, 436, 824, 1075, 217, -1369, 1107, 349, -1898, 53, 163, 575, 1365, -457, 144, 1, -1295, 559, -631, -889, 1861, 1138, 156, -257, -1170, 351, -139, -1007, 1113, 186, 244, 1299, -770, -1321, -393, 405, 1463, -1327, -762, 2806, 584, -1552, -1279, -586, 1308, 51, -1293, 1114, 597, 388, 567, -2311, -1108, 1230, 1111, 281, -1731, 572, 3161]
918C161m679j513L280J220L99k723j98L027j421j287k93o84L191N79l061N07P63
935B68Q83n27l513K024K954j480k51j108n4K311j461r40p7N74L556k153l940K465
953d69K313j634k098j08M421l57m081K076P31j956N82P46K50j067j58L654j930
970I15m439L340K427k026k191J351L663k039l856K997J131k287O65R41N67j585
986d26n48L300j939l555L289K182j532j908l6L123l88l841J448J476L2N48k307
1003a082N53J431q59l4j274J24L153r30j376k78k96K257l90k927M93K162J893
1020B620j750m199K750M187l469l366J627M145M04n354M55M302k062j355O93j
1036c73O17J91J132j467l446L782L422m982k848M721L371l261n253L654N244m690
$$ y = [3161, -1518, -3031, 249, 1469, 1868, -855, -1053, 1974, 553, -734, -1027, -1711, 1480, 2059, -1002, -495, 268, 1151, 624, -2889, -865, 2089, 609, 358, -750, -804, 1507, 46, -894, -971, -397, 3159, 1006, -2934, -469, 1844, 210, -1888, -1996, 2425, 2068, -2013, 63, 794, -1162, -580, 166, 416, -651, -809, 2845, 915, -3524, -184, 2243, 217, -1974, -623, 3040, 1001, -2855, 142, 1273, -1014, -349, 592, 1159, -426, -974, 2326, 387, -3168, 121, 2303, 771, -1137, -1173, 1950, 1562, -2279, -831, 645, 677, 1225, -1082, -529, 902, 43, 9, -1265, -1141, 2012, 1082, -294, -572, -868, 1389, 999, -1928, -1435, 727, 2620, 870, -3329, -579, 3608, 139, -3227, -1600, 2545, 2949, -2405, -1950, 2352, 290, -1065, -372, -373, 244, 435, 1567, 100, -3346, 436, 3858, -1124, -3972, 749, 4120, 859, -4394, -740, 4504, -186]
1052a86l050K887K230m55k540L68J430j726J790N14l034J027K501j78k849j473
1068b744M206J512m871P8L212K63j421k025J233J863j339j98K48o51K066q57k147
1085a572J125R81K52r35r68K053n0k099J436m53m75J042K32m90p85L42K314k411
1103d61k024L737K66k182n70J834J329l071r12L646p51k592K020R27q89j479N26
1120f46K037k176p40L327j148j924J097J044n31k060J246K785l120j165L312p0
1136A268k142o46J496J613k385k61K566j474j013J250m62k15j26J093N91k333
1152a180P45K303k258p19J051L57K64j413Q88J035j788L18J190j574M83J197l30
1169E69n03j116J768M69k682J043J576r84m79K84O00%j541J252M81j831J404L78
$$ y = [-186, -3236, -349, 1881, 1426, -1114, -746, 684, -1042, 748, 1262, -1772, -745, 1756, 1578, -1271, -2744, 1462, 2974, -1897, -1819, 1393, 1656, 235, -1790, -557, 1306, -33, -231, 17, -634, 1432, 575, -1572, -447, 534, 786, -149, -1117, 936, 886, -1213, 223, -230, -705, 337, 569, 79, -706, -364, 1950, -461, -2485, 1252, 1518, -664, -1234, 600, 1929, -1142, -2054, 1592, 841, -1751, 269, 1196, 307, -1172, -646, 1391, -785, -1525, 1802, 654, -1270, -173, 871, 340, -1720, -474, 2311, -809, -1974, 1338, 1268, -874, -1520, -24, 1589, -796, -1057, 1509, 35, -978, 272, -190, -405, -531, 562, 1153, -1180, -435, 1868, -390, -1109, -58, 299, 563, -850, 38, 1073, -715, -397, 793, -781, -298, 899, 569, 66, -1050, 718, 1187, -1495, -452, 1124, 140, -339, -55, 545, 545, -996, 256, 737, -1094, 310, 688]
1187F88j277R3O28O72r25j364K316M35k453J269O30m49p21k41J853q52j564K152
1205H90j32j743N89P69J30j034k09K105r57j874K085K22j688L97R06M10j131l67
1223f32J845j216j367J739M10j065KM27P38j517l71K227j002j317J511J24k29
1240C07p22m0J563j206n11J483o92o14Q07j73k35l87J81J170j500j49J714p20
1258B76r30M60K66M06j031L61J154j496R9J323j180j17M16L36l0j289J254Q92
1276A170k006O9J283p66J36k60M15O93j535N07R31j444O69O82m12k97l35J111
1294F11k2j643R59J162j082l07J75M10l1j082J131L59j096P53K55r07J78k9N19
1313C13p36o18J890q3j410O75J73j88L8n25Q72J08p33Q01l7j067P74j52K8j47
$$ y = [688, -589, -496, 132, 804, -121, -1485, 831, 1266, -1187, 82, 712, 263, -458, -699, 1154, 302, -1262, 890, 758, -985, -396, 373, 503, -531, -740, 1365, 408, -1466, 619, 841, -847, -450, 456, 866, -265, -632, 1213, -3, -1370, 369, 779, -286, -284, 143, 881, -636, -1007, 1220, 218, -1099, 412, 536, 307, -415, -455, 1108, -98, -609, 874, 182, -432, 375, 202, -33, -420, -239, 931, -569, -718, 996, 276, -654, -194, 72, 478, -553, -192, 962, -534, -435, 888, -292, -409, 7, 343, 313, -976, 278, 1170, -836, -767, 516, -250, -114, -374, 41, 734, -801, -294, 637, -807, -138, 544, 132, -165, -500, 611, 589, -1054, -95, 1067, -15, -322, -147, 263, 232, -850, 281, 640, -456, 297, 552, -355, -177, -206, 313, -423, -1041, 849, 766, -644, 31, 204, 16, 54, -471, 401, 509, -224, 577, 540, -527, 247, 95, 123, -24]
1333b4n9R00q24o58J110j32q05N19k66N78m27l67R05o00l50J131o46l75O66o2
1353B14lm31o5J085j079m49J243k49l71k5O8M14n63k61R60q79K91O20r22M03l98
1374c97M83L69j032L48J214j118l47M41J2K67o56M05O89q52J59L45l87J78k13
1393i2m8N33m82P8O80r69O4L99l87N80m10k49J051p35j24L92n77N68j09k75L50
1414B38j95p3J27o70N76K09m96M66q9k55M48m49J79K68p10Q44j41r58O09J08Q8
1435A24ro23P71K44q22N67j19j34J72n52M40P0l43Q08l98n46N97l1P2j75o17Q37
1457C33K6p25K04M68j88K59q60L86M54p80M21m5o2M52m19J70K42o92M27M24m98
1478cM4j32K1N37q73K51O41o81P6o3J05M35p70J45R21o03NP2l94M52l07J10N01
$$ y = [-24, -83, 817, -7, -665, 445, 313, -492, 27, -239, 339, -88, -455, 450, -150, -500, 631, -15, -390, 276, 214, 211, -220, -285, 800, -279, -728, 515, 266, -105, -130, -62, 352, -211, -472, 488, -391, -100, 520, -402, 1, -397, 86, 455, -577, -229, 985, -133, -480, -39, -27, 240, -416, -11, 678, -174, -15, 330, -57, 121, -92, -140, 393, -89, -11, 669, -300, -236, 163, -224, 356, -54, -303, 748, 13, -111, 281, -296, 272, 163, -112, 238, 43, -30, 97, -573, 3, 212, -284, 182, 93, -162, 286, -163, 16, 284, -426, 418, 277, -681, -72, 36, 124, 115, -508, 263, 507, -315, 252, 133, -1, 171, -381, 59, 129, -214, 594, 196, -350, 247, 216, 288, 113, -504, 333, 359, -366, -162, 306, 118, 377, -483, -97, 357, -423, -2, -47, -109, 343, -76, 94, 336, -356, 71, 495, -3, 41, -91, -70, 467, -406, -155, 486, -195, -119, -182, -77, 358, -412, -267, 654, 51, 56, 128, -266, 186, -121, -11, 490]
1501D90o90J01M53o40M3K34j15M52o00J22M81k88N7k07n2O15n25o2O47n48j51
1522a83L43l61N60n27mM69m85r3M02j56K50j75l30P35m31l48M33j56N5j32m7L78
1544A97m53P0N62l89l66N20l14J74j75O1N80l51l54M27j70M3m43J70K62J06m21
1565b64L88m00K46L43l53K97l5m42O60k68l26R6L59k40q1l77O04Qn55M62j73K6
1587b5K66o60N87j26j89L52l59O6J39l16L70j55l03N17j01l61%L91J43J0q21Q69
1609B94j6o27N00j8k03K33m89M96J08m73L72m6j13J86m18M48p5n18N99m5o07O11
1631A99j86n9K3k79L89J72n10J94L5Q2J48j88n1K41l34j2M42o07N66l60J5N3j96
1654b23J93J05k48J58R7n1K69k37j92K02P8j33K31m6J45k94j11K74k30J08j22
$$ y = [490, -200, -99, 354, -286, -243, -9, -124, 328, -272, -150, 331, 43, 100, -107, -159, 456, -69, -131, 516, -32, -183, 160, -201, 359, -168, -172, 297, -188, -281, 121, -35, 215, 40, -290, 445, 14, -334, 99, -57, -2, -134, -181, 197, -256, -186, 376, -13, -379, 141, -173, 1, -174, -113, 467, 116, -238, 189, 19, 62, -381, -211, 51, 157, -264, 124, -276, -30, 313, -40, 257, 222, -220, 440, 172, -154, -58, 301, 61, -20, -397, 207, 215, -340, 122, -51, -25, 241, -419, 168, 42, -147, 205, -154, -88, 51, -265, 105, -50, -353, 164, 63, -298, -298, 93, 236, 246, -575, 294, 278, -349, 151, 133, -70, 163, -326, 170, 278, -195, 177, 131, 18, 204, -214, 234, 159, -359, 240, 195, -412, 199, 13, -46, -23, -302, 87, 259, -251, -57, -22, 60, 208, 20, -31, 210, -124, -136, 306, -301, 265, -95, -80, -27, -223, -30, 75, -173, -15, 82, 31, 300, 63, -129, 73, 151, 18, 249, 203, 348, 54, -57, 217, -13, 95, -27]
1675b7P5L6j64J61L26m13q2J44j58O9JK8K96n30N0M69m18K15j03o0J61k30j6L90
1699B20m46J65J44n7Kk62J28L59j11j13J0k44J31J88j98L19l02O9L16l11K54r4
1721A67k82K21j7k81M93m42K87n9l81M13o1l81M40j40k6K08k76N13j57m12O6K30
1743A23q4K70j44k56L59n08L81k8k32L13n4m08M89l36K56j23l41K69K67q9n5k4
1765D5o3j16j19J60J79j48P7l3j32J65j86K42K7j26P9J57n44N19l10N5J31l22
1787b63N25k72Q4O9l26K66p0k29K15J2l15M82p8l60M20k86O8m3PJ03k32L14o7
1810B4k31%L51k14l3L28k0k43J89m01M71j85N4J09j66N9j85N1M2l8NM28m98L0
1834g3L48n21K79j2j82K37j28J36j03O3n7j57K57kLj55K0K5K37r8l28K51J34k48
$$ y = [-27, 48, 84, -80, 81, 407, -6, -88, 56, -102, -33, -32, -4, 292, -238, -188, 281, -137, 78, -25, -85, 76, -154, -170, 220, -226, -61, 83, 26, 28, -234, -106, 253, 142, 29, 39, -205, -74, 114, -84, 235, -67, 2, 318, 7, 261, 167, -115, 106, 89, -192, 301, -141, 146, 87, -294, 119, 58, -323, 117, -23, -49, 159, -117, 396, 239, -173, -107, 123, 39, 309, 165, -91, 268, -240, 141, 113, -119, 194, 140, -268, 221, -115, 141, 18, -323, -54, 213, 124, 69, 45, -18, -134, -253, -93, 86, -62, 15, -18, -150, 15, -171, 71, 98, -28, 51, 208, -336, 183, -127, -72, 59, -263, 262, -10, 74, 143, -183, 83, 13, -216, -1, 11, -304, 178, 100, -260, 160, -126, -58, -101, -94, 9, -223, 91, 24, -207, -207, 144, -70, -103, 225, 205, -38, 151, -250, 221, 36, 90, 199, 33, 92, -93, -42, 0, -38, -33, 395, -103, -73, 275, -246, 33, 21, -161, 76, -52, 84, -19, 44, -13, -170, 87, 85, 88, -67, -47, -22, 215, 117, -211, 40, 174, -74]
1858g4J26j82K55P4m09Q7L83m11K81j52M2J01l60L72J64k70J13k46M1J14J07j86
1880c0J03Mj4L15n10L44k65j32J61k11K11K05k84P4K12j16J52l15k3L49k60J85
1902A55j15J30j2j69oN5j21J02J67j98j1L58n03N26l19j29J70m53N15k15l2L9
1924f6j57L62R4j75q6J43j14J07k53Q8K7n0P4N2j9j0p5J55J79k68r0J74m9j39
1948i6K62q3P1k22J33J87k88j58M06j94o9J24J2P9l04J75J20j88J69k25J16O4
1970I1O9k78K18r2J49jo1m3l3r2J18m21L41J08k03L59j59l51M90j67J17K1k46
1993f6J09N7k82M70j86k33K11l71J94L97k77jJ66j80nJ21k60L09l73M22k03O9
2015H8p7J27j82K6J17l53P3p0J66J93r0O9k15m4L63l71J65J07l38K35K95k76J70
$$ y = [-74, 52, -130, 125, 199, -210, -123, 260, -151, 130, -22, 20, 121, -239, 133, 297, 27, 140, -106, -65, 49, 156, -30, 73, 77, 63, 378, -132, 212, -53, -185, -24, -235, -24, 181, -103, -29, 183, 67, 219, -96, -119, 230, -30, 155, 40, 170, 158, -11, -17, 38, -83, 19, 186, -12, -23, 335, -168, 358, 39, -90, 80, -373, 142, -73, -105, -66, -223, 139, 233, 58, -28, 115, 1, 108, -145, -57, -30, -80, -6, 46, 27, 17, -58, 97, 276, 8, -82, 92, 43, -96, 166, 83, 154, -68, 65, 252, -36, -194, 212, 18, -51, 73, 85, 164, -140, 35, 155, -33, 136, -89, 27, 91, 160, -118, 100, 8, 157, 156, 95, 52, 19, -73, 45, -376, -35, 73, -130, 229, 70, -281, 209, 42, 159, 180, -66, 43, 100, -182, 288, 102, -131, 80, -291, -97, 300, 23, 22, 188, 8, 3, 124, -136, 173, -200, 222, 19, 88, 11, 138, -44, -18, 99, -254, -181, -251, -85, 108, 18, 87, -128, -172, 191, -180, -15, 92, -246, -11, 284, 8, 178]
2038A78l04L28j39j75j25K32o1Q1q2J03M3k32J35K97k53j73J29j34K34k64P6L04
2060A98m72K38M5l35L63k73L43J11l69J39J67l53K29m8l7L51l52q1L29k52J85
2081A26k08J4K50j39l7K09m9o6k74Q2K89J0m39O4K35l5N5k13J01q4j18J27R1j66
2105a75L96l93K81j13k9J62k97r8L22J88j60k25J11r6R2q7L45m40j8N22l99L6
2127g5nJ09M8q7p9N21n74J19M1m9Jj15K95j48Q9o1m1l4Q2R4k31K70j43Np0l5K78
2154B05O3l28R1P5k28J5QO7J11j94OQ0j62K33o8K19Mm05L28Q3j60j70N13l87k18
2179b19K83l0K94j12k50K07j55j23K06l56J65N3J06j36j61M28j71j33N63m66J96
2200A89j77j36O7n4J14J87P1m21M08l45J44P2m15K43J08j10J41p1J05K8jq2J05
$$ y = [178, -126, 202, 63, -112, -237, -5, -66, 15, -67, 36, 79, -153, -18, 279, 26, -147, -18, -152, 82, -182, -106, 198, -274, -36, 9, -326, 37, -236, 107, 218, -151, -12, 155, -198, 31, -17, -54, 297, -55, -136, 193, -59, 126, -82, -68, 182, 43, 6, 215, 166, 100, -174, -92, 197, 207, -232, -168, 67, 32, 87, -126, -25, -109, -227, -100, -9, -175, 221, -172, 109, -4, -33, 129, -168, -266, 56, 244, 84, -141, -30, -126, -34, -121, 224, -216, -234, 288, -111, -75, -80, 29, 77, -10, -89, 432, -142, -23, 18, -31, -30, -145, 150, 2, 91, 30, -11, -45, 37, 131, -100, 170, 27, 32, -38, -73, 205, 268, -60, 31, 106, -122, -107, -99, -32, 79, -115, -109, -29, -191, 42, -26, 193, 197, -208, 120, 203, 43, -127, 386, -1, -219, 64, 34, 328, 216, -34, 173, 18, -105, 101, -255, -90, -37, 69, -67, -228, 200, 29, -104, 459, -7, 189, 12, -124, -57, -111, 3, 190, 261, -160, 248, -97, 47, 119, -296, -53, 55, -55, 86, 15, 120, 148, 147, 65, 170]
2223A70k01l5J10PK21k49k82M14k39N4k2j45K02L1n1J45j43j48J03j35K80k91
2245b04J74Mk75K36p0K86l29J53k1K5j48r3N55m70P8K74j02j1q0J7Q2k68P6R1
2269b0L3J20j06o7l6J24J6l67J32J74K67j91j79J51j36NL48k63K46omj86q7J61
2293A29j83n2L33k91J07ql3j86L81l08J30j48Q8P8j37K38j9j22j79p8K34k67O6
2316b27J46L0j05N7J24M0Q7n00M39j79P4j20K5m4J22K66k89K04k46K2K3J60k53
2339a44K38k02P4M8J01M7q0j7R9k70l7P2k17K06k9L21n17L20P3j62j26J23K70
2362A91j02m8j98N80l71n0j10J18k61L02O8j15N2l05L33K1p0rj26r2M25k04o2
2385c3RJ7K63n27L45o7j47J35J98j32j91j4m9l6k2K23J01J01l15j22J75J88j66
$$ y = [170, -31, -66, 44, 51, 272, 23, -259, 155, -84, -30, -52, -197, 5, 36, -15, 130, -13, -161, -58, -193, 87, -204, -30, -26, -301, -65, -135, 151, -178, -25, -46, -21, -169, -262, 293, -177, -99, 175, 73, 62, -18, -1, 81, -187, -111, -20, 13, 133, 27, -40, -76, 48, 64, -303, -171, 3, 270, 79, -100, 51, -85, -80, 268, 5, 251, 245, 241, 55, -32, 129, -54, -106, 227, -64, 43, 35, 2, -184, 197, -111, 19, -129, -41, 37, -100, 138, 119, -3, -182, -260, -26, -293, -227, -81, -51, -156, -99, 25, 65, 152, -348, 91, -88, -14, -134, -109, -153, -31, 235, -54, 150, -96, -74, -51, 109, -144, 94, -108, -34, 14, 115, 162, 82, 65, 164, -106, -143, -71, -288, -82, -111, 210, -307, 13, 86, -76, -202, -79, 191, 89, 41, -157, 423, 52, 2, -108, 10, -251, 51, 119, 4, 56, -249, 84, 105, 35, 26, -100, -192, 233, 29, -33, -24, -7, 256, -271, 74, 7, -140, -5, 193, 61, -130, -144, -193, -229, -251, -28, 73, 174, -141, -263, -88, 100, -66]
2408f6O8J70j04k83K41J2k2n6P6m7J69k85K46k26J44M4J1J17k53L02k35k52J59
2431g0N4j85K20J97k47j4M3o3J5k34K39K54j92NL32l42L11l14ll4p5N20k89k08
2455h0J49k54J99L3j12J02J25k42K50j51k26L92k48j07L75k18J26j29RJ86k40
2476f1J59j38K66k95lL26k37q9j9N7J22j15M6J33j20m0l93N88j85k00Q7NJ21l8
2500b3KK54m19L45n4k58J30J10m99L97j56L0K04k61J1M05o6m1o0P7j88j38J41
2523e7J95k49J14K05k96O8Q5l09K02K46r4j21j21L30j84p1Q9q5j09J91k74M0L25
2546A20n18K67M6p8K90K3k09o4J10J68p5k17J42k1j87J26L8P3M3m4k7J8l24K56
2570d4r6O0R2P3j86K26j45q4J58J3j87J55L3Pk44M02p0k03m4K49j70L5J63m15
$$ y = [-66, 2, 172, 68, -215, 26, 38, 16, -40, 36, -11, 158, -127, 119, -107, 37, 81, 92, 209, -44, 258, 23, -229, -70, -16, -201, 19, 216, -31, -45, -2, -65, -50, -284, -45, 209, 17, 22, 354, 12, 323, 9, 6, -28, -103, 417, 128, -80, 69, -185, 14, 47, -65, 37, 162, -80, 170, 19, -207, 185, -63, -170, 205, -13, 113, -16, -7, 179, -61, 98, -40, 226, -69, -72, 254, 17, -72, -91, -34, 88, -27, 19, 152, 32, -8, -401, 187, 2, -198, -111, -106, 15, -23, -21, 233, -186, 159, 105, -153, -23, 87, -412, -15, -171, -141, 63, -198, -187, 218, 152, 111, 51, 128, -60, -198, -57, 138, -111, 3, 208, -88, -20, 65, -244, -42, 204, 110, -11, -132, 198, 14, -57, 32, -53, -162, 29, -245, -205, 120, -398, -131, -85, -163, 127, 150, -59, -123, -13, 155, 80, -137, 5, -16, -203, -77, -39, 34, 77, 33, 6, 24, -300, -44, -140, -80, 12, 85, -101, 125, -20, -104, 54, 67, -120, 35, 68, 75, -169, 233, 163, -40, -84, 165, -5, 30, 193, -222]
2594b22L39k89K26j00k53M02l04M95l77j99N74k65r5j9kR3j08NL21k50j05L8L3
2617f2J35K8r7J04k49m3J88j59m9K17K2J9j16J50j37K27j70K05l09O8J61k06J35
2640F2J30j82r2J48k27K63j08K33j56j12jJ69N2k95n4R3J56l20J53R1j20K77k42
2663h2J02k1M5j33J78k68K8K78O8m39J14J99j31R3J84k02O4j66J58K4M6k80K04
2686F3J26m67K15K27j90K40j95J2K74l53J5J9q1R1L0j25M66m74K28p0j7L2o4l4
2710c2L16m22K53n3j47P7L03l75M6o4N6L0j75L15j58L14j95L1nj34l05K01J51
2733B8K20j73J62k59M6J29k02K77k12j00O6j25MK28J1K53n20L15k0M6k46J44m2
2756C0j24R7K31k44J12n9K8j26J59l06R9j09J65K39k28n6M24k1l28j2J29n4l8
$$ y = [-222, 117, -172, 54, -46, -299, 103, -201, 294, -83, -282, 292, 27, -68, -87, -89, 4, -104, -99, 222, -28, -133, -95, -62, 73, 101, 4, 108, -141, -184, 4, -155, -204, 13, 35, 54, -62, 88, -49, 178, 8, 213, -96, -28, 133, -73, 62, 192, 10, -82, 66, -161, 102, -6, 227, 71, -41, -42, 127, 179, -116, -170, -77, 79, -241, -88, 3, -117, 160, -82, 20, -1, 44, -89, 89, -179, -151, 127, 195, -244, -130, 69, -62, 31, 215, 13, 77, -89, 69, 93, 139, -141, 63, 189, -278, -63, 164, -26, 214, 19, 31, 305, -48, -33, -14, -95, -4, 26, -99, 367, -107, 121, 51, 34, 66, 2, -32, 284, -138, 115, 62, -85, -8, 295, -80, -34, -98, -42, -12, -187, 128, -30, 284, 89, 120, 115, -19, -324, -123, 28, 248, 75, 237, -22, 24, 153, -49, 228, 16, -84, -18, -143, -139, 89, 100, 353, -167, 148, 128, 174, -72, 72, 30, -94, 3, 234, -10, 102, 43, 71, -55, 104, -202, -103, -212, -47, 192, -36, -92, 332, 311, -17, -29, 100, 46, 8]
2779Hq0LJ27J7j4j53J79k07K12r9J7n1Q3j08N4L5k35K48j4L9q9J26j34q2N75l23
2805A34l91J77J67j10K99k02j90q1K10j37K27J64j31k63K45j47j1j92o4M27n4
2826G7p1P1j12k13L58L5l6m20K41R5KRJ99j57J7P1m10L58j07j09J29NJ1M20l89
2851G4K9l15K64k76K70l9J66j86R9j87J43o0J01j99L39m9L6k55k08K87k12Q7R4
2874Cl2R2P6j68L9p8RQ0q5j06L75j41L4j88J64l72K36K24n4lk00q4O9J9J33j41
2900i9J66k60J8M02k61K27j34k06M29l07j75L02l24L02J5k91M41p3j08L1p0j33
2922a08R8j85J66R4o7o3J22j55K74r9P0l80R2L27Nm42J6K88j14M9lJ73j53j51
2946a46K05J58l32K9J09N5j95P1j04J27j38J11j0R9O9r6K60k08k32K50K5J38j98
$$ y = [8, -72, -69, 58, 75, 61, -92, 87, -120, 92, -7, 10, -41, 42, -66, -12, 23, -212, 36, 22, 61, -28, 98, -36, -118, 457, 134, -257, -80, 87, -23, 276, 74, -116, -197, 13, -124, 103, 267, 136, -127, 118, -29, -40, -232, -296, 131, 77, 6, 77, -35, -248, 110, 145, 109, -311, -70, 25, 27, 36, 235, 78, 95, 166, -244, 114, 7, -102, 27, 32, 43, 463, 74, 103, -212, 52, -224, 46, 7, 173, -13, 86, -101, 42, -18, 83, -116, 223, 174, 210, -45, -253, 34, -178, -91, 3, -29, 63, 139, -29, 10, -68, -59, 21, -64, -170, 205, 64, 98, -90, 74, -298, -62, 162, 108, 105, -95, -179, -110, -91, 42, -99, 67, -193, -175, 227, -34, 193, 59, -147, 282, -25, -200, 102, -222, 80, 95, -196, 245, 172, 64, 95, 25, -108, -10, -195, -29, 65, -2, -65, 57, -98, 176, 77, 147, -233, -141, 186, 191, -251, -235, 53, -61, -12, -15, 158, 5, -146, 59, 217, -115, -86, 23, 78, -117, -46, -150, -23, -161, -50, -60, 39, 108, 12, 272, 64, -168, 82, 107, 245, 47]
2969D7J23k28J75k89K78l07K00n6j65J52m3L71k58pj12J72J48k06J74j09K2j28
2991d6j40J35j09K65O8j70J26k11O1J43k09N5K60l21L30j91k30K51J14k34J57
3012A04m8J51j61j0J61j25K4p3LOK78l88k20L31j42j85R2K9K53j9j44O4k33P4
3036a78Q5N2J69k34O9J95k20N3r6N4r7L21l97RM35l25K32l38R6J52k44L63j99
3059d3Q9nj45J40m5k6J75l1K6l25K7K75m0l13R3j75R7N52k13j06m8r1J07N7o1
3084b9N2j80J84J32N1l25K46p5L7J64k6k52j4L05j64j06K31l53L53j50p7m6K26
3107A84k09L5K31l80m1Q3J75j41J06k04J81j02l8l6P4J28l2K15r6k39L44j89j61
3130a12K65l25Q7J00j05n9K96k04J11m1j10K19J27l09K31j96K02j68L08l16M6
$$ y = [47, 170, -58, 117, -172, 106, -201, -1, -57, -222, -70, -113, 258, 0, -7, -119, 53, 201, -5, 169, 60, 82, -46, -186, -51, -160, 105, 173, 3, 129, -82, -21, 122, -87, -32, 228, -93, 237, 46, -184, 67, 181, -53, 104, 56, 207, 46, 36, 197, 72, 96, 23, 26, 32, 310, -78, -298, 33, -109, -294, -202, -173, 80, 61, -83, -19, -252, -178, -93, -41, 128, -106, -37, 158, -62, -9, -105, -51, -148, 173, -224, -215, 220, -105, 127, -211, -115, 37, -207, 156, -43, 46, 41, -104, 36, -9, -35, 140, 109, 135, -190, -163, 112, 72, -241, -148, -323, -226, 326, 113, 7, -41, -132, -25, 32, -29, 23, -157, 27, 159, 210, -115, 131, 56, 93, 257, 231, -21, -35, 270, 106, 0, 231, -122, 231, 81, 4, -42, 184, -25, 10, 241, -139, -180, -97, 78, -63, 43, -161, 20, -82, -120, -156, -82, 46, 14, 229, 133, -106, 238, 49, -112, 153, -172, -85, 15, -90, -149, 147, -57, 54, 13, -97, 122, 249, -60, 171, -25, 177, 9, 317, 1, 47]
3151D7R3j72O2j1N3j95J1K9L72k34jkM9l63L14k0j00k21M08j87J30k58Q2K31k32
3176a15K40j91R3K4l1N7j38N2J13j02J22j46J54oj23j03J81r0n5J70Jj59P6j05
3200h1j19J75N4k86K94j77K69k15nM97l79o4k7n9L44j95J92m4R1j34J10j46r4
3223AJ34p9q0Ml83L24m6m2M32k36L2J68k99J38q6o5L21j19j8J09l92J99J22j27
3247A2J5o9O8%J94j08j8k23J85L46l04j91OK29j38k4j22K07J61m1k97N6K00k25
3271h1J56j90J21o0q3j27P7k02K22K36j96K77l40K74m9l9j45J75O6j19J03j68
3293i2M7l0J79J25r5j61J40j31J23q2j92L13k82J33N1k90R0J79oK3j09J65j46
3316d8O6M6k01k78M31J2p2K26j73K81P0l82k97J52j06N6L39j44Q3q6J22j05j70
$$ y = [47, 140, -32, 30, 19, 72, -123, -112, -83, 289, 55, 54, 52, 101, -262, 52, 32, -68, -289, 119, -68, 62, -196, -114, 117, -115, 125, -66, 27, 51, 20, 77, -61, -9, 104, 2, 124, -22, 132, 126, 3, -100, 81, -9, -64, 106, 107, -52, 24, -81, -200, -25, 29, -257, 37, -140, 129, -86, -91, 406, 27, -37, -64, -123, 221, 26, 218, 174, 265, 131, 241, 95, 1, 135, 56, -24, -20, -403, -79, -125, -167, 265, 29, 61, 229, -70, 68, -18, -83, 238, 119, 101, 210, -182, 17, 139, 12, 27, -42, 26, 26, 220, 112, 94, -129, 56, 402, 98, -93, -87, 142, 4, -20, -142, 65, 226, 185, -112, -56, 144, -81, 75, -115, 6, -54, -137, -264, -187, -389, -167, 69, -127, 150, -190, 84, 35, -4, -149, 26, 92, -27, 76, -92, -45, -75, 104, 229, 134, -27, 113, -18, 105, 23, -169, 144, -138, -5, 46, -244, -154, 25, 19, 42, -67, 98, -48, 18, 64, -137, -415, 16, 28, -44, 182, 9, 290, 360, -22, -319, -167, -273, -217, 122, -22, 61, -25, 97, -8, -178]
3339a78K36k51N1L95k41k59L15l6k21J14j04K65k89j08L00K4l4K82m73J73q7j77
3361c03N13l09J63O9l47N3J49J81l66N47k91o9o1r7q7L07J09m4k09M5J52O2k36
3384f9p1L38J2k80L12j84Q6J26l21Q1q4k40M16j78P9J10j65J32l05j5P9L68l75
3407a48L37l3m7J42j92J84l59N9L7J42k36L0k15N00r2k58P4l4j51L54n1k41K72
3430G4n1J44K4m06K79j49J42J62m1m6Q7k54r8K1O7K13k31j28K62k3k4R0j81J69
3454A02K4k59j12K34J18k49RK36k56k8K42k35K82L1j7j6K6m00K66K37l74K20r3
3477a2j74L48l04L23J3j90J65k28J1J16m0K22k22l5j95Q2J39L9k21J11J2J26j5
3500G1O7k24m5J31J12L0j80j60O7Q0J86J8n7r7j91K46m1p0J48k03O0m4p5L93k97
$$ y = [-178, 58, -193, -142, 253, 12, -247, 68, 32, -189, -75, -179, 86, -203, -311, -11, 13, -21, 261, -212, -39, -126, -303, 210, -99, 64, 133, -214, -161, -12, 169, -197, 350, 59, -10, -71, -168, -255, 52, 161, 117, -92, -47, 105, 167, -69, -140, 198, 210, -70, 242, 58, 144, 270, -51, 30, -54, -294, 122, -56, 23, 133, -32, 100, -205, -220, -141, 227, -148, 189, 156, 109, 251, 59, 243, -116, -57, -20, 122, -114, -84, -299, 201, 109, -149, -75, -109, -260, 94, 43, -198, 74, 23, 167, 191, -215, 64, -85, 57, 219, 178, 132, 219, -35, -133, -112, -45, 168, -63, -191, 71, 48, 24, 114, -67, 102, 126, -133, -245, -11, 107, -142, -133, 103, -153, -181, 61, -174, 108, 139, 122, 106, 132, -268, -2, 235, -139, 81, -12, -186, 162, -142, 181, 194, 4, 169, -59, -48, 68, 28, 250, 28, -7, -202, -120, 19, 58, -163, -52, -40, 86, 71, 138, -86, -131, 0, 112, 142, -38, -198, -131, -51, 135, 153, 96, -1, -192, 54, 13, -57, 91, -112, -52, -96, -171, 222, -75]
3525g5J45lk07J19L2n7L15k73j23O1j86K79lO8jk17JK16j67j92N36k17K5N4k18
3550h8K01j8k26J62M4p2K90j38j90l6Mr9L99l70n7J21J40K12l78J29J26p5K46
3573C27q9k62J08n2o5O6o3o7K22j29J0O3j75J15p0j99L12n3J8J60j19j76j97m0
3597c55O75m85K05k44P2O8M6J25j2j47P4j18N9J21N6m06L61l24K26P9k5J23k17
3620d3j02PK53j87R1j65K11r5l8j21K94j54N7p5K32l57J83N3Kk8J51j79K5K9j35
3645i1mK73j83q7J30L32n01J07p2L79m12p3K68k25K31j62K52j46Q0k07M6K15k54
3668a04L95k49J13p2q7k16K98n1N7j14j13K55m61N11k56J73j37M7j61P0J27r2
3690f7rO2K3J31o7l56J28J38N6j89L22l60O7NK81j20jj75K37K13l94J70k03j39
$$ y = [-75, 70, 67, -140, -21, 11, -46, 269, -4, -127, -66, -252, 27, 24, 92, 91, -126, -125, 91, -76, -268, 268, 51, 76, 130, -88, 113, 95, -131, 31, 75, 3, 293, 155, -35, -71, -67, -166, 233, -137, -194, -73, 67, 279, -99, 30, 156, 81, 327, 238, -24, 84, 32, -33, 33, -30, -97, 125, -4, 6, 69, -106, 9, -61, -260, 52, -1, 17, 177, 58, -118, -315, -355, 320, -165, 40, -204, -132, -64, -18, 107, 95, -52, 22, -96, -37, 84, 140, -266, 95, -229, -3, 76, 51, 174, -43, -145, -138, 115, -72, 19, -146, 65, -30, -68, -189, 105, -49, 8, -67, 165, -192, -9, 44, 46, 18, 169, -10, 15, 44, -91, -95, 178, -5, -92, 38, 370, -131, -24, -96, 283, -129, -202, 66, -159, 72, -90, 162, 16, 96, -111, -65, 150, -104, 291, 42, 155, 83, -4, -220, 78, 27, 84, -30, -143, 112, -349, 162, -94, 79, -58, -11, -172, -102, 25, -67, -76, -14, 9, 140, 73, -283, -155, -17, 39, -150, 172, -188, -121, -116, 165, 45, 44, -131, 106, 319, -75, 95, -108, -247]
3714b47L39j78J90K2m14M16K6o7J3p5j06K88k71r7j30K68K60m53k8M66k38J3Q9
3737H6l02K85j30Q7J0l4J79k68L2L5Q6n5K0J9Q8l68J92Q3P3j34j24J49qJ2J08
3762A21j22j29L4J74nj13J63m8Q4j77j24Q5P2J31k89J30q4M4K48p6k44Q9K16M9
3786B29J3k54J00j83J70m7%l05L86J34l68J78j92J12J34j23J39j14J09l60L59
3807A17N4j85Q1j09K3j90P1N2k8l7K27l3k62K61j23J85j05J18j57m3Q7m2J39r8
3831Cr0K23j39K7l28M43k57J50o5J15J40j63Rp6J19n5M7mj73Nj03K42Q2j98J80
3856A34j85K9m2J52j20L2k6km0L4P3r8J63M7l97K32P2l45Q1N2J24O5m4oRl8l4
3883g8M5R0o6n0J74L1j33n5j03K53q1K0k4j48j28N0M13m80K03J06q8Ql9O9K39
$$ y = [-247, 92, -86, 104, 126, -288, 128, 154, 87, 100, 25, -81, 207, -64, -161, -291, -23, 237, -216, -244, 222, -16, -3, 86, -216, 69, -61, 26, 36, 2, 181, -87, -55, -20, 66, 11, 31, 50, 138, -230, -38, 45, 118, -16, -140, 9, 1, 13, 121, -1, -130, -96, 78, 73, -40, 123, 75, 159, -18, -142, -57, 15, 146, -143, -13, -97, -53, 195, 119, -125, -36, 180, 229, 242, -12, 88, -95, 75, 28, 28, -277, 109, 243, -125, 53, -139, -27, 107, -16, 123, 9, 118, -242, 117, 171, -14, 67, -42, -19, -209, -138, -86, -114, -151, 76, 43, -219, 42, -81, 104, -1, 117, -40, -83, 4, -38, 101, 3, -87, 136, -3, 24, -304, 139, -118, 32, -33, 82, 222, 59, 68, -8, 111, 56, 103, 99, -74, -69, -172, 70, 152, -46, 134, -51, -22, -64, 88, -32, 0, -26, -28, -68, -34, 39, -59, 104, 151, -246, -14, 58, -287, -206, -154, -30, 35, -9, -15, -6, -44, -78, -33, 57, -9, -59, 115, 146, 13, -42, -145, 108, 27, 47, 23, -125, -253, -203, 210, -270, -67, 39, -49, -41, -80, -11, 228]
3908B28k18k80K49P0j44J20k59Q8J41R5p9J1%%J03n3j0k4j10K25j77P1M4oJ4k40
3934a41K30J6n1P7q0j84P5J18j26J67l5J74l88K46J10l92N06k36p6k66J06J69
3956A9k5p5O7j10J48K3j13N8q8K8O9j85J10%r5K42j4l11M19k58O9K38l31J26j44
3981a33M9J26p0mJK9K62l51l57N89k47K24j46j31J34p9J39K19k72j12K86k39N2
4004c1J03k2O0j34j9J23j89K52j58qL4j43j27L2P3J03J58j80M2J58l88M22k21
4027f0K79j96k73L68kKp0Q7j55k5p6PJ45j91J82J40l26Q2L98l16K26j67j19K1
4051c9J79j64R9l7n4J27k17L63m29J81J62k01J1q3L32q6k68R4k4o9J42K73m15
4074a23J16J30j94J82l03L05m24L08kJ22j69K10Kk06J4jO9K16l31R7K01j45N8
$$ y = [228, 10, -270, -21, 49, -95, 25, -234, -146, -5, 90, 11, 22, 22, 22, 125, 72, 62, 38, -72, 153, -24, 47, 91, 85, 99, -141, 89, 105, 54, 131, 51, -133, -58, 60, -66, 101, 66, 240, -148, 98, 208, -184, 322, 86, 10, -256, -150, 19, -6, -81, -14, -124, 24, 47, -66, -8, -96, -68, 1, -184, -74, -74, -169, 73, 59, -252, 167, -91, -22, 216, -115, 11, -133, -84, 42, -28, -32, -31, -2, 260, -91, -448, 141, -106, 118, -28, -159, -25, -104, 35, 254, -18, -130, 156, -83, -31, 72, 50, 110, -24, -43, 80, -109, 143, -15, -23, 11, -132, -259, -227, -154, -51, 107, -73, -31, 127, -261, 161, -60, 219, 23, -250, 118, 116, 118, 48, 135, -20, -45, -121, -114, 31, -160, 22, 162, -164, -82, 316, 0, 226, 59, -60, -39, 140, -24, 75, 38, -16, 111, -106, 257, -172, 9, 171, -30, -19, -102, 230, 144, -124, -30, -54, -123, 19, 292, -123, -7, 123, -71, 111, -192, 113, -311, -3, -5, 117, -52, 158, 160, -46, -32, -33, 36, 252, -79, 18, 219, 74, 132]
4097A32o1J38o5r7K19l24k61N29j14r0j59J95k02J87j9n5k5j2K9j8j56L8P7O7
4121d7K46l38j3L1J39J5K9l54K75L08m16K55L2j24j1J02l76M4K73M6j3n5j20k1
4145i3J87l22K35J64l23J02Q2Op9K3N0O8j58J2M4pk5J5O9q4r3k6K75j04P5J74
4171B67l60J45J20k05M5Rj38J78K3j1O5m7K2j25j03m3K46j29J54k29M16p5k94
4194f9R4o8j22L86j40L7l05L7J56m4K8j36J56j09J28J78k48o6K56k7o3k04Q8m0
4218i7M31j37k31O8P9l4k65PK16l6l1R1J5K5K10l53K28L2P6l00P0j84K70j04K50
4243B96l24j15K89j34N1M6j15J83k43R1j39J33J09o9j71J59J71l76j11L40r3m6
4265f8KP4j38Q5k4RK00r5q2J81nqk40jR1J49r3m5j0K5k16L19M3r0k8k84K07K87
$$ y = [132, 71, 209, 144, 47, 266, -58, -319, 210, 96, 6, -153, 42, -160, 27, 8, -47, -72, -84, -55, -73, -229, -191, -114, -47, 199, -139, -152, -121, 18, 33, 62, -292, -17, 291, -125, 130, 162, 38, 27, 129, -247, -203, 70, 116, 103, 48, -72, -93, 94, -228, 7, 171, -152, -50, 32, 38, -41, -18, 32, 100, -58, -46, -2, -9, -34, -19, 50, -34, -127, -153, 122, 18, 93, 267, -93, 52, 172, -33, 12, 21, -117, 61, 84, 73, 138, 91, 113, -12, -115, -158, 88, -41, 113, -116, 300, 225, -69, 25, -43, -165, 221, 81, 118, -187, -150, 6, -38, -10, -146, 10, -99, 29, 207, -41, -107, 149, 122, 59, -145, -57, -97, 334, 197, -34, 34, 113, 79, -186, -179, 37, 1, -30, 61, 76, 101, 311, -42, 186, 218, 294, -6, 64, -120, 150, 46, 296, -28, -143, 146, 12, 63, 109, -6, 177, -66, 25, -114, 19, 128, 59, -112, 47, 218, -158, -269, 71, -22, -68, -66, 8, -130, -45, -69, -60, 140, 45, -37, 144, 139, 131, -109, -110, -19, 130, 37, -8, -18, 7, -209, 110, 153, 63, 35, -249, -42, 245]
4293B45k70N6Q9k04Q5k49J87P6J38j83J1j3m0j18L4M57j94O9J3k00j27J71j88
4316a55K37j19m9J23j32r3P8J28J45p4O6l64j00M61l39q1L09j92MK77l16K42J3
4339F9j03J59j60k7j03J01k6J28j44Q4M3J51j88j16J29J07Q6k41K6J24J36j2k22
4362Arnn1r4j42M31o06O02k55K87M0j15j59R8R4k66J86r0L6K74j00j59j2o3O2
4387a5j05n6J31K6o5j00K49k9Q0k21P8K60j06p4m5l6J19J05j82J21j39J00j36
4410d0q9K50P8k96Q7o2K08q5R0j33j40K9l1j86M75o3k18J9r1J03M36m49L80j98
4434G4j73J7j00J40k9J47j43K44k26J30N4p8lQ9l08L29m60J67J77j01J17k17L38
4457A85J5m29L14j57N5J4J27j67J43k01j3P4K14m20L22M1j32K47k69j56K7k3L36
$$ y = [245, -25, 31, 120, -84, 1, -248, -61, 15, 153, -30, -19, -32, -72, -190, -156, 301, 107, 176, 189, -11, -138, 33, -155, 82, -37, -86, 37, -95, -188, -110, 18, 163, 89, 155, -209, -309, 152, -187, -268, 41, -151, -147, 130, -186, 56, 69, -34, 125, -35, -62, -165, -64, -90, 38, -106, -22, 21, 172, -16, -132, -3, 104, 190, -51, -25, 99, 235, 223, 1, -8, -13, -64, -158, -300, 131, -475, 127, -128, 159, 199, 84, -75, 23, 117, -149, 37, -53, -17, 257, 157, -2, -14, -77, -15, -120, -176, -45, -19, -84, -184, 65, 36, 116, -105, -27, 233, 127, 53, 8, -28, 91, 196, 14, 135, -4, 96, -40, -129, 121, 199, -97, -10, -72, 136, 51, 141, 8, -132, -103, -134, -320, 155, 92, -126, -107, -198, -95, 341, -108, 272, 74, -99, -82, -182, -42, -71, 76, -67, 177, -49, 81, 135, 57, 54, 143, -165, 164, -296, -129, 48, -53, 64, -153, 185, 200, -229, 85, -72, -17, -3, 124, -43, 100, -101, -114, -40, 174, -246, 76, 117, -15, 232, -37, -193, -166, -189, 147]
4480A47L9l6M5k52K05l23j7J46l2L3Lj00K07L1k77J86k65L30k41J26J05o2J0J61
4504A69k12j00M4L15k22j43K22L2j24m6O9j23J87l27K72J17r7J04K7j11q2O4O6
4527A01J7J25j06qk01N4L9lj76l9M17l7L7n46J32J53J33J62r2j18RJ5j68J57l0
4552B7l36K17J41O3l59N23l03K4J8n5qR3N2l9K99n25O2L2J58M5k84M14k89j2J15
4577G3m4J77j27j45K21L5oj63j89J25M9J02j59J85j08l77L36j71L81k68j01JK46
4600G3j67J4J08k09J28P6K00j89L8K73m25PP9j7J3q1J73k85J03J02J91n20K01
4623a14K25j51J13k29K81j38R2p9P4k00K35j31j45L42k65M3R4r7R6K8k58M37k94
4646d1r3L33j42j60J87M5o7Kk4J6j33J07Pj86J80n5r4J36j12m4K1K4K32k36J87
$$ y = [147, 186, 150, 195, -57, 148, -175, -192, -46, -78, -45, -42, -142, 65, 96, -181, 5, -260, 70, -171, -45, 60, -2, 8, 169, -43, -143, -99, 216, -6, -149, 73, 105, -19, -65, 4, -119, 68, -259, 13, 130, 33, 137, 164, 53, -29, 35, 101, 118, 243, 137, 129, -72, -18, 21, 18, -158, -197, 220, 183, 220, -326, -194, -41, 92, 254, 162, 44, 53, 68, -100, 57, 27, -309, -92, 49, 112, -247, 276, -27, -3, 15, -40, -48, 45, 97, 58, 357, -168, -106, -74, 84, 129, -155, 259, -30, -42, 73, 29, 206, 79, -66, 155, 190, 184, 21, -168, -43, 6, 108, -51, 134, 26, -351, -15, -186, 195, -73, -174, -173, 73, -94, -80, 28, -181, -53, 23, 223, 34, 72, 345, -80, -73, 6, -11, 2, -79, 94, -191, -88, 14, 205, -315, -114, 111, -40, 73, -156, 125, -13, 79, 0, 74, -126, 109, -22, -167, 175, -90, -47, 47, -50, 46, 74, -184, 253, -41, -134, 199, 57, -103, 84, 129, 62, 64, 40, 56, -77, 30, 37, -149, 31, -24, -118, 18, -94, -138, -117, -93, 139, -97, 90]
4671I0o3j6k06K25j55J54L8O4k4j98P2J36n2k47k4J97o3m9J6J59L2J73j43j48
4695c2J36q0j34K34J67m07j0J85j10m0J32k22J69n9K46p4%l10J39m2L75k91j15
4718a43K61j24L2l9m7J63k21J97k4n0k7O8LJ3l09K98q6k57K30L02j82J13m22K18
4742c3N5M2l49K09J49j79K43J29j69j44K0R2m75M89j28L9K23k62K16r7j88n1l
4765a72J62l0J09l14L21Q4J9j87o0P1M2k7m6J45j46O4n8J43o2j65J39J57j91L28
4789C26k38m7n4L0Q8p2Q3j48K7l9K26j09j39J56k9j04j29L77k25n7K86M4j61p4
4813A8j01j20L75j49j4J8o7M2J38p8pq3J75l7Pl37K16r5K45j91K23j20k12K99
4837A45k00j53L43j72O9K60j48j29j08J23K49k65L9N3j8k23M35k37j66Q2j27K04
$$ y = [90, 27, 11, -195, 30, -125, 29, 67, 131, 107, -91, -19, 117, 65, -182, -206, -9, -72, -121, -105, 54, 86, 259, 116, -32, 104, 24, -110, 124, 291, -116, -126, 59, -51, -91, 41, -181, -12, -71, 175, 101, 101, -209, -70, -112, 263, -28, -143, 118, -6, 26, -13, -60, 103, -118, 79, 55, 5, -22, 46, 49, 62, -247, 51, -35, -292, -62, 240, 58, 171, -251, -33, 22, 64, -285, -76, 73, -106, 137, 266, 97, -47, -27, 65, -410, 79, -49, -10, 213, -49, 167, 70, -118, -169, -172, -10, -40, 69, -245, 76, 160, 179, -8, -68, 3, 45, 18, -28, 117, -29, 35, -23, 120, 58, -107, 32, 189, -2, 326, 88, 41, -13, 17, 105, 33, 116, -32, -5, -44, 182, 73, -66, 90, 61, -43, -172, 205, -20, -77, 209, 253, 92, 18, -83, -203, 172, 23, 9, 27, -40, 2, 140, 62, 55, -28, 147, 110, 117, -220, -4, -99, 146, -45, 178, 58, -154, 145, -55, -208, 135, -37, 32, 292, 144, 15, -93, 30, 279, 14, 53, 106, 88, -135, 300, 63, -103, -21, -148, 56]
4859E6j29K6K3J08J07j34p3K11j71j54J09n4l6J31L3N7j41o4L19k20R2R2k31j49
4883a92L36k00K6J28k55M5K27k16K42j8j20pmL9R3J9r7O2j44J47j76K4j90J87
4907d4j80K38L06j77K2p0j72J57k40J46j5n4K04j1k21J07QK5j6J4K6n1J20J1N
4932A38N3j95K82k90J00j09J53j17J49j88r8Q2J08J45n4r8j92J30Nl3j02K40j26
4955a7q7R9M6j14P3r7j27R9J67j89k52M08k42M3L13q0O8q7m3M3J4P3j44j48J81
4980@M4Q4j08k07M79k53J21k5l71M33l02J45j24J22rk49L43j25j72M66l28J12
5002G6K55n38M59k85r3K47q7L3j36k13M18q5O9j52j68J50N6k3K35J14l80R0l3
5025IR4J25j53J06k50R2m2j15P4m7J54J56k68r9J76N9k76M7L16j95k8r9L8n5J73
$$ y = [56, -73, -47, -24, 84, 191, 57, -16, 195, 24, -130, -21, -75, -111, 20, 53, 110, -31, -95, 224, 4, 96, 188, -43, -192, 144, -56, -30, 98, -157, -112, 115, -101, 141, 123, 3, -4, -8, 31, 124, 143, 46, 108, -36, 111, -65, -41, -231, -44, -224, 14, 320, 143, 165, 95, -77, 80, -160, -14, -29, -83, 121, 110, -111, -4, 4, 29, 13, 27, 53, 2, 122, 133, 138, 191, -4, 278, -12, 88, -21, 132, 15, 164, -24, -122, -40, 68, 213, 159, 61, -131, -1, 4, -29, -131, 109, -17, -104, -5, 41, -73, 0, -97, -224, -125, 42, -147, -399, 9, -233, -190, 123, 43, 111, 24, -19, 24, 38, 111, -33, -181, 0, 44, 128, 20, -187, 292, 39, 160, 135, -236, 197, -105, 40, -84, 38, 29, -220, 123, -2, -174, 292, -36, 76, 331, -207, 252, -33, -126, 121, 34, 67, -69, -282, 136, 51, 120, -32, -200, -50, 6, -17, 218, 332, -48, 42, 9, 103, 228, 75, 181, -69, 23, -19, -134, -60, -107, 47, 203, -65, -164, 12, 71, -205, -158, 158, -37, -65, -164, -126, -181, -8]
5050hJ05j6j4j30J13j11P2O6j83L60k61o7L10m39L13Q5j59k9k70M22j61j15r2
5073b09k6L83r6j3m1R9R7j75j09n1K24j75R3J42k6o2K5l36K72j3j90J99j95j05
5097b88M32L9r1N2n0K50l88L1j17K60m86M14p7K53k58O2j21k15J86J8J45P4j98
5120g3R5N1Q8j06l4o8K4J15q6p6O9k9j0K15m05M70l19J31k4j21j70K03j07J30
5144c7PJ4Q4j23o8L73j45k05J12R9j53J80j49j87K41J12n2nP5j45k52L14k08N2
5168f6J86j32P8j66K50Joj69K09k96J07J98k15J0o1K53j49j1J61n5k34n2L89k49
5192a9r3L17m80J89M2J19O1p9j91J96j43n8K72l5k2o9kJ31n7k81J59J38j53n6
5216a14k9Q9J20M1j50J7J99k38Np9N2k9J70j50K30k46J12Mj85K81k34l3J07L4
$$ y = [-8, 97, 81, 67, -63, 50, -61, 11, 77, -106, 254, -7, -74, 236, -203, 110, 195, 36, 7, -263, 159, -2, -117, -209, -235, 148, 52, 39, -2, 97, 194, 19, -90, -141, 83, -92, 1, 143, 117, 55, 80, -256, 16, 3, -187, 12, -183, -288, 144, 183, 92, 144, 94, 344, -44, -13, -130, 130, -356, 58, -19, 234, -24, 38, -83, -298, -112, -94, 51, 125, -73, 22, 73, 161, 55, 21, -47, -23, 92, 6, -70, -1, -30, -40, 175, -230, 240, -79, 52, 28, -93, -263, -60, -167, -37, -30, -16, 68, -55, -123, 250, 105, -100, 12, 111, -42, 138, -11, -198, 43, 155, 103, 98, 173, 28, -224, 90, -118, -66, 120, -12, 66, -100, 150, 151, 145, -24, 185, -111, -4, 194, -21, -11, -72, 181, 32, 21, 182, 127, -107, -159, 230, -19, -112, 205, -275, -86, -44, 75, 136, 57, -134, 62, -81, -139, 133, 98, 76, 7, 5, 136, 79, -202, -43, 95, -58, -114, -143, -54, 66, 107, -43, -26, 173, -65, -60, -139, -87, -116, 54, -96, 134, -112, 0, 4, -181, 100, -134, -167, -60, -26]
5240b6J88k98J05P3L9j35P0J03j45j86K9J46k74K65k7j4oQ3j79K89J0k6j66J59
5264G7l5k9k1m9J35j8J9j05Qo3J30l5j15J26J00k1M3m19K25J35l7p2j64J24J18
5289E7j1p2Q5l17M55k84N3o9J30j38J90K40k37p3J80k47J67J5k65J57k19K99j59
5312f3Q1J45n4j61Rj09J16L2L49j73j5j39j53K5M1P6j8J09R5r7P6l78K63j89j0
5337a42j03K71rJ08O5j78M4l53L14q1j30K22J40kn4k49lK11p3n9q5K40q8J29q3
5362E2p2kK54j70j59j06L06j34J86r4k04J39M9o1O3K7j51J06o0%n9K97l27J75
5386E5k48R5R2L30k32k72R7R0N4j26J99j26J36j38P7j75j08lK10J26j77O3K55
5409B74j73l21M36k26j4R5j01n0J03k5lN9k28o9M59l15K23k30Q8j91O6m2J17Q3
$$ y = [-26, 162, -136, -31, 42, 81, -54, 16, 119, -26, -212, -183, -37, -311, -46, -73, -87, -93, -10, -189, 100, 110, 84, -82, 77, 42, 13, -8, -57, 78, 60, 79, -26, -18, -81, 49, 14, -101, 25, 125, 104, 147, -272, -47, 88, 51, -21, -185, -61, 57, 46, -26, 59, -258, 197, -87, -34, -103, 27, -111, 79, 319, 82, 9, 189, -58, 109, 124, -141, 16, -203, 96, -63, 18, 163, 109, -52, -43, -152, -36, -4, 345, 172, 157, 18, -135, -110, -69, 7, -11, 98, 193, 96, 172, -206, 57, -132, -142, -245, 26, 17, 125, 190, 12, 56, -297, 17, -64, -194, 28, 168, 166, 112, -137, -140, 71, -2, -61, -146, 94, 6, 135, 52, -20, -22, 232, 62, -97, -203, 103, -31, 155, 61, -143, -4, 45, -16, 47, 74, -77, 29, -31, -31, -90, 207, -120, 55, -193, -98, -6, 324, 92, -180, -83, 7, 61, -65, 134, 8, 144, 6, 83, -92, -200, -203, 7, 133, -44, 19, 274, 101, -220, 216, -10, -24, 71, -30, -80, 23, -2, -5, 54, -174, -243, 216, -99, 124, -106, -18, -209, -143, -185, -68, 15]
5433A5O6q1J38q9r5J2K25j11N3l06J86J27j03QO1j63n7L61m82L20m4l30L12l47
5457c24J43K86k55L84j81Mm1l0K0k75J25j32q4K87J4J39p9n9J2N5j6p9J56j41
5481g1J2k28M05l20K49O2j47N8j97K46rJ6J86k15j58K2O2J68k10J91j50q5N27
5504D14m68K5J12k01Q8J67k30P3o7j6M8L9J19j34O8j8K59l73J22k9J18j88n3K27
5528A02l20K68o8P4j11rL9n3J54j68qN4j74J92K00j32r5Q2j43l7J03J9O7q1pn0
5554a02L2p2mJ22J19L6j04j68J77M2j09k75M66k39K7p2K68j54J13j44Q0k9M8j46
5578h8k1l4J77R6q6j0Q2o9l07K00l3k2N8N0k05L34j0j0k22K23k80KK34O5P4r1
5604A07k17n8J27m1K65K20l90L00k70O4L7r7jO1j48L7r5K29k12K25o6o8K20l85
$$ y = [15, 81, 0, 138, 49, -46, -34, 191, 80, 133, -173, 13, 140, 37, 45, 106, -57, -114, 247, -235, 85, 41, -289, 23, -324, -181, 105, -150, 234, 53, 57, 16, -14, 6, -269, -144, -276, -360, -73, -59, 80, 1, -58, -46, 9, -7, -86, 70, -71, -59, -287, 118, -202, 47, 109, -38, 20, -177, 69, 60, 76, 262, 47, -111, -89, -27, 141, -69, 122, -28, -113, 414, -54, -29, 83, -118, -30, 137, -93, -20, -87, -103, -55, -16, 103, -31, 37, 19, 278, -95, 27, -2, 116, -72, -125, 102, -218, 50, -18, 56, -55, -64, -25, -78, 76, -92, -100, -46, -220, -28, 172, 40, -55, 27, -116, -153, -50, -31, 36, -45, -52, -102, -70, -142, -146, -24, 95, 131, 27, -141, 36, 78, -31, -306, 160, -79, -52, -124, 144, -10, 103, -41, 39, 10, 58, -88, -109, -143, 34, 130, 44, 34, 116, 47, -260, -60, -93, -115, -57, -7, -212, 122, 112, 102, -120, 103, -177, -175, 59, 124, 198, 107, -110, -168, -41, -82, 183, 403, 13, 313, 43, 107, 144, 47, 46, 107, -41, -4, -99, 130, -82, 143, 77, 9, 229, -156]
5628a56K25j24J25N5j05l8j43J77j05N4kJ8L00k90M4J64p1k02J30k36P5L7J60
5651I2j87J54lj80J36M7J03j74J28l7J39k72n8R9J22r6j54K23j04J16k3k05J39
5674EP7rj36O6n7J18J28j74O4J11n5o6r3KJ70k58K93P3j54k04M05k02n4J55j72
5699C3K9J18q2j43K4Qk87K22J73l76J58L19k24J94l1q8n6Jo6l7R8J42K35n27J57
5724fq0K67k80L39n34L07r8J35J98m61M14k75O8J00k41J83lq5M1K3k9N5Q7k1Q9
5749A93k20p5J47K4o4j67J90o4J06Q2k19j27J23K44k81K82l33P0P5j05J61J55
5771A97k89L6RJ72k6o9nk23N6N58l53J49k15L4j11J24R3j01j17J13p6J96L8m47
5795b57P0J96O0j91M9k8J85k07Q0l0Q1q1m5J90j08M7j02J03Nk34K52M9j08q8K32
$$ y = [-156, 69, -55, 70, 125, 20, -18, -161, 16, -89, -35, -37, -19, 281, -9, 35, 199, 128, -74, 56, -180, -105, -68, 92, -95, 59, 56, -124, 12, 59, 162, -12, 116, 79, 218, -54, -112, -13, 109, 13, -141, 82, -22, 94, 71, -134, 5, 82, 73, -63, 3, -54, 64, 192, 18, 82, 193, 138, 72, -21, -19, 151, -107, 186, 259, 105, -99, 306, 104, 50, 205, 33, 62, 180, 98, -45, -21, -13, -300, -78, 95, -281, -123, 196, -28, 166, 135, 47, -9, -8, -74, -111, -13, 129, 364, -163, -6, -86, 181, -99, 240, -294, 13, -85, 50, 248, -213, 201, -74, -6, 94, -147, 36, 33, -52, -11, 12, -17, 38, 125, 104, 193, -27, -102, 45, 69, 5, -162, 28, -36, 70, 152, -67, -194, -71, 173, -108, 174, -159, -89, -14, -119, 42, 197, -92, -56, -47, 125, 99, 30, 25, -198, -142, 416, 63, 212, -3, 31, -80, 44, 137, 36, -81, 32, -44, 152, 190, -257, -187, 9, 69, -122, -73, -101, 84, -123, -43, -73, 8, -73, -118, 72, -36, 11, -91, 12, 17, -217, 35, 84, -24, -112, 120]
5820A20n63L96K70k50J26j28r2Q5J3J34p8Jj18P5n6j08M6j62L62p3K2L6jj95Q3
5845e5K66m63L12M5p7j46p4J98Nl7K49j88Rj95L38j37l7P1j16N9m4Q0j2l0nrl4
5872b7j85K82k89M33o6m29M68m32n5M62q0J13j05%l8J0N1K63o22K56J30L5J5k39
5896d9J83Q9k75J06j8m8R5k56J75j49J92M3j95J75k08J81k97M06o3r5J01k14j41
5919b62K96j49J69l3j8M0K2qk28J82K2j79K74j68o0J01J36k75L34j99k9L9l5J10
5943H2k6k8j38K46k88K24rk4Lj26MN1j00L16M2ml63L38k44q0R1j67K39j16M0L16
5969B79o00N09j84j04q5K14k20J02K61m23L39J4j50K26j57k06j49K69n6J67o5
5990a9JJ13J09j72m38M07K5J13l8j99O6J76m5j55M6N7J57j64j15MK39k92Kj12
$$ y = [120, -443, -47, 223, -27, 99, -29, -121, -36, -23, 111, 33, 34, -84, -9, -65, -173, -127, -289, 73, 0, 22, 58, 57, -138, -55, 211, -252, 60, 105, 28, -118, -192, 6, 11, -26, 223, 35, 44, -151, 187, 50, 13, 84, -32, 27, -17, 63, 51, 21, 16, 7, -27, -212, 70, -219, 214, 148, -281, 187, -245, -300, 162, 82, 195, 90, 90, 52, 62, 113, 376, -246, 10, 140, 175, 190, -49, 134, 223, -52, 54, 36, -12, 83, -173, 2, -147, 45, 88, -107, 68, -140, 41, -256, 150, 87, -8, 93, -121, -262, 34, -115, 54, 21, 3, 43, 65, 57, -171, 11, 33, -146, 128, -40, -100, 1, 137, -138, 196, -3, -32, 7, -28, 82, 56, 28, -110, 136, -152, 72, 63, 39, 42, -84, -80, -29, -129, 187, 229, 225, -138, 200, -44, -124, -33, -200, 39, -77, -37, 279, -321, 188, 4, -100, -185, 29, -191, -89, 172, -251, 88, 102, -48, 178, 21, -185, -334, -65, -121, 46, -19, -18, 95, 204, 32, -406, 1, 26, 139, 101, -98, -32, 144, 99, -56, -10, 47, 204, 40, -75, -71, 168, -124, -122, -234]
$$ [...]
8191G2
##END NTUPLES=NMR FID
##END=
