##TITLE=1H_Pr 37-Q
 CDCl3
 8 sc, 
 27.06.2022
##JCAMPDX= 6.0         $$ Bruker NMR JCAMP-DX V2.0
##DATA TYPE= NMR FID
##DATA CLASS= NTUPLES
##ORIGIN= UXNMR, Bruker Analytische Messtechnik GmbH
##OWNER= root
$$ XWIN-NMR		Version 3.5
$$ Mon Jun 27 14:09:43 2022 Russian Standard Time (UT+4h)  she@DPX200
##.OBSERVE FREQUENCY= 200.13135
##.OBSERVE NUCLEUS= ^1H
##.DELAY= (6, 6)
##.ACQUISITION MODE= SIMULTANEOUS
##.ACQUISITION SCHEME= undefined
##.AVERAGES= 8
##.DIGITISER RES= 18
##SPECTROMETER/DATA SYSTEM= spect
##.PULSE SEQUENCE= zg30
##.SOLVENT NAME= CDCl3
##.SHIFT REFERENCE= (INTERNAL, CDCl3, 0, 15.7039)
##AUDIT TRAIL= $$ (NUMBER, WHEN, WHO, WHERE, WHAT)
$$ ##TITLE= Audit trail, XWIN-NMR		Version 3.5
$$ ##JCAMPDX= 5.01
$$ ##ORIGIN= Bruker BioSpin GmbH
$$ ##OWNER= she
$$ F:/spectra/data/she/nmr/H-F/1/audita.txt
$$ ##AUDIT TRAIL=  $$ (NUMBER, WHEN, WHO, WHERE, WHAT)
(   1,<2022-06-27 14:08:37.70 +0400>,<she>,<DPX200>,
      <created by zg, POWCHK disabled, PULCHK disabled
       configuration hash MD5:
       00 E9 B6 7A A2 85 ED C7 34 08 36 98 17 FE 4E 26
       data hash MD5: 16K
       FD 71 41 43 41 32 21 2E 0D EF EB FB BE 17 77 F7>)
$$ ##END=
$$ 
$$ hash MD5
$$ F8 21 2D 11 92 D2 4E 99 0D A1 74 AD 5F 27 4C D6
##$RELAX= 
##$RELAX= 
##$RELAX= 
##$RELAX= 
##$RELAX= 
##$RELAX= 
$$ Bruker specific parameters
$$ --------------------------
##$DU= <F:/spectra>
##$EXPNO= 1
##$NAME= <H-F>
##$PROCNO= 1
##$TYPE= <nmr>
##$USER= <she>
##$AMP= (0..31)
100 100 100 100 100 100 100 100 100 100 100 100 100 100 100 100 100 100 
100 100 100 100 100 100 100 100 100 100 100 100 100 100 
##$AQSEQ= 0
##$AQ_mod= 1
##$AUNM= <au_zg>
##$AUTOPOS= <>
##$BF1= 200.13
##$BF2= 200.13
##$BF3= 200.13
##$BF4= 200.13
##$BF5= 200.13
##$BF6= 200.13
##$BF7= 200.13
##$BF8= 200.13
##$BYTORDA= 1
##$CFDGTYP= 0
##$CFRGTYP= 5
##$CHEMSTR= <none>
##$CNST= (0..31)
1 1 145 1 1 1 1 1 1 1 1 1 1 1 1 1 1 1 1 1 1 1 1 1 1 1 1 1 1 1 1 1 
##$CPDPRG= <>
##$CPDPRG1= <>
##$CPDPRG2= <>
##$CPDPRG3= <>
##$CPDPRG4= <mlev>
##$CPDPRG5= <mlev>
##$CPDPRG6= <mlev>
##$CPDPRG7= <mlev>
##$CPDPRG8= <mlev>
##$CPDPRGB= <>
##$CPDPRGT= <>
##$D= (0..31)
0 1.2 0 0 0 0 0 0 0 0.06 0 0.03 0 0 0 0 0.0002 0 0 0 0 0 0 0 0 0 0 0 0 
0 0 0 
##$DATE= 1656324517
##$DBL= (0..7)
120 120 120 120 120 120 120 120 
##$DBP= (0..7)
150 150 150 150 150 150 150 150 
##$DBP07= 0
##$DBPNAM0= <>
##$DBPNAM1= <>
##$DBPNAM2= <>
##$DBPNAM3= <>
##$DBPNAM4= <>
##$DBPNAM5= <>
##$DBPNAM6= <>
##$DBPNAM7= <>
##$DBPOAL= (0..7)
0.5 0.5 0.5 0.5 0.5 0.5 0.5 0.5 
##$DBPOFFS= (0..7)
0 0 0 0 0 0 0 0 
##$DE= 6
##$DECBNUC= <off>
##$DECIM= 32
##$DECNUC= <off>
##$DECSTAT= 4
##$DIGMOD= 1
##$DIGTYP= 9
##$DL= (0..7)
0 120 120 120 120 120 120 120 
##$DP= (0..7)
150 150 150 150 150 150 150 150 
##$DP07= 0
##$DPNAME0= <>
##$DPNAME1= <>
##$DPNAME2= <>
##$DPNAME3= <>
##$DPNAME4= <>
##$DPNAME5= <>
##$DPNAME6= <>
##$DPNAME7= <>
##$DPOAL= (0..7)
0.5 0.5 0.5 0.5 0.5 0.5 0.5 0.5 
##$DPOFFS= (0..7)
0 0 0 0 0 0 0 0 
##$DQDMODE= 0
##$DR= 18
##$DS= 0
##$DSLIST= <SSSSSSSSSSSSSSS>
$$ [...]
##$SUBNAM2= <"">
##$SUBNAM3= <"">
##$SUBNAM4= <"">
##$SUBNAM5= <"">
##$SUBNAM6= <"">
##$SUBNAM7= <"">
##$SUBNAM8= <"">
##$SUBNAM9= <"">
##$SW= 18.05172834244
##$SWIBOX= (0..15)
0 0 2 0 0 0 0 0 0 0 0 0 0 0 0 0 
##$SW_h= 3612.71676300578
##$TD= 16384
##$TD0= 1
##$TE= 0
##$TE2= 300
##$TE3= 300
##$TEG= 300
##$TL= (0..7)
0 120 120 120 120 120 120 120 
##$TP= (0..7)
150 150 150 150 150 150 150 150 
##$TP07= 0
##$TPNAME0= <>
##$TPNAME1= <>
##$TPNAME2= <>
##$TPNAME3= <>
##$TPNAME4= <>
##$TPNAME5= <>
##$TPNAME6= <>
##$TPNAME7= <>
##$TPOAL= (0..7)
0.5 0.5 0.5 0.5 0.5 0.5 0.5 0.5 
##$TPOFFS= (0..7)
0 0 0 0 0 0 0 0 
##$TUNHIN= 0
##$TUNHOUT= 0
##$TUNXOUT= 0
##$USERA1= <user>
##$USERA2= <user>
##$USERA3= <user>
##$USERA4= <user>
##$USERA5= <user>
##$V9= 5
##$VALIST= <valist>
##$VCLIST= <CCCCCCCCCCCCCCC>
##$VD= 0
##$VDLIST= <DDDDDDDDDDDDDDD>
##$VPLIST= <PPPPPPPPPPPPPPP>
##$VTLIST= <TTTTTTTTTTTTTTT>
##$WBST= 1024
##$WBSW= 4
##$XGAIN= (0..3)
0 0 0 0 
##$XL= 0
##$YL= 0
##$YMAX_a= 197241
##$YMIN_a= -257983
##$ZGOPTNS= <>
##$ZL1= 120
##$ZL2= 120
##$ZL3= 120
##$ZL4= 120
##$ABSF1= 10
##$ABSF2= 0
##$ABSG= 5
##$ABSL= 3
##$ALPHA= 0
##$AQORDER= 0
##$ASSFAC= 0
##$ASSFACI= 0
##$ASSFACX= 0
##$ASSWID= 0
##$AUNMP= <proc_1d>
##$AZFE= 0.1
##$AZFW= 0.1
##$BCFW= 1
##$BC_mod= 2
##$BYTORDP= 1
##$COROFFS= 0
##$CY= 11.3945322036743
##$DATMOD= 1
##$DC= 2
##$DFILT= <>
##$DTYPP= 0
##$F1P= 2.36226072786647
##$F2P= -0.459571619588291
##$FCOR= 0.5
##$FTSIZE= 0
##$FT_mod= 4
##$GAMMA= 1
##$GB= 0.15
##$INTBC= 1
##$INTSCL= 1
##$ISEN= 128
##$LB= 0.24
##$LEV0= 0
##$LPBIN= 0
##$MAXI= 10000
##$MC2= 0
##$MEAN= 0
##$ME_mod= 0
##$MI= 1.114404
##$NCOEF= 0
##$NC_proc= 0
##$NLEV= 6
##$NOISF1= 3.799351
##$NOISF2= 2.8
##$NSP= 1
##$NTH_PI= 0
##$NZP= 0
##$OFFSET= 15.70392
##$PC= 1
##$PHC0= -18046.52
##$PHC1= 13.20069
##$PH_mod= 1
##$PKNL= yes
##$PPARMOD= 0
##$PSCAL= 0
##$PSIGN= 0
##$REVERSE= no
##$SF= 200.130013532006
##$SI= 16384
##$SIGF1= 3
##$SIGF2= 2
##$SINO= 400
##$SIOLD= 16384
##$SREGLST= <1H.CDCl3>
##$SSB= 0
##$STSI= 0
##$STSR= 0
##$SW_p= 3612.71676300578
##$SYMM= 0
##$S_DEV= 0
##$TDeff= 0
##$TDoff= 0
##$TI= <>
##$TILT= no
##$TM1= 0
##$TM2= 0
##$TOPLEV= 0
##$USERP1= <user>
##$USERP2= <user>
##$USERP3= <user>
##$USERP4= <user>
##$USERP5= <user>
##$WDW= 1
##$XDIM= 8192
##$YMAX_p= 0
##$YMIN_p= 0
$$ End of Bruker specific parameters
$$ ---------------------------------
##NTUPLES= NMR FID
##VAR_NAME=  TIME,          FID/REAL,        FID/IMAG
##SYMBOL=    X,             R,               I
##VAR_TYPE=  INDEPENDENT,   DEPENDENT,       DEPENDENT
##VAR_FORM=  AFFN,          ASDF,            ASDF
##VAR_DIM=   8192,          8192,            8192
##UNITS=     SECONDS,       ARBITRARY UNITS, ARBITRARY UNITS
##FACTOR=    0.0002768,     1,               1
##FIRST=     0,             0,               0
##LAST=      2.2672688,     0,               0
##MIN=       0,             -257983,         0
##MAX=       2.2672688,     197241,          0
$$ Real data points
##PAGE= N=1
##DATA TABLE= (X++(R..R)), XYDATA
0@%%%%%%%%%%%%qJ6j6J6j9K7l2M0m8N6p2Q4r6J14j34J52j76K06k34K66l03L43
$$ 0 0 0 0 0 0 0 0 0 0 0 0 0 -8 8 -8 8 -11 16 -16 24 -24 32 -40 44 -52 62 -72 80 -96 110 -124 142 -161 182
34A82l88M39m94N54o21O94p74Q61r56J059j173J299j433J580j742J920k116K330
$$ 182 -206 233 -261 293 -328 366 -408 453 -503 556 -617 682 -751 829 -913 1007 -1109 1221
52A221k568K832l126L456l828M253m743N315n992O809p818R102j0804J3175j6724
$$ 1221 -1347 1485 -1641 1815 -2013 2240 -2503 2812 -3180 3629 -4189 4913 -5891 7284 -9440
67i440K2700l5294J10400j81846j48477L14804R6961j81469j21611J68003P0853
$$ -9440 13260 -22034 88366 -93480 -241957 72847 169808 -11661 -133272 34731 105584
78A05584j30259n3166P5299K4588K0853j4919n5283m9057M8709J03435k5606j11330
$$ 105584 -24675 -77841 -2542 22046 42899 27980 -27303 -76360 -27651 75784 50178 -61152
90f1152L0223N3797k7079j5811K6475J4007k2427l151K7809n7884k1638J19825
$$ -61152 -30929 22868 -4211 -20022 6453 20460 -1967 -5118 22691 -35193 -56831 62994
102F2994L0388j30445n8701J01187Q4310q3164o7679P7394K8366o1801j8500K8228
$$ 62994 93382 -37063 -95764 5423 89733 6569 -61110 16284 44650 -17151 -35651 -7423
114g423L2485J649k5000k6747k0143M8819N1815o2214l9294O2367J2672o8557
$$ -7423 25062 26711 1711 -25036 -45179 3640 55455 -6759 -46053 16314 28986 -39571
126c9571o572R8973J3280j26893j214J25951k1079j08997L6090J15969l8916j36713
$$ -39571 -46143 52830 66110 -60783 -61997 63954 42875 -66122 -30032 85937 47021 -89692
138h9692L6819J32586k9738r5584J7549N7853j5230m5694K3183L5079k5084j0040
$$ -89692 -52873 79713 49975 -45609 -28060 29793 14563 -31131 -7948 27131 2047 -7993
150g993P501k1052N740L7855L317m1783j5908M1321O240l5748K0838K9823l3479
$$ -7993 -492 -21544 -15804 22051 25368 -16415 -32323 8998 15238 -20510 328 30151 -3328
163c328k5966L0132K5002k9396j2214M2055o576n3686J4144N2021o884m3915K430
$$ -3328 -29294 838 25840 -3556 -15770 26285 19709 -33977 -19833 32188 25304 -18611 -16181
176a6181L4488j5280k6993K6284J8849k0812j5013N636O442P22J1269p6k8206
$$ -16181 18307 3027 -23966 2318 21167 355 -14658 -9022 -2580 -1858 9411 9335 -18871
189a8871N287L2576j5805l0073K7568L9033l3789n3834L7167N9013l3223m7974
$$ -18871 -13584 18992 3187 -26886 682 39715 5926 -47908 -10741 48272 15049 -32925
201c2925K5857L6765k3416l2687K6339K5261k3220j1931R503m474k644J6282Q933
$$ -32925 -7068 29697 6281 -26406 -67 25194 1974 -9957 -454 -4928 -7572 8710 17643
214A7643k6693j8433L1797J4605k7804n617K0300N181j7084q754J5889M974j273
$$ 17643 -9050 -27483 4314 18919 -8885 -14502 5798 10979 -6105 -14859 1030 6004 4731
227D731O215j7367j3735K5421J9569j9086k6209J6841L0126k5552k5535K8324
$$ 4731 10946 -6421 -20156 5265 24834 5748 -20461 -3620 26506 954 -24581 3743
239C743J9371j9223k0893Q882J8609j0775m953J3946j2094j0673J3244P000n706
$$ 3743 23114 3891 -17002 -8120 10489 -286 -5239 8707 -3387 -14060 -816 6184 478
252D78r197Q126J0681j8118k846J6819j391j745j031n926M03L898J2359l511k3279
$$ 478 -8719 -593 10088 -8030 -10876 5943 4552 2807 1776 -4150 -3747 151 12510 8999 -14280
267a4280J3119J8209j8477j0990J3276J6125j1732k6682J6782K0577j7769o660
$$ -14280 -1161 17048 -1429 -12419 857 16982 5250 -21432 -4650 15927 -1842 -8502
279h502R130K845n996r306J3380P419j5890L822N884o745L355K23L442K269q698
$$ -8502 628 3473 -2523 -11829 1551 8970 -6920 -3098 2786 -3959 -604 -381 3061 5330 -3368
294c368K698M7j007J4226r216j3165J2405N532n648j1069M830K1948j5484k3158
$$ -3368 -670 -623 -1630 12596 3380 -9785 2620 8152 2504 -8565 -3735 18213 2729 -20429
308b0429J7785J5129p611j5592N22K1036p686j8437J3337Q503l274o558o215J1825
$$ -20429 -2644 12485 4874 -10718 -10196 10840 3154 -15283 -1946 6557 3283 -3275 -9490 2335
322B335L968q374L257j915K098M155j1724N422J1077p196n654k175Q564N627j7262
$$ 2335 6303 -2071 1186 -729 1369 5524 -6200 -778 10299 3103 -2551 -4726 3838 9465 -7797
337g797L152J5638q892j0893J721J2496M754k0198k95J8394o091q954J099Q384
$$ -7797 -4645 10993 2101 -8792 -7071 5425 10179 -10019 -10314 8080 1989 -6965 -5866 2518
351B518O217j4468m063J3970N87l331m137r33J1690m811r449O733N012J445q768
$$ 2518 8735 -5733 -9796 4174 4761 1430 -2707 -3640 8050 3239 -6210 523 5535 6980 -1788
366a788p397J5048K700j3034N63N072M201p377q388J3689L890j3338JO248L422
$$ -1788 -9185 5863 8563 -4471 -3908 1164 5365 -2012 -10400 3289 7179 -6159 -6158 90 3512
381C512n557o367J1838L908j3051j311P968O734l860j2737O733J2034n792r103
$$ 3512 -2045 -8412 3426 7334 -5717 -7028 940 7674 3814 -8923 -2190 9844 4052 -5051
395e051q8J2116N616j8014n439J4848O587q242j2674N953J4000p540j1028N028
$$ -5051 -5139 6977 12593 -5421 -10860 3988 10575 2333 -10341 -4388 9612 2072 -8956 -3928
409c928P602j34q949p53R098k355m003M051O65k447l042M383P412o903o726O428
$$ -3928 3674 3540 -5409 -6162 2936 581 -3422 629 1294 -1153 -4195 188 7600 697 -6029 399
425C99O554k599r277Q16J2848j693j1787j348Q571N624p947p462O329M437l181
$$ 399 6953 4354 -4923 -4107 8741 7048 -4739 -6087 2484 8108 161 -7301 -972 3465 284
440B84l713J62N151j960m424L784J270k130m70J690M058l741n716M995O511l17
$$ 284 -3429 -3267 1884 -76 -4500 -716 554 -1576 -2046 -356 3702 -39 -5755 -760 5751 5434
456E434q437m873J2237P241j1481r307O345J5283l748k0245J141J9710L247j7001
$$ 5434 -3003 -7876 4361 11602 121 -9186 -2841 12442 8694 -11551 -10410 9300 12547 -4454
470d454j1040J5066J3939j3381j1211P155Q510j046q193P15M988k583L063K506
$$ -4454 -15494 -428 13511 130 -11081 -3926 4584 3538 -4655 -3940 1048 -1535 1528 4034
484D034p838j778O813Q936n255j7179P028J9275m957j6791l230J7571R205k0328
$$ 4034 -3804 -5582 1231 10167 4912 -12267 -5239 14036 9079 -7712 -10942 6629 15834 -4494
498d494r042J5424Q378o189j3631J946J4842l576q627J482J880L885k274l610
$$ -4494 -13536 1888 10266 4077 -9554 -7608 7234 3658 -4969 -3487 -1607 2278 4 -3606
512c606L810j729J220L934o088M71M377j698R18k091J446K344o669L703P360p827
$$ -3606 204 -1525 -305 3629 -2459 -1988 2389 691 1609 -482 964 3308 -3361 342 7702 -125
528a25n103L444Q935p81j6903L499J7961n792j2959o21J1310N648j4040k095J1029
$$ -125 -5228 -1784 7151 6370 -10533 -7034 10927 5135 -7824 -8445 2865 8513 -5527 -7622 3407
543C407l388j925K973j337j401k619Q079N320j6432j816J7702L078j3765j1552
$$ 3407 19 -1906 1067 -270 -1671 -4290 3789 9109 -7323 -9139 8563 11641 -2124 -13676
557a3676J4187J8334j6577j6578J0835J3613k65j7688m548J9116J988j1690m417
$$ -13676 511 18845 2268 -14310 -3475 10138 9873 -7815 -12363 6753 8741 -2949 -7366
570g366L354R548k691q863M063M07Q56M827n995k020L117K497L909q596k948J1255
$$ -7366 -4012 5536 2845 -6018 -1955 -1548 -692 4135 -1860 -3880 -763 1734 5643 -2953 -5901 5354
586E354L0o352j776K347O430n039m678P375k860l614M562L9j864l561J626P532
$$ 5354 5384 -968 -2744 -397 6033 994 -3684 3691 831 -2783 1779 1818 -46 -3607 -1981 5551
602E551p211m659P892J9k759j383J471L302n490P86Q739o669n839O920N949k788
$$ 5551 -1660 -6319 1573 1592 -1167 -2550 -1079 2223 -3267 -2481 6258 -411 -6250 670 6619 3831
618C831j1477L448J5132n870j2223K265R994M331j1078p978J0872O273o135o817
$$ 3831 -7646 -4198 10934 5064 -7159 -4894 5100 9431 -1647 -9625 1247 7520 1385 -5432
632e432m10R750Q09q599l83K963K706L35m707J008J627l3L654k773n240L999N087
$$ -5432 -5842 3908 4717 -3882 -4265 -1302 1404 1739 -2968 -1960 -333 -366 3288 515 -4725 -726 4361
649D361K40p069l108J0549K257r110k728M770O119l198q105K736M843P9k741m473
$$ 4361 4601 -2468 -5576 4973 7230 -1880 -4608 162 6281 3083 -5022 -2286 2557 2636 -105 -4578
665d578K377N476k368m166o11M278L463o227k770O188J878l681k305L337L672
$$ -4578 -2201 3275 907 -3259 -3870 408 3871 -2356 -5126 1062 2940 -741 -3046 291 3963
680C963n286r70N290m51l519m35L513J935n236j099M686M47l072k459K420L764
$$ 3963 -1323 -2293 2997 2546 -973 -1408 2105 4040 -1196 -2295 2391 2838 -234 -2693 -273 3491
696C491l500l314K080K040M69l948r97N482k72l948l80K965K729m297k059N684
$$ 3491 -9 -3323 -1243 797 1266 -2682 -3679 1803 1531 -2417 -2797 168 2897 -1400 -3459 2225
712B225O02m077k32K917K325l666k808N264O04l492o80J179L156k834m006M092
$$ 2225 2827 -1250 -1482 1435 3760 94 -2714 2550 3154 -338 -1018 161 3317 483 -3523 569
728E69J374j896j933q51M424L3n447J549K938J020k351m186N398L897o442j211
$$ 569 1943 47 -1886 -2737 1687 1720 -3727 -2178 760 1780 -571 -4757 641 4538 -1904 -3115
744c115L519K839j106n986L414N660m503k289J369K458J172n728R11M678l027
$$ -3115 404 3243 2137 -3849 -435 5225 722 -1567 -198 2260 3432 -2296 -1385 3293 266
759B66j569k56J273K641m575j072M950j514j490j064R04M718l847l830N433J086
$$ 266 -1303 -1559 -286 2355 -2220 -3292 1658 144 -1346 -2410 -1506 3212 -635 -4465 968 2054
775B054j395k058q22O692k188n631L874J707J09k519k359N601m73m942K454N18
$$ 2054 659 -1399 -2221 4471 2283 -3348 526 2233 2342 -177 -2536 3065 2592 -2350 104 622
791F22J35j87l665L593J070m244J947K84P03J076m984K856L263l900j45N64K559
$$ 622 757 570 -3095 498 1568 -2676 -729 -445 258 1334 -3650 -794 2469 -1431 -1576 -1012 1547
808A547J039n567J560N724l370j795j23K427L308o326j386O269j671j864j339
$$ 1547 2586 -2981 -1421 4303 933 -862 -985 1442 4750 -1576 -2962 3307 1636 -228 -1567
823a567K16N146m515k489L903p80K92j285k366M853p38l142K338o57J745m76l109
$$ -1567 -1351 3795 -720 -3209 694 -86 206 -1079 -3445 1408 670 -2472 -134 -791 954 478 -2631
840b631M238K88l668K269R0R47m44l167M456P82n358K093J368N88j346l899M280
$$ -2631 1607 1895 -1773 496 586 1533 1089 -2078 2378 3160 -2198 -105 1263 1851 505 -3394 886
857H86J960m597K60N34J414R69m492J460K949j807m16o02O54L594l658q95L430
$$ 886 2846 -1751 -1491 -957 457 1426 -3066 -1606 1343 -464 -880 -1482 -828 2766 -892 -1787 1643
874A643r41m7j851J446L444m011j841M600j47k379j904J889M215m610k892M117
$$ 1643 702 655 -1196 250 3694 -317 -2158 2442 2295 -84 -1988 -99 4116 -494 -3386 731
890G31J056j288k361p88M236j011k695R80k09K142l58k742J742J218k29j29j157
$$ 731 1787 499 -1862 -2650 1586 575 -2120 -1140 -1349 793 435 -2307 -565 653 424 295 -862
907h62J511Q98k368J974J000k619j29J644J666k436l147M109J915m210j201J678
$$ -862 649 1547 -821 1153 2153 -466 -595 1049 2715 279 -2868 1241 3156 -1054 -2255 -577
923e77K214j450l245K312J216j371M97m23j41Q29J80J32j384K36K857j621j367
$$ -577 1637 187 -3058 -746 470 -901 -404 -827 -968 -139 41 173 -1211 -975 1882 261 -1106
940a106K143J53j264l46K182N28m374J085M730j753m799N97N007N51o571p26O237
$$ -1106 1037 1190 -74 -420 1762 2290 -2084 -999 3731 1978 -2821 -2224 2783 3334 -3237 -3963 2274
957B274J51l823k250K512L613k499k662J392J171J635j702k063K503M42k30K36
$$ 2274 2425 -1398 -3648 -1136 2477 -22 -2684 -1292 -121 1514 -188 -2251 252 694 464 700
973G00r69R22l93l40L209l435k552M600J861l047m329K555P023n069o276M804
$$ 700 -269 653 260 -80 3129 -306 -2858 1742 3603 556 -3773 -1218 5805 736 -5540 -736
989g36M089k426m299P16N435k917k768L693j149j309K008M73o88k239J829M164
$$ -736 3353 927 -3372 -2656 2779 -138 -2906 787 -362 -1671 337 810 122 -2117 -288 3876
1005C876m837j407M973o63k383j92K100J397n233J221N388m491l018L600K026
$$ 3876 -961 -2368 2605 1942 -441 -633 1467 2864 -2369 -1148 4240 -251 -3269 331 2357
1020B357r96n474K281N895m542k527K414O20J323k703j446L930j141j09P76k297
$$ 2357 1361 -4113 -1832 4063 -479 -3006 -592 28 1351 -1352 -2798 1132 -9 -118 658 -1639
1036a639L169n52k286L385j499k278K036M31K251m279k640Q511r59o713j51N084
$$ -1639 1530 978 -1308 2077 578 -1700 336 767 3018 -1261 -3901 4610 3651 -3062 -3213 1871
1052A871K775o700n029R951R71p267L32L404J588k734j761M272j612k510M815
$$ 1871 4646 -2054 -7083 2868 3839 -3428 -3096 308 1896 -838 -2599 1673 61 -2449 2366
1067B366j095l141J788J813R39m483j66O676l312m373M239O26j639j768J472L182
$$ 2366 1271 -1870 -82 1731 2670 -1813 -1979 4697 1385 -2988 1251 1877 238 -1530 -58 3124
1083C124n031p67N751k719l174K050J487M70l650N43M313l008j393K698j112J111
$$ 3124 -1907 -2674 3077 358 -2816 -766 721 1191 -2459 -1916 2397 -611 -2004 694 -418 693
1099F93q21p40K405j481J11J227k632K748N46l950J795K278o22k806j179N449
$$ 693 -128 -868 1537 56 167 1394 -1238 1510 2056 -1894 -99 2179 1557 -1249 -2428 3021
1115C021m60o967K827M756k372l873N64N189j525m666L359K283l375J191K74Q05
$$ 3021 2561 -4406 -1579 3177 805 -3068 -2504 2685 1160 -3506 -147 2136 -1239 -48 226 1031
1131A031j194j560M147j854k841L696J214k928lJ105J552l222m08L973k454k510
$$ 1031 -163 -1723 2424 570 -2271 1425 2639 -289 -292 813 2365 -857 -1265 2708 254 -2256
1147b256L765J04l156k16J943K607m920j932N745j99l822J053K166M23l196J81
$$ -2256 1509 1613 -1543 -1759 184 2791 -2129 -4061 1684 1485 -2337 -1284 882 1305 -1891 -1710
1163a710L801k198j146J817L49m54m46N49J94j413K066M56l561J388K611j759
$$ -1710 2091 -107 -1253 564 913 459 13 562 756 -657 1409 1865 -1696 -308 2303 544
1179E44k489J321K618j700l681L264J953k987j268K244J821k914j182L616r2l254
$$ 544 -1945 -624 1994 294 -3387 -123 1830 -1157 -2425 -181 1640 -1274 -2456 1160 1068 -2186
1195b186J429K053p39j424M35K487k035p67K496r61j302J185O23j353j052J726
$$ -2186 -757 1296 557 -867 -432 2055 20 -747 1749 788 -514 671 1294 -59 -1111 615
1211F15J640l833qL672j891k457J192K189l85l962K109L376l352j243K819P67
$$ 615 2255 -1578 -1586 2086 195 -2262 -1070 1119 734 -3228 -1119 2257 -1095 -2338 481 1248
1227A248j682j445K538J752l717Q58K162j225k35o8M21l6p98J378n36k147K636
$$ 1248 -434 -1879 659 2411 -1306 -448 1714 489 254 186 607 571 -227 1151 615 -1532 1104
1244A104Q5k594O26P28R90k163j385M078o01l947K441J689j158j185mL464j978
$$ 1104 1189 -1405 -779 -51 939 -1224 -2609 1469 868 -3079 -638 1051 -107 -1292 -1296 2168 190
1261A90k861M076l4j773P27k55J405q70j358K759j921p69K412j806m63J036m89
$$ 190 -2671 1405 1371 -402 325 70 1475 605 -753 2006 85 -684 1728 -78 -541 495 6
1278FQ94k471P29L123l608p41L451j389j052k68J709J440m060J036M034l058q97
$$ 6 900 -1571 -842 2281 -1327 -2068 1383 -6 -1058 -1326 383 1823 -2237 -1201 2833 -225 -1122
1295a122J556K44J015k954J439K221l071M51J783j877J114p14k81J240k145J397
$$ -1122 434 678 1693 -1261 178 2399 -672 -221 1562 -315 799 85 -196 1044 -1101 296
1311B96P25l418K415R05k268N92j82J703l52k995L254Q61l258J355J034k39j44
$$ 296 1021 -2397 18 923 -1345 -753 -935 768 416 -2579 675 1536 -1722 -367 667 428 284
1328B84j551K650M16l112K219K12j169R81j158J218j5k124K231j203j047K175
$$ 284 -1267 1383 1799 -1313 906 1118 -51 930 -228 990 975 -1149 1082 -121 -1168 1007
1344A007j537o72J305n15M98j418J45K948k492j416K819o0q19o91L07L045k520
$$ 1007 -530 -1202 103 -412 86 -1332 -1187 1761 -731 -2147 672 612 -207 -898 -591 2454 -66
1361f6j229K811m22j326L10N4J590j711q79K404j217p78N82o80R44l42j146J294
$$ -66 -1295 1516 1094 -232 78 132 1722 11 -868 1536 319 -459 123 -557 387 45 -1101 193
1379A93j278P75M15j799J420O96j267L70k59Q77O08k004J444R29j385N31j62P81
$$ 193 -1085 -310 105 -1694 -274 422 -845 -475 -734 143 751 -1253 191 1120 -265 266 104 885
1397H85m1j166R43M34j195Q14l57j36L00r09L05O9n71O46p90l4J080m41p92M86
$$ 885 844 -322 621 1055 -140 674 317 181 481 -428 -123 -54 -625 21 -769 -803 277 -164 -956 -470
1417d70J52R48j602q4J958p18o89L28M54J308j540q72J706K9q65k25M90P43j242
$$ -470 -318 630 -972 -1056 902 184 -505 -177 277 1585 45 -827 879 908 43 -182 308 1051 -191
1436a91n58J472J4j164k54L15J279j274j595K021K52o97o99L47J598q32j246J197
$$ -191 -749 723 737 -427 -681 -366 913 -361 -1956 65 317 -380 -1079 -732 866 34 -1212 -15
1454a5M85j32n78q0J262k06j191J290ll36l26n76J439o32j216J444m13k00l61
$$ -15 470 338 -240 -320 942 736 -455 835 832 496 170 -406 1033 401 -815 629 216 16 -345
1473c45m82J240k75j395R54n4j7L40r18J220l87n87J127q60m24J854p13j4N2j87
$$ -345 -827 413 138 -1257 -303 -357 -374 -34 -952 268 -119 -706 421 -439 -863 991 278 264 316 129
1493A29J225j320p34J889k87j010m7J4J881k292j002K749r37j369M66M99Q92j948
$$ 129 1354 34 -700 1189 902 -108 -155 -141 1740 -552 -1554 1195 258 -1111 -645 -146 746 -1202
1511a202o72K807n54j839P94M77J074r02j654K946n75j410J008l42R43o38j256
$$ -1202 -1874 933 379 -1460 -666 -189 885 -17 -1671 1275 700 -710 298 -44 899 261 -995
1528i95K530m45j719J421o61O64l61j719K138r3j898Q68j42M64J61k091K248J99
$$ -995 1535 1090 -629 792 131 795 434 -1285 853 760 -1138 -270 -412 52 213 -1878 370 569
1546E69j968J406j53k37J060j491R58K78j273J782k19j228J368p21N54k21j159
$$ 569 -1399 7 -146 -383 677 -814 144 422 -851 931 712 -516 852 131 685 464 -695
1563f95K423j144j818J619J13o82k1o61K078j019k210K290k71q57L38n10J846
$$ -695 1728 584 -1234 385 498 -184 -205 -866 1212 193 -2017 273 2 -855 -517 -1027 819
1580H19m45k266K451O9r68P23o62J158q1j814J784L18j467P37n83O94O81j865
$$ 819 374 -1892 559 628 -340 383 -279 879 798 -1016 768 1086 -381 356 -227 467 1148 -717
1598g17Q28N62p94J12q19O69R00j833N32J080j143N22p11M60J171j651M48R11
$$ -717 111 673 -121 -9 -828 -159 741 -1092 -560 520 -623 -101 -812 -352 819 -832 -384 527
1616E27p84M69k36j05J122j441P87O15j306Q34L03q72O27p88J56M54j208J104
$$ 527 -257 212 -24 -129 993 -448 339 954 -352 482 785 -87 540 -248 -92 362 -846 258
1634B58J51j392P12M6J02k61j093J577k6j245R27L27k98Jk82J365r3j524J127
$$ 258 409 -983 -271 -225 -123 -384 -1477 100 74 -1171 -244 83 -215 -214 -496 869 776 -748 379
1653C79J75n41M99n49O66O1r88K49J61J12K79p46K39M44p60k38J76O0P04j239
$$ 379 554 13 512 -37 629 690 -298 -49 112 224 503 -243 -4 440 -320 -558 -382 -322 382 -857
1673h57J87J129o72n65N12L82K61j317O48J268r46k52M47N17j70r12P80N90r83
$$ -857 -670 459 -213 -778 -266 116 377 -940 -292 976 30 -222 225 742 572 -340 440 1030 47
1692D7J63q8J06K64p37N11k87p71J063n20p97P12J86n8p4m34J286p09p87J343
$$ 47 210 122 228 492 -245 266 -21 -792 271 -249 -1046 -334 -148 -206 -280 -714 572 -137 -924 419
1712D19l33k14R4k03Q84m15o41J165j55o29M78m45O36l38r94J215p14j67P84j134
$$ 419 86 -128 -34 -237 647 232 -409 756 601 -28 450 5 641 303 -691 524 -190 -357 427 -707
1732g07N44M01j038M68P8L22J48j572J162P28j394N70L83P5N90j537J171O97j628
$$ -707 -163 238 -800 -332 -254 68 216 -1356 -194 534 -860 -290 93 168 758 -779 392 1089 -539
1751e39O06M56J07K65j182N03R71j690N82L37o10N38j022J60J109j382R08j15
$$ -539 67 523 630 895 -287 216 1187 -503 79 416 -194 344 -678 -518 591 -791 117 2
1769Bj070J363n90l66R69r25M34Q6p43J441m14p96J409p80L47K08q66J216k05
$$ 2 -1068 295 -295 -661 308 -617 -183 -97 -840 601 187 -609 800 20 367 575 -291 925 720
1788G20j257J210l66j07N94j535J348l01j186J223o53l49J199j648P48N18r68
$$ 720 -537 673 307 200 794 -741 607 306 -880 343 -310 -659 540 -1108 -360 158 -810
1805h10Q74m35k83J425j138j67J342r05O83n88K5J151j302j63J430r42K87l55
$$ -810 64 -371 -654 771 -367 -534 808 -97 586 -2 23 1174 -128 -291 1139 197 484 129
1823A29l73J441j475l79J274p69j68J6n03J499j094n17J273q09K34r1m16J358
$$ 129 -244 1197 -278 -657 617 -152 -320 -304 -807 692 -402 -919 354 -455 -221 -312 -728 630
1841F30o88p91J238k25j36L97r43J540k07j543J435n96M93k45r15J000N7j337
$$ 630 -58 -849 389 164 28 425 -518 1022 815 -728 707 111 604 359 -556 444 501 -836
1859h36R92j37m13M77r69R14O9r67J045l80l36M96n02O75K74r94Q70J7q88J215
$$ -836 156 19 -394 83 -886 28 97 -870 175 -205 -541 -45 -547 128 402 -592 278 295 -593 622
1879F22m24j55O20o96O80n61n70J352o48j94K29m16K87j24q35J137k72o34K14
$$ 622 198 43 663 -33 647 86 -484 868 220 26 255 -161 126 2 -833 304 32 -602 -388
1898c88j94M23K13r95J041n9m50J29J18O51M0r33O49M09n49o4J25L44Q8j012Q67
$$ -388 -582 -159 54 -941 100 41 -409 -280 -162 489 529 -404 245 654 105 41 166 510 598 -414 453
1919D53J70m94j61j01O69k92j116P05L87p01j49l1Q52m46n26N94L35o62L26M4
$$ 453 623 129 -32 -133 536 244 -872 -167 220 -481 -630 -661 191 -255 -781 -187 148 -514 -188 -144
1939a44M08O5o43P72k88k59L86k30L82J2n89N99l72R4K63m78j74M05n45M17M9
$$ -144 264 329 -314 458 170 -89 297 67 449 461 -128 471 99 193 456 -22 -196 209 -336 81 130
1960A30o08L58k18K5j52Q0N21n30k45Q48j92l01K70m84J015m82o51J135j66j21
$$ 130 -478 -120 -338 -313 -465 -385 136 -394 -639 209 17 -284 -14 -498 517 35 -616 519 353 232
1980B32J61k78O70m22j010J214j72o73L34n55Q70j58j370J383j00q48M71l30P52
$$ 232 393 115 785 363 -647 567 395 -278 56 -499 371 213 -1157 226 126 -722 -251 -581 171
1999A71K2j339J308J23r58O64j49Q86m6j374J184N00j419O96n1j41O46j132Q43
$$ 171 193 -1146 162 285 -673 -9 -158 728 682 -692 492 992 -427 269 218 77 723 -409 434
2018D34J01j291J170n99O3M43q59N06K7r99J077j53q13J351q37N8P64p01M50j54
$$ 434 535 -756 414 -185 -122 321 -538 -32 -5 -1004 73 -80 -893 458 -379 -321 443 -258 192 38
2038C8o00J567r42k47J146j173O11J7q76R62n22O5O54j313Q49M73j493P56j23
$$ 38 -562 1005 63 -184 962 -211 400 417 -459 503 -19 46 700 -613 236 709 -784 -28 -151
2057a51o3P00j441O65Q14j576O76N99k89L39q41P17R27k069J186N63j085N28l8
$$ -151 -214 486 -955 -290 524 -1052 -376 223 -66 273 -568 149 1076 -993 193 756 -329 199 161
2076A61J14P10j471N96M85p34M08k97J19K01r43M88O73j355J090l88m59J107o14
$$ 161 275 985 -486 110 595 -139 269 -28 91 292 -651 -163 510 -845 245 -143 -602 505 -109
2095a09k67N75q38J032m16p24J307n47k46P10m28O45n07n30J315q09m28R75o48
$$ -109 -376 199 -639 393 -23 -747 560 13 -233 477 49 694 187 -343 972 163 -265 710 62
2114F2J40l93K1O66q18n32J324j105J5Q31n99K57l62K86M96j236N55J207r69j68
$$ 62 202 -191 -170 496 -322 -854 470 -635 -620 211 -388 -131 -493 -207 289 -947 -392 815 -154 -322
2134c22L53K69o1o73O27Q29r61j48O54k0m23k79M47K91j007K23N33o80K84J85
$$ -322 31 300 239 -434 193 1022 61 -87 567 547 124 -155 292 583 -424 -201 332 -348 -64 121
2154A21n07M01j91J73l78m68P49J26p06O52kL35n00j7J102q85n49J004J11m23
$$ 121 -386 15 -176 -3 -381 -849 -100 26 -680 -28 -30 305 -195 -212 890 5 -544 460 571 148
2174A48k13J46O07o08m87J184l72p94L81J39l4q59M33P53r31o6R82o07m32N02
$$ 148 -65 81 688 80 -407 777 405 -389 -8 131 97 -762 -329 424 -507 -573 409 -198 -630 -128
2194a28K47K66j181P98O72q88P0M31J13j75n17R57n7r54N96K03m64l2j10L85l09
$$ -128 119 385 -796 2 674 -214 -144 287 400 225 -292 665 608 -346 250 453 -11 -43 -153 232 -77
2215g7m35Q95j71r21O71m5m96N92n23N59o18L15P44p00m08J011m54l3Q6l1P70
$$ -77 -512 383 212 -709 -38 -83 -579 13 -510 49 -569 -254 490 -210 -618 393 -61 -94 -8 -39 731
2236G31p72n54J815j188k4K70O7L73j078K01Q54j104j69J119r73N62m68K4N90
$$ 731 -41 -595 1220 32 8 278 345 718 -360 -159 695 -409 -578 541 -432 130 -338 -314 276
2255B76r88M05R15j241J29O51m11M95o19M97P48j309P49O53j208M10L86k80K78
$$ 276 -712 -307 608 -633 -504 147 -264 231 -388 109 857 -452 297 950 -258 152 538 258 536
2274E36q20Q17M7j431J030j33m13M99l72L13O6j128J449m77j051J356k86l04L41
$$ 536 -284 533 580 -851 179 46 -367 132 -240 73 139 -989 460 -17 -1068 288 2 -302 39
2293C9m47P86j46j127J599m55p40P87N0j39j90l18J121o28p31J393q97p0L08l91
$$ 39 -408 378 232 -895 704 249 -491 296 346 207 17 -301 820 192 -539 854 -43 -113 195 -196
2313a96P62p83l45J257j159j56Q83o87M95k08j73O80p19M3J066j081M22L24l18
$$ -196 566 -217 -562 695 -464 -620 263 -424 71 -137 -310 370 -349 -306 760 -321 101 425 107
2332A07Q7j95L62N32j496R74O06j253L42N49m97K62r81O24L43j346R33K73n63
$$ 107 194 -1 361 893 -603 371 977 -276 66 615 118 380 -601 23 366 -980 -47 226 -337
2351c37K54k71L76K60j131R12on79L93L77l54N24p92P93p3p22R08l22m84L95j66
$$ -337 -83 -354 22 282 -849 63 57 -522 -129 248 -106 418 -374 419 346 -376 532 210 -274 121 -45
2372d5M43k01n82Q28k34m68N96o72M42j13m69P94o99OM26l43n1L54k47K68N1m4
$$ -45 398 197 -385 443 209 -259 337 -335 107 -6 -475 319 -380 -374 52 -291 -342 12 -235 33 84 40
2394D0L60n63K73O05j023L79L74j86L1n14N37K84j103L82Q83p89j93N5O9K06r77
$$ 40 400 -163 110 715 -308 71 445 259 290 -224 313 597 -506 -124 759 -30 -223 -168 -99 107 -870
2415h70P45K39n84J12L52P3l6m98O73qk03M18L5o96M29RK88k10m05N41l63P4K02
$$ -870 -125 114 -470 -358 -6 67 31 -467 206 198 -5 413 448 -248 181 190 478 268 -137 404 41 115 317
2438C17r3k68Q6j74K83j68m47P02q58J72K40j18K37n6r2J64k65J25M20o41L90
$$ 317 224 -44 42 -132 151 -17 -464 238 -620 -448 -208 -326 -89 -145 -237 -73 -338 -213 207 -434 -44
2459d4L17j17M2q9L03K02o47K30J19m77L19p5J83m8n75N99oo09L49J20l50J74
$$ -44 273 156 198 109 412 614 -33 197 316 -161 158 83 266 218 -357 242 236 -373 -24 96 -254 -80
2481h0k21K27L98r69O70l0j11K86m94L57K52o09N48M6k85N66n40J85J89o42M16
$$ -80 -301 -74 324 -645 25 -5 -116 170 -324 33 285 -324 224 270 -15 551 11 196 385 -257 159
2502A59L7m33P35p23K48R8n87J94J14k38M54k02k60L97n25M37K13l24M5j48K12
$$ 159 196 -237 498 -225 23 121 -466 -272 -158 -396 58 -144 -404 -7 -532 -95 118 -206 -161 -309 -97
2523i7L89n58M63J40m68N49j01m26M87m71P6L06n03N39k34m11N71l73J24J45q58
$$ -97 292 -266 197 337 -131 418 317 -109 378 -93 -17 289 -214 325 91 -320 251 -122 2 147 -711
2544g11O03K82o74M76n42M12M78o23M08J9l49N03l52R2M86n39J54K39p75P69k98
$$ -711 -108 174 -500 -24 -566 -154 324 -299 109 128 -221 282 -70 22 508 -31 123 362 -413 356 58
2565E8m25P32k51k02L67p24N29L8n65P97m35l44N91m57L57m1m95O34j94o3K57
$$ 58 -367 365 114 -88 279 -445 84 122 -443 354 -81 -425 166 -291 66 25 -470 164 -30 -93 164
2586A64m25N63J6o79O83O8n58N78l24N9J25q12P52J44o05L03m8o5R8m36M62J08
$$ 164 -261 302 318 -361 322 390 -168 410 86 145 270 -542 210 354 -251 52 4 -61 37 -399 63 171
2608A71p71O91l98l30O97m23K39O0k63O79l51l41N91l80J00K4k08O88k81l2K54
$$ 171 -600 91 -307 -637 60 -363 -124 -64 -327 352 1 -340 251 -129 -29 -5 -213 475 194 162 416
2629D16m98M7L90m99L44m77N0M36l58p4K40j95JQ1k92M22l07L26p3l57L42M98
$$ 416 -82 -35 355 -144 200 -277 -227 209 -149 -223 17 -178 -177 -96 -388 34 -273 53 -20 -377 -35 463
2651D63q26O15k13J94k46j54L95K11l94K91K66m23p9l3K07j40m76L52j27k5J79
$$ 463 -363 252 39 233 -13 -167 228 439 45 336 602 179 100 67 274 134 -342 10 -117 -142 37
2672C7k16L5k6m01O94j25n2k19J03p9K33P9m0r7j09M02k07J69J0k03M46k32k16
$$ 37 -179 -144 -170 -571 123 -2 -54 -273 -170 -249 -16 63 23 -74 -183 219 12 181 191 -12 434 202 -14
2695a4K21j46r3L2j53L00J7k55L06l29m7K5l10M41M8l35L67n8M1J39m66M41K16
$$ -14 207 61 -32 0 -153 147 164 -91 215 -114 -161 -136 -446 -5 43 -292 75 17 58 197 -269 172 388
2718C88p02L92J08J83k11l16Q52l90n80M54K52p32N29k93M76l84k99L20J1n38
$$ 388 -314 78 186 369 158 -158 694 304 -276 178 430 -302 227 -66 410 26 -273 47 58 -480
2738d80L81l6K81m38j07P15n66j35O31j52j00J31j95N28m35j61O18m25k0K35n90
$$ -480 -99 -135 146 -292 -399 316 -250 -385 246 94 -6 125 -70 458 23 -138 480 55 35 270 -320
2759c20Q35k98k10N28o90J18L00n23K89J53o05L70j69J88K15o95N55n6l80L51
$$ -320 515 217 7 535 -155 -37 263 -260 29 182 -423 -53 -222 -34 181 -514 41 -15 -395 -44
2779d4J26k20L96o50O63K05p00M58K57l44l4oK19r4n80O61O9p02L46K26l09Q9
$$ -44 82 -138 258 -392 271 476 -224 234 491 147 113 107 326 232 -348 313 382 -320 26 252 -57 32
2801C2m52N59j05o08M59J52k33K99n47L07M00n24L85J01m47O55n21J55J69n34
$$ 32 -420 139 34 -574 -115 37 -196 103 -444 -137 263 -261 124 225 -222 433 -88 67 236 -298
2821b98O08m48N5M78m30J72K36o12M10J74n68M33n75L61J47n39L7K64k4L8p1j16
$$ -298 310 -138 -83 395 -35 137 373 -239 171 345 -223 210 -365 -4 143 -396 -359 -95 -119 -81 -152 -268
2843b68O14n50j35N84n10K27L7m0R9k72L60L72n35O3L55k74k7j56O2M48o53RN92
$$ -268 346 -204 -339 245 -265 -38 -1 -41 58 -214 146 518 -17 46 401 127 100 -56 6 454 -199 -190 402
2866D02q89M77k27J29K69m45J64K73l89r5K08L7J44m33O74j40l22K20k6k76P12
$$ 402 -487 -10 -237 -108 161 -284 -120 153 -236 -331 -123 -86 58 -375 299 159 -163 57 31 -245 467
2887D67j74k72J3k37M71l41J2L09l76k59N53l47m4j21M34P6m76K34J21N5k9k48
$$ 467 293 21 34 -203 268 -73 -61 248 -128 -387 166 -181 -225 -346 88 164 -312 -78 43 98 69 -179
2909a79L31O1l77J24L73l30q5K99q5r1K11M8Q1m91J17J42k76J24j38L92l5o61
$$ -179 152 213 -164 -40 333 3 -82 217 132 41 252 300 381 -110 7 149 -127 -3 -141 251 216 -445
2931d45K36L08m09R6K41j1l57R8L29Q4k35L58l73J57R1l32J72K97n41M84j64j22
$$ -445 -209 99 -310 -214 27 16 -341 -243 86 170 -65 293 -80 77 168 -164 8 305 -236 248 84 -38
2953c8K21l15K01J70j13n3j88j6J43k92K60P9k53K80j80l58M17l89J50N60o52
$$ -38 183 -132 69 239 126 73 -115 -131 12 -280 -20 59 -194 86 -94 -452 -35 -424 -274 286 -366
2974c66J97L22n0J56m66M65J70n89K70K36l80K01j24m3n8l23M92K78n94K32N4
$$ -366 -169 153 103 259 -207 258 428 -161 109 345 -35 166 42 -1 -59 -382 110 388 -206 26 80
2995H0l3J09k59j10M51q29P91p0l62L27k16J68Q0k10M13j80j18L14m88K51l4q6
$$ 80 47 156 -103 -213 238 -591 200 130 -232 95 -121 47 127 -83 330 150 32 346 -142 109 75 -11
3017a1L28j15m07M16j61j52K90l38J91R3m23K63K18k00J16m14K39Q8m40L79p3
$$ -11 317 202 -205 211 50 -102 188 -150 41 134 -289 -26 192 -8 108 -306 -67 21 -419 -40 -113
3038a13%L71n29J70L80l21J31K50m49L77m30J56J83m34L25J24m29M01j23m02M36
$$ -113 -113 258 -271 -101 279 -42 89 339 -110 267 -163 -7 176 -258 67 191 -238 163 40 -362 74
3059G4l00K25K83m19L54k50j85M69k54q9K46l40M38j73r0J48k53K13J86j86p5
$$ 74 -226 -1 282 -137 217 -33 -218 251 -3 -92 154 -186 252 79 -11 137 -116 97 283 97 22
3080B2R4p4K07j05j96M38n75L07L8l91K53k14M3L59m38qM88n54M92k45O8L01p05
$$ 22 116 42 249 144 -52 386 -189 118 156 -235 18 -196 -153 206 -232 -240 248 -306 186 -59 9 310 -395
3103c95M7O78n88M25n5j14K76l29K37J96l98K69q4j40J34ol14L91k52K37j22l84
$$ -395 -348 330 -258 167 112 -2 274 -55 182 378 -20 249 165 25 159 153 -161 230 -22 215 93 -291
3125b91L90k98K3J38q4M5M8l47L87m03K34M48n34K31J42k3Pk5kL48l20k29L88
$$ -291 99 -199 -176 -38 -122 -77 -29 -376 11 -392 -158 290 -244 -13 129 106 113 88 86 434 114 -115 273
3148B73j10m32J15K20J28m32P2J50k40J98j83j5N9m1J96L58o65K81L8l9J88j82
$$ 273 163 -269 -154 66 194 -238 -166 -16 -256 -58 -241 -256 -197 -238 -42 316 -349 -68 -30 -69 119 -63
3170f3J92K48n28M76j87l41L53N9j3K16l55mJ88m09M09k87k5L74n49L66k97j35
$$ -63 129 377 -151 325 138 -203 150 209 196 412 57 53 241 -168 241 -46 -71 303 -246 120 -177 -312
3192c12M23m65J27J58Q6lJ62j68j22J55o4N4j52J30K19n2k27L4K33P3m44K15l3
$$ -312 111 -354 -227 -69 17 14 176 8 -114 41 -23 31 -121 9 228 176 -51 -17 216 289 -155 60 27
3215B7k21M34j24j07K1n2j74L98q13O36K52n16j41N2L04L19o60L99J61l08O1J87
$$ 27 -194 240 116 9 30 -22 -196 202 -611 25 277 -239 -380 -328 -24 295 -365 34 195 -113 -52 135
3237A35k60L38j14R1l67J21M84j18k19N4l57M32j45k31L29j26m72M68k7m44K77
$$ 135 -125 213 99 190 -177 -56 428 310 91 145 -212 220 75 -156 173 47 -425 43 16 -428 -151
3258a51l58Q56n85o7O66p06J83K51q3K08l84M5O69p12M3M09m43m2N37m15J74l33
$$ -151 -509 347 -238 -305 361 -345 -162 89 6 214 -170 -125 544 -168 -125 284 -159 -201 336 -79 95 -238
3280b38L22J33n14N04J50p53K91K5r3n0l7J09M08q38N00M2k23M50m97N03Q4n11
$$ -238 84 217 -297 207 357 -396 -105 -80 -173 -223 -260 -151 257 -581 -81 -39 -262 188 -309 194 278 -233
3302b33L68n5k36L03k75K48J83k99M1L28o37P33l97L2O3l64K02k73j18N37pn05
$$ -233 135 80 -156 147 -128 120 303 4 45 373 -264 469 72 104 167 -197 5 -268 -386 151 144 -361
3324c61O02m64J76N4j39K31P8k24J46j5j63L18m33L86j29k29N52o51K03L87n94
$$ -361 241 -223 -47 7 -132 99 177 -47 99 84 -79 239 -194 192 63 -166 386 -265 -62 325 -269
3345b69L77N9l81K60j7k40L33o25J67M38k30M2p7K07L51p02L96K52m48o1K64q5
$$ -269 108 167 -214 46 29 -211 122 -503 -336 102 -128 -86 -163 44 395 -307 89 341 -107 -168 96 11
3367A1J79k79J76J76l98N10o1n57J00L5J83M6m83L23o4K0N4l39K54Mj04N8J67
$$ 11 190 -89 87 263 -135 375 314 -243 -143 -108 75 121 -362 -39 -103 -83 -29 -368 -114 -110 -214 -156 11
3390A1k99K77o0q2J38M0P8k59L42N2m70L29L7p0j10L22l89M92m15N3K51l24j53
$$ 11 -288 -11 -71 -153 -15 25 103 -156 186 238 -232 97 134 64 -46 276 -113 379 -36 17 268 -56 -209
3413b09L25m0j49m4K04K9n18M3M33q4k89P30m03l48J32J97J54k73L52N2k00j66
$$ -209 116 76 -73 -117 87 116 -402 -359 74 -10 -299 431 28 -320 -188 9 163 -110 242 294 94 -72
3435g2L1O1J61m72K98L35l61K22k00k30O4k3L11j39j48M37m73j7L94l47L03j02
$$ -72 -41 20 181 -291 7 342 -19 203 3 -227 -163 -186 125 -14 -162 275 -198 -215 179 -168 135 33
3457C3j73J51l95L00L54n12J35N5P1K48l48J20K81o46M76L7l95L04lk61K99l01
$$ 33 -140 11 -384 -84 270 -242 -107 -52 19 267 -81 39 320 -326 150 187 -208 96 93 -168 131 -170
3479a70J0M23n45N3K04R9K35m24r7O33l01l8j00j53J40j42L59O0k23J14M4k68
$$ -170 -160 263 -282 -229 -25 74 309 -115 -212 421 120 82 -18 -171 -31 -173 186 246 23 137 181 -87
3501h7K23Rj78L43l72Q7M43o17N71n75J25L57n17J30J80l12K42k21J2N77n53k5
$$ -87 136 145 -33 310 -62 25 468 -149 422 -153 -28 329 -188 -58 122 -190 52 -169 -157 420 -133 -158
3523a58J45r4K00k45R2O1j51K88L18m40K42k32l01L01J24j98J32l52K6N23l71
$$ -158 -13 -107 93 -152 -60 1 -150 138 456 16 258 26 -275 26 150 -48 84 -268 -242 281 -90
3544i0J25l23j53O36l71j10P99o22L81m65o7M09j05j20O7j52j4L25k95K12j15
$$ -90 35 -288 -441 195 -176 -286 513 -109 272 -193 -260 149 44 -76 -9 -161 -175 150 -145 67 -48
3565d8k1M21l55J0L21j63P0j13j73L42n39L22J18m96M05k61r9K92O6r4N0k20K53
$$ -48 -69 352 -3 7 328 165 235 122 -51 291 -248 74 192 -304 101 -160 -259 33 99 5 55 -165 88
3588H8l66l0M89k49O7M04n59J36K42k52L37n44K70K11l19L9j21Q3Q9k9l8R5l42
$$ 88 -278 -308 181 -68 -1 403 -156 -20 222 -30 307 -237 33 244 -75 -36 -157 -74 15 -14 -52 43 -299
3611b99L84j17qR6j53j19J93n2L9K86l20K28J77l40J08q2qJ58j23k33L04m73N66
$$ -299 85 -32 -40 56 -97 -216 -23 -75 -36 250 -70 158 335 -5 103 21 13 171 48 -185 119 -354 212
3634B12l72m0M77l22J41K97m19J07j56p5J97l08K05L3j11J43k55J15K97l44K00
$$ 212 -160 -200 277 -45 96 393 -26 81 -75 -150 47 -261 -56 -23 -134 9 -246 -131 166 -178 22
3655B2Lj06M72m19p7L11q3o9J02M4j20l63L83J5j3J6J07l37J86R9l55J61k21K60
$$ 22 25 -81 391 -28 -105 206 123 54 156 200 80 -283 100 115 102 118 225 -112 74 173 -182 -21 -242 18
3679A8k57p4L52k46q9N36l72L47r2R4l85K03o4K60l28P0L0OJ96n2LL5l08j4N74
$$ 18 -239 -313 39 -207 -296 240 -132 215 123 217 -168 35 -29 231 -97 -27 3 9 205 153 156 191 -117 -131 443
3704D43n32J73j46j19K64l39R0R1j25J68m3J16nj18J13n4j57L0N76n95J23J3j95
$$ 443 -89 84 -62 -181 83 -256 -166 -75 -200 -32 -75 41 36 -82 31 -23 -180 -150 426 -169 -46 -33 -228
3727b28N70j18q0K70m97K50q4J04j08k00k9J85m33L21m1j68M02k63J4J33l82L86
$$ -228 342 224 144 414 -83 167 83 187 79 -121 -150 35 -398 -77 -118 -286 116 -147 -133 0 -382 4
3749DJ31j45K15j64J2J51n45L46J89k86L17j15M8O9q3j60O4k89K42m5o0K08j17
$$ 4 135 -10 205 41 53 204 -341 5 194 -92 225 110 158 227 144 -16 48 -241 1 -44 -104 104 -13
3772a3m2M7j21K31j15M0o3j69LM84m08k23L97j1P2k33K0L15k10J80j08j35J15
$$ -13 -55 -8 -129 102 -13 27 -36 -205 -202 282 -126 -349 48 37 109 -124 -104 211 1 181 73 -62 53
3795E3N6j61L64o30L93k4k81J94N5j26j10K10L3l73K15K81k59p9J42o5m4K21j89
$$ 53 109 -52 312 -318 75 51 -230 -36 19 -107 -217 -7 26 -347 -132 149 -110 -189 -47 -112 -156 65 -124
3818a24p4K58n2K16r4l44N88l19J29O8k95K97l58l4K56j97L06j02l98K53k36P5
$$ -124 -198 60 8 224 130 -214 374 55 184 252 -43 254 -104 -138 118 -79 227 125 -273 -20 -256 -181
3840a81L45k63lJ23l61J68J10qL21j95p1qj18N1L97j36L42n33J52L40n17J20k9
$$ -181 164 -99 -102 21 -340 -172 -62 -70 251 56 -15 -23 -141 -90 307 171 513 -20 132 472 -45 75 46
3863D6j26L48k92%O0j78k09M13l48K34J15j4J42l58J66j15jK10k6j40J53l58M55
$$ 46 -80 268 -24 -24 36 -142 -351 62 -286 -52 63 49 191 -167 -1 -116 -117 93 67 -73 80 -278 177
3886A77k45J95J32j79j75L88k10Q9k17j97M75%l02O8N7j42J98j88q7Nk16N63l88
$$ 177 -68 127 259 80 -95 293 83 172 -45 -242 233 233 -69 -1 56 -86 112 -76 -163 -158 -374 189 -199
3909a99qP2J49q2J43J20j75j38L8L74j90p9J58k92L07n7l14K20K2j79L15l10m9
$$ -199 -207 -135 14 -68 75 195 20 -118 -80 294 104 25 183 -109 198 141 -173 47 69 -110 205 -105 -154
3932a54J87nr0q0l0j4J53J8n8N2j24JJ42K41m23L66m4l06O6K78j57J67p0m2Qk89
$$ -154 33 28 -62 -142 -172 -186 -33 -15 -73 -21 -145 -144 -2 239 -184 182 138 -168 -102 176 19 186 116 74 82 -207
3958b07M4J26K4K05m69M02j45J22O6k13j12L12pk26N2k18L99r2j90N45l67r2M5
$$ -207 -163 -37 -13 192 -277 125 -20 102 168 -45 -157 155 148 -78 -26 -244 155 63 -127 418 51 -41 4
3981Dj72K69p8j36K59k14j11K77j45J9J90o3L8l36K66J18k99L12l11J23k01M6
$$ 4 -168 101 23 -113 146 -68 -179 98 -47 -28 162 99 137 -199 67 185 -114 198 -113 10 -191 -145
4003a45K55l9l00K00m2j24L96m03J7M49r8K0j3l59K05Op8K78k65J95p0l31L43
$$ -145 110 71 -229 -29 -71 -195 201 -202 -185 264 166 186 173 -186 19 25 -53 225 -40 155 85 -246 97
4026I7j80K46j95k44J49J93p5J31L1l67K98j16l10L63l61L49k4J6J88j51j73K57
$$ 97 -83 163 -32 -276 -127 66 -9 122 153 -214 84 -32 -342 21 -340 9 -15 1 189 38 -135 122
4048A22r5k17L18j32J74k80K79k43M9k25L04j12J21Rk95L95k43R5j18l4k61K50
$$ 122 27 -190 128 -4 170 -110 169 -74 -25 -250 54 -58 63 72 -223 172 -71 24 -94 -128 -389 -139
4070a39j02K99p7k12K48l7k3K15j89N88n75N5N0m37M71q5j07O1J53j52n7k5L4
$$ -139 -241 58 -19 -231 17 -20 -43 172 -17 571 -4 51 101 -336 135 50 -57 4 157 5 -52 -77 -43
4093d3K4L8j5k05K74K10m57J39J92j03J5o8k94L36M4p4J10j56R0L3l6J71P0j70
$$ -43 -19 19 4 -201 73 283 -174 -35 157 54 69 1 -293 43 87 13 123 -33 57 90 54 225 295 125
4117A25J08l66J38K88l21R1J46n49M79k09J26m3k02K53k15Q6M44m90J67k9j26
$$ 125 233 -133 5 293 -28 63 209 -340 139 -70 56 13 -189 64 -151 -65 379 -111 56 27 -99
4138i9J03j55j57M99j66N1p8k39J82r5L8K95L5r0K7j20j2J3p1K27j56k54N35j18
$$ -99 4 -151 -308 191 25 76 -2 -241 -59 -154 -116 179 214 124 151 31 19 32 -39 188 32 -222 313 195
4162A95j46j10M6j02K0J51k46J39J46j56n4K97q1q5J85k31N9l7k26K18lJ53j75
$$ 195 49 -61 -15 -117 -97 54 -192 -53 93 -63 -117 180 99 14 199 -32 27 -10 -236 -18 -21 132 -43
4185d3L9j11J77k68L0k9J77J74k80J87K11k89q1J39j42J48j90J04K32l15J01N3
$$ -43 -4 -115 62 -206 -176 -205 -28 146 -134 53 264 -25 -106 33 -109 39 -151 -47 185 -130 -29 24
4207B4k88L79k76J11O6J67l12L28r0j03J80k86K89k8k53J75j70M8j33N21l54l79
$$ 24 -264 115 -161 -50 16 183 -129 199 109 6 186 -100 189 161 -92 83 -87 -39 -172 349 -5 -384
4229c84M65j88k9N9J7J61L5j12l7M7k67M53P4k58K44k92L2J45k88P2K81j42r3
$$ -384 81 -107 -136 -77 -60 101 136 24 -13 34 -233 220 294 36 280 -12 20 165 -123 -51 230 88 -5
4252eJ34j16M2r3m0J22n5l7J02J7k6k62K18j44J05K13k33j41J27KL01K3l28N7
$$ -5 129 13 55 -38 -78 44 -11 -48 54 71 45 -217 1 -143 -38 175 -58 -199 -72 -70 231 254 -74 -17
4276a7J24k14L58l21K43N0l33J98k0j67PJ00j61K2Q9J13j67L29j43k18L79k23
$$ -17 107 -107 251 -70 173 223 -110 88 68 -99 -92 8 -153 -131 -42 71 -96 233 90 -128 251 28
4298B8ko7K19m53M05p0K06j48l20K46j29J92L2K6j43J13j34j2K29m89J21K11j78
$$ 28 26 -41 178 -275 130 60 266 118 -202 44 -85 107 139 165 22 135 1 -11 218 -271 -150 61 -117
4321a17Ro7J56K66m64J24Q0l8J03l59J76P3l0j25M85j89J46k26J08j68l8L7P6
$$ -117 -108 -175 -19 247 -217 -93 -13 -51 52 -307 -131 -58 -88 -213 272 83 229 3 111 -57 -95 -58 18
4344A8k75K66O6j98J57K42N7k77O0j58K5j01J14q4j78L45m9j82M1k39L87Q9k42
$$ 18 -257 9 75 -123 34 276 333 56 116 -42 -17 -118 -4 -88 -266 79 30 -152 -111 -350 37 126 -116
4367a16J16k03J60j21k2L06Mk93K52k49K13J96k70J49jj02r6QP4j33L92j55j47
$$ -116 0 -203 -43 -164 -186 120 124 -169 83 -166 47 243 -27 122 121 19 -77 -69 5 -128 264 109 -38
4390c8J98l97J17N3J0J09J19j80j37O1R2J1Km1r0K24r5Q3o3K51k52j78K1N7J02
$$ -38 160 -237 -120 -67 -57 52 171 -9 -146 -85 7 18 20 -21 -111 113 18 101 38 289 37 -141 -120 -63 39
4415C9J57n3l02K43j12L0O6J24j40m0k54M05k43N5j53Q1P8M9k2K89l86l6J53%
$$ 39 196 143 -159 84 -28 2 68 192 52 12 -242 163 -80 -25 -178 -97 -19 30 8 297 -89 -125 28 28
4439B8J22j63r0m5o2J99M0k94K45J51l61M33m04K62j10n2o3K33l25L24j31j86
$$ 28 150 -13 -103 -148 -210 -11 29 -265 -20 131 -230 203 -201 61 -49 -101 -164 69 -256 68 -63 -249
4461b49N67n61M64k27N3j13p8J13n4K7j93L25J73n8r4j46K02Nj63M6JJ67j24L5
$$ -249 318 -243 221 -6 47 -66 -144 -31 -85 -58 -251 74 247 189 95 -51 151 156 -7 39 40 207 83 118
4485A18p5O9l10L40k23MJ30k36J77j06k73L91l7qK59l59K99J14k12J70k03K39
$$ 118 43 112 -198 142 -81 -77 53 -183 -6 -112 -385 6 -31 -39 220 -139 160 274 62 232 29 268
4507B68j26k0N1j1k25P0q7J17j53K18O2j00Kj75L0j65O24m88J42j1r3L18k43j13
$$ 268 142 122 173 162 -63 7 -80 37 -116 102 164 64 66 -109 -79 -244 380 -108 34 23 -70 248 5 -108
4531a08J34j32J29P8j50k1R6K39m39k02K50O4l6k2L63m35J28QK09k38J9J23k2
$$ -108 26 -106 23 101 -49 -70 26 265 -174 -376 -126 -62 -98 -120 243 -192 -64 -56 153 -85 -66 57 35
4554C5j28J98k70Q6J7j51K61l28J93N8k19J02J02n9L87k40r4Q9k04K87Qk5L6m77
$$ 35 -93 105 -165 -79 -62 -213 48 -280 -87 -29 -248 -146 -44 -103 284 44 -50 39 -165 122 130 105 141 -336
4578c36K4K16M4j57K52j36Q1P8j99J70r4Q4r0j23J96J83k09K7o3j09M22k58P2
$$ -336 -312 -96 -52 -209 43 -93 -12 66 -133 37 -57 27 -63 -186 10 193 -16 11 -52 -161 261 3 75
4601G5k37L88k97K93k23Q1j69j64K82k32K02O1J4p0Q7k20L95k22n0J28l30K91
$$ 75 -162 226 -71 222 -1 80 -89 -253 29 -203 -1 60 74 4 91 -129 266 44 -6 122 -208 83
4623H3j87j91M79k29J74j85K4L3k11%J29J05J25k08J91n1r1K17k03l3k49L32r9
$$ 83 -104 -295 184 -45 129 -56 -32 1 -210 -210 -81 24 149 -59 132 81 -10 207 4 -29 -278 54 -45
4646d5K40p7m00K84j77J33J0j35K41k08j15P01l52mN6l38K39N7k76M38m52K92
$$ -45 195 118 -282 2 -175 -42 -32 -167 74 -134 -249 452 100 96 152 -186 53 110 -166 272 -180 112
4668A12M5j15R5l49L34k78L01k11K10l62J94K95l10K02k88j17L02j89m2K21OJ38
$$ 112 157 42 137 -212 122 -156 145 -66 144 -218 -24 271 -39 163 -125 -242 60 -129 -171 50 56 194
4690A94l09J22J93j34J62j64j33K32j4r0J7l6m9q8KK25M8m64M66m64K07o5Lp5
$$ 194 -115 7 200 66 228 64 -69 163 149 59 76 40 -9 -97 -95 130 178 -286 180 -284 -77 -142 -139 -214
4714b14K46r0k9P9K5n1j77K45j13J50J63j07j07M1j41lK11m5j1k11O5J74k28K43
$$ -214 32 -58 -87 -8 17 -34 -211 34 -79 71 234 127 20 61 -80 -83 128 83 72 -139 -74 100 -128 115
4738A15l37K01jj23m9L56l02K6pJ71m1k84R5L59k37k20K90j17r7J24J85r4j3q
$$ 115 -222 -21 -22 -145 -194 162 -140 -114 -121 50 9 -275 -180 179 -58 -278 12 -105 -202 -78 107 13 0 -8
4762hM4j17N8K30j61N7p5K04j82l01M60o8j14k28K54j70J51m52K22J04j1m2J65
$$ -8 36 -81 -23 207 46 103 28 232 50 -251 209 141 27 -201 53 -117 34 -418 -196 -92 -103 -145 20
4785B0j55J05k18M53l10J50J4j21lPJ26O3r0j30J61P1j66K51j70k14J51k9J13
$$ 20 -135 -30 -248 205 -105 45 59 -62 -65 -58 68 131 41 -89 72 143 -23 228 58 -156 -5 -34 79
4808G9n7l1Mj16o3M47k20m15L57J39O3k84N5n6m8K37K00j19j77j16J22J03m5L9
$$ 79 22 -9 -5 -121 -184 263 43 -372 -15 124 187 -97 -42 -98 -146 91 291 172 -5 -121 1 104 59 98
4832I8j1p5l1%k78M07n2j6J97m69K72J71l35J78lj33K92q3k71J72j10J71%o2r8
$$ 98 87 12 -19 -19 -297 110 58 42 239 -230 42 213 -122 56 53 -80 212 129 -142 30 -80 91 91 29 -69
4857f9J37J16k66L1M13j16l89M70k30J09k51M63m88J12j59lR2j2J20k44m0K08
$$ -69 68 184 -82 -51 362 246 -143 327 97 206 -45 418 -70 42 -117 -120 -28 -40 80 -164 -204 4
4879Dj27O5K88m65K84k00K0P8J58K2mpJ0j11k0j32K42Onk34K64l43Q4J44j09R8
$$ 4 -123 -58 230 -235 49 -151 -131 -53 105 127 123 116 126 15 -5 -137 105 111 106 -128 136 -207 -123 21 -88 10
4905A0j12K79j11j26J29k03r0K91r6k14L38j67o2j29J97M2n1p0M01k25L3K8j52
$$ 10 -102 177 66 -60 69 -134 -224 67 -29 -243 95 -72 -134 -263 -66 -24 -75 -145 256 31 64 92 -60
4928f0K68j56J98j75l1qj14N4J67j86j68J70q6J56n1K6j98K94l47K33q7m2K78
$$ -60 208 52 250 75 44 36 -78 -24 143 -43 -211 -41 -127 29 -22 4 -194 100 -247 -14 -101 -143 135
4951A35j97oJ49k84L04J04j54Q6q7j17Kq3K13K89j57k92l7L17r4j82M5J47j31
$$ 135 -62 -68 81 -203 101 205 51 137 50 -67 -65 -148 65 354 197 -95 -132 185 91 -91 -46 101 -30
4974c0j3j21L78j53l26L89j7k12M38l61o7K1k38K98L4j57L42j97L1J08k96L75
$$ -30 -43 -164 214 61 -265 124 107 -105 333 -28 -95 -74 -312 -14 20 -137 205 8 39 147 -149 226
4996B26%l46K43l6j14J01l97M22k9j37J02j21j69L63l89K08Rl3K11Q3k36J15j37
$$ 226 226 -120 123 87 -27 74 -323 99 70 -67 35 -86 -255 108 -281 -73 -64 -97 114 197 -39 76 -61
5019f1j50M19j75J34k05j89N15j48N8j09j55J94Q2m1m43J48K42q7l28K59j16J37
$$ -61 -211 208 33 167 -38 -227 288 140 198 89 -66 128 210 169 -274 -126 116 29 -299 -40 -156 -19
5041a9n2J3n8J30n1j16J91l1p3P3j07N97m69K00k45J08r2O1l25K53oJ60q1J75
$$ -19 -71 -58 -116 14 -37 -153 38 7 -66 7 -100 497 28 228 -17 91 -1 60 -265 -12 -18 142 61 236
5065B36k06j63J00K0M2P3r3J10k10J3qj8J53k65L80k63q6K47m8o9K71l59K67j78
$$ 236 30 -133 -33 -13 29 102 9 119 -91 -78 -86 -104 49 -216 164 -99 -185 62 14 -55 216 -143 124 -54
5089e4o2L81j74j02J70j58Q5k07Q3K1j06P7K7j36M7M2m8L37j59n4j23J50R6l02
$$ -54 -116 265 91 -11 159 1 86 -121 -38 -17 -123 -46 -19 -155 -108 -66 -114 223 64 10 -113 37 133 -169
5113a69M4J28K0K10l12J38j20Rl30O73l8j28Lj2J07Q3l26J11j90J6m9K20O9m4
$$ -169 -125 3 23 233 -79 59 -61 -52 -382 291 253 125 128 116 223 306 -20 91 -99 -83 -132 88 157 113
5137A13p2n5j96K13J44k17P7Q9l25L6L28M8k68r9K12O7Q4k11L05j07p8r9P2K8
$$ 113 41 -14 -210 3 147 -70 7 96 -229 -193 135 183 -85 -184 28 95 179 -32 273 166 88 -11 61 89
5161H9k55J85K0J14k26J30k48L34j96N8k30l8K26P2j00J97j72J93M2k48o5K5O7
$$ 89 -166 19 39 153 -73 57 -191 143 -53 5 -225 -263 -37 35 -65 132 -40 153 195 -53 -118 -93 -26
5184b6K03j86J37p9L9J64k80P2K17j11m0N1J5J4k25R0O7l23O0J51l78K89P5J94
$$ -26 177 -9 128 49 88 252 -28 44 261 150 110 161 176 190 -35 55 122 -201 -141 10 -368 -79 -4 190
5208A90l38J08j49K65j33j0n8P5J76j47J87n8M3nj54n4p0J20M9J22k48K60l39
$$ 190 -148 -40 -189 76 -57 -67 -125 -50 126 -21 166 108 151 146 -8 -62 -132 -12 37 159 -89 171 -168
5231a68J29J68j51J24R6l48J28j03p6L93k79Q5J24p9NK4j71K23P8k55k2J09l1
$$ -168 -39 129 -22 102 198 -150 -22 -125 -201 192 -87 -2 122 43 48 72 -99 124 202 -53 -75 34 3
5254CM4p8R8r4M2Nl0J27J0k08J4L60n39M74j35j40J67l5Q5k22n3L41l90L12J24
$$ 3 47 -31 67 -27 15 20 -10 117 127 -81 -67 293 -246 228 93 -47 120 85 170 -52 -105 236 -154 158 282
5279B82l12PM9L07k55j24M3K06r1l36J45l2J33j36L0jP5m1LP2R2J36j41j18k34
$$ 282 -30 -23 26 333 78 -46 -3 203 112 -224 -79 -111 22 -114 -84 -85 -10 -51 -48 24 116 252 111 -7 -241
5304b41O5J72%Q5m2k25L77l25R6O8l6R2nl52M77k37j5J57n5Q5o3k04J51J50k30
$$ -241 -176 -4 -4 81 39 -186 191 -134 -38 30 -6 86 81 -271 206 -31 -46 111 56 141 78 -126 25 175 -55
5329e5j8l16N94k36j60Q1Q9j71K16k3j50L53j08l9R1j72K95m18K00J51k06q1o
$$ -55 -73 -389 205 -31 -191 -110 -21 -192 24 1 -149 204 96 57 148 -24 271 -147 53 204 -2 -83 -89
5352h9R5L46l41k0K77k66M0m6j89K91n1p1R8k69R9P8p0j40K45O6k54L4K01J60
$$ -89 6 352 11 -9 268 2 42 -4 -193 98 47 -24 74 -195 -96 -18 -88 -228 17 83 -171 -137 64 224
5376B24k56J81l17O8K93k74K0J36j06K60j36l00L45j67k4j11k4M98l60K16j11
$$ 224 -32 149 -168 -100 193 -81 -61 75 -31 229 93 -207 138 -29 -53 -164 -188 310 -50 166 55
5397E5l8j80Q9k7L80r8l29K48k73L52m83K08K27P8j79N7jpm5j85J98N0k02K39
$$ 55 17 -163 -74 -101 279 181 -148 100 -173 179 -304 -96 131 209 30 87 86 79 34 -151 47 97 -105 134
5421A34k03j6O6n5J13j37K25n5j91o0N04m81P9o7oJ66oj40P1k7K9M7L95l31R1
$$ 134 -69 -85 -19 -74 39 -98 127 72 -119 -179 325 -156 -77 -144 -150 16 10 -130 -59 -86 -57 -10 385 54 145
5446A45k06N2J42j72J47J9J11j66r2k8j27K07k5j12K7j4J89l9k14K22o8q2P5J28
$$ 145 -61 -9 133 -39 108 127 238 72 -20 -48 -175 32 7 -105 -78 -92 97 58 -156 66 -2 -84 -9 119
5470A19j10o5p6M4oJ94J4P2k40J78L8l82J73K14j05q3j7L7P8j57L12l26mJ27o
$$ 119 9 -56 -132 -88 -94 100 114 186 -54 124 162 -220 -47 167 62 -21 -38 -1 77 -80 232 -94 -98 29 23
5495B3k12K08R4L5k91k4K17mO5K14m09Q3K60k78q7J28r1N7J68r3j39Q9J62k77
$$ 23 -189 19 113 148 -143 -167 50 46 111 325 -84 -1 259 -19 -106 22 -69 -12 156 63 -76 13 175 -102
5519a02jJ11k78J67Q0j88K29j51J2K79k42J4P0J6J66j54n1rK03j97RR9q2J90K4
$$ -102 -103 8 -270 -103 -23 -211 18 -133 -121 158 -84 -70 0 16 182 28 -23 -32 171 -26 -17 82 0 190 214
5544B14j65k26J75N7k22J1p2K56J0k52J40m2j87M37k66Mn4L8J43J28j94J78k55
$$ 214 49 -177 -2 55 -167 -156 -228 28 38 -214 -74 -116 -303 134 -132 -128 -182 -144 -1 127 -67 111 -144
5567a44j12K62k07J4K93m6n9J01k64j3K96O7m8j0r6j61j23L05p7M9L7j53K11n0
$$ -144 -256 6 -201 -187 106 60 1 102 -162 -175 121 188 140 130 34 -127 -250 55 -22 27 64 -89 122 72
5591G2k94K5J07n1J07P4j36k0j86K09K27j69r7J99j07K45l98L83j80Nl9J39k05
$$ 72 -222 -197 -90 -141 -34 40 -96 -116 -302 -93 134 -35 -132 67 -40 205 -193 190 10 15 -24 115 -90
5614i0J17j8M6L7l59L24j9P0k2j7r6j89J65N6JJ2Rl32K33K16m99L92m3j15K50
$$ -90 27 9 55 92 -267 57 38 108 86 69 -27 -216 -51 5 6 18 27 -305 -72 144 -355 37 -6 -121 129
5639A29n9j16J31j62m5m8J60J3l02K09M63m23Q1j16J54l0M0k43J46J25J25o8j90
$$ 129 70 -46 85 -77 -122 -170 -10 3 -299 -90 373 -50 31 -85 69 39 79 -164 -18 107 232 164 -26
5662b6J03r7K89k1k13j15K16k67J1K45l23J20q6K92l7l3p3M2P2k26J12K18l2l04
$$ -26 77 -20 269 248 35 -80 136 -131 -120 125 -198 -78 -164 128 91 58 -15 27 99 -127 -15 203 171 -133
5686a33K84k33K42k58N8M6j6O5J24k15n7j52L67N8k17J98J20j98r2O5O9j74L71
$$ -133 151 -82 160 -98 -40 6 -10 55 179 -36 -93 -245 122 180 -37 161 281 83 -9 56 125 -49 322
5709C22m28L25l62K8J29J56k83K17J19k86j01O5L47j25j28R0J23k32K61k78j23
$$ 322 -106 219 -143 -115 14 170 -113 104 223 -63 -164 -99 248 123 -5 85 208 -24 237 -41 -164
5730a64K39M5Q3k81J20Q2j85P3r5L8J1J41K2J5j03j2J82j56l26M76j35q8r3l6
$$ -164 75 120 203 -78 42 124 -61 12 -83 -45 -34 107 129 144 41 29 211 55 -271 205 70 -18 -111 -147
5754a47M22n37K18Q3n9P5RQ2j37j34p8M02l38K35m0M6n8j45NJ57j03K11j63J23
$$ -147 275 -262 -44 39 -20 55 64 146 9 -125 -203 199 -139 96 56 102 44 -101 -96 61 -42 169 6 129
5778A29k9l42L51O18p84j10j8L57l62P75r41J81J05K69jj89Q0j01j21K87j54J01
$$ 129 100 -242 109 727 -57 -167 -185 172 -190 585 -356 -175 -70 199 198 9 89 -12 -133 154 0 101
5800A01j75N2jJ12K08k67l7l1m9Q9j19o7L27k95RJ52O3j42%j10M13o7k77J75j8
$$ 101 -74 -22 -23 89 297 30 -7 -38 -87 2 -117 -184 143 -152 -143 9 72 -70 -70 -180 233 166 -111 64 46
5825D6q8J00q9Q4L3J25j1R9k81m4R2j93K15k49J76j4j4K51l29Rj60R2K43j72M1
$$ 46 -42 58 -31 53 86 211 200 299 18 -26 66 -127 88 -161 15 1 -13 238 -91 -82 -242 -150 93 -79 -38
5850c8o5K83k44kj91N45q7j56K7j50J9L21j44o4j32K25j44k3K84m03N7n9j5L88
$$ -38 -103 180 -64 -66 -257 288 201 45 72 -78 -59 262 118 54 -78 147 3 -20 264 -139 -82 -141 -156 232
5874B32j2l63J17Q8lK0r5K8j2KM4r7p4J26j76n4Q4m7J44R2M0k10J74k19L2J70
$$ 232 220 -143 -26 62 59 79 -16 12 0 2 46 -51 -125 1 -175 -229 -145 -192 -48 44 84 -126 48 -171 -139 31
5900C1J17k13K20q7n02L66J35q0K02j02p0q4K26l17N7J06K39l06O9J64k82J17
$$ 31 148 -65 155 68 -434 -68 67 -13 189 87 17 -67 159 -158 -101 5 244 -62 7 171 -111 6
5922Fm1J3J4l7R0J43O1l50pr7M05M4O9j82n8J99j29k64j09K36J14j78J36j91P9
$$ 6 -35 -22 -8 -45 45 188 249 -101 -108 -205 200 244 313 131 73 272 143 -121 -230 6 120 -58 78 -113 -34
5947c4k0%J50L3l9k32J16J28k9m8l9J44k46J62q1J31j77qK03K40l41j3j38K20
$$ -34 -54 -54 96 129 90 -142 -26 102 73 25 -14 130 -116 46 -35 96 -81 -89 114 354 13 0 -138 82
5971H2J24J4k40J30oj6j25J5j0n3J50Rj11l9K15m66M86k14J09l05M20q8j14j43
$$ 82 206 220 -20 110 104 88 -37 -22 -32 -85 65 74 -37 -76 139 -327 159 -55 54 -251 169 81 -33 -176
5995a76M60l0k10n0k5o6K33J21q0k88J5l0J30j73K51J0p7n0j20k1j06M29l43O8
$$ -176 284 254 44 -6 -31 -97 136 257 177 -111 -96 -126 4 -169 82 92 15 -35 -155 -176 -282 147 -196 -128
6019a28J47J54k84O3J27k47M58l52k2J26K66j59L7l36M68l11J39n4l7J76l01n
$$ -128 19 173 -111 -48 79 -168 290 -62 -84 42 308 149 186 -150 318 7 146 92 55 231 -70 -75
6041g5J33J31k90J7O2m9K9lO6j9j0J27m14J81L87l24J49k3j91p2L10j03l4l8J37
$$ -75 58 189 -101 -84 -22 -71 -42 -45 21 2 -8 119 -295 -114 273 -51 98 75 -116 -188 122 19 -15 -53 84
6066H4J31k42J2R5l48L62j34L12k11r7r1O1J23rMj97J01q0Q7K03j82l7N0K8l%
$$ 84 215 -27 -15 80 -268 94 -40 272 61 -36 -127 -66 57 48 52 -145 -44 -124 -37 166 -16 -53 -3 25 22 22
6092B2K19j27Jo4J12r8K91k46q2J91k55j92O9nK40R0k14N9m7J19l2j86L87k84
$$ 22 241 114 115 51 163 65 356 110 28 219 -36 -228 -159 -164 76 166 -48 11 -36 83 51 -135 252 -32
6116c2N8J11J51k57J8q4J60n0J8K56l21P2r4j52K27J07m62J19M71l26L6R7l3R
$$ -32 26 137 288 31 49 -35 125 75 93 349 28 100 6 -146 81 188 -274 -155 316 -10 26 123 90 99
6140I9j80O6k12K83k12K76j16L49l64nQ8q5o4J39J39k97L82n7m26L88n07K97J82
$$ 99 -81 -15 -227 56 -156 120 4 353 -11 -16 72 -13 -77 62 201 -96 286 229 -197 191 -316 -19 163
6163A63J6k2k54j13J93P7k70M94k01j05L83l30j7J96q6r2K05l18j15L53K0J06
$$ 163 179 157 -97 -210 -17 60 -210 284 83 -22 361 31 14 210 124 32 237 -81 -196 157 177 283
6185B83k86J63j2j57N0j64P0MJ3k1P8MJ57j29j5m5L04l16L9p4R2lk60J55j41L24
$$ 283 -3 160 148 -9 41 -123 -53 -49 -36 -57 21 25 182 53 38 -7 297 -19 20 -54 38 35 -225 -70 -211 113
6211A13j49r6M20k79mm7j43K69j91J17K24k11l7l6l5L3O7o2qJ52O3k54j18J76
$$ 113 -36 -132 288 9 5 -42 -185 84 -107 10 234 23 -14 -50 -85 -52 15 -47 -55 97 160 -94 -212 -36
6235c6k2L2j5M1j77J96j62J48m5p5L15n1J14k30M7k4M6m5r3J15k80K05K24j76
$$ -36 -58 -26 -41 0 -177 19 -143 5 -40 -115 200 149 263 33 80 56 102 57 -36 79 -201 4 228 52
6259E2R8m24L03j31J88j54j54K82k36j2L26k68J46j72R5L7J35j66r8m4J05J36
$$ 52 150 -274 29 -102 86 -68 -222 60 -176 -188 138 -130 16 -156 -61 -24 111 -55 -153 -197 -92 44
6281D4k01J13n5nL31j28k76J28N1J02j91n4L29j24j17Q9j14k11L94j37q1O3J8
$$ 44 -157 -44 -99 -104 227 99 -177 -49 2 104 -87 -141 188 64 -53 36 -78 -289 105 -32 -113 -50 -32
6304c2J11Jl1K3O9l91K59o1L1L5j87mL08k46J45m2M3J4K4L14j37m43j8qJ18J60
$$ -32 79 80 49 72 141 -250 9 -52 -21 14 -173 -177 131 -115 30 -12 31 45 69 383 246 -197 -215 -223 -105 55
6330E5k48N5N0pK94l69M33k78K8n0R7m7k9J88l34M9LK46n7r0j80K87l4J21k47
$$ 55 -193 -138 -88 -95 199 -170 263 -15 13 -37 60 13 -16 172 -162 -113 -110 136 79 -11 -191 96 62 183 -64
6355f4J24j57L9k57L21k09K91P2l35K81k03J35l6p6Jq2K07J91j69j4o1j03K69
$$ -64 60 -97 -58 -315 6 -203 88 160 -175 106 -97 38 2 -74 -73 -155 52 243 74 60 -1 -104 165
6378A65j14r5J70j58oJ53j03K64j48l51K37J0L6P2k12OK19J30l54J02J01j32o
$$ 165 51 -44 126 -32 -38 115 12 276 128 -223 14 24 60 132 -80 -74 145 275 -79 23 124 -8 -14
6401a4j86M82m2j94r6k2r5R2j05L0k8j9K18O5N8k54O4K45j21k72J60l0NLQ2JQ
$$ -14 -200 282 240 46 -50 -72 -167 -75 -180 -150 -178 -197 21 86 144 -110 -46 199 78 -194 -34 -64 -59 -56 26 27 35
6428C5q5J22k39L06k81N8K53k64m4K0J86r6J27R9J3l26J70l6K80k66O3r3q4J5
$$ 35 -50 72 -167 139 -142 -84 169 -95 -139 -119 67 -29 98 197 210 -116 54 18 298 32 95 2 -82 -67
6452f7O1r0K83r4j44J84j60O4k45L41j60k76K50j63K45j30K78j22l8j53P3J57
$$ -67 -6 -96 187 93 -51 133 -27 37 -208 133 -27 -303 -53 -216 29 -101 177 55 17 -136 -63 94
6474I4o5L0n2K72l57P9n8r2J92p6K33j98m8J30o7j64J44j22K31j72m7K18l11J9
$$ 94 29 59 7 279 -78 1 -57 -149 43 -33 200 2 -46 84 17 -147 -3 -125 106 -66 -113 105 -206 -187
6498a87J55J71q0l6p9K1j65L20o4o5n4J44J95m37K95k65R6n0L31o5j22j8J11j11
$$ -187 -32 139 59 23 -56 -35 -200 120 56 -9 -63 81 276 -161 134 -131 -35 -85 246 181 59 41 152 41
6522D1J75k23j21L33m1k72m7J27k8q9L09j70j00J29j24J41m6J25r7Kj2J76j56
$$ 41 216 -7 -128 205 164 -108 -155 -28 -56 -145 164 -6 -106 23 -101 40 -6 119 22 24 12 188 32
6545C2M4J01j37mj2r1J09Q2j24N4j12L67k47Jo2L8j12K69j62j57K49N0r5l1j70
$$ 32 76 177 40 36 24 -67 42 124 0 54 -58 309 62 63 1 39 -73 196 34 -123 126 176 81 50 -120
6570a20P4J25R6j82J06L7R2k32j46M84j70J86k51k46J39k00K57j28q2p9L84j93
$$ -120 -46 79 175 -7 99 136 228 -4 -150 334 164 350 99 -147 -8 -208 49 -79 -161 -240 144 -49
6592d9R0j40j5K70n9j78P3J1R1J42k11K11l37nJ98J55k26J45l19K9K0Q9m0J36
$$ -49 41 -99 -114 156 97 -81 -8 3 94 236 25 236 -101 -106 92 247 21 166 -153 -124 -104 -15 -55 81
6616H1QQ9j86j43J74J50j10r5O7k5k26L63l53K77r8j80L67k28k8J02k51Q7L27
$$ 81 89 178 -8 -151 23 173 63 -32 35 10 -216 147 -206 71 -27 -207 160 -68 -96 6 -245 -158 169
6639A69k4j20j42J6K8R6j53K22k2mj57P2k2J67k28p5J55J39k23K39M5m24K26R9
$$ 169 145 25 -117 -101 -73 23 -130 92 70 66 -91 -19 -41 126 -102 -177 -22 117 -106 133 178 -246 -20 79
6663G9j58Q9m6p1K24l47k1M84o2O4l08R0J60l07mK34q6P0Mj10K17r6j76K04j1
$$ 79 -79 10 -36 -107 117 -230 -251 233 171 235 -73 17 177 -130 -134 100 14 84 88 -22 195 99 -77 127 116
6688A16j17q8J55l1R6j71j20j04K86Q4j21J94j92M0Lj12QJ46J4r4J95j8j00K89
$$ 116 -1 -89 66 35 131 -40 -160 -264 22 106 -15 179 -13 27 30 -82 -74 72 86 -8 187 169 69 358
6712C58k94o1j79J86M2k76J84Mn9J32N6K8J5k75J48K41l95J54K96m84L19m0j97
$$ 358 64 3 -176 10 52 -224 -40 -36 -95 37 93 121 136 -139 9 250 -145 9 305 -179 140 100 -97
6735i7K66j9k3j04Rk3n72N11J73oNk16j76J88K9K25m0l78M81k23jNO6k48J95j28
$$ -97 169 150 127 23 32 9 -563 -52 121 115 120 -96 -272 -84 -55 170 130 -248 233 10 9 14 80 -168 27 -101
6761a01j00J81J09M2k5j07k40O4Q9M3J46k33J30l0k22P7L75k75Q8Q4p9J20p5n3
$$ -101 -201 -20 89 131 106 -1 -241 -177 -88 -45 101 -132 -2 -32 -254 -177 198 -77 11 95 16 136 61 8
6785HQ6l5j34Q9l63M29j47J35J85l65M9%J17K6k56L76l05L86q3j74N8l13J78M2
$$ 8 94 59 -75 14 -349 80 -67 68 253 -112 -63 -63 54 80 -176 200 -105 281 198 24 82 -231 -53 -11
6809a1K42k51k5Nl14J86K66k68J72J61k94K31r6K11l99N6pK09j00r2M00J5k73
$$ -11 231 -20 -45 -40 -354 -168 98 -170 2 163 -131 100 4 215 -184 -128 -135 74 -26 -118 282 297 24
6832B4j36j4N2J78k8l1k96K85%j25P6O7rJ22k04j2L7j47J65J37O0J5m44J30m2
$$ 24 -112 -126 -74 104 76 45 -251 34 34 -91 -15 52 43 165 -39 -51 -14 -161 4 141 201 216 -228 -98 -140
6857a40J27j23m0K89r8j90J38O3J8k98L67J58l1k90J32P0k38K49j88k06J64J85
$$ -140 -13 -136 -176 113 15 -175 -37 26 44 -254 113 271 240 -50 82 152 -86 163 -25 -231 -67 118
6879A18l29K18m0p9J37j67L4J24k50L14j72J44j90J08O6m6R1J94p4m17Q9M5M3
$$ 118 -211 7 -33 -112 25 -142 -108 16 -234 80 -92 52 -138 -30 36 -10 81 275 201 -216 -127 -82 -39
6902c9P0j23K06K8%m6l62K03j64L41p0j20L24K0l04k2J31j2k36J60m1Q1j56J83
$$ -39 31 -92 114 142 142 96 -266 -63 -227 114 44 -76 248 268 -36 -58 73 61 -175 -15 -56 25 -131 52
6926E2N3jj59k3J47n7R1OK3M6q0j70K61P6k76J03j52p8K20k25J59qp6Q2j20j76
$$ 52 105 104 -55 -78 69 12 103 109 132 178 98 -72 189 265 -11 92 -60 -138 82 -143 16 8 -68 14 -106 -282
6952b82K79l5j03J78j06k2J73j60J11J91l17L12j78J93j70qr0J35p1K01j91j09
$$ -282 -3 -38 -141 37 -69 -91 82 -78 33 224 -93 219 41 234 64 56 -34 101 30 231 40 -69
6974f9L0l0K35k70N3%O0j40O7n9J83Q0k9k70L65k80P7R2j35k24J21M3N2j27l8
$$ -69 -39 -69 166 -104 -51 -51 9 -131 -64 -123 60 140 111 -159 206 -74 3 95 -40 -264 -143 -100 -48 -175 -213
6999b13J69o3K16j30R2j01K34J3m26J69l9K03j52J9J64l49J58J6q6L8K22j30l2
$$ -213 -44 -107 109 -21 71 -30 204 217 -209 -40 -79 124 -28 -9 155 -194 -36 -20 -106 -68 154 24 -8
7022hL84l53k70J66K20k71L19l73L06k79N0M37k71P0M2j68n6M8p8LK11k26K8M
$$ -8 376 23 -247 -81 139 -132 187 -186 120 -159 -109 328 57 127 169 1 -55 -7 -85 -82 129 -97 -69 -65
7046f5J10q9L6k20K0K44k7N1J26m44M21n2j9P7j55j38M96l46k43K75r4J47j48
$$ -65 45 -44 -8 -228 -208 36 9 60 186 -258 163 111 92 169 14 -124 372 26 -217 58 -36 111 -37
7069c7K17j87J23L53o11Q0L7J87o67N84J69l73J17n4J35j6m62J83J9Q5r9J74J68
$$ -37 180 -7 116 469 -142 -62 -25 162 -505 79 248 -125 -8 -62 73 57 -405 -222 -203 -118 -217 -43 125
7092A25r2j20K3J29J1J16j82j24J99j34L5K46l04N7J86j27J00j31R8j8o2j62j91
$$ 125 33 -87 -64 65 76 192 10 -114 85 -49 -14 232 -72 -15 171 44 144 13 111 93 31 -131 -322
7115c22J50K86O9l75K63N4k64j48O48l64m5k05K05K53k31Q2J3R4k01K1j02K78
$$ -322 -172 114 183 -192 71 125 -139 -287 361 -3 -48 -253 -48 205 -26 56 69 163 -38 -17 -119 159
7137A59o1j43J06q2oJ44Q9k61Q0n7p5J84j56K01j53j20J37k48l2L12L04l90O8
$$ 159 98 -45 61 -21 -27 117 206 -55 25 -32 -107 77 -79 122 -31 -151 -14 -262 -294 18 322 -68 0
7160@k82M15j24j57J39o4l1J10p1J02n2m3l3Nr2Q1J22p6q7Q4N7j11K25k07L0J1
$$ 0 -282 133 9 -148 -9 -73 -104 6 -65 37 -15 -58 -91 -86 -178 -97 25 -51 -138 -54 3 -108 117 -90 -60 -49
7186d9P4k29K76j9j57J3q8K7k3J64K89j85k71L00n8j63J41q1p8K14J05l97J70
$$ -49 25 -204 72 53 -104 -91 -179 -152 -175 -11 278 93 -178 122 64 -99 42 -39 -117 97 202 -195 -25
7209b5r9r4J10n5K82j83j17L26K2j84J01m1J7N9M6K10o91L49O5l8k19K15k08q0
$$ -25 -124 -218 -108 -163 119 -64 -181 145 167 -17 84 43 60 119 165 375 -316 33 98 60 -159 56 -152 -232
7233b32Q9K65N7l22L1l6p8M73k32j12J98o0j71L14m65J10L19m5k93K93j45j40
$$ -232 -143 122 179 -143 -112 -148 -226 247 15 -97 101 41 -130 184 -281 -171 148 103 -190 103 -42 -182
7255a82L04l92K92j1lk3j24L8O4Q1j5J20l7m4j51J1p0pK32J72j67m0k28K03k29
$$ -182 122 -270 22 11 8 -15 -139 -101 -37 44 29 149 112 68 -83 -72 -142 -149 83 255 88 48 -180 23 -206
7280b06J98j71Q8o9J20j31M95k80o5J81k12J68j07J27j53L2n5k7J82Q4j62j8J94
$$ -206 -8 -179 -91 -160 -40 -171 324 44 -21 160 -52 116 9 136 -17 15 -40 -67 115 199 37 19 213
7303B13m21J24R8J6j6j60o6R3O2L21k86k59M21k06K89j97LN6l14K60Rq4J74j22
$$ 213 -208 -84 14 30 14 -146 -212 -119 -57 264 -22 -281 140 -66 223 26 29 85 -229 31 40 -44 130 8
7327Hq4L24k50K44j69K96n26N21k17k64K63Q2J58n95M02l64Q2M21m29j82L24o1
$$ 8 -76 248 -2 242 73 369 -157 364 147 -117 146 228 386 -209 193 -171 -89 332 -97 -279 45 -16
7349a6j22K70j82J25Kj12J1K82k72l5q5J15K67l73J36QO9O8j02j73K80l00J04
$$ -16 -138 132 -50 75 77 -35 -24 258 -14 -49 -134 -19 248 -125 11 19 88 156 54 -119 161 -139 -35
7372c5k07m5K19L03l01J13P8k83M0Q6J6N7k18L44k49J68J28j57J40l44J16K10
$$ -35 -242 -287 -68 235 -66 47 125 -158 -118 -32 -16 41 -177 167 -82 86 214 57 197 -147 -31 179
7394A79k99J63K3J05j21k01j22L09j16j64K14l8M2Q0K33m70o4K48L4j94L51n6
$$ 179 -120 43 66 171 50 -151 -273 36 -80 -244 -30 -68 -26 54 287 -183 -247 1 35 -159 192 136
7416A36j32n2j2j43O7O7m3K19l21J47M2k62L97k45J70KM0k03J22j56J91j07mJ80
$$ 136 4 -48 -60 -203 -136 -69 -112 107 -214 -67 -25 -287 110 -135 35 37 77 -126 -4 -160 31 -76 -80 100
7440A00j51M3J77l33K39k2m5o0%K0J04j01k6J26k05K37j45Q1j07j7J34k5k30L81
$$ 100 -51 -8 169 -164 75 53 8 -52 -52 -32 72 -29 -55 71 -134 103 -42 39 -68 -85 49 24 -206 175
7464A75k06j4Q4q8j57J96j99L35k08J3J45k70K31k42n1K30N0k22J88j04J49l08
$$ 175 -31 -45 39 -49 -206 -10 -209 126 -82 -69 76 -194 37 -205 -256 -26 24 -198 -10 -114 35 -273
7486b73K03O2r8J51k8K38m49J04r5J47o5L5J91k61p1N0M07j97j50J33k10M62n82
$$ -273 -70 -8 -106 45 17 255 -194 -90 -185 -38 -103 -68 123 -138 -209 -159 248 51 -99 34 -176 286 -296
7509b96K94L5k7N8k45J41j88K21J13j90J75Q7l96K69k04K54l39K71j82J45Q2k59
$$ -296 -2 33 6 64 -181 -40 -228 -7 106 -84 91 178 -218 51 -153 101 -238 33 -149 -4 78 -181
7531a81J70K5J46o9r9R0NK24p40L52K4K22l00L06j89Q5j54M1K68J4l95N50l47
$$ -181 -11 14 160 91 -8 82 87 311 -429 -77 -53 169 -131 175 -14 71 -83 -42 226 240 -155 395 48
7554D8m8J72k18j73L27k15m7K49j73j31K30M1j88r5J53O3j64K29j59J45J2O2j50
$$ 48 0 172 -46 -219 108 -107 -154 95 -78 -209 21 62 -126 -221 -68 -5 -169 60 -99 46 58 120 -30
7577c0k2k35L61P4l16L0J44q9K71k70J40o5Q2M1j71J32P8k19J85j33j23M9j04
$$ -30 -52 -287 74 148 -168 -138 6 -83 188 -82 58 -7 75 116 -55 77 155 -64 121 -12 -135 -86 -190
7600a90L10J6l51K05l5q9M33k96M2L7M1r8J25l01M53m02K87n7j03qj56Q0R6L8
$$ -190 120 136 -215 -10 -45 -134 299 3 45 82 123 25 150 -151 302 -100 187 130 27 19 -137 -57 39 77
7624G7r4O1L0j93P5L10n73L53l60M23ORM3j00j6r9N8k23J27J20N2j01L3j11p2
$$ 77 -17 44 74 -119 -44 266 -307 46 -314 109 115 124 167 67 51 -48 10 -213 -86 34 86 -15 18 -93 -165
7649a65Q6J99l06L24p0L2l55J45K32j66r9L19j68J46l12q6L56j89N5R2j21O0K20
$$ -165 -79 120 -186 138 68 100 -255 -110 122 -44 -143 176 8 154 -158 -244 112 -77 -22 70 -51 9 229
7672B29m16K92j69K9k71L54J45k11M0m9n2O4m9m8J70l04J9L80j64j63K49l8M8
$$ 229 -187 105 -64 -35 -306 48 193 -18 22 -27 -79 -15 -64 -112 58 -246 -227 153 -11 -174 75 37 85
7695H5P4K2l12J20J68j67lP1P3j55N3j6n7J3LL3j59J38j78K66p5M0J13j80n7Q6
$$ 85 159 181 -131 -11 157 -10 -13 58 131 -24 29 13 -44 -31 -28 5 -154 -16 -194 72 -3 37 150 -30 -87 -1
7721aL05m16K90l43K43J89k78J24k04K01k29L11l41m3K46r5J49k55K30k55J20
$$ -1 304 -112 178 -165 78 267 -11 113 -91 110 -119 192 -149 -192 54 -41 108 -147 83 -172 -52
7742e2N7mj47J91m9k16N4O1K32l8j74jJ05J58q3K5r2j66L82j49j72j10K59j06
$$ -52 5 1 -146 45 -4 -220 -166 -105 127 89 -85 -86 19 177 94 119 27 -139 243 94 -78 -188 71 -35
7766c5M5J69k14l9O4j94J98J01j54M9K51l71L29l75K29k05R7K25n8J72j27j24
$$ -35 10 179 -35 -74 -10 -204 -6 95 -59 -10 241 -130 199 -176 53 -152 -55 170 112 284 157 33
7788C3j2K1JJ36l12K41m3j22j51L71k93J19J30k06J03p0J36J22j80q5Q4k00J56
$$ 33 21 42 43 179 -133 108 65 -57 -208 163 -130 -11 119 -87 16 -54 82 204 24 -61 23 -177 -21
7811b1k55K98K42m2l3k89J68j21N4j69J83J9j84J81q2J6j79J79j4J07jk15M6L79
$$ -21 -276 22 264 222 189 -100 68 -53 1 -168 15 34 -150 31 -51 -35 -214 -35 -49 58 57 -158 -112 267
7835B67j69MJ6j31J71j87j54J35J54N3M4r0k75L61k78R9k02K51J17j22j47L61
$$ 267 98 102 118 -13 158 -29 -183 -48 106 159 203 113 -162 199 -79 20 -182 69 186 64 -83 278
7857B78k86n1M0J7o1J87R5k4m45K11J75M2j86%J84l12J27l0P4J12j12K70k04j58
$$ 278 -8 -59 -19 -2 -63 124 219 195 -250 -39 136 178 -8 -8 176 -136 -9 -39 35 147 35 305 101 -57
7881e7L3K7p0M5J68j94j77L64J3k46N9l7K59k43lo0N7K4J90m4K8k15K31o7m9j95
$$ -57 -24 3 -67 -22 146 -48 -225 139 152 -94 -35 -72 187 -56 -59 -119 -62 -38 152 108 136 -79 152 85 36 -159
7907a59K09p7j61KK12N9j49J66j43J4L19m31N0K77j34o8K3j67J49M6J9r5R2jj62
$$ -159 50 -27 -188 -186 26 85 -64 102 -41 -27 292 -139 -89 188 54 -14 9 -158 -9 37 56 -39 53 52 -110
7932a10J94M2j40k17K19p5L03k47J92k28J00J79L4L8m35K52k28J12r7q4J28L2
$$ -110 84 126 -14 -231 -12 -87 216 -31 161 -67 33 212 246 284 -151 101 -127 -15 -112 -196 -68 -36
7954c6R4j13M2O4L9Jm0J19j49j3K9k50M44m42K58p6K69m2J8k52j31L42j00P6j92
$$ -36 58 -55 -13 51 90 91 51 170 21 8 37 -213 231 -211 47 -29 240 198 216 -36 -167 175 75 151 -41
7979d1Q1k66K54j01j60K06k00K45J03j91r0L15k95J51P9p4k52L12j35J79k17M56
$$ -41 40 -226 28 -73 -233 -27 -227 18 121 -70 -160 155 -140 11 90 16 -236 76 -59 120 -97 359
8001C59j87j65m4j07J3K39o3k1m2r5j60L10j30P2J15k65J42o6J54j58j61K95O2
$$ 359 172 7 -37 -144 -131 108 45 24 -18 -113 -273 37 -93 -21 94 -171 -29 -95 59 -99 -260 35 97
8024I7n13K36K30J74j95j08k8R0K16n8p0N2r4Qj6q6J12p5p4K08j45J49J12l85
$$ 97 -416 -180 50 224 29 -79 -107 -17 199 141 71 123 29 37 21 -65 47 -28 -102 106 -39 110 222 -163
8048a63p3M64k04J27J85m46m22J110n00m54M26N7k21J85L6L1n3r5K3j02J85o0
$$ -163 -236 228 24 151 336 -110 -532 578 78 -376 50 107 -114 71 107 138 85 -10 13 -89 96 36
8070C6lj09J24J17L4k69J10k79K08j36J14O9j79J42j96K34J20j03J87j62L7o5
$$ 36 33 -76 48 165 199 -70 40 -239 -31 -167 -53 16 -163 -21 -217 17 137 34 221 59 96 31
8092C1n5Q6j18M6m8nJ66j73J45l0R7j33L9j43j3k3K21P2k56Q5Lp2k10M51j63J94
$$ 31 -24 62 -56 -10 -58 -63 103 -70 75 45 142 9 48 -95 -108 -131 90 162 -94 -9 -6 -78 -288 163 0 194
8118A94l31L87k73j20L42m04R9K20l12K65Jj91J1J07k6M62o76L63k11K46M4j24
$$ 194 -137 250 -23 -143 199 -205 -106 114 -198 67 68 -123 -112 -5 -31 431 -245 118 -93 153 197 73
8140G3P0j59j03L07k21J9j42K67J40k49m6L03j32j72J86k23L8l7N0J64k03n3J3
$$ 73 143 -16 -119 188 -33 -14 -156 111 251 2 -44 259 127 -45 141 -82 -44 -81 -31 133 -70 -123 -110
8163a10K55k10J57j90k3r0L2J29M7j17J21n5J13p8k23R4L7k0K15j32J89q9o5J85
$$ -110 145 -65 92 -98 -121 -211 -179 -50 -3 -120 1 -54 59 -19 -242 -148 -111 -131 84 -48 141 52 -13 172
8187A72j13j51N2P1
$$ 172 59 -92 -40 31
8191C1
$$ Imaginary data points
##PAGE= N=2
##DATA TABLE= (X++(I..I)), XYDATA
0@%%%%%%%%%%%%%qJ6j6J6j8K6l2M0m8N6o4P2q8J04j20J36j54J76k00K27k58K91
$$ 0 0 0 0 0 0 0 0 0 0 0 0 0 0 -8 8 -8 8 -10 16 -16 24 -24 32 -32 40 -48 56 -64 72 -82 94 -106 121 -137 154
35A54l26L66m11M60n14N72o35P03p76Q58r50J048j155J272j401J545j703J876
$$ 154 -172 194 -217 243 -271 301 -334 369 -407 451 -499 549 -606 666 -735 810 -893 983
53I83k069K286k532K811l130L505l947M477n129N951p025Q494j0629J4031k0289
$$ 983 -1086 1200 -1332 1479 -1651 1854 -2093 2384 -2745 3206 -3819 4675 -5954 8077 -12212
68a2212L5431j38673j42529L56388R8836k25631j23554J78251R1898j45613o5736
$$ -12212 23219 -115454 -257983 98405 197241 -28390 -151944 26307 118205 -27408 -93144
79i3144J14241L2950k1671k6239m3917j5882N7768P7066l3672j19688K6939Q4001
$$ -93144 21097 54047 32376 6137 -37780 -53662 4106 81172 47500 -72188 -45249 38752
91C8752k9031l1070K7363J0907k3297j4894K6599k3119k3980R2992K4362j32469
$$ 38752 9721 -21349 6014 16921 -6376 -21270 5329 -17790 -41770 51222 75584 -56885
103e6885m1418J17779P6158q8993q0428Q0141M8166p2035j7921M5925K4837j2278
$$ -56885 -98303 19476 95634 6641 -73787 6354 54520 -17515 -35436 10489 35326 23048
115B3048l4802j4795M628L7495M0171n8012n1383O2510K4218o3364o868Q1337
$$ 23048 -11754 -26549 -21921 15574 55745 -2267 -53650 8860 33078 -30286 -37154 44183
127D4183J0397j15554r899J30535r613j16193L1104J08636l7400j26234L8786
$$ 44183 54580 -60974 -70873 59662 50049 -66144 -35040 73596 36196 -90038 -51252
138e1252J40274l3775j16034K3927P4490j4335m9428J8740M1476k6704k5011J7833
$$ -51252 89022 55247 -60787 -36860 37630 23295 -26133 -7393 34083 7379 -17632 201
150B01o988N53L0955m285m1129j1938M1878J4086l9355P015L2383k9915k7218
$$ 201 -6787 -6234 24721 20436 -20693 -32631 9247 23333 -16022 -9007 23376 -6539 -33757
163c3757L3329K6175k7207j9989L4747L510m8819J3447N4703j0717m8188L156
$$ -33757 -428 25747 -1460 -21449 13298 16808 -32011 -18564 36139 25422 -22766 -19610
175a9610L9119p175l0719K2267K2091k6121j7095J2757J1451j584J131j037k1505
$$ -19610 19509 12334 -18385 3882 25973 -148 -17243 -4486 6965 5381 6512 5475 -16030
188a6030J455L1722j0740l0567K1587L2542l0640m6152L6408N8697l5878n4255
$$ -16030 -14575 17147 6407 -24160 -2573 29969 -671 -46823 -10415 48282 12404 -41851
200d1851K9963M2031k2942l3619K5106L0063k5623j9446J7049L521m622J0593
$$ -41851 -11888 30143 7201 -26418 -1312 28751 3128 -16318 731 4252 -370 10223
212A0223M488k2240j5234K9580J7630l0776j0276K2993M251j8212p939J7189Q000
$$ 10223 14711 -7529 -22763 6817 24447 -6329 -16605 6388 10639 -7573 -15512 1677 9677
225I677j0373P84q093j0396K3860J6672k2714k2247J7048K9713k0376k8479K9045
$$ 9677 -696 88 -8005 -18401 5459 22131 -583 -22830 -5782 23931 3555 -24924 4121
238D121K2360k5036j9600J3507K0801r232j3109J2768n049j3200J4045P712r355
$$ 4121 26481 1445 -18155 -4648 16153 6921 -6188 6580 1531 -11669 2376 10088 733
251G33q202M564J0920j3283p817J9452m57r962J343l983K365O153M892j821j9119
$$ 733 -7469 -2905 8015 -5268 -13085 6367 5910 -4052 -2709 -6692 -4327 1826 6718 4897 -14222
266a4222Q428K2580j6557j3099J6201J2492j1339k2113J3512K5947j8838j3874
$$ -14222 -5794 16786 229 -12870 3331 15823 4484 -17629 -4117 21830 2992 -10882
278a0882J3828K411o222o227Q385R908j6914k507J2407p261N5L818j357K639p568
$$ -10882 2946 5357 -865 -7092 1293 11201 -5713 -8220 4187 -3074 -3019 799 -558 2081 -5487
293e487M96O127l048Q214l441j4697J2401Q935q918o376L969J6781r319k4761
$$ -5487 -4991 1136 -1912 6302 2861 -11836 565 9500 582 -5794 -1825 14956 5637 -19124
307a9124J8640J9267j4001j4118J505J8800l201k2150J2042J3071j0182o276k633
$$ -19124 -484 18783 4782 -9336 -7831 10969 7768 -14382 -2340 10731 549 -5727 -8360
320h360R071O521j1788P47L020j887N201p318N80J3190p658p879L625O517N501
$$ -8360 711 7232 -4556 -3809 -789 -2676 2525 -4793 -4213 8977 1319 -6560 -2935 3582 9083
335I083j3077k251J7989p594j2867O705J0056K601j7311l676K0444m256j3876
$$ 9083 -3994 -6245 11744 4150 -8717 -2012 8044 10645 -6666 -10342 10102 5846 -8030
348h030M344O984L285j1810o691J6112J518q998j382L7Q465r96j1227P237P185
$$ -8030 -3686 3298 6583 -5227 -11918 4194 5712 -3286 -4668 -4631 3834 2838 -8389 -1152 6033
363F033l148n588n145J2511O490j5305k99R140Q57m999p024J0203O757j5218j271
$$ 6033 2885 -2703 -7848 4663 11153 -4152 -4451 4689 5546 547 -6477 3726 10483 -4735 -6006
378f006R533L9m424n790P909N770j3522j567J0295K838m663j0073N240J3393p021
$$ -6006 3527 3566 -858 -6648 1261 7031 -6491 -8058 2237 5075 412 -9661 -4421 8972 1951
393A951j0014L635J0105M101j5466n503J7558N432j0767r631N944J4365p059j3105
$$ 1951 -8063 -4428 5677 9778 -5688 -11191 6367 11799 1032 -8599 -2655 11710 4651 -8454
407h454O840Q536k639q493j689R855q89p409L753J297l381j274L080N547n582
$$ -8454 -1614 6922 4283 -4210 -5899 3956 3067 -4342 -589 708 -2673 -3947 -867 4680 -902
422i02p359P316O649m529p243J713J1516j019j2433Q89R908L811p461p445P253
$$ -902 -8261 -945 5704 1175 -6068 -4355 7161 6142 -6291 -5402 4506 8317 856 -6589 664
437F64O103n315l467O88M575j292n327K988K244l324p82J483K116k402n365M986
$$ 664 6767 1452 -2015 -1327 3248 1956 -3371 -383 1861 -1463 -2245 -762 1354 -1048 -6413 -1427
453a427N964k916o857k576J0812O803j2552p538R084J2602m323j8221K620K0805
$$ -1427 4537 1621 -5236 -7812 3000 9803 -2749 -10287 -1203 11399 7076 -11145 -8525 12280
467A2280J50j7671p601J5551J3321j5011j2899J0580Q882l611q763M1P032j933
$$ 12280 12430 -5241 -12842 2709 16030 1019 -11880 -1300 7582 3971 -4792 -4751 2281 348
481C48j548K976o230j708P831M664n348j3217O382J9423p067j7558K037J6933
$$ 348 -1200 1776 -4454 -6162 1669 6333 985 -12232 -5850 13573 6506 -11052 -9015 7918
495G918O597j9181r359J8988Q425j1119j0742L273J4664k811j2298K811M305J154
$$ 7918 14515 -4666 -14025 4963 13388 2269 -8473 -5200 9464 6653 -5645 -2834 1471 2625
509B625j592n142L543R93k350L596m304j885O108j798q77j18l76L342l883J03
$$ 2625 1033 -4109 -566 427 -1923 1673 -2631 -4516 1592 -206 -1083 -1201 -1577 1765 -2118 -2015
525b015Q201o464o226P009O392j292j3130J388J8467n214j5754L222J1184L814
$$ -2015 6186 -278 -6504 505 6897 5605 -7525 -6137 12330 7116 -8638 -5416 5768 9582
539I582j3471n066J3484j241o755L700r79j817j84L859M854j2923l513J8416J431
$$ 9582 -3889 -8955 4529 3288 -3467 233 -746 -2563 -2747 1112 5966 -6957 -10470 7946 9377
554I377j5283o407J3088J6330j5730j7671J4656J4424n150j4902l048J8849L363
$$ 9377 -5906 -12313 775 17105 1375 -16296 -1640 12784 7634 -7268 -10316 8533 11896
567A1896j6255k563O785O918k193j0532L259M442k098K878l928l791N020J196
$$ 11896 -4359 -6922 -137 6781 4588 -5944 -2685 1757 -341 2537 -1391 -5182 -162 1034
581A034R43m995m550J1337J453r504M75L684M898l393o249P153Q46n697M464J199
$$ 1034 1977 -3018 -7568 3769 5222 -4282 -3807 -123 4775 1382 -4867 2286 3132 -2565 1899 3098
597C098l311j156J339N865m698p182Q263K031o038J1Q29K725l293k227P658m138
$$ 3098 -213 -1369 -30 5835 1137 -6045 2218 4249 -1789 -1778 -949 1776 -1517 -3744 3914 -224
613b24p355P723N012m454q181K640J4038m652j4077N104J0915J143r861o826J1940
$$ -224 -7579 144 5156 702 -7479 -4839 9199 4547 -9530 -4426 6489 7632 -2229 -9055 2885
628B885O995r217n787K221Q052J493j0280n49O119O52r20m625j9L822o77Q39j647
$$ 2885 9880 663 -5124 -2903 5149 6642 -3638 -4187 1932 2584 1664 -2961 -2980 842 165 1004 -643
645f43m416L761M818j961n381k168R075L373j0104k042P198M058l389p113L080
$$ -643 -5059 -1298 3520 1559 -3822 -5990 3085 6458 -3646 -5688 1510 5568 2179 -4934 -1854
660a854O996j855l586k139J998N325k821m903O46L857K080n180l763O398J837
$$ -1854 5142 3287 -299 -2438 -440 4885 2064 -2839 -2193 1664 3744 -1436 -5199 1199 3036
675C036m577k217L135L112m328k415N828K66m311L35L511J642m247j949N938N04
$$ 3036 -1541 -3758 -623 2489 -1839 -4254 1574 1840 -2471 -2136 1375 3017 -1230 -3179 2759 3263
691C263l879j147K512L412k997l463K702K430j138l020j298N020k66m729J35K900
$$ 3263 -616 -1763 749 4161 1164 -2299 403 2833 1695 -1325 -2623 2397 2131 -2598 -2463 437
707D37J373l213k835N060J643n474M58L000J357k315k997M968J828m830o6K383
$$ 437 1810 -1403 -4238 822 2465 -3009 -2551 449 1806 -509 -3506 1462 3290 -1540 -1606 777
723G77K270j679l968L498K774l168j359K74K560P07n253O15M310r03k535k668
$$ 777 3047 1368 -2600 898 3672 504 -855 -581 1979 2686 -2567 -1952 2358 1455 -1080 -3748
739c748L674M239o609k411M938J848j492m535J791O751m214l731L489J925M97
$$ -3748 -74 4165 -2444 -4855 83 1931 439 -4096 -2305 4446 232 -3499 -10 1915 2412
754B412m205j87O051k295l067J934K51J625k448k346M712m26l752Q54L84K782
$$ 2412 -1793 -1980 4071 1776 -1291 643 894 2519 71 -2275 2437 2011 -1741 -887 -503 2279
770B279k344m718N318J799l796o61k38M467l05o490L846L620k557o47k139M050
$$ 2279 -65 -4783 535 2334 -1462 -2123 -2361 2106 1801 -4689 -843 2777 220 -427 -2566 1484
786A484K194o228K259K734j729P49k672J801L225n341J034K457j878P67l177J370
$$ 1484 3678 -2550 -291 2443 714 1463 -1209 592 3817 -1524 -490 1967 89 856 -2321 -951
802i51M030m421j884L558R8O95m087m61P234l499l451K172J461K537m322k841
$$ -951 3079 -1342 -3226 332 430 1125 -2962 -3423 3811 312 -3139 -967 494 3031 -1291 -4132
818d132P477m17m326R10M51L680k257m485M378J202k248J78k416L180J015n085
$$ -4132 3345 2928 -1398 -488 -37 3643 1386 -3099 1279 2481 233 411 -2005 1175 2190 -2895
834b895K330J108q63R66l445K407K247m665J672J868j063L30k190K727K742n516
$$ -2895 -565 543 -320 646 -2799 -392 1855 -2810 -1138 730 -333 -3 -2193 534 3276 -2240
850b240Q90L795j117r03k401K661L620n044o74K842k23P40l622J57M127k466j641
$$ -2240 -1350 2445 1328 425 -1976 685 4305 -739 -1413 1429 1206 1946 -1676 -1519 2608 142 -1499
867a499O20l46K810k290k462L788j44j584k8j9L066k513k591M989O83l627j99
$$ -1499 -879 -1225 1585 -705 -3167 621 477 -1107 -1135 -1154 1912 -601 -3192 1797 2480 -1147 -1346
884a346J595L639l378l720M952J493l074r11j22L162k90l953J267J066j9P0k681
$$ -1346 249 3888 510 -3210 1742 3235 161 -750 -872 2290 2000 -1953 -686 380 361 431 -2250
901b250J287K142j749j16m72M58J384k352J216J746k341j4J942O19j539k283L461
$$ -2250 -963 1179 -570 -686 -1158 -700 684 -1668 -452 1294 -1047 -1061 881 1500 -39 -2322 1139
918A139K629m186j212K721J572j588k883J805J956k060k97N86j125J174j52p55
$$ 1139 3768 -418 -1630 1091 2663 1075 -1808 -3 1953 -107 -404 182 -943 231 79 -676
934f76o01j66K529j122k362K295M68j320M3J320R59l036K24M846j599m727J607
$$ -676 -1277 -1443 1086 -36 -2398 -103 365 -955 -912 408 1367 -1669 -1445 3401 1802 -2925 -1318
951a318M470O14o148o93O548m8m854j121K733L081l044l183K076J529R8j090k569
$$ -1318 3152 3766 -2382 -3075 3473 3425 -1429 -2550 183 3264 220 -2963 -887 642 740 -350 -2919
968b919K358J526j629J0m78O57L57p13K275j468l187M846K227m367k586K885N934
$$ -2919 -561 965 -664 -654 -1132 -475 -118 -831 1444 -24 -3211 1635 3862 -505 -3091 -206 5728
985E728m005p018N586M700l809m021R69N194j780n020L699P05k782J923P31j629
$$ 5728 1723 -5295 291 4991 1182 -2839 -1870 3324 1544 -3476 223 928 -1854 69 800 -829
1001h29j382J090L877l695l221N599M48l898J086J554J389l540k08N977l300m065
$$ -829 -2211 -1121 2756 -939 -4160 1439 1887 -2011 -925 629 2018 -1522 -1730 4247 947 -3118
1017c118M639J857k385l548J528N558m035l917L811P47n29j720j828L625P0j908
$$ -3118 1521 3378 993 -2555 -1027 4531 496 -3421 390 1137 608 -1112 -2940 685 755 -1153
1033a153P69j323J425J341k668J550O43k831K263Q97K89j389k242O353j0p224
$$ -1153 -384 -1707 -282 1059 -1609 -59 584 -2247 16 913 1202 -187 -2429 3924 3914 -3310
1049c310J410M639R82n351l616Q576K247r152M92N063k27k624k350L990L34m316
$$ -3310 -1900 2739 3721 -1630 -5246 3330 5577 -3575 -3083 1980 1753 -871 -3221 769 1103 -3213
1065c213L903P67m546K325K055m61k711j239O168j163n949M522K324l040l52P94
$$ -3213 690 1457 -3089 -764 1291 830 -1881 -3120 3048 1885 -4064 458 2782 -258 -610 184
1081A84K534k563k469N554j221n056L250J768q74k327q68M670k201l306L290j92
$$ 184 2718 155 -2314 3240 2019 -3037 213 1981 1107 -1220 -2088 2582 381 -2925 365 173
1097A73j199N55j009J729k12j418J711j151P69J774l575J274L007j809j484q77
$$ 173 -1026 -471 -1480 249 37 -1381 330 -821 -52 1722 -1853 -579 2428 619 -865 -1742
1113a742M428J179p189J827O339l379l841R51M424r43n684K654M180m732n37K109
$$ -1742 2686 3865 -3324 -1497 4842 1463 -2378 -1427 2997 2054 -3630 -976 3204 -1528 -2065 44
1129D4J180j921j714L876l80l671K530K411l512K13J644Q73j866j156L582n69
$$ 44 1224 -697 -2411 1465 1085 -2586 -56 2355 -1157 -944 700 1573 -293 -1449 2133 1564
1145A564l598K969J505l175q78K340K684m623j903O029q10m271O46L352o39k998
$$ 1564 -2034 935 2440 -735 -1613 727 3411 -1212 -3115 2914 2104 -2167 -1521 1831 1192 -1806
1161a806n58L844j510k584K253Q26o11m14M38M35q96Q99R88k466M88L161j783
$$ -1806 -2364 1480 -30 -2614 -361 465 -146 -560 -122 313 -583 316 1304 -1162 -674 2487 704
1178G04j830J189K491j528l401K433L086l345j784K731J036k395j732L239O72
$$ 704 -1126 63 2554 1026 -2375 58 3144 -201 -1985 746 1782 -613 -2345 894 1566
1193A566l883P60L013j316j768K05K298r19j999K678J5k116K084N70j327n9R92
$$ 1566 -2317 -1557 1456 140 -1628 -1423 875 -44 -2043 635 650 -1466 618 1188 -139 -198 794
1210G94J224k518o71L831j448k703J025K232k44l467Q87L798l330k384L567N16
$$ 794 2018 -500 -1171 2660 1212 -1491 -466 1766 1522 -1945 -1058 2740 -590 -2974 593 1109
1226A109k259p43J570J800l349mL178j464p36Q63M4N93r34N22J039k394J993J603
$$ 1109 -1150 -1893 -323 1477 -1872 -1876 1302 -162 -898 -35 9 602 -332 190 1229 -1165 828 2431
1244B431l464P04J743l44j245j487L360L77m746K050K511k208j233L68K355q59
$$ 2431 -1033 -329 1414 1070 -175 -1662 1698 2075 -2671 -621 1890 -318 -1551 -1183 1172 313
1260C13l439L206J634l413J042M12P39l76j293K157k13k163K779o01j535J753
$$ 313 -3126 80 1714 -1699 -657 -245 494 118 -1175 982 769 -1394 1385 784 -751 1002
1276A002l53m9q07l84L029k185k331L849r95j751L20N52J238k625p20M475k396
$$ 1002 649 600 -207 -591 2438 253 -2078 1771 776 -975 -655 -103 1135 -1490 -2210 2265 -131
1293a31k482K553L71N1j680j58L823k614j440L049j193MQ31j344J373q26k0J779
$$ -131 -2613 -60 311 362 -1318 -1476 2347 -267 -1707 1342 149 153 984 -360 1013 187 167 1946
1311A946l045R89K388k848K10R14o2J88k509J698K319l926L93K086r93l5j152
$$ 1946 -1099 -110 2278 -570 -360 554 492 680 -1829 -131 2188 -1738 -1345 741 -252 -287 -1439
1328a439J454J384l186J261J651j646O67q7m4J209j833J043P05j651J621l19j855
$$ -1439 15 1399 -1787 -526 1125 -521 146 59 15 1224 -609 434 1139 -512 1109 790 -1065
1345a065K039m42k86j87r97K424j442k476K965P9j610J76l1K065j503k488L659
$$ -1065 974 532 246 59 -938 1486 44 -2432 533 612 -998 -822 -853 1212 -291 -2779 880
1362H80j59j791Q68N4J163r73j319K628m70j657J496l64M41J99j534J003J41m72
$$ 880 721 -1070 -202 -148 1015 42 -1277 1351 881 -776 720 356 797 996 -538 465 606 134
1380A34N23j478L30J513j491k91K18L68M93j775N87J869j898p2R05k07O24q47
$$ 134 657 -821 -491 1022 -469 -760 -542 -174 319 -1456 -869 1000 -898 -970 -65 -272 352 -495
1398d95J64J164j022K04J119q36L06o33K6J244j213L01J35o72J050m49j293R64
$$ -495 -331 833 -189 15 1134 298 604 -29 -3 1241 28 329 464 -208 842 393 -900 64
1416F4K43j53p60r00K023l70j422P08M23M88j063p85J885J93j473O20N39N96q93
$$ 64 307 154 -606 -1506 517 147 -1275 -567 -144 344 -719 -1504 381 574 -899 -279 260 856 -37
1435c7m76J565K50j571L07P55L78p66j391J513P79j591l41J25J300o12j774J313
$$ -37 -513 1052 1302 -269 38 793 1171 405 -986 527 1306 -285 -626 -501 799 187 -1587 -274
1453b74O12o79j92m93J164K05j539J127N55o50L11l04P22J01j239J549J7j181
$$ -274 338 -341 -533 -1026 138 343 -1196 -69 486 -164 147 -157 565 666 -573 976 993 -188
1471a88M23j42M49N92j891R43P42j165K40l13L0O85j272O88%j241J726l36r72
$$ -188 235 93 542 1134 -757 186 928 -237 3 -310 -280 405 -867 -179 -179 -1420 306 -30 -1002
1490a002Q06o53J326l79j528K035J87j559O37J94R80p14j563K691r4k521J527
$$ -1002 -196 -849 477 98 -1430 605 792 -767 -130 64 1044 330 -1233 1458 1364 -1157 370
1507C70K99L40j015j508K708j00k730J122M00J54k97j791K365K62k230J336M82
$$ 370 669 1009 -6 -1514 1194 1094 -1636 -514 -114 40 -257 -2048 317 579 -1651 -315 167
1524A67o59O18j535J882R77k304J111N60p24O20j383J381Q98k202P47O90o13K96
$$ 167 -492 126 -1409 473 1450 -854 257 817 93 713 -670 711 1609 -593 154 844 231 527
1542E27j446P70J643k443N39P26j025R07q25M7J017j692R26J108k214J534J94
$$ 527 -919 -149 1494 -949 -410 316 -709 198 -627 -580 437 -1255 -329 779 -1435 99 293
1559B93m10M87j400J721O19k379J491P55j374L72k27J038K65k600J942P77k330
$$ 293 -117 370 -1030 691 1310 -1069 422 1177 -197 175 -52 986 1251 -1349 593 1370 -960
1576i60J059l64O73K32k544J326J737k270K75M17L41L38j555J050J013j628N68
$$ -960 99 -265 408 640 -1904 -578 1159 -1111 -836 -419 -78 260 -1295 -245 768 -860 -292
1593b92N90k21J063j685M63J385j251K55l2k94J424j832j37J690j303L0J5m56
$$ -292 298 77 1140 -545 -82 1303 52 307 275 -19 1405 -427 -564 1126 -177 -147 -132 -588
1611e88J497j584n57J722j063Q0K88o18R25n81p8J189j031J81P09r04R00Q5n78
$$ -588 909 -675 -1232 490 -573 -493 -205 -823 102 -479 -557 632 -399 -218 491 -413 487 572 -6
1630fO98q29N47Q09j752Q34N36o73J44p40Q40M05j660N01J124j028m40r5R26K04
$$ -6 692 -137 410 1219 -533 301 837 164 308 -432 408 813 -847 -346 778 -250 -690 -785 141 345
1650C45j572Q86P30r06L46r1J47O37q29M69P41o14K35m73J31O36n10n46O34j05
$$ 345 -1227 -341 389 -517 -171 -262 -115 522 -307 162 903 289 524 51 182 818 308 -238 396 291
1670B91L65o88n33J379p51o62J31Q63j69j138J00J176p94l65Q90r6K18r53L59
$$ 291 656 -32 -565 814 63 -599 -468 395 226 -912 -812 364 -430 -795 95 -1 217 -736 -377
1689c77J199j075n7P90j90K07j72q1L41o17N33J64q81L17M15m69k21K0J89J72
$$ -377 822 -253 -310 480 290 497 325 244 585 -32 501 665 -216 101 516 47 -174 -154 35 207
1709B07j243J077J87r93M31j28N01K0j135J137J59p87P34k20L62L94j255J088
$$ 207 -1036 41 228 -765 -334 -462 39 59 -1076 61 220 -567 167 -53 309 703 -552 536
1727E36J89q47R42p22K15M87j056K55K88k41K91q10K65R77j605j12J030k32K58
$$ 536 725 -122 820 98 313 800 -256 -1 287 46 337 -473 -208 769 -836 -948 82 -150 108
1746A08j034K88J455j517J0J037m01M57r44N16J287j314j86J324j132M53L7o77
$$ 108 -926 -638 817 -700 -690 347 -54 403 -541 -25 1262 -52 -238 1086 -46 407 444 -233
1764b33Q32n96j93O08p43P65Q1j487J244l50p87J187j395R02M95j723J670k89
$$ -233 599 3 -190 418 -325 440 521 -966 278 -72 -859 328 -1067 -165 330 -1393 277 -12
1782a2p34R72q19P05L95j425J101M54r95R86l77Q3N53j170O43K72r80J146r11
$$ -12 -746 226 -593 112 507 -918 183 637 -358 628 251 334 887 -283 360 632 -348 798 -113
1801a13j59J286j265N1N62j131J389j160o60J816q84l9L82j052J592q71q64J565
$$ -113 -272 1014 -251 -200 362 -769 620 -540 -1200 616 -268 -307 75 -977 615 -256 -1120 445
1819D45l53l84Q22r13J012r9j342J926n52r06P69p01R70l83j050J298n26p62J015
$$ 445 92 -292 530 -383 629 530 -812 1114 562 -344 425 -276 694 311 -739 559 33 -729 286
1838B86q91N57M47j554J361l08m02M79p51P99P15j793Q97Q17r22M00l24N64Q16
$$ 286 -605 -48 399 -1155 206 -102 -504 -25 -776 23 738 -1055 -158 659 -263 137 -187 377 1193
1857A193j538N91O58r90O88l82l9O85j259L61O72j261P01k69l08O63q20N15N18
$$ 1193 -345 246 904 -86 602 220 181 866 -393 -32 640 -621 80 -189 -497 166 -654 -139 379
1876C79j106N31J89l56M35k56k7O19j066J246j04o72N88k65K17J12q82P04O62
$$ 379 -727 -196 -7 -363 72 -184 -211 408 -658 588 484 -188 400 135 352 464 -418 286 948
1895I48j171L78J36L1k58r61O64N70r24M33j64K17J01r69Q11N27q81M2M30R4K71
$$ 948 -223 155 291 322 64 -897 -233 337 -587 -154 -318 -101 0 -969 -158 369 -512 -470 -40 54 325
1916C25j063R78O67r66J49M27q3K90r42M43Q31j005j33K78q9J48q45Q02q8p81
$$ 325 -738 240 907 -59 90 517 434 724 -218 225 1056 51 -82 196 107 255 -590 212 124 -657
1936f57K14J94K26p0n76L81O88r52N01K6k08K27l08L93M12q28O70j34l20O27l07
$$ -657 -443 -249 -23 -93 -669 -288 400 -552 -51 -25 -233 -6 -314 79 491 -337 333 199 -121 506 199
1957A99P6M57j006O83j64n45O20n69J30K30o59M69%o51M22J00l4K38r39J143J50
$$ 199 275 732 -274 409 245 -300 320 -249 -119 111 -548 -79 -79 -730 -308 -208 -242 -4 -943 200 350
1978C50p16L60j19M48R6q81O83O44r31K96K29J06M2r98Q66L00j063K73J12j09
$$ 350 -366 -6 -125 323 419 -462 221 865 -66 230 459 565 607 -391 475 775 -288 -15 97 -12
1998a2N51j630R31O41j406L60N98l79M34j059P04Q47j414M78O19l59Q10q47Q1
$$ -12 539 -1091 -160 481 -925 -565 33 -346 88 -971 -267 580 -834 -356 263 -96 714 -133 -52
2017e2R41j563R61O28j234P61k41l55R14j060M54K14j255J011j72n89P93o65o3
$$ -52 889 -674 287 915 -319 442 201 -154 760 -300 154 368 -887 124 -48 -637 156 -509 -572
2036e72P76q91Q03j67o17J190p15j67J030r69N43L47r33J262q31l10J379j318
$$ -572 204 -687 116 -51 -668 522 -193 -360 670 -299 244 591 -342 920 89 -221 1158 -160
2054a60K02P20p92L96n60k30J232j345k86J616r48j07l14K84O65j495K85J559
$$ -160 42 762 -30 366 -194 -424 808 -537 -823 793 -155 -262 -576 -292 373 -1122 -837 722
2072G22j114l1L22N6Q38j466K60J375j356M04M18m54N77p49L17Q32j236N76M74
$$ 722 -392 -423 -101 -45 793 -673 -413 962 -394 10 428 -26 551 -198 119 951 -285 291 765
2091G65j069P87l41p36O94l82O4N81j257J002K20j300J069k09j51J07m68R10J63
$$ 765 -304 483 142 -594 100 -282 -218 363 -894 108 328 -972 97 -112 -263 -156 -624 286 449
2110D49j023J020m2n60N54l72K60J14n07R91m70j122J038j90k39K69k41N57q65
$$ 449 -574 446 404 -156 398 26 286 400 -107 884 414 -708 330 140 -99 170 -71 486 -379
2129c79n09J225m13n20O65k40K08p22M5J375r89m36J150l81o4l61L72Q10r33l
$$ -379 -888 337 -76 -596 69 -171 37 -685 -640 735 -254 -690 460 79 15 -346 26 836 -97 -100
2149a00R95q13J76L9l63M21j18l80K66n13L81O9n42K92M81m46j20j2N83j94q09
$$ -100 895 82 258 297 -66 355 237 -143 123 -390 -9 60 -482 -190 291 -155 -275 -287 296 102 -707
2170g07P91K75q77K32L22N84l17o76J118j04j308P23M21j21m13J38L82o87j16
$$ -707 84 359 -518 -286 36 620 303 -373 745 641 -667 56 477 356 -57 81 463 -224 -340
2189c40Q08n23m02M65K12k14p32O08M37r21k19J192o35J04k9K00N59j140N35Q03
$$ -340 468 -55 -457 8 220 6 -726 -118 319 -602 -821 371 -264 -160 -189 11 570 -570 -35 768
2209G68p78J06J81J16j16l21N53J74q36N88l3p32N74N0k88O4o26P90Rr70P18J30
$$ 768 -10 96 277 393 277 -44 509 683 -153 435 402 -330 244 294 6 70 -556 234 243 -727 -9 121
2231A21o39J75J39N13o02n72J659l98j220R98M5O6l01R3Q69p48p00J048j7n47
$$ 121 -518 -343 -204 309 -293 -865 794 396 -824 174 219 285 -16 77 946 198 -502 546 529 -18
2251a8J82p7M06p65k68J143j001j48R29p73K02j8j29O53q06j25J338j064m7Q81
$$ -18 164 87 493 -272 -540 603 -398 -546 383 -390 -188 -206 -335 318 -488 -613 725 -339 -386 495
2271D95m67K00l86K07Q87j542N14R94r55K18P6m7N18j158O98Q0j122Q81J78r45
$$ 495 28 228 -158 49 936 -606 -92 902 -53 165 241 194 712 -446 252 332 -790 91 269 -676
2291f76N60k31M40k77o31Q94J01j178J072J6l27k0j75J025j88j376J732r7r96
$$ -676 -116 -347 93 -184 -815 79 180 -998 74 90 -237 -257 -432 593 405 -971 761 664 -332
2310c32L52J11L59j90p84J145l68r43J084m48l33P39q60L91P2n54J145r54j36
$$ -332 20 131 490 300 -484 661 293 -650 434 -14 -347 392 -468 -77 -5 -559 586 -368 -504
2329e04Q38n75q0K89OM70p20Q3J261j078k08P57n29k3L1J69M74r55jJ186j248
$$ -504 334 -241 -321 -32 -26 444 -276 -193 1068 -10 -218 539 10 -13 18 187 661 -294 -295 891 -357
2350c57K66K35l90M75n84K05N74j325O00N72o43J15l17O01M06j007O12M14o73
$$ -357 -91 144 -246 229 -355 -150 424 -901 -301 271 -372 -257 -574 27 433 -574 38 452 -221
2369b21J91L82k16Pk87N08K16p14N12p6l02J81m01M69K9o00O96l39n84Q37p40
$$ -221 -30 352 136 143 -144 364 580 -134 378 302 0 181 -220 249 278 -322 374 35 -549 288 -452
2390d52K43J09k52L86m49L29N14p45q8J024m87j94J29K81L29r28k4P48m08q5L55
$$ -452 -209 -100 -352 34 -415 -86 428 -317 -405 619 132 -62 67 348 677 -251 -275 473 65 -20 335
2411C35j64J31l48R7O61j019K65O9N5j83k50L21K18q17N52J17k03j34kK09J62
$$ 335 171 302 -46 51 712 -307 -42 27 82 -101 -351 -30 188 -629 -77 40 -163 -297 -299 -90 72
2432G2n42N23M65m94N49m06p6L01m19K62K4m90N25K07o00M07m60R9N8k52L33l83
$$ 72 -470 53 518 24 573 167 91 392 -27 235 259 -231 294 501 -99 308 -152 -53 5 -247 86 -297
2454b97K98R7n08N7M26n61N09j80J38K11m62K78P71p79J47K02k46L69o65L82L36
$$ -297 1 98 -410 -353 73 -488 21 -159 -21 190 -272 6 777 -2 145 347 101 470 -195 187 523
2475E23q13L04M03l98K52n80O01J79q03L41J61p30L81r7o8N63o98L85kl18M88
$$ 523 -290 14 417 19 271 -309 292 471 -332 9 170 -560 -179 -276 -344 219 -479 -94 -96 -414 74
2496G4k09J3L98m61L49L82o18K48J05m41O84l74k2K69o51L29L60q92P00m91J33
$$ 74 -135 -122 276 -185 164 546 -72 176 281 -160 524 150 128 397 -254 75 435 -457 243 -248 -115
2517a15M27q05L89J33n02L57Q5k70O36r16O93L70n98K12J83l02M80m58n7N67p26
$$ -115 312 -493 -104 29 -473 -116 -31 -301 335 -581 112 482 -116 96 279 -23 457 -1 -58 509 -217
2538b17L67P0j74L55m30l11Q56p87K48J92o07N44l01j95O58o05J36K46n33O85
$$ -217 150 220 46 401 -29 -340 516 -271 -23 169 -438 106 -195 -390 268 -337 -201 45 -488 197
2558A97m13j91Q57o63J64L59n70N99k17l60P18l80j65K95n06N99j12p50P75o20
$$ 197 -216 -407 450 -213 -49 310 -260 339 122 -238 480 100 -65 230 -276 323 211 -539 236 -384
2578c84L94L99r44O73J62p62N53k18k79N49o89L76M09m88L57Q3k85N07n79K63
$$ -384 10 409 -535 138 300 -462 91 -127 -406 143 -546 -170 239 -249 108 191 -94 413 -166 97
2598I7M57p81M16J07l91L59j42J96j44k73K85j20l86M84l57L97J3m74J32J82p88
$$ 97 554 -227 189 296 -95 264 122 318 174 -99 186 66 -320 164 -193 204 217 -257 -125 57 -731
2619g31P81r5k21K32k85M90l22k77N86N8j14K6n9J5L9j47L71k20j95J06L11m27
$$ -731 50 -45 -266 -34 -319 171 -151 -428 158 216 102 128 69 84 123 -24 347 127 -68 38 349 -78
2641g8J91l2P3j39P1K2m02K60Q9k38K0R2k53N32o32J76P26p30J7M92j85j50K00
$$ -78 113 81 154 15 86 108 -294 -34 55 -183 -163 -71 -324 208 -424 -248 478 -252 -235 257 72 -78 122
2664A22l7J74l30L53J36m16K27j84J23R3n65M25K32q87O17j46j99J52r5o6Q8m
$$ 122 85 259 -71 282 418 2 229 45 168 261 -304 121 353 -534 83 -63 -262 -110 -205 -271 -183 -187
2686a87J43K96k91rJ00L68l19j84M45k78L7K59m88L65L2l17K89j47J8j9m69R3
$$ -187 -44 252 -39 -48 52 420 101 -83 362 84 121 380 -108 257 289 -28 261 114 132 113 -356 -263
2708b63N96n12J94j49L6O6l01K23L66m95K27o1j5n6j22N11O6o59N76N7j60m6L2
$$ -263 333 -179 15 -134 -98 -32 -333 -110 256 -239 -12 -73 -88 -144 -266 245 311 -348 228 285 125 79 111
2731A11K74j43n85O11K62p49K60K07j61j77j28M61m3m88jl4K23J35l83K36J9k21
$$ 111 385 242 -343 268 530 -219 41 248 87 -90 -218 243 200 -288 -289 -323 -100 35 -348 -112 -93 -314
2753c14N16k31j48Q7K7J74L34m69J78K00l93L33j79j77M97m85K75r3m69O24k85
$$ -314 202 -29 -177 -90 -63 111 445 -24 154 354 -39 294 115 -62 435 -50 225 132 -337 287 2
2774Bk41M82o28m9P25n98K95J9QK76q19K92M45l05O8J27Q9J47p39O52M59j216
$$ 2 -239 243 -385 -434 291 -307 -12 7 15 291 -528 -236 209 -96 -28 99 188 335 -404 248 707 -509
2796e09M73M81k89j36R5pL42o07L52J88n57N66l90k01L81l30J53K55p44O19j38
$$ -509 -36 445 156 20 115 108 450 -157 195 383 -174 392 2 -199 182 -148 5 260 -484 135 -3
2817cj89J92j57L09rl93L71M4l23N95j85q3J86l19L32j01n36Q61o62j85K95j67
$$ -3 -192 0 -157 152 143 -250 121 165 -158 437 252 169 355 36 368 267 -269 592 -70 -255 40 -127
2839a27L32j51m56M50j27l94N37k31k48N59k65L5k04k3P72m65j15M11k5o3j40
$$ -127 205 54 -402 48 -79 -473 64 -167 -415 144 -121 -86 -290 -313 459 -6 -121 290 265 202 62
2860F2j23M37l95PM49l42l86K47Q3N7m01PN06l43J60K0k99K77k06r9M69n51L74
$$ 62 -61 376 -19 -12 437 95 -291 -44 39 96 -305 -298 208 -135 25 45 -254 23 -183 -282 187 -364 10
2883A0m8q8J61M9k49M02k05q1K60k22J21j21l45N81j69j48M4J0R9Jj90O48n26
$$ 10 -38 -126 35 84 -165 237 32 -49 211 -11 110 -11 -356 225 56 -92 -48 -38 61 62 -128 520 -6
2906fj57J07m4Nk00L5L32j70k95L46Qn9R6q8Q8r0J26M17m87J99K83k54J43m87
$$ -6 -163 -56 -100 -95 -295 -260 72 -98 -393 -47 -39 -98 -2 -90 -2 -92 34 451 -36 163 446 192 335 -152
2930a52J03N84p44K08P4q3L8j71j47M85n76K41K79j9k87J62o4K80k72k44N32r7
$$ -152 -49 535 -209 -1 73 -10 28 -143 -290 195 -381 -140 139 120 -167 -5 -69 211 -61 -305 227 130
2952A30kq6J75J05l69L44j07L27n43j51L91L3l11Q6R5k78L4L5m3K93l23j88L68
$$ 130 128 42 217 322 -47 297 190 517 -26 -177 214 247 -64 22 117 -161 -127 -92 -135 158 -165 -353 15
2975A5l74L61k39l5M02m87K80L07n06J24J17K06J77m68K18K27j67J28j52r3K62
$$ 15 -359 2 -237 -272 130 -357 -77 230 -276 -152 -35 171 348 -120 98 325 158 286 134 41 303
2996C03m54KM78m52J3L31l39k27q4K16L53o02Q1N14m56L35j17RL65n32J95M03
$$ 303 -151 -149 329 -123 -110 221 -118 -345 -429 -213 140 -462 -381 133 -323 12 -105 -96 269 -263 -68 335
3018C35l50P7q1n1K52j84m3L99n05J44J69k81M14j6j76O3n35J98K52n61N63j07
$$ 335 -15 62 -19 -70 182 -2 -45 354 -151 -7 162 -119 295 279 103 166 -369 -171 81 -480 83 -24
3040b4j76M20k90o7M59o13M36J36o32L45M2j39L71j32J12oj79M33m5p03M48k82
$$ -24 -200 220 -70 -137 322 -291 145 281 -351 -6 36 -103 268 136 248 242 63 496 451 -252 196 -86
3062h6J45l6j09K92l29j00M68n11j1K24j24K41k8n70Q02l28K7K79n75K30J55j87
$$ -86 59 23 -86 206 -123 -223 245 -266 -277 -53 -177 64 36 -534 268 -60 -33 246 -329 -99 56 -131
3084a31L60k05j00K88r1RQ6k50K55k18O6J36m53J49l3j04j22J36k3K27j15K7O58
$$ -131 229 24 -76 212 121 130 216 -34 221 3 69 205 -248 -99 -132 -236 -358 -222 -245 -18 -133 -106 552
3107E52q95L61k20J47L8j45J63K34n15N36J10j86L51l59n9M6k49M63K8o48M19
$$ 552 -343 18 -202 -55 -17 -162 1 235 -280 256 366 180 531 172 113 159 -90 373 401 -247 172
3128A72j19r8L8j61K51j64j9K6l42K70K32l63J04K26k72L70k5k40M82l82o1J39
$$ 172 53 -45 -7 -168 83 -81 -100 -74 -416 -146 86 -277 -173 53 -219 151 126 -114 368 -14 -75 64
3150F4k39L91k14P5J80J8l58L06k37K53m61J48K22m48K67K36l01J15m5K8K1l42
$$ 64 -175 216 2 77 257 275 -83 223 -14 239 -222 -74 148 -300 -33 203 -98 17 -28 0 21 -321
$$ [...]
8191b
##END NTUPLES=NMR FID
##END=
