##TITLE=1H_Pr 37-DT
 DMSO
 8 sc, 
 6.04.2022
##JCAMPDX= 6.0         $$ Bruker NMR JCAMP-DX V2.0
##DATA TYPE= NMR FID
##DATA CLASS= NTUPLES
##ORIGIN= UXNMR, Bruker Analytische Messtechnik GmbH
##OWNER= root
$$ XWIN-NMR		Version 3.5
$$ Wed Apr  6 14:21:16 2022 Russian Standard Time (UT+4h)  she@DPX200
##.OBSERVE FREQUENCY= 200.131346
##.OBSERVE NUCLEUS= ^1H
##.DELAY= (6, 6)
##.ACQUISITION MODE= SIMULTANEOUS
##.ACQUISITION SCHEME= undefined
##.AVERAGES= 8
##.DIGITISER RES= 18
##SPECTROMETER/DATA SYSTEM= spect
##.PULSE SEQUENCE= zg30
##.SOLVENT NAME= DMSO
##.SHIFT REFERENCE= (INTERNAL, DMSO, 0, 15.7039)
##AUDIT TRAIL= $$ (NUMBER, WHEN, WHO, WHERE, WHAT)
$$ ##TITLE= Audit trail, XWIN-NMR		Version 3.5
$$ ##JCAMPDX= 5.01
$$ ##ORIGIN= Bruker BioSpin GmbH
$$ ##OWNER= she
$$ F:/spectra/data/she/nmr/H-F/1/audita.txt
$$ ##AUDIT TRAIL=  $$ (NUMBER, WHEN, WHO, WHERE, WHAT)
(   1,<2022-04-06 14:20:17.89 +0400>,<she>,<DPX200>,
      <created by zg, POWCHK disabled, PULCHK disabled
       configuration hash MD5:
       00 E9 B6 7A A2 85 ED C7 34 08 36 98 17 FE 4E 26
       data hash MD5: 16K
       7B 95 72 ED 05 0A 9D 72 72 98 9F AE 09 8E 3E AC>)
$$ ##END=
$$ 
$$ hash MD5
$$ A8 FD DA F5 C6 32 7E 9F CD FC 4F 18 0F 93 30 DA
##$RELAX= 
##$RELAX= 
##$RELAX= 
##$RELAX= 
##$RELAX= 
##$RELAX= 
$$ Bruker specific parameters
$$ --------------------------
##$DU= <F:/spectra>
##$EXPNO= 1
##$NAME= <H-F>
##$PROCNO= 1
##$TYPE= <nmr>
##$USER= <she>
##$AMP= (0..31)
100 100 100 100 100 100 100 100 100 100 100 100 100 100 100 100 100 100 
100 100 100 100 100 100 100 100 100 100 100 100 100 100 
##$AQSEQ= 0
##$AQ_mod= 1
##$AUNM= <au_zg>
##$AUTOPOS= <>
##$BF1= 200.13
##$BF2= 200.13
##$BF3= 200.13
##$BF4= 200.13
##$BF5= 200.13
##$BF6= 200.13
##$BF7= 200.13
##$BF8= 200.13
##$BYTORDA= 1
##$CFDGTYP= 0
##$CFRGTYP= 5
##$CHEMSTR= <none>
##$CNST= (0..31)
1 1 145 1 1 1 1 1 1 1 1 1 1 1 1 1 1 1 1 1 1 1 1 1 1 1 1 1 1 1 1 1 
##$CPDPRG= <>
##$CPDPRG1= <>
##$CPDPRG2= <>
##$CPDPRG3= <>
##$CPDPRG4= <mlev>
##$CPDPRG5= <mlev>
##$CPDPRG6= <mlev>
##$CPDPRG7= <mlev>
##$CPDPRG8= <mlev>
##$CPDPRGB= <>
##$CPDPRGT= <>
##$D= (0..31)
0 1.2 0 0 0 0 0 0 0 0.06 0 0.03 0 0 0 0 0.0002 0 0 0 0 0 0 0 0 0 0 0 0 
0 0 0 
##$DATE= 1649240417
##$DBL= (0..7)
120 120 120 120 120 120 120 120 
##$DBP= (0..7)
150 150 150 150 150 150 150 150 
##$DBP07= 0
##$DBPNAM0= <>
##$DBPNAM1= <>
##$DBPNAM2= <>
##$DBPNAM3= <>
##$DBPNAM4= <>
##$DBPNAM5= <>
##$DBPNAM6= <>
##$DBPNAM7= <>
##$DBPOAL= (0..7)
0.5 0.5 0.5 0.5 0.5 0.5 0.5 0.5 
##$DBPOFFS= (0..7)
0 0 0 0 0 0 0 0 
##$DE= 6
##$DECBNUC= <off>
##$DECIM= 32
##$DECNUC= <off>
##$DECSTAT= 4
##$DIGMOD= 1
##$DIGTYP= 9
##$DL= (0..7)
0 120 120 120 120 120 120 120 
##$DP= (0..7)
150 150 150 150 150 150 150 150 
##$DP07= 0
##$DPNAME0= <>
##$DPNAME1= <>
##$DPNAME2= <>
##$DPNAME3= <>
##$DPNAME4= <>
##$DPNAME5= <>
##$DPNAME6= <>
##$DPNAME7= <>
##$DPOAL= (0..7)
0.5 0.5 0.5 0.5 0.5 0.5 0.5 0.5 
##$DPOFFS= (0..7)
0 0 0 0 0 0 0 0 
##$DQDMODE= 0
##$DR= 18
##$DS= 0
##$DSLIST= <SSSSSSSSSSSSSSS>
$$ [...]
##$SUBNAM2= <"">
##$SUBNAM3= <"">
##$SUBNAM4= <"">
##$SUBNAM5= <"">
##$SUBNAM6= <"">
##$SUBNAM7= <"">
##$SUBNAM8= <"">
##$SUBNAM9= <"">
##$SW= 18.0517287032376
##$SWIBOX= (0..15)
0 0 2 0 0 0 0 0 0 0 0 0 0 0 0 0 
##$SW_h= 3612.71676300578
##$TD= 16384
##$TD0= 1
##$TE= 0
##$TE2= 300
##$TE3= 300
##$TEG= 300
##$TL= (0..7)
0 120 120 120 120 120 120 120 
##$TP= (0..7)
150 150 150 150 150 150 150 150 
##$TP07= 0
##$TPNAME0= <>
##$TPNAME1= <>
##$TPNAME2= <>
##$TPNAME3= <>
##$TPNAME4= <>
##$TPNAME5= <>
##$TPNAME6= <>
##$TPNAME7= <>
##$TPOAL= (0..7)
0.5 0.5 0.5 0.5 0.5 0.5 0.5 0.5 
##$TPOFFS= (0..7)
0 0 0 0 0 0 0 0 
##$TUNHIN= 0
##$TUNHOUT= 0
##$TUNXOUT= 0
##$USERA1= <user>
##$USERA2= <user>
##$USERA3= <user>
##$USERA4= <user>
##$USERA5= <user>
##$V9= 5
##$VALIST= <valist>
##$VCLIST= <CCCCCCCCCCCCCCC>
##$VD= 0
##$VDLIST= <DDDDDDDDDDDDDDD>
##$VPLIST= <PPPPPPPPPPPPPPP>
##$VTLIST= <TTTTTTTTTTTTTTT>
##$WBST= 1024
##$WBSW= 4
##$XGAIN= (0..3)
0 0 0 0 
##$XL= 0
##$YL= 0
##$YMAX_a= 586056
##$YMIN_a= -503841
##$ZGOPTNS= <>
##$ZL1= 120
##$ZL2= 120
##$ZL3= 120
##$ZL4= 120
##$ABSF1= 10
##$ABSF2= 0
##$ABSG= 5
##$ABSL= 3
##$ALPHA= 0
##$AQORDER= 0
##$ASSFAC= 0
##$ASSFACI= 0
##$ASSFACX= 0
##$ASSWID= 0
##$AUNMP= <proc_1d>
##$AZFE= 0.1
##$AZFW= 0.1
##$BCFW= 1
##$BC_mod= 2
##$BYTORDP= 1
##$COROFFS= 0
##$CY= 11.3945322036743
##$DATMOD= 1
##$DC= 2
##$DFILT= <>
##$DTYPP= 0
##$F1P= 2.36226072786647
##$F2P= -0.459571619588291
##$FCOR= 0.5
##$FTSIZE= 0
##$FT_mod= 4
##$GAMMA= 1
##$GB= 0.15
##$INTBC= 1
##$INTSCL= 1
##$ISEN= 128
##$LB= 0.24
##$LEV0= 0
##$LPBIN= 0
##$MAXI= 10000
##$MC2= 0
##$MEAN= 0
##$ME_mod= 0
##$MI= 1.114404
##$NCOEF= 0
##$NC_proc= 0
##$NLEV= 6
##$NOISF1= 3.799351
##$NOISF2= 2.8
##$NSP= 1
##$NTH_PI= 0
##$NZP= 0
##$OFFSET= 15.70392
##$PC= 1
##$PHC0= -18038.27
##$PHC1= 21.80078
##$PH_mod= 1
##$PKNL= yes
##$PPARMOD= 0
##$PSCAL= 0
##$PSIGN= 0
##$REVERSE= no
##$SF= 200.130013532006
##$SI= 16384
##$SIGF1= 3
##$SIGF2= 2
##$SINO= 400
##$SIOLD= 16384
##$SREGLST= <1H.CDCl3>
##$SSB= 0
##$STSI= 0
##$STSR= 0
##$SW_p= 3612.71676300578
##$SYMM= 0
##$S_DEV= 0
##$TDeff= 0
##$TDoff= 0
##$TI= <>
##$TILT= no
##$TM1= 0
##$TM2= 0
##$TOPLEV= 0
##$USERP1= <user>
##$USERP2= <user>
##$USERP3= <user>
##$USERP4= <user>
##$USERP5= <user>
##$WDW= 1
##$XDIM= 8192
##$YMAX_p= 0
##$YMIN_p= 0
$$ End of Bruker specific parameters
$$ ---------------------------------
##NTUPLES= NMR FID
##VAR_NAME=  TIME,          FID/REAL,        FID/IMAG
##SYMBOL=    X,             R,               I
##VAR_TYPE=  INDEPENDENT,   DEPENDENT,       DEPENDENT
##VAR_FORM=  AFFN,          ASDF,            ASDF
##VAR_DIM=   8192,          8192,            8192
##UNITS=     SECONDS,       ARBITRARY UNITS, ARBITRARY UNITS
##FACTOR=    0.0002768,     1,               1
##FIRST=     0,             0,               0
##LAST=      2.2672688,     0,               0
##MIN=       0,             -503841,         0
##MAX=       2.2672688,     586056,          0
$$ Real data points
##PAGE= N=1
##DATA TABLE= (X++(R..R)), XYDATA
0@%%%%%%%%qJ6k4L2m0N6p2R0j14J44j77K18k66L22l88M62n47O45p57Q80j018J176
30F30j352J549j770K014k285K584k913L278l678M114m591N114n686O309o990P734
46D061q547R436j0405J1465j2630J3908j5313J6868j8596K0523k2687K5136k7928
59a4709L1148l4912L9379m4781N1470o0006P1351q7303J11811j56612L65910p76587
71e03841O42254P5632n52690O28185n62183N80827n93227M04198n383l87040N67049
82B93781n04905L17497j58893N5435R1287k96609M78900n36289M28333k42111
92g3574N6263J55461m02775N78084n39168K82436L5727k59867L56217m15881M74912
103B47835m34255K23559J18936m59515O40272n94689L79636j03564j49726L43351
$$ plain form
0 0 0 0 0 0 0 0 0 0 -8 8 -16 16 -24 32 -40 50 -64 80 -97 121 -145 177 -211 251 -296 349 -408 472 -546 630
30 630 -722 827 -943 1071 -1214 1370 -1543 1735 -1943 2171 -2420 2694 -2992 3317 -3673 4061
46 4061 -4486 4950 -5455 6010 -6620 7288 -8025 8843 -9753 10770 -11917 13219 -14709
59 -14709 16439 -18473 20906 -23875 27595 -32411 38940 -48363 63448 -93164 272746 -503841
71 -503841 138413 214045 -338645 289540 -272643 308184 -285043 119155 113772 -273268 293781
82 293781 -211124 106373 -52520 2915 94202 -202407 276493 -259796 168537 -73574
92 -73574 -17311 138150 -264625 313459 -225709 56727 92454 -167413 188804 -227077 247835
103 247835 -186420 37139 156075 -303440 336832 -257857 121779 18215 -131511 211840
113B11840m69371N06268m05672J64805J21988l47272M58992m44943L23748j30366
123i983q3862K39011k96846L07552l26125L23963k17193k2270L10984m94243M73548
134B04536k93114O9075J12980k35745L28684l99701L88085k32003l7436L02811
144B08172m46899M35578l22232J72517r61j86577L36720l86871L18269j67430
154c9714n50J46129k63129L33468l20368K10378l8116j30963K38739k74481K71300
165A32693k46563J76797l4896j59314L24870l70475K77215j11965m7495J65261
175A06128k43048K84692k70493J78580k2994j43404K65563l09411K68233j67039
185e3193M2686P5139j66695K22562k39155K08365j19117j9021J68994k75545K88354
$$ plain form
113 211840 -257531 248737 -156935 7870 129858 -217414 241578 -203365 120383 -9983
123 -9983 -93845 145166 -151680 155872 -170253 153710 -63483 -85753 225231 -269012 204536
134 204536 -88578 -19503 93477 -142268 186416 -213285 174800 -57203 -94639 208172
144 208172 -238727 196851 -125381 47136 46175 -140402 196318 -190553 127716 -39714
154 -39714 -40264 105865 -157264 176204 -144164 66214 28098 -102865 135874 -138607 132693
165 132693 -113870 62927 28031 -131283 193587 -176888 100327 -11638 -59133 106128
175 106128 -136920 147772 -122721 55859 32865 -110539 155024 -154387 113846 -53193
185 -53193 -10507 64632 -102063 120499 -118656 89709 -29408 -48429 120565 -154980 133374
196A33374k03286O7140O1727j51437K01812k23814K11600j45527K8935J00084
206H0608j92162K19217j85110J13244k6160o4330J44568j94541J96411j44702
216e2957N0999N6982j47488J97612j95578J44828o4265k0716R0001j33479J49989
227G5928j39737R8382k5668o2501J38919j76698J62330j03989K1287O4529j34922
238h2140J73748j70755J24993m5902m2761J14441j49020J38761r1654K6450L6438
249C2599q4326J10232j12155R1694n1147l509O0492j04747J22830j10656P3811
260B5118k3860k7506P0787r7314J00752p7325L1150K4877p3360J00837j00323
271d6167P2498k7417k3562O9074r8286J02909q1622M1399O636m8207P2842p5555
$$ plain form
196 133374 -69912 -2772 58955 -92482 109330 -114484 97116 -48411 -19476 80608
206 80608 -111554 107663 -77447 35797 9637 -54693 89875 -104666 91745 -52957
216 -52957 -1958 55024 -92464 105148 -90430 54398 -9867 -30583 59418 -74061 75928
227 75928 -63809 34573 8905 -53596 85323 -91375 70955 -33034 -11747 52782 -82140
238 -82140 91608 -79147 45846 -56 -42817 71624 -77396 61365 -30289 -3839 32599
249 32599 -51727 58505 -53650 38044 -13103 -16612 43880 -60867 61963 -48693 25118
260 25118 1258 -26248 44539 -52775 47977 -29348 1802 26679 -46681 54156 -46167
271 -46167 26331 -1086 -24648 44426 -53860 49049 -32573 8826 15462 -32745 40097 -35458
283c5458N7383k5728r543L8912n5812N8013m7282K8106m529k0952M4308n9741
295c2323O2312n0209K6022K443k6493M0615m3119L6205k0958n2K2053l9357M5059
308B2198l7076J8353M625k5175L9117m4743M1338k9164J0478R027k3064K7468
320A3382k2004J0265K499j1894J7065j7806J4171o721k461J0521j5282J6592j5666
333g339J3305j0496O799k364j301K963k242N1K828m616M123j808k373P644j0921
348e747J0196n574j164N991n599j43Q186j4577J7398j6909J3430p972J240O235
362D991j3198J7828j8467J5347q684k11R064j5308J6014j0491K81J1098k0252
375a1988K6828l0105K7540j6787n77J8743l1289L4202k8611J7902m968r057K2704
$$ plain form
283 -35458 21925 -3803 -13346 25566 -30246 27767 -19515 8591 4062 -16890 27418 -32323
295 -32323 29989 -20220 5802 8245 -18248 22367 -20752 15453 -5505 -5557 16496 -22861 22198
308 22198 -14878 3475 8100 -17075 22042 -22701 18637 -10527 -49 8978 -14086 13382
320 13382 -8622 1643 4142 -7752 9313 -8493 5678 -1043 -3504 7017 -8265 8327 -7339
333 -7339 5966 -4530 2269 -95 -1396 1567 -675 -624 2204 -2412 1711 -97 -2470 5174 -5747
348 -5747 4449 -1125 -2289 3702 -1897 -2040 6146 -8431 8967 -7942 5488 -2484 -1244 4991
362 4991 -8207 9621 -8846 6501 -2183 -2394 6670 -8638 7376 -3115 -2834 8264 -11988
375 -11988 14840 -15265 12275 -4512 -5089 13654 -17635 16567 -12044 5858 890 -8167 14537
388A4537l1670L0787j7967k606K2995l7246M2682l9483K8450j0593j0790L0826
400A9922m3457M5391l6554J8773L762k5580M0004m1837L1034j2428p947K6463
412A7546m2018N2504n2885L7784p891k6284N0741n7721M8798l2113J2900Q313
424I674l0343M9350n6255M3646j4347k1310N0097o3316O1081m7087K4467L161
436H818l1843N6314o8379O1840l6082r80L5841n6553N7475m3055K2353o02k2162
449a7015M6236o6416P1512n3606J6288K5308n4229O3637n7560M3624k5455K325
461e351K5946n2622O7317o1760L5556K906m1693O9285p8421O7511m2579J0968
473b937K2047n2465P6313q5137O8785k6111k8558P0845q3133O6737l6933P637
$$ plain form
388 14537 -17133 13654 -4313 -6919 16076 -21170 21512 -17971 10479 -114 -10904 19922
400 19922 -23535 21856 -14698 4075 7837 -17743 22261 -19576 11458 -970 -8917 17546
412 17546 -24472 28032 -24853 12931 5040 -21244 29497 -28224 20574 -11539 1361 9674
424 9674 -20669 28681 -27574 16072 1725 -19585 30512 -32804 28277 -18810 5657 8818
436 8818 -23025 33289 -35090 26750 -9332 -10312 25529 -31024 26451 -16604 5749 5147 -17015
449 -17015 29221 -37195 34317 -19289 -3001 22307 -31922 31715 -25845 17779 -7676 -5351
461 -5351 20595 -32027 35290 -26470 9086 11992 -29701 39584 -38837 28674 -13905 -2937
473 -2937 19110 -33355 42958 -42179 26606 495 -28063 42782 -40351 26386 -10547 -2910
485b910J8624m5882P1836q3866P0306l2319j4504N0326o6577O6649n6614L9553
497A4622j4774j7098N0371p3969P7242n5535J3510L5333p2416Q4252p2373M8728
509A7893k4060j657L4819p4123J01183r2972M5955J8916o9726Q7151p5788N0815
521A8406k3103o269L9729p0825Q7277q0504N0610o568l8999P2404q2915O7948
533B7191l7871R643R209k5609N0555p8398Q5264n1955j2632P2489r5663Q1142
545C3365n3719L3960j7607j3966O3718j05890J07718o2555k394N2412p2917P2820
557C4945o5111M9842j9394k4315O6492r0983R0425o7404K6065K4764o8297Q6199
569D3228p2217M0881j5911N482O865l8502Q1335j00463O9205r1o2974Q5777p3978
$$ plain form
485 -2910 15714 -30168 41668 -42198 28108 -4211 -18715 31611 -34966 31683 -24931 14622
497 14622 -152 -17250 33121 -40848 36394 -19141 -5631 29702 -42714 41538 -30835 17893
509 17893 -6167 -7824 26995 -47128 54055 -38917 7038 25954 -43772 43379 -32409 18406
521 18406 -4697 -10966 28763 -42062 45215 -35289 15321 8753 -30246 42158 -40757 27191
533 27191 -10680 -1037 8172 -17437 33118 -45280 39984 -11971 -24603 47886 -47777 33365
545 33365 -20354 13606 -4001 -17967 45751 -60139 47579 -14976 -17370 35042 -37875 34945
557 34945 -30166 19676 282 -24033 42459 -48524 41901 -25503 562 25326 -42971 43228
569 43228 -28989 11892 -4019 1463 8328 -30174 51161 -49302 19903 19812 -43162 42615 -31363
582c1363N6931n0879M0841l890n4786J02166j08638P4253k2411k4285N8105q0038
594d3994Q4250o4313K4898J7790m9047O8968q2654Q5176o1445O511N6924r2945
606d9881Q4201n0549K5121j6826L855L4294q2170J01138o9274P126M3422o1539
618c1082O0572o2565O7090n4097J1949M4134q4885R3426p4459M2175m604l6817
630b9163P2712q6200O8913l2634j615K5452m7296P4826r3833P9074k6021l7873
642c3658P5907p6571N8447m4216L4200j2180k8537P1940q9927P0927k8483j3301
654a5452M1766o0176P2409p3257N3535j5368k5786N5875p1580P4851o3689L2153
666E281J5917n9954P7686o6220M1385j8827j589K9766o5768R0724q2540M0498
$$ plain form
582 -31363 25568 -25311 15530 11640 -43146 59020 -49618 24635 2224 -22061 36044 -43994
594 -43994 40256 -24057 841 18631 -30416 38552 -44102 41074 -20371 -13860 43064 -49881
606 -49881 34320 -16229 8892 -7934 -4079 30215 -51955 49183 -20091 -12965 30457 -31082
618 -31082 29490 -33075 34015 -20082 -8133 36001 -48884 44542 -29917 12258 7654 -29163
630 -29163 43549 -42651 26262 -6372 -7987 17465 -29831 44995 -48838 30236 4215 -33658
642 -33658 42249 -34322 24125 -20091 14109 1929 -26608 45332 -44595 26332 -2151 -15452
654 -15452 26314 -33862 38547 -34710 18825 3457 -22329 33546 -38034 36817 -26872 5281
666 5281 21198 -38756 38930 -27290 14095 -4732 -6321 23445 -42323 48401 -34139 6359
678F359J2486m9441O1997o1223N7551m8408K3368J8194n9026P8346o9334M1603
690A2472q055k4170N2312p0447P0228n0933K1381Q568l4484N5719o8503O5041
702B9129m0611J086L6556n7055N8895m9849L5729j5056j6418N2594p6901P6052
714C4151n0014J2410K1041m4475N9354o4425N4545k7959p473L9427n8545O0973
726B9010m8365K3900P408l7182N6770o0838M9799k9466O042J7821m0261N5869
738C0507n7067M0645j2952j4918L4720m4483M5939l9159K2805L033l2119N3947
750C0898o0786N0950k9021J238K5809m6641N6901n2184L3470o440k1341M1570
762B4423m9871M5308k9002M884K0090l9023M8197m6000L4106j5471o266K6383
$$ plain form
678 6359 18845 -30596 31401 -29822 27729 -20679 2689 20883 -38143 40203 -29131 12472
690 12472 4417 -19753 32559 -37888 32340 -18593 2788 11356 -23128 32591 -35912 29129
702 29129 -11482 -10396 26160 -30895 28000 -21849 13880 -1176 -17594 35000 -41901 34151
714 34151 -15863 -3453 17588 -26887 32467 -31958 22587 -5372 -12845 26582 -31963 29010
726 29010 -19355 4545 11953 -25229 31541 -29297 20502 -8964 -2922 14899 -25362 30507
738 30507 -26560 14085 1133 -13785 20935 -23548 22391 -16768 6037 9070 -23049 30898
750 30898 -29888 21062 -7959 -6721 19088 -27553 29348 -22836 10634 4194 -17147 24423
762 24423 -25448 19860 -9142 -4258 15832 -23191 25006 -20994 13112 -2359 -8625 17758
774A7758m0100M3804l6547K1022k008j6718L1280l8029L5605k4173N274J6036
786A3204l4150M4361m3468L1682j1833j0781K9579m0286M0397l0558J4170N452
798G769k3062L3804l5020K6544j0707p617K3247l2967L4836k8625J6843k081j2753
811i789K4246k9689K7946j9894P537N724j7095K4136k4668J8899p741o347J9070
824A2335k7466K9229k3516J2683M33j3091K1953k5486K2689j3990K382R304j7628
837a0169K0160j6759Q855P83j0158J6948j9438J7768j2556M912L326j0271J4451
850G852j5554J2710o656PO066j0367J0996q142K936L224q393J1514j2411J0839
864D621o951J827L156p119R373q560N364j986j044L352m021L211r66j754M437
$$ plain form
774 17758 -22342 21462 -15085 5937 3929 -12789 18491 -19538 16067 -8106 -2832 13204
786 13204 -20946 23415 -20053 11629 -204 -10985 18594 -21692 18705 -11853 2317 7769
798 7769 -15293 18511 -16509 10035 -672 -8289 14958 -18009 16827 -11798 5045 2964 -9789
811 -9789 14457 -15232 12714 -7180 357 6081 -11014 13122 -11546 7353 -388 -6735 12335
824 12335 -15131 14098 -9418 3265 3698 -9393 12560 -12926 9763 -4227 -1845 7459 -10169
837 -10169 9991 -6768 2087 2870 -7288 9660 -9778 7990 -4566 346 3672 -6599 7852
850 7852 -7702 5008 -1648 -1641 4425 -5942 5054 -3088 -152 3072 -5321 6193 -6218 4621
864 4621 -2330 -503 2653 -4466 4907 -3653 1711 -275 -1319 2033 -1988 1223 257 -1497 2940
879B940o200O382n404L293o71j495K712k485J199K94j216J045j24j362L014m800
895b878O298o353M534j068k387M096m048K854r55j562M139o252P127n804J967
910b92L611r388J2292j1438Q462m175N72K657o128R242j0641Q151j420o692J2861
925G674j5239J2928p209J18P101j3970J8972j9644J5083o294m162J2276j6378
938h744J6037j1604M769L421j1605J7494j9575J7473j0372j170J4023k3451K5742
951A2438k1018J2854l625n927J4818k1845K4448j9599O875R542k3567K9438k6168
964a1336J6486m027p594J8055k6932L1672k8669J6320K337k0164K9977k9217K0241
977G149q554k280J1964k0703K7507k9007K2108p608j1195K8169l7155L6160k6307
$$ plain form
879 2940 -3260 3122 -2282 1011 340 -1155 1557 -928 271 565 -651 394 270 -1092 1922 -2878
895 -2878 3420 -2933 1601 533 -1854 2242 -1806 1048 93 -1469 2670 -3582 3545 -2259 -292
910 -292 3319 -6069 6223 -5215 3247 -928 -356 2301 -3827 5415 -5226 2925 1505 -5187 7674
925 7674 -7565 5363 -1846 -1728 5373 -8597 10375 -9269 5814 -480 -4642 7634 -8744
938 -8744 7293 -4311 458 3879 -7726 9768 -9807 7666 -2706 -3876 10147 -13304 12438
951 12438 -8580 4274 649 -5278 9540 -12305 12143 -7456 -581 8961 -14606 14832 -11336
964 -11336 5150 1123 -6471 11584 -15348 16324 -12345 3975 6312 -13852 16125 -13092 7149
977 7149 -1405 -3685 8279 -12424 15083 -13924 8184 576 -10619 17550 -19605 16555 -9752
990i752J1300M595j9137L0732l6218L2061j7402m129K5460l8375L9017k9432J4097
1003B817K574j8482L2617m1373M0749k7870N905J7709l5304L9703l2158J8357
1015E244l185r921K1139l0907L7096l4892K0221M469k9541M3960m3561L2935j8702
1028e645M118J1732k9696M4526m7241L2860n451k4499M4811m9383M0138k2486
1040f216K272J6275l1396M1907m5030L8250k0007o279L1473m5495M3581k9882
1052a0547J2578L073j7320L2186m4833M6499l1536L682K4853m3054M7706m1948
1064a8661L0330j4230n848K7455m5078N1619m2456J9002J1583l8953N3599n0832
1076b2470L3784j1229r170K5160l8642M8790m9189L3226k476k9112M6287m5226
$$ plain form
990 -9752 1548 6143 -12994 17738 -18480 13581 -3821 -7950 17510 -20865 18152 -11280 2817
1003 2817 5391 -13091 19526 -21847 18902 -8968 -3063 14646 -20658 19045 -13113 5244
1015 5244 2059 -7862 13277 -17630 19466 -15426 4795 9264 -20277 23683 -19878 13057 -5645
1028 -5645 -1527 10205 -19491 25035 -22206 10654 5203 -19296 25515 -23868 16270 -6216
1040 -6216 -3944 12331 -19065 22842 -22188 16062 -3945 -10224 21249 -24246 19335 -10547
1052 -10547 2031 5104 -12216 19970 -24863 21636 -9900 -6218 18635 -24419 23287 -18661
1064 -18661 11669 -2561 -8409 19046 -26032 25587 -16869 2133 13716 -25237 28362 -22470
1076 -22470 11314 85 -9085 16075 -22567 26223 -22966 10260 7784 -21328 24959 -20267
1088b0267L3119j9731P470P630k7216M6130n3021M1237j5180j4786L7885m9202
1100b5932M9062l9254K1144J980k4251M0722m8202M5238l0160L454K7369n0184
1112b9014N5443m2202K0559o48j5298L1704m8067N4868m3780J4646J8754m0416
1124b3451M5345l8747K8597j6793j16K3224m4570N2715m3901K2801K760k6555
1136a8691M4752n2640M5942k6562K449J7901l1944M1533m5350L7926j4862j7435
1148a6981M3319n1411M2029k4966R816L938k1992M2940n5742M8713k3275p166
1160a0778K9183l8946M0775l7574K6498n402k0045L9477m6451M1453k8612R685
1172g37J4040l7141N0968m7943L0512q959q662K2132l4670M3855m1582K2356P692
$$ plain form
1088 -20267 12852 -6879 591 8221 -18995 27135 -25886 15351 171 -14615 23270 -25932
1100 -25932 23130 -16124 5020 7000 -17251 23471 -24731 20507 -9653 -6199 21170 -29014
1112 -29014 26429 -15773 4786 4138 -11160 20544 -27523 27345 -16435 -1789 16965 -23451
1124 -23451 21894 -16853 11744 -5049 -5165 18059 -26511 26204 -17697 5104 7864 -18691
1136 -18691 26061 -26579 19363 -7199 -4750 13151 -18793 22740 -22610 15316 454 -16981
1148 -16981 26338 -25073 16956 -8010 1806 5744 -16248 26692 -29050 19663 -3612 -10778
1160 -10778 18405 -20541 20234 -17340 9158 3756 -16289 23188 -23263 18190 -10422 -737
1172 -737 13303 -23838 27130 -20813 9699 740 -7922 14210 -20460 23395 -18187 4169 11861
1185A1861l2905M2564l8356K8902j9239O326J3375l5832M8860m5000K7939o088
1197B407j3744K9391l9952M1733l1025R677J3939l1214L9155l8828L1618j6426
1209c269o301K9654m3880M3041k9927J3875j73j3230K7990l9219L8652k3551O28
1222e710J9532l0765L4101l2593K5603j1292q581K8343l9609L9026k9434J4457
1234C078K662k0008L3973l8609L0906j4082m976K0742l0521L4951l2739K0502
1246E879m54k0356L3650l5816K9373j8583O147P830k1779L1208l1192K1466o557
1259H16q474K0243k7599L0077k5828J3628L450j9724K9555l1964K7943j8166L853
1272b190J2204k5261L1042k7439J6676k803j1161K2507k9579K9533k0501N386
$$ plain form
1185 11861 -21044 21520 -16836 12066 -7173 -847 12528 -23304 25556 -19444 8495 2407
1197 2407 -11337 18054 -21898 19835 -11190 -1513 12426 -18788 20367 -18461 13157 -3269
1209 -3269 -9570 20084 -23796 19245 -10682 3193 3020 -10210 17780 -21439 17213 -6338 -5710
1222 -5710 13822 -16943 17158 -15435 10168 -1124 -9705 18638 -20971 18055 -11379 3078
1234 3078 5740 -14268 19705 -18904 12002 -2080 -7056 13686 -16835 18116 -14623 5879
1246 5879 5425 -14931 18719 -17097 12276 -6307 -160 7670 -14109 17099 -14093 7373 816
1259 816 -7658 12585 -15014 15063 -10765 2863 6313 -13411 16144 -15820 12123 -6043 -2190
1272 -2190 10014 -15247 15795 -11644 5032 2229 -8932 13575 -16004 13529 -6972 -1586
1284a586J0862k3025K8311k7140K1077j0631k508J4725k3099K4971j9904J0213
1296B266J392j2679K1300k5128K2663j4214J991J0524k0132K5345k4700J8272
1308F900p332n634J6785k2834K2081j5662N688N594j5406K1571k2280J7172p819
1321a176l110J3225k0067K2053j9051J1719j650q417J5617j8410J6204j0102K039
1334a126O579j3766J7347j6822J2244m474m283J2191j7825J9191j5663Q688L14
1347B595q885J4635j6221J3161o988n77Q085j3702J5794j3872Q233q55o504J2347
1361G246j5246J4769j0540M190K203p549J1117j1675Q966l979j940P401j1199
1374f236J2154j0072N252R43o857J0699j2168J0880p018K459K225o406Q875q817
$$ plain form
1284 -1586 9276 -13749 14562 -12578 8499 -2132 -4640 10085 -13014 11957 -7947 2266
1296 2266 3658 -9021 12279 -12849 9814 -4400 -2409 8115 -12017 13328 -11372 6900
1308 6900 -432 -6066 10719 -12115 9966 -5696 -8 5586 -9820 11751 -10529 6643 -1176
1321 -1176 -4286 8939 -11128 10925 -8126 3593 1943 -6474 9143 -9267 6937 -3165 -1126
1334 -1126 5453 -8313 9034 -7788 4456 -18 -4301 7890 -9935 9256 -6407 2281 2595
1347 2595 -6290 8345 -7876 5285 -1703 -2280 5805 -7897 7897 -5975 2258 1403 -5101 7246
1361 7246 -8000 6769 -3771 419 2622 -4927 6190 -5485 3481 -498 -2438 4963 -6236
1374 -6236 5918 -4154 1098 2041 -4816 5883 -6285 4595 -2423 36 2261 -4145 4730 -4087
1388d087O096j832k557O589r024Q747o441K950J591n634Q117q816P791n285J720
1403g5J642m544N870n265L630j335j825M935o440O325m386R35K242m556N586n307
1419b568M974m007K094K51k227L228l045J706J72j841K448k318J959j661J216
1434C81L0j620L054l493L283k842J991j588J372m92q69J957k324J737k47j030
1450g00J367j174P55r89J276p77p70K728l877M409l562J971r71P20j39j475L455
1467B247m505L477p08k743M626m164K223j52o51J255k873N362p498P563m761K2
1483a280M525o749O093l971J525j60q07L079n859O937n125Q72M475p887Q293p169
1499c208N509l562J319J866o178R717j0069O355o5n601Q425q030N682l615J586
$$ plain form
1388 -4087 2009 177 -2380 4209 -4815 3932 -2509 441 2032 -3602 4515 -4301 3490 -1795 -75
1403 -75 1567 -2977 2893 -2372 1258 -77 -1902 3033 -3407 2918 -1468 -533 1709 -2847 2739 -2568
1419 -2568 2406 -1601 493 744 -1483 1745 -1300 406 578 -1263 1185 -1133 826 -835 381
1434 381 411 -1209 1845 -1648 1635 -1207 784 -804 568 76 -793 1164 -1160 577 330 -700
1450 -700 667 -507 248 -741 535 -242 -1012 1716 -2161 2248 -1314 657 -314 406 267 -1208 2247
1467 2247 -2258 1219 511 -2232 2394 -1770 453 301 -350 905 -1968 3394 -4104 3459 -1302 -1280
1483 -1280 3245 -3504 2589 -1382 143 -17 -824 2255 -3604 3333 -1792 -920 3555 -4332 3961 -3208
1499 -3208 2301 -1261 58 1924 -4254 5463 -4606 1749 1684 -3917 4508 -3522 2160 -1455 131
1514A31K040o943J1796j3833J0797m102l547Q696j0232R078o503M754j889l199
1528b956Q881j3050J2415o299k545R704j2611J1278q436O567m499N74N736j2492
1542g733J5740j2904N147M051j0335J1928j0566Q085n075P80N279j2497J7708
1555I608j7181J0422l18q327J2642j2740J0966q865N711k4q611J6318j8307J3195
1569D489l385o880J3448j5170J4301j2175Q711l120n352J4483j9878J8337j0554
1582b745M6R267j4269J4580j2426R752n813j275J0892j9841K3162j7426N355O457
1596E716j3632J5159j3983J2772r919L659O152j6199K1250j8524R452J293j0440
1609g244J6309j8294J7056j2922O385K203j1871J9628k1964J7125o197n905J3685
$$ plain form
1514 131 2171 -4772 7024 -6809 3988 -114 -3661 5035 -5197 3881 -2622 2132 243 -2956
1528 -2956 5925 -7125 5290 -1009 -3554 6150 -6461 4817 -3619 2948 -1551 -977 4759 -7733
1542 -7733 8007 -4897 250 4301 -6034 5894 -4672 3413 -1662 -882 4397 -8100 9608
1555 9608 -7573 2849 2531 -5796 6846 -5894 5072 -3793 1918 1894 -6717 9601 -8706 4489
1569 4489 1104 -5776 7672 -7498 6803 -5372 3339 219 -5133 9350 -10528 7809 -2745
1582 -2745 -2699 6568 -7701 6879 -5547 4205 -1608 -2883 8009 -11832 11330 -6096 -741 5716
1596 5716 -7916 7243 -6740 6032 -3887 -228 5924 -10275 10975 -7549 1903 3196 -7244
1609 -7244 9065 -9229 7827 -5095 1290 3493 -8378 11250 -10714 6411 214 -5691 7994
1622G994j5891J4926j2952R877l725p193J9531k5900K2245j1502n19R111j3749
1635g747J6521j7799J5811q749k631J4141k1108K1348j5532O187M546j4412K0243
1648A0819k0569J6901j0809K984P236j7966K4676k3034J2466J622j2110J6009
1660H225j5986J5390j3907Q405L021j6788K5004k3783J5509n813k541J0254j7237
1673a0247K1611k0235J2140n43j0001J7286k1223K0658j3718J439J1266j9511
1685a1078K1169j8425J4635r307k67J3490k4491K6331j7896M721O320j2089J5548
1698H661j8513J8945j3003M26J2958k1240K2300j8507J2808n132n089J5411k1885
1711a1860K1258j4602N976K732j1539J9693k3673J9624p838o043J5755j9422J9594
$$ plain form
1622 7994 -7897 7029 -5923 3954 229 -6964 12567 -13333 8912 -2590 -3109 6002 -7747
1635 -7747 8774 -9025 6786 -1963 -4594 9547 -11561 9787 -5745 442 4988 -9424 10819
1648 10819 -9750 7151 -3658 -674 6562 -11404 13272 -9762 2704 4326 -7784 8225
1660 8225 -7761 7629 -6278 2127 5148 -11640 13364 -10419 5090 -723 -3264 6990 -10247
1673 -10247 11364 -8871 3269 2726 -7275 10011 -11212 9446 -4272 -2833 8433 -11078
1685 -11078 10091 -8334 6301 -3006 -3273 10217 -14274 12057 -5839 -1118 5202 -6887 8661
1698 8661 -9852 9093 -3910 -3484 9474 -11766 10534 -7973 4835 -297 -5386 10025 -11860
1711 -11860 9398 -5204 772 3504 -8035 11658 -12015 7609 -229 -6272 9483 -9939 9655
1724I655j8280J4096m362r728K1482k4621J8898r758J599N597j3123J9628k1624
1737a0541J5747m025p393J5169j9118K0484j8394J0941P01j2480J9639k0042J6200
1750F888j0691L529O036j6327K2810k1186J1765m22q916J4844j8776K1048j7407
1763f805P993M635j5715K0083j8700J4246q011j72R601j7826K0455j5914P744
1776A614J180q912J5246j9392J9479j3656L332O924j4181J7158j6921J4214p841
1789a756j949J2200j8798J8888j3368N627K082r541J6413k0211J8230j0542R7
1802b628R168j5049J7324j6128J1648l705n704J3349j6991J5720j0803M284K992
1815C477j0808J6845j8329J4748p295j788R144j4084J6306j4710R164q52p365
$$ plain form
1724 9655 -8625 5471 1109 -8619 12863 -11758 7140 -2618 -1019 4578 -8545 11083 -10541
1737 -10541 5206 1181 -6212 8957 -10161 10323 -8071 2870 3571 -8909 10730 -9312 6888
1750 6888 -3803 -274 5762 -10565 12245 -8941 2824 2402 -6514 8330 -10446 10602 -6805
1763 -6805 1188 5823 -9892 10191 -8509 5737 -2274 -2446 7155 -10671 9784 -6130 1614
1776 1614 2794 -6118 9128 -10264 9215 -4441 -1109 5815 -8366 8792 -8129 6085 -1756
1789 -1756 -3705 8495 -10303 8585 -4783 844 2926 -6615 9798 -10413 7817 -2725 -2628
1802 -2628 6540 -8509 8815 -7313 4335 630 -5074 8275 -8716 7004 -3799 485 3477
1815 3477 -7331 9514 -8815 5933 -1362 -3150 5994 -8090 8216 -6494 2670 1818 -5547
1828e547J3627j5830J3512q472J605N780j2492J6586j6247J1266l969l310R779
1841F288j3900J4771j1857N841J670q501J2548j3347J1081o155m65P309j2542
1854g259J4839j3359Q487j834m598R686j2786J2812r417L677K805q314J1354j1431
1868e338Q711l845k294Q061j1882J2768j0203N447k57n066R512j1348J0409p081
1882b406J439M383q352J0309r262N934j199m029Q726j1197J0536p549L080J568
1896A981o161Q901r278P817m038o46M965p800Q092o355L138J077n459Q258q945
1911d453P847n032J337K412n536P375p571N545k070j866N185o623O181l940N06
1926g03K852n406P092p279N788k818r12L834n638N914m371K130K00k241L827m468
$$ plain form
1828 -5547 8080 -7750 5762 -2710 -1105 4675 -7817 8769 -7478 3788 -181 -3491 6288
1841 6288 -7612 7159 -4698 1143 2813 -5688 6860 -6487 4594 -1561 -2026 5283 -7259
1854 -7259 7580 -5779 2708 874 -3724 5962 -6824 5988 -3429 248 3053 -5261 6093 -5338
1868 -5338 3373 -472 -2766 5295 -6587 6181 -4022 1425 1168 -3898 5614 -5734 4675 -2406
1882 -2406 -967 3416 -4936 5373 -3889 2045 846 -3183 5543 -5654 4882 -2667 413 1981
1896 1981 -4180 4721 -4557 3260 -778 -1424 3541 -4259 3833 -2522 616 1693 -3766 4492 -4453
1911 -4453 3394 -1638 -301 2111 -3425 3950 -3621 1924 -146 -2012 3173 -3450 2731 -1209 -703
1926 -703 2149 -3257 3835 -3444 2344 -474 -1386 2448 -3190 2724 -1647 483 683 -1558 2269 -2199
1942b199L858k026n10L332n600N851m900K929l01j750L026l701L909l057J047
1957i2J640l183L295k636P62R24k168L282l690L428k667R41J353k943L258k316
1973h12O61J186j788J698j399O67l06p7J474l245M282l983J889O74k349K283j387
1990e32N23J42K3P14k141K976k513P4K932m802M911l383J183K09r12J526k151
2007a221K632k174RK704m265M349k554j6J866k882L156l609M251m124K381J125
2023A628m581N570m096J245J521k675K914l298L978m140K445J476n745Q123p472
2038c107M003P3k758L725l942M065l892K869N9m437P782q176N068o58k898M964
2054B740n622N817n755M925k309k149O700q805P227k984j676M623n920O136n728
$$ plain form
1942 -2199 1659 -367 -877 2455 -3145 2706 -2194 735 434 -1316 1710 -1991 1918 -1139 -92
1957 -92 1548 -1635 1660 -976 -214 710 -1458 1824 -1866 1562 -1105 -164 1189 -1754 1504 -812
1973 -812 -151 1035 -753 945 -454 213 -93 -170 1304 -1941 2341 -1642 247 921 -1428 855 -532
1990 -532 -9 133 156 870 -1271 1705 -808 -734 2198 -2604 2307 -1076 107 316 -596 930 -1221
2007 -1221 1411 -763 -754 1950 -2315 2034 -520 -536 1330 -1552 1604 -2005 2246 -1878 503 1628
2023 1628 -2953 2617 -1479 -234 1287 -1388 1526 -1772 2206 -1934 511 1987 -3758 4365 -3107
2038 -3107 896 969 -1789 1936 -2006 2059 -1833 1036 1095 -3342 4440 -3736 1332 674 -2224 2740
2054 2740 -2882 2935 -2820 2105 -204 -2353 4347 -4458 2769 -215 -1891 2732 -3188 2948 -2780
2069b780N018k664j959P314j0772J0473o590J020L600n747O321o253N724m013
2083a308k0N196r785J1127q071K289L353o739P693p535P529o588L482J754p701
2098e324J1484j0612N558Q50n630P871q470P853o487L828J260p127J1696j2880
2112f130Q984k601k665O493q459Q272p290M977o26n109J0401j2600J0457n125
2126a021j415O812r457J0063r697Q050m149j549P824j2440J2533p655Q30M991
2140C720q624R953r745Q529n388p38P787j2623J4102j1394N582J008o582R824
2154E411j0265Q763o080J961L588r627J3786j3461Q565q86o409J0685j1927J1095
2168E199r004N259L40p300J2976j3962R633k653l784Q072j0454J1254j0370O903
$$ plain form
2069 -2780 2238 -426 -2385 4929 -5843 4630 -1960 -940 2660 -3087 3234 -3019 2705 -1308
2083 -1308 -1328 3868 -5917 5210 -2861 -572 2781 -3958 3735 -3800 3729 -2859 623 2377 -5324
2098 -5324 6160 -4452 1106 1956 -3674 4197 -4273 3580 -2907 921 2181 -4946 6750 -6130
2112 -6130 2854 253 -2412 4081 -4378 3894 -3396 1581 955 -4154 6247 -6353 4104 -1021
2126 -1021 -2436 4376 -5081 4982 -4715 3335 -814 -2363 5461 -6979 5554 -2101 -1271 3720
2140 3720 -4904 5049 -4696 3833 -1555 -2293 5494 -7129 6973 -4421 1161 2169 -4413 5411
2154 5411 -4854 3909 -2171 -210 3378 -6249 7537 -5924 2641 1755 -4654 6031 -5896 5199
2168 5199 -3805 1454 1794 -5506 7470 -6492 3141 488 -3296 4776 -5678 5576 -4794 2109
2182B109l39o894J1991j3892J2544q279J526N223r992J2074j0527P097k883k197
2196b439Q272j3751J5214j0856L055M756r954J1810j2053J1030p499R39O826j2702
2210g352J3841j0511M921Q95o042J0636j3084J2099p580J060N207j0023J2949
2223G016j3695J0800m115l728R772j2149J1009q208M614L67p240J3442j5403J1678
2237D160m316k863P804j0814J2675j2875R581k257n809J1288j2981J0929o837
2250b315K021M117j0584J4020j2562P717j996l137P747j1772J4000j2143N831
2263I44K088q350J1021j0682R209o683J663N707j2320J4507j1806O234k91m501
2277c260Q898j2779J3940j0297K870M181q827J0670j0483Q866m704j856Q752j2901
$$ plain form
2182 2109 1770 -5124 6867 -7025 5519 -2760 -1234 3989 -6003 6071 -4456 2641 -242 -2439
2196 -2439 5833 -7918 7296 -3560 -505 4251 -5703 6107 -5946 5084 -2415 -1476 5350 -7352
2210 -7352 6489 -4022 899 1794 -4248 6388 -6696 5403 -2177 -1117 4090 -5933 7016
2223 7016 -6679 4121 6 -3722 6050 -6099 4910 -3298 1316 1683 -5557 7885 -7518 4160
2237 4160 -156 -3019 4785 -6029 6646 -6229 3352 1095 -4714 6574 -6407 4522 -2315
2250 -2315 -294 3823 -6761 7259 -5303 2414 418 -2719 5028 -6744 7256 -4887 944
2263 944 3032 -5318 5703 -4979 4230 -2453 -790 4917 -7403 7104 -4702 1532 1241 -3260
2277 -3260 5638 -7141 6799 -3498 -628 3553 -5274 5396 -5087 3779 -925 -2781 5971 -6930
2291f930J2474q740L783J037n733J0643j3824J2751p057l0N396q633R822r844
2305d885P867k976m010J0062j2205J1094p599K976K212p876J2122j3147J0238
2318C873m460j421O073r116J0505r873O220L6o517J0698j1469R584o199J836L611
2333C381r163J2179j1426P375k362k369O384q948R786q175L328K869p617R899
2347E141r803Q025m551j82N755j0220J1216r412N743r60l459P008r191Q992o063
2362a961R94L927p188Q854q779O741l048j806O483r428J0085p884M161L0m125
2377b944P279q685P535m338o3M437p318Q463q114N741j858k698O816q820Q516
2392C949o513L273P08m568P211p738N910k728q97M166o471P543o831M183k78l326
$$ plain form
2291 -6930 5544 -3196 587 1624 -4109 6534 -7290 5461 -1596 -1626 3770 -4863 4959 -4885
2305 -4885 2982 6 -4004 6058 -6147 4947 -2652 324 2536 -5340 6782 -6365 3873
2318 3873 -587 -2008 4065 -5051 5454 -4419 1801 1837 -4680 6018 -5451 4133 -2066 -230 3381
2333 3381 -5782 6397 -5029 2346 -16 -2385 3999 -4949 4837 -3338 -10 2859 -4758 5141
2347 5141 -4662 3363 -1188 -1370 4385 -5835 5381 -4031 1712 752 -2707 4301 -4890 4102 -1961
2362 -1961 -967 2960 -4228 4626 -4153 2588 -460 -2266 4217 -5211 4874 -3010 1151 1181 -2944
2377 -2944 4335 -4350 3185 -1153 -1216 3221 -4097 4366 -3748 1993 135 -2563 4253 -4567 3949
2392 3949 -2564 709 1417 -3151 4060 -3678 2232 -496 -1393 2773 -3698 3845 -2986 1197 919 -2407
2408b407O392q035P354n098J747J698m768O744o324M127j530j635M741o444O533
2423C095n404K644Q63l969O419o919N948l795R98J665l813M859m966L613j016
2438B22j911M361n750N846m222J515J110l544N289n754M875k927L38K236l838
2453b154M444l927K111J42k340L866m292M189l039J127J230l235M072m209L156
2468A141j476RJ047k109K964l052K046k28j832L202l269K704j613O3J168j910
2484a145K792l469L261k355O49J355k422K444j801P62P9o75J465k234K469k120
2500i45R46P54k154K687k131J317j049P12j33m17J343j979J759p75l10R53j102
2517e24J013j030J031j054K03J249k148K587j942P11l0j35j12N2N45j654K109
$$ plain form
2408 -2407 3985 -4050 3304 -1794 -47 1651 -3117 3627 -2697 1430 -100 -1735 3006 -3438 3095
2423 3095 -2309 335 1198 -2771 3648 -3271 2677 -1118 -120 1545 -2268 2591 -2375 1238 222
2438 222 -1689 2672 -3078 2768 -1454 61 1171 -2373 2916 -2838 2037 -890 -552 1684 -2154
2453 -2154 2290 -1637 474 616 -1724 2142 -2150 2039 -1000 127 1357 -1878 2194 -2015 1141
2468 1141 -335 -326 721 -1388 1576 -1476 570 342 -1490 1712 -1557 1147 -466 -403 765 -1145
2484 -1145 1647 -1822 1439 -916 -267 1088 -1334 1110 -691 71 150 -525 940 -1294 1175 -945
2500 -945 1 755 -1399 1288 -843 474 -575 137 4 -413 930 -1049 710 -65 -375 578 -524
2517 -524 489 -541 490 -564 -361 888 -1260 1327 -615 96 66 -69 -181 -129 416 -1238 871
2534H71r35o27J617k009J303M9l73K80l04Q45k132K833k605J169P44j968J945
2551G03j117O46n94N91q2j054K416k994J697O30k132K761k688K317j830J577j298
2568d51R4J834l475L426j794j58J723k529K118j554J855j524j82K716m949N528
2584B678m279J612R97k103K100k408K751k520J337Q72l330M953m605K330L89k281
2600a507L453l865L590l787L459j290j840M531n716M810k118m66K124l163L616
2615A831l742L463j599j244M227o515O450m021J085J411k971L741m606M755l455
2630a190Q45K412n187O393n213K463M02k730M450n518N622n084L154M44m391O637
2646C509o364M385j512j288K992m158N263n492L803m64l576P181q093O585l611
$$ plain form
2534 871 -64 -691 926 -1083 220 269 -104 176 -128 717 -1415 1418 -1187 -18 726 -1242 703
2551 703 -414 232 -362 229 147 -907 1509 -1485 212 842 -1290 1471 -1217 1100 -730 847 -451
2568 -451 -357 1477 -1998 1428 -366 -524 1199 -1330 788 -766 1089 -435 -617 2099 -2850 2678
2584 2678 -1601 11 1008 -1095 1005 -1403 1348 -1172 165 1037 -2293 2660 -1945 385 774 -1507
2600 -1507 1946 -1919 1671 -2116 1343 53 -1787 2744 -2972 1838 -280 -746 1378 -1785 1831
2615 1831 -1911 1552 -47 -1291 2936 -3579 2871 -1150 -65 1346 -1625 2116 -2490 2265 -1190
2630 -1190 -345 2067 -3120 3273 -1940 523 925 -1805 2645 -2873 2749 -2335 819 1263 -3128 3509
2646 3509 -2855 1530 18 -1270 1722 -2436 2827 -2665 1138 674 -2902 4279 -3814 2771 -840
2661h40N64K293m500N571o185N343k692r21M560o995P001m791J396J609l882N785
2677C316o856O796n129J380L122o371P419o250L725p18k052M374o257O617n257
2692b141K364J795n498P775q318O182k430p73L511n641O791o611M775j434k863
2707b516O339p873O685l688N00K508n115P044p999P037l530j360N127p281P796
2722C674o015L282K25l774O390p494O583m107M57L700p153Q792q083N179j140
2737E16k211M874o909P572o458L475J017n366P499p521N720k994k35L931o988
2752d078Q699p904M604o88k906N862p813P723n437J784K401n797P053o693N349
2767B159k448j468N469q166Q455o432K979J72l096N915p895Q074n274N97L643
$$ plain form
2661 -840 -276 2017 -2483 3088 -3097 2246 -446 -1367 3193 -3802 3199 -1592 -196 1413 -2469 3316
2677 3316 -3540 3256 -1873 -493 2629 -3742 3677 -2573 1152 434 -1618 2756 -3501 3116 -2141
2692 -2141 223 2018 -3480 4295 -4023 2159 -271 -1044 2467 -3174 3617 -2994 1781 347 -2516
2707 -2516 3823 -4050 2635 -1053 -553 1955 -3160 3884 -4115 2922 -608 -1968 3159 -4122 3674
2722 3674 -2341 941 1166 -2608 3782 -3712 2871 -1236 -779 2921 -4232 4560 -3523 1656 516
2737 516 -1695 3179 -3730 3842 -2616 859 1876 -3490 4009 -3512 2208 -786 -1021 2910 -4078
2752 -4078 4621 -3283 1321 633 -2273 3589 -4224 3499 -1938 -154 2247 -3550 3503 -3190 2159
2767 2159 -289 -1757 3712 -4454 4001 -2431 548 720 -2376 3539 -4356 3718 -1556 -959 2684
2782B684o305O917o379M918k055k117O583q663Q001n514K544M87l902O933q550
2797d418P169l187j131M163n778P024o955M740o80m196P501q204O741m499K129
2812D19J297m825P357p902N638j826j606M383o393P099o494L598P01m595P211
2827D062p824O437m172J182K397n904Q108p698M773r68k027M390o371P480o083
2842b218J861K796n628O987p318O045l601K49L588o522P421o078L384m05k685
2857b124N145o763O742m413P03L104n459O668o609N306k906r04M420o574O802
2872C138m809K304J77l034N638o982N982k967o33L668n634O650o503M728j509
2887B14k397N377o519N897l910J582R99l770N860o129M451j493j527L933n691
$$ plain form
2782 2684 -3621 3296 -3083 1835 -220 -2337 4246 -4417 3584 -1930 614 1101 -2801 4132 -4418
2797 -4418 2751 -436 -1567 2596 -3182 3842 -3113 1627 947 -3249 4252 -3952 2789 -1710 419
2812 419 1716 -3109 4248 -3654 1984 158 -1448 2935 -3458 3641 -2853 745 1446 -3149 4062
2827 4062 -3762 2675 -1497 -315 2082 -3822 4286 -3412 1361 393 -1634 2756 -3615 3865 -2218
2842 -2218 -357 2439 -3189 3798 -3520 2525 -1076 -827 2761 -3761 3660 -2418 966 561 -2124
2857 -2124 3021 -3742 3000 -1413 -710 2394 -3065 3603 -3006 2300 -606 -1510 2910 -3664 3138
2872 3138 -1671 633 810 -2224 3414 -3568 2414 -553 -1186 2482 -3152 3498 -3005 1723 214
2887 214 -2183 3194 -3325 2572 -1338 244 1243 -2527 3333 -2796 1655 162 -1365 2568 -3123
2902c123O084n370L295n0l207N261n828N346l633J037J654m201N723n579L831
2917A240r45j694L635n531O272m796K306O06l451N136n505M596k772J59K646m623
2933b721N549m775K474K58k651M514n436M987l427J266J308l635M872m760L803
2948A626j780j049L495m685M445l396J532O52k989M611n051M298k664N95K142
2963A782l985M312l961K647l73j864L603m300L856k478J66K004l647M285m266
2978b219L511j664m26K787m136M025l125J439P11k745L999l992K934j492l05J978
2994A280l653M734m202K523n16j334K868l641L376k404R17P01k021L273l653K679
3010I27p44j335K723l274L145k344J329r4j244K180l094L017j722J77J478k651
$$ plain form
2902 -3123 2961 -2409 886 836 -2371 2890 -2938 2408 -1225 -188 1466 -2735 2988 -2591 1240
2917 1240 295 -1399 2236 -3295 2977 -1819 487 1093 -2358 2778 -2727 1869 -903 -744 1902 -2721
2933 -2721 2828 -1947 527 785 -1866 2648 -2788 2199 -1228 38 1346 -2289 2583 -2177 1626
2948 1626 -154 -1203 2292 -2393 2052 -1344 188 840 -2149 2462 -2589 1709 -955 -360 1782
2963 1782 -2203 2109 -1852 795 422 -1442 2161 -2139 1717 -761 -595 1409 -2238 2047 -2219
2978 -2219 1292 -372 -798 1989 -2147 1878 -1247 192 903 -1842 2157 -1835 1099 -393 -698 1280
2994 1280 -2373 2361 -1841 682 166 -1168 1700 -1941 1435 -969 -52 649 -1372 1901 -1752 927
3010 927 183 -1152 1571 -1703 1442 -902 427 333 -911 1269 -1825 1192 -530 -353 1125 -1526
3026a526K612j879Q21J9r52K249l143L286k336O27J012j947K248k086J777p50
3042C2l52J138k047K456j846M81R96k040K335k044J533r70L60L89j459K057j919
3059i00J175K51j704K236j627Q47l6n38O19j224K277k633J903m58j089K009j724
3076f16P76r9j19L18p14J045j296J162n32n60J643k070J368o48L21m3p8N85j138
3095f95J430p91n31J291j443R18Q3r06J153q26N56p32J377j364J28J004j240Q70
3113B82n0n48O37m86M07n70O17n31j62J163j753J819q70l32O71n85M83j76K12
3132B28l93j2Q64j636J475m79p39J668j749J182m64K22m14J53L78j101J665q55
3150go65J527j809J440m20j62K82q44J490j930K140j637P03N44j764J767r32K87
$$ plain form
3026 -1526 1086 -793 28 47 -905 1344 -1799 1487 -849 -222 790 -1157 1091 -995 782 32
3042 32 -320 818 -1229 1227 -619 -138 858 -1182 1153 -891 642 -328 32 421 -1038 1019 -900
3059 -900 275 526 -1178 1058 -569 278 242 -296 323 -901 1376 -1257 646 188 -901 1108 -616
3076 -616 160 61 -58 260 -454 591 -705 457 -75 -635 1008 -1062 306 -342 -21 -64 -142 443 -695
3095 -695 735 -56 -587 704 -739 179 262 -644 509 -317 239 -493 884 -480 -352 652 -588 282
3113 282 232 -316 321 -165 242 -328 289 -242 -404 759 -994 825 -45 -377 294 -291 192 16 228
3132 228 -165 -177 687 -949 526 47 -692 976 -773 409 -55 167 -247 -94 284 -817 848 -7
3150 -7 -672 855 -954 486 66 -96 186 -658 832 -1098 1042 -595 108 652 -1112 655 -277 10
3168A0L35q21J257j859J938j298M39R99k258K494k185J126m12J2R63j699J648
3185F89j234L96Q29k009K901k445J086K23j127J786k111K313k436J753n26j238
3201a150K605k634J637m49n56J556k276K618k583J734k26j220K703l152K730j879
3217e42L99N52j316K167k372J938p04q67K340l330L138k231R79O31k088K841l343
3234a808L166j731p8J789k858L170k414R10L59j550K947l460L170k598J066J055
3250A135l148M238l940K809j088o23J738k973L471k715J358O57k556L887m005
3265a755L082j697o6J838l271L756l434K511j028r11K978m019L716k313K06J869
3281A462l247L473l448K996j478r43L259m255M184l204J740R6j930L131l943L514
$$ plain form
3168 10 345 -476 781 -1078 860 -438 1 1000 -1258 1236 -949 177 -235 -223 740 -959 689
3185 689 -545 -149 680 -1329 1572 -873 213 436 -691 1095 -1016 1297 -1139 614 88 -1150
3201 -1150 1455 -1179 458 9 -547 1009 -1267 1351 -1232 502 276 -944 1759 -1393 1337 -542
3217 -542 -143 409 -907 1260 -1112 826 122 -745 1595 -1735 1403 -828 151 782 -1306 1535 -1808
3234 -1808 1358 -373 -451 1338 -1520 1650 -764 146 505 -1045 1902 -1558 1612 -986 80 1135
3250 1135 -2013 2225 -1715 1094 6 -617 1121 -1852 1619 -1096 262 919 -1637 2250 -1755
3265 -1755 1327 -370 -436 1402 -1869 1887 -1547 964 -64 -975 2003 -2016 1700 -613 -407 1462
3281 1462 -1785 1688 -1760 1236 -242 -1185 2074 -2181 2003 -1201 539 635 -1295 1836 -2107 1407
3297A407j828k10K212l559L946l808K675o58j593L757m390L785k865J540L10k397
3313a676L884m276L146r46j116K717l698M306l834K142J63k951M477m600L914
3328A652k626P89J577l557M292l677K400o30j621L352m312M492l439J494R78l277
3344b113M263m342L816k361J42K421m015M259l221J276M28j994L557m454M236
3359A898k690N14J893l520M051m348L523j681n09K712m055M086k745J138M53k575
3375a855M129m794M141j914l61K105l526M065m102L302j185j569L368l850L798
3390A752k825J198R95l222M787m883L454j482q65K551l419M215m011K191L68k370
3406a566L346l391K881j931M86J899l661M091l760K346o78j132K717l825M377
$$ plain form
3297 1407 -421 -631 1581 -1978 1968 -1840 835 177 -1416 2341 -2049 1736 -1129 411 721 -1676
3313 -1676 2208 -2068 1078 132 -984 1733 -1965 2341 -1493 649 812 -2139 2338 -2262 1652
3328 1652 -974 -185 1392 -2165 2127 -1550 850 220 -1401 1951 -2361 2131 -1308 186 1164 -2113
3344 -2113 2150 -2192 1624 -737 -595 1826 -2189 2070 -1151 125 553 -1441 2116 -2338 1898
3359 1898 -792 -278 1615 -1905 2146 -2202 1321 -360 -869 1843 -2212 1874 -871 267 720 -1855
3375 -1855 2274 -2520 1621 -293 -654 1451 -2075 1990 -2112 1190 5 -1564 1804 -2046 1752
3390 1752 -1073 125 1120 -2102 2685 -2198 1256 -226 -1091 1460 -1959 2256 -1755 436 804 -1566
3406 -1566 1780 -1611 1270 -661 -175 1724 -1937 2154 -1606 740 62 -1070 1647 -2178 2199
3421B199l413J179P49k146L046l382K772j377j76K240l675L991l154J195L15j351
3437i88K733l529L574k620N94J384k465K731k824K060q11p36K621l375L287k471
3453h35J369k5j601K936l724L468j966J09P30j821K961k871K139n80j202K462
3469A549l167K565j753P31J120k394K833k996K430j165k47J420k465K976k356
3484i19J370l22q46K090k752K774j840M56P25k068K903k691J649o76l97J332j879
3501a091J868j546R36M39j637K165k211J679q08k19J091j643K028k039J650q55
3517a93l78J239j638J474j151P35J50r74J539j700J455q79N1J179j904J974j560
3534e81J031m28mO22j364J416r78N3O85j207J428j041N39k17l35Q04j046J456
$$ plain form
3421 2199 -1214 -35 714 -1432 1614 -1768 1004 -373 -549 1691 -1984 2007 -1147 48 363 -988
3437 -988 1745 -1784 1790 -830 -236 1148 -1317 1414 -1410 650 -161 -897 1724 -1651 1636 -835
3453 -835 534 509 -1092 1844 -1880 1588 -378 -269 461 -1360 1601 -1270 869 289 -913 1549
3469 1549 -1618 947 -806 -75 1045 -1349 1484 -1512 918 -247 -494 926 -1539 1437 -919
3484 -919 451 129 -717 1373 -1379 1395 -445 11 736 -1332 1571 -1120 529 -147 -544 788 -1091
3501 -1091 777 -769 167 606 -1031 1134 -1077 602 -206 -425 666 -977 1051 -988 662 -193
3517 -193 -571 668 -970 504 -647 88 238 -736 803 -897 558 -321 -270 909 -995 979 -581
3534 -581 450 22 18 640 -724 692 -286 -233 452 -755 673 -368 171 -46 -381 423 -623 833
3552H33j512R00K3p26J145j123O15k95O1L6l93R16j151P40p7m47J068r81M72m55
3572c51L34k8ML67p87Q38n39k95O68m69M19k26p2j17L15L07o05O17o06O62n71
3593a35Q0k04L25n1k81N16l32q3M25n45J37K48m46M35Q1j12m84Q38r33O27j89
3614h3qL10j60N4m35M75m46K50L04n23N84n04J30M79m85K25l81N09n85M48j17
3635D1l28O42p78N02r3N4J63m24N93o34Q13l85m50Q87j175R64n85J28J39l09O57
3656D22r29P81m78J39M44q19P59n69L29o2j49L64r58J656j397N44M94j382J433
3675F22j333J162n22K63m0m72J088j428P66L68j185J350j453J347j014O59Pq19
3693f34J444j538J296n54o07J322j474J295q89L74N7o64J458k041K091j168L65
$$ plain form
3552 833 -679 221 244 -482 663 -460 155 -140 -79 -43 -436 480 -671 69 -8 -455 613 -368 104 -351
3572 -351 -17 -45 -41 326 -461 377 -162 -457 211 -258 161 -65 -137 -254 61 368 -237 380 -226 436 -135
3593 -135 -55 -259 66 15 -266 250 -82 -165 260 -285 -148 100 -346 89 170 58 -426 412 -521 106 -83
3614 -83 -91 219 59 113 -322 153 -293 -43 261 -262 322 -182 -52 427 -58 167 -214 295 -290 158 41
3635 41 -287 355 -423 79 -14 40 203 -221 372 -262 551 166 -284 603 -572 392 -193 -65 74 -235 422
3656 422 -507 274 -204 -65 379 -440 319 -250 79 17 -132 232 -726 930 -467 77 571 -811 622
3675 622 -711 451 -71 192 152 -320 768 -660 106 474 -711 639 -814 533 -481 178 185 -634
3693 -634 810 -728 568 14 -593 729 -745 550 -339 35 92 -572 886 -1155 936 -232 133
3710A33M04j227J368j125Q67n66l0R31j395J431j466O24N19j427J834j629J402
3727F48q63k0P95j134J828k105J378j98j166J755j933J823j142J92M61j548K265
3744A036k040J801j013l13J433j973J984j675J112R0j306J879k110J784j034o1
3760d06J154k047K511k204J581p26l43J528k194K022j515P04M12j331J589j659
3776i24J674n33l93J068k081K510k279J420k45r73J634j872J723j211L80N87j329
3793h44J761k013J567k70o10J307k088K460k293J390l2r89J889k373K029j475
3809e84L75J013j916K403k041J052O2q91J657k586K655k016R03J89j360K446k507
3826a146J594q47J10J308k027K102j897J070J23j071J864k430K240j356m0J061
$$ plain form
3710 133 537 -690 678 -447 420 -146 -176 755 -640 791 -675 -51 468 -959 875 -754 648
3727 648 -215 -235 560 -574 1254 -851 527 329 -837 918 -1015 808 -334 -142 319 -1229 1036
3744 1036 -1004 797 -216 -529 904 -1069 915 -760 352 442 -864 1015 -1095 689 -345 -406
3760 -406 748 -1299 1212 -992 589 -137 -480 1048 -1146 876 -639 65 477 -854 735 -924
3776 -924 750 217 -176 892 -1189 1321 -958 462 217 -756 878 -994 729 -482 -102 485 -844
3793 -844 917 -1096 471 201 -409 898 -1190 1270 -1023 367 335 -654 1235 -1138 891 -584
3809 -584 -209 804 -1112 1291 -750 302 364 -527 1130 -1456 1199 -817 86 275 -1085 1361 -1146
3826 -1146 448 -399 -289 1019 -1008 1094 -803 267 390 -681 1183 -1247 993 -363 -403 658
3842F58j876K117j897J665o00n48J291k056K453k062R50M33j582K196k284K174
3858A032j369r8J399j948J927j823J379l19q56K045k418K037j214K27N45j628
3874a082K240k387J840o25l99J355j809K091j912J082r4j315K136k055J719j136
3890c51K62Q79k215K859k607J718k70p10J346k189K371j942O08O00j390J959k057
3907a129J665r78L6J129j921K757k522J159j47o03J623k285K067j589O12O94j691
3924a123K173j968J442o69m13J457k334K781j994R62j74j020K037k190J868j109
3940b74m0Q72j601J838j534J346n96r29K046k359K369j679O46K24j146J930k252
3957a139J732p16r6R84j506J626j499Q73K63j493K113k319J831j068L13O65j524
$$ plain form
3842 658 -1218 899 -998 667 67 -481 810 -1246 1207 -855 95 528 -1054 1142 -1142 1032
3858 1032 -337 -435 964 -984 943 -880 499 180 -676 1369 -1049 988 -226 1 546 -1082
3874 -1082 1158 -1229 611 -14 -413 942 -867 1224 -688 394 300 -1015 1121 -934 785 -351
3890 -351 -89 790 -1425 1434 -1173 545 275 -435 911 -1278 1093 -849 -241 359 -1031 928 -1129
3907 -1129 536 -442 -406 723 -1198 1559 -963 196 49 -554 1069 -1216 851 -738 -126 568 -1123
3924 -1123 1050 -918 524 -145 -558 899 -1435 1346 -648 314 140 -880 1157 -1033 835 -274
3940 -274 -314 558 -1043 795 -739 607 11 -918 1128 -1231 1138 -541 105 329 -817 1113 -1139
3957 -1139 593 -123 -219 765 -741 885 -614 259 522 -971 1142 -1177 654 -414 -101 564 -960
3974i60K210k305J564m20n62J308j765K101j620O48K20j508K209k059J682r74
3990b31m2R33j508J749j571Q78p6p40J451j941J894j096N0O30j357K013j975J558
4008F19q61r8J223j977J893j488Q32K19j154J460j707J638r03K77O40j642K223
4025A194k020J188m17l59J148j554J523r66K96K47j073J670j659J195k18n76J075
4042F94j543J484j347J096m22n41J436j464J259q35j58Q80r15J049j156Q49k59
4059A07n03R56j562J868j141L17O3n18R16j029J238j094L36M70j352J745j479
4076f62Q13J2m69R07j383J277q58N09O8p96J434j324P63k52k32P78q61O61p13
4095c28M68J98p06J052j395J114m61k81M18n87Q32p99O14k08j78P27j075Q88l70
$$ plain form
3974 -960 1250 -1055 509 89 -473 835 -930 1171 -449 199 419 -1089 1120 -939 743 -231
3990 -231 -273 660 -848 901 -670 208 132 -608 843 -1098 796 -300 -250 380 -977 1036 -939 619
4008 619 -242 -340 883 -1094 799 -689 143 362 -792 668 -1039 599 -304 -27 613 -1029 1194
4025 1194 -826 362 -55 -414 734 -820 703 -263 33 280 -793 877 -782 413 195 -381 694
4042 694 -849 635 -712 384 -38 -579 857 -607 652 -183 -341 539 -376 673 -483 366 107
4059 107 -396 560 -1002 866 -275 42 105 -413 503 -526 712 -382 -46 424 -928 817 -662
4076 -662 151 163 -306 601 -782 495 -363 146 214 -582 852 -472 291 39 -193 585 -276 385 -328
4095 -328 140 338 -368 684 -711 403 -58 -339 79 -508 324 -475 139 -69 -247 480 -595 293 -77
4114g7k26N56n46P55j094R63p73L02L79o02Q31p99M59J03m60O48o74N49k88l5
4134b9O92j242J166r11R5o1N4N25n35N85l56K66p3m42N10o58M11J58m66P05n88
4155a94M00o51P57k87k39N79p33P32m79m29N99k52J20j28K72J7l63P70q43P79
4175D27m83pj02J71K74n85O94n08J54ml30N17k11K80k5n60N35l91K46k90K91l
4197I0o38O62k08L94k15j94O1K6P4M2R6m11M53K24o21N7K60j72j70M00K5l05K30
4220A60k14j18J99L6k45M35k22M6k2k12N5Q3jL74l19M2k47l4J03J19N9l64N15
4243B28n25L78k33J35J32j36R7j88n7K36n9k5l19M31k02K23J40m52M73n68M60
4264A69m23K63K33l56j2j15RM61m74N16m12M08l84m6N58n42L20k08K06o1k13R6
$$ plain form
4114 -77 -303 253 -293 462 -632 331 -442 -140 239 -363 468 -331 128 231 -229 419 -255 294 6 -29
4134 -29 663 -579 587 -324 -229 -290 -236 289 -246 339 -17 249 176 -266 244 -414 -3 155 -311 394 -194
4155 -194 206 -445 312 25 -214 365 -368 364 -115 -544 55 -197 -77 -205 67 84 -279 491 -352 427
4175 427 -56 -63 -165 6 280 -305 389 -119 35 31 -299 218 7 287 262 -298 237 -154 92 -198 93 90
4197 90 -548 114 -94 300 85 -109 -48 -22 52 94 190 -221 232 456 -165 -108 152 -20 -190 210 235 -70 160
4220 160 -54 -172 27 63 -182 253 31 77 55 -157 -102 -19 -20 354 35 77 -170 -204 -101 18 77 -287 228
4243 228 -297 81 -152 -17 115 -21 76 -112 -169 67 8 -17 -336 95 -107 116 256 -196 277 -291 169
4264 169 -254 9 242 -114 -126 -241 -232 229 -245 271 -141 267 -117 -163 395 -147 173 -35 171 110 -103 -7
4286gl00M90l24O1L37n92P88p17O4K47j82L21n04Q29q56L64Q4k73N09o46M69l11
4308a49j44N69p65R89q17L38O7o70J064p82N70l45j48N21m95N46n50L52j73l95
4328d17Q22r19R60n66K13J51n71O47q28J167q15O4K61m77L02m13P84l13l42Q61
4348E71j064Q97o13M8M53p41R37r49J156r34L01K15m70N98r11O69j66n71J051
4367D77q77P85m34j26L89p03J148j071O66l85m21Q85r19R15m93L31j91m82R31
4386D25r92Q84l64k40Q24j041J022o47M39j63n11N82o34P47n70K92L88q98Q37
4405C80q79Q70l74P1K38q59J089j059P75l6m27P07q14O49m48kM38p59P93q52O93
4426A94j72k70R06j233P42m99N33j76l28Q75r67P06l25q4M11p26Q93r06O23K1
$$ plain form
4286 -7 -307 183 -141 -80 257 -335 453 -264 -200 47 -135 186 -318 511 -345 19 103 -170 339 -307 162 -149
4308 -149 -293 276 -489 500 -317 21 88 -582 482 -300 270 -75 -223 298 -197 349 -201 151 -22 -417
4328 -417 405 -514 446 -120 93 244 -327 320 -508 659 -156 -92 169 -308 -6 -419 365 52 -290 571
4348 571 -493 404 -209 -161 292 -449 488 -461 695 -239 62 277 -193 405 -506 163 -3 -574 477
4367 477 -400 385 -49 -175 214 -489 659 -412 254 -131 -552 333 -586 329 -164 167 -24 -506 425
4386 425 -567 317 -47 -287 537 -504 518 -129 310 147 -364 218 -416 331 -239 53 441 -457 380
4405 380 -499 371 -3 68 306 -553 536 -523 252 216 -211 496 -318 331 -117 -119 319 -440 353 -499 194
4426 194 22 -248 658 -575 167 -332 201 25 -303 572 -395 311 -14 -98 313 -413 480 -426 197 218
4446B18p98J197j222Q95o64J91M40q44J097j075O35r6k90P17q82R06o78K85J73
4465B05n85P14q45J043n71L01k2p03J097j041M02J22k78L91q03R93o56n7N08o11
4485c96J017j298R43o26o1O87o66Q94j084P57O6m76P55q80Q85n27j16N76j083
4504f33J206q48L92k1k23O81j123Q79n20K14K40p56R89r67R67o31K0M41p58Q32
4524C81q09P86l02k21M27p12P77l76n4L89m96L02n99Q05p7l07L45o07Q25q02K60
4545f5M50n97N37o53O17m27K42J76p70J025r37N58J62n19O06q24O56k86K14j21
4565D4m5J78k97K66J3k10K43m85L40o46O48j16l90M25n08Q09m39R9K44n30M15
4586E8k37J53J42k67N57q59O73l60J14M9j44M79n73L02l3J2L57n46L35l27Q6L02
$$ plain form
4446 218 -580 617 -605 290 -374 -183 257 -587 510 -565 70 -26 -316 401 -481 425 -253 32 205
4465 205 -380 334 -511 532 -39 262 240 -463 634 -407 -5 117 -161 230 -573 420 -236 -293 215 -396
4485 -396 621 -677 266 -360 -421 266 -400 494 -590 167 233 -243 512 -368 517 -10 -126 450 -633
4504 -633 573 -275 117 96 -127 554 -569 310 -210 4 244 -512 477 -490 477 -154 -134 307 -451 381
4524 381 -428 358 56 -165 262 -450 327 -49 -103 286 -210 92 -507 298 221 -86 259 -348 477 -325 -65
4545 -65 385 -212 325 -328 289 -138 104 280 -490 535 -402 156 318 -201 405 -419 237 -49 165 44
4565 44 -1 177 -120 146 159 -51 192 -293 47 -599 49 -67 -457 -32 -540 269 -170 -71 173 -357 58
4586 58 -179 -26 116 -151 406 -453 220 -140 -26 23 -121 358 -215 87 54 66 423 -123 212 -115 -29 273
4608B73n31M82l34L20l48j83M86k26J26j05K59m32lL94m74L59k8j71K58l10J58
4629c0k77P06l90j00J99k64M59l11Q0ok03M78n30L37j72l20M34k43K75Rp7L7j67
4652g6J41k57K27l31K00K06k30L33k49J20l6q0K03n40M39k81J64K39j07j03k77
4673b95L13m1m0M4j13L20j69j43J38k7J45j95J30k00pL7J96j14l7K18j30l6K83
4696B77p9k15k6J08k50J55l4J7k04L99j95M6k63M9L37%j24n2K9j38K68l26J10
4719a11J60j41L41j32l77L27Q9k58K36k33K6P3n1J49j0j60M4J29l32K52k10K11
4741B2j27j10J52J0L9J57k99R4J06j89L52j65J06L2r8l51K41J43k27L21l20L1
4763h0K61k44J3P8R7l48K65j13p1L66k77Q8o0K39k50k15N73l76k1J95l06K89l04
$$ plain form
4608 273 -258 224 -110 210 -138 -321 165 -61 65 -40 219 -213 -216 178 -296 63 35 -136 122 -188 -30
4629 -30 -307 399 9 -91 108 -156 303 -8 72 66 -137 341 -189 148 -24 -344 90 -153 122 131 54 91 -76
4652 -76 65 -192 35 -296 -96 110 -120 213 -36 84 48 -32 171 -369 70 -211 -47 192 85 -18 -295
4673 -295 18 -23 -63 -19 -132 188 19 -124 14 -13 132 -63 67 -133 -140 -103 93 -21 -58 160 30 -6 277
4696 277 198 -17 -43 65 -185 -30 -64 -47 -251 148 -47 -1 -264 -215 122 122 -2 -54 -25 -163 105 -221 -111
4719 -111 49 -92 249 117 -260 67 156 -102 134 -99 -73 0 -51 98 88 -72 -28 101 -231 21 -189 22
4741 22 -105 -215 -63 -53 -14 143 -156 -62 44 -145 207 42 148 180 82 -269 -28 115 -112 209 -111 -80
4763 -80 181 -63 -50 28 125 -223 42 -71 -142 224 -53 35 -25 214 -36 -251 322 -54 -75 120 -186 103 -201
4786b01K06J55k56J14r9J67k78M73j67j18p3k53O45j45k14L43m83M56j67j13J1
4807Cj32L36k44M03m25K87j49l47M68n33P13l24q8L9k20M56m40L33p9k49L89k00
4829cL72n70L72j99j24N52n46J56K37m77O54n41L31k62O8n0n06P51m72M68k70
4850e9j30K84r0K64m93M52l33l9M60n60L01k37K41K22l01M55o03M29n01J63p7
4871a52Q1N86o61J24M1m48L59L8J45j46Q6J18n40P11o19L09K60o10P64o71L97
4892A72k47n0L42l36L46o03N94k14j69L44n72N75m12K78P8o2N7k96M05m85J71
4913h4L27k60J80m82M89o2k32J95j29K67m13J26O7j77M15m59N25l22K04j01k79
4934b05O02n34K23K50n78M67m73M91l35J54j94j70P15n47k8J45k05K91l03L32
$$ plain form
4786 -201 5 160 -96 18 -81 86 -192 281 114 -4 -77 -330 315 170 -44 299 -184 272 105 -8 3
4807 3 -129 207 -37 366 -59 228 79 -268 200 -333 380 56 -32 7 -213 243 -197 136 57 -192 197 -3
4829 -3 369 -201 171 -28 -152 400 -146 10 247 -230 424 -117 214 -48 20 -30 -536 215 -257 211 -59
4850 -59 -189 95 5 269 -224 228 -105 -144 316 -244 57 -180 61 283 -18 437 -166 263 -238 -75 -152
4871 -152 -71 515 -146 -22 19 -429 -70 -32 113 -33 53 171 -369 342 -277 32 292 -318 446 -225 172
4892 172 -75 -125 217 -119 227 -376 218 4 -165 179 -393 182 -230 48 126 64 121 -175 230 -255 -84
4913 -84 243 -17 163 -319 170 108 -124 71 -58 209 -204 -78 -11 -188 227 -232 293 -29 175 74 -205
4934 -205 397 -137 86 336 -242 225 -248 243 -92 62 -132 -302 413 -134 -162 -17 -222 69 -234 98
4954I8l14M39q2l54L04l84N14m11J00L01l48N46o89J30R5j54M79p46J072n29j34
4975f7J70n68Q27n00J41l29O9N49n16M60l14K59l33Q5J33l48J87o9L04Q8m93N78
4997C13n06J76j18j73P28r65P76k99OK67m75N27n50L88j22k07M87p82Q39m18K58
5018A50m0j34L10n51M42k46l5L15n92O22m35L15Q0n34N02l78M92m46K7L31m51
5039b56K89r1Q3j93K06K10m70M24m23K17P6k70N68o49N39k61J26j80l60O71n51
5060b95M68j33o5Q8k74N43n37J21J62k14M77p08M49j21M6K15n17K81q5K30Jm13
5082b81N98m78O21o90J98K41o01Q65p65L75k76J99J13m20N77k09K36j44l00K88
5102A47n78O97k53j08K58l63K41l49L95k00J88K67n99M82l46J17K87n02M85l47
$$ plain form
4954 98 -216 223 141 -213 91 -293 221 -190 -90 211 -137 409 -280 -150 -55 -209 270 -476 596 67 -67
4975 -67 103 -465 362 -138 3 -326 -257 292 -224 236 -78 181 -152 -67 66 -282 -95 -164 140 228 -265 313
4997 313 -193 -17 -135 -308 420 -545 231 -68 -62 205 -270 257 -293 95 -27 -234 253 -529 310 -108 150
5018 150 110 -24 286 -265 177 -69 -104 211 -381 241 -194 121 201 -333 169 -209 283 -163 -136 195 -256
5039 -256 33 -58 25 -168 38 248 -222 202 -221 -4 72 -198 370 -279 260 -1 125 -55 -415 256 -295
5060 -295 173 40 -25 63 -211 332 -205 -84 78 -136 341 -367 82 -39 7 222 -295 -14 -99 131 132 -281
5082 -281 317 -161 460 -230 -32 209 -392 473 -292 83 -193 6 119 -301 276 67 303 159 -141 147
5102 147 -431 266 13 -95 163 -200 41 -308 87 -113 75 342 -257 225 -121 -4 283 -219 266 -81
5122h1J87q1j43K71n46O04j81O9n7j06K97n42O34m05j97L66o1m1N9J1K2l20M11
5145A70k75L17p1j47m6r2M12m43L04j74K6P1q2N3k69M51r6m30N93m87L40l82K64
5168GK60n01O19m82K02k11O5J72l96L15pJ96j79J53J64o32L67J0m1j28k51M10
5190A12j15K67k80j0J20k99L39j32M4m3k85M85l49L46k36J56q5k62J75L8J01j43
5212e6p7K65k76L31k59N7J06j78L67m18L15m07K01K62m11J67K2jO3l41M84m44
5234b28K86j67j51L81j79L76m37M0Q9J15N8l65M98n03L69k47j10K40j01J30O5
5255A59m27K56R4j30j11L65pk43K7j92K79Q2l12J21k6Nl2J31q2J53o9q6L5k3O6
5280C3K0k8j93K36J94j80P8P7k59o4j24J28J09J65n8p1k76K26J09l1l8j73m3N0
$$ plain form
5122 -81 106 25 -118 153 -393 211 30 99 42 -64 233 -309 325 -80 -277 89 28 -13 46 57 79 -241 170
5145 170 -105 212 141 -6 -52 -144 268 -175 129 -45 -19 52 -30 23 -246 205 109 -321 272 -215 125 -257 7
5168 7 267 -234 385 -97 105 -106 -41 131 -265 50 43 239 60 213 377 -255 112 122 81 -47 -298 112
5190 112 -3 264 -16 -26 94 -205 134 2 46 3 -282 203 -146 200 -36 120 35 -227 -52 -14 87 -56
5212 -56 -133 132 -144 187 -72 -15 91 -87 280 -138 177 -230 -29 233 -178 -11 11 10 73 -268 216 -228
5234 -228 58 -109 -260 121 -58 318 -119 -79 10 125 183 -182 316 -187 182 -65 -175 65 -36 94 159
5255 159 -268 -12 82 -48 -159 206 199 -44 -17 -209 70 152 -160 -39 -65 -60 -92 39 -43 110 41 -45 -10 -33 33
5280 33 53 25 -168 68 262 82 160 237 -22 -86 -210 -82 27 192 134 63 -213 13 122 91 53 -120 -163 -113
5304a13LJ14p0J43k90K53Q2j2J52k92J93j55J47n7j49K80j15j86J13J13j98Q3
5326C9J08r0mj2p6J52l92K14K38l26L6Ll3N5P5qL1j45L9K06o5q8L9L8K8r9n4M4
5354d7J32j31l5K14l42L03j2r2J50j76N2l00K99J70j64J16k14J04k4r8K56j87
5376b6P7l66K7L05j75K52j85J44k8j05K91m93L14J4k4j57j15M65l92K21k43K41
5398D2r2j07L47j58K04j46k61K62k62J56j21jM23n13J89k43K37N4K3J55j6o7l15
5421b10K61K8q9J93k26K38j78Q9j48o8J34j61K98k00k5K01m04L88k94K08j38J66
5443F3P5m02J99p9j27M92m06K51k00N8K2j26N27o87P09m12K51j77k19J95j81K06
5465C2j82jK97j98K86k81R8K85n96K97k53M10n93M88n1m31O46m30L63k07J5O60
$$ plain form
5304 -113 -110 4 -66 77 -213 40 122 110 262 -30 163 8 155 98 -51 229 114 -72 41 154 -44 39
5326 39 147 57 53 41 -35 117 -275 -61 177 -149 -113 -110 -143 -88 -13 -21 10 -135 -96 110 45 -43 -4 34 62 -37 -91 -47
5354 -47 85 -46 -81 133 -209 94 82 -10 140 -36 16 -284 15 185 21 137 -77 27 3 -95 161 -26
5376 -26 51 -315 -288 17 -158 94 -91 53 25 -80 211 -282 32 46 22 -135 -250 215 -177 44 -199 42
5398 42 -50 -157 190 32 236 90 -171 91 -171 -15 -136 -137 286 -227 -38 -281 -44 10 33 188 172 105 -210
5421 -210 51 79 -10 183 -43 195 17 106 -42 -110 24 -137 161 -39 -64 137 -267 121 -173 35 -103 63
5443 63 138 -264 -65 -144 -271 221 -185 66 -134 -76 -54 -180 347 -340 369 -43 208 31 -188 7 -174 32
5465 32 -150 -151 146 -52 234 -47 51 336 -260 37 -216 194 -399 89 38 -393 253 -177 186 -21 -6 654
5487F54q24L92m07J40k7l89O12k53L56j47k96N4j64O78l73L2J13k51K87n56O89
5508C20m42Q5m3j0M79m77J28j96Q2L15n32O40n57J62K12n61O54m05P6J24k02M64
5530C16m37L98m55L10j97k55N27l86K48o9N3n3n0K87l90K5L42j44J0m05N57k62
5552c0m0J48l45J75o5K17j85K75M6o06M29j49K82j66j57M04n60M71k30J64K4l85
5574b83L79j26K75m78J08K49k30L03k06O3P0n05N49l00K58j94M0o5k22N46m69
5595b38K58l1j37N05m46K71l21k24M70l26M40l72K38n6k60M57k62J50l63J59K00
5616A12j99J83k25K58j8J0J29m90J93k88L68j7k14K88k51M19n70K68P2j13K69
5637A84j96M3nj48J77l71L62j43M17l42m0K73n83O92k91k1M35m47M2q3Q6K56k86
$$ plain form
5487 654 -170 222 -185 -45 -72 -461 151 -102 254 107 -189 -135 -299 379 6 38 151 -100 187 -369 320
5508 320 -122 -37 -80 -90 389 -88 40 -156 -74 241 -291 349 -208 -46 166 -395 259 -146 -70 54 -148 316
5530 316 -121 277 -178 132 -65 -320 207 -179 69 0 53 0 -50 237 -153 -128 214 70 80 -325 232 -30
5552 -30 -70 78 -267 -92 -157 60 -125 150 196 -410 19 -130 152 -14 -171 233 -327 144 -86 78 102 -283
5574 -283 96 -30 245 -233 -125 124 -106 197 -9 54 124 -381 168 -132 126 -68 -28 -93 -315 231 -238
5595 -238 20 -11 -148 357 -89 182 -139 -363 107 -219 221 -151 87 31 -229 228 -34 116 -247 -88 112
5616 112 -87 96 -129 129 111 121 250 -240 -47 -335 33 16 -198 90 -161 258 -312 -44 28 -85 184
5637 184 -12 31 26 -122 55 -316 46 -97 320 -22 -62 211 -372 320 29 8 443 -4 38 -45 41 297 11
5660A1J38l35N84n48J07O5k67M15m41L48R3j81Q5k42L56l13Q7J68j92J00k97J45
5682a14J36q3O0q0M05n04N8K86k42P5pJ42N7p4m5l64K17Q0J91k02j43M68m45L12
5706A84k66oK07l81L06j22K54j28j29J19l13O01n24K03N2K23j66l18K53k90L28
5727H7Q4m9J03k24k7j99m2M94m31M40k83M3L0k5J44k08J47J60k15j42j55M00j83
5750e1l8Q8j41L42l21K70j92k6J41j42L69k13N4k53N4j38M7K97l01K08M7j42N4
5773A3j89K07Nk36K50J06k23K38j05r5l2K82k82j3mM4L6L3j95j46M40j70r7K65
5797A32K1j16j8l26L47K8j95N1Q9M1J51j03qO3j99J7P2m0J53k06j28J58o6K09
5821A27n4J14lk25Q1k68O7K41l05M36k68p5L11j82J13n0j42M9J68R6l16J48j64
$$ plain form
5660 11 149 -186 398 -150 -43 22 -245 170 -271 77 170 -11 74 -168 188 -125 -38 130 -62 38 -259 -114
5682 -114 22 -61 -1 -81 324 -180 -122 164 -78 -3 -10 132 189 115 70 -294 -77 3 194 -8 -151 317 -128 184
5706 184 -82 -88 119 -262 44 -78 176 48 -81 38 -275 326 -198 5 57 280 114 -204 49 -241 87
5727 87 171 122 225 1 -26 -225 -267 227 -204 236 -47 -4 26 1 145 -63 84 244 29 -113 -268 132 -51
5750 -51 -89 -1 -142 200 -121 149 -43 -69 72 -70 299 86 140 -113 -59 -197 -150 147 -154 54 101 -41 13
5773 13 -176 31 36 -200 50 156 -67 171 66 -29 -61 221 -61 -74 -78 -34 2 35 -160 -306 134 -36 -133 132
5797 132 153 37 19 -307 40 68 -127 -76 13 54 205 102 94 157 -42 -25 47 7 160 -46 -174 -16 -82 127
5821 127 73 187 184 -41 40 -228 -161 80 -225 211 -57 -132 179 -3 110 60 -82 -33 135 231 -85 63 -101
5844a01N4j0R1n0N6O6k10kJ19o9o8J5P0L6J78j43k86K13kP2j60J36J9k5J8r5J61
5871H3P9k28j88K09J55Jkm06K75J08Pk23L1K4O5p9J44j67J73K30m24J34k54L81
5895A28%k66J21k02J32J60K1o1L6J2k7j85J51J46M9j68j13j9J36mJ03k42Q0K08
5919A96l08J16k7N6K00l24R4J40n24K13j6K47LJ27j34q4P1l50M47k44J33m5R2
5942G9p4J27p3o5lK98k84P2j80K57j24k35K20j43M19j99M2m4j7j34J26j3M9l89
5966b88L41j20Q0q5P2J00k56M86m71O8K69j76K9k34L4NK91mj54L10l08m7LM64
5990D09k87j33J90l3K53m53j00K35k69M64l83pJ41m9J61k31L34k39K0J70j94L24
6012C23k22J42k52Q3N4k95J61m6K9L8l16N70m52L69j52k9J11j70J52m12M07P3
$$ plain form
5844 -101 -47 -57 34 -16 40 106 -104 -106 13 -56 -124 -109 -39 -3 175 32 -254 -41 -43 29 -131 5 24 -1 17 -78 83
5871 83 162 -66 -254 -45 110 111 109 -297 -22 86 93 -130 -99 -75 -10 -89 55 -112 61 291 -133 1 -253 128
5895 128 128 -138 -17 -219 -87 73 94 33 69 81 54 -131 20 166 215 47 -66 -85 51 47 150 -92 -12 196
5919 196 -112 4 -23 33 233 -91 3 143 -381 -168 -184 63 66 193 59 -25 46 -304 143 -101 32 -13 79
5942 79 5 132 59 -6 -9 289 5 77 -103 154 30 -205 15 -128 291 92 134 90 73 -61 65 52 101 -288
5966 -288 53 -67 13 -72 0 100 -156 330 -141 -73 196 20 49 -185 -151 -146 145 141 -13 297 -11 -58 -55 409
5990 409 122 -11 179 146 399 -54 -154 81 -188 276 -107 -114 27 -22 139 -92 242 3 23 193 -1 323
6012 323 101 243 -9 74 128 -167 -6 -52 -23 15 -301 269 -183 186 34 5 116 -54 98 -314 93 166
6034A66l23J85k26K54k08j3L06j42Q9J10p2j63J97Q5k98K01M6k20J61j11L3k2
6056C5R7O2n08L45k48L18n9J36k95O1L46m72M34k44P1J36m10L48J3r9j25r5L66
6079B13l70K90q8j98J87k02K43j39L90l42J6J68k82K40k07J44K08k83J87k41M13
6100C47o37O2K26l55M45l56K80O0o6P9l92M71lJ7j00k35M28l19K73j73O3on9K35
6124B85l61J22Rq8L05n57N22k51l36O23l69J85k14L60k56J8J97m48M41k40P9N7
6146H3k75L75l74J92P9k27Q5p8J41j62K45J24k71M05n03M25k64J44L8k61L99m37
6168a17N2k8p4M85l35q5L2N55n15M9K33m94K30j26K03J05l00L97l83R4j78P9K64
6191A43k91K75k12J61j32k99M53qn2m9j02K04k08L67j40l09M62l93J69m7M9J65
$$ plain form
6034 166 -157 28 -198 56 -152 -165 141 -1 88 198 126 -37 160 245 -53 148 194 -26 135 24 57 35
6056 35 132 194 -314 31 -217 101 42 178 -117 -56 290 -182 252 8 79 215 -195 153 166 67 -58 -153 213
6079 213 -157 133 45 -153 34 -168 75 -64 326 -16 0 168 -114 126 -81 63 271 -12 175 -66 347
6100 347 -290 -228 -2 -357 88 -268 12 72 6 85 -307 164 161 178 78 -157 271 -48 225 52 115 109 50 285
6124 285 -76 46 55 -33 272 -285 237 -14 -350 273 -96 89 -125 235 -21 -3 194 -254 187 -53 26 83
6146 83 -192 183 -191 1 80 -147 -62 -140 1 -161 84 208 -63 342 -161 264 0 144 182 -79 320 -117
6168 -117 -65 -93 -167 318 -17 -102 -70 485 -30 19 252 -242 -12 -138 65 170 -130 267 -116 -22 -200 -121 143
6191 143 -148 127 -85 76 -56 -355 98 90 38 -11 -113 91 -117 250 110 -199 263 -130 39 -8 41 206
6213B06K5j75j03J06k44K18j53j27K29j19K32j57J19J34j71O1k58K18j69rj09
6234b46L10N8k07K96j73j48Q6l5M3K73m73K47L4J73m95L74k50L25k51K3L44j54
6256A54k6k06O7P9j54K77n5l24Q1P7K29k66Q1n4j5J98l28M49l55J32l10J31K46
6279A08m07L23k15m3K54j56M2L35j50j6j66L00l20K06Jo1j12K4o8K72r6o2q0l
6303i0k11J87NJ82j07m1K64k75L3J12nK35k97P9j55J61k9K9j21J61J0l8k96L61
6327A54k24K59m5j05M6m00L92k22K46l05K79K18j44l24j06L59J0k53K55j05j82
6348a97n2L22K2j36n4K63l47Q4K17m9k84J87l1L9q7j8J50L70j30l12kK9K29j00
6372A13J83j82k56O5k7K12j16j18K5Q7k6M51l97J45q2j22P1J02l44L57k73K30
$$ plain form
6213 206 231 56 -47 59 -185 33 -120 -247 -18 -137 95 -62 57 191 20 81 -177 41 -128 -137 -246
6234 -246 64 122 -85 211 38 -110 -24 -59 -16 257 -216 31 65 238 -257 117 -133 192 -59 -36 308 154
6256 154 128 -78 -11 68 -86 191 136 -188 -107 -30 199 -67 14 -40 -55 143 -185 264 -91 41 -269 -138 108
6279 108 -299 24 -191 -234 20 -136 -94 241 91 75 -91 209 -111 95 96 35 -77 -53 -121 151 55 -7 -87 -90
6303 -90 -301 -114 -109 73 -34 -75 189 -86 -53 59 54 289 -8 71 -84 77 48 77 -44 117 127 89 -207 154
6327 154 -70 189 144 39 85 -315 77 -145 101 -204 75 293 149 -175 -281 78 88 -165 90 -15 -197
6348 -197 -249 73 95 -41 -95 168 -179 -95 122 73 -211 -24 -55 -16 -103 -121 29 399 269 -43 -45 -16 213 113
6372 113 296 114 -142 -77 -104 108 -8 -126 -101 -14 -40 411 14 159 77 -45 26 128 -216 141 -132 98
6394I8M4j81r7Q8J12j29J78l4R5k60J22q6M0q1K04l11K85k79L29M3l26K08j77
6417a15K46l9pr7K08l36R3J50l3k2J59j38P3k21K1j00K76k51J62j0M3j15J96j60
6441a7J51J32k67o2j59K03jJl8J98P5j44J13j05j09k5K42Jj26j01K96j72L1l17
6465b00K72k50M61o7o00L33j86J10R1j9J92k54Q9p0R0P6k29J57j53J33l67K40
6487a51R7M8n2k15L62j61K24k02P8l9J69Ml01M9J11j79K19no2L28m75J70j19N1
6511e1J5J07j76J47j04l3J27M5k21J77j10J01J7J02j02N4j74j67K38OJ96Q2m24
6534a48K14r5l11M53j60J00j39R6K7j44K39l07J74m0p5L3K0l3j42M18j95j3J8
6557a0J99R9m82J36O4Q0OmO6k83R6Q0p4R8pj7J0k53R8j34N25m85N7M6J58J10m39
$$ plain form
6394 98 142 -39 -136 -48 64 -65 113 79 174 -86 36 -50 -10 -91 113 -198 87 -192 137 180 -146 62 -115
6417 -115 131 92 85 -12 196 -140 -47 103 70 48 207 69 142 -79 -58 -158 118 -133 29 19 62 -53 143 -17
6441 -17 134 266 -1 -63 -222 -19 -20 -19 -57 141 216 72 185 80 -29 -54 188 189 63 -38 258 86 117 -200
6465 -200 72 -178 283 216 -384 -51 -237 -127 -36 -55 137 -117 -28 -98 -8 68 -161 -4 -157 -24 -391 -151
6487 -151 -54 -6 -58 -273 89 -72 152 -50 28 -11 158 162 -139 -90 21 -158 61 56 -6 322 -153 17 -102 -51
6511 -51 -36 71 -105 42 -62 -95 32 77 -144 33 -77 24 41 143 41 95 -79 -246 -8 -2 194 276 -148
6534 -148 66 -29 -340 113 -47 53 -86 10 37 -107 132 -175 -1 -41 -116 -83 -63 -96 -238 180 -15 -28 -10
6557 -10 189 288 -194 -58 6 86 92 88 154 -129 -33 47 -27 71 64 47 57 -196 -98 -232 293 -192 -135 -89 69 179 -260
6584b60M63l97P8K00J5j83j3J53q9m0K62l67O1q9L54n6r5K36k44J29k52L02j53
6607A5M0P6k51J88P5j86J33k18L30k97J61j09j4Rj2J79k61Q1K55k21J23k7k20
6630a51L22j79K77n71K57n4K80q1k35J30m7O4l4L4l3p9L91m08j08M77k72nq7L39
6654B27m25L06j1KK00m05M37k03n4qj71J68J45jj39k66K05PJ65k44L3K01j48K03
6678B24k19j6O0l29M71k17Q9j65P4K4k92N79m33k2J24J42L0k61L04k24J47J24
6700B14j88J31m66N07j26o6J86j00M3ok41J41NQ8l44J79N1N6Q2l82N38m42K44
6723A04Q5j06O2j79n1m4J76L5j96J60l90L60J24k17L72k18O8j02J81l33l2K45
6745A04j63J29j31k4R3j20K08O3k1J07m2M0k30jo1n9N0J9j25K31J07p0K13k62
$$ plain form
6584 -260 203 -194 -116 84 99 -84 -97 56 -33 -73 189 -178 -117 -206 148 92 -3 233 -11 118 -134 168 15
6607 15 55 131 -120 68 143 -43 90 -128 202 -95 66 -43 -57 -48 -60 119 -142 -61 194 -27 96 69 -151
6630 -151 171 -8 269 -302 -45 -99 181 100 -135 -5 -52 12 -22 12 -21 -100 291 -117 -225 252 -20 -25 -112 227
6654 227 -198 108 97 99 299 -106 331 128 74 66 -105 63 208 207 68 -198 7 14 179 -65 -32 169 21 224
6678 224 5 -11 49 -280 191 -26 63 -102 -28 -4 -296 283 -150 -172 -48 94 124 -137 167 -57 90 214
6700 214 26 157 -309 198 72 6 192 92 135 129 -112 29 34 122 -222 -43 8 64 146 -236 302 -140 104
6723 104 189 83 145 -34 -85 -129 47 82 -114 46 -344 16 140 -77 295 77 145 43 224 -109 -141 104
6745 104 -59 70 -61 -85 8 -112 96 159 138 245 203 243 13 12 -49 -108 -58 -39 -164 67 174 104 317 55
6769E5J2j3j91M10n13L11J38l86qK59M64m06l39J94p8K87n08K76L43m00Q9k62
6791b66L73n4l8r7J11j33M1K4J03j67K36l10K47m4j67L0J68J59l48K6K76k57l4
6814a21n0K11o8j0J25Q0r0P2j79r3K69Q8k38J99k59n1R2N3J71j73kk73L99k19
6838f7o8K51q6j00J92J02o9p0J52j05K1M4l17L28l66J47Pk7K11k87J95l23L22
6861H7R3l75K59o4n1K39j28P1r2JK3J09l84J42m5J5K05l01J30J0J45p8OJ7k22
6886a88L22j05Kk23J66Q6k28R6J97q2M8P0%j4j29P8q0j69J54J70k11R1o0O2R9
6911A52k75J96j49N6l9N5P3k13J89P6r3j80J03o3L7j27R2P5J49R0j44j07n5K35
6935A33p9R5l32L37k9m67L00N7k35j2J98J63J07k48Q5j87Q3k09K17J64o3k08M14
$$ plain form
6769 55 67 54 -137 273 -240 71 209 -177 -185 74 538 132 -207 -13 -91 196 -312 -36 307 -93 -4 -266
6791 -266 107 53 15 -82 29 -104 -63 -39 64 -103 133 -177 70 26 -141 -111 57 216 -132 -106 170 -87 -121
6814 -121 -171 40 -28 -38 87 167 77 149 -30 -123 146 234 -4 195 -64 -115 -23 30 201 28 26 -247 152 -67
6838 -67 -135 116 30 -70 122 224 155 85 237 132 153 197 -120 208 -158 -11 -4 -31 180 -107 88 -235 87
6861 87 180 -195 64 0 -51 188 60 131 39 40 63 172 -212 -70 -115 -100 105 -196 -66 -56 89 11 17 34 -188
6886 -188 134 29 31 -192 -26 60 -168 -72 125 43 91 161 161 147 18 96 16 -153 1 171 -40 51 -9 53 152
6911 152 -123 73 -76 -20 -59 -4 69 -144 45 121 28 -152 -49 -112 -75 -202 -110 -35 114 204 60 -47 -102 133
6935 133 54 149 -183 154 125 -342 -42 15 -220 -232 -34 129 236 -12 73 -114 -31 -240 -23 141 78 -130 284
6958B84j89Mr1J38k88J34J04J36l35J00J82k40K28j80l69K88N2M7J32j27j96K03
6980A7j64Kj08M59j42J28j96l55K89J13j52J32Q9j3j14J9j09Q9J46j37J06r2J31
7003A38K5j09j19K51j47j54L16r6J6j26o7K79k70J59J28k92N6k77J97q7L61p5
7025A07k11K89j50K31j35j83O9j8K1j68J14R7l25K23M3P7j74J58k53J12J30k50
7047a96L38k78J74J23j69P0n6K59l70j50L41k0J17L7j85kL5j24j20J60P0j24p3
7070a43K32j55J57Q2Mk00qJ85j22j29J36o9j23K78O0j18R0r7J21m77K42J4J11
7093G1P2j32J75q0p4J87k58K7Q1J78l22L18j46k13L51k8j67O2k23J84KO4k91L47
7117A85j36o1o4r7P0K07k48K98l20K26k73M16k70k5J49j53K97k93M8K34j50N9
$$ plain form
6958 284 95 99 8 146 -142 -8 96 232 -103 -3 179 -61 167 -13 -382 -94 -42 5 137 10 -186 17
6980 17 -147 -145 -253 206 64 192 -4 -359 -70 43 -109 23 112 99 -15 4 -105 -16 130 -7 99 7 138
7003 138 163 54 -65 186 39 -115 201 105 121 -5 -72 207 -63 96 224 -68 -12 -289 -92 -179 182 107
7025 107 -104 185 35 266 131 -52 17 -1 20 -148 -34 63 -262 -39 4 81 -93 65 -188 -76 54 -196
7047 -196 142 -136 38 161 -8 62 6 265 -105 -255 86 66 183 220 35 33 68 -56 -176 -16 54 -70 -143
7070 -143 89 -66 91 173 177 -23 -31 154 32 -97 39 -30 -153 125 185 67 157 60 181 -296 -54 -40 71
7093 71 143 11 186 106 32 219 -39 -12 69 247 -75 243 97 -116 235 207 40 102 -121 63 65 129 -162 185
7117 185 49 -12 -76 -173 -103 104 -144 154 -166 60 -213 203 -67 -92 57 -96 201 -92 -44 190 40 99
7139I9k9K29l01j47N41n27K53j81K30l11R0R5r6K38l41L24j79q9j42J42J61r4
7161c5m0L01l26K82m38J94j47L15J63m32K44n5m07N88l32L03k67K73j60j53M45
7182C16k46Q0k53J42J30k97K70j54L77m79O4J12k55M3J47Nq4K1K59l94J66k18
7204b48L52J93n65L57j89L39r6l47K32j09P8R3L4J52l41K99m45J50Q1K01j29k17
7226a25K81j10j72N4q6M51m70L08j32J50j12J18j71M2k62p8R5O01m68J18J07r8
7248D1Q8k64R9J20N3j22R5nl87N80m49K89j52P6J5q3J96l09P7p2J69J1L0O5k08
7273d7J28L4l87L44k24J99l6n0J78o8j85m5O8j6J44J3m14L28J3n38M20J58j6q9
7297h8K94j85j76K7J77K25m09K13n4J35J87n50K66j86L7J72k06J53j47J78j13
$$ plain form
7139 99 70 299 -2 -149 392 -135 118 -63 167 -144 -54 41 -55 183 -158 166 -13 -102 -244 -102 59 -35
7161 -35 -75 226 -100 182 -256 -62 -209 106 269 -163 81 26 -381 207 -125 178 -89 184 24 -129 316
7182 316 70 150 -103 39 169 -128 142 -12 365 -114 -50 62 -193 -150 -3 2 -82 -61 198 -196 -30 -248
7204 -248 104 297 -268 89 -100 239 143 -204 28 -81 -3 90 124 276 -65 234 -211 -61 20 221 92 -125
7226 -125 156 46 -126 -72 -158 293 -177 131 -1 149 37 155 -16 26 -236 -314 -219 382 -86 32 139 41
7248 41 129 -135 -36 84 137 15 110 105 -282 298 -151 138 -14 62 77 -6 190 -119 -42 -114 55 66 96 161 -47
7273 -47 81 115 -272 72 -152 47 11 -39 139 71 -114 -159 -91 -107 37 50 -364 -36 -23 -561 -141 17 1 -88
7297 -88 206 21 -155 -128 49 274 -135 78 24 159 346 -204 62 -124 -87 85 -121 32 -115 63 -50
7318e0l3P7p6L21k45J12j30j28K07R4k02K18k83L37k81J99j6L1j58q6J05j47J70
7341C6p2j63M02j51L7l6J3j02p2K17j66O5j02R6Q7j81L17j58k08J43j81K75j70
7364g4R8l04R1M79l71J85j02J72k96Q3L7j59J88o5N0N2l59K21nJ29K2L6Qj50O6
7389C2N9J1j68pQ8j2R2k48O2P6Q7J65m51J30R1k20K79j98K91k12m8M04l39J96
7413A60m1j96L6J60j27j18J01K9l3nJ8m3j87J53l9M0l4mL42j80J27l50K23J39
7437A71j17o5j38R7L6K0L5j04j94R5L5J68l4N8PM2k29r3K10k5J59k28R0k4lM0
7463IJ55j58j6mo5K42LM1Ql11P9mJ66j66M6O4k39J59p7J69k95K86J09j93j14J99
7489I3j03K4j11J18j4j09J43o5K4j34q7L55j90k00Q0K53q0P9j09O2L4j72J26P0
$$ plain form
7318 -50 -83 -6 -82 239 -6 106 -24 -152 55 149 -53 165 -118 219 -62 137 121 152 -6 -92 13 -134 36
7341 36 -36 -199 203 52 89 53 66 -36 -108 109 -57 8 -94 2 89 -92 225 67 -141 2 -179 96 -74
7364 -74 24 -280 -189 290 -81 104 2 174 -122 -39 -2 -161 27 -38 12 64 -295 -74 -79 50 72 108 116 -34 32
7389 32 91 102 -66 -73 15 3 95 -153 -91 -15 72 237 -214 -84 7 -213 66 -132 159 -53 -101 303 -36 160
7413 160 119 -77 -41 119 -8 -126 -25 4 -29 -34 -16 -59 -246 -93 -132 -92 -126 -130 212 32 159 -191 32 171
7437 171 54 -11 -149 -52 -16 4 39 -65 -259 -164 -129 39 5 63 70 112 -117 -210 0 -25 134 -94 -4 -28 -31 9
7463 9 164 6 -10 -14 -79 163 166 207 215 -96 -17 -21 145 -21 25 89 -150 9 -68 101 -194 92 201 8 -106 93
7489 93 -10 14 -97 21 7 -102 41 -24 0 -134 -221 134 -56 -256 -176 77 -3 76 -33 29 63 -109 17 87
7513H7p7o6J04%j2p2N2J37j03J8j13%J93Jk55N10l53l9M3l4j02R0J8m8lo1J27
7540D2j41K68j46J17l8PK1l75K28R0l29L64q8k20L46k21J29j50K72p9o6Q7k13
7563i5L51j51o0n8oM47k70n4k39K46l1K7J18j54j95L86l06K05l38M44j60k42J55
7586B0J55J40k59J39j63j22K82l17K94l73K87J22l25M04l91J15m3P9J17l00L13
7607A74l32L5L4L7M0j41K45j12l9R9k55K50k04L03l24o6N83n88L98m09K08L08
7629B44j44n0k3J57k16r3L45k00l5Q1n3r7J85p6n9K00j14Q9j60n9P4M1J77j16
7653I8j49K14l55J58Q5r2J51J4kj95J14l03J47K43l27L89l50L12l0j81L02l77
7675a34J9R4LJ50j69K99l76N8qJ46Q3l14N07l04J05j69n7J95j80K68j43j54K11
$$ plain form
7513 87 10 -56 48 48 36 -36 16 153 50 68 -45 -45 148 149 -106 404 51 12 55 21 -81 9 27 -21 -24 -85 42
7540 42 -99 169 23 140 102 109 130 -245 -17 73 -256 108 20 -200 146 -75 54 -96 176 97 31 118 -95
7563 -95 256 105 45 -13 -19 428 158 104 -135 111 80 107 225 71 -124 262 -44 161 -177 267 107 -135 20
7586 20 175 315 56 195 32 -90 192 -125 169 -204 83 205 -120 284 -107 8 -35 44 161 -139 174
7607 174 -158 -123 -89 -52 -12 -153 92 -20 -59 40 -215 35 -169 134 -190 -256 327 -261 137 -272 -64 244
7629 244 100 50 27 184 -32 -125 220 20 -15 66 13 -84 101 25 -34 166 52 141 -19 -78 -4 37 214 98
7653 98 -51 163 -192 -34 51 -41 110 124 122 -73 41 -262 -115 128 -199 190 -160 152 122 -59 243 -134
7675 -134 -115 -21 -18 132 -37 262 -114 -56 -64 82 165 -149 358 54 159 -10 -67 128 -52 216 73 -81 130
7698A30j99K48l17J90p0j91L62l53K00j23M6J38O3J17l61K20P3j72O9j08J0j27
7720a55J47J69j10L20m41R6j38K80r7j31J63k54K25K01m48K42k02K50k54K37m00
7741c00R8K66k22J76k86l9N05m47L71j55N7J7K8J38k58k7J6R8o1Q6J34p1qN4k67
7766i7K59l44K70K5k2m0M2m1j52J11n8R2K11m32K03M5j47K66j8j14l42M54m17
7789b46L15m0j58L15l33J79LJ16j92j03K40r1k8Q1l68L85j86J87m1j54n4M2K80
7812A49k64J23j68K92P2o8J20j38J7p9p6M3j2q5q0o3K63m2J59r2l75L78O1k34
7836i9O7q2O4j0J05k2J3J41J27l40J35L9l02J47L8M4k09J00K43k89J53o3q1R2
7860A1j4N3l36L92q3k63K84p3j9p3J68qJ57k78l2n9J70j92L90n01K31K3K4J12
$$ plain form
7698 130 -69 179 -138 52 -18 -209 153 -200 0 -123 -77 61 124 241 -120 100 173 1 70 -38 -28 -155
7720 -155 -8 161 51 371 -70 26 -112 168 71 -60 103 -151 74 275 -173 69 -133 117 -137 100 -300
7741 -300 -202 64 -158 18 -268 -307 198 -249 122 -33 24 41 69 207 -51 -78 -62 36 -25 61 195 124 116 170 -97
7766 -97 162 -182 88 113 91 51 93 52 -100 11 -47 45 256 -176 27 72 -75 191 173 59 -283 171 -246
7789 -246 69 29 -129 186 -147 32 35 151 -41 -144 96 5 -23 58 -310 75 -111 76 35 -119 -173 -131 149
7812 149 -115 8 -160 132 204 136 256 118 135 56 -20 23 11 -74 -154 -217 46 4 163 71 -304 74 135 -99
7836 -99 -32 -114 -50 -60 45 23 36 177 304 -36 99 138 -164 -17 21 65 -144 -44 199 -90 63 0 -81 11
7860 11 -3 50 -286 106 23 -240 44 -29 -48 -121 47 39 196 -82 -114 -173 -3 -195 195 -306 -75 -52 -28 84
7884H4k61Q5m1L78qk36P9j60M5o4J15l5j36L17j69j98K07q9R2k9J80l61L64l11
7908a52J11J77j87J05K60l53k7J75No4Q8K62k99j27k57J97K42j7L0m4j08K71j85
7931A03j11K2o4r8J84qJ76j53j65M2K53j83j17K51l33J73k13J94J14J11j27L8
7953H9k25Q5j16M2K15l8q6Lj09J1K97k07k2M00m01J75k9l02L67%Lk12Q8J04k17
7978h5J90l0J5j69Q5j00K81q9n0k54K10p6M6R5k90K97k19K31K38k25p3rj36J68
8002E1j34j00N08k51K31k75J38l79L30J75l80Nj08K09O0J01k11j74K32j30K19
8023A17k07M1k8j9J64j59K10k29R0J23k23M5M5J36j42r1L17k96j4Q4j50L83j30
8046F7j09oo5o9M98k74j0Jn5K01k10j09jK67l8KR3j72p1o8J46QP3Rj36K72m00
$$ plain form
7884 84 -177 -92 -133 245 237 1 80 -80 -35 -99 16 -19 -155 162 -7 -205 2 -87 5 -24 156 -205 159 -152
7908 -152 -41 136 -51 54 314 -39 -66 109 114 50 138 400 101 -26 -283 -86 156 139 169 125 17 288 103
7931 103 -8 14 -50 -148 36 28 204 51 -114 -72 181 -2 -119 132 -201 -28 -241 -47 67 178 51 89
7953 89 -136 -51 -167 -125 90 52 -34 -31 -140 -129 168 -39 -61 339 -62 113 84 -218 149 149 152 -60 28 132 -85
7978 -85 105 75 90 -79 6 -94 187 98 48 -206 4 -72 -26 69 -221 76 -143 88 326 101 28 19 -117 51
8002 51 -83 -183 325 74 305 30 168 -211 119 294 -86 -81 -189 20 80 181 -30 -204 28 -102 117
8023 117 -90 -49 -77 -96 68 -91 119 -110 -20 103 -120 -75 -30 106 -36 -127 190 -106 -120 -36 -186 197 67
8046 67 -42 -48 -113 -182 316 42 32 33 -22 179 -31 -140 -141 126 88 90 183 11 -60 -128 18 26 99 108 -28 244 -156
8073a56K06K1j0J48l56L53k17m5N5j66J03l4k2J00j13K41j24j6J92l45J49N3J94
8096B11k77J92j74K60j27j79N1j94K66Rj0j97L64l14J94k70N22j37q7q7j61K88
8118A43j42M1P4j95K31j04M6j17J39p4k53M1j9J90r7J77n7O3k09J96M7l1%R6k30
8143d4j38J27J87l10R4L2r9P5J28j24N5Q2j10M2L2R2q8l1q5J07o0J17k46J54K
8168iK05j72L8j16K26j97J21k40L00j68r8M19k93K5l1p6J85k33K22nj69J9m4
$$ plain form
8073 -156 50 71 61 209 -147 206 -11 -56 -1 -167 -64 -98 -120 -20 -133 108 -16 -32 160 -185 -36 17 211
8096 211 -66 126 -48 212 85 -94 -43 -237 29 38 28 -169 195 -119 75 -195 327 190 103 16 -145 143
8118 143 1 42 116 -79 152 48 94 -23 116 42 -211 -170 -189 1 -96 81 24 87 -122 74 121 90 90 186 -44
8143 -44 -182 -55 132 -178 -84 -52 -151 -76 52 -72 -17 65 -45 -3 29 121 33 2 -83 24 -36 81 -165 -11 -9
8168 -9 196 24 62 -54 172 -25 96 -144 156 -12 -110 309 16 41 10 -66 119 -114 108 103 -66 -47 -91
8191i1
$$ Imaginary data points
##PAGE= N=2
##DATA TABLE= (X++(I..I)), XYDATA
0@%%%%%%%qJ6j6J6k4L2m0M8n6P2q8J09j33J58j87K19k56K96l41L93m51N16n87
30c12O68p56Q51r57J073j202J342j493J659j841K036k248K481k735L012l313L643
47A908m004M400m837N318n850O444p110P865q727R718j0872J2233j3864J5856
61H478j8345K1542k5781L1643m0217N3775p7951J31918m09377J0102R00269j063883
73d77827P11611l24885J22037J9223k61696N60668o93141N36792j84473j39008
83a30699L06075l62398L86609m19039L96459k20706n0541K81583m16635M72421
93B43129m73314L67365r8625k58643N10312n29716L93907k38922R7035Q0437l24111
104b31146N61489o34952M74034j49415k06418M57286n42905M93421l64503J71727
$$ plain form
0 0 0 0 0 0 0 0 0 -8 8 -8 8 -16 16 -24 24 -32 40 -48 61 -72 86 -101 118 -138 158 -183 210 -241 275 -312
30 -312 356 -400 451 -506 567 -635 707 -786 873 -968 1068 -1180 1301 -1434 1578 -1735 1908
47 1908 -2096 2304 -2533 2785 -3065 3379 -3731 4134 -4593 5125 -5747 6486 -7378 8478
61 8478 -9867 11675 -14106 17537 -22680 31095 -46856 85062 -324315 -314213 586056 -477827
73 -477827 233784 -91101 30936 50159 -211537 349131 -344010 192782 8309 -130699
83 -130699 175376 -187022 199587 -219452 177007 -43699 -94240 187343 -229292 243129
93 243129 -230185 137180 38555 -220088 290224 -239492 154415 -84507 12528 92965 -231146
104 -231146 330343 -304609 169425 20010 -186408 270878 -272027 221394 -143109 28618
114B8618Q0171l32507M96307n01846L49299j19917j11111L06219m15540M00338
124A80031k87470J51422m3394n4995K00132l83887M91751m11881J58905J40797
134A41411l49888M06002l53499K66298j57294k451K16932m20437N00650l95779
144a48055J63383P6327k49945L50233l85750L44493k06994J72J93600l06625L31206
155A62045k87692J89316m3450j30501K80309l42925L00128j91119O9447L9338
165D4896j43181K54793l40673L28778j89291k5248K14907l05176K93087k25128
175i2236J31905j0136j32491K59117l22059K91559j76409K1241J24352k25029
185a30186K61693k39126J75388q4190k5087J38414k33357K75942k33051J05586
$$ plain form
114 28618 108789 -223718 272589 -229257 120042 125 -110986 195233 -220307 180031
124 180031 -107439 43983 589 -54406 145726 -238161 253590 -158291 614 141411
134 141411 -208477 197525 -155974 110324 -46970 -49421 167511 -252926 247724 -148055
144 -148055 15328 91655 -158290 191943 -193807 150686 -56308 -56136 137464 -169161 162045
155 162045 -125647 63669 20219 -110282 170027 -172898 127230 -63889 5558 44896
165 44896 -98285 156508 -184165 144613 -44678 -69926 144981 -160195 132892 -92236
175 -92236 39669 29533 -102958 156159 -165900 125659 -50750 -29509 94843 -130186
185 -130186 131507 -107619 67769 -16421 -41508 96906 -136451 139491 -93560 12026
195A2026O0768j99668K61492k41863J76095r5619M841R7248j92283K43195k20998
206i4766J31317j3584r0080J58965j88308J77977j28872M4696N9057j52182K05570
217A09790k04496J49539n7627m3143J25739j70364J69660j33484P6982r871n9578
228d6853J21844j61190J57566j04694J8181P3888j44710J76762j65120J15773
238D1447l8929m8658J24385j66929J63027j14108L6998M1977j00315J25558j16306
249e1853Q1247l2324k1109P0555j06888J21326j07910O7080r653m7113Q9489j08800
261e5953J03863p7304L3652J8623o7316R7872j00128P2635k4282l0292P5557j01395
273e4468J02953p9730L7848J2896n9040Q7772r1999P2071l5267o758M1508o1266
$$ plain form
195 12026 72794 -126874 134618 -107245 68850 -26769 -21928 75320 -116963 126232 -94766
206 -94766 36551 22967 -67113 91852 -96456 81521 -47351 -2655 56402 -95780 109790
217 109790 -94706 54833 -2794 -45937 79802 -90562 79098 -54386 22596 12725 -46853
228 -46853 74991 -86199 71367 -33327 -15146 58742 -85968 90794 -74326 41447
238 41447 2518 -46140 78245 -88684 74343 -39765 -2767 39210 -61105 64453 -51853
249 -51853 29394 -2930 -24039 46516 -60372 60954 -46956 20124 10471 -36642 52847 -55953
261 -55953 47910 -29394 4258 22881 -44435 53437 -46691 25944 1662 -28630 46927 -54468
273 -54468 48485 -31245 6603 19499 -39541 48231 -43768 28303 -6964 -13722 27786 -33480
285c3480O2755m7168K1060P804l3339N0789n8310N6138m3165J9671R532l6484
297b4197N3365n5529M3917k3686J202J8967l3927M0372l5329J8827N031k8429
309a9416M3871m7334L9524k4396N491J4143l0239L8069l5052K2354n278r543J7777
322I971j8093J2600m127n541J3872j9542K0578j6810J0862m417r95N137q300J0345
336E540r944P731m616J563J2N35l154O215q764R997q438M017K123o815O545j601
352I46n894J1292j1641P224J71p385J3285j7240J9420j9005J5026p997o85Q487
366F004j3934J5457j2486M434O438j6078K0961k0503J5398o240n995K0117l2297
379a8724L7953l3438J9828k225j3277K3308k7698K6445j8694L584J5918l2798
$$ plain form
285 -33480 29275 -17893 3167 10971 -22368 28421 -29889 26249 -16916 2755 12287 -24197
297 -24197 29168 -26361 17556 -6130 -4928 14039 -19888 20484 -14845 3982 9013 -19416
309 -19416 24455 -22879 16645 -7751 -2260 11883 -18356 19713 -15339 7015 1737 -7806 9971
322 9971 -8122 4478 351 -5190 8682 -10860 9718 -7092 3770 -647 -1642 3495 -4805 5540
336 5540 -4404 3327 -1289 274 286 821 -2333 3882 -4882 5115 -3323 694 2817 -3998 2547 946
352 946 -4948 6344 -5297 1927 2098 -5287 7998 -9242 10178 -8827 6199 -1798 -2483 6004
366 6004 -7930 7527 -4959 -525 5913 -10165 10796 -9707 5691 -549 -6544 13573 -18724
379 -18724 19229 -14209 5619 3394 -9883 13425 -14273 12172 -6522 -2938 12980 -19818
391a9818L9730l3829J8848l2j8967L5037m5151M5839l5795J7585M672k5541L9170
404B1748m2335L3742j4502r222K9596m1094M2380l5873K3106l267k3340M9949
416C0888o4536N9417l6391N858K0064l6457M4579m6024L9164j9768j0734M2355
428B8415o2053O1874m2832J3127J7503m2465N8742o4620N7846l7170N071L0727
440B4165n8538O7277n3892K4381Q523l3388M7300n2938N1541m0602J6209K0304
452B0342n7058P7503p2354M6499j3852j3722L3680m7997N6314n4141L5907l040
464H081l4884O4455p5762O5342l6462j331L7707o3322P4180p1957N7671k9044
476e326j3179N8402q8278Q6892n3170M406L6980n9188O5293o3398N4299l0701
$$ plain form
391 -19818 19912 -13917 4931 4899 -14068 20969 -24182 21657 -14138 3447 8119 -17422 21748
404 21748 -20587 13155 -1347 -10569 19027 -22067 20313 -15560 7546 4279 -19061 30888
416 30888 -33648 25769 -10622 -4764 15300 -21157 23422 -22602 16562 -3206 -13940 28415
428 28415 -33638 28236 -14596 -1469 16034 -26431 32311 -32309 25537 -11633 -6562 24165
440 24165 -34373 32904 -20988 3393 11916 -21472 25828 -27110 24431 -16171 38 20342
452 20342 -36716 40787 -31567 14932 1080 -12642 21038 -26959 29355 -24786 11121 8081
464 8081 -26803 37652 -38110 27232 -9230 -10561 27146 -36176 38004 -33953 23718 -5326
476 -5326 -18505 39897 -48381 38511 -14659 -10253 26727 -32461 32832 -30566 23733 -6968
488f968r537N3961q2946Q4222o1530K8232L298k8413M8691o3135O5903n1618J9622
501b18K3021o3628Q6722q1687N0230o560l1620N5077o6988P4217p4404N5113q806
514A0469n1901R7574j03233O8951j7766k6128N3004o6716P2555o6721M3231l707
526I612m0660P5785r1051Q1232m9197N492L3885n4879N7105n2310M9664m2279
538a7601J4055L7343q9325J07453p7900K1374K6779m8967N7288p0184Q4763p7166
550c2088L1298L7856r2057J02986p5241L4306O04k8767N6551p9349Q3945o3020
562b2976K1454K6415o7182R2055r2887O4697j6601k7843M8628m7751M5915n4691
574c0767O0334l6312k3181Q6765j11504Q3466k9758j0791K7554m1236O8021r5172
$$ plain form
488 -6968 -16505 37456 -45490 38732 -22798 5434 8732 -19681 29010 -34125 31778 -19840 -218
501 -218 22803 -40825 45897 -35790 14440 7880 -23740 31337 -35651 38566 -35838 19275 10469
514 10469 -41432 56142 -47091 21860 4094 -22034 30970 -35746 36809 -29912 13319 9612
526 9612 -31048 44737 -46314 34918 -14279 -8787 25098 -29781 27324 -24986 24678 -17601
538 -17601 -3546 33797 -55528 51925 -25975 -4601 22178 -26789 30499 -39685 45078 -32088
550 -32088 -790 37066 -54991 47995 -27246 7060 7664 -21103 35448 -43901 40044 -22976
562 -22976 -1522 24893 -42289 49766 -43121 21576 4975 -22868 25760 -21991 23924 -30767
574 -30767 29567 -6745 -29926 56839 -54665 28801 -957 -11748 15806 -25430 42591 -52581
586e2581R2147m6278k0806P3630r3301Q5245o1459K6722J6613n8166Q1662p9747
598c6319O1251l6576O158L4764q1321J08416r2217L8650J7528m4889M5473m5969
610b5051O1301p0917M4768J7163p7696R7622p4426L7449j2681l258K8977o6887
622d3636R5350r0254N0305K287m5084P0927q1858P5496m6302r28M6205o9125O9255
635C2638o0528N1338l1773j1588O8052j04662R6074n1742M581K2691l4839M9477
647B9719o8907P4744m9308k426N3230p8351P5139n7126L5550q724k6467O1679
659C8752q0977P5682n2463K2149J1094m6936P6924q4035N9212j3985k6757M7978
671B6638n5178O0848o3319M7516o047m7849Q5575q7692O1207k8011K070J9208
$$ plain form
586 -52581 39566 -6712 -27518 46112 -47189 38056 -23403 3319 19932 -38234 43428 -36319
598 -36319 24932 -11644 -5486 29278 -52043 56373 -35844 2806 20334 -24555 20918 -25051
610 -25051 36250 -34667 10101 27264 -50432 47190 -27236 10213 -2468 -5726 23251 -43636
622 -43636 51714 -38540 11765 14052 -31032 39895 -41963 33533 -12769 -13697 32508 -36617 32638
635 32638 -27890 23448 -8325 -19913 48139 -56523 39551 -12191 -7610 15081 -19758 29719
647 29719 -39188 35556 -13752 -16178 37052 -41299 33840 -23286 12264 3540 -22927 38752
659 38752 -42225 33457 -19006 3143 14237 -32699 44225 -39810 19402 5417 -21340 26638
671 26638 -28540 32308 -31011 16505 10458 -37391 48184 -39508 21699 -6312 -4242 14966
683A4966m3858O7966p5238N3802j1208l1978N9698o9228O4817m7546J7341J9056
695A8590m9632O5371o5132N4513l5432O031K9752o0409P2145n8617K8870J692
707G742k5304M4068n9771O6296n3621J8536K6019n9783P1760o4857M7028k2627
719d514o661L7136o0563O6003n0942K2867R254l7519N6595o1653N0574k5969m567
732i959L1712m8755N5363n2784L9709j6006j4456M1197n4015M9737l3882J3562
744A423P502k8460M6502n5083M8604k6650l410L2318n2218N8823n2066L3462o925
757C822k1476M4109n3773M8003l0040M899K1088m0812M9616m5836L0332p896j4842
770a2806L3384m4443M6041l7577K0301J168k0931L4300l9069L4483k1590L486
$$ plain form
683 14966 -28892 39074 -36164 17638 6430 -25548 34150 -35078 29739 -17807 -466 18590
695 18590 -31042 34329 -30803 23710 -11722 -5691 24061 -36348 35797 -22820 6050 7742
707 7742 -17562 26506 -33265 33031 -20590 -2054 23965 -35818 35942 -28915 18113 -4514
719 -4514 -11175 25961 -34602 31401 -19541 3326 12580 -24939 31656 -29997 20577 -5392 -9959
732 -9959 21753 -27002 28361 -24423 15286 -720 -15176 26021 -27994 21743 -12139 1423
744 1423 8925 -19535 26967 -28116 20488 -6162 -9572 22746 -29472 29351 -22715 10747 3822
757 3822 -17654 26455 -27318 20685 -9355 -4456 16632 -24180 25436 -20400 9932 2036 -12806
770 -12806 20578 -23865 22176 -15401 4900 6068 -14863 19437 -19632 14851 -6739 -3253
782c253J5960l2286M1417l9972K7767q069j4329L3458m4200M3816l2473J3681
794A517P361k5132L5530l6484K7750j1754p061K4112l4329L4944k6577J2250L804
807E931j8536K9209l3559L0072j9934O309Q004j9571K5691k5172J8329p123n940
820f290J8134k6149K7031k0942R726M267j7333K5762k8231K3970j4624K885R542
833G748j8730K1937j8890J0694J79j0213J7004j9340J6622r930J066P837j4596
846h612J8135j7867J4003p856L30P071j1704J2564r631M110J991p626J1154j1308
860e246Q843m312j438O715j0351J2103j1211P801l423j056M329n473M587k511
874f43j2K684m764N488m547J908J209l814N363n615M710k992R65L77k53j066K483
$$ plain form
782 -3253 12707 -19579 21838 -18134 9633 1564 -12765 20693 -23507 20309 -12164 1517
794 1517 8878 -16254 19276 -17208 10542 -1212 -8273 15839 -18490 16454 -10123 2127 5931
807 5931 -12605 16604 -16955 13117 -6817 -508 7496 -12075 13616 -11556 6773 -350 -6290
820 -6290 11844 -14305 12726 -8216 1510 5777 -11556 14206 -14025 9945 -4679 -1794 7748
833 7748 -10982 10955 -7935 2759 2938 -7275 9729 -9611 7011 -2919 -1853 5984 -8612
846 -8612 9523 -8344 5659 -2197 -1867 5204 -6500 6064 -3567 543 2534 -5092 6062 -5246
860 -5246 3597 -715 -2153 4562 -5789 6314 -4897 2904 -519 -1575 2754 -2719 1868 -643
874 -643 -655 2029 -2735 2753 -1794 114 1323 -2491 2872 -2743 1967 -1025 -60 317 64 -1002 1481
891A481l368L762l775L097r40k341N228o438N373k591o9J975l304L854k929P92
907a93K731p336J0917j1643Q828l445k345O534q705R105q556P160l997j556Q112
922E611j2793J2351o463j887R573j4680J6763j6071J2078m632n078J4181j9221
935a0268J8899j3638N441L530j1126J5810j6539J3028o314k557J2500k1196K4999
948A2569k1949J2410N58j2122J9347k2148K1188j6628Q180M131j7689K7072k7363
961a2444J7887k483j2683K3308k7557K6401k1553J2414J342j7575L0617l4642
973a6968K7223j1546n488J8017k3685K3999k0905J4446l864j0237K4911l5110
985a9207L5623k5541Q680J0047k4882L2668l3482K7797j6177p90J9809l4906M0169
$$ plain form
891 1481 -1887 1875 -1900 1197 257 -2084 3144 -3294 2079 -512 -581 1394 -1910 1944 -985 -193
907 -193 2538 -4798 6119 -5524 3304 -141 -2486 4048 -4657 4448 -4108 3052 -945 -2501 5611
922 5611 -7182 5169 -1294 -3181 6392 -8288 8475 -7596 4482 -150 -5228 8953 -10268
935 -10268 8631 -5007 434 3964 -7162 8648 -7891 5137 -1177 -3734 8766 -12430 12569
948 12569 -9380 3030 3588 -8534 10813 -11335 9853 -6775 1405 5536 -12153 14919 -12444
961 -12444 5443 2960 -9723 13585 -13972 12429 -9124 3290 4632 -12943 17674 -16968
973 -16968 10255 -1291 -6779 11238 -12447 11552 -9353 5093 1229 -9008 15903 -19207
985 -19207 16416 -9125 -445 9602 -15280 17388 -16094 11703 -4474 -5264 14545 -20361 19808
998A9808l2167J3723P709k5438L5444l7712L3839k3069N651J5413l4530M4279
1010B2950l9857K3532j819j7439K8457l1334K8873k3035J3102K563k2530M0799
1022B4262m8194L8945j7016o989K4240l3351L7542l7474L0140j2052j4496L9395
1034B4952n1927M6028k4799k132K5215l9306M3222l9343K9377j3167o829K7996
1046A9287m5124N0079l8615J5055J0409k8356L5748l5835L2720k4477O967J8492
1058A6350m2955N4381m7372K6917l237j6857L1793m1809M5225l8632K0779N103
1070I686l2163N1286n4460L9707j2474j6804L8113m6311M3673l5716K3634n204
1082B967k0021M5246n7338M7907k1984n530K2838l0044L4703l8354L4688j8388
$$ plain form
998 19808 -12359 1364 9073 -16365 19079 -18633 15206 -7863 -2212 13201 -21329 22950
1010 22950 -16907 6625 4806 -12633 15824 -15510 13363 -9672 3430 5993 -16537 24262
1022 24262 -23932 15013 -2003 -8992 15248 -18103 19439 -18035 12105 53 -14443 24952
1034 24952 -26975 19053 -5746 -7878 17337 -21969 21253 -18090 11287 -1880 -8709 19287
1046 19287 -25837 24242 -14373 682 11091 -17265 18483 -17352 15368 -9109 -2142 16350
1058 16350 -26605 27776 -19596 7321 4084 -12773 19020 -22789 22436 -16196 4583 9686
1070 9686 -22477 28809 -25651 14056 1582 -15222 22891 -23420 20253 -15463 8171 2967
1082 2967 -17054 28192 -29146 18761 -3223 -8753 14085 -15959 18744 -19610 15078 -3310
1094c310r325L7824n4523N3446l7887J5220Q657k9744M4342m8575M1326k4843
1106g392K806K1184m2395N4515m9937K7022M573l0567M3107m4405M1054l3962
1118a4397J7938R054l8937N6933n3297L2071o787j2727K5513l5707M3015m1361
1130a8689K5325K208k9512M6954n1703M4162k6527J828K4283m2378M6914m0143
1142a7278K7661j1725r061L2874n1125N2459l3052L451K1052l3550L7997m0590
1154b0887L9784k7822J606K9891n1095N1996l7315J7980J34j7524L4784m5817
1166b4285M3075k6369K971J9008l5869M6227m7531L5850j1413j6299L5528m1536
1178b0643L8281l1271K0362j978k3390M5163m9941L5088j0733r761K2067l0915
$$ plain form
1094 -3310 -12635 25189 -29334 24112 -13775 1445 10102 -19642 24700 -23875 17451 -7392
1106 -7392 -4586 16598 -25797 28718 -21219 5803 10376 -20191 22916 -21489 19565 -14397
1118 -14397 3541 12595 -26342 30591 -22706 9365 2578 -10149 15364 -20343 22672 -18689
1130 -18689 6636 8844 -20668 26286 -25417 18745 -7782 -5954 18329 -24049 22865 -17278
1142 -17278 10383 -1342 -10403 22471 -28654 23805 -9247 -5796 15256 -18294 19703 -20887
1154 -20887 18897 -8925 -7319 22572 -28523 23473 -13842 4138 4272 -13252 21532 -24285
1166 -24285 18790 -7579 -4608 14400 -21469 24758 -22773 13077 1664 -14635 20893 -20643
1178 -20643 17638 -13633 6729 4751 -18639 26524 -23417 11671 938 -8823 13244 -17671
1190a7671L9173m1976L1415q072j8429L7110m3063L8945k8231J1629R902l0832
1202b0100M2711m0544K7299q965r074K5902m0629M6046l6765J5256R008k5915
1214a5770L2708l3706L1709k4165P418J5673l4845M0780l3038J8356k794j1658
1226i332K5650l7269M0469l0950J1939Q944k5090L4443l6787L1505j7881k610
1238f969K2842l4418L5297k7743J5257J80j7808L3339m0189L4321j8301n63J5217
1251A0462k4843L0170l0114K3249r242q369K3365l0040K8169k0608R492M086j8832
1264a3055L0254l3555K7414j4360p33J4476k5313L1269k9542J9248l197j3004
1276a0098K4061k8465K6293j8093M685J1114k4689L1773k9623J9711o545o348
$$ plain form
1190 -17671 21502 -20474 10941 2869 -15560 21550 -21513 17432 -10799 830 10732 -20100
1202 -20100 22611 -17933 9366 401 -8673 17229 -23400 22646 -14119 1137 10145 -15770
1214 -15770 16938 -16768 14941 -9224 -1806 13867 -20978 19802 -13236 5120 2326 -9332
1226 -9332 16318 -20951 19518 -11432 507 9451 -15639 18804 -17983 13522 -4359 -6969
1238 -6969 15873 -18545 16752 -10991 4266 4446 -13362 19977 -20212 14109 -4192 -4755 10462
1251 10462 -14381 15789 -14325 8924 -318 -8687 14678 -15362 12807 -7801 1691 5777 -13055
1264 -13055 17199 -16356 11058 -3302 -4035 10441 -14872 16397 -13145 6103 2906 -10098
1276 -10098 13963 -14502 11791 -6302 -1617 9497 -15192 16581 -13042 6669 124 -6224
1288f224J7149k4360K6349k1546J0964K178j3960K1599k3950K0543j1858J85J2155
1301I224k2050K6022k3662J5891m587p411J7660k4086K4290j7796O357O147j5755
1314i756K0943k1128J5860o576m927J5661k1758K2426j8355J0148M73j0617J8014
1327A0408k0796J8260j1208J698P540j4241J7392j6306J0875k865n961J3698j8195
1340i701J8531j4641P529J388j0284J6284j7821J4683q313R9Q025j3269J5056
1353G566j3190P615M12q055J3533j6118J4893j0016L441L767j0085J3129j3371
1366f479J0419m894j427O956j0681J1438r059M378J735p364J1200j2296J0742
1379D668o953J478M095q127J0165r993P565k949k359O316q532Q340n689J654K922
$$ plain form
1288 -6224 10925 -13435 12914 -8632 2332 4510 -9450 12149 -11801 8742 -3116 -2931 9224
1301 9224 -12826 13196 -10466 5425 838 -6573 11087 -12999 11291 -6505 -148 5999 -9756
1314 -9756 11187 -9941 5919 -657 -5584 10077 -11681 10745 -7610 2538 3011 -7606 10408
1327 10408 -10388 7872 -3336 -1638 5902 -8339 9053 -7253 3622 757 -5204 8494 -9701
1340 -9701 8830 -5811 1718 3106 -7178 9106 -8715 5968 -2345 -2246 5779 -7490 7566
1353 7566 -5624 1991 2403 -5652 7881 -8237 6656 -3360 81 3848 -6237 6892 -6479
1366 -6479 3940 -954 -2381 4575 -6106 5332 -3727 651 2386 -4978 6222 -6074 4668
1379 4668 -2285 -807 3288 -4839 5326 -4667 2898 -51 -2410 3906 -4626 3714 -1975 -321 2601
1394B601o681Q993r672Q124m918O50L747o586P377o522M458j873j045L854n378
1409b871N411l946P95K972n845O998o323M701k356J49J579l194M347m505L433
1424A345j345r68K428k622J779n96m31J215k145K956l378L553k664R74N83j775
1440a091J645j311J949k562K735j953L04J387j866J226o0j192J210j068J657k529
1456a519L411l194J503N57k021L060l199K845l286L613k842L06K547m105L952
1471A628j547j680L436l800L711l677L979l347O18L548p396Q933o916K869O93
1486A052l035L811l637L717l340J701J839o140Q846q407N054p33k783M794o086
1501c347P595q515P241l177k867P978j0076Q006l001j731M583o088P747q994Q443
$$ plain form
1394 2601 -4080 4913 -4759 3365 -1553 -903 2844 -3742 3635 -2887 1571 -302 -1347 2507 -2871
1409 -2871 2540 -1406 -611 2361 -3484 3514 -2809 1892 -464 -315 1264 -1930 2417 -2088 1345
1424 1345 0 -968 1460 -1162 617 21 -410 805 -1340 1616 -1762 1791 -873 101 684 -1091
1440 -1091 554 -757 1192 -1370 1365 -588 -284 1103 -763 463 403 -789 421 -647 1010 -1519
1456 -1519 1892 -1302 201 758 -1263 1797 -1402 1443 -1843 1770 -1072 -766 1781 -2324 1628
1471 1628 81 -1599 1837 -1963 1748 -1929 2050 -1297 -679 2869 -4527 4406 -2510 359 1052
1486 1052 -1983 1828 -1809 1908 -1432 269 2108 -4032 4814 -3593 1461 728 -2055 2739 -3347
1501 -3347 4248 -4267 2974 -203 -3070 4908 -5168 2838 -163 -1894 2689 -3399 4348 -4646 3797
1516C797m904j963R421j3574J2976q588K904J479m428O808q996J0006p410J461
1530a011O830j3754J4714j0134L514K007n107P143r662J2004j2195P912M04r421
$$ plain form
1516 3797 -1107 -3070 6351 -7223 5753 -2835 69 1548 -2880 3928 -5068 4938 -2472 -1011
1530 -1011 5819 -7935 6779 -3355 159 2166 -2941 4202 -5460 6544 -5651 2261 2665 -6756
$$ [...]
8191a18
##END NTUPLES=NMR FID
##END=
