##TITLE=1H_Pr 37-D
 DMSO
 8 sc, 
 6.04.2022
##JCAMPDX= 6.0         $$ Bruker NMR JCAMP-DX V2.0
##DATA TYPE= NMR FID
##DATA CLASS= NTUPLES
##ORIGIN= UXNMR, Bruker Analytische Messtechnik GmbH
##OWNER= root
$$ XWIN-NMR		Version 3.5
$$ Wed Apr  6 11:22:42 2022 Russian Standard Time (UT+4h)  she@DPX200
##.OBSERVE FREQUENCY= 200.131346
##.OBSERVE NUCLEUS= ^1H
##.DELAY= (6, 6)
##.ACQUISITION MODE= SIMULTANEOUS
##.ACQUISITION SCHEME= undefined
##.AVERAGES= 8
##.DIGITISER RES= 18
##SPECTROMETER/DATA SYSTEM= spect
##.PULSE SEQUENCE= zg30
##.SOLVENT NAME= CDCl3
##.SHIFT REFERENCE= (INTERNAL, CDCl3, 0, 15.7039)
##AUDIT TRAIL= $$ (NUMBER, WHEN, WHO, WHERE, WHAT)
$$ ##TITLE= Audit trail, XWIN-NMR		Version 3.5
$$ ##JCAMPDX= 5.01
$$ ##ORIGIN= Bruker BioSpin GmbH
$$ ##OWNER= she
$$ F:/spectra/data/she/nmr/H-F/1/audita.txt
$$ ##AUDIT TRAIL=  $$ (NUMBER, WHEN, WHO, WHERE, WHAT)
(   1,<2022-04-06 11:21:37.09 +0400>,<she>,<DPX200>,
      <created by zg, POWCHK disabled, PULCHK disabled
       configuration hash MD5:
       00 E9 B6 7A A2 85 ED C7 34 08 36 98 17 FE 4E 26
       data hash MD5: 16K
       59 0A 87 20 7A 89 DC 7B C8 76 91 C6 8E 5C 85 F6>)
$$ ##END=
$$ 
$$ hash MD5
$$ 62 3F ED CB C5 9D F9 A5 D8 7C DD AC 45 31 F3 58
##$RELAX= 
##$RELAX= 
##$RELAX= 
##$RELAX= 
##$RELAX= 
##$RELAX= 
$$ Bruker specific parameters
$$ --------------------------
##$DU= <F:/spectra>
##$EXPNO= 1
##$NAME= <H-F>
##$PROCNO= 1
##$TYPE= <nmr>
##$USER= <she>
##$AMP= (0..31)
100 100 100 100 100 100 100 100 100 100 100 100 100 100 100 100 100 100 
100 100 100 100 100 100 100 100 100 100 100 100 100 100 
##$AQSEQ= 0
##$AQ_mod= 1
##$AUNM= <au_zg>
##$AUTOPOS= <>
##$BF1= 200.13
##$BF2= 200.13
##$BF3= 200.13
##$BF4= 200.13
##$BF5= 200.13
##$BF6= 200.13
##$BF7= 200.13
##$BF8= 200.13
##$BYTORDA= 1
##$CFDGTYP= 0
##$CFRGTYP= 5
##$CHEMSTR= <none>
##$CNST= (0..31)
1 1 145 1 1 1 1 1 1 1 1 1 1 1 1 1 1 1 1 1 1 1 1 1 1 1 1 1 1 1 1 1 
##$CPDPRG= <>
##$CPDPRG1= <>
##$CPDPRG2= <>
##$CPDPRG3= <>
##$CPDPRG4= <mlev>
##$CPDPRG5= <mlev>
##$CPDPRG6= <mlev>
##$CPDPRG7= <mlev>
##$CPDPRG8= <mlev>
##$CPDPRGB= <>
##$CPDPRGT= <>
##$D= (0..31)
0 1.2 0 0 0 0 0 0 0 0.06 0 0.03 0 0 0 0 0.0002 0 0 0 0 0 0 0 0 0 0 0 0 
0 0 0 
##$DATE= 1649229696
##$DBL= (0..7)
120 120 120 120 120 120 120 120 
##$DBP= (0..7)
150 150 150 150 150 150 150 150 
##$DBP07= 0
##$DBPNAM0= <>
##$DBPNAM1= <>
##$DBPNAM2= <>
##$DBPNAM3= <>
##$DBPNAM4= <>
##$DBPNAM5= <>
##$DBPNAM6= <>
##$DBPNAM7= <>
##$DBPOAL= (0..7)
0.5 0.5 0.5 0.5 0.5 0.5 0.5 0.5 
##$DBPOFFS= (0..7)
0 0 0 0 0 0 0 0 
##$DE= 6
##$DECBNUC= <off>
##$DECIM= 32
##$DECNUC= <off>
##$DECSTAT= 4
##$DIGMOD= 1
##$DIGTYP= 9
##$DL= (0..7)
0 120 120 120 120 120 120 120 
##$DP= (0..7)
150 150 150 150 150 150 150 150 
##$DP07= 0
##$DPNAME0= <>
##$DPNAME1= <>
##$DPNAME2= <>
##$DPNAME3= <>
##$DPNAME4= <>
##$DPNAME5= <>
##$DPNAME6= <>
##$DPNAME7= <>
##$DPOAL= (0..7)
0.5 0.5 0.5 0.5 0.5 0.5 0.5 0.5 
##$DPOFFS= (0..7)
0 0 0 0 0 0 0 0 
##$DQDMODE= 0
##$DR= 18
##$DS= 0
##$DSLIST= <SSSSSSSSSSSSSSS>
$$ [...]
##$SUBNAM2= <"">
##$SUBNAM3= <"">
##$SUBNAM4= <"">
##$SUBNAM5= <"">
##$SUBNAM6= <"">
##$SUBNAM7= <"">
##$SUBNAM8= <"">
##$SUBNAM9= <"">
##$SW= 18.0517287032376
##$SWIBOX= (0..15)
0 0 2 0 0 0 0 0 0 0 0 0 0 0 0 0 
##$SW_h= 3612.71676300578
##$TD= 16384
##$TD0= 1
##$TE= 0
##$TE2= 300
##$TE3= 300
##$TEG= 300
##$TL= (0..7)
0 120 120 120 120 120 120 120 
##$TP= (0..7)
150 150 150 150 150 150 150 150 
##$TP07= 0
##$TPNAME0= <>
##$TPNAME1= <>
##$TPNAME2= <>
##$TPNAME3= <>
##$TPNAME4= <>
##$TPNAME5= <>
##$TPNAME6= <>
##$TPNAME7= <>
##$TPOAL= (0..7)
0.5 0.5 0.5 0.5 0.5 0.5 0.5 0.5 
##$TPOFFS= (0..7)
0 0 0 0 0 0 0 0 
##$TUNHIN= 0
##$TUNHOUT= 0
##$TUNXOUT= 0
##$USERA1= <user>
##$USERA2= <user>
##$USERA3= <user>
##$USERA4= <user>
##$USERA5= <user>
##$V9= 5
##$VALIST= <valist>
##$VCLIST= <CCCCCCCCCCCCCCC>
##$VD= 0
##$VDLIST= <DDDDDDDDDDDDDDD>
##$VPLIST= <PPPPPPPPPPPPPPP>
##$VTLIST= <TTTTTTTTTTTTTTT>
##$WBST= 1024
##$WBSW= 4
##$XGAIN= (0..3)
0 0 0 0 
##$XL= 0
##$YL= 0
##$YMAX_a= 538461
##$YMIN_a= -331577
##$ZGOPTNS= <>
##$ZL1= 120
##$ZL2= 120
##$ZL3= 120
##$ZL4= 120
##$ABSF1= 10
##$ABSF2= 0
##$ABSG= 5
##$ABSL= 3
##$ALPHA= 0
##$AQORDER= 0
##$ASSFAC= 0
##$ASSFACI= 0
##$ASSFACX= 0
##$ASSWID= 0
##$AUNMP= <proc_1d>
##$AZFE= 0.1
##$AZFW= 0.1
##$BCFW= 1
##$BC_mod= 2
##$BYTORDP= 1
##$COROFFS= 0
##$CY= 11.3945322036743
##$DATMOD= 1
##$DC= 2
##$DFILT= <>
##$DTYPP= 0
##$F1P= 2.36226072786647
##$F2P= -0.459571619588291
##$FCOR= 0.5
##$FTSIZE= 0
##$FT_mod= 4
##$GAMMA= 1
##$GB= 0.15
##$INTBC= 1
##$INTSCL= 1
##$ISEN= 128
##$LB= 0.24
##$LEV0= 0
##$LPBIN= 0
##$MAXI= 10000
##$MC2= 0
##$MEAN= 0
##$ME_mod= 0
##$MI= 1.114404
##$NCOEF= 0
##$NC_proc= 0
##$NLEV= 6
##$NOISF1= 3.799351
##$NOISF2= 2.8
##$NSP= 1
##$NTH_PI= 0
##$NZP= 0
##$OFFSET= 15.70392
##$PC= 1
##$PHC0= -17827.48
##$PHC1= 11.60078
##$PH_mod= 1
##$PKNL= yes
##$PPARMOD= 0
##$PSCAL= 0
##$PSIGN= 0
##$REVERSE= no
##$SF= 200.130013532006
##$SI= 16384
##$SIGF1= 3
##$SIGF2= 2
##$SINO= 400
##$SIOLD= 16384
##$SREGLST= <1H.CDCl3>
##$SSB= 0
##$STSI= 0
##$STSR= 0
##$SW_p= 3612.71676300578
##$SYMM= 0
##$S_DEV= 0
##$TDeff= 0
##$TDoff= 0
##$TI= <>
##$TILT= no
##$TM1= 0
##$TM2= 0
##$TOPLEV= 0
##$USERP1= <user>
##$USERP2= <user>
##$USERP3= <user>
##$USERP4= <user>
##$USERP5= <user>
##$WDW= 1
##$XDIM= 8192
##$YMAX_p= 0
##$YMIN_p= 0
$$ End of Bruker specific parameters
$$ ---------------------------------
##NTUPLES= NMR FID
##VAR_NAME=  TIME,          FID/REAL,        FID/IMAG
##SYMBOL=    X,             R,               I
##VAR_TYPE=  INDEPENDENT,   DEPENDENT,       DEPENDENT
##VAR_FORM=  AFFN,          ASDF,            ASDF
##VAR_DIM=   8192,          8192,            8192
##UNITS=     SECONDS,       ARBITRARY UNITS, ARBITRARY UNITS
##FACTOR=    0.0002768,     1,               1
##FIRST=     0,             0,               0
##LAST=      2.2672688,     0,               0
##MIN=       0,             -331577,         0
##MAX=       2.2672688,     538461,          0
$$ Real data points
##PAGE= N=1
##DATA TABLE= (X++(R..R)), XYDATA
$$ plain form
0 0 0 0 0 0 0 0 0 -8 8 -8 8 -8 16 -16 24 -24 32 -41 50 -64 73 -88 105 -125 146 -170 198 -227 265 -304 347
31 347 -395 449 -508 576 -646 725 -812 909 -1014 1127 -1253 1388 -1539 1703 -1881 2074
47 2074 -2288 2520 -2777 3059 -3372 3713 -4099 4529 -5014 5567 -6199 6935 -7805 8847
61 8847 -10124 11731 -13828 16678 -20807 27332 -39199 67601 -276547 -46644 498917 -196016
73 -196016 -165602 175071 -27582 -5998 197171 -241533 -178913 295788 7561 -240970 191790
84 191790 63191 -187139 171274 57424 -327247 118452 236450 -262667 -24255 302086
94 302086 -148692 -147891 219919 -63883 -184358 169206 10406 -141151 175020 38086 -206996
105 -206996 121755 85563 -232989 65944 171441 -190677 8542 227726 -142922 -112592
$$ packed form
0@%%%%%%%qJ6j6J6j6K4l2M0m8N6p3R1j14J37j61J93k30K71l16L68m25M92n69O51
31C47p42Q44r57J084j222J371j537J721j923K141k380K641k927L242l584L955
47B074m362M808n297N836o431P085p812Q628r543J0581j1766J3134j4740J6652
61H847j8971K1855k5559L0506l7485M8139o6531J06800l44148K29903N45561o94933
73a96016L0414L40673k02653K1584K03169m38704O2620M74701k88227k48531M32760
84A91790j28599k50330L58413j13850l84671M45699J17998m99117K38412L26341
94C02086m50778Q01L67810k83802j20475L53564j58800j51557L16171j36934k45082
105b06996L28751l6192l18552K98933J05497l62118J99219K19184l70648L0330
$$ plain form
115 -112592 180891 -82916 -132326 197367 -15825 -193018 185150 120598 -223847 -3639
125 -3639 117166 -91313 25726 56779 -137822 82661 182078 -188560 -105866 205064 -46026
136 -46026 -150601 140808 24164 -128296 125449 56089 -179014 43187 106530 -126905
146 -126905 -149 113153 -74135 -4369 98045 -91982 -40265 115531 -80178 -86211 160652
157 160652 8011 -146228 94682 75749 -134326 13101 72046 -92038 22062 99988
167 99988 -83651 -24036 101993 -54791 -60735 75696 -33869 -51527 106435 -5065 -99390
178 -99390 81882 40441 -115498 28274 64260 -85133 20490 90726 -75021 -28210 90100
189 90100 -43044 -63418 63293 -5044 -41117 63455 -2877 -59972 60577 12308 -91243
$$ packed form
115a12592K93483k63807m9410L29693k13192j77193L78168o4552l44445K20208
125c639J20805k08479J17039L1053j94601K20483R9417l70638Q2694L10930k51090
136d6026j04575K91409j16644j52460K53745o9360k35103K22201O3343k33435
146a26905J26756J13302j87288O9766J02414j90027N1717J55796j95709o033K46863
157A60652j52641j54239K40910j8933k10075J47427N8945j64084J14100P7926
167I9988j83639N9615J26029j56784n944J36431j09565j7658J57962j11500r4325
178i9390J81272m1441j55939J43772L5986j49393J05623P0236j65747M6811J18310
189I0100j33144k0374J26711o8337l6073J04572o6332n7095J20549m8269j03551
$$ plain form
200 -91243 36702 55696 -70747 12047 70024 -54876 -19020 64007 -43458 -46782 65010
211 65010 373 -47453 45188 14066 -44674 28834 5698 -57024 32133 36432 -53746 14148
223 14148 51835 -45614 -13791 47234 -37480 -32048 58128 -1662 -43332 38427 16252 -40916
235 -40916 14928 8120 -38334 24193 27044 -39652 10512 38336 -33677 -13389 30147 -24783
247 -24783 -14622 42087 -10115 -29622 38847 8457 -43991 11934 18664 -27541 8456 20898
259 20898 -19750 7847 20475 -27258 -7714 23732 -16547 -12094 29149 -3112 -18295 23594
271 23594 817 -30348 13064 12874 -23844 8153 21071 -15376 -711 14885 -15533 -8390 13629
284 13629 -7049 -5286 17455 -2680 -10141 14925 -3540 -21160 11853 9434 -17274 6633 16154
$$ packed form
200i1243J27945J8994j26443Q2794N7977j24900L5856Q3027j07465l324J11792
211F5010o4637m7826R2641l1122n8740P3508k3136o2722Q9157M299r0178O7894
223A4148L7687r7449L1823O1025q4714N432R0176n9790m1670Q1759k2175n7168
235d0916N5844o808m6454O2527K851o6696N0164K7824p2013K0288M3536n4930
247b4783J0161N6709n2202j9507O8469l0390n2448N5925O730m6205L5997J2442
259B0898m0648K7597J2628m7733J9544L1446m0279M453M1243l2261j5183M1889
271B3594k2777l1165M3412j90l6718L1997J2918l6447J4665J5596l0418P143K2019
284A3629k0678J763K2741k0135p461K5066j8465j7620L3013k419k6708K3907R521
$$ plain form
297 16154 -10538 -2631 8137 -10478 -5157 9854 -3495 -4089 11583 1725 -7681 3514 -1978
310 -1978 -8728 6520 2341 -8249 8786 9095 -10022 -2661 6020 -5513 -5036 4661 1865 -409
324 -409 4567 812 -4497 -116 -635 -4178 1613 2421 -46 3982 1412 -3917 -798 -128 -3164 -1226
340 -1226 2448 3152 389 206 1655 -2223 -3956 191 607 -1400 1592 4571 375 -2855 1004 -424
356 -424 -4843 670 2014 -1143 3870 2071 -3842 1826 994 -6605 -320 4822 -2025 -88 6029 -1781
372 -1781 -4288 4454 -2186 -7894 5506 4504 -6032 3627 5074 -5874 379 2193 -7552 1050
386 1050 8009 -4591 -2473 9082 -1955 -7413 5355 -983 -7866 7680 3702 -8626 6067
399 6067 6419 -10169 -36 6093 -8067 -421 9703 -4963 -3853 10280 -3012 -9035 7286
$$ packed form
297A6154k6692P907J0768j8615N321J5011j3349n94J5672r858r406J1195n492
310a978o750J5248m179j0590J7035L09j9117P361Q681j1533M77R697k796k274
324d09M976l755n309M381n19l543N791Q08k467M028k570n329L119O70l036J938
340a226L674P04k763j83J449l878j733M147M16k007K992K979m196l230L859j428
356d24m419N513J344l157N013j799n913N668q32p599O285N142o847J937O117p810
372a781k507Q742o640n708J3400j002j0536R659J447j0948O253J814r745Q602
386A050O959j2600K118J1555j1037n458J2768o338o883J5546l978j2328J4693
399F067L52j6588J0133O129j4160P646J0124j4666J110J4133j3292o023J6321
$$ plain form
412 7286 -559 -9094 9310 4228 -11084 6176 7590 -11896 -590 7925 -8003 -438 10828
425 10828 -6542 -4620 12244 -3485 -11599 8662 2302 -9535 7733 3942 -10049 6864 5908
438 5908 -14049 1648 11192 -9751 -3049 12610 -4375 -6634 9712 -3010 -9398 9260 308
451 308 -10198 10234 4878 -13352 5386 8624 -12789 -674 10241 -7637 -1305 11008 -7674
464 -7674 -5700 13446 -4142 -13417 10551 4981 -10135 5862 3107 -9677 8216 5316 -17172
477 -17172 2327 16380 -9041 -7747 11076 -1369 -4768 7069 -6643 -7544 14934 658 -15391
490 -15391 9014 8942 -12180 1618 6859 -10283 1927 10625 -9287 -2979 12178 -5520 -7342
503 -7342 10491 -3160 -9576 11403 2100 -11684 8055 5285 -12454 4570 7945 -12338 744
$$ packed form
412G286p845q535J8404n082j5312J7260J414j9486J1306Q515j5928P565J1266
425A0828j7370J922J6864j5729q114K0261o360j1837J7268l791j3991J6913r56
438E908j9957J5697R544k0943O702J5659j6985k259J6346j2722o388J8658q952
451C08j0506K0432n356j8230J8738L238k1413J2115J0915j7878O332J2313j8682
464g674J974J9146j7588r275K3968n570j5116J5997k755j2784J7893k900k2488
477a7172J9499J4053k5421J294J8823j2445l399J1837j3712r01K2478j4276j6049
490a5391K4405p2k1122J3798N241j7142J2210Q698j9912O308J5157j7698j822
503g342J7833j3651o416K0979r303j3784J9739k770j7739J7024L375k0283J3082
$$ plain form
516 744 12345 -8090 -4514 10514 -4407 -6050 9055 -4048 -7141 12473 -970 -13352 11200
529 11200 7024 -15779 1360 10891 -7371 -1029 6083 -7454 2347 10979 -11896 -8150 15733
542 15733 -33 -12256 6967 2915 -6686 8327 -72 -14045 8037 10415 -12701 -1661 10487
555 10487 -5597 -1894 8113 -7837 -4630 12439 -3923 -9450 11337 1039 -11915 8290 5757
568 5757 -12127 1956 7194 -6510 3020 5280 -11673 1804 14421 -9966 -10789 12939 2075
581 2075 -8505 6003 -860 -7587 10172 1927 -13867 5455 9133 -9446 987 7830 -8989
594 -8989 -775 11025 -7499 -6359 11475 -2596 -8026 10736 168 -12065 7414 5974 -9746
607 -9746 2483 4669 -7924 4825 7687 -12364 -2235 13442 -5228 -7975 9163 -951 -6518
$$ packed form
516G44J1601k0435L576J5028j4921j643J5105j3103l093J9614j3443j2382K4552
529A1200m176k2803J7139R531j8262O342P112j3537R801Q632k2875L746K3883
542A5733j5766j2223J9223m052r601J5013q399j3973K2082K378k3116J1040J2148
555A0487j6084L703J0007j5950L207J7069j6362n527K0787j0298j2954K0205k533
568E757j7884J4083N238j3704R530K260j6953J3477J2617k4387q23K3728j0864
581B075j0580J4508o863o727J7759q245j5794J9322L678j8579J0433O843j6819
594h989Q214J1800j8524J140J7834j4071n430J8762j0568j2233J9479j440j5720
607i746J2229K186j2593J2749K862k0051J0129J5677j8670k747J7138j0114n567
$$ plain form
620 -6518 8626 -800 -9892 7689 3344 -10041 5523 6014 -10989 1836 10687 -7887 -4810 7926
634 7926 -3167 -2084 8539 -6525 -7393 13077 1611 -13236 4228 5930 -5825 3778 2239
647 2239 -10057 4987 10281 -10593 -5324 10625 -1914 -4997 6648 -2961 -5232 9043 -872
660 -872 -9618 6975 3645 -9244 4342 6382 -9060 -145 7914 -5528 -2661 6816 -4474 -3070
674 -3070 9237 -2989 -8166 7654 2357 -7785 3955 2743 -6746 4267 4908 -8366 349 7416
688 7416 -5687 -2491 7300 -3657 -4387 7607 -1098 -6465 5465 627 -6074 5265 2194 -7838
702 -7838 3480 5973 -6714 -1071 5563 -4037 -1096 5842 -4316 -3286 7607 -1442 -6493 5265
716 5265 1545 -5640 3574 2177 -5646 2617 3862 -5721 261 5160 -4382 -1574 5865 -2570 -3415
$$ packed form
620f518J5144r426r092J7581m345j3385J5564M91j7003J2825Q851j8574L077J2736
634G926j1093J083J0623j5064q68K0470j1466j4847J7464J702j1755R603j539
647B239j2296J5044N294k0874N269J5949j2539l083J1645r609k271J4275r915
660h72q746J6593l330j2889J3586K040j5442Q915Q059j3442K867R477j1290J404
674c070J2307j2226n177J5820n297j0142J1740j212r489J1013O41j3274Q715P067
688G416j3103L196R791j0957p30J1994q705n367J1930m838o701J1339l071j0032
702g838J1318K493j2687N643O634r600K941O938j0158J030J0893r049n051J1758
716E265l720p185R214j397p823Q263J245r583N982M899r542K808P439q435q45
$$ plain form
731 -3415 5154 -874 -4116 4351 209 -4808 3840 2399 -5257 1689 3671 -4205 127 3763 -3388
746 -3388 -935 4744 -2445 -2715 4450 -1054 -3539 3868 235 -4001 3103 1781 -4067 1484 2490
761 2490 -3661 445 3147 -2988 -781 3770 -1952 -2201 3520 -925 -2647 3075 -60 -3140 2665
776 2665 1219 -3357 1363 1940 -2890 320 2375 -2217 -445 2781 -1715 -1600 2693 -865 -2134 2406
792 2406 40 -2189 1919 714 -2401 1154 1318 -2227 449 1983 -1729 -323 2113 -1368 -993 2046
808 2046 -840 -1416 1995 -72 -1680 1320 348 -1738 1029 753 -1681 603 1362 -1415 -173 1521
824 1521 -1022 -651 1425 -741 -824 1368 -298 -1168 999 162 -1274 662 472 -1102 355 720 -976
841 -976 21 972 -685 -424 969 -518 -545 940 -200 -649 807 102 -706 515 330 -536 242 388
$$ packed form
731c415Q569o028l242Q467m142n017Q648j441p656O946J982p876M332L636p151
746c388K453N679p189k70P165n504k485P407l633m236P104j322n848N551J006
761B490o151M106K702o135K207M551n722k49N721m445j722N722l135l080N805
776B665j446m576M720N77m830L210K055m592J772L226m496J15M293l558j269M540
792B406k366k229M108j205l115L555J64l545K676J534l712J406K436l481L75L039
808B046k886n76L411k067j608L000r72k086K767k76k434K284P59k777J242J694
824A521k543L71K076k166q3K192j666q70K167q37j436J936j90j574J457L65j696
841i76R97R51j657K61J393j487k7J485j140m49J456p05q08J221j85q66P78J46
$$ plain form
859 388 -580 -1 538 -426 -260 587 -277 -240 425 -120 -310 274 18 -231 121 268 -182 -155 115 -87 -106
880 -106 119 -102 -83 158 17 -52 101 -10 8 -73 -61 92 -126 113 207 -248 -29 342 -122 -186 278 24 -279
903 -279 202 81 -284 102 206 -456 127 504 -293 -55 433 -484 -139 548 -268 -334 524 -99 -445 507 66
924 66 -683 391 434 -707 139 589 -549 26 579 -608 -224 843 -417 -617 868 13 -696 425
942 425 26 -671 638 320 -1055 557 908 -951 -183 1014 -419 -222 845 -488 -297 1000 -236
959 -236 -797 977 132 -1052 565 370 -965 481 773 -1227 214 1008 -890 -400 1105 -589 -526
976 -526 976 -344 -637 1007 -156 -977 937 150 -1182 876 776 -1278 263 989 -974 -85 993
993 993 -911 -179 1306 -802 -816 1332 -147 -1187 965 282 -1114 800 366 -1229 740 802 -1484
$$ packed form
859C88r68N79N39r64J66Q47q64L7O65n45j90N84k56k49L52J47m50K7K70k02j9
880a06K25k21J9K41j41o9J53j11J8q1J2J53k18K39R4m55K19L71m64o4M64k54l03
903b79M81j21l65L86J04o62N83L77p97K38M88r17L45O87q16o6Q58o23l46R52m41
924F6p49J074M3j141Q46M50j138N75N53j187L84J067j260k00J485q55p09J121
942D25l99o97J309l18j375J612L51j859P68J197j433J97J067j333J91J297j236
959b36n61J774q45j184J617j95j335J446K92k000J441P94j898M90J505j694O3
976e26J502j320k93J644j163q21J914p87j332K058j00k054J541P26j963Q89J078
993I93j904P32J485k108j4K148j479j040K152o83j396J914m34j595J969O2k286
$$ plain form
1010 -1484 279 1366 -1167 -204 1353 -835 -494 1310 -690 -983 1629 -155 -1555 1294 549 -1488
1026 -1488 675 619 -1315 694 820 -1608 354 1541 -1579 -630 1961 -744 -1288 1689 -198 -1221
1042 -1221 1387 -18 -1543 1582 447 -2221 1013 1494 -1912 97 1473 -1286 -23 1711 -1701
1057 -1701 -893 2570 -796 -1953 2073 347 -1805 1430 368 -1896 1626 939 -2464 847 1879
1072 1879 -2252 -218 2425 -1534 -1050 2241 -800 -1310 2265 -778 -2152 2557 442 -2892 1503
1087 1503 1729 -2379 468 1636 -2146 407 2325 -2282 -796 3037 -1342 -1918 2725 -397 -2293
1102 -2293 2375 323 -2697 1913 1025 -2905 1215 2233 -3098 -171 3101 -1794 -1294 2290 -1188
1117 -1188 -994 3096 -1460 -2682 3334 814 -3445 1430 1657 -2642 1021 1759 -3052 384 3127 -2422
$$ packed form
1010a484J763J087k533R63J557k188L41J804k000k93K612j784j400K849p45k037
1026a488K163n6j934K009J26k428J962J187l120R49K591k705n44K977j887j023
1042a221K608j405j525L125j135k668L234M81l406K009J376k759J263J734l412
1057a701Q08L463l366j157M026j726k152L235j062k264L522o87l403L311J032
1072A879m131K034K643l959M84L291l041n10L575l043j374M709k115l334M395
1087A503K26m108K847J168l782K553J918m607J486L833m379n76M643l122j896
1102b293M668k052l020M610q88l930M120J018n331K927L272m895N00L584l478
1117a188J94M090m556j222O016k520m259M875K27m299L663P38m811L436K743n549
$$ plain form
1133 -2422 -1314 3166 -1478 -2047 3057 -482 -2722 2506 625 -2853 2057 1084 -3451 1475 2703
1148 2703 -3237 -680 3128 -1645 -1067 2655 -1752 -1563 3678 -710 -3343 2701 1019 -2852 1657
1163 1657 1114 -3042 1342 2454 -3215 -131 3023 -2160 -1072 3295 -1625 -2412 3294 62 -2813
1178 -2813 2191 510 -2712 2180 1294 -3613 855 2866 -2449 -669 2504 -1816 -752 3037 -1752
1193 -1752 -2238 3210 18 -2839 2198 809 -2806 1583 1540 -2989 572 2393 -2128 -187 2518 -2191
1209 -2191 -1047 3132 -1173 -2201 2511 67 -2119 2167 257 -2853 1666 1794 -2849 217 2233
1224 2233 -1789 -284 2329 -1792 -973 2817 -963 -1883 2430 -73 -2085 1986 539 -2623 1334
1239 1334 1529 -2347 306 1738 -1958 -143 2223 -1743 -1199 2406 -601 -1533 1856 -148 -1735 1825
$$ packed form
1133b422J108M480m644n69N104l539k240N228j881l478M910r73m535M926J228
1148B703n940K557L808m773N78L722m407J89N241m388k633O044j682l871M509
1163A657n43m156M384J112n669L084L154n183J088M367m920p87N706l232k875
1178b813N004j681l222M892q86m907M468K011n315J780L173m320J064L789m789
1193a752m86N448l192k857N037j389l615M389m3m529L561J821m521J941K705m709
1209b191J144M179m305j028M712k444k186M286j910l110M519J28m643L066K016
1224B233m022J505K613m121Q19L790l780r20M313k503k012M071j447l162L957
1239A334J95l876K653J432l696J815K366l966N44L605l007r32L389k004j587L560
$$ plain form
1255 1825 467 -2265 1145 1499 -1980 387 1612 -1643 -272 2080 -1321 -1029 2101 -544 -1480 1846
1271 1846 -100 -1699 1468 580 -1947 738 1089 -1654 475 1507 -1667 -307 1940 -1169 -972 1791
1287 1791 -472 -1198 1736 -90 -1476 1256 499 -1751 728 838 -1655 276 1330 -1338 -276 1568
1303 1568 -954 -706 1639 -430 -1169 1562 -64 -1300 1102 538 -1439 658 856 -1318 174 1164
1319 1164 -1055 -209 1282 -864 -562 1370 -500 -945 1246 94 -1145 802 406 -1198 548 734
1335 734 -1081 146 951 -878 -153 1033 -685 -436 1187 -342 -836 1008 -93 -969 837 325 -915
1352 -915 445 707 -957 183 777 -784 -249 901 -509 -368 979 -318 -548 775 -37 -712 747
1369 747 208 -760 522 430 -644 36 650 -613 -141 709 -363 -394 732 -228 -390 609 -42 -529 503
$$ packed form
1255A825j358k732L410L54l479K367J225l255J371K352l401K92L130k645r36L326
1271A846j946j599L167q88k527K685L51k743K129J032l174J360K247l109J97K763
1287A791k263p26K934j826j386K732p57k250K479J10k493J931J054k668J062J844
1303A568k522K48K345k069p39K731j626j236K402n64j977K097J98k174J492R90
1319A164k219Q46J491k146L02J932j870m45K191j152j239J947l96j604J746J86
1335G34j815J227Q05j829P25J186j718K49J623j529m94J844j101q76J806n12j240
1352i15J360K62j664J140N94j561N35J150j410J41J347j297k30J323q12o75J459
1369G47n39r68J282r2j074O80O14j263M72Q50j072l1J126r60j62R99o51m87J032
$$ plain form
1388 503 211 -632 309 363 -575 19 413 -370 14 630 -266 -171 699 -201 -415 466 -5 -420 236 153 -349
1409 -349 226 227 -398 86 372 -291 -61 332 -220 -155 388 -128 -226 359 -155 -241 237 40 -195 91 90 -127
1431 -127 111 122 -229 64 179 -134 -112 249 -99 -83 104 59 -6 116 -102 30 103 30 -107 68 60 -106 96
1454 96 -58 -23 130 -55 -148 56 96 -105 57 60 -38 162 -80 -223 243 203 -204 -54 224 -107 8 -15 -37
1477 -37 67 175 -227 -167 431 -43 -381 193 107 -164 156 20 -29 183 -52 -307 77 419 -318 -143 345
1498 345 -69 -176 271 -114 -94 440 -73 -438 342 185 -324 83 315 -270 86 218 -433 68 433 -414
1518 -414 -312 567 6 -498 241 63 -279 293 -207 -474 613 371 -697 112 670 -334 -208 386 -227
1537 -227 -148 435 -349 -278 534 -181 -707 491 311 -615 181 268 -383 102 278 -666 105 783 -503 -458 753
$$ packed form
1388E03k92q43R41N4r38N94L94p83L84O16q96R5Q70r00k14Q81m71m15O56q3n02
1409c49N75Jo25M84K86o63K30L93n52O5N43n16r8N85n14q6M78j97k35K86jk17
1431a27K38J1l51K93J15l13K2L61l48J6J87m5o5J22k18J32P3p3j37J75qj66K02
1454I6j54L5J53j85r3K04M0k01J62Lr8K00k42j43M66m0m07J50K78l31J15k3k2
1477c7J04J08m02O0N98m74l38N74q6k71L20j36m9K12k35k55L84L42p37J75M88
1498C45m14j07M47l85K0N34n13l65P80j57n09M07K32n85L56J32o51N01L65q47
1518d14J02Q79n61n04P39j78l42N72n00k67J087k42j068Q09N58j004J26N94o13
1537b27P9N83p84P1Q12p15n26J198j80r26P96Q7o51M85J76r44P71O78j286M5J211
$$ plain form
1558 753 -53 -594 460 -108 -385 472 -168 -704 624 530 -777 81 731 -436 -156 592 -359 -60 550
1577 550 -530 -327 886 -122 -821 621 258 -750 272 293 -574 341 372 -898 146 902 -603 -489
1595 -489 867 -83 -428 484 -210 -477 714 -28 -1019 592 587 -856 83 617 -583 -75 621 -580 -122
1614 -122 834 -557 -503 960 -128 -896 727 415 -756 391 338 -704 418 570 -1061 -43 1014
1631 1014 -568 -653 868 -345 -512 854 -393 -773 896 94 -1079 600 600 -965 286 767 -750
1648 -750 -108 799 -734 -270 974 -649 -695 1211 -55 -1017 662 407 -763 426 255 -1065 478
1665 478 997 -1131 -347 1142 -498 -420 847 -500 -578 971 -205 -979 822 207 -1074 607 601 -1128
1683 -1128 141 1090 -816 -198 911 -791 -331 1218 -572 -1075 1190 288 -901 527 222 -979
$$ packed form
1558G53q06n41J054n68k77Q57o40n36J328r4j307Q58O50j167K80P48r51K99O10
1577E50j080K03J213j008o99J442l63j008J022K1q67R15L1j270J044P56j505J14
1595d89J356r50l45R12o94k67J191p42r91J611nj443R39N34j200N08O96j201M58
1614a22R56j391N4J463j088p68J623l12j171J147n3j042J122J52j631J018J057
1631A014j582q5J521j213j67J366j247l80J669q02j173J679%j565J251M81j517
1648g50O42R07j533M64J244j623m6J906j266r62J679k55j170J189j71j320J543
1665D78N19k128P84J489j640P8J267j347p8J549j176p74J801o15j281J681oj729
1683a128J269R49j906O18J109j702M60J549j790n03K265r02j189J428l05j201
$$ plain form
1699 -979 780 598 -1241 214 1153 -807 -263 1001 -675 -499 1137 -405 -928 1101 28 -914 857
1716 857 232 -1193 580 878 -1038 -89 858 -722 -128 912 -844 -613 1388 -196 -1048 822 217
1733 217 -952 784 348 -1309 551 922 -1017 -96 1016 -720 -224 1171 -635 -769 1219 -9
1749 -9 -935 815 120 -1054 775 588 -1280 225 1076 -846 -98 855 -839 -234 1227 -406 -983 1050
1767 1050 127 -919 769 254 -1099 679 751 -1064 133 868 -794 -137 939 -743 -620 1133 -305
1784 -305 -777 860 21 -908 805 350 -1011 559 766 -881 -109 830 -874 -247 988 -632 -650 1091
1802 1091 -157 -832 861 120 -1005 775 451 -1034 366 683 -844 5 964 -694 -308 976 -420
1819 -420 -657 921 -128 -792 845 204 -868 602 579 -1017 251 699 -739 -2 768 -617 -393
$$ packed form
1699i79J759j82j839J455R39j960N44J264j676J76J636j542n23K029j073r42J771
1716H57o25j425J773K98j916R49R47j580N94J040j756K31K001j584q52J870o05
1733B17j169J736m36j657J860L71j939R21J112j736M96J395j806j34J988j228
1749ir26J750o95j174J829j87j868J505Q51j922P48R53j694O05J461j633n77K033
1767A050r23j046J688n15j353J778P2j815J197P35j662O57J076j682J23J753j438
1784c05m72J637q39r29J713m55j361J570K07j647P72R39j704O27J235j620j8J741
1802A091j248o75J693p41j125J780l24j485J400L17j527Q49R59j658L86J284j396
1819d20k37J578j049o64J637o41j072J470k3j596J268M48j438P37P70j385K24
$$ plain form
1836 -393 906 -362 -591 824 -58 -799 733 222 -819 486 441 -854 251 638 -655 -83 687
1853 687 -518 -349 819 -162 -660 675 -79 -701 679 257 -835 384 487 -689 79 596 -522
1870 -522 -175 641 -350 -347 664 -139 -518 706 145 -734 519 262 -667 295 343 -602 -1 548 -403 -245
1890 -245 615 -407 -327 538 -158 -484 441 114 -575 280 361 -540 39 459 -465 28 437 -315 -125 478
1910 478 -71 -366 399 51 -370 424 169 -462 66 276 -349 62 261 -241 -33 370 -166 -200 282 -25
1930 -25 -209 328 107 -254 283 159 -252 59 157 -300 -113 86 -81 -104 267 -117 -256 264 67 -76 119
1951 119 82 -140 116 134 -246 66 152 -124 -111 190 -5 -114 31 18 -208 97 -14 -186 31 167 -165 -110
1973 -110 148 -25 -150 -23 106 -27 -2 75 -79 37 115 -165 -105 230 0 -118 136 92 2 142 -27 -96
$$ packed form
1836c93J299j268k29J415q82p41J532n11j041J305m5j295J105L87j293N72P70
1853F87j205J69J168r81m98J335p54o22J380m22j092J219J03j176P68N17j118
1870e22L47Q16r91LJ011q03l79J224n61q79J253k57r29R62M8r45O01N49r51J58
1890b45Q60j022Q0Q65o96l26R25l27o89Q55Q1r01N79M20r24M93M09p52J90O03
1910D78n49k95P65l48m21P94k55o31N28K10o25M11J99n02K08M03n36l4M82l07
1930b5j84N37k21l61N37j24m11L11R8m57J87J99j67k3L71l84j39N20j97j43J95
1951A19l7k22K56J8l80L12Q6k76J3L01j95j09J45j3k26L05j11j72K17J36l32N5
1973a10K58j73j25J27J29j33K5P7j54J16P8k80O0L35k30j18K54m4r0J40j69o9
$$ plain form
1995 -96 85 110 -69 -71 295 -130 -201 192 104 -184 125 -64 -155 217 -5 -321 134 309 -297 -170 263 -147
2017 -147 -248 251 -184 -158 379 59 -373 274 274 -418 -16 350 -176 8 310 -225 0 471 -219 -404 436
2038 436 -60 -549 262 189 -336 211 175 -441 185 353 -478 -141 563 -291 -389 473 1 -356 243 -26 -300
2059 -300 383 103 -675 252 484 -491 -87 486 -265 -179 557 -362 -210 622 -149 -614 525 198 -625 224
2079 224 291 -300 162 272 -459 51 657 -449 -331 683 -257 -497 433 83 -407 489 96 -564 482
2098 482 391 -734 48 525 -437 -108 420 -247 -151 502 -292 -353 686 -60 -747 375 343 -598 184 333
2118 333 -543 72 380 -519 -26 674 -249 -420 648 -47 -495 347 91 -554 471 191 -670 366 456
2137 456 -550 -21 525 -353 -146 398 -257 -205 630 -204 -492 629 99 -603 310 238 -596 132 432 -576
$$ packed form
1995i6J81K5j79kL66m25p1L93q8k88L09j89r1L72k22l16M55J75o06J27M33m10
2017a47j01M99m35K6N37l20m32O47%o92M02L66n26J84L02n35K25M71o90j85Q40
2038D36m96m89Q11p3n25N47l6o16O26J68q31L37P04q54r8Q62m72l57N99k69k74
2059c00O83k80p78R27K32r75M04N73p51Q6P36r19J52Q32p71m65J139l27q23Q49
2079B24O7n91M62J10p31N10O06j106J18J014r40k40R30l50m90Q96l93o60J046
2098D82r1j125P82M77r62L29N28o67R6O53p94o1J039p46o87J122l2r41P82J49
2118C33q76O15L08q99M93P00r23j71J068o95m48Q42k56o45J025k80q61J036R0
2137D56j006N29N46q78K07N44o55N2Q35q34k88J121n30p02R13p2q34P28L00j008
$$ plain form
2157 -576 112 481 -547 -128 629 -324 -395 541 3 -524 409 75 -459 464 218 -694 196 570 -509 -50
2177 -50 540 -261 -116 440 -338 -343 570 -125 -449 430 89 -589 290 221 -580 149 367 -378 136 383 -397
2198 -397 -193 593 -279 -522 497 -72 -345 433 -95 -515 464 262 -494 189 425 -335 -93 332 -305 -54
2218 -54 441 -287 -179 323 -133 -361 343 10 -485 370 205 -498 63 304 -455 122 335 -442 -160 436
2238 436 -165 -328 380 -133 -259 391 -1 -384 268 251 -445 77 314 -375 24 290 -350 -162 344 -133
2258 -133 -213 404 -222 -325 459 30 -465 227 324 -350 187 258 -487 81 435 -244 -175 415 -203 -123 419 -191
2280 -191 -260 331 -24 -335 225 107 -316 242 194 -333 71 377 -278 -123 268 -191 -174 313 -227 -222 262 98
2302 98 -314 119 117 -272 181 195 -309 31 234 -250 -117 297 -269 -192 483 -133 -255 276 53 -251 170 103
$$ packed form
2157e76O88L69j028M19P57r53p1R36n38n27R33l34n34R23k46r12Q90L74j079M59
2177e0N90q01J45N56p78nR13o95l24Q79l41o78Q79o9q01P29K18p45N14K47p80
2198c97K04P86q72k43J019n69k73P78n28m20R79k02p56O83K36p60K42M25o37K51
2218e4M95p28J08N02m56k28P04l33m95Q55j65p03N61K41p59N77K13p77K82N96
2238D36o01j63P08n13j26O50l92l83O52j7o96N22K37o89L99K66o40J88N06m77
2258a33q0O17o26j03P84m29m95O92R7o74N37P1p45N68L54o79O9N90o18Q0N42o10
2280a91o9N91l55l11N60j18m23N58m8n27M04L06o55J55L91m59J7M87n40NM84j64
2302I8m12M33kl89M53J4n04L40K03m84J33M14n66P7O75o16j22N31k23l04M21o7
$$ plain form
2324 103 -278 234 242 -376 -51 300 -168 -5 320 -186 -197 322 -40 -168 258 -97 -147 257 84 -287 127
2345 127 188 -349 22 307 -234 10 301 -155 -103 307 -125 -225 181 -64 -186 205 72 -253 63 162 -223
2366 -223 7 157 -150 -32 263 -180 -92 291 -45 -96 221 -41 -229 277 33 -95 116 106 -302 70 205
2387 205 -170 -37 249 -163 -171 200 36 -113 222 -37 -210 59 87 -83 82 113 -155 9 106 -186 -45 239
2409 239 -20 25 281 -81 -25 227 -61 -94 140 -10 -188 63 127 -196 7 261 -185 95 151 -98 10 229
2431 229 -53 -117 220 -65 -126 194 38 -135 99 43 -187 -29 116 -203 31 140 -227 -12 33 -149 -61 127
2453 127 -104 -35 115 -38 -50 79 109 -36 95 37 -196 113 82 -159 67 84 -98 -71 43 -155 -22 117
2475 117 -65 -76 20 140 -235 112 -18 -84 87 74 -57 -3 -23 -37 56 144 -28 -76 78 -18 -47 49 0 -118 121
$$ packed form
2324A03l81N12Qo18L25L51m68J63L25n06j1N19l62j28M26l55n0M04j73l71M14
2345A27O1n37L71K85n41K44K91m56N2M10m32j00M06k45j22L91j33l25L16R9l85
2366b23K30J50l07J18K95m43Q8L83l36n1L17k62j88N06k44j28K11j0m08L72J35
2387B05l75J33K86m12qL71j64j49L35k59j73K69K8j70J65L1k68J64R7k92J41K84
2409B39k59M5K56l62N6K52k88l3K34j50j78K51O4l23K03K54m46K80N6k49J08K19
2431B29k82o4L37k85o1L20j56j73K34n6k30J58J45l19K34J09l67K15M5j82Q8J88
2453A27k31O9J50j53j2J29L0j45J31n8k33L09l1k41K26J7j82K7J14j98J33J39
2475A17j82j1R6J20l75L47j30o6J71j3j31N4k0j4R3Q8j72m8J54r6k9R6m9j18K39
$$ plain form
2500 121 8 -92 16 -3 -31 99 -15 -28 50 -97 40 87 153 -14 -48 -35 -17 -91 -46 -30 -39 22 39 -35 4 13 -48
2527 -48 29 36 -24 -24 33 3 27 38 -9 -76 77 -33 -1 14 49 42 -8 -19 7 51 14 32 23 -3 7 34 26 13 33 -7 -65 -35
2559 -35 175 -33 99 -32 25 -94 -21 -61 -112 103 -41 -123 79 -4 -45 -51 11 13 -64 -6 61 7 55 0 -68 124 -72
2586 -72 -125 66 -8 -63 57 6 37 114 0 -14 125 8 -48 -65 46 -18 -20 107 -128 -66 149 -19 -51 174 -48
2611 -48 -54 48 99 6 64 199 -31 28 84 -106 -7 142 -29 -86 101 10 10 126 -59 -123 -66 -24 -59 -27 91 -122
2637 -122 -17 41 -36 -15 72 -143 -11 157 -56 -10 -6 91 -29 70 43 -53 124 -31 -65 68 18 16 -57 118 28 -90
2663 -90 82 20 -77 39 -68 27 42 51 -1 71 9 -140 37 51 -72 -1 148 -121 -30 28 -49 -48 -36 37 -13 -8 -117
2690 -117 -88 23 12 -89 52 4 -106 15 -6 46 -53 5 -11 3 107 -17 -66 113 71 -33 -47 129 -133 -21
$$ packed form
2500A21j13j00J08j9k8J30j14j3P8j47J37M7O6j67l4J3J8p4M5J6rO1J7p4L9Ro1
2527d8P7Po0%N7l0K4J1m7o7J53j10L2J5L5pn0j1K6M4l7J8rk6J0K7qj3K0m0n8L0
2559c5K10k08J32j31N7j19P3m0n1K15j44q2K02q3m1oO2Kp7N8O7n4M8n5o8J92j96
2586g2n3J91p4n5J20n1L1P7j14j4J39j17n6j7J11o4kJ27k35O2K15j68l2K25k22
2611d8oJ02N1r3N8J35k30N9N6j90R9J49j71n7J87r1%J16j85o4N7M2l5L2J18k13
2637a22J05N8p7K1Q7k15J32J68k13M6MR7j20R9k7r6J77j55l4J33n0kp3J75r0j18
2663i0J72o2r7J16j07R5J5Rn2P2o2j49J77J4j23P1J49k69R1N8p7JJ2P3n0Nj09
2690a17K9J11j1j01J41m8j10J21k1N2r9N8j6J4J04j24m9J79m2j04j4J76k62J12
$$ plain form
2714 -21 100 -102 -54 133 -58 -87 70 -10 -11 115 -62 -26 66 60 -81 -88 113 -47 -12 55 -142 -47 3 -73 22 52
2740 52 78 -89 48 -43 -48 27 53 23 -24 12 -47 53 46 -63 -9 24 -42 -50 66 79 -53 145 127 2 14 -63 -51 -37
2768 -37 69 -114 68 88 1 -69 35 -4 -8 95 -35 -12 -92 -6 -44 7 -29 45 -13 53 -96 -30 123 -23 32 56
2794 56 4 -13 40 14 -42 -19 -2 -15 14 46 -51 -91 -30 5 -19 48 -45 47 0 10 -16 -58 54 -65 -4 26 57 -67 -39
2823 -39 106 -16 144 -70 -137 1 34 66 -77 39 -33 -7 60 92 32 76 72 -17 12 69 6 36 66 120 -14 37 57
2850 57 98 0 21 81 -61 -26 -35 69 34 41 -92 22 -26 -42 -33 97 20 73 -23 -97 35 -16 -142 1 70 -73 90
2877 90 26 -45 -100 120 21 -18 77 -2 -31 42 54 8 -78 28 -52 10 62 14 -47 100 -23 -35 -1 -75 -66 73 -24 -95
2905 -95 102 65 -102 -42 74 -143 -35 93 -88 -129 157 32 23 74 -79 -44 38 28 -132 61 32 22 34 56 -64
$$ packed form
2714b1J21k02M8J87j91k9J57q0jJ26j77L6R2oj41pK01j60L5O7j97R5N0p6R5L0
2740E2K6j67J37r1nP5K6l0m7L6n9J00pj09N4L3o6qJ16J3j32J98j8j25J2p7J2J4
2768c7J06j83J82K0q7p0J04l9mJ03j30K3q0Q6l8N1l6P4n8O6j49O6J53j46N5K4
2794E6n2j7N3k6n6K3J7j3K9L2r7m0O1L5k4O7r3R2m7J0k6m2J12j19O1L0L1j24K8
2823c9J45j22J60k14o7J38L3L2j43J16p2K6O7L2o0M4mq9K9N7o3L0L0N4j34N1K0
2850E7M1r8K1O0j42L5rJ04l5Pj33J14m8j6RJ30p7N3r6p4J32n1j26J43O9j43J63
2877I0o4p1n5K20r9l9R5p9k9P3J2m6q6J06q0O2N2m8o1J47j23j2L4p4RJ39r7p1
2905i5J97l7j67O0J16k17J08J28j81m1K86j25rN1j53L5Q2j0j60J93k9j0J2K2j20
$$ plain form
2930 -64 -30 80 64 76 81 -25 -63 -17 -10 -49 -13 -23 -73 37 72 -136 -99 61 -98 -22 135 9 -78 40 -12 42 104
2957 104 169 -76 14 3 -111 -20 55 -39 -36 72 -45 49 89 -52 -31 124 -53 -23 59 41 -12 13 22 -23 -38 130 -10
2984 -10 -160 85 17 -26 49 -82 -85 -7 17 -64 14 61 -135 -71 149 -41 24 104 -6 1 45 -12 -9 121 -64 -85 68
3011 68 53 -153 36 47 -13 -11 20 33 42 29 -116 -5 98 -14 33 -72 -76 -12 -77 141 28 89 28 -46 25 -4 29
3038 29 -33 55 -46 -3 6 90 -49 86 72 -95 26 89 49 4 43 15 -17 36 -84 -33 17 86 -19 -24 105 67 -28
3065 -28 -99 -21 -50 19 75 -68 -20 -24 -4 66 15 -102 18 -31 22 -25 -1 -23 8 -21 -16 -111 -38 108 -1 -68 85 -85
3093 -85 -100 32 -24 -103 -74 5 55 61 37 49 4 132 -35 -31 40 24 17 36 -4 -104 32 84 -44 -9 35 -68 -54 82
3121 82 2 -78 14 -42 -59 121 69 -74 55 115 -119 -16 31 -38 70 149 -35 -14 142 17 -107 25 50 -125
$$ packed form
2930f4L4J10j6J2Nj06l8M6Pl9L6j0n0J10L5k08L7J60j59P6J57j26q7J18n2N4O2
2957A04O5k45R0j1j14R1P5r4LJ08j17R4M0j41K1J55j77L0Q2j8n3K5Rm5j5J68j40
2984a0j50K45o8m3P5j31lP8K4q1P8M7j96O4K20j90O5Q0j10PM4n7LJ30j85k1J53
3011F8j5k06J89J1o0KL1J3Rj3j45J11J03j12M7j05mO4o5K18j13O1o1p4P1k9L3
3038B9o2Q8j01M3RQ4j39J35j4j67J21O3m0m5L9k8l2N3j20N1N0O9j05nJ29l8r5
3065b8p1P8k9O9N6j43M8mK0P0n1j17J20m9N3m7K4k2L1k9Nr5P3J46j09o7J53j70
3093h5j5J32n6p9K9P9N0Ok4J2m5J28j67MP1j6pJ9m0j00J36N2j28L5M4j03J4J36
3121H2q0q0R2n6j7J80n2j43J29O0k34J03M7o9J08P9j84K1J56j25j24J32K5j75
$$ plain form
3145 -125 40 69 -87 49 -10 -41 44 49 20 47 -57 -77 6 75 104 -141 113 141 -64 129 57 -212 -33 89 -46
3170 -46 74 65 31 -31 105 32 -97 92 42 -167 -32 46 -46 29 43 -66 88 160 -110 -45 137 -44 -35 130 137 -52
3196 -52 108 56 -207 11 61 -218 -62 72 -39 -84 133 -89 47 36 -65 32 72 29 -75 90 124 -189 79
3219 79 206 -146 -51 163 -65 35 118 -63 -83 89 20 -79 171 66 -207 57 102 -210 -45 150 -148 -1
3241 -1 147 -172 -70 66 -76 -56 157 6 -154 140 61 -280 89 211 -141 3 101 -76 5 270 -117 -138
3263 -138 215 -26 -146 106 -43 -122 88 9 -190 118 218 -208 26 165 -238 -36 210 -36 -76 197 27
3284 27 -169 165 40 -276 108 182 -235 33 94 -199 16 153 -124 -84 353 -156 -167 237 -65 -246 119 134
3306 134 -336 123 254 -187 3 72 -291 96 308 -220 -85 321 -51 -221 221 -33 -219 194 200 -276 60
$$ packed form
3145a25J65K9j56J36n9l1Q5Nk9K7j04k0Q3O9K9k45K54K8k05J93p2k69J79J22j35
3170d6J20rl4o2J36p3j29J89n0k09J35P8r2P5J4j09J54P2k70O5J82j81RJ65Pj89
3196e2J60n2k63K18N0k79J56J34j11m5K17k22J36j1j01R7M0m3j04J65L4l13K68
3219G9J27l52R5K14k28J00Q3j81k0J72o9r9K50j05k73K64M5l12J65J95k98J47
3241aJ48l19J02J36j42K0K13j51j60K94p9l41L69J22l52J44R8j77Q1K65l87k1
3263a38L53k41j20K52j49p9K10p9j99L08J00m26K34J39m03K02K46k46m0K73j70
3284B7j96L34j25l16L84P4m17K68O1k93K15J37k77M0M37n09j1M04l02j81L65J5
3306A34m70M59J31m41J90O9l63L87K12n28J35M06l72j70M42k54j86M13Om76L36
$$ plain form
3327 60 225 -225 -32 222 -155 -155 315 -154 -182 292 -50 -158 225 -10 -373 153 181 -249 163 260 -144 12
3349 12 359 -274 -57 298 -109 -156 240 32 -304 279 169 -404 203 203 -232 158 135 -276 68 418 -171 -276
3371 -276 382 -43 -185 296 -61 -224 268 131 -311 16 247 -347 87 247 -281 -30 349 -192 -321 436
3391 436 -65 -329 268 -17 -278 242 123 -370 50 214 -264 103 280 -367 -118 442 -184 -235 341 -149
3411 -149 -303 321 111 -234 258 109 -239 60 198 -290 -10 288 -331 -131 393 -93 -98 354 -24 -199 313
3432 313 66 -321 186 153 -248 110 336 -279 3 392 -229 -103 290 -139 -232 375 24 -208 308 167 -417
3453 -417 116 141 -229 40 220 -306 27 294 -234 -81 293 -31 -279 317 -83 -285 267 141 -339 190
3473 190 114 -272 125 347 -397 -105 367 -239 -55 268 -168 -221 311 -10 -241 280 -22 -178 98 180 -235
$$ packed form
3327F0J65m50J93K54l77%M70m69k8M74l42j08L83k35l63N26K8m30M12R7m04J56
3349A2L47o33K17L55m07m7L96k08l36N83j10n73O07%m35L90k3m11L44L50n89j05
3371b76O58m25j42M81l57j63M92j37m42L27K31n94M34J60n28K51L79n41j29P57
3391D36n01k64N97k85k61N20j19m93M20J64m78L67J77o47K49N60o26n1N76m90
3411a49j54O24k10l45M92j49l48K99J38m88K80K98o19K00N24m86nM52l78j75N12
3432C13k47l87N07l3m01L58K26o15K82L89o21J26L93m29r3O07l51k32N16j41n84
3453d17N33K5l70K69J80n26L33K67n28J53L74l24k48N96m00k02N52j26m80N29
3473A90p6l86L97K22p44K92M72o06J84L23m36n3N32l21k31N21l02j56K76Q2m15
$$ plain form
3494 -235 72 214 -235 -49 182 -190 -68 322 -76 -191 210 -9 -138 266 7 -301 115 102 -189 94
3514 94 159 -219 10 339 -95 -51 151 -184 -119 261 -59 -130 240 94 -228 170 155 -298 13 163 -137 76
3536 76 174 -156 -58 143 -139 -109 198 -77 -180 109 42 -205 108 29 -224 164 135 -229 36 246 -90 -43 206
3559 206 -58 -61 128 -163 -19 121 -17 -118 102 88 -141 22 136 -55 61 135 -141 82 180 -212 -37 174
3581 174 -105 -137 140 48 -59 160 -1 -163 147 -4 -190 41 210 -56 -80 138 -29 -26 45 -137 63 184
3603 184 44 -194 39 161 -70 100 3 -135 124 56 -112 32 136 -117 -32 98 -37 28 53 -148 15 92
3625 92 -63 -78 36 49 -2 32 38 6 40 71 -126 108 46 -103 32 173 -96 -113 65 -7 -3 120 -12 0 104
3650 104 -50 -68 82 8 -174 89 92 -53 115 33 -18 219 115 -164 57 50 -12 -23 57 -4 20 101 -39 42 109
$$ packed form
3494b35L07J42m49J86K31l72J22L90l98j15M01k19j29M04k59l08M16j3k91K83
3514I4O5l78K29L29m34M4K02l35O5L80l20p1L70j46l22L98j5m53L11J50l00K13
3536G6R8l30R8K01k82L0L07k75j03K89o7k47L13p9k53L88k9l64K65K10l36M7K49
3559B06k64lJ89k91J44J40j38j01K20j4k29J63J14j91J16P4k76K23R8l92J75K11
3581A74k79l2K77r2j07K19j61j62L10j51j86K31J69k66k4K18j67LP1j82K00J21
3603A84j40k38K33J22k31J70r7j38K59o8j68J44J04k53Q5J30j35O5K5k01J63P7
3625I2j55j5J14J3n1L4Ol2L4L1j97K34o2j49J35J41k69j7J78p2MJ23j32J2J04
3650A04j54j8J50p4j82K63Lj45J68q2n1K37j04k79K21po2j1Q0o1K4Q1j40Q1O7
$$ plain form
3675 109 15 -150 75 68 -86 131 -39 -62 128 100 -150 78 150 -62 -53 190 -118 7 130 -144 -96 236 11
3698 11 -186 241 -2 -130 39 37 -186 94 14 -193 14 70 -231 -139 250 -10 -127 242 -43 -164 113 -31
3720 -31 -103 129 38 -250 162 225 -238 63 52 -131 -97 223 -211 -113 295 -71 -188 196 18 -113 156 34
3742 34 -196 165 173 -226 2 153 -208 -84 280 -151 -117 271 -131 -169 178 -106 -301 197 189 -338 174 249 -371
3765 -371 59 321 -274 -110 258 -175 -62 400 -203 -258 198 -30 -268 219 98 -201 185 248 -286 17 230
3786 230 -195 31 363 -215 -228 305 -113 -274 301 -9 -325 283 107 -298 208 189 -304 127 311 -315 10
3807 10 361 -202 -143 355 -143 -161 367 12 -179 274 29 -201 218 141 -361 190 345 -337 -17 339 -126
3828 -126 6 340 -128 -208 408 -79 -297 140 20 -297 201 142 -317 141 211 -356 70 244 -294 -86 386
$$ packed form
3675A09r4j65K25pj54K17j70k3J90k8k50K28P2k12RK43l08J25J23k74M8L32k25
3698A1j97M27k43j28J69kk23K80q0k07K07N6l01R2L89k60j17L69k85j21K77j44
3720c1p2K32r1k88M12O3m63L01j1j83L4L20m34R8M08l66j17L84j78j31K69j22
3742C4k30L61Ql99K28J51l61J24L64m31L4L88m02l8L47k84j95M98qn27N12P5o20
3765c71M30K62n95J64L68m33J13M62o03n5M56k28k38M87j21k99L86O3n34L03K13
3786B30m25K26L32n78j3N33m18j61N75l10l16O08j76m05N06j9m93M31J84o26L25
3807A0L51n63N9M98m98j8N28l55j91M53k45k30M19p7n02N51J55o82L20L56m65
3828a26J32L34m68q0O16m87k18M37j20l17M98n9m59M58P0n67M26J74n38K08M72
$$ plain form
3849 386 -146 -274 449 -1 -241 187 -51 -344 226 217 -344 85 257 -335 98 315 -269 -68 342 -227 -208
3870 -208 467 -84 -262 357 17 -289 330 219 -394 5 211 -454 35 365 -344 -192 440 -292 -303 351
3890 351 -68 -224 437 -26 -364 258 191 -390 100 326 -336 167 374 -284 26 459 -159 -158 453 -74 -217
3911 -217 299 139 -421 183 263 -404 121 176 -414 185 426 -358 -132 381 -153 -160 459 29 -245 334 67
3932 67 -441 239 202 -387 221 344 -431 73 473 -420 -145 421 -323 -220 427 -165 -391 291 137 -407 240
3953 240 246 -447 111 354 -450 -20 406 -353 -286 425 -18 -252 439 -154 -346 310 209 -369 186 287 -433
3974 -433 105 385 -354 -81 369 -272 -198 343 -187 -279 410 -9 -395 235 112 -440 142 332 -352 104 438
3995 438 -313 -129 293 -255 -91 442 -107 -318 295 54 -413 86 213 -382 278 303 -403 61 294 -336
$$ packed form
3849C86n32j28P23m50k40M28k38k93N70rn61M29J72n92M33K17n84K01M10n69J9
3870b08O75n51j78O19l40l06O19j11o13L99K06o65M89L30p09J52O32p32j1O54
3890C51m19j56O61m63l38O22o7n81M90K26o62N03K07o58L10M33o18JO11n27j43
3911b17N16j60n60O04Q0o67N25N5n90N99K41p84K26N13n34pO19m30k74N79k67
3932F7n08O80l7n89O08J23p75N04M00q93K75N66p44J03O47n92k26O82j54n44O47
3953B40Oo93N58K43q04M30M26p59O7P11m43k34O91n93j92O56j01n78N55J01p20
3974d33N38K80p39K73M50o41P4N41n30r2O89m19l86O30j23n52N82J90o84M56L34
3995D38p51J84M22n48J64N33n49k11O13k41m67M99J27n95O60K5p06M64K33o30
$$ plain form
4015 -336 -111 283 -202 -210 380 -75 -251 392 83 -344 199 122 -278 168 274 -325 2 258 -219 -120 294
4036 294 -218 -169 334 22 -314 301 68 -313 155 91 -298 120 249 -305 1 347 -138 -132 231 -1 -207
4057 -207 195 -62 -352 200 133 -227 128 239 -313 -11 286 -160 -75 268 -90 -200 278 -170 -284 198 -5
4078 -5 -188 107 53 -217 31 89 -208 66 197 -94 -64 158 -45 -260 173 1 -157 167 6 -221 96 5
4100 5 -256 42 183 -252 -33 163 -143 6 160 -109 -105 257 -5 -76 151 183 -214 112 33 -61 37 17 -60 -69
4124 -69 49 -80 -54 142 67 -64 60 -30 -85 78 -40 -150 89 120 -201 -29 68 17 -64 -47 -33 10 192 -21
4148 -21 -44 125 80 -31 -11 124 -15 -49 -1 -110 49 158 -92 -1 70 0 10 65 56 -125 22 113 -85 4 30
4173 30 -85 -41 74 -87 -35 107 -36 -54 -54 -48 -86 118 47 -44 6 130 -90 -85 67 -40 37 15 72 -96 64 6
$$ packed form
4015c36K25L94m85qN90m55j76O43l09m27N43p7m00M46J06n99L27K56m77R9M14
4036B94n12M9N03l12l36O15k33l81M68o4l89M18J29n54L06L46m85OL63k32k06
4057b07M02k57k90N52o7l60L55J11n52L02K97m46Q5L43l58j10M78m48j14M82k03
4078ej83K95n4k70K48N8k97K74J31k91L0K22k03k15M33j72j58L24j61k27L17r1
4100Ek61K98J41m35K19J96l06J49J54k69ML62k62p1K27L2l97L26p9r4R8k0p7r
4124f9J18j29K6J96p5j31J24r0n5J63j18j10K39L1l21J72R7n1q1J7J4M3J82k13
4148b1k3J69m5j11K0J35j39l4M8j09J59J09k50R1P1p0J0N5rj81J47R1j98Q9K6
4173C0j15M4J15j61N2J42j43j8%Ol8K04p1r1N0J24k20NJ52j07P7k2N7j68J60n8
$$ plain form
4199 6 45 35 59 -63 -111 192 41 -98 65 48 7 13 27 -120 51 18 -185 19 11 11 -15 39 0 -67 76 -21 -27 47
4227 47 38 -93 -5 178 -158 42 106 -11 98 62 -1 -45 143 30 -153 86 103 -58 22 33 -84 67 -27 -61
4251 -61 147 46 -118 -9 56 -10 -113 97 -73 35 75 0 -94 149 106 -145 61 163 -95 75 160 -137 41
4274 41 163 -90 -75 100 26 -102 216 127 -115 125 120 -172 -98 146 -134 -41 262 -20 -143 145 -22 -58 91
4297 91 -38 -204 136 188 6 138 82 -216 108 93 -194 -2 156 -14 -37 83 -14 -112 163 48 -114 159
4319 159 114 -139 142 172 -134 -4 96 -52 10 221 -27 -165 91 -77 -140 118 0 -148 129 47 -177 56
4341 56 93 -74 16 118 48 -117 217 -3 -57 73 -88 -92 114 15 -212 134 29 -86 -6 118 -86 4 80 -96
4365 -96 -136 235 -109 -67 87 -47 -104 74 29 -148 100 145 -14 96 0 -137 -61 130 -85 -69 149 -83 -101
$$ packed form
4199FL9j0K4j22m8L03j51j39J63j7m1OJ4j47J71l3k03K04q%k6N4l9o7J43r7oP4
4227D7rj31Q8J83l36K00O4j17J09l6o3m4J88j13j83K39J7j61Q0J1j17J51r4l4
4251f1K08j01j64J09O5o6j03K10j70J08M0p5r4K43m3k51K06J02k58J70Q5k97J78
4274D1J22k53J5J75p4j28L18q9k42K40nk92P4K44k80R3L03k82j23K88j67l6J49
4297I1j29j66L40N2j82J32n6k98L24j5k87J92J58j70k3J20r7r8K75j15j62K73
4319A59m5k53K81L0l06J30J00j48O2K11k48j38K56j68o3K58j18j48K77q2k24K33
4341E6L7j67R0J02p0j65L34k20n4J30j61mK06r9k27L46j05j15Q0J24k04R0P6j76
4365i6m0L71l44M2J54j34n7J78m5j77K48M5j59J10r6j37P6J91k15J6K18k32j8
$$ plain form
4388 -101 44 -46 -53 52 87 -57 57 98 -282 -15 48 -82 -85 56 -78 -122 105 -100 -105 87 -21 -137 133 40
4412 40 -75 75 -38 -95 22 128 -127 -12 128 -164 16 90 -143 3 99 -165 -108 69 -59 -45 43 8 -34
4435 -34 78 38 -121 81 58 -36 -1 17 -140 82 94 -11 -25 98 -39 -137 66 31 -32 -27 -12 -18 37 59 -39 -44 22
4462 22 -96 55 126 -32 24 149 -104 -96 126 84 -28 106 23 -130 26 38 -97 87 -15 -76 73 160 -163
4485 -163 -27 70 -117 -77 45 12 -1 -11 -12 -72 70 16 -48 92 11 -56 32 90 -90 49 -5 -32 -42 170 -31 -85
4511 -85 86 -10 -136 47 27 -35 164 -13 -140 101 90 -81 -37 82 36 -30 135 32 -15 71 -70 -76 157 -18
4535 -18 -144 137 58 -188 34 19 -149 -30 65 -104 -1 139 -58 -50 108 -58 -77 184 -64 -133 -5 30 -137
4558 -137 -19 147 -144 -13 65 -70 7 142 -21 -49 109 56 -94 72 -88 -86 -35 63 -65 -38 34 -152 -15
$$ packed form
4388a01J45r0pJ05L5j44J14M1l80K67O3j30lJ41j34m4K27k05nJ92j08j16K70r3
4412D0j15J50j13n7J17J06k55J15J40k92J80P4k33J46R6k64N7J77j28J4Q8l5m2
4435c4J12m0j59K02k3r4L5J8j57K22J2j05j4J23j37r8K03l5o3NJ5oN5K2r8nO6
4462B2j18J51P1j58N6J25k53QK22m2j12J34q3j53J56J2j35J84j02o1J49Q7l23
4485a63J36R7j87M0J22l3j3j0jo0J42n4o4J40q1o7Q8N8j80J39n4k7j0K12k01n4
4511h5J71r6j26J83k0o2J99j77j27K41j1j71M4J19m6o6J65j03m7Q6j41oK33j75
4535a8j26K81p9k46K22j5j68J19R5j69J03J40j97QJ58j66j9K61k48o9J28L5j67
4558a37J18J66k91J31P8j35P7J35j63k8J58n3j50J66j60KN1R8j28K7P2j86J37
$$ plain form
4581 -15 125 -147 63 138 -26 -14 -20 -63 -52 143 -43 -58 84 44 80 28 107 -32 -23 -44 -80 -26 109 -115 -87 88
4607 88 -104 -58 64 38 31 28 -59 -148 49 -35 -140 16 52 -19 -83 22 -129 39 129 28 11 194 -94 -20 76 24
4633 24 -92 46 25 4 -118 0 18 39 0 -44 -55 85 6 31 41 22 -135 17 -88 -47 53 48 -9 56 -4 -92
4659 -92 -16 24 -96 0 -5 5 -10 -53 -53 -82 17 -8 -59 -35 91 -11 54 33 -78 61 65 -82 -27 15 -29 -34 -1 -138 -18
4688 -18 59 -44 1 59 -37 -126 98 15 5 -48 36 4 -29 4 -3 45 -67 -16 -48 42 -43 -66 4 -134 21 -64 -50 -73
4716 -73 3 -56 -10 14 69 -44 -13 55 -23 59 -2 -51 -58 56 -43 -160 -14 49 0 47 19 24 -41 -57 -36 -23 15 -49 -38
4745 -38 -23 -2 -1 -11 -9 -16 -49 -5 79 7 -56 -30 76 -33 -15 -5 -69 -42 71 19 -47 15 40 -21 66 -76 -15 2 -22 -73
4775 -73 -23 64 -30 57 81 8 89 80 20 46 27 18 26 -6 -20 37 47 -26 33 46 0 -25 -35 58 82 85 27 -103 38 42 -53 1
$$ packed form
4581a5J40k72K10P5j64J2om3J1J95j86j5J42m0L6n2P9j39Rk1l6N4J35k24K8J75
4607H8j92M6J22k6plq7q9J97q4j05J56L6p1o4J05j51J68R0j01j7J83k88P4R6n2
4633B4j16J38k1k1j22J18J8K1l9m4j1J40p9K5J0j9j57J52j05M1J00nn7O5o0q8
4659i2P6M0j20R6nJ0j5m3%k9R9k5n1K4J26j02O5k1j11J39Mj47N5M2m4nL3j37J20
4688a8P7j03M5N8r6q9K24q3j0n3Q4l2l3L3pM8j12N1l2R0q5k3P0j38J55q5J4k3
4716g3P6n9M6K4N5j13L1O8p8Q2o1m9pJ14r9j17J46O3m9M7k8No5j6K1J3L8o4J1
4745c8J5K1Jj0Kpl3M4Q4p2o3K6J06j09J8J0o4K7J13n2o6O2K5o1Q7j42O1J7k4n1
4775g3N0Q7r4Q7K4p3Q1ro0K6j9rQl2j4N7J0p3N9J3m6k5j0R3K4Ln8j30J41Mr5N4
$$ plain form
4807 1 123 -95 -78 5 -28 -41 61 -41 -43 52 93 2 52 -9 -133 87 124 -32 42 115 -42 -6 -35 92 38 99 65
4834 65 -129 98 3 -79 1 91 16 10 -27 -10 -3 31 59 26 46 72 -8 133 58 -220 77 41 -122 90 25 5 114
4861 114 73 -120 19 -65 -44 -81 87 -65 -59 36 -17 22 15 -7 -130 110 -21 -101 20 21 -76 12 44 -56 109 49
4887 49 -173 36 87 -4 -89 84 -13 -13 101 53 35 3 18 -46 -19 -29 -136 17 15 -73 -86 116 63 -48 -19 -12 -53 -11
4915 -11 28 -43 80 9 -52 82 97 21 70 202 -56 25 62 -3 -13 80 -3 -69 42 -52 -76 28 100 -49 27 -2 -72
4942 -72 97 169 -169 66 98 -151 -38 116 -115 16 201 -33 -111 52 30 -92 -39 -2 -101 47 186 -45 100
4965 100 127 -93 63 181 -37 -56 143 -75 -61 244 -114 -28 79 128 -123 56 69 -172 109 111 -83 -25 117
4988 117 8 -39 87 -15 -180 128 -86 -180 -19 158 -161 5 26 -160 -11 160 -169 -2 237 -169 -33
$$ packed form
4807AJ22k18J7Q3l3j3J02j02kR5M1r1N0o1j24K20L7j56P4P3j57L6k9J27n4O1l4
4834F5j94K27r5q2Q0R0p5ol7J7PL4K8l3K0K6q0J41p5k78K97l6j63K12o5k0J09
4861A14m1j93J39q4K1l7J68j52OR5n3L9pk2j23K40j31q0J21Jr7Q8L2j00J65o0
4887D9k22K09N1r1q5J73r7%J14m8j8l2J5o4K7j0j07J53kq8j3K02n3j11K9Pm1M2
4915a1L9p1J23p1o1J34J5p6M9J32k58Q1L7o5j0R3q3o6J11r4k4J04P2j49P6k9p0
4942g2J69P2l38K35L2k49J13J54k31J31J85k34p8J63k2j22N3L7r9J48J39k31J45
4965A00K7k20J56J18k18j9J99k18J4L05l58Q6J07M9k51J79J3k41K81Kj94N8J42
4988A17j09m7J26j02j65L08k14r4J61J77l19J66K1j86J49J71l29J67K39m06J36
$$ plain form
5009 -33 191 -40 -94 182 95 -74 98 112 -46 1 157 -160 -8 168 -57 -21 200 -100 -157 233 -46 -108 82
5032 82 59 -140 54 105 -103 127 161 -94 -114 140 -150 -53 199 -59 -203 98 -62 -148 128 7 -198 31
5054 31 94 -107 58 202 -203 23 236 -75 -43 183 -127 -129 129 15 -212 161 19 -257 153 79 -180 -37
5076 -37 156 -179 2 160 -21 -141 177 -62 -82 90 3 -108 199 103 -161 24 152 -154 -15 115 -111
5097 -111 -29 218 -47 -110 88 -39 -117 103 20 -215 111 42 -187 -26 111 -97 -5 176 -154 -78 151 -101
5119 -101 -22 111 -50 -124 102 52 -106 195 45 -65 47 197 -43 -65 160 -134 -2 109 -66 -108 199 -38
5141 -38 -188 149 3 -110 -11 126 -150 -4 149 -68 60 117 -87 16 51 -20 -123 96 22 -71 73 -6 -88
5164 -88 41 64 -98 34 154 -105 -30 122 -65 33 103 -75 -120 11 -89 0 166 69 -137 62 53 -43 14 14 -62
$$ packed form
5009c3K24k31n4K76q7j69J72J4j58M7J56l17J52J76k25L6K21l00n7L90k79o2J90
5032H2k3j99J94N1k08K30L4k55k0K54k90R7K52k58j44L01j60q6K76j21k05K29
5054C1O3k01J65J44m05K26K13l11L2K26l10kK58j14k27L73j42k76M10p4k59J43
5076c7J93l35J81J58j81j20L18k39k0J72q7j11L07r6k64J85J28l06J39J30k26
5097a11Q2K47k65o3J98j27p8K20q3k35L26o9k29J61J37k08R2J81l30P6K29k52
5119a01P9J33j61p4K26n0j58L01j50j10J12J50k40k2K25k94J32J11j75m2L07k37
5141c8j50L37j46j13R9J37k76J46J53k17J28N7k04J03L5p1j03K19p4r3J44p9q2
5164h8J29K3j62J32J20k59P5J52j87R8P0j78m5J31j00Q9J66r7k06J99rr6N7%p6
$$ plain form
5189 -62 -40 54 -8 -49 64 33 67 166 44 -53 63 11 -161 20 53 -66 81 33 21 -69 81 56 98 85 -27 -60
5215 -60 196 -36 -64 13 -72 -103 24 8 -62 -67 123 -82 6 133 34 44 -73 -5 26 90 58 -52 -52 6 -30 81 43
5242 43 -74 11 37 -126 -23 13 -12 -25 37 15 -55 44 -78 -96 -42 -25 22 48 1 62 47 13 33 4 44 -7 -23 -1
5270 -1 14 -76 -34 23 -46 -4 14 -56 6 45 -120 -53 -41 18 61 37 -65 1 40 15 -71 11 0 -44 -48 69 47 45 21 16 -20
5301 -20 -39 47 40 -27 6 2 -60 83 71 -76 58 -19 4 45 -1 -42 35 122 -15 -64 18 -76 56 62 -19 -28 43 -150 -122
5330 -122 4 -61 -21 -2 7 43 -33 -4 -69 27 17 -13 -8 75 55 -91 31 8 -27 84 2 -24 -14 -8 12 -41 68 -40
5358 -40 -6 147 -6 -19 -60 -33 -69 -41 -73 -89 -31 88 -38 20 98 -17 27 23 -56 -70 -21 -89 -12 8 10 -142 -83 -57
5386 -57 -49 8 8 -46 -13 17 2 -58 -45 92 -17 47 -82 -26 39 67 -54 21 -8 -106 57 28 -92 25 120 -77 -27
$$ packed form
5189f2K2R4o2m1J13l1L4R9j22r7J16n2j72J81L3j19J47m8j2r0J50k5M2j3j12l3
5215f0K56k32k8P7q5l1J27j6p0nJ90k05Q8J27r9J0j17O8L1O4l2j10%N8l6J11l8
5242D3j17Q5K6j63J03L6k5j3O2k2p0R9j22j8N4J7M7K6m7O1j5l4K0k9M0n1j6K2
5270aJ5r0M2N7o9M2J8p0O2L9j65O7J2N9M3k4j02O6L9k5q6Q2j1m4mJ17k2kk4nl6
5301b0j9Q6po7L3mo2J43j2j47J34p7K3M1m6m1P7Q7j37m9Q2r4J32Oq1rP1j93K8
5330a22J26o5M0J9RL6p6K9o5R6j0l0NQ3k0j46J22k3l5J11q2k6J0OK0n3J09j08
5358d0L4J53j53j3m1K7l6K8l2j6N8J19j26N8P8j15M4mp9j4M9o8P7K0Kj52N9K6
5386e7QN7%n4L3L0j5o0J3J37j09O4j29N6O5K8j21P5k9r8J63k9j20J17R5j97N0
$$ plain form
5413 -27 41 25 -72 82 0 -1 23 14 -19 -23 62 -73 30 75 -51 -10 -7 -8 38 94 -18 -38 76 24 -94 85 43 -84
5441 -84 -25 87 -60 8 153 6 -97 8 -97 -99 -29 -12 -44 20 89 -79 70 157 -29 74 111 -42 -23 58 -86
5466 -86 -96 -3 33 -94 198 -87 -99 107 23 -39 94 11 -19 21 84 -97 -30 58 -21 -71 54 72 66 13 -23 -80 81
5493 81 -17 5 51 31 -3 84 107 -64 -30 87 -12 -79 61 -17 -3 -71 -91 -34 -61 36 -23 149 -54 -48 7 30 -158 66
5521 66 12 -153 -67 33 11 -41 29 8 10 93 -20 -63 -76 -68 -73 16 35 27 -67 36 -98 45 120 -24 -1 -27 44 -9 61
5550 61 -27 -6 -77 -18 14 27 -31 -49 86 -4 -44 -9 76 -11 56 31 55 -101 34 8 20 18 -86 -13 -1 -19 -14 61 10
5579 10 30 1 14 49 -31 34 -82 -30 0 -33 -1 -13 -44 77 5 -35 -20 -9 -44 -10 93 -83 -84 -115 44 30 -63 -48
5607 -48 -2 -34 28 -66 57 3 7 21 -6 11 47 -48 -42 50 64 -14 -3 -25 55 -63 9 -52 62 -43 121 -19 8 9 -29
$$ packed form
5413b7O8j6r7J54q2jK4rl3mQ5j35J03M5j26M1LjM6N6j12k0J14n2j18J79m2j27
5441h4N9J12j47O8J45j47j03J05j05kP0J7l2O4O9j68J49Q7j86J03L7j53J9Q1j44
5466h6j0R3L6j27K92k85j2K06q4o2J33q3l0M0O3j81O7Q8p9n0J25J8on3l6n7J61
5493H1r8K2M6k0l4Q7K3j71L4J17r9o7J40p8J4o8k0N7k7R7n9J72k03ON5K3j88K24
5521F6n4j65Q6J00k2n2P0k1KQ3j13m3j3QnQ9J9qr4J03j34J43P5j44K3k6P1n3P0
5550F1q8K1p1N9L2J3n8j8J35r0m0L5Q5q7O7k5K4j56J35k6J2kj04P3J2j8NP5n1
5579A0K0k9J3L5q0O5j16N2L0l3L2j2l1J21p2m0J5J1l5L4J03j76jl1J59j4r3J5
5607d8M6l2O2r4J23n4MJ4k7J7L6r5OR2J4p8J1k2Q0j18P2o1J14j05J64j40K7Jl8
$$ plain form
5636 -29 -55 12 -97 -11 -5 30 -23 51 64 -102 5 -16 49 5 10 -41 -66 36 50 -25 -8 11 -92 26 -35 8 -27 -1
5664 -1 8 -2 21 -100 -6 -28 -110 41 -35 -38 52 27 52 35 -13 -34 26 -77 46 -21 12 2 71 29 39 -33 -37 51 -71 -142
5694 -142 53 -31 -37 2 -35 41 -33 -22 -26 -9 15 5 -44 -36 -36 -31 14 -31 -67 -38 -42 -40 70 65 -77 25 71 -39 74 -32
5724 -32 -60 18 -2 -54 47 77 -40 55 -10 -45 -36 24 14 -16 173 5 41 50 -50 24 12 -36 68 -9 145 -38 32
5751 32 -33 -52 49 45 22 -88 82 19 -21 31 -63 -53 4 122 38 -47 23 -31 -2 48 -24 16 -3 -9 39 -94 -86 -68 57
5780 57 65 -37 58 -69 -23 88 38 41 -47 -120 51 87 -1 -65 -51 41 -26 -93 -19 37 -9 54 -17 -109 39 5 -123 -67
5808 -67 1 -24 -15 -49 13 -14 70 -42 18 -46 56 -25 14 65 16 -42 9 21 -45 -43 -53 -130 -31 14 -125 -20 31 -82 -44
5837 -44 -55 -13 6 -30 35 -17 77 -45 -17 -84 -16 26 -84 -33 10 -37 13 8 14 27 -59 -44 26 -64 2 7 9 -1 -17 -24 52 39
$$ packed form
5636b9k6O7j09Q6OL5n3P4J3j66J07k1O5m4Nn1k5J02J4p5J7J9j03J18o1M3l5K6
5664aRj0K3j21R4k2q2J51p6lR0k5K5j7m8k1O0j03J23o7L3j0O9m2J0p2mQ8j22p1
5694a42J95q4oL9l7P6p4J1mJ7K4j0m9Q%NM5m5l6K9mKJ10nj42J02M6j10J13j06
5724c2k8P8k0n2J01L0j17R5o5l5RO0j0l0J89j68L6Rj00P4j2m8J04p7J54j83P0
5751C2o5j9J01mk3j10J70o3m0N2r4J0N7J18q4q5P0n4K9N0p2M0j9oM8j33QJ8J25
5780E7Qj02R5j27M6J11n0Lq8p3J71L6q8o4J4R2o7o7P4N6m6O3p1r2J48l4j28N6
5808f7O8k5Rl4O2k7Q4j12O0o4J02q1L9N1m9n8N1J2o6Kj0p7R9M5j39J05N1j13L8
5837d4j1M2J9l6O5n2R4j22K8o7O8M2j10N1M3m7N0nOJ3q6J5P0r0O6NKj0j6pP6j3
$$ plain form
5869 39 66 27 -50 3 43 -82 -20 61 55 -15 4 23 -41 13 -124 51 -15 42 4 3 18 -114 7 -19 21 -23 73 48 -2
5898 -2 13 -62 2 7 -35 -85 72 28 47 25 37 -47 -64 -74 -64 45 48 2 -37 39 34 18 2 27 -94 26 22 -67 60 -2
5928 -2 2 55 25 4 -17 111 -40 -52 62 45 -126 -88 -7 -70 -37 -20 31 -40 39 -44 36 23 49 134 -7 -36 44 61 -4
5957 -4 2 12 79 -87 45 125 19 35 64 -48 -26 21 62 21 16 -85 28 208 48 -37 37 74 -97 108 56 -67
5983 -67 44 42 -68 70 50 -135 34 62 42 -44 127 30 -10 9 -18 0 71 67 -46 2 69 -91 60 103 -43 -44 18
6010 18 -90 -63 111 -19 5 46 69 -57 118 -77 -79 -2 65 -31 -9 76 -61 -83 150 -38 -99 165 -67 -94 37
6035 37 -84 -38 74 -2 -44 -23 -46 -215 -19 100 -78 -40 92 14 -116 161 -77 -25 89 37 -102 52 -31 -55
6059 -55 43 78 -120 40 187 -201 -96 75 -88 -140 146 10 -124 85 -112 -88 -13 13 -151 67 3 -67 58
$$ packed form
5869C9K7l9p7N3M0j25O2Q1op0J9J9o4N4j37J75o6N7l8jJ5j32J21k6M0m4R6k5n0
5898bJ5p5O4Nm2n0J57m4J9k2J2q4j7j0J0J09Lm6l9P6nj6j6K5j21J20mq9J27o2
5928bMN3l0k1k1J28j51j2J14j7j71L8Q1o3L3J7N1p1P9q3Q0j3K6Q5j41k9Q0J7o5
5957dOJ0O7j66J32Q0j06J6K9j12K2M7M1m1nj01J13J80j60q5P4L7j71K05n2j23
5983f7J11kj10J38k0j85J69K8k0q6J71r7m0J9k7J8P1mj13M8O7j60J51M3j46jO2
6010A8j08K7J74j30K4M1K3j26J75j95kP7O7r6K2Q5j37k2K33j88o1K64k32k7J31
6035C7j21M6J12p6m2K1k3j69J96J19j78L8J32p8j30K77k38N2J14n2j39J54q3k4
6059e5R8L5j98J60J47l88J05J71j63n2K86j36j34K09j97K4P5K6j64K18o4p0J25
$$ plain form
6082 58 8 -15 -60 6 -72 -109 19 -119 -61 147 -15 -45 11 29 -115 261 68 -99 -43 67 -116 16 123 -136
6106 -136 -67 159 -53 -50 56 -3 -55 24 25 -36 74 88 -165 -44 -24 -188 -42 113 -130 -2 75 -49 -201 46
6130 46 -31 -100 20 81 -144 39 50 -220 13 100 -6 -17 204 -117 -32 128 -36 -141 74 -44 -103 105 1
6153 1 -206 37 60 -165 -67 63 -54 -106 114 -79 -34 62 -49 -47 44 -53 -62 70 12 -232 56 5 -59 37 90 -74
6179 -74 -3 119 -12 36 155 11 -80 72 -94 -118 53 -36 -153 63 68 -53 -47 52 -69 95 140 -85 -20 128
6203 128 -21 -117 52 109 -175 73 116 -123 2 63 -88 24 32 -177 -1 110 -30 -10 4 94 -104 34 24
6226 24 -29 57 86 -88 -1 -27 -78 18 40 25 -73 216 -142 4 112 -61 -167 143 40 -100 35 24 -10 30 91
6251 91 -184 73 23 -107 54 115 -37 11 61 -40 -61 -3 -80 -122 68 -77 -106 -28 47 43 28 134 -55 -35 153
$$ packed form
6082E8n0k3m5O6p8l7J28j38N8K08j62l0N6J8j44L76j93j67N6J10j83J32J07k59
6106a36O9K26k12LJ06n9n2P9Jo1J10J4k53J21K0j64J46J55k43J28P7j24j52K47
6130D6p7o9J20O1k25J83J1k70K33Q7j06j1K21l21Q5J60j64j05K15j18n9K08j04
6153Ak07K43K3k25R8J30j17n2K20j93M5R6j11KR1r7rJ32n8k44K88n1o4R6N3j64
6179g4P1J22j31M8J19j44r1J52j66k4J71q9j17K16Nj21OR9j21J64M5k25O5J48
6203A28j49r6J69N7k84K48M3k39J25O1j51J12Qk09J76J11j40K0J4R0j98J38j0
6226B4n3Q6K9j74Q7k6n1R6K2j5r8K89l58J46J08j73j06L10j03j40J35j1l4M0O1
6251I1k75K57n0j30J61O1j52M8N0j01k1N8p7m2J90j45k9P8P5mj5J06j89K0J88
$$ plain form
6276 153 -49 -83 80 -38 -101 6 0 -34 78 32 -84 -45 -14 -72 -8 66 -27 -91 130 -130 -71 -16 -2 -83 110 0
6302 0 -86 22 15 -119 -41 77 -35 -42 -43 -12 34 91 -84 26 87 -29 -95 69 39 24 36 -14 -66 27 29 -70 -56 35 4
6331 4 -46 144 -48 -65 17 -21 -5 18 -20 43 34 45 12 -40 -17 15 -118 65 -46 10 -67 -3 29 22 -33 -13 70 -32 -44
6360 -44 15 11 26 50 5 -15 -91 18 -43 80 8 18 -104 -73 -21 35 23 100 7 -96 64 -60 -22 -43 -41 81 -39
6387 -39 7 37 -42 7 -10 -20 11 -12 -51 -80 -43 -18 -16 4 0 59 30 -97 90 60 -120 64 53 6 -3 -62 -84 -42 -33 -11
6417 -11 -4 28 -30 66 -77 -70 -81 2 12 -70 -40 -37 -18 -47 32 -27 58 25 -39 -82 52 161 54 53 66 -21 -115 -34 47 19
6447 19 19 75 -37 -12 -70 -26 -97 63 -18 -101 18 -128 -85 -34 22 -93 49 11 -51 15 85 -12 23 37 27 -8 25 -55
6475 -55 -104 46 -21 -26 30 -120 -161 -8 49 -59 107 24 -97 49 -21 -19 20 26 13 -56 10 -2 0 52 133 -39 -67 0
$$ packed form
6276A53k02l4J63j18o3J07ol4J12m6j16L9L1n8O4P4r3o4K21k60N9N5J4q1J93j10
6302@q6J08pj34P8J18j12pjL1M6N7j75J10O1j16o6J64l0j5J2n0n2R3Kr9J4R1l1
6331Dn0J90j92j7Q2l8J6K3l8O3rJ1l3n2K3L2j33J83j11N6p7O4L2pn5K0Q3j02j2
6360d4N9mJ5K4m5k0p6J09o1J23p2J0j22L1N2N6j2P7r3j03J60j24L8k1KJ22j20
6387c9M6L0p9M9j7j0L1k3l9k9L7K5KK0mN9k9j27J87l0j80J84j1m7rn9k2M2RK2
6417a1PL2n8R6j43Pj1Q3J0q2L0LJ9k9P9n9Q5l3o4m3J34J09j07jJ3q7r4Q1Q1k8
6447A9%N6j12K5n8M4p1J60q1q3J19j46M3N1N6j15J42l8o2O6P0r7L5J4j0l5L3q0
6475e5m9J50o7nN6j50m1J53N7j08J66q3j21J46p0KL9Oj3o9O6j2KN2Q1j72k8O7
$$ plain form
6503 0 -48 -62 -20 -72 24 47 -7 6 -34 17 -7 -5 -63 -63 15 67 -73 119 39 -43 86 47 -107 -128 42 -109 -42 53 -3
6532 -3 -23 51 -50 -55 117 -9 -58 -4 49 -108 90 38 -45 15 85 -85 -105 -1 -123 -115 38 65 -167 120 21 -25
6558 -25 156 -36 -107 17 40 -59 -93 77 -26 -107 111 -38 -36 28 -61 -89 39 52 17 71 24 -104 19 16 50 -77
6584 -77 -79 -81 -20 -6 -53 -25 29 15 -52 40 33 -125 39 4 -75 149 93 -11 -108 131 -25 -15 117 -70 -58 147 14
6611 14 -62 49 10 -62 133 90 -10 0 53 -55 38 124 -6 74 70 -32 -132 66 19 -72 74 10 -87 30 47 -45
6637 -45 40 27 38 -3 92 -101 -63 22 113 8 81 -32 -37 38 -4 -5 103 104 -42 -4 -36 -93 -42 79 -11 -67 -39 -35 -86
6666 -86 63 8 -18 80 -28 -13 56 18 -12 -79 58 -26 -24 131 12 -75 39 -64 36 80 -102 24 157 -20 -107
6691 -107 -70 3 -86 114 111 26 12 -13 -7 -59 -46 -38 11 33 115 8 -29 94 30 15 1 -57 38 36 -21 -24 41 -45 -30 78
$$ packed form
6503@m8j4M2n2R6K3n4J3m0N1k4Kn8%P8N2j40J92q0q2J29l9j54k1J70j51O7R5n6
6532ck0P4j01nJ72j26m9N4N3j57J98n2q3O0P0j70k0J04j22QJ53K7k32K87r9m6
6558b5J81j92p1J24K3r9l4J70j03q1K18j49KO4q9k8J28J3l5N4m7j28J23lL4j27
6584g7kkO1J4m7K8N4j4o7R2pj58J64l5p9K24n6j04r7K39j56J0J32j87J2K05j33
6611A4p6J11l9p2J95m3j00J0N3j08R3Q6j30Q0mj02j00J98m7r1J46o4r7J17J7r2
6637d5Q5j3J1m1R5j93L8Q5R1j05P3j13nP5m2jJ08Jj46L8l2n7N1J21r0n6K8Mn1
6666h6J49n5k6R8j08J5O9l8l0o7J37q4KJ55j19q7J14j03J00M4j82J26J33j77q7
6691a07L7P3q9K00lq5j4k5On2J3QM9K2Q2j07l7J23o4j5j4n8R5kn7lO5q6J5J08
$$ plain form
6721 78 -8 -105 18 44 33 79 -60 -56 88 34 22 57 -15 -32 113 -11 -48 3 116 -122 7 -59 -10 -92 69 90
6747 90 -89 -47 32 -27 25 139 -51 -57 114 -79 -38 31 -4 -33 54 45 -181 12 5 -97 -19 56 -15 78 173 -16 48
6774 48 81 -63 -19 -12 14 -50 -25 -89 -83 -16 49 -54 7 52 -5 84 -47 -99 -42 9 85 58 92 21 48 99 -4 17 78
6803 78 -75 -16 -18 -3 -143 26 5 -38 15 -21 84 52 163 -25 14 -4 18 -17 33 -76 -39 63 134 29 -87 35
6829 35 -43 31 55 -44 -75 -56 -54 -75 -66 9 -77 20 -68 -158 -16 21 -5 -75 0 -44 -59 74 -20 -3 -67 89 -17 -92 -60
6858 -60 -44 36 46 -28 71 37 -126 34 -24 -45 -16 -33 -31 -6 42 47 -16 21 -84 -30 10 -41 81 -64 17 104 -4 -20
6886 -20 38 -26 41 2 -56 111 -110 62 101 46 -32 99 13 -16 -22 34 -26 -97 29 -35 -74 16 -55 44 7 -18 -30 -17
6914 -17 -19 8 5 -12 -21 -23 121 48 -32 23 11 -41 -37 111 59 -79 -17 -44 21 -54 -96 -9 55 21 -9 -62 45 -32 -13 -139
$$ packed form
6721G8q6r7J23K6j1M6j39MJ44n4j2L5p2j7J45j24l7N1J13k38J29o6M9q2J61K1
6747I0j79M2P9n9N2J14j90oJ71j93M1O9l5k9Q7rk26J93pj02P8P5p1R3R5j89O4
6774D8L3j44M4PK6o4K5o4OO7O5j03O1M5n7Q9j31n2N7N1P6k7L4p1K7N1j03K1O1
6803G8j53N9kJ5j40J69k1m3N3l6J05l2J11j88L9j8K2l5N0j09L7J02P1j05j16J22
6829C5p8P4K4r9l1J9Kk1RP5q6R7q8r0J42L7k6p0P5m4j5J33r4J7o4J56j06p5L2
6858f0J6Q0J0p4R9l4j63J60n8k1K9j7KK5M8No3L7j05N4M0n1J22j45Q1Q7j08j6
6886b0N8o4O7l9n8J67k21J72L9n5p8J31q6k9oN6o0p1J26o4l9R0p1R9l7k5j2J3
6914a7kK7lj7rkJ44p3q0N5j2n2MJ48n2j38O2k7O5p5m2Q7O4l4l0n3J07p7J9j26
$$ plain form
6944 -139 -62 -52 -18 -63 74 26 79 -18 -60 -10 -61 -55 -7 116 -45 17 -55 -37 -62 -76 -48 4 -19 -74 13 -15 60 -31 38
6973 38 -67 12 96 20 -28 25 14 -58 63 52 25 -9 -34 6 -39 -72 -3 -11 -58 -8 -14 92 -157 12 83 38 -6 -108
7001 -108 -23 61 -108 39 28 17 65 14 -93 147 10 -22 20 46 -34 41 -13 -22 5 -42 -14 -16 -57 -58 7 40 -9 2 58
7030 58 6 21 49 77 37 23 -8 5 98 65 52 -4 148 57 24 -3 -73 -11 1 7 -73 83 -121 37 93 -128 -23 -9
7058 -9 -18 -42 -46 83 -45 -50 104 6 72 26 -107 -52 108 -16 -14 67 -49 -65 80 90 -133 93 5 -9 7 64 -60
7085 -60 47 64 -6 -34 -45 -103 -7 -34 -22 -61 115 -3 -86 -5 3 -34 -4 -11 -46 -29 89 16 -94 65 -2 -60 53 55
7113 55 -30 29 -6 14 96 73 19 84 84 -38 -29 37 18 48 -53 28 7 25 -98 -4 55 -13 -12 11 -7 -41 -7 -2 -118 32
7143 32 61 -34 23 46 -2 28 -4 19 -49 73 -25 -81 61 62 34 101 92 -26 29 12 -37 -84 -55 -43 -48 -34 -36 -73 42 -28
$$ packed form
6944a39P7J0L4m5J37m8N3r7m2N0n1OM8J23j61O2p2J8k5j4K8N2k3n5Q7k8P5r1O9
6973C8j05P9Q4p6m8N3j1p2J21j1k7l4k5M0m5l3O9qm7N0oJ06k49J69P1m5m4j02
7001a08Q5Q4j69J47j1j1M8n1j07K40j37l2M2K6q0P5n4rK7m7K8km1jO5L3m9J1N6
7030E8n2J5K8K8m0j4l1J3R3l3j3n6J52r1l3k7p0O2J2Oq0J56k04J58N6k21J05J4
7058irk4mJ29j28nJ54r8O6m6j33N5J60j24KQ1j16j6J45J0k23K26q8j4J6N7j24
7085f0J07J7p0k8j1n8R6k7J2l9J76j18q3Q1Ql7L0pl5J7J18p3j10J59o7n8J13K
7113E5q5N9l5K0Q2k3n4O5%j22RO6j9L0j01Q1k1J8j23R4N9o8JK3j8l4L4Nj16J50
7143C2K9r5N7K3m8L0l2K3o8J22r8n6J42Jk8O7rj18N5j7m9m7K9J2nJ4kl7J15p0
$$ plain form
7173 -28 30 -12 -1 -31 35 -30 -37 -84 -55 -51 0 37 -118 9 42 -69 -8 58 12 -134 94 -61 -24 -21 16 -97 -60 -92
7201 -92 -102 42 -39 83 10 14 -99 -24 -4 -82 24 2 89 -64 -20 136 -31 -49 34 23 82 -30 20 19 -3 -88 -114
7228 -114 31 -107 8 -57 38 -74 16 3 -47 107 21 -4 -80 25 -56 -14 66 -48 -11 36 17 12 50 -56 -96 22
7254 22 1 15 122 28 -63 8 25 -90 60 -15 1 -34 84 -143 -15 79 89 -147 101 51 44 19 3 -41 48 10 25
7281 25 9 133 -30 34 -36 66 -45 -21 -55 19 22 -63 0 105 -27 -102 170 64 -147 -4 66 -42 -112 -86 -46
7306 -46 -55 73 -81 -81 -26 -18 -45 0 -47 -4 -20 -61 -120 70 -35 -62 -24 54 70 -64 50 11 -48 42 16 -31 32 -51 -137
7335 -137 19 -44 -8 -19 123 -25 1 -8 13 -17 -52 -37 -74 69 -59 -2 80 28 -31 -47 36 -52 115 91 -54 18 -32
7362 -32 22 -29 -8 -52 49 -54 -16 -10 23 11 0 101 41 5 39 121 -44 51 83 -80 -10 69 -20 -110 63 3 -11 86
$$ packed form
7173b8N8m2J1l0O6o5pm7K9MN1L7j55J27L3j11O1O6m6j46K28j55L7LL7j13L7l2
7201i2j0J44q1J22p3Mj13P5K0p8J06k2Q7j53M4J56j67j8Q3j1N9j12N0jk2q5k6
7228a14J45j38J15o5R5j12R0j3n0J54q6k5p6J05q1M2Q0j14L7M7j9nL8j06m0J18
7254B2k1J4J07r4r1P1J7j15J50p5J6l5J18k27J28R4J0k36K48n0pk5j6m4Q9l8J5
7281B5j6J24j63O4p0J02j11K4l4P4Lq5O3J05j32p5K72j06k11J43P0j08p0K6M0
7306d6rJ28j54%N5Qk7M5m7M3j6m1n9J90j05k7L8P8J6j34J14l9n9R0k6m7O3q3q6
7335a37J56o3L6j1J42j48K6rK1l0l5J5l7J43j28N7Q2n2n9j6Q3q8J67k4j45P2n0
7362c2N4n1K1m4J01j03L8OL3j2j1J01o0l6L4Q2j65R5L2j63P0P9q9r0J73o0j4R7
$$ plain form
7390 86 -21 -41 31 -8 17 116 23 37 -17 -28 -27 17 25 -19 2 -37 -57 -64 32 36 -22 -21 107 -105 30 26 -27 10 16 16 93 -9
7422 -9 -99 -49 91 -57 -103 -4 51 -102 40 -26 77 -84 16 -2 30 43 40 11 35 46 19 113 -77 -106 36 -72
7448 -72 -96 41 -11 -82 -39 -30 56 -61 19 -20 -29 22 21 34 28 55 -16 -27 -8 22 -58 -45 26 -95 -57 25 17 -1 41 45 -34 65
7480 65 -14 -27 43 -64 -87 51 34 43 -38 18 0 -59 -35 -17 -7 -26 -48 39 8 39 23 9 28 59 17 -46 -41 0 20 6
7510 6 62 13 13 16 94 49 -61 0 -1 -33 -9 -27 11 -7 -12 -23 -5 14 -20 -29 39 -79 -78 13 -43 -62 18 -70 -71 -5 -39 6 81
7543 81 27 -53 30 -4 -39 14 16 -44 -114 76 -72 -42 8 -84 77 43 78 34 124 24 -4 -19 41 24 19 -80 -72 9 22 -43
7573 -43 5 1 -24 -19 48 22 -57 -49 -57 -55 -18 28 -44 -43 47 -15 -3 59 -108 -22 -50 28 -73 0 -69 -67 -39 52 -34 31 -11 5 -20
7606 -20 0 -14 -22 88 -56 44 79 17 -45 -7 112 -65 25 79 -67 4 39 -150 -41 85 -78 -4 -15 40 -55 -38
$$ packed form
7390H6j07k0P2l9K5R9r3J4n4j1JM4Qm4K1l9k0pR6Mn8JJ28k12J35mn3L7O%P7j02
7422ir0N0J40j48m6R9N5j53J42o6J03j61J00j8L2J3lk9K4J1k7R4j90k9J42j08
7448g2k4J37n2p1M3RQ6j17Q0l9rN1jJ3oK7p1j1J9L0q0J3P1j21L8Q2qj8M2Mp9R9
7480F5p9j3P0j07k3J38j7Rq1N6j8n9K4J8J0j9k2Q7l1L1j6j4J9L1m2o3NM1K0j4
7510FN6m9%LP8m5j10O1jl2K4j8L8j8nj1J8J9l4rO8j18JR1n6j9Q0q8jO6l4M5P5
7543H1n4q0Q3l4l5N3Ko0p0J90j48L0N0r2J61l4L5m4R0j00k8j5O0j7nr9QQ1J3o5
7573d3M8mk5NO7k6p9QqKL7M6p2JR0o2J2O2j67Q6k8P8j01P3o9KK8R1q6O5m2J6k5
7606b0K0j4qJ10j44J00L5o2o2L8J19j77R0N4j46P1L5j89J09J26j63P4j1N5r5J7
$$ plain form
7632 -38 -4 -12 65 15 -10 37 -15 -48 -72 -5 10 -18 96 -3 71 123 55 0 52 -23 -59 -32 -19 14 16 33 -25 20 38 -21 -65
7663 -65 129 -15 -59 17 59 6 3 -5 -90 -95 -5 -58 25 96 -35 55 88 40 35 16 -100 34 12 -8 -127 15 -17 -14 -4
7692 -4 -53 13 25 -4 -72 -56 -21 -39 -83 210 -17 -1 109 22 -50 -10 -3 -150 133 21 -59 6 -12 -33 -79 23 52 51
7720 51 -62 -35 -10 62 32 8 -69 28 25 27 90 33 56 126 -91 -72 88 -14 -11 6 -64 -56 84 16 -2 -31 62 -12 30 41
7750 41 -118 47 106 -48 44 57 -79 -2 -24 -20 13 33 44 -31 72 14 2 -18 83 52 14 105 -62 48 71 -32
7776 -32 41 94 -45 -68 35 102 0 41 65 -80 152 39 -92 -130 15 -113 -89 25 46 -43 64 -17 22 57 -14
7801 -14 -113 96 89 -47 32 67 -25 57 -29 -69 -43 -60 -32 -10 -64 31 -40 -54 -59 -76 -10 -62 -36 -37 86 -71 50 1 11
7830 11 -11 123 45 -75 50 -83 8 -10 115 -141 -3 63 -37 61 39 -83 19 2 -37 101 -2 -81 -77 79
$$ packed form
7632c8L4qP7n0k5M7n2l3k4O7J5k8J14r9P4N2o8n5N2p5l6K7J3L3KJ7n8M5J8n9m4
7663f5J94j44m4P6M2n3lqq5nR0n3Q3P1j31R0L3m8nj9j16J34k2k0j19J42l2LJ0
7692dm9O6J2k9o8J6L5j8m4K93k27J6J10q7p2M0Pj47K83j12q0O5j8k1m6J02K9j
7720E1j13K7K5P2l0k4p7R7lKO3n7K3P0k17J9J60j02LJ7p0QJ40o8j8k9R3p4M2J1
7750D1j59J65N9j54R2J3j36P7k2ML3K0J1p5J03n8j2k0J01l1l8R1j67J10K3j03
7776c2P3N3j39k3J03O7j02M1K4j45K32j13j31l8J45j28K4J14K1q9J07q1L9L5p1
7801a4r9K09pj36P9L5r2Q2q6m0K6j7K8K2n4R5p1j4nj7O6n2K6jJ23j57J21m9J0
7830A1k2J34p8j20J25j33R1j8J25k56J38O6j00R8k2j22J02j7l9J38j03p9MJ56
$$ plain form
7854 79 -81 32 -27 -9 144 72 -95 53 9 33 -48 -62 154 -7 -35 8 -11 -22 134 69 -37 -12 125 39 -1
7879 -1 125 -76 -15 64 -113 11 12 -19 -14 25 -87 -60 84 -22 -6 -32 -54 -86 13 -9 -126 -15 -12 -36 18 63 18 31
7907 31 -4 -52 -155 -14 -130 -104 32 -56 126 24 -97 -29 15 57 -29 46 26 -1 47 77 -10 -1 65 33 92 26 -12
7934 -12 19 60 26 -96 2 128 -53 -107 -49 -37 -42 53 -2 -102 10 29 39 -8 -9 -19 32 33 -93 7 87 0 -35 54
7962 54 3 -58 14 49 -99 -62 17 -61 126 28 20 -38 3 67 -37 -7 -56 78 46 82 54 -91 -60 -82 -120 49 -74
7989 -74 111 -73 18 19 19 -7 -46 61 -66 20 90 -28 -50 -28 -72 -111 -35 18 -2 17 8 91 77 -20 -61 60 37 -6 -45
8018 -45 89 -25 73 60 -43 -29 38 -87 -23 73 8 -42 -12 -26 29 18 -15 -77 -24 -78 16 47 6 -42 -52 -54 -76 -113 -77
8047 -77 -29 -1 -11 46 39 -4 -36 65 -118 -63 26 -31 85 2 -52 -67 -37 -100 -39 16 14 78 20 22 -13 -22 -11 23 -76 9 10
$$ packed form
7854G9j60J13n9J8J53p2j67J48m4K4q1j4K16j61k8M3j9j1J56o5j06K5J37q6m0
7879aJ26k01O1P9j77J24Jl1NL9j12K7J44j06J6k6k2l2R9k2j17J11Lk4N4M5m5J3
7907C1l5m8j03J41j16K6J36q8J82j02j21O8M4M2q6P5k0k7M8L0q7RO6l2N9o6l8
7934a2L1M1l4j22R8J26j81n4N8J2nR5n5j00J12J9J0m7jj0N1Jj26J00Q0q7l5Q9
7962E4n1o1P2L5j48L7P9p8J87r8qn8M1O4j04L0m9J34l2L6k8j45L1k2l8J69j23
7989g4J85j84R1J%k6l9J07j27Q6P0j18k2K2m4l9P6N3k0J9rQ3j4r7m1J21k3m3l9
8018d5J34j14R8j3j03J4O7j25O4R6o5n0L0j4N5j1l3o2N3n4R4L1m1m8j0kk2l7L6
8047g7M8K8j0N7pm3l2J01j83N5Q9n7J16q3n4j5L0o3O1N5kO4n8Kl5rJ1L4r9Q5J
$$ plain form
8078 10 -23 43 -117 -94 37 47 7 -61 18 -45 -22 85 -30 -50 51 -4 -40 29 8 45 36 70 93 -114 56 -16 -28
8105 -28 29 24 -20 76 -74 -5 5 54 -48 -5 74 -37 -20 30 -14 -7 -3 -39 -140 68 17 -84 -23 19 -57 -21 -54 -16 39
8134 39 2 -24 -38 47 89 28 30 -112 -33 12 14 -34 33 47 42 -4 92 -40 -18 73 1 8 111 32 -98 94 -127 12 -18
8163 -18 53 12 97 -33 -72 -61 98 -3 -28 35 -9 79 14 -18 -69 52 -74 -21 78 -27 -102 -14 -69 -36 46 51 21 46
$$ packed form
8078A0l3O6j60K3J31J0m0o8P9o3K3J07j15k0J01n5l6O9k1L7rL4K3k07J70p2j2
8105b8N7nm4R6j50O9J0M9j02M3P9j11J7N0m4PMl6j01K08n1j01O1M2p6L6l3L8N5
8134C9l7k6j4Q5M2o1Kj42P9M5Km8O7J4nm6R6j32K2R1p2PJ03p9j30J92k21J39l0
8163a8P1m1Q5j30l9J1J59j01k5O3m4Q8o5l2n1J21j26N3R9j05p5Q8n5L3Q2Nl0K5
8191D6
$$ Imaginary data points
##PAGE= N=2
##DATA TABLE= (X++(I..I)), XYDATA
$$ plain form
0 0 0 0 0 0 0 0 0 0 0 0 0 0 0 0 0 0 0 0 0 0 0 0 0 0 0 -2 2 -2 3 -4 4 -6 8 -11 14 -15 19 -21 26 -26 33 -38 45 -48 55 -62 73
47 73 -79 89 -96 107 -117 128 -140 148 -159 168 -175 178 -174 158 -129 64 58 -291 752 -1764 4319
68 4319 -13087 91450 538461 -86355 -331577 212683 59166 -111477 123673 -130846 -213366
79 -213366 290699 109550 -281076 107412 165236 -215151 51918 131253 -274485 29820
89 29820 310451 -197201 -133064 304669 -73957 -245262 196124 36729 -218868 135932
99 135932 110923 -167295 93375 98139 -215338 38603 157577 -193492 -8335 226022 -133941
110 -133941 -85096 225624 -88279 -189227 172626 13875 -168582 156522 69244 -206882
120 -206882 108084 163241 -226575 -66083 182260 -54504 -44059 93314 -87334 8281
$$ packed form
0@%%%%%%%%%%%%%%%%%%%%%%%%%kMmNpQj0J4j9K5k9L4m0M7n2N9p1Q3r3J03j17J35
47G3j52J68j85K03k24K45k68K88l07L27l43L53l52L32k87J93ol49J043k516O083
68D319j7406J04537M47011o24816k45222N44260j53517j70643K35150k54519q2520
79b13366N04065j81149l90626L88488N7824l80387K67069P9335m05738L04305
89B9820K80631n07652O4137M37733l78626j71305M41386j59395k55597L54800
99A35932k5009k78218K60670M764l13477K53941J18974l51069J85157K34357l59963
110a33941M8845L10720l13903j00948L61853j58751j82457L25104q7278k76126
120b06882L14966N5157l89816J60492K48343k36764J0445J37373j80648R5615
$$ plain form
130 8281 172220 -146610 -159808 207043 31292 -186205 107207 96031 -145469 55252 96822
141 96822 -169940 -8564 153932 -92211 -51448 135604 -42136 -64642 94283 -51746
151 -51746 -80503 112245 -17796 -106443 131472 53420 -164073 44764 114580 -127844 -32475
162 -32475 113181 -57219 -23288 108241 -58307 -68904 98659 -20935 -89962 72742 16427
173 16427 -67675 78555 27393 -112662 43902 73047 -108785 -5888 99143 -60237 -20843
184 -20843 97105 -53196 -65752 87075 -11379 -82655 60316 32502 -55626 39981 21564
195 21564 -70145 31520 38459 -82970 13429 81290 -56363 -21473 76678 -38297 -49717
206 -49717 62797 -14967 -59068 60648 26557 -59342 25904 32045 -51749 6920 27417 -47464
$$ packed form
130H281J63939l18830j3198L66851j75751k17497K93412j1176k41500K00721M1570
141I6822k66762J61376J62496k46143M0763J87052j77740k2506J58925j46029
151e1746k8757J92748j30041q8647K37915p8052k17493K08837O9816k42424R5369
162c2475J45656j70400L3931J31529j66548j0597J67563j19594o9027J62704n6315
173A6427q4102J46230n1162j40055J56564K9145j81832J02897J05031j59380L9394
184b0843J17948j50301j2556J52827r8454p1276J42971k7814q8128R5607j8417
195B1564r1709J01665O939j21429R6399O7861j37653L4890R8151j14975j1420
206d9717J12514p7764m4101J19716l4091q5899Q5246O141q3794N8669K0497p4881
$$ plain form
218 -47464 15195 53259 -45122 -11516 56776 -34161 -37048 49146 -13260 -41671 53300 17431
230 17431 -53557 22166 30393 -45376 -924 26909 -29372 9980 37746 -33780 -9010 41438
242 41438 -25917 -29102 34435 -6115 -23150 37624 3683 -38471 25541 19037 -45969 1790
254 1790 33622 -21341 -3531 27928 -15790 -7580 21264 -20352 -16245 27580 -4101 -18287 25701
267 25701 5389 -25985 13542 9341 -30081 6438 23859 -19123 -1033 24950 -13315 -12242
279 -12242 15631 -9517 -12794 16520 1308 -9376 14183 1643 -15625 8357 3033 -19946
291 -19946 8266 17456 -14787 -414 18344 -10196 -10725 9472 -5390 -6945 11817 1580 -6713
304 -6713 8550 2853 -11267 335 2564 -7121 5055 7098 -7309 3893 9221 -10926 -6665
$$ packed form
218d7464O2659L8064r8381L3606O8292r0937k887Q6194o2406k8411R4971l5869
230A7431p0988P5723Q227p5769M4452K7833n6281L9352K7766p1526K4770N0448
242D1438o7355l185O3537m0550j7035O0774l3941m2154O4012o504o5006M7759
254A790L1832n4963J7810L1459m3718Q210K8844m1616M107M3825l1681j4186M3988
267B5701k0312l1374L9527m201l9422L6519J7421m2982J8090K5983l8265J073
279a2242K7873k5148l277K9314j5212j0684K3559j2540j7268K3982n324k2979
291a9946K8212R190l2243J4373J8758k8540n29K0197j4862j555J8762j0237q293
304f713J5263n697j4120J1602K229r685J2176K043j4407J1202N328k0147M261
$$ plain form
317 -6665 7969 -2041 -5222 6368 4218 -2292 1539 161 -5812 -1133 1893 -2104 1945 4464
331 4464 -526 905 527 -5049 -1650 1657 -1357 176 3503 2645 -707 -1865 87 -1864 -3443 1222
347 1222 2868 -69 1159 3195 -637 -4423 -467 929 -3339 893 4445 -462 1441 1906 -4739
362 -4739 -882 2257 -4689 -473 6654 -297 -2230 4365 -1078 -6132 2636 1083 -6680 4430 7365
377 7365 -5969 -280 5817 -5760 -2921 4242 -4430 -506 8816 -2328 -5381 7239 -51 -9403
391 -9403 3555 3596 -6996 5085 6814 -8689 1135 7899 -9326 -3760 8827 -4180 -3100 10056
405 10056 -2109 -7384 7907 137 -10663 5412 4807 -8684 5577 7730 -11071 791 9818
418 9818 -10257 -4526 11038 -3980 -4148 10559 -3251 -8495 9743 316 -13044 6649 7660
$$ packed form
317f665J4634j0010l181J1590k150o510L831j378n973M679L026l997M049K519
331D464m990J431l78n576L399L307l014J533L327q58l352j158J952j951j579M665
347A222J646k937J228K036l832l786L956J396m268M232L552m907J903M65o645
362d739L857L139o946M216P127o951j933O595n443n054Q768j553p763J1110K935
377G365j3334N689O097j1577K839P163q672L924R322j1144l053J2620p290r352
391i403J2958M1j0592J2081J729j5503R824O764j7225N566J2587j3007J080J3156
405A0056j2165n275J5291p770j0800J6075o05j3491J4261K153j8801J1862R027
418I818k0075N731J5564j5018j68J4707j3810n244J8238r427j3360J9693J011
$$ plain form
431 7660 -9747 3292 7800 -9824 1187 8449 -11670 -2459 13674 -5926 -7268 12254 -754
444 -754 -10601 7375 1830 -10611 6774 5634 -10482 5460 8397 -12999 -5 11662 -10196
457 -10196 -4714 12847 -3742 -6115 10261 -3536 -9376 10995 813 -14414 8177 10074 -11181
470 -11181 745 7481 -8860 2331 8192 -13684 -1555 18029 -5974 -12617 10999 3009 -9012
483 -9012 4688 -763 -8146 11524 4946 -16107 4395 12903 -11798 -3918 10398 -6714 -2517
496 -2517 11652 -5990 -7424 11478 -1610 -10792 8674 2247 -10813 8005 6587 -12615 3143
509 3143 9229 -11410 -526 11107 -9055 -3656 13496 -4841 -9070 10077 -222 -9289 7526
522 7526 1447 -8864 9009 3851 -13986 6294 10662 -14632 -2812 14458 -4969 -6212 7774
$$ packed form
431G660j7407J3039M508j7624J1011P262k0119R211J6133j9600j342J9522j3008
444g54r847J7976n545j2441J7385j140j6116J5942K937k1396J2994J1667k1858
457a0196N482J7561j6589k373J6376j3797n840K0371j0182j5227K2591J897k1255
470a1181J1926O736j6341J1191N861k1876J2129J9584k4003o643K3616p990j2021
483i012J3700n451p383J9670o578k1053K0502Q508k4701P880J4316j7112M197
496b517J4169j7642j434J8902j3088r182J9466o427j3060J8818j418j9202J5758
509C143O086k0639J0884J1633k0162N399J7152j8337m229J9147j0299r067J6815
522G526o079j0311J7873n158j7837K0280M368k5294J1820J7270j9427j243J3986
$$ plain form
535 7774 -3510 -2587 9900 -7397 -10490 14702 4388 -14865 4213 8218 -7923 2894 3902
548 3902 -12316 4184 13221 -11000 -6336 12628 -2432 -6858 7577 -3333 -7061 11079 642
561 642 -11650 8273 5641 -12752 3921 9332 -11241 -1714 10814 -4767 -2417 6714 -7897
574 -7897 -2325 13782 -6181 -13338 12411 6903 -11565 2462 4150 -7839 5944 5407 -13051
587 -13051 1905 12475 -8143 -4209 9396 -5554 -4921 10948 -3564 -9415 10402 2044 -10669
600 -10669 7175 4354 -12545 3954 9882 -9428 -1522 8152 -5773 -174 8448 -9208 -5404
613 -5404 13747 -1645 -11343 7935 3669 -8654 5392 3200 -10396 4572 7451 -9599 1190
626 1190 8686 -8988 -2273 11648 -5461 -8406 8731 939 -5545 6467 -2135 -8834 10356 4807
$$ packed form
535G774j1284R23J2487j7297l093K5192j0314j9253J9078M005j6141J0817J008
548C902j6218J6500R037k4221M664J8964j5060m426J4435j0910l728J8140j0437
561F42j2292J9923k632j8393J6673N411k0573R527J2528j5581K350R131j4611
574g897N572J6107j9963p157K5749n508j8468J4027J688j1989J3783n37j8458
587a3051J4956J0570k0618L934J3605j4950O33J5869j4512n851J9817q358j2713
600a0669J7844k821j6899J6499N928j9310P906R674j3925N599Q622j7656L804
613e404J9151j5392r698J9278m266j2323J4046k192j3596J4968K879j7050J0789
626A190P496j7674O715J3921j7109k945J7137p792o484J2012q602o699J9190n549
$$ plain form
640 4807 -14236 1628 10388 -5677 -974 4562 -7630 1165 10854 -8256 -8237 11279 1609 -8344
654 -8344 4950 1015 -6850 6565 2598 -10208 4158 7238 -8708 412 8454 -7292 -3573 9136
668 9136 -3058 -5812 6844 -925 -5362 7524 189 -9605 5625 5650 -8397 1079 5760 -5975
682 -5975 921 6349 -6899 -2478 8517 -3223 -5313 7141 -601 -6394 6158 1745 -7807 3600
696 3600 3957 -6422 2507 4661 -7057 672 7370 -5662 -3702 6627 -1736 -3593 5399 -1627
710 -1627 -5008 6325 1043 -7672 3507 4329 -5816 1268 4435 -5240 201 5140 -4677 -1988 5914
725 5914 -2514 -3586 5604 -532 -5046 4157 1330 -5233 2840 2456 -5037 2011 3938 -5074 -374
740 -374 4767 -3310 -1813 4463 -1865 -2520 4409 -802 -4086 3811 948 -4437 2652 2099 -4171 1562
$$ packed form
640D807j9043J5864Q760j6065M703N536j2192Q795R689j9110J9J9516r670r953
654h344J3294l935p865J3415l967j2806J4366L080j5946R120Q042j5746L719J2709
668I136j2194k754J2656p769m437J2886p335r794J5230K5j4047R476M681j1735
682e975O896N428j3248M421J0995j1740k090J2454p742n793J2552m413r552J1407
696C600L57j0379Q929K154j1718P729O698j3032J960J0329q363j857Q992p026
710a627l381J1333n282q715J1179Q22j0145P084L167r675N441M939r817K689P902
725E914q428j072R190o136m514R203k827o563Q073l84p493P048J927r012M700
740c74N141q077J497O276o328o55O929n211l284P897k863n385P089n53o270N733
$$ plain form
756 1562 3102 -3875 -117 3529 -2766 -1133 3766 -1831 -2024 3710 -683 -3288 2999 759 -3371
771 -3371 2234 1558 -3299 1431 2381 -3222 172 2960 -2257 -839 2872 -1384 -1678 2737 -660 -2387
787 -2387 2453 379 -2591 1839 1170 -2517 1031 1567 -2322 212 1995 -1850 -465 2152 -1064 -1233
803 -1233 2058 -524 -1620 1902 93 -1874 1476 675 -1978 871 975 -1792 428 1420 -1440 -90
819 -90 1612 -990 -772 1527 -460 -1121 1335 35 -1140 1134 349 -1423 669 690 -1355 353 914
836 914 -866 28 883 -768 -425 1013 -364 -779 1094 2 -820 709 137 -847 494 286 -764
853 -764 219 520 -519 53 524 -511 -200 574 -204 -409 529 -14 -488 341 82 -387 271 165 -338 97
873 97 290 -88 -73 139 -67 -152 39 7 -110 237 3 -87 -29 -45 -24 31 -32 115 -22 31 158 -129 -89 369
$$ packed form
756A562J540o977L758L646o295J633M899n597j93N734m393k605O287k240m130
771c371N605o76m857M730R50n603L394K788n217J418L711m256k94M415l397j727
787b387M840k074k970M430o69l687L548N36l889K534J783l845J385K617l216j69
803a233L291k582j096L522j809j967L350q01k653K849J04k767K220R92k860J350
819i0J702k602K18K299j987o61K456j300j175K274p85j772K092K1k045J708N61
836I14j780Q94Q55j651L43J438j377m15J873j092q22J529n72r84J341k08j050
853g64R83L01j039N72M71j035L11P74p78k05R38n43m74Q29k59m69O58j06n03M35
873I7J93l78J5K12k06q5J91l2j17L47k34r0N8j6K1N5o3J47j37N3J27k87M0M58
$$ plain form
897 369 -27 -242 246 191 -194 79 169 -212 27 203 -315 -148 396 -135 -205 390 -220 -405 589 -144 -462
918 -462 470 57 -490 388 271 -616 105 633 -630 -177 797 -317 -438 569 -297 -392 874 -158 -775
937 -775 730 381 -749 250 287 -680 326 554 -897 34 1143 -804 -555 1063 -302 -723 737 -160
955 -160 -589 858 67 -1085 634 507 -1034 184 758 -805 94 961 -950 -332 1154 -670 -721 1202
973 1202 -101 -949 846 165 -1062 698 328 -972 523 584 -1159 384 1117 -1118 -189 1304 -587
990 -587 -588 1099 -378 -640 1163 -317 -1185 1177 240 -1426 645 662 -1190 262 828 -1186 128 1293
1008 1293 -1242 -246 1527 -769 -831 1331 -335 -937 1074 -95 -1247 1305 431 -1663 820 1126
1024 1126 -1536 106 1331 -1171 -13 1154 -1201 -342 1711 -1065 -1007 1919 -73 -1666 1326 622
$$ packed form
897C69l96k15M88n5l85K73R0l81K39J76n18J67N44n31p0N95o10j85R94p33l18
918d62R32m13n47Q78j17q87P21N28j263M53R74j114j21J007q66r5J266j032o17
937g75J505l49j130R99L7r67J006K28j451R31J109j947K49J618j365m21J460q97
955a60m29J447p91j152J719j27j541J218N74j563Q99Q67j911O18J486j824n1J923
973A202j303q48J795o81j227J760l70j300J495O1j743J543P33k235R29J493j891
990e87jJ687j477k62J803j480q68K362r37j666K071J7j852J452N66k014J314J165
1008A293k535R96J773k296o2K162j666o02K011j169j152K552q74k094K483L06
1024A126k662J642J225k502J158J167k355Q59K053k776N8K926j992j593K992p04
$$ plain form
1040 622 -1504 915 654 -1764 913 1108 -2041 319 2024 -1514 -710 1753 -832 -811 1730 -869
1056 -869 -1429 2324 44 -2520 1427 1187 -2077 708 1253 -1928 658 1657 -2210 -101 2465 -1614
1072 -1614 -1227 2567 -751 -1827 2004 122 -2027 1830 419 -2311 1848 1430 -3067 584 2581
1087 2581 -2162 -628 2106 -1462 -583 2449 -1531 -1721 2888 -257 -2764 2132 746 -2727 1597
1102 1597 1507 -2717 873 2063 -2559 130 2869 -2420 -1341 3312 -820 -2270 2299 -47 -1923
1117 -1923 2278 -188 -3056 2622 1969 -3674 302 2702 -2308 -328 2433 -2257 -869 3304 -1437
1132 -1437 -2380 3017 -102 -2862 2437 817 -3198 1762 1798 -2893 867 2076 -2976 318 3355 -2647
1148 -2647 -1977 3494 -566 -2335 2291 -405 -2300 2905 544 -3781 1840 2320 -3051 367 2154
$$ packed form
1040F22k126K419k61k418K677J95l149K360J705l538Q04K463k585K1K541k599
1056h69n60L753k280k564L947k40l264K785N45l181K586R99l867K109K566m079
1072a614L87L794l318j076L831j882k149L857j411k730M159m18m497L651J997
1087B581m743J534K734l568Q79L032l980j90M609l145k507M896j386l473M324
1102A597r0m224L590J190m622K689K739n289J079M653m132j450M569k346j876
1117a923M201k466k868N678o53n643L976K400n010J980K761m690J388M173m741
1132a437r43N397l119k760N299j620m015M960L6m691L760J209n052L294L037o002
1148b647O70N471m060j769M626k696j895N205k361m325N621M80n371L418J787
$$ plain form
1163 2154 -2558 126 3023 -2417 -1427 3290 -1016 -2197 2985 -262 -3120 2603 1464 -3336 1159
1178 1159 1774 -2603 932 2039 -3067 -306 3534 -1778 -1950 2783 -665 -1769 2760 -567 -2901
1193 -2901 2791 1173 -3241 1217 1834 -2703 531 2301 -2433 -493 2815 -1538 -1263 2604 -1081
1208 -1081 -1864 2838 -135 -2962 2103 1257 -2583 1131 1295 -2698 851 2413 -2599 -824 2736 -1077
1224 -1077 -1380 2238 -961 -1750 2528 -67 -2587 1886 985 -2488 1234 1370 -2583 487 2247 -2031
1240 -2031 -655 2184 -1299 -1084 2290 -852 -1923 2321 410 -2226 1430 657 -2009 1159 1213 -2176
1256 -2176 336 1985 -1778 -529 1960 -1131 -1045 1993 -602 -1746 1955 236 -1843 1384 740 -1901
1272 -1901 925 1312 -1885 181 1595 -1476 -349 1835 -1106 -917 1863 -471 -1593 1623 303
$$ packed form
1163B154m712K684K897n440R90M717m306j181N182l247k858N723j139m800M495
1178A159O15m377L535J107n106K761L840n312j72M733l448j104M529l327k334
1193b901N692j618m414M458O17m537L234J770m734J940L308m353K75L867l685
1208a081p83M702k973k827N065q46l840L714J64l993L549J562n012J775L560l813
1224a077l03L618l199p89M278k595k520M473r01l473L722J36l953L070J760m278
1240b031J376K839l483K15L374l142j071M244j911k636L656p73k666L168N4l389
1256b176K512J649l763J249K489l091Q6L038k595j144L701j719k079L227o44k641
1272a901K826L87l197K066J414l071J127K184k941J89K780k334j122L216j320
$$ plain form
1287 303 -1671 1138 560 -1757 826 1126 -1623 130 1366 -1255 -367 1618 -879 -868 1568 -400
1303 -400 -1361 1443 278 -1498 923 614 -1592 581 983 -1331 122 1160 -948 -221 1272 -744
1319 -744 -778 1344 -324 -1176 1253 111 -1278 937 504 -1382 576 802 -1099 113 1018 -962 -380
1336 -380 1186 -694 -664 1147 -292 -902 1031 16 -1079 834 546 -1161 473 725 -1003 75
1352 75 816 -756 -304 1025 -507 -536 971 -213 -791 770 70 -821 605 235 -793 395 464 -812
1370 -812 152 663 -695 -273 731 -355 -532 744 -178 -628 703 24 -663 386 255 -618 235 384
1388 384 -601 48 423 -472 -81 588 -310 -252 494 -186 -449 508 19 -494 335 171 -438 204 264 -437 43
1409 43 262 -306 -23 407 -60 -74 346 -42 -346 206 -27 -243 249 76 -406 194 135 -123 -38 178 -102
$$ packed form
1287C03j974K809n78k317K583L00k749J753J236k621Q88J985k497J1K436j968
1303d00r61K804j165j776K421l09k206K173M02k314J453J038k108P27J493k016
1319g44l4K122j668q52K429j142j389K215m33j886J958K26j901J212R05j980N82
1336c80J566j880L0J811j439o10J933j015j095J913k88j707J634K52j728J078
1352G5P41j572M52J329j532k9J507j184n78J561p00q91J426l70j028J188O9j276
1370h12R64N11j358M22J004j086j77J276r22m50J331o79o87J049j31q73Q53J49
1388C84r85O49L75q95L91O69q98N8P46o80k63R57m89n13Q29j64o09O42O0p01M80
1409D3K19n68K83M30m67j4M20l88l04N52k33k16M92j73m82O00n9k58Q5K16k80
$$ plain form
1430 -102 15 126 -56 -7 171 -128 -94 226 -1 -115 78 105 -101 124 -113 -58 145 -57 -157 66 45 -1
1452 -1 -85 -15 -58 105 -50 -162 82 134 -160 -46 122 -151 56 -56 -285 183 204 -194 -146 264 -96 -167 86
1475 86 -23 -25 122 -180 -343 320 162 -362 42 230 -144 22 151 -227 91 141 -310 -9 426 -182 -314
1496 -314 285 83 -344 89 29 -329 335 9 -466 305 451 -482 -42 389 -221 -158 182 -207 -59 481 -267
1517 -267 -396 550 211 -584 172 413 -363 88 133 -424 329 408 -537 -104 623 -281 -479 396 119 -371 303
1538 303 -66 -424 503 130 -712 364 541 -557 -152 490 -295 -192 281 -465 -161 690 -200 -649 604
1557 604 170 -638 416 251 -395 368 127 -650 261 603 -790 -189 893 -254 -535 458 -73 -401 485
1576 485 -260 -610 735 112 -1041 429 645 -802 -48 513 -425 -1 519 -546 -144 957 -351 -707
$$ packed form
1430a02J17J11j82M9J78k99L4L20k27j14J93K7k06K25k37N5K03k02j00K23k1m6
1452aq4P0m3J63j55j12K44N2k94J14J68k73K07j12k29M68K1l98M8M10l60p1K53
1475H6j09kJ47l02j63O63j58n24M04J88l74J66J29l78L18N0m51L01M35o08j32
1496c14N99k02m27M33o0l58O64l26m75P71J46r33M40M31o10O3L40l89J48N40p48
1517b67j29R46l39p95P56K41p76M51M5n57P53P9r45M33P27r04j98Q75k77m90O74
1538C03l69l58R27l73q42J076J77j098M05O42p85J03M73p46L04Q51q90m49J253
1557F04m34q08J054j65o46P63k41p77R11L42j393O01J082j147k81R93n31l28Q86
1576D85p45l50J345o23j153J470K16j447P54N61r38M24N20j065M02J101j308l56
$$ plain form
1594 -707 761 125 -747 355 133 -592 660 236 -842 357 886 -840 -358 763 -312 -408 683
1611 683 -200 -457 844 -183 -769 867 202 -1147 436 661 -630 27 588 -514 50 758 -836
1628 -836 -387 1230 -280 -1001 750 198 -713 497 59 -929 818 521 -1020 213 912 -822 -218
1645 -218 989 -562 -488 866 -296 -648 929 -154 -854 982 317 -1223 398 717 -815 57 567
1662 567 -869 53 982 -920 -653 1191 -133 -1005 755 -18 -815 903 304 -1068 568 607 -985
1679 -985 165 840 -935 -164 1167 -542 -669 958 -317 -632 1139 -159 -1158 1007 665 -1207 183
1696 183 703 -858 217 870 -1076 -234 1317 -555 -834 1069 -166 -931 1083 29 -1207 753
1712 753 568 -1131 405 802 -1120 270 1221 -944 -479 1125 -301 -578 1007 -412 -956 1259 223
$$ packed form
1594g07J468o36q72J102k22p25J252m24j078J199N29j726M82J121j075r6J091
1611F83q83k57J301j027n86J636o65j349J583K25j291O57N61j102N64P08j594
1628h36M49J617j510p21J751n52r11J210m38r88J747k97j541J233O99j734O04
1645b18J207j551P4J354j162l52J577j083p00J836o65j540J621L19j532Q72N10
1662E67j436R22R29j902K67J844j324q72J760p73p97J718n99j372J636L9j592
1679i85J150O75j775P71J331j709j27J627j275l15J771j298r99K165l42j872J390
1696A83N20j561J075O53j946Q42J551j872k79J903j235p65K014j054j236J960
1712G53j85j699J536L97j922J390R51k165M65J604j426k77J585j419n44K215j036
$$ plain form
1729 223 -1368 612 795 -890 397 712 -1093 176 1384 -851 -567 1176 -220 -666 1038 -276
1745 -276 -1099 987 304 -1137 563 630 -978 480 911 -1165 -121 1226 -605 -590 946 -365 -712
1762 -712 1062 -109 -1139 867 527 -1106 450 594 -1084 334 913 -1002 -403 1125 -528 -666
1778 -666 986 -415 -887 1073 72 -1040 740 486 -907 305 616 -1048 75 996 -816 -450
1794 -450 1046 -345 -614 980 -236 -981 957 289 -1054 533 461 -1015 351 772 -1073 -31 903
1811 903 -713 -412 972 -304 -597 904 -87 -860 759 301 -934 413 538 -952 338 756 -867
1828 -867 -105 824 -421 -407 784 -296 -633 814 -27 -854 567 323 -803 354 511 -904 119
1845 119 711 -695 -102 717 -435 -358 717 -232 -685 641 78 -721 518 214 -802 352 463 -698
$$ packed form
1729B23j591J980J83j685J287L15j805J269J208k235K84J743j396m46J704j314
1745b76q23K086o83j441J700O7j608J458M31k076J044J347j831J5J536j311l47
1762g12J774j171j030K006l40j633J556J44j678J418N79j915N99J528j653j38
1778f66J652j401m72J960j001j112J780k54j393J212L11j664J123R21j812L66
1794d50J496j391k69J594j216p45J938o68j343J587p2j476J366M21j845J042R34
1811I03j616L01J384j276k93J501r91p73J619m58j235J347J25j490J290M18j623
1828h67P62R29j245J4J191j080l37J447q41q27J421k44j126J157J57j415J023
1845A19N92j406N93Q19j152P7J075r49m53J326n63p99J239l04j016J154J11j161
$$ plain form
1863 -698 103 619 -607 -247 632 -407 -405 672 -134 -584 498 156 -672 425 207 -748 218 414 -608
1882 -608 18 627 -491 -185 545 -237 -352 634 -103 -493 441 222 -641 277 335 -580 109 434 -431 18
1902 18 525 -331 -228 455 -222 -251 443 7 -407 306 223 -513 196 241 -407 146 379 -421 -102 355 -206
1923 -206 -376 399 -59 -290 218 75 -387 155 97 -382 112 258 -258 -84 266 -119 -60 230 -157 -211 310
1944 310 106 -215 126 109 -204 74 213 -215 65 244 -189 -47 219 -101 -94 171 53 -216 57 81 -126
1965 -126 -23 49 -93 -100 49 -121 -81 90 196 -199 10 113 -67 -116 44 -103 18 84 -57 -134 88 147 -130
1988 -130 -5 81 -100 -21 92 -35 3 129 -173 -130 325 51 -464 87 173 -176 38 98 -204 137 238 -326
2010 -326 -83 426 -80 -253 262 -1 -267 179 77 -337 154 93 -369 149 479 -394 -154 310 -214 -182 265
$$ packed form
1863f98Q01N16j226L60Q79j039KJ077q06m50J082l42q28J097k18r55R66J96j022
1882f08O26O09j118L06P30p82j15R86p37l90R34k19q63R18N8r15O89L25q65M49
1902A8N07q56J03O83o77k9O94m36m14P13q3p36P09M5o48N53K33q00L19M57n61
1923b06j70P75m58k31N08j43m62N42n8m79M94J46n16J74L50l85N9K90l87n4N21
1944C10k04l21L41j7l13K78J39m28K80J79m33J42K66l20PK65j18k69K73K4k07
1965a26J03P2j42pJ49j70M0J71J06l95K09J03j80m9J60j47J21O6j41p7K22N9k77
1988a30J25Q6j81P9J13j27L8J26l02M3M55k74n15N51Q6l49K14O0l02L41J01n64
2010c26K43N09n06j73N15k63k66M46j02m14M91o1m62N18L30q73K40M64n24L2M47
$$ plain form
2031 265 -87 -160 296 -113 -417 416 189 -564 113 345 -370 -34 293 -197 80 345 -317 -328 566 -130 -571
2052 -571 268 153 -350 216 166 -409 243 361 -567 -5 647 -337 -341 465 -79 -339 515 -36 -325 468 112
2073 112 -583 415 323 -675 61 488 -441 -62 449 -387 -186 659 -315 -441 707 124 -660 328 294 -551
2093 -551 241 229 -513 299 558 -610 -156 655 -284 -287 458 -110 -448 435 -5 -485 543 221 -804 347
2113 347 381 -614 -118 464 -413 -78 534 -317 -226 605 -112 -710 496 205 -532 315 299 -563 190 251 -634
2134 -634 130 584 -589 -174 677 -238 -424 464 -110 -363 534 8 -513 353 289 -614 97 528 -527 -13
2154 -13 492 -432 -81 584 -290 -377 598 -78 -542 568 223 -583 237 259 -506 187 262 -581 89 626 -288
2175 -288 -350 617 -129 -311 496 -4 -451 419 69 -574 333 380 -523 59 443 -372 -54 402 -321 -147 468
$$ packed form
2031B65l52p3M56m09l04Q33k27p53O77K32p15L36L27m90K77K65o62j1Q94o96m41
2052e71Q39j15n03N66n0n75O52J18r28N62O52r84mQ06n44k60Q54n51k89P93l56
2073A12o95R98r2r98P36M27r29L79N11q36K01Q45r74j26J148n83p84R88l4q45
2093e51P92j2p42Q12K59j168M54Q11r39lP45n68l38Q83m40m80J028l22j025J151
2113C47L4r95M96N82q77L35O12q51R1Q31p17n98J206k91p37Q47j6q62P53O1q85
2134f34P64M54j173M15Q51r15j86Q88n74k53Q97n26n21Q66o4r03P11M31j055N14
2154a3N05r24L51O65q74q7R75o76m64J110l45q06Q20K2p65O93P5q43O70N37r14
2175b88o2R67p46j82Q07n00m47Q70l50o43R07M7r03N82L84q15L18M56p23J74O15
$$ plain form
2196 468 -268 -343 550 19 -486 399 138 -554 351 258 -511 275 436 -507 -64 592 -267 -259 330 -165 -159 470
2218 470 -109 -471 331 95 -487 335 149 -450 99 370 -334 -112 370 -291 -97 349 -291 -366 408 -10
2238 -10 -365 265 15 -301 291 114 -489 202 346 -248 -54 326 -158 -141 440 -256 -303 405 -1 -403 356
2259 356 17 -263 311 208 -421 56 406 -200 70 299 -353 -58 369 -123 -204 369 -14 -295 333 41
2279 41 -266 218 277 -519 70 272 -380 85 249 -289 -34 411 -149 -238 317 -45 -255 420 -22 -415 339
2300 339 139 -303 64 184 -345 94 210 -351 -87 392 -168 -234 256 -67 -235 305 86 -353 256 132
2320 132 -337 146 179 -259 129 295 -263 -92 210 -200 -137 367 7 -333 337 44 -307 181 65 -269 123
2341 123 99 -251 62 204 -282 -159 212 -167 -136 233 -48 -234 316 -36 -265 210 -5 -192 159 108 -420
$$ packed form
2196D68p36p5Q93n31n05Q85k61o92R05r3p69P86J61r43M43O56q59QN89m95OO29
2218D70n79l62Q02k36n82Q22j86n99N49K71p04K22M82o61J94M46o40p5P74m18
2238a0l55O30k50l16N92j77o03O91J44n94J94L80m84J7N81o96m7P08m06m02P59
2259C56l39k80N74j03o29M77L50o06K70K29o52K95M27m92q1N73l83k81O28k92
2279D1l07M84N9p96N89K02o52M65J64n38K55M45n60q9N55l62k10O75m42l93P54
2300C39k00m42L67J20n29M39J16n61K64M79n60o6M90l23j68N40k19m39O09j24
2320A32m69M83L3m38L88J66n58J71L02m10O3N04l60l40O70k93l51M88j16l34L92
2341A23k4l50L13J42m86J23L71l79L1L69k81j86N50l52k29M75k15j87L51n1n28
$$ plain form
2362 -420 84 198 -200 -56 203 -107 -80 241 -33 -222 175 17 -293 67 212 -219 89 188 -268 94 226
2383 226 -108 23 234 -66 -110 200 -43 -158 172 -27 -227 243 23 -186 64 109 -244 -21 181 -136 -111
2404 -111 131 -94 0 282 -59 -168 222 5 -152 230 23 -166 83 164 -138 36 109 -170 -53 237 -74
2425 -74 -50 151 -67 -164 109 -38 -27 132 -10 -137 95 19 -126 46 109 -56 -46 230 -49 -73 117 -77 -47
2448 -47 208 -30 -82 192 -51 -64 101 105 -39 84 0 -154 124 95 -132 24 60 -162 -94 120 -135 -169 67
2471 67 -129 16 123 9 -110 83 113 -160 -4 124 -68 -72 -21 -142 7 191 -68 -72 105 -80 -127 102 53
2494 53 -53 181 13 11 95 65 -115 63 166 -49 25 -10 -22 -50 3 -23 4 119 -29 -144 67 26 -46 4 58
2519 58 -107 30 -59 -8 32 56 -35 -25 41 -64 -60 31 -102 -82 125 -57 -70 70 -84 2 105 24 32 -79 -25 -73
$$ packed form
2362d20N04J14l98J44K59l10K7L21k74j89L97j58l10L60J45m31L08R9m56L62J32
2383B26l34J31K11l00m4L10k43j15L30j99k00M70k20k09K50M5l53K23K02l17K5
2404a11K42k25R4K82l41j09L90k17j57L82k07j89K49Q1l02J74P3k79J17K90l11
2425g4K4K01k18r7K73j47J1J59j42j27K32p6j45J72O3j65J0K76k79k4J90j94L0
2448d7K55k38n2K74k43j3J65Mj44J23q4j54K78k9k27J56L6k22O8K14k55l4K36
2471F7j96J45J07j14j19J93L0k73J56J28j92mN1j21J49J84k59mJ77j85m7K29m9
2494E3j06K34j68kQ4l0j80J78J03k15P4l5j2k8N3k6K7J15j48j15K11m1p2N0N4
2519E8j65J37q9N1M0K4r1J0O6j05MR1j33K0K07j82j3J40j54Q6J03q1Qj11N4m8
$$ plain form
2545 -73 60 39 46 72 96 -44 93 -52 16 18 -11 85 -11 36 -110 14 12 5 19 -22 89 -72 4 -18 -74 -6 74 -33
2573 -33 24 29 23 8 0 46 29 49 74 -82 60 11 -114 -66 58 -51 -26 30 -105 80 -28 -84 -43 116 -26 -170
2599 -170 73 -20 -46 88 -16 -29 103 -40 -88 77 54 -30 -22 55 -128 -27 -63 -37 123 46 -35 -73 114 -24 -93
2624 -93 39 -2 24 64 -73 -86 77 70 -61 -5 80 -10 -2 62 -40 -32 82 -22 -32 40 38 -12 110 18 -4 -33 -24 -40 -37
2653 -37 7 -58 -82 108 -137 -131 15 -132 -72 56 51 40 184 -46 -183 49 -49 -130 -5 -10 -16 -64 18 1 4 71 -10 -87
2681 -87 74 -7 -116 19 -37 -164 -71 5 -62 27 85 -121 -70 15 -39 -18 152 91 -124 44 40 33 70 50 -78 106
2707 106 40 1 -42 58 -57 -135 4 25 -127 39 -68 -35 16 -69 -120 7 49 -44 22 -9 -69 -33 80 -53 -12
2732 -12 -11 22 -99 10 -87 -63 53 1 -72 168 73 -88 90 94 30 -17 32 -50 -45 72 2 -9 62 -29 11 69 -42 -70
$$ packed form
2545g3J33k1PK6K4j40J37j45O8Kk9R6r6M7j46J24kpJ4m1J11j61P6k2n6O8Q0j07
2573c3N7Noj5qM6j7K0K5j56J42m9j25M8J24j09K5N6j35J85j08n6M1J59j42j44
2599a70K43r3k6J34j04j3J32j43m8J65k3q4QP7j83J01l6K6J60p7q1l8J87j38o9
2624i3J32m1K6M0j37j3J63pj31N6Q5r0QO4j02QJ14j04j0P2kn0J22r2k2k9Rj6L
2653c7M4o5k4J90k45OJ46j47O0J28nj1J44k30j37K32r8q1J25nom8Q2j7LO7q1p7
2681h7J61q1j09J35n6j27R3P6o7Q9N8k06N1Q5n4K1J70o1k15J68mpL7k0j28J84
2707A06o6l9m3J00j15p8J39K1j52J66j07L3N1q5n1J27M2r3O6l1o0L6J13j33M1
2732a2JL3j21J09r7K4J16n2p3K40r5j61J78Mo4m7M9q2NJ17p0j1P1r1M0N8j11k8
$$ plain form
2760 -70 33 91 -22 -38 -47 -55 12 17 7 2 72 -32 -62 48 31 6 120 32 24 48 35 21 -113 35 46 -15 51 -81 -77
2789 -77 65 12 -116 -16 21 17 -25 -32 -84 113 71 -54 -15 43 39 -24 4 -41 61 69 -48 88 8 -2 50 -5 -18 -114
2817 -114 75 57 3 -104 -14 54 18 26 -57 -4 1 77 -54 37 14 -118 -48 33 -56 -3 8 10 -38 7 73 3 -35 33 111
2846 111 -152 84 -4 29 -3 4 31 19 32 -96 -26 -11 -73 -58 5 25 -45 56 52 10 139 15 -29 1 -18 -19 -64 89
2874 89 -13 -19 81 -10 -107 1 -59 -9 58 -19 -7 6 102 -22 97 71 -66 -63 87 -54 -103 88 -33 30 100 -21
2900 -21 -52 100 -4 -57 19 130 -94 77 147 -62 4 41 -26 73 100 63 -155 88 -35 -61 87 120 -27 4 105
2925 105 -4 -137 110 10 -76 2 -75 38 -14 34 -61 -47 151 -92 -42 42 -162 -91 67 -63 -4 -18 -84 -66 101
2950 101 2 -70 16 120 -35 25 44 -79 34 22 30 -9 86 -73 -53 37 -30 -58 104 31 -39 60 -30 -8 -11 20 48 60
$$ packed form
2760g0J03N8j13j6rqO7Nj0nP0j04l0J10j7k5J14q8qK4j3j4j34J48J1o1O6j32M
2789g7J42n3j28J00L7mm2pn2J97m2j25L9N8mo3K8m5J02Qj17J36q0j0N2n5j3r6
2817a14J89j8n4j07R0O8l6Qq3N3NP6j31R1k3j32P0Q1q9N3J1Km8M5O6p0l8O8P8
2846A11k63K36q8L3l2PK7j2J3j28P0J5o2J5O3K0p0J01mm2J29j24m4L0j9jm5J53
2874H9j02oJ00r1r7J08o0N0O7p7J2J3R6j24J19k6j37LJ50j41m9J91j21O3P0j21
2900b1l1J52j04n3P6J11k24J71P0k09O6L7o7R9K7l7k18K43j23k6J48L3j47L1J01
2925A05j09j33K47j00q6P8p7J13n2M8r5J4J98k43N0Q4k04P1J58j30N9j4o6J8J67
2950A01r9p2Q6J04j55O0J9j23J13j2Ql9R5j59K0R0o7k8J62p3p0R9r0K2lL1K8J2
$$ plain form
2978 60 -16 -100 -35 120 -104 50 147 -23 -18 108 81 -117 -55 -13 34 12 7 7 63 25 -60 -65 44 85 -31 112 -27
3005 -27 -42 0 -28 -4 59 -18 -13 -40 70 5 -57 43 -81 -25 2 -55 -17 -89 113 -10 122 91 -10 64 29 -79 -125
3032 -125 60 23 0 30 11 -80 92 114 -59 36 126 -5 -16 41 -20 -24 0 10 -70 105 24 -2 35 35 66 -117 -61 -62
3060 -62 -28 46 15 -44 -22 121 131 51 -2 21 18 -11 -13 55 77 33 -38 105 28 30 32 2 -47 -36 7 -37 -116 46 46 30 117
3091 117 -60 0 9 -21 61 -17 -43 10 7 48 -28 35 8 -31 -69 -8 -12 -21 5 -7 -81 66 85 -84 -42 102 -24 -25 -11 -62
3121 -62 -33 38 -81 53 63 22 19 84 20 -2 14 21 60 29 22 17 61 197 -98 -132 -23 73 -44 67 84 7 28 47 42
3150 42 -140 144 -46 -63 60 -18 -132 39 23 -25 63 77 -61 -13 62 -118 -66 36 -86 -60 144 -63 -108 97
3174 97 -6 -168 60 200 -57 54 68 -174 49 76 -106 45 -27 -136 -154 168 12 -65 132 25 -178 -85
$$ packed form
2978F0p6q4O5J55k24J54R7j70NJ26k7j98O2M2M7k2n%N6l8q5nJ09M1j16J43j39
3005b7j5M2k8K4O3p7Nk7J10o5o2J00j24N6K7n7L8p2K02j23J32l1j01P4l5j08m6
3032a25J85l7k3L0j9r1J72K2j73R5R0j31j1N7o1mK4J0q0J75q1k6L7%L1j83N6j
3060f2L4P4l1n9K2J43J0q0n3K3lk9kO8K2m4p1J43p7KKl0m9J1M3m4p9J62%j6Q7
3091A17j77O0Rl0Q2p8k6N3lM1p6O3k7l9l8O1mrK6j2p4J47J9j69M2J44j26jJ4n1
3121f2K9P1j19J34J0m1lO5o4k2J6PL9l1pnM4J36k95l4J09R6j17J11J7p7K1J9n
3150D2j82K84j90j7J23p8j14J71j6m8Q8J4j38M8P5j80N2J02j22K6K04k07m5K05
3174I7j03j62K28J40k57J11J4k42K23K7j82J51p2j09j8L22j56p7J97j07k03R3
$$ plain form
3196 -85 46 -119 95 162 -114 -41 131 -56 -110 80 -24 -135 161 -67 -122 194 30 -185 46 141 -127 83
3218 83 172 -162 -50 70 31 -75 221 -102 -169 66 155 -153 39 74 -150 -7 136 -99 -51 81 -53 -175
3240 -175 175 -45 -151 218 95 -232 87 20 -213 73 132 -168 -22 165 -107 -56 147 -112 -67 203 -27
3261 -27 -154 176 52 -219 138 221 -183 -85 134 -186 -8 204 -176 -147 140 -49 -132 134 -15 -256 303 95
3283 95 -138 201 87 -136 159 99 -196 -117 243 -184 -163 178 -214 -208 285 92 -261 202 180 -202 203 151 -344
3306 -344 25 275 -169 -161 271 -121 -39 321 -157 -303 264 -8 -195 110 26 -364 117 253 -316 -37 241
3327 241 -268 -133 251 -215 -166 318 -48 -220 210 -14 -93 110 128 -295 154 288 -281 -7 305 -269 -45
3348 -45 314 -140 -319 366 -16 -230 232 116 -300 181 149 -256 38 268 -247 -99 279 -228 -220 428 -97
$$ packed form
3196h5J31j65K14O7k76P3J72j87n4J90j04j11K96k28n5L16j64k15K31R5k68K10
3218H3Q9l34J12J20l9j06K96l23o7K35Q9l08J92L5k24J43J43k35M8J32j34j22
3240a75L50k20j06L69j23l27L19o7k33K86N9l00J46J87k72N1K03k59M5K70k30
3261b7j27L30j24k71L57Q3m04R8K19l20J78K12l80K9K87j89q3K66j49k41N59k08
3283I5k33L39j14k23K95o0k95P9L60m27K1L41l92OM93j93l53M63k2l82M05n2m95
3306c44L69K50m44QM32l92Q2L60m78j46N67k72j87L05q4l90M81J36n69K79K78
3327B41n09J35L84m66M9M84l66j72M30k24p9K03J8m23M49J34n69K74L12n74K24
3348d5L59m54j79O85l82k14M62j16m16M81l2m05K94K30n15J48L78n07QO48n25
$$ plain form
3369 -97 -240 267 18 -235 137 94 -345 273 216 -344 37 381 -290 -76 269 -167 -165 387 -109 -339 284 18
3391 18 -305 120 156 -302 40 271 -304 36 219 -190 -106 411 -135 -271 390 -83 -369 232 111 -296 188
3412 188 162 -371 193 237 -298 32 278 -193 -139 373 -173 -263 288 20 -392 207 136 -280 210 146 -291 80
3434 80 387 -237 -25 334 -247 -171 284 -171 -280 355 -19 -363 229 71 -344 254 185 -346 79 284 -367
3455 -367 -110 314 -242 -167 273 -108 -297 379 72 -294 197 59 -331 144 187 -334 78 214 -174 -35 308
3476 308 -235 -151 344 -36 -230 254 116 -246 259 -17 -204 51 178 -278 92 277 -259 -78 190 -186
3496 -186 -199 349 -39 -184 201 -110 -166 231 120 -331 80 182 -291 24 217 -178 25 274 -181 -59 221
3517 221 -95 -161 272 -83 -316 122 151 -215 82 129 -237 186 221 -283 -105 200 -115 -126 182 -100 -106 307
$$ packed form
3369i7j43N07k49k53L72m3m39O18n7n60L81L44o71K14L45m36KN52m96k30O23k66
3391A8l23M25L6m58L42K31n75L40J83m09Q4N17n46j36O61m73k86O01j21m07M84
3412A88k6n33N64M4n35L30K46m71N4N12n46r0N51k68m12N99p1m16M90o4m37L71
3434H0L07o24K12L59n81P6M55m55j09O35l74l44N92j58m15N98o9n31M25K05o51
3455c67K57M24n56P5M40l81j89O76l07l66M91j38l90M75M3n21M12J36l88J39L43
3476C08n43Q4M95l80j94M84j38l62N05k76j87K55J27m56L70J85n36J81K68l76
3496a86j3N48l88j45L85l11n6L97j11m51M11J02m73L15J93l95K03K49m55J22K80
3517B21l16o6M33l55k33M38K9l66K97M7l66M23L5n04J78L05l15j1L08k82oM13
$$ plain form
3539 307 -114 -241 296 10 -169 180 -2 -100 63 129 -191 8 107 -202 -114 248 -61 -205 187 -26 -95 59
3561 59 -40 -188 201 27 -139 101 159 -196 -10 128 -5 -33 130 -127 36 114 -55 -123 94 -8 -115 122
3583 122 12 -126 72 40 -216 -4 78 -248 -53 128 -118 -63 127 -39 -14 170 -67 -78 61 -131 -140 50
3605 50 25 -94 -6 82 -96 -12 68 -216 8 106 -160 35 88 -19 -85 -1 67 -10 143 -53 -102 61 77 -108 -63
3630 -63 26 -50 77 5 -123 53 90 -124 -70 39 -96 -43 51 35 -6 69 18 15 62 -4 -156 65 93 -103 -49 45
3656 45 -155 46 27 -80 21 86 -150 -24 110 -13 -128 57 -55 -96 164 32 -69 159 158 -117 118 69
3678 69 -202 33 -17 -142 53 184 -275 -21 201 -66 -69 105 -8 -11 112 -67 -146 207 60 -204 163 147 -209
3701 -209 16 41 -69 -30 202 -190 -90 204 -152 -76 214 -24 -96 155 82 -126 175 -9 -240 101 102 -145
$$ packed form
3539C07m21j27N37k86j79L49j82r8J63O6l20J99R9l09Q8L62l09j44L92k13o9J54
3561E9r9j48L89j74j66K40N8l55J86J38j33k8J63k57J63P8j69o8K17j02j07K37
3583A22j10j38J98l2k56K12Q2l26J95J81k46N5J90j66K5J84k37j1J39j92rJ90
3605E0k5j19Q8Q8j78Q4Q0k84K24R8k66J95N3j07o6Q4O8p7J53j96m9J63J6j85M5
3630f3Q9p6J27p2j28J76L7k14N4J09j35N3R4j6m1P5n1lM7o6j52K21K8j96N4R4
3656D5k00K01j9j07J01O5k36J26J34j23j15J85j12m1K60j32j01K28jk75K35m9
3678F9k71K35n0j25J95J31m59K54K22k67lJ74j13lJ23j79p9L53j47k64L67j6l56
3701b09K25K5j10L9K32l92J00K94l56P6K90k38p2K51p3k08L01j84k31L41Jk47
$$ [...]
8191b3
##END NTUPLES=NMR FID
##END=
