##TITLE=1H_Pr 37-Acid2
 CDcl3
 8 sc, 
 22.2.2023
##JCAMPDX= 6.0         $$ Bruker NMR JCAMP-DX V2.0
##DATA TYPE= NMR FID
##DATA CLASS= NTUPLES
##ORIGIN= UXNMR, Bruker Analytische Messtechnik GmbH
##OWNER= root
$$ XWIN-NMR		Version 3.5
$$ Wed Feb 22 16:37:36 2023 Russian Standard Time (UT+4h)  she@DPX200
##.OBSERVE FREQUENCY= 200.13135
##.OBSERVE NUCLEUS= ^1H
##.DELAY= (6, 6)
##.ACQUISITION MODE= SIMULTANEOUS
##.ACQUISITION SCHEME= undefined
##.AVERAGES= 8
##.DIGITISER RES= 18
##SPECTROMETER/DATA SYSTEM= spect
##.PULSE SEQUENCE= zg30
##.SOLVENT NAME= DMSO
##.SHIFT REFERENCE= (INTERNAL, DMSO, 0, 15.7039)
##AUDIT TRAIL= $$ (NUMBER, WHEN, WHO, WHERE, WHAT)
$$ ##TITLE= Audit trail, XWIN-NMR		Version 3.5
$$ ##JCAMPDX= 5.01
$$ ##ORIGIN= Bruker BioSpin GmbH
$$ ##OWNER= she
$$ F:/spectra/data/she/nmr/H-F/1/audita.txt
$$ ##AUDIT TRAIL=  $$ (NUMBER, WHEN, WHO, WHERE, WHAT)
(   1,<2023-02-22 16:36:16.79 +0400>,<she>,<DPX200>,
      <created by zg, POWCHK disabled, PULCHK disabled
       configuration hash MD5:
       00 E9 B6 7A A2 85 ED C7 34 08 36 98 17 FE 4E 26
       data hash MD5: 16K
       BC 2A BE 3E 86 F4 2E 9D 6A 0E 14 EF 70 7B 02 ED>)
$$ ##END=
$$ 
$$ hash MD5
$$ C4 60 15 F8 FF C8 CA 56 58 45 67 0D 9D B6 BA 0D
##$RELAX= 
##$RELAX= 
##$RELAX= 
##$RELAX= 
##$RELAX= 
##$RELAX= 
$$ Bruker specific parameters
$$ --------------------------
##$DU= <F:/spectra>
##$EXPNO= 1
##$NAME= <H-F>
##$PROCNO= 1
##$TYPE= <nmr>
##$USER= <she>
##$AMP= (0..31)
100 100 100 100 100 100 100 100 100 100 100 100 100 100 100 100 100 100 
100 100 100 100 100 100 100 100 100 100 100 100 100 100 
##$AQSEQ= 0
##$AQ_mod= 1
##$AUNM= <au_zg>
##$AUTOPOS= <>
##$BF1= 200.13
##$BF2= 200.13
##$BF3= 200.13
##$BF4= 200.13
##$BF5= 200.13
##$BF6= 200.13
##$BF7= 200.13
##$BF8= 200.13
##$BYTORDA= 1
##$CFDGTYP= 0
##$CFRGTYP= 5
##$CHEMSTR= <none>
##$CNST= (0..31)
1 1 145 1 1 1 1 1 1 1 1 1 1 1 1 1 1 1 1 1 1 1 1 1 1 1 1 1 1 1 1 1 
##$CPDPRG= <>
##$CPDPRG1= <>
##$CPDPRG2= <>
##$CPDPRG3= <>
##$CPDPRG4= <mlev>
##$CPDPRG5= <mlev>
##$CPDPRG6= <mlev>
##$CPDPRG7= <mlev>
##$CPDPRG8= <mlev>
##$CPDPRGB= <>
##$CPDPRGT= <>
##$D= (0..31)
0 1.2 0 0 0 0 0 0 0 0.06 0 0.03 0 0 0 0 0.0002 0 0 0 0 0 0 0 0 0 0 0 0 
0 0 0 
##$DATE= 1677069376
##$DBL= (0..7)
120 120 120 120 120 120 120 120 
##$DBP= (0..7)
150 150 150 150 150 150 150 150 
##$DBP07= 0
##$DBPNAM0= <>
##$DBPNAM1= <>
##$DBPNAM2= <>
##$DBPNAM3= <>
##$DBPNAM4= <>
##$DBPNAM5= <>
##$DBPNAM6= <>
##$DBPNAM7= <>
##$DBPOAL= (0..7)
0.5 0.5 0.5 0.5 0.5 0.5 0.5 0.5 
##$DBPOFFS= (0..7)
0 0 0 0 0 0 0 0 
##$DE= 6
##$DECBNUC= <off>
##$DECIM= 32
##$DECNUC= <off>
##$DECSTAT= 4
##$DIGMOD= 1
##$DIGTYP= 9
##$DL= (0..7)
0 120 120 120 120 120 120 120 
##$DP= (0..7)
150 150 150 150 150 150 150 150 
##$DP07= 0
##$DPNAME0= <>
##$DPNAME1= <>
##$DPNAME2= <>
##$DPNAME3= <>
##$DPNAME4= <>
##$DPNAME5= <>
##$DPNAME6= <>
##$DPNAME7= <>
##$DPOAL= (0..7)
0.5 0.5 0.5 0.5 0.5 0.5 0.5 0.5 
##$DPOFFS= (0..7)
0 0 0 0 0 0 0 0 
##$DQDMODE= 0
##$DR= 18
##$DS= 0
##$DSLIST= <SSSSSSSSSSSSSSS>
$$ [...]
##$SUBNAM2= <"">
##$SUBNAM3= <"">
##$SUBNAM4= <"">
##$SUBNAM5= <"">
##$SUBNAM6= <"">
##$SUBNAM7= <"">
##$SUBNAM8= <"">
##$SUBNAM9= <"">
##$SW= 18.05172834244
##$SWIBOX= (0..15)
0 0 2 0 0 0 0 0 0 0 0 0 0 0 0 0 
##$SW_h= 3612.71676300578
##$TD= 16384
##$TD0= 1
##$TE= 0
##$TE2= 300
##$TE3= 300
##$TEG= 300
##$TL= (0..7)
0 120 120 120 120 120 120 120 
##$TP= (0..7)
150 150 150 150 150 150 150 150 
##$TP07= 0
##$TPNAME0= <>
##$TPNAME1= <>
##$TPNAME2= <>
##$TPNAME3= <>
##$TPNAME4= <>
##$TPNAME5= <>
##$TPNAME6= <>
##$TPNAME7= <>
##$TPOAL= (0..7)
0.5 0.5 0.5 0.5 0.5 0.5 0.5 0.5 
##$TPOFFS= (0..7)
0 0 0 0 0 0 0 0 
##$TUNHIN= 0
##$TUNHOUT= 0
##$TUNXOUT= 0
##$USERA1= <user>
##$USERA2= <user>
##$USERA3= <user>
##$USERA4= <user>
##$USERA5= <user>
##$V9= 5
##$VALIST= <valist>
##$VCLIST= <CCCCCCCCCCCCCCC>
##$VD= 0
##$VDLIST= <DDDDDDDDDDDDDDD>
##$VPLIST= <PPPPPPPPPPPPPPP>
##$VTLIST= <TTTTTTTTTTTTTTT>
##$WBST= 1024
##$WBSW= 4
##$XGAIN= (0..3)
0 0 0 0 
##$XL= 0
##$YL= 0
##$YMAX_a= 688329
##$YMIN_a= -1065589
##$ZGOPTNS= <>
##$ZL1= 120
##$ZL2= 120
##$ZL3= 120
##$ZL4= 120
##$ABSF1= 10
##$ABSF2= 0
##$ABSG= 5
##$ABSL= 3
##$ALPHA= 0
##$AQORDER= 0
##$ASSFAC= 0
##$ASSFACI= 0
##$ASSFACX= 0
##$ASSWID= 0
##$AUNMP= <proc_1d>
##$AZFE= 0.1
##$AZFW= 0.1
##$BCFW= 1
##$BC_mod= 2
##$BYTORDP= 1
##$COROFFS= 0
##$CY= 11.3945322036743
##$DATMOD= 1
##$DC= 2
##$DFILT= <>
##$DTYPP= 0
##$F1P= 2.36226072786647
##$F2P= -0.459571619588291
##$FCOR= 0.5
##$FTSIZE= 0
##$FT_mod= 4
##$GAMMA= 1
##$GB= 0.15
##$INTBC= 1
##$INTSCL= 1
##$ISEN= 128
##$LB= 0.24
##$LEV0= 0
##$LPBIN= 0
##$MAXI= 10000
##$MC2= 0
##$MEAN= 0
##$ME_mod= 0
##$MI= 1.114404
##$NCOEF= 0
##$NC_proc= 0
##$NLEV= 6
##$NOISF1= 3.799351
##$NOISF2= 2.8
##$NSP= 1
##$NTH_PI= 0
##$NZP= 0
##$OFFSET= 15.70392
##$PC= 1
##$PHC0= -19105.71
##$PHC1= 10.00074
##$PH_mod= 1
##$PKNL= yes
##$PPARMOD= 0
##$PSCAL= 0
##$PSIGN= 0
##$REVERSE= no
##$SF= 200.130013532006
##$SI= 16384
##$SIGF1= 3
##$SIGF2= 2
##$SINO= 400
##$SIOLD= 16384
##$SREGLST= <1H.CDCl3>
##$SSB= 0
##$STSI= 0
##$STSR= 0
##$SW_p= 3612.71676300578
##$SYMM= 0
##$S_DEV= 0
##$TDeff= 0
##$TDoff= 0
##$TI= <>
##$TILT= no
##$TM1= 0
##$TM2= 0
##$TOPLEV= 0
##$USERP1= <user>
##$USERP2= <user>
##$USERP3= <user>
##$USERP4= <user>
##$USERP5= <user>
##$WDW= 1
##$XDIM= 8192
##$YMAX_p= 0
##$YMIN_p= 0
$$ End of Bruker specific parameters
$$ ---------------------------------
##NTUPLES= NMR FID
##VAR_NAME=  TIME,          FID/REAL,        FID/IMAG
##SYMBOL=    X,             R,               I
##VAR_TYPE=  INDEPENDENT,   DEPENDENT,       DEPENDENT
##VAR_FORM=  AFFN,          ASDF,            ASDF
##VAR_DIM=   8192,          8192,            8192
##UNITS=     SECONDS,       ARBITRARY UNITS, ARBITRARY UNITS
##FACTOR=    0.0002768,     1,               1
##FIRST=     0,             0,               0
##LAST=      2.2672688,     0,               0
##MIN=       0,             -1065589,        0
##MAX=       2.2672688,     688329,          0
$$ Real data points
##PAGE= N=1
##DATA TABLE= (X++(R..R)), XYDATA
$$ [...]
1424e54K07j93J51N8J18j90J95K48n8O4J6J64J32K27j83J14J90L9l5l39O2j73
1446B60k54M5m76K78l01ml8n6o7P9J77j52L45r7N6L6O6P1M4J52ML3J01O4K1K15
1472F02r2qm4o2r9k25k04J13k36K5o0p7N6J8j44K48N2j96K06M6j34J56l4J38j45
1497a00P3J07J80K63r4l8L49n1j88Q6k88J2j91m6j72k09m2N4k57J8Q8rJ47K13
1521i5j15J50k47L61p8j32Q0J31l53K41K38p2J5J96J73j50J74N3l91K23p6m65
1543a39p7k9N9l52K53o0j02L17J25j09K27j22J03Q8J1Ml7K2q9J3qK37k7LJ35j55
1569B91J91p1k96p6l28j08q4k04j4j26N0J54L7J11J99k3J56K72l19K72j10R2L03
1592C69l9O1N3K14J0K6K77o5r0q0J06m13k90J91j75k70l56p8p2K6M0L5l39K79
$$ plain form
1424 -554 -347 -540 -389 -331 -213 -403 -208 40 -18 46 62 226 358 585 402 516 706 745 710 371 433 260
1446 260 6 51 -425 -147 -448 -452 -490 -546 -613 -534 -357 -509 -164 -261 -205 -169 -103 -32 12 164 168 201 302 366 387 602
1472 602 510 502 458 396 297 72 -132 -19 -255 -230 -290 -367 -311 -293 -437 -189 -137 -333 -127 -81 -215 -59 -93 45 -100
1497 -100 -27 80 260 523 429 391 740 689 501 587 299 311 120 74 -98 -307 -349 -295 -552 -534 -446 -455 -308 -95
1521 -95 -210 -60 -307 54 -24 -156 -76 55 -298 -57 181 109 124 320 493 343 517 570 179 402 326 -139
1543 -139 -216 -245 -186 -538 -285 -345 -447 -130 -5 -114 113 -9 94 182 193 197 160 182 93 106 98 335 308 311 446 291
1569 291 482 411 115 39 -289 -397 -481 -685 -699 -825 -775 -621 -584 -473 -274 -297 -141 131 -188 84 -26 66 369
1592 369 330 391 444 658 668 694 971 906 816 736 842 429 139 330 155 -115 -471 -549 -621 -595 -555 -520 -859 -580
1616e80J46k6P8k03L75L4k17J0K44J66J41j1J71P1J62J00L7j83J31q0j40l7j64
1639B25k20q9oj58j82j15J57o6J35J40K4R6l4j70K02K3j63J11J04J05j28J79k4
1662A46J32L0R7k25M20k66j02j41j69J88j58k99J17j37J32m0o8M1nq9K22J45j29
1685a58J26j7K16M4j03M0M0j53K19k32K76J37J07k50j45n9M0r4o6j44K8l1n4j54
1709c87P5J11r6K74k53J29q6J01L60j13J6r3L2K75M1l21J79j73K73l2k22K4P8
1732A92j17j58J40k12j1j66Q3j79O2N5J13L5Kj16J34J95K61j80J3J17j61M2K06
1755C50j70J84l1J40k43J48j29j16r5o2j4j04j02kM1j57qK1%J38k84M8J61J5J38
1780a33j39L00J34n3J13R3J20L1J7j32J72l07K3P5k13m0JJ1n9p5r9j04OJ13k45
$$ plain form
1616 -580 -434 -460 -382 -585 -210 -176 -393 -383 -139 27 168 157 328 399 561 661 698 515 646 566 426 389 225
1639 225 5 -84 -90 -248 -430 -545 -388 -454 -319 -179 -155 -59 -93 -263 -61 -38 -201 -90 14 119 -9 170 146
1662 146 278 308 405 180 600 334 232 91 -78 110 -48 -347 -230 -367 -235 -275 -343 -302 -307 -396 -174 -29 -158
1685 -158 -32 -49 167 211 108 148 188 35 254 22 298 435 542 292 147 88 128 34 -32 -176 -148 -179 -233 -387
1709 -387 -312 -201 -297 -23 -276 -147 -233 -132 228 115 131 38 70 345 386 65 244 71 344 312 90 114 192
1732 192 75 -83 57 -155 -166 -332 -249 -428 -366 -311 -198 -163 -161 -277 -143 52 313 133 146 263 102 144 350
1755 350 180 364 333 473 230 378 249 133 38 -24 -38 -142 -244 -246 -205 -362 -370 -349 -349 -211 -495 -447 -286 -271 -133
1780 -133 -272 28 162 109 222 315 435 466 483 351 523 216 239 314 101 61 62 73 14 -61 -160 -264 -258 -145 -390
1805c90J74k24n5R2J75k31J73k0K04l1K11J70k57K13P2J2J03j6q8j68K0J09j04
1828A44k1J35l16n6K10k21r2P3j28J63k09j31K23j46Q4M7O2K64p5R4J34l8rK19
1852D10j46J62k80M4L7j81K41j24j05K42l38mln9K8k14l9P6j52r9N3J4J10r7J58
1877b66J86N3L2K41R6O2L8k66J26L7j08r3j12K36j33J0Mp3j63J76r2m1O8l28J82
1902a28j63J5r4Ok8J44j45J04J68R4K90j51Oj9L51n8k74K07j52l60L85j66l4k1
1926b3k5J41l5q2M4j62k0J63l23K07j09J90n9j94J03J19Q6n5J30Q4J7r8J42k4
1950B17m7j41n2P0MQ6k30J72m4jk05mP8J1j13J58j13l1j0J24n3m3K77o4kQ7J65
1977B96rK9j55P3Q5K9j99K61m00j19K34l19J26j00J36%j89K2j22k6J57k99J37
$$ plain form
1805 -390 -216 -440 -495 -403 -228 -459 -286 -306 -102 -133 78 248 -9 204 276 288 391 375 287 119 139 248 144
1828 144 123 258 -58 -114 96 -125 -217 -144 -272 -109 -318 -449 -226 -372 -288 -241 -179 85 10 104 238 200 191 410
1852 410 264 426 146 190 227 46 287 163 58 300 -38 -42 -45 -104 -76 -290 -329 -253 -405 -504 -451 -437 -327 -424 -266
1877 -266 -80 -27 5 246 342 404 442 176 302 339 231 138 26 262 129 139 143 70 -93 83 -9 -50 18 -310 -128
1902 -128 -291 -276 -370 -364 -392 -248 -393 -289 -121 -27 263 112 118 99 450 392 118 325 173 -187 198 32 -2 -23
1926 -23 -48 93 58 -24 20 -142 -162 1 -322 -115 -224 -34 -93 -287 -184 -65 21 -34 96 180 197 99 241 217
1950 217 170 29 -23 47 51 137 -93 79 35 34 -171 -175 -97 -86 -199 -41 -154 -185 -195 -71 -124 -167 110 46 44 131 296
1977 296 287 316 161 234 319 348 149 410 10 -109 125 -194 -68 -168 -32 -32 -221 -199 -321 -347 -190 -489 -352
2000c52P8O6k2K07m6Q3R7O3N0m1J20O2J18j20pn7j06k0k16J67j01N6p4R9o7p8
2026d1j21Q1r6l1m9n5K01k4l7m2M4J64R3q1l2J62Q6K57k11m3r4k0J07r6rK4k32
2053i5Q8K7P6j57j36r1R0j25K70k60J34p8O6k2K29k54K8K36J10l6P3n0Q0r8K15
2078C20j95l9J72J33m8j83Oo1j68j49L70k95Pj30j31K61Nr5j07J39O0k79K60P5
2102g2m2K52Jj55J30Mj4OJ20m6L2p9o3n6O6j81J86j21j6L6L2q2j46J12m4N0l3
2129a23Jj76K27P6o8k3q4L18j07J39O7j34J2m4o2J50j72M2k2P0k8j54m5p1p0J92
2155h9k2k54J47J55j22j24K11J5mKP4J98k47K44j24j8J7J42N9j98O9m5N2j6Oq1
2181D7J7j51Kl4M1j71O2j09P6j4O7l4Q6J46k49R4L6K38k65J65QP3Lj01J66j77
$$ plain form
2000 -352 -274 -208 -230 -23 -69 14 111 174 224 183 303 365 483 363 356 299 193 173 -43 124 23 79 5 104 37 -41
2026 -41 -162 -81 -177 -208 -257 -312 -111 -135 -172 -214 -170 -6 87 6 -26 136 222 479 268 225 131 111 218 122 113 137 -95
2053 -95 -7 20 96 -61 -197 -288 -198 -323 -53 -313 -179 -257 -191 -213 16 -238 -210 26 136 100 173 123 203 105 320
2078 320 125 86 258 391 343 160 166 105 -63 -212 158 -137 -130 -260 -391 -130 -125 -220 -327 -188 -128 -407 -147 -72
2102 -72 -114 138 139 -16 114 118 104 110 230 184 216 137 74 18 84 -97 89 -32 -48 -12 20 -62 -208 -96 -140 -90 -123
2129 -123 -122 -298 -71 5 -63 -86 -170 148 41 180 247 113 125 81 19 169 -3 39 17 87 59 -95 -140 -211 -281 -89
2155 -89 -111 -365 -218 -63 -185 -309 -98 -83 -87 -85 -11 187 -60 184 60 42 59 201 260 62 131 86 138 122 128 47
2181 47 64 -87 -85 -119 -78 -249 -187 -296 -220 -234 -167 -201 -115 31 -218 -124 -88 150 -115 50 58 131 134 33 199 22
2207B2L34r8j45r5K11k06l8O6o3r3J4k8J9q9J40j67K47m1j4j57K37n4j61J70j54
2232a43K32o4R3m6j8J5J22j86K57j64r9J89l17J85p0k4Q8j71K5j82R2M5m1l1q
2257b21Q0L7O6J69j87J62lJ57j24n7P2N7q4o7L06j57R2l30L4K3J8j32J25j66J04
2282b6m6j35k1n8J5J87q0J42m5J52o4j01L5l1J33J49j02K8k8J57J2L0j70N1r2
2307I2j41J00J31k85M7n8K66k61o5j01J75pk4Q5n8j34J89n9J00P5o2N5o9J53J2
2332A56r2j1pK23L3j70K4q0j26Q2p8m1J5J5K0j46j34K00q0M5R2O3l8l0m8J01m7
2359e9R2Q8K0Q6k39P0J29K3k5j00J26k20J19j18NJ43j72p0j0j14R0K1l3k3pj59
2385c37K65P9k3RO1o7J6J53Q7qj54N8n6L4m9Q4k1j52q9K16k21K08m0l5n0O6r3
$$ plain form
2207 22 356 258 113 18 229 23 -15 51 -12 -105 -91 -119 -100 -189 -49 -216 31 -10 -24 -181 56 2 -159 11 -143
2232 -143 89 25 118 72 54 69 191 5 262 98 -1 188 -129 56 -14 -38 50 -121 -96 -278 -186 -141 -182 -213 -221
2257 -221 -141 -104 -38 131 -56 106 103 260 136 79 151 208 124 57 363 206 298 -32 2 25 43 -89 36 -130 -26
2282 -26 -72 -207 -228 -286 -271 -84 -164 -22 -67 85 21 -80 -45 -76 57 206 104 132 104 261 273 303 133 184 92
2307 92 -49 51 182 -103 -56 -114 152 -109 -174 -275 -100 -107 -131 -46 -104 -238 -49 -108 -8 67 5 60 -9 144 156
2332 156 64 53 46 269 302 132 156 76 -50 32 -46 -87 -72 -57 -37 -183 -317 -117 -197 -152 -60 3 -35 -65 -113 -12 -59
2359 -59 33 121 141 227 -12 58 187 210 185 85 211 -9 110 -8 -3 140 -32 -102 -112 -226 -136 -115 -148 -171 -178 -337
2385 -337 -72 7 -16 -7 54 -13 3 156 243 235 81 139 83 117 68 152 131 -21 -110 106 -115 93 53 18 -32 34 -59
2412e9l9j70m2K31k9N6m1J64k22O0J38l1K48k14O3L2J19R5l74P0oL2p4J26k25
2437i2M8J51j02n0p1O3J01j73m6j11J48Q4r1O8l0J01M8j24j3J97L9k1j71J62j18
2462cJ42q6J95j79j00J60K2j0j75pK2l4nl5j36M9j53K70N4m8o8L1J16m9R8Q8j99
2489d0pJ04N5J22m5r3M2J4j22P4K7j28n0j54J04O2jq4K5O8P5k35J60r7j14P4K64
2516A00j20k7J03l3P6K15l46O9m1R0j09k4P8NJ22k09J13j75l9M9Q3j00j72J31
2540a61O0q7J42K4N4j10pj66K28J57rj61J95k5N1L7j89K58j09J8r2n8n8R9K5o7
2566D9o6k14K05r9j42O6L8Q7j4j67Q6J85j09J25j50J60j80J36n5J09J99k35R7
2589A11M1q6n5N4L8k67K36j85J19J06n1j10K7j44L6R3r9p3P9L5O8m6rJ29m8J70
$$ plain form
2412 -59 -98 -268 -310 -79 -108 -52 -93 71 -151 -91 47 16 264 50 113 145 264 359 -15 55 49 81 7 133 -92
2437 -92 -44 107 5 -45 -116 -53 48 -125 -171 -282 -134 -50 -141 -73 -103 -2 46 -78 -91 106 145 124 -47 115 -3
2462 -3 139 53 248 69 -31 129 151 141 -34 -41 -19 -53 -58 -93 -229 -180 -333 -63 -9 -57 -125 -94 22 -27 71 159 -40
2489 -40 -47 57 112 234 189 96 138 152 30 104 131 3 -47 -201 -97 -35 -36 -120 -95 -27 48 -187 -27 -124 -238 -164 100
2516 100 -20 -47 56 23 99 314 -32 37 -4 86 -23 -47 31 36 158 -51 62 -113 -152 -103 -20 -120 -292 -161
2540 -161 -101 -188 -46 -22 32 -78 -85 -251 -23 134 125 -36 159 134 185 222 33 291 182 200 108 50 -8 91 116 49
2566 49 -17 -231 -26 -125 -267 -201 -163 -76 -90 -257 -171 14 -95 30 -120 40 -140 -4 -59 50 249 14 111
2589 111 152 66 11 65 103 -164 72 -113 6 112 61 -49 -22 -166 -130 -37 -136 -209 -130 -95 -27 -73 -82 47 -1 169
2615A69k95J28L0M1R4j98J10K6K1j62J51j56J10p1OJ1r1R6j45L8p4J90m6j25J34
2640hN3j01J50k14m0J63M5J76k26j1M4M1k1j03R8Q3o4J7k2p0L9n4k3J3p2k4M1
2667i0k05J42J72l87J66K71j37r4j5J54J26Lo4n5J51Q1k07R4j21Q3n9M6j44K33
2691A44j77P7n3%O0m0n0j43M5q4K79j34M6r7K12j44J9KK4O9o2N8m6K00j60J2J0
2718F7J66k39O0J08k27J22k3j09j57J54J25P8k56n6RJ02o4M0NJ16m0Ml0L5K27
2743B17j54k1MJ47L5j71K64m15J83q2N8O7j36o2J30j47J16m6j32J44j17L1q4P2
2767i9j08J20Q0m9K51j45QP3j17O2k8K3O8q5l9J43j89J88j12L1j28Nk1j28K54
2792E8j26p5J55j25m6k5P7N4J15j60J3qL2K3p5J53K1j27J99J7j57r9N5J64k38
$$ plain form
2615 169 -126 2 32 73 167 -31 79 105 126 -36 115 -41 69 -2 4 15 -76 20 -125 -87 -161 29 -17 -142 -8
2640 -8 45 -56 94 -120 -160 3 48 224 -2 -13 31 72 51 -52 46 129 65 82 60 -10 29 -25 -48 -35 -107 -131 -90
2667 -90 -295 -153 19 -368 -202 69 -68 -162 -177 -23 103 106 42 -13 138 219 12 106 -15 68 9 55 -89 144
2691 144 -33 44 -9 -9 51 11 -39 -182 -137 -221 58 -76 -30 -127 85 -59 -40 -38 -14 55 -7 51 5 205 45 57 67
2718 67 233 -6 54 162 -65 57 34 -75 -232 -78 47 125 -131 -187 -178 -76 -140 -100 -95 21 -19 -15 -45 -10 217
2743 217 63 42 46 193 228 57 321 -94 89 7 65 132 -4 -66 64 -83 33 -13 -145 -1 -118 -87 -171 -99
2767 -99 -207 -87 -7 -56 195 50 58 131 14 76 48 71 139 54 15 158 -31 157 45 76 -52 -47 -68 -196 58
2792 58 -68 -143 12 -113 -159 -184 -107 -53 62 -98 -85 -93 -61 -38 -113 40 61 -66 133 150 -7 -106 -51 113 -125
2817a25J45k4N9j73K26j95j06K10m7l5j46N7R7q7n8J25J8M7K5q4J13O7o1L4n7
2842B5j0J5j77K90Nl8o2M1n3JKj27qJ84o9j59J48k4K9j33m2k4J17Q3Qj58O1J43
2870F8j36j6J31J13j69RK23j86j19M2L4K01o9j6R2k37p6n5m0J62q4R9J34j02R7
2895A00l7j12k1R0j87K44n9J75j90J04j07n6K49q4j00P7L3j34j02l7M9R4J1p7
2919g7K7j38K04q9l6N3j57KJ41R3j91J61K3o3Q8K37k07M2R3k2j68J8m5m1O2k1
2945a1P0r9q9K1j04J17J05P1m8j28Q2l9k6R2n1J34r2j08O2j50K13kR0M8J3j18
2971E3o6J71J0kk58J09P0q3Mj47J69j11q4j5K13k17J31o1N8j94QJ62N3j8j02K35
2997H8q0o8p7J71L5r0K35j48q4O3J39j38k9l7J48q8j8j45J53q4j5o8J06Q2k10
$$ plain form
2817 -125 20 -4 55 -118 108 -87 -193 17 -30 -65 -211 -154 -57 -144 -202 -77 -59 -12 13 -71 42 109 48 82 25
2842 25 15 30 -147 143 148 110 48 89 36 37 39 -88 -96 88 19 -140 8 -16 13 -120 -162 -186 -69 14 22 -136 -75 68
2870 68 -68 -84 47 160 -9 0 223 37 -82 -40 -6 195 126 110 202 -35 -111 -166 -206 -44 -128 -29 105 3 100
2895 100 63 -49 -70 20 -167 77 18 193 3 107 0 -56 193 109 9 86 119 -15 -117 -154 -105 -11 0 -77
2919 -77 -50 -188 16 -73 -109 -56 -213 -211 -70 23 -168 -7 16 -47 41 278 71 113 206 184 16 34 -11 -52 10 -11
2945 -11 59 -40 -129 -108 -212 -95 10 81 33 -95 -13 -52 -78 14 -37 97 5 -103 -41 -191 22 20 110 158 171 53
2971 53 -13 158 168 166 -92 17 87 4 8 -139 30 -81 -165 -180 33 -184 -53 -114 -56 -250 -242 -80 -27 -45 -147 88
2997 88 8 -60 -137 34 69 -21 214 66 -18 45 184 46 17 -20 128 40 22 -123 30 -54 -69 -137 -31 51 -159
3022a59R2J7r5O9J35k7j43P2%jJ19J72l42K00J56q2k00J64m6m3k2L1r4o2q6Q9
3048h6J05k41P3j06K39j23N7J35j18j3O7j31O6P6J25q6n7l1j2K4K72j34K5j61
3072c5J6K39j71O0n8j14L7Lq0Q4p3j92K41K3P7q7l2J8J06%j2o3P0k01K65j34M1
3099B8m3l7K58j26J38l01J58j94O3j15M1K05j61r6K14q3m7R5q4Rm9K4L07j55n2
3124cr4J46L9j51J70q4Q9j64J61j66K2J48j03L4J6Rl8K2k38J40M4j91J96j9J0
3149ej75N6J00j2J12o7j26J11j01J33Q0j3O4N5L9j62k7l8J12r2j38L4J45o4K1
3174D2j60J03j44R6J4l7o1m2J85j58J40k3N4Pj07M2MQ0J7n2N3p6NM3P7q3l1n3
3202f5J96j15k12pJ6O7k0L2N0j2Q0O9k58J52k5L2P9o8M9q1p7K65k19Q8m2J95j27
$$ plain form
3022 -159 -67 -50 -145 -76 59 32 -111 -39 -39 -40 79 251 -91 109 265 183 -17 147 101 58 36 67 -27 -89 -175 -86
3048 -86 19 -222 -149 -255 -16 -139 -82 53 -65 -78 -11 -142 -76 0 125 39 -18 -49 -61 -37 235 101 126 -35
3072 -35 -19 220 49 109 51 -63 -26 -23 -103 -19 -92 -284 -43 -20 57 -30 -62 -44 62 62 50 -13 57 -144 121 -13 28
3099 28 -15 -52 206 80 218 -83 75 -119 -56 -171 -130 75 -86 -182 32 -51 -98 -3 -87 -78 -127 -103 204 49 -3
3124 -3 -97 49 88 -63 107 23 112 -52 109 -57 -35 113 10 44 60 69 31 53 -185 -45 -1 -192 4 -15 -5
3149 -5 -180 -124 -24 -36 76 9 -117 -6 -107 26 106 93 157 212 251 89 62 24 136 44 -94 -60 85 21 42
3174 42 -118 -15 -159 -63 -49 -86 -147 -189 -4 -162 -22 -45 9 16 -91 -49 -45 35 52 0 53 -23 -18 25 102 19 -12 -65
3202 -65 131 16 -196 -203 -187 -120 -140 -108 -58 -70 10 79 -179 -27 -52 -20 59 -9 40 -41 -118 147 -72 16 -26 169 42
3229D2J33k01J12k7j98J93Q8M2j61q5q3J00j94J11Q3j75J94k7j1j11J81l9M7J52
3253A66k40R0M7k6l1N5K0j02K13k02O3J95k02O1k04J60j14O3K4r5J4mj20J43j22
3278a48L5KN0J14j9j31n1K48k00J17O2k7P8l1j14n1q4J43J8L8J04k67jJ47N1j32
3304d9P1j62O4p2J62o1n9O2l1l7M1J17J87j72l0J67j64j32J52l9l7j4j39K64r6
3329gj3J01j43R4o6K3p5l3K7J92j03j13P4q3nJ31Q9p1q0J49o1n9O7K3PnJ72n9
3357A73j56P4j6k75M14j13J8j68q0o5R9nJ62j71rJ45j25N4M0J30j43m1P7J44l05
3382a42J83K3J19j52j1j6j28K08l1o0O2O0m6j18J5O1j22Q5L7m3j95J40j21kJ73
3407b1O8q8n6J77k82J42J15q4L9J4J30j78o3J22k8l0J14j44N5K8l7j22J87j27
$$ plain form
3229 42 175 -26 86 59 -139 54 142 184 23 -62 -145 -45 -239 -128 -45 -220 -26 -53 -64 -175 6 -33 14 166
3253 166 -74 16 63 37 6 61 81 -21 192 -10 53 248 46 107 -97 63 -51 12 36 -59 -45 -49 -169 -26 -148
3278 -148 -113 -111 -61 53 34 -97 -148 100 -100 17 79 52 130 99 -15 -66 -150 -7 11 49 153 -114 -115 32 83 -49
3304 -49 22 -140 -76 -148 14 -47 -106 -44 -75 -112 -71 46 233 61 31 198 34 -98 54 15 -22 -36 -175 89 -7
3329 -7 -20 81 -62 32 -34 -11 -86 -119 -92 100 -3 -116 -42 -125 -130 1 90 19 -61 88 27 -32 35 58 65 60 232 173
3357 173 17 91 75 -200 214 101 119 -49 -129 -194 -95 -100 62 -109 -118 27 -98 -44 -4 126 -17 -58 19 163 -142
3382 -142 41 64 183 31 20 4 -124 84 53 -7 55 115 69 -49 -34 27 -95 -10 27 -16 -211 -71 -192 -194 -21
3407 -21 47 -41 -97 80 -202 -60 55 -29 10 24 154 -24 -87 35 7 -23 91 -53 2 30 -7 -129 58 -69
3431f9K4N8k62J81O3j2N1k8p1M6L5m4rr0J14N9j7J04k36K02r7J37p5J7Q6o8m1
3458E8k5j34N3J21k00J76ok3j30N8j4R9j01J59j49Q0J7j0J43j18m6M3l9K09j16
3483A05p8N3o7J2Q8l5O8l25J04K00j98J07M2j0j78P2N7J14k35R2M7j8o4l1J95
3508A17j69K13k11J80P1Oj10o1J43k98J54J6L7J1j12qm2MjJ90j46k19J86j7J09
3533D3L7j91nM7r6J14n4J56oJ0R1k41J96q8J32K0O0k96R5K0r8k8k1J39Mj10J8
3560e2k2MML3J41j24Nj64J40%l9P6Q7j86J02J80j58J00j39K6L3K7j60q6J68p2
3586g6K5K9pj66K36q2K7k28J81J20j0j61R5k2L0o1J2R0L9j49RL23k14J61k53J08
3612E6q4m5J76j54J09lk8q5k1J34k93J62J3k4J48mj18L7r3j29J84J02q2Q8J42
$$ plain form
3431 -69 -45 13 -249 -68 -5 -17 34 6 -65 -19 16 -28 -37 -127 -13 46 29 133 -103 99 2 139 64 81 167 99 58
3458 58 33 -101 -48 73 -127 49 43 20 -110 -52 -66 33 -68 91 -58 22 39 29 172 54 8 51 12 221 105
3483 105 27 80 13 25 113 78 146 -179 -75 125 -73 34 76 66 -112 -40 17 131 -104 -12 35 17 -47 -78 117
3508 117 -52 161 -50 130 201 207 97 36 179 -119 35 51 88 99 -13 -21 -63 -59 -60 130 -16 -235 -49 -66 43
3533 43 80 -111 -116 -69 -165 -51 -105 51 45 55 146 -95 101 13 145 165 225 -71 24 44 -54 -82 -103 36 40 -70 -52
3560 -52 -74 -70 -66 -33 108 -16 -11 -175 -35 -35 -74 2 89 -97 5 185 27 127 -12 14 47 74 -86 -172 -4 -76
3586 -76 -51 -22 -29 -195 41 -41 -14 -242 -61 59 49 -112 -17 -39 -9 -70 -58 32 71 -78 -69 254 40 201 -52 56
3612 56 -28 -73 103 -51 58 55 27 -58 -79 55 -238 -76 -63 -87 61 57 -61 -24 -117 -246 -62 40 -42 46 188
3637A88j44rJ4j07J09k0J03j88J70M5j20r8l0NP3O5k78K47L8j81O4O0j65M4P7
3662c8l8n8J68L9j98J40K7o1l2M7MJ68j15M7q3k18K85j3k4j55N2Rj09J73r0j8
3688i1O4m3J84J4l41K84n6r7N8j24J12Q0r7J83j31n7J67j24J1J08r3k0l9K6J03
3713H1k4j22J94k07m6P8j10K09J9j03j18K5RK02j21J01J2m1j84K2J98Mj21J28
3737H5r0K53k32M2J27j55Kqk23K72n1P2j71J1r9Q8k6r4J9j21L13P6j47k0R0J1
3763B4o4J40j5j74O9QK27q4m4j45K17k45J26j27L5P5o5J43j80J53j09rN0K3J8
3788D7j68R4n7P6O5p0n2N9j11Q6J00M0%j87J32Q8k36J88q4n5RkK99k57j39J30
3814eK0J51k41j07J83Q9r3KN5o8n2J68j05K4j29J28M5j41M0j5J07J22m5o7k6j12
$$ plain form
3637 188 44 35 49 -58 51 31 134 -54 116 161 41 -57 -87 -82 -9 56 -222 25 63 -118 -54 6 -159 -115 -38
3662 -38 -76 -134 34 73 -125 15 42 -19 -51 -4 0 168 53 100 17 -201 84 71 47 -108 -56 -47 -156 17 -73 -91
3688 -91 -27 -70 114 128 -213 71 15 -82 -24 -148 -36 44 -53 130 -1 -58 109 -15 -4 104 11 -9 -48 -22 81
3713 81 57 -65 129 -78 -124 -46 -156 53 72 -31 -149 -124 -115 87 -34 67 79 38 -146 -124 74 78 -43 85
3737 85 -5 248 16 58 185 30 32 24 -199 73 22 94 -77 -66 -165 -77 -103 -197 -178 -299 14 90 -57 -77 13 24
3763 24 -40 100 85 -89 -20 -12 215 131 87 -58 159 -86 40 -87 -52 23 -42 101 -79 74 -35 -44 6 29 47
3788 47 -121 -27 -84 -8 57 -13 -65 -6 -117 -31 69 109 109 -78 54 142 -94 94 10 -45 -36 -38 261 4 -135 -5
3814 -5 15 166 -75 -182 1 90 -3 -1 54 -14 -66 102 -3 21 -108 20 65 -76 -36 -51 56 178 133 66 40 -72
3840g2J32N6p8p0n7J68m2L1p6J71k71O0Q5Q6j55J04q0J20Jj05Q3l2j1J81k09q2
3866f2J30j0R0l9j39J8q8J45n9k2J13j89N0QJ04J7j64P1K19j64j62P4l7J33J17
3891A54j04K5n5J25q9k2m4l8J4J81p9l1j1n6Q4m7l0l9J14j50J21j3p7P0l3N1o9
3918d8K2L2K1l9J52p7R8q4o1P3o2J29k71K7J21K8j9J27k20K05j64M5J7j50J71
3943G3j98P1oL0k7J23p8o5J18R8k61J36lN6n9Q3m9J08n8n7P0j15j6R1j21J94p3
3970F5n7l8J0m3J04qo2j01J74j46J23k0q6q6J62N9k48K07M6j96K54n0j45J37o6
3995a1J27o4m7J5QR3j63Q2j21qL2K13l39K77k48Q7Por4J13J8J68k15J81j00N4
4021E9j7kN4q8J43j70L5N5j02R3l6n2k2NR7J46j73l7Q0j77qQ0N0k0r9J49kk01
$$ plain form
3840 -72 60 116 38 -32 -89 79 37 68 -8 163 -108 -48 37 123 -32 72 -8 112 113 8 91 59 48 229 20 -62
3866 -62 68 58 148 109 -30 -12 -100 45 -14 -36 77 -112 -62 -54 50 67 -97 -26 193 29 -133 -59 -96 37 154
3891 154 50 75 20 145 56 34 -10 -48 -34 147 68 37 26 -30 54 7 -23 -62 52 -98 23 10 -67 3 -30 21 -48
3918 -48 -26 6 27 -12 140 63 161 77 16 89 27 156 -115 -88 33 61 42 169 -51 154 -10 35 52 -98 73
3943 73 -125 -54 -60 -30 -57 66 -12 -77 41 139 -122 14 11 67 8 91 42 150 92 35 105 -10 -26 65 -56 138 65
3970 65 8 -30 -20 -63 41 33 -29 -130 44 -102 21 1 -85 -171 -9 50 -198 9 55 -141 113 63 -82 55 -11
3995 -11 116 52 5 20 28 121 -42 40 -81 -89 -57 156 -183 94 -154 -67 -60 -66 -160 -47 -29 139 -76 105 5 59
4021 59 42 40 94 6 149 -21 14 69 -33 60 24 -28 -50 -45 52 198 25 -12 68 -109 -117 -37 13 -7 -106 43 41 -160
4049a60J04J61j58J4q4Q8kR8j0J02q1l7Q3j12o1Q7o1J38o9j97L5J76m3O0m2j54
4075a25N3J2r5J25J3O9r6n6Q2m4K03k08J40j5J05m02Q4M2oK08j59m5J93p9J3j16
4101a04J94J03k33n4K08Qk80K57j89K17j52m1J46j45R5q2j17J79m2L1Q3L1j10
4124CJ90j45o5P1R6k58O4k3n3K77k88J44r7J2kj5J06o1K9J0q4O8J41k86J41k8
4150e3%J64j10m7J7qK02o7o3mM4k3j11J76p1j00LL6N8n6o2M7P2r0J03n5p5K60
4178A87Rk27j11J73Q3Qq4m1J01j05J75j00R0r3J8k48K14m0N1q0J8K23k57k49J45
4203a40J43pn9j5n2JJ5p6L34j40j48J82KJ9N9j44Q1k18K77k29r1J72K35j65n0
4228a4r4J29q4J39m3j27J35k15R5j24PL3J45R3P2j77M3R8j47j18J36J05K5N2Q5
$$ plain form
4049 -160 -56 105 -53 -39 -123 -35 -37 61 51 153 72 35 118 6 -55 32 -29 109 40 -157 -122 54 11 71 29 -125
4075 -125 -72 -60 -155 -30 -17 52 -44 -100 -18 -62 141 -67 73 58 163 -239 -155 -113 -119 89 -70 -115 78 -1 12 -104
4101 -104 90 193 -40 -94 114 122 -158 99 -90 127 -25 -66 80 -65 30 -52 -169 10 -32 -1 82 113 3
4124 3 193 48 -17 54 150 -108 -44 -67 -120 157 -131 13 -84 -72 -74 -89 17 -44 -15 -5 -89 -21 120 -166 -25 -53
4150 -53 -53 111 1 -46 -29 -37 165 98 35 31 75 52 -59 117 46 -54 -51 -15 43 -13 -75 -28 44 -46 57 2 -73 187
4178 187 196 -31 -142 31 114 122 38 -3 98 -7 168 68 158 65 83 -165 49 9 60 -20 -2 221 -36 -285 -140
4203 -140 3 -4 -63 -78 -130 -129 -114 -190 144 4 -144 38 40 59 118 -26 55 -163 114 -115 -206 -34 201 36 -14
4228 -14 -108 21 -63 76 33 -94 41 -174 -79 -203 -196 -163 -18 75 147 -30 13 111 -36 -154 -18 87 112 164 249
4253B49j54L6j86l0J40q3r8K7O9j6K68j63m6l13L92j9Jo9m2J5O9L0k3o3Q0M2k03
4280i0l1K86k73rK29q9l7j41J17r4J55j89K58k70K82j31K0K0jj38j4K32Qj30j51
4305a81K49k16J97QR2Lm6k86J62N6K5j22qlK1J87j78l1N1K15q1j42k3j26J58q9
4331a08P7j13K22k08J75Nj87L7j0O5o0L2Q4J0q5L6J56j45K38k64J25LK7l8J01
4356A75j47p4O6N8Mj14n3J56rj42O5j16J27L1p8K0l6K2N3o7J32j07M5N9N5j95
4382g0L4j06m8o2K37j2j47J84R4L4k96J28j00M4Q9p7J34j64R0O5j97R2L6L4R3
4407A09m5qQ9j21j8j69o4K22Q2o5pq2J35Q0k9k25j4J1J13M4m3mj01J59j03K0j18
4434a52Q0M0Qm6J39M9j51nK24r1j34K2j7m2n5J69k5J9K77k41K1j72J45k15J61
$$ plain form
4253 249 95 131 -55 -85 55 -28 -126 -99 -30 -46 222 59 13 -300 92 73 74 5 -37 -22 47 77 54 -9 71 113 -90
4280 -90 -121 165 -108 -117 112 23 -14 -155 -38 -132 23 -166 92 -178 104 -27 -7 13 12 -126 -140 92 100 -30 -181
4305 -181 68 -148 49 57 149 152 106 -180 -18 38 63 -59 -67 -70 -49 138 -40 -71 -20 195 114 -28 -51 -177 -19 -108
4331 -108 -31 -144 78 -130 45 50 -137 -100 -110 -45 -105 -73 11 21 -64 -28 128 -17 221 -43 82 85 112 74 175
4356 175 28 -46 20 78 82 -32 -85 71 62 -80 -15 -131 -4 27 -51 -31 -67 -45 8 -59 73 -34 11 70 125 -70
4382 -70 -36 -142 -190 -252 -15 -27 -174 10 104 138 -158 -30 -130 -86 3 -74 60 -104 -14 51 -146 -54 -18 16 109
4407 109 64 56 145 24 6 -163 -227 -5 77 12 5 -77 58 138 109 -116 -130 -119 -6 38 -5 -9 -110 49 -54 -34 -152
4434 -152 -72 -32 -24 -70 69 118 -33 -38 186 95 -39 -17 -34 -76 -131 38 13 32 309 68 89 -83 62 -153 8
4459HJ5n5j1J1J7J02n0k48J22R4o1J64J1k36J91m7M2o6j17J32n0k7K68j56J0m0
4485B3m6J9K0O5n0M8j95J71j42N7J4l2j0J9j1J15l8n3j32J46L2r0M7J63l10Q2
4511h8n7J38m0N4m3P7Qk29Q5k4J80j61O7J65k21j3M4k5J5q3L45k16j6K0K27k11
4537bJ88j76p0j26M05k64R6O2Kj54P5J24k97J56O2k11K37j42m3j33J39q9O0J27
4561B6j47K62j07L9k5o2l0P9Jo2j6L2r6J37n6K5J55n1j91P9q0J28p3m2K1K0o3
4588i7J3K0j10J57J19n7j54L55l30J17k4N7j35MO2J37j45JN8N1q8lj73J13k2J09
4614C5L2l3pm5J12k11Q4n1R2O4r4Q3r4o5K05r3k7J24j31j63J55m9K97j80j53L6
4640g7l2Q7o8J5O3N3J38k50M6J2M2k42J85O6O6j91J36m6j0R8l7j97J22O6q1J20
$$ plain form
4459 8 23 -32 -43 -32 -15 87 37 -211 -89 5 -56 108 119 -117 74 27 69 3 -114 18 -32 -59 209 53 63 23
4485 23 -23 -4 16 81 31 79 -116 55 -87 -30 -16 -48 -58 -39 -50 65 27 -26 -158 -12 20 -70 -23 140 -170 -88
4511 -88 -145 -7 -47 7 -36 41 49 -180 -95 -119 61 -100 -33 132 -89 -102 -58 -83 -68 -151 194 -22 -38 -18 209 -2
4537 -2 186 10 -60 -186 219 -45 51 113 115 -39 36 160 -137 19 81 -130 107 -35 -78 -211 -72 -161 -101 26
4561 26 -121 141 34 73 48 -14 -44 35 36 -26 -42 -10 -106 31 -25 0 155 104 -87 -8 -88 40 -33 -75 -54 -34 -97
4588 -97 -84 -64 -174 -17 102 45 -109 246 -84 33 9 66 -69 -65 -3 134 -11 -10 48 99 11 8 -165 -52 -74 35
4614 35 67 34 27 -18 94 -117 -33 -84 8 72 -22 61 -33 -98 107 14 -13 111 -20 -183 -28 -77 220 40 -113 -77
4640 -77 -109 -22 -90 -75 -12 41 179 -71 -25 -13 29 -213 -28 38 104 -87 49 3 -7 91 54 -143 -21 45 -36 84
4666H4j5J4n0j35J62j86J56K3j73R9J7q7P3j01Q7J51k34J13n0J71j25n7J3j5%
4691f5R1q6J01l2n4J4M5P1O1j73nj10L28k98J51k9N9r2l8O6j05K04j15j3j6j50
4717a90J2K11j38N3R0N6j46N5RN8j72K10j07J13L2m6n2R0j62o6J37j62J17j9p7
4742i4Q5r3K39k20K7N9k8Q8j21m2O2P3R4p8O9n4q6J8O3N4n7N8j91J14m7K8N0p9
4770iL1J04j28j79J79j17K41j42nJ35j20kJ17K3k89J37K2N0l0P0j05O4k4j1N0
4795F2n3J0Q2j34Pk0p8jj17J39K5L6MJ61j75J12p3J68j51lp0j5L7J53p9m0P3j
4823E9j39rJ01L7j5L2n2j33J02J35k22J69j38L4P1n8K9J0j62J49K8J6k79L14k0
4848E9p3J90j33J32j06R3j58l4L5J4L9N8j60O8o6p1J05Ml7K06k49OkJ8M1j8J38
$$ plain form
4666 84 69 83 33 -102 60 -126 30 53 -120 -21 -4 -91 -18 -119 -32 119 -115 -2 -52 119 -6 -63 -50 -65 -65
4691 -65 26 -60 41 9 -45 -31 14 85 146 -27 -32 -142 186 -112 39 10 69 -23 -61 5 -100 104 -11 -24 -40 -190
4717 -190 -178 33 -105 -52 38 94 -52 3 12 70 -102 108 1 114 146 100 48 138 -24 -90 47 -115 2 -17 -94
4742 -94 -9 -102 137 -83 -56 3 -25 63 -58 -100 -38 35 129 51 120 66 -20 -2 61 115 58 116 -75 39 -8 20 70 -9
4770 -9 22 126 -2 -181 -2 -119 122 -20 -25 110 -10 -12 105 128 -161 -24 -2 48 18 88 -17 47 23 12 62
4795 62 9 19 101 -33 -26 -46 -124 -125 -242 -103 -78 -42 -38 123 -52 60 -13 155 4 1 -69 -84 -47 106 27 -13 60 59
4823 59 -80 -89 12 49 34 66 14 -119 -17 118 -104 65 -73 -39 32 -26 3 13 -149 0 28 44 -235 79 59
4848 59 -14 176 43 175 69 162 4 -30 5 19 58 116 -44 24 -42 -113 -8 -4 -41 165 -84 -78 -80 -62 -21 -39 99
4875I9k9l8j4j12q0J93N4J01k39Q3l8J09j50N8J68j4Rm0O6j16K23k47L2m0P7j61
4901d6Qr8L4q3K15j08JP2M9k65L28j12K8j4k2J16j91j8N8J89p8j37J39n0L2J92
4927B39j71K3q6Rk7Q3q0nj9q3J50r5l7J44mJ1lj81J65p5K20j47J10j10j28J51
4953E4j25J94p8M8j07K9K4j24K18k09O5l4k6J01O1M9j70J27L8l51J65k7K65k15
4977b8J78m4r1L8j38J95J4rj38Q5j74L1K0J32r1k2l9LJ6o4J61j19l5J4j83K94
5003Fm4M0M3m4Oj9J86k03rJ9J27K8mj31J68k69K05pj71J68j31p9o5K42j97J97
5029F2k11K75j55J32q8j07J65Oj20j50L05M3j42J0n9J2PJ00j00J11P3l40J94n9
5053c6N8l0j16P7q0J09j33J99j42M3J06p2k0l0Q2jr2M4K3J7K0J08q7j89J88p7
$$ plain form
4875 99 70 32 18 -94 -174 19 73 174 -65 18 -20 89 -61 -3 165 151 160 120 186 70 293 46 78 38 115 -46
4901 -46 -38 -136 -102 -185 30 -78 -77 -5 44 -221 107 -5 23 9 -13 103 -88 -106 -48 141 63 -74 65 15 47 239
4927 239 68 91 5 14 -13 70 -10 -15 -34 -117 33 -62 -99 45 41 52 49 -132 33 -42 178 31 141 31 -97 54
4953 54 -71 123 45 93 -14 15 39 -85 133 -76 -11 -45 -71 30 91 140 -30 97 135 -216 -51 -78 187 -28
4977 -28 150 106 15 53 -85 110 124 115 -23 62 -112 -81 -61 71 -20 -42 -81 -78 -62 -126 35 -84 -119 -105 -288 6
5003 6 -38 2 45 1 7 -12 174 -29 -38 -19 108 136 132 1 169 -100 105 98 -73 95 -36 -115 -180 62 -135 62
5029 62 -149 126 -29 103 15 -92 73 79 -41 -191 114 157 15 25 -34 -22 -15 85 -15 96 169 -171 23 -36
5053 -36 22 -8 -124 -47 -127 -18 -151 48 -94 -51 55 -17 -37 -67 15 14 -78 -34 -11 6 26 134 47 -142 46 -31
5079c1q0L0M4K2j00K25j38l7J16r5K13k49J05l9k8J7j05R4m8l6P5MJ70k66l5J19
5105e3m6L64k46M4j04L7J36o0K8j35J28j60J15q8l8J46n6j27J3O7Q8j06m2pJ1
5130i1L7J47p3j25J23n6QM1J18o4o6J02j64J16N9n7Lj59K56j83l7m0R6j04J44
5155C1o2J72j37l0K13k53r7P3O5j6Kr0l2K02j48J67j86L1k8J52R8q6K5j01n9K3
5181g1J69j43m1J36m1l9Or2J24j08J71rj13lj71J88N0l3R6l6m5J66k71J11P7L
5207H1k25J05J49O1j24J7p3L3omp7OKN3k08K14j33m6K34P9qk24K07k18M6J81j37
5234a5K27l9k72J45J0K8l2j48J18j05j10J32n3J59O7q4l0Mm2O1j0j38J44l1p4
5259h8l0K3L1PKR2k0j36kL4l8l4M50k77j16J60l0J0l4M4r7J55l8m7P5p8m2P5l4
$$ plain form
5079 -31 -111 -81 -37 -15 -115 110 -28 -65 51 -44 169 -80 25 -14 -42 -25 -130 -36 -84 -120 -45 -41 129 -137 -172 -53
5105 -53 -99 265 19 63 -41 -4 132 72 100 -35 93 -67 48 -40 -78 68 12 -115 -102 -35 53 -53 -95 -102 -91
5130 -91 -54 93 20 -105 18 -38 -30 11 129 65 -1 101 -63 53 112 55 58 -101 155 -28 -65 -105 -9 -113 31
5155 31 -31 141 4 -26 187 -66 -163 -90 -25 -41 -39 -129 -161 41 -107 60 -126 -95 -123 29 127 41 66 -35 -94 -71
5181 -71 98 -45 -86 50 9 -30 -24 -116 8 -100 71 62 -51 -54 -225 -37 13 -20 76 40 -5 161 -110 1 78 81
5207 81 -144 -39 110 171 47 64 -9 24 18 14 -63 -57 -55 -2 -210 4 -129 -175 59 138 130 -94 113 -105 -59 122 -15
5234 -15 212 173 -99 46 56 84 52 -96 22 -83 -193 -61 -114 45 112 28 -2 2 -40 21 11 -127 17 -14 -88
5259 -88 -118 -95 -64 -57 -55 37 17 -119 -121 -87 -125 -159 291 14 -102 58 28 38 4 48 -49 106 68 21 96 18 -24 51 17
5288A7p1J1J49j6l2l2r1j44R2R6R5M4jJ41k71J26l4L3L5j3k74R0K3q0J88o6J02
5315A17j02j31n1K3K33m3k2J08j32l9J03J1j08J51j52Q9l4J2n6N0O3j39Q2K0r6
5340d3KJ42k4r2J4N4Qk17J4J02k2M3j40K59n6j39J21j44M0m9J8J48J0K3j9m8M0
5367D5O6k11J36j15J12m2RJ8qj36J53J77k27qq2R0j84K73q1K2J3K0m4P2K2j12
5393b2m4J64j23j0J48p1Nj05N9J5O1o3N1r1J33j27N9L0j20m3K40k61J26j62J7
5418a34J31P0qk69J91j01J22l5o0K84k72l0P9P3n9M9O7o7jQ7m4n2m0j68J76q1
5444i2k6K9J51p1j11j8K3J37l5k6k7L2m3%PO1l0J26nM0Mk31J56k1j49J67J82k77
5472d7jJ84j54J2j3M7j54J26j64K60p5j24J20j4k8p9Q5j16J76j62J7K52J3j67
$$ plain form
5288 17 -54 -43 106 90 58 26 -65 -209 -117 -21 74 118 117 258 -13 113 79 112 147 134 -140 -50 -27 -107 81 15 117
5315 117 15 -116 -167 -144 89 46 24 132 0 -39 64 75 -33 118 -34 55 21 33 -23 27 90 -49 33 53 -43
5340 -43 -41 101 77 -15 -1 53 61 -156 -142 -40 -62 -19 -159 100 44 -95 26 -118 -78 -127 -109 39 49 72 53 5 45
5367 45 111 -100 36 -79 33 -9 0 18 10 -126 27 204 -23 -31 -113 -23 -207 66 -15 7 20 40 -4 68 90 -22
5393 -22 -66 98 -25 -35 113 42 47 -58 1 16 77 14 65 -26 107 -20 39 69 -51 -94 146 -115 11 -151 -134
5418 -134 -3 67 59 -210 -19 -120 2 -33 -93 191 -81 -111 -32 41 -18 31 98 31 30 117 73 21 -19 -187 -11 -92
5444 -92 -118 -89 62 -9 -120 -138 -115 22 -13 -39 -66 -34 -77 -77 -70 -9 -39 87 82 122 126 -105 51 30 -119 48 230 -47
5472 -47 -48 136 -18 -6 -19 28 -126 0 -164 96 21 -103 17 3 -25 -104 -19 -135 41 -121 -104 148 161 -6
5496fM6J79k92j42K02N1mo6P1k08J23J32r1j84J57oR0QQ3k83J95N1l84L60N9n6
5522H5p0K2l8L8p4J45l2p5j85L42o8k9p7J11k42J53j32P9nK0J3J12j53J6jL7J12
5549A04l27J98n4j0jQ6m4J83j14j52J01p2J63j19J15K7k11K54j63P4kj3k7j73
5573a77L62k90q4J50m0J66k61J63m2J1J15m4L0J18j86K2m7p1Q6J55j9j45oP5j97
5598a56J51J1n1l5q4J81j84j5O3J18q3O5N0r2m6k3J27k1P8p2j10J11j4M2n0J49
5624A10mJ01j91k8o0J6N0q6K18j44J2o8RJ5J33k12qP9l3n1M0J50j28J6L48l59
5650g5J27j34K69K0j49J31k01O4j04R9l3J0kj10rJ72n4j4J3k4klj50J95j43j5
5676a22P1l2J23j57K00n7j43p5J41R0j11R4j29O2N0n3J48j86L3J35k9q3oO6n0
$$ plain form
5496 -6 40 219 -73 -215 -13 38 34 -32 39 -169 -46 86 -5 -189 -32 -38 52 60 143 -140 55 106 -278 82 141 85
5522 85 15 37 -1 37 -37 108 76 1 -184 158 90 61 -16 95 -147 6 -126 -47 -52 -32 -19 93 -60 -44 -45 -8 104
5549 104 -223 -25 -79 -89 -90 -4 -48 135 21 -131 -30 -102 61 -58 57 84 -127 127 -36 38 36 23 -4 -177
5573 -177 185 -105 -189 -39 -79 87 -174 -11 -53 -42 73 29 59 177 -9 13 -34 -105 -19 136 117 -28 -34 41 -156
5598 -156 -5 6 -45 -80 -164 17 -167 -182 -119 -1 -84 -19 31 -61 -107 -130 -3 -24 54 -18 -128 -17 -31 11 -39 110
5624 110 106 207 16 -12 -72 -56 -6 -92 126 -18 -6 -74 -65 -50 83 -129 -137 -58 -91 -142 -102 48 -80 -64 284 -75
5650 -75 52 -82 187 207 58 189 -12 52 -52 47 14 24 22 -88 -97 75 21 7 20 -4 -6 -9 -159 36 -107 -122
5676 -122 -51 -83 40 -117 83 26 -117 -192 -51 39 -72 22 -107 -45 5 -48 100 -86 -53 82 53 -30 -36 30 -20
5701b0o4P4rP8k06K27j56J49p6m1P8rk6J62l51O2K30k9p5Q2j04j8J7NO4r8P2J06
5729A24k71J62p0q5Mk7M19k90o3J5q7J93m3J24j61J13oq0P9RJMoK4n2l3J16J8
5757A31j91N7qj07J63o9N4j06n6K7m6J48j62J42j01J99J21k33L9L8n9J02q5J07
5781A05p3p3K80m47K46J5J0o7J33O3j80n2N3o4K1o6K62k29R6j6k25K71j01M9M0
5806E1l9N5q4n4J7J03n7k6N6J12k03L3Q4j25Q7Q6J5j38l5K6N1j03P6kmJ9Np3J06
5835C9q9L8J01k47P3J24M7j22K22k68J94n0j66J84j24O1J08k33J47Ol09J55ml1
5859a44J61k69J93N6m0P6j57J55p6J46j17N6M4j79J77P2j82Mm0J24q7L1q7M4J18
5884G9j82k4K9K40k42L7j45Q1K29k27O8l6J6J7K22o9r4o4Q2q6L2J20nM5k30J72
$$ plain form
5701 -20 -84 -10 -19 59 -147 80 -76 73 -3 -44 34 25 -1 161 -190 -128 102 73 -2 80 -24 -42 -25 -20 44 -54 18 124
5729 124 -147 15 -55 -140 -136 -163 256 -34 -97 -82 -169 24 -19 105 -56 57 51 -29 50 59 60 64 58 82 30 -3 113 131
5757 131 -60 -3 -11 -118 45 -24 30 -76 -132 -105 -151 -3 -165 -23 -124 75 196 -37 2 40 -19 83 -2 105
5781 105 32 -41 239 -208 38 53 63 -4 129 192 12 -40 13 -51 -30 -96 166 -63 33 17 -208 63 -38 11 51
5806 51 12 67 -17 -71 -54 49 -8 -34 22 134 -69 -36 48 -77 10 96 111 -27 -62 -36 15 -88 -12 -14 -18 1 6 -67 39
5835 39 -50 -12 89 -158 -85 39 86 -36 186 -82 112 62 -104 80 -44 17 125 -108 39 45 -264 -109 -113 -144
5859 -144 17 -252 -59 -3 -43 33 -124 31 -45 101 -16 40 84 -95 82 154 -28 -24 -64 60 -27 4 -83 -39 79
5884 79 -103 -127 -98 142 -100 -63 -208 -127 102 -125 -57 -93 -77 -60 162 93 -1 -65 17 -69 -37 83 78 123 -107 65
5910F5R0m7o3K5q6K8O9o1k7L9j15qN0k6O1j41J85j09R9k30J26J22j38K31r0p2
5936b3O2J3r9O1K7J36L7l03J95j32q3L30j87K6j22J7L5Nj04M7R8j4j02J03p5Q9
5962C7j00l8J78j97J37P5r1r4J16m8j22R2K39k30J62o7r4n9l9K28r4r4N5o4j22
5987b34K96k82L61j31l6j13J40p6MJ00K4j39K6O3q3K5j0L5n0R2n8J0Q6m7p5N9
6013a3K5N2j86m4M7K24q8j90J66o1Q1J18j49Q5j60K49k16k0j5R1N3j9P5M6j24
6038B7j7R8l6j13K5l9nR1k7j18K55j49N2j59L1n9M4K16j04k31J68j29P6J26N5
6063G8k35J03q5Q1K4K4l0M7k9K8o9oJ0k9K6J06p3m9J72k83J44o9P2j00L84j52
6089I0o2O0l3j36M5m8M4J00K3k64K27L8j43R3J10j83L3J3k06K25J98k53J4M4J2
$$ plain form
5910 65 155 108 45 70 -16 12 81 20 -7 32 -83 -91 -41 -67 -6 -147 38 -71 28 -202 -76 46 -92 139 49 -23
5936 -23 39 52 -47 14 41 177 214 -89 106 -26 -109 221 34 60 -62 -45 -10 -5 -109 -62 36 22 -80 23 -52 37
5962 37 -63 -101 77 -120 17 92 1 -93 23 -25 -147 -55 184 -46 116 49 -45 -104 -143 85 -9 -103 -48 -112 -234
5987 -234 62 -220 141 10 -26 -139 1 -75 -71 29 53 -86 -60 3 -80 -55 -65 -30 -80 12 -46 -36 50 3 -72 -13
6013 -13 12 64 -122 -166 -119 105 17 -173 -7 -68 13 131 -18 67 -93 156 -60 -80 -95 -4 49 30 105 151 27
6038 27 10 108 72 -41 -16 -55 -60 31 4 -114 141 -8 44 -115 -84 -143 -99 117 13 -218 -50 -179 -103 23 78
6063 78 -157 -54 -139 -58 -34 -10 -40 7 -22 6 -63 -69 -59 -88 -62 44 -29 -78 94 -189 -45 -114 -42 -142 242 90
6089 90 28 88 55 -81 -36 -84 -40 60 83 -181 46 84 -59 34 144 -39 -6 7 -199 26 224 -29 -15 29 41
6114D1m3j14J56M1p5r2Q2K5Jrm9J43j0j0j29J15M2k24K79j17j39K11l0k9o9J08
6140A05r6j37Q0n1J93J4j51j31L80k15J24j24n8L0J98j54l2k5l1L33j77J0n3K3
6164E5L8o5j28J43J01j49j52K11m8P1r0J61j97J25j51J79j72j49K72k45J70M4
6186B4%J27j2r9l8J1Q2n9p6N7K6j37J73K2p5kj8k3lk5r1n8K76j17r8J02M1Q3j20
6215b7l0P5m5K1%j63J95P7j28r2P8N9o5J70k73K35n8l2q1j9J14L8p3J12j22q7
6241a21P8P4KQL3j27RJ70j21KJ37j03M4q0KK7Jqn1L9oj37L2J10K4M0p8P6q1j68
6271a73P1P4o4n1K3J39O8l06L46j34k8K5q3L9P7o7oP7m1p2J27j27N4m2J22l32
6297b84L46k1j31kk2O1L7J44o5q6j31L32j98k2O9M9J03l28J29K18l07j01L48k02
$$ plain form
6114 41 -2 -116 40 81 6 -86 -4 21 22 13 -36 107 97 87 -42 73 115 -109 170 53 -86 125 95 66 -3 105
6140 105 9 -128 -48 -99 94 108 -43 -174 206 -9 115 -9 -67 -37 161 7 -25 -50 -81 252 75 85 32 55
6164 55 93 28 -100 43 144 -5 -157 54 6 77 -13 148 -49 76 -75 104 -68 -217 55 -190 -20 24
6186 24 24 151 139 40 2 13 95 36 -40 17 43 -94 79 101 26 24 6 -17 -20 -45 -136 -194 82 -35 -133 -31 10 93 -27
6215 -27 -57 18 -27 -6 -6 -169 26 103 -25 -117 -39 20 -45 125 -148 87 29 -3 -84 -103 11 49 -24 88 -34 -121
6241 -121 -43 31 33 41 74 -53 -44 126 5 7 144 41 85 5 7 34 35 27 -24 15 9 -128 -96 14 38 78 0 76 -5 -173
6271 -173 -102 -28 -92 -143 -120 19 87 -219 127 -7 -35 -10 -93 -54 23 -44 -50 27 -14 -86 41 -86 -32 -74 48 -284
6297 -284 62 41 -90 -92 -114 -53 -16 128 63 -23 -154 178 -20 -42 27 76 179 -149 -20 198 -109 -210 138 -64
6321f4l8J34j18J84k7j46K30j89o0K70j23k52L71k33j44K61j25M3J03j12n9J43
6343D9Om8r5O9oP6jo2p8Q4n1J63k9j11NP1q1J26j40K9O7J19r9j46J38l0j4j8j69
6372a76M1J48j51J4J30l9O2K8Kj20J09q5N8o3J66j68p2K66j10j91R7R8J05j59
6396a0j52J86K05k51jL4q5J28p3j16J88om2j06J26n7P9L8j0k0m2l4PJ35r5m9O0
6423C7k00K22l0QR5k81J23r8J01m4P9k5j17J14l2O9p3KL3P7j47J66p2K9n0l8K6
6450b6N1M9j70m7L08j14j37K08j00M4r0j18M1R9L0l9j11K02j03J16j73pJ14R9
6474A26k04QJ39j2j45J00p7J58l7J1m5q7M2Nj9j2J83m7j36K3n7R0n9k10L26j20
6500e6K07l45K68J8j36J58J3k8o2o4N6l3j2N9j00P7j2N4o2Q0r4k0j93L40n4j73
$$ plain form
6321 -64 -102 32 -86 98 71 -75 155 -34 -94 176 53 -199 172 -61 -205 56 -69 -26 77 -35 -94 49
6343 49 55 7 -88 -19 -25 51 50 -12 -90 -6 -57 106 77 -34 -29 42 -39 87 -53 -24 43 162 63 -83 55 25 11 -7 -176
6372 -176 -135 13 -138 -124 6 -33 29 57 59 -61 48 -37 21 -42 124 -44 -116 150 40 -151 -54 44 149 -10
6396 -10 -162 24 229 -22 -23 11 -74 54 -19 -135 53 47 5 -101 25 -32 47 85 75 55 13 -21 -14 121 26 -23 37
6423 37 -163 59 29 37 132 -149 -26 -124 -23 -67 12 -13 -130 -16 -48 21 -52 -50 -17 60 -87 79 7 36 -14 -52 -26
6450 -26 25 74 -96 -143 165 51 -86 122 22 66 -24 -142 -101 -2 28 -11 -122 80 -23 93 -80 -87 27 126
6474 126 -78 -70 69 57 -88 12 -65 93 56 67 22 -65 -23 -18 -37 -49 134 87 -49 -26 -83 7 -52 -262 64 -56
6500 -56 151 -194 74 92 -44 114 127 99 37 -27 29 -4 -16 43 -57 20 8 62 0 80 -14 -34 -227 113 59 -114
6526a14J38q5J98j21k06K10j00l4J0J11O1k20J50q7R9N3n2O7m0Q7l1r7J17j33
6550a9J06k8j30M8j34K18K3j81q3J98j72RO5J69j31p0O6j13O4N2J09j23k5J83
6574A01K6k42P3N6J60jJj44N2n5k6k4k3P9n5J12j44J6l0K75l00J67k07J24L8J09
6600A38m8k61M07l04J2j6Q4K9k3mMPj25k0K72r9j42J24k7k7J14j05j2PJ6k63J83
6627g9J55k45K01J47k86L17j85j48P9MMM0J46j37O0j86K0R2j41L9K03p7j49p2
6651a98K29pj36K29j80J1J3PO5l6k4rJ10l7n6L0O6j21N0m9J4N3J60j81K9j38%
6678a06O7l4r0J66l5J91k75L8Q3o8LJ21r9j8N8k01K45j80N2r3L75k66J14M7j29
6703c4L3O2j5l1M4j59J6j4K37k07R4K4k6oN3L5j35O2j58R4J28k7k1l6r6j1J11
$$ plain form
6526 -114 24 -61 137 16 -190 20 -80 -114 -104 7 68 -152 -2 -89 10 63 11 78 38 125 94 -3 114 -19
6550 -19 87 59 -71 -23 -157 61 84 -97 -180 18 -154 -145 -80 89 -42 -112 -46 -159 -95 -43 66 -57 -82 101
6574 101 127 -115 -42 14 174 173 174 30 82 27 1 -23 -46 33 -22 90 -54 -38 -68 207 -93 74 -133 -9 29 138
6600 138 90 -171 236 -68 -56 -72 12 41 18 14 18 25 -100 -120 152 53 -89 35 8 -19 95 -10 -22 -15 1 -262 -79
6627 -79 76 -169 32 179 -107 210 25 -123 -44 -40 -36 4 150 13 73 -113 -93 -1 -142 -103 100 23 -126 -198
6651 -198 31 24 -112 117 -63 -52 -39 -32 33 -3 -27 -36 74 37 -19 11 77 -44 6 -43 -29 24 184 3 32 -106 -106
6678 -106 -39 -73 -163 3 -32 159 -116 -78 5 -63 -60 61 -38 -56 2 -199 46 -134 -82 -175 200 -66 48 95 -34
6703 -34 -1 61 46 15 59 -100 -84 -98 139 -68 26 50 24 18 71 106 -29 33 -125 -31 97 70 49 13 -83 -94 17
6730A7j02r5K18J02j3k32L7L0L3P4n9P3j52J4J0J24j69K68k14N4K18k79O6K9R8
6755A50j94l3r5K3J65j4J21o2j8o7m9mj9M1m6P6q4o4L03p9N9l78L30qp4q6J11
6782Ej10K74l07M2M9j9n0J88j42J91q2j05K3O9R2j45k9M1P5m1kMN2p5lJ6j00J14
6810B5M1j17J28J04l18j6K00m1J7N0k08P3o2L2J18r9J98k89L22j19j91P0p9K36
6834G5q3J44j10P5jj11q6L6J1J90k42Q2k9J50l58K12M6o2Q0k63L42n6o7Q5j7M1
6860H4p1j18R6j9Q1j78J26O1R7m5j11J71r0K6m5j04J36j36N7K4k24K04j35oJ40
6885B1P0j76j05K22r1O8r1L8mn4P6R9M2r5R3p9L1o4q9J14k9k45J95J25j50l3Q4
6912b7j2J39J8N0l94K48j02J41L5j78J34n6r9J58j72R1J49k83J33M6j99P3P9R2
$$ plain form
6730 17 -85 -180 38 140 127 -105 -68 -38 -5 69 10 83 -69 -55 -45 79 -90 178 -36 18 236 -43 23 52 150
6755 150 -44 -77 -172 -149 16 2 123 61 43 -24 -73 -77 -96 -55 -101 -25 -109 -173 130 51 110 -268 62 54 -20 -106 5
6782 5 -105 169 -138 -96 -47 -66 -116 72 -70 121 39 -66 -43 26 118 -27 -56 -15 60 19 17 21 73 -2 -5 11 -89 25
6810 25 66 -51 77 181 -137 -153 47 6 23 73 -135 -62 -124 -92 26 -73 125 -164 158 39 -152 -82 -161 75
6834 75 -8 136 26 101 100 -11 -97 -61 -50 140 -102 -20 -49 101 -257 -45 1 -61 19 -244 98 42 -25 60 43 84
6860 84 13 -105 -9 -28 53 -125 1 62 159 114 3 174 84 110 65 -39 97 -39 18 42 -182 22 -113 -119 21
6885 21 91 -85 -190 32 -59 9 -82 -44 -48 -102 -26 73 115 20 113 34 65 1 -88 26 -3 -248 -53 72 -78 -111 -27
6912 -27 -39 100 118 168 -226 22 -80 61 96 -82 52 -4 -103 55 -117 -26 123 -160 -27 19 -180 -107 -28 64
6936F4j67J48M2k8L3j01M9j29O5p5N0J11j04J21k22J92r0n9L25k21J4K9rL4j31
6961e9J1m7O9j6J90o4j95J06j38K31j83R1j11J06l6j6j30J51j19K75O5l24R2L
6985d8J63j21K42j92j03j7K28K9j26j39J54k47J40k6m1J37j9O2k75K77Jj47NL9
7009b4N6K0JK9k7JJ9j31J17K7j97J26j08J34o0k2J2N2J48k89J01L3j01m1o1K91
7035A06j08J20k63R1j46L67j37J53j42n1K8N3o5j34K06q5N3j43l1J76O8l1q3P6
7059G8q9o4J3J04N1k12L7Q0J4j36J36J6l0j02P7L7J30k54K37j25m2j36J58J52
7083A30j86o1L2K27k41J87j03oqK3oL0j7J1Kl8K1R6L2j05n4O0j6p7lK0N8R1j07
7112hl1O8jk7J9P5Pk03K2J13L1n1m0N3l7J18k4j21p2J47NonJ3j20J46k99L12j24
$$ plain form
6936 64 -103 45 87 59 92 -9 40 -89 -24 -99 -49 62 -42 79 -143 49 -41 -100 225 4 18 47 38 72 -59
6961 -59 -48 -95 -26 -42 148 84 -111 -5 -143 88 -95 -4 -115 -9 -45 -61 -191 -40 -159 116 181 -143 -51 -48
6985 -48 115 -6 236 44 -59 -76 152 181 55 -84 70 -177 -37 -63 -104 33 14 76 -199 78 79 -68 -63 -24
7009 -24 32 52 53 82 55 56 75 -56 61 88 -109 17 -91 43 -17 -39 -27 25 173 -116 -15 18 -83 -124 -185 106
7035 106 -2 118 -145 -54 -200 167 30 183 41 -10 18 71 6 -128 78 -7 46 -97 -128 48 116 85 2 78
7059 78 -11 -75 -62 42 93 -119 -82 -2 12 -124 12 28 -2 -104 -27 10 140 -114 123 -2 -44 -180 -22 130
7083 130 -56 -117 -85 142 -99 88 -15 -21 -29 -6 -12 18 1 12 14 -24 -3 93 125 20 -34 26 10 -67 -70 -50 8 99 -8
7112 -8 -39 29 28 1 20 95 102 -101 -79 34 65 14 -26 27 -10 108 84 -37 -109 38 43 37 32 45 -75 71 -228 84 -40
7141d0j6M4J12k9q9j39L42k46n0J33o2J99j63M1qj35J48j29M5J56R9k27M6L2Q6
7166A50r6N0o3M9J7l9J03j70K0j08J19k04K92k54M2k9J89m2j94J44N3J03k4j83
7190g5m7Q7o9J03P2m0j60J12N3J19j35j35P8K16k17N2RrO3j1j01k1l7Q%N5J5O4
7218D9m7M9o7K0p2rK32k02O4Lk22J52J17j43J29l6O9j27M1K4J54k09K7m8J16j8
7244D6m6j6R4k09K14j81J10r2M4O6n0Q6M1j61jK78k02j07K08k25R9K21k32n8N8
7269a5l7P7R5j71Q3l0k2J12k06J22j18R5K0J8O0n9k3M2n3nPl3J21q2p1j82K53
7296bJ3P0k01r5J27K14m4j72O9r9Q7J31j71J27N6Nm2j35J37j77l2J76k9m9n9n8
7322a53K65j67J04J84j42p0j30K76l62K49q2Q4K4j42K3J2L6M0n5J02r2K9p5Q4
$$ plain form
7141 -40 -56 -12 100 71 -18 -157 185 -61 -111 22 -40 159 -4 37 29 -106 42 -87 -42 114 213 -14 32 64 150
7166 150 54 104 41 90 107 68 171 1 21 -87 32 -172 120 -134 -92 -121 68 26 -168 -24 29 132 108 -75
7190 -75 -122 -35 -104 -1 71 31 -129 -17 36 155 20 -115 -37 179 -38 14 23 14 77 66 -35 -56 -93 -85 -85 -30 -15 49
7218 49 2 51 -16 4 -68 -77 155 -47 17 20 -202 -50 67 -76 53 17 86 -41 0 24 178 -31 -4 -52 64 46
7244 46 0 -16 78 -131 83 -98 12 -80 -36 30 -20 66 107 -54 -55 223 21 -86 122 -103 -4 217 -15 -73 -15
7269 -15 -52 25 120 -51 32 2 -20 92 -114 8 -110 -15 5 23 83 24 1 43 -10 -15 -8 -41 80 -2 -73 -255 -2
7296 -2 11 81 -120 -215 -88 126 82 -90 -21 -120 -33 98 -73 54 110 115 73 -62 75 -102 -134 42 13 -36 -95 -153
7322 -153 112 -55 49 233 91 21 -109 167 -195 54 -28 56 80 -62 -39 -27 9 49 -6 96 4 33 -42 42
7346D2K2N5j81J89l14J51J53j02rj40P8K2j41K36M0r0j3kN1n0r7J56o7L0j04J47
7372F2l7n8k4k0P7k9J23j10j7N0M7k30K23pj39J4K07l1k9j07P1J5j34Q7l0L2O2
7399F8n8M3j09J06J1j2r7r2J89l2q5J5J60Ok07J25j56J24p8J78k32K15n3j50Q2
7424c9j4J86j84N8j10J60j08K35k23j32J48M9j32J58k9l7K2Kk1J53j43K0L4N0
7448A03j45N7m6L2p2O1K5K5q4N7M4j42O2Q6j14J39j11k9q3J36J2p3j1J56j15q3
7474a13P9J7j1J31J0k50L2L1J71p6k45K69k02K03K0N7l2q0O1J4j49L3j8J01J25
7499A78o4p7j40K53m4q7m0O4l4O3j16J15L9j3j71N3j04J22m3N4l6p9N5P5L6Pk62
7526a96K49Oj71pQ9j35J15J65j41q1pJ40j13J99r3J3j86J43RR2m5M6J0j5J01k99
$$ plain form
7346 42 64 119 -62 127 -187 -36 117 15 6 -134 -56 -34 -175 61 101 11 -2 -4 47 -3 -100 56 -11 19 -85 62
7372 62 25 -33 -57 -77 0 -29 94 -16 -33 17 64 -166 57 50 -89 -75 132 101 72 -35 36 51 -83 4 -26 6 68
7399 68 10 53 -56 50 61 49 -48 -140 49 17 -68 -53 107 113 -94 31 -125 -1 -79 99 -133 82 29 -121 -39
7424 -39 -53 133 -51 7 -103 57 -51 184 -39 -171 -23 26 -106 52 23 -14 8 10 -11 142 -1 19 53 103
7448 103 -42 15 -31 1 -71 -10 15 40 -44 13 57 -85 -23 63 -51 88 -23 -52 -135 1 13 -60 -71 85 -30 -113
7474 -113 -34 -17 -28 103 113 -137 -105 -74 97 21 -224 45 -157 46 66 123 91 11 72 86 -63 -30 -48 53 178
7499 178 114 37 -103 150 106 19 -21 43 9 72 -44 71 110 97 -74 -21 -125 -3 -46 8 -28 -107 -52 23 59 66 -196
7526 -196 53 59 -112 -119 -30 -165 -50 115 -26 -107 -114 26 -87 112 19 32 -154 -11 -2 90 45 91 101 86 187 -112
7552a12K34L9j14L9J17k44Q0N4Rj73q2K25j86N6R2K3q1M6L6MJj17J66o8O7j71
7578f0J48o6q2J00O1p5j16LOK27k17K23j75J20j1m0j2k3J54j04k22J84n6J40j76
7603f9J34o7j01K53m1l1j49j53J64J00o5O6p0P0L3k4M3K5k04J22N3j41N0l8o3
7628a03J4R0j25J53k3l0m6J7J33n7J6k33K19Q1o0j11K72j16J4q7r9K0K7J22j24
7653c6N8J01l1j61P4j13K94l67J19J25k01K29Jp6j35J82p0n6l5J82j86N2j15L6
7677a29R4R4n4OP1j77j38K05O2j21J90j44J32j63Q2N4k07L5J55j41J22NJ02l25
7701a90K36j08m8Q9K04K3k25N2q2Q4j26J51o5n8J34L3k6J0j25O8j43JJ96p9P3
7726G9k1nj56J09L8j92L7J17K0j71J76r7Q4J08j41J3k5j30J86OR2l0nNp9j41J4
$$ plain form
7552 -112 122 161 47 86 203 -41 39 93 102 -71 -153 72 -114 -58 34 57 -24 22 58 62 63 -54 112 44 111 -60
7578 -60 88 22 -60 40 101 26 -90 -87 -81 146 -71 152 -23 97 86 46 34 11 165 61 -161 23 -33 107 -69
7603 -69 65 -2 -103 150 109 78 -71 -224 -60 40 -25 41 -29 41 74 50 93 118 -86 36 89 -52 -2 -40 -103
7628 -103 -89 1 -124 29 6 -24 -70 -53 80 23 39 -194 25 106 46 -65 207 91 105 18 -81 -61 -34 88 -36
7653 -36 22 123 92 -69 5 -108 186 -181 -62 63 -138 91 92 16 -119 63 -7 -63 -98 84 -102 -50 -165 -129
7677 -129 -35 59 5 11 82 -95 -233 -28 34 -87 103 -41 91 -72 10 64 -143 -108 47 -94 28 33 135 -190
7701 -190 46 -62 -110 -21 183 206 -19 33 -49 35 -91 60 -5 -63 71 104 78 88 -37 31 -112 -111 85 6 79
7726 79 58 53 -103 6 44 -148 -111 6 26 -145 31 -66 18 126 -15 -2 -27 -157 29 35 127 97 92 97 18 -123 -109
7753a09J22P3j26J33j33nl1J38j31L6J02j09J8j79K48P3j45k8l6L3J06q6j17J81
7777B8r8K90k60o2J9N6J31r5M9j58J87j45Q3k0j22K73k47P9j18Q9k4N1J88k50
7801g6J31%O1k48K05q3N5k17J76q8J74k09R2l5j25J81j08K44q6j36pK25j32j7
7825b3q1K28j36O7p7J25r7N5k06N8m8K50o1l31L57k01K15l5m5l2J8Q8oOk90Q2
7851a20J04j1L3j04J09l9K12k01J00k38O3J15j23O2k3k6J07r1J8R1J00k6k84L82
7875B10k34j10J64j44J5J42p4Mm0J37k8L1l5Q7j77M7P2K1r6M5j37p3K10N5n1K4
7901F5p8j19K03j02k02K92j80LN2p0J06q2Q3O2j04P4J16j37J26j82j17K75j7r5
7925b8n6Q4L9o8j42L14k6j60L6N5K7j32P8k7p5j6J91K2j60M7q6qK16j68P7m1J08
$$ plain form
7753 -109 13 86 -40 93 -40 -45 -76 62 -69 -33 69 -40 -22 -201 47 120 -25 -53 -89 -56 50 -36 -153 28
7777 28 -70 220 -40 -102 -83 -27 104 9 58 -100 87 -58 25 5 -117 156 -91 -12 -130 -41 -65 -14 174 -76
7801 -76 55 55 116 -132 73 -10 45 -172 4 -84 90 -119 -27 -62 -187 -6 -114 130 44 -92 -99 126 -6 -23
7825 -23 -104 124 -12 55 -22 103 6 61 -145 -87 -135 115 54 -277 80 -121 94 59 14 -18 0 88 82 88 -202 -120
7851 -120 -16 -27 6 -98 11 -28 184 -17 83 -155 -92 23 -100 -38 -61 -87 20 -71 -53 38 138 112 -172 210
7875 210 -24 -134 30 -114 -99 43 -31 -27 -67 70 42 73 38 125 -52 -5 67 88 -8 37 -100 -173 37 92 41 65
7901 65 -13 -132 71 -31 -233 59 -121 -118 -66 -136 -30 -112 -29 33 -71 3 119 -18 108 -74 -191 84 67 -28
7925 -28 -84 0 39 -29 -171 143 117 -43 -7 48 75 -57 21 -6 -81 -97 94 116 -44 3 -83 -91 125 -43 34 -7 101
7952A01j08n0J45k9Pk77J66P1K8p7J3j1J51k22L5PL7O2j00P6p3P3Q1l4l7J18j77
7979b4kN1j4N1j5j27O1RJ54m28L04m3j5J08J06j07j62M5Q5qj61Q7J02o6O0K6O4
8006A41n8j77K34k41K1J03P0j12P8j85J74q1n4Q9R4k27J30K9J5k7J09j24n8l1
8030h8J84N4n6j59RJ11j35L4J22j9o7j25R2R6j57J30Q4j69P6j0m1j0L5N5j63K44
8056A27m6k34J92K0J83j95j47QL9k7J13j95K01j58J80j7Op1n0L35k46J3n2R8j81
8081a04M2k0Q3P9j03J10o6R5j3k11J12K19k79Q7j05N5M1J81k62L7J67j62j8J79
8105A44k87J61n4O4j24J72P7k24M0N3j91M5K72l10K18k07J6J04J28o6J51o4j88
8128g0J25Qj48j1N1k2j9J12rK83k30j95J94m2nJ11j78Q9m0Q6j98J97q9N7jK6M0
$$ plain form
7952 101 -7 -57 88 59 66 -211 -45 26 54 -23 -10 -21 130 -92 -57 -50 -13 49 -51 25 -48 25 106 72 35 153 -24
7979 -24 -26 25 11 62 47 -80 -19 -10 144 -284 20 -23 -38 70 176 69 -93 -48 37 29 -132 -45 57 -9 51 77 141
8006 141 83 -94 140 -101 -80 23 93 -19 59 -126 48 -33 -87 2 96 -131 -1 28 43 16 125 1 -57 -88
8030 -88 96 150 94 -65 -56 55 -80 -46 76 57 -10 -135 -43 53 -104 26 110 -59 17 7 -34 -44 -9 46 -117 127
8056 127 81 -153 39 59 242 47 -100 -92 -53 -80 33 -162 39 -119 61 44 50 -21 -71 264 18 31 -21 77 -104
8081 -104 -62 -82 1 80 -23 87 21 116 103 -108 4 223 -56 31 -74 -19 22 203 -59 -22 145 -17 -35 144
8105 144 -143 18 -36 28 -96 76 153 -71 -31 22 -169 -124 148 -162 56 -151 -135 -31 97 31 182 118 -70
8128 -70 55 63 -85 -96 -45 -67 -86 26 17 300 70 -125 69 27 22 133 -45 44 4 90 -108 89 0 57 56 82 122
8155A22j0j42j4J56j55O7Pl9j23k5K92j28k4M7q4p8J27K8m0r1Ll3j1O9J08J42
8181A71k39J72q3n0j18K59l8j43Q2n8
$$ plain form
8155 122 112 -30 -44 112 -43 24 31 -8 -131 -156 136 8 -16 31 -53 -131 -4 24 -16 -107 -104 -137 -148 -79 29 171
8181 171 -68 104 21 -29 -147 112 74 -69 13 -45
8191d5
$$ Imaginary data points
##PAGE= N=2
##DATA TABLE= (X++(I..I)), XYDATA
0@%%%%%%Qq%%Qj6J6j6K4l2M0m8N6o8Q0r2J07j27J48j72K00k32K64l02L45l90M41
33B34m98N60o29P05p87Q80r79J083j199J327j467J622j790J970k172K391k631
50a380K900l197L526l891M308m782N324n954O697p591Q680j0043J1804j4168J7511
65I744k2568L1015m7484R0286l92461p34121J365073L88845j118262Q8254O89092
76C47413m65243j60310N46529k46863m10770M45832K40817l70530j90398K10328
86e3195J95355j16949k20077J11574J89965j36568r2397K23870m0659k57942K54146
97E7123K30050m18123n5420M57943j50242l64454K43688J72975k30446J4182J96113
108A53389j23232j29420J82309M3643j85373M2310J59645o9584j73538p983J94933
$$ plain form
0 0 0 0 0 0 0 0 8 0 0 0 8 -8 8 -8 16 -16 24 -24 32 -36 44 -48 59 -68 80 -92 108 -124 140 -162 183 -207 234
33 234 -264 296 -333 372 -415 465 -514 569 -630 697 -770 852 -938 1032 -1140 1251 -1380
50 -1380 1520 -1677 1849 -2042 2266 -2516 2808 -3146 3551 -4040 4640 -5403 6401 -7767 9744
65 9744 -12824 18191 -29293 60993 -331468 -1065589 299484 688329 -429933 -341679 347413
76 347413 -117830 -278140 268389 21526 -389244 56588 297405 -73125 -263523 -53195
86 -53195 142160 25211 -194866 -83292 106673 -29895 -122292 101578 60919 -197023 57123
97 57123 287173 -130950 -186370 271573 121331 -243123 565 173540 -56906 -42724 153389
108 153389 30157 -99263 83046 126689 -58684 -16374 143271 73687 -99851 -107834 87099
119H7099N5553k47139n5784K57309J3981k28541J7519J73544m4939j10563P6592
130e369L5681r0236M4672O8832j05523m7400J04506L4547o9451k2813L6339L72
142a5843R53M7614k2254o4087N6097P2245o4647p8852M1322P0757k0619m8763
154b6077J5131K0572j880J7367k219k9267J5312M3804j1730n5344K514N6145j1906
167C2422n7527K2949M9119k8416l5465K8845J6535l9950n098N2671l723n9778
179b7416j491M0974K16k9209j4937J0294J5600j830j4530j5068M747L1679J0287
192I316l0558j2664L1146J8392k9080j7789K6833N743j6984J8030Q922k9198P669
205a0222M2134n027l4704J1540L3327j6281k6137J4413P261j3233N614O801j5096
$$ plain form
119 87099 142652 -104487 -160271 97038 111019 -117522 -100003 73541 28602 -81961 -5369
130 -5369 30312 -59924 -15252 53580 -51943 -99343 5163 39710 -29741 -52554 -16215 -15843
142 -15843 -14890 32724 10470 -53617 2480 74725 10078 -68774 -27452 43305 22686 -26077
154 -26077 -10946 9626 7746 25113 22894 -6373 8939 52743 41013 -14331 -11817 44328 32422
167 32422 -25105 -2156 46963 18547 -16918 11927 28462 -11488 -16586 36085 32362 -27416
179 -27416 -28907 12067 12283 -16926 -31863 -21569 -5969 -7799 -22329 -37397 -32650 -971 9316
192 9316 -21242 -33906 -2760 15632 -13448 -31237 -4404 1339 -15645 2385 11307 -17891 -10222
205 -10222 31912 26885 -7819 3721 37048 20767 -5370 9043 16304 3071 8685 15486 390
218C90p758K0188J0578k8589q805L4236J630l5226K513K8478q455k5535J2225
231d130J7848j8795p390J8701o572j2438J4988N856j6066j043J7743k737k0163
244a4198M557J4411q973q571N865p65o738P182J2147j2404j4421K0713J5534k1351
258g012j0544K0160P797j4060q92J0089l447O52J1719o407j1318J2324J1234j2387
272G908r570J2245O296j2108m331Q506P4p201J273M722o926n749R249J569j2507
287f550l07Q039l346m840L334k58m430O047K974j0346Q11J0778k872o378J175
302f169K010J926p87m794J454P463j426q292N443R330p576k997Q556j808n833
317c500N039M909m921n680O930P089p556k682J0969J667j0591L074J1091q686
$$ plain form
218 390 -7368 12820 23398 -5191 -13996 20240 21870 -13356 -10843 17635 9180 -16355 -4130
231 -4130 13718 -5077 -12467 6234 -338 -12776 2212 8068 -7998 -9041 8702 5965 -14198
244 -14198 -9641 4770 -4203 -12774 -6909 -7674 -14412 -7230 4917 -7487 -21908 -1195 14339 -7012
258 -7012 -17556 2604 10401 -3659 -4551 5538 2091 2743 14462 8055 -3263 9061 20295 7908
272 7908 -1662 10583 16879 4771 440 8946 9020 1819 3092 7814 888 -4861 4388 5957 -6550
287 -6550 -6857 1182 -2164 -7004 -3670 -3928 -8358 -2311 663 -9683 -8872 1906 -966 -7344 -6169
302 -6169 -4159 -2233 -3020 -7814 -6360 1103 -323 -8615 -3172 6158 -1418 -4415 4141 2333 -3500
317 -3500 1539 6448 1527 -4153 2777 9866 2310 -372 10597 12264 1673 4747 15838 7152
331G152q486J5404j722k1377P532J3830j5366o575J5117k656j3297P736P235r754
345e227K160P568j0010m923Q017r48o397n6L858L388k303l177O672O687m990j181
361h62Q492m300p627J0094J581j4170M494Q820q885j186Q924n970m217J1744j591
376E341j2148Q493P739j2039p59Q248o589j504R249n420p680R311N699o892J088
391B137M778l383L172N064r882m680J0002m90r597N91M46m736N990O250j1768
406f106n364J4539J286j3560J365O257n205j211L824n435k227J0189J334q006
420h320N000P744l943N38M381k427J081L163l765K85N303n791n233J0060R49j3414
436d389M518J0797q615k270R217o666o012J1854j37j5522J429Q960o004l346L562
$$ plain form
331 7152 -1334 14070 12348 -9029 -1497 12333 -3033 -9608 5509 2853 -10444 -2708 4527 -5227
345 -5227 -3067 4501 -5509 -10432 -2415 -3363 -9760 -9816 -5958 -2570 -4873 -8050 -1378 5309 319 -862
361 -862 7630 3330 -4297 5797 7378 -6792 -2298 6522 -2363 -3549 5375 -595 -4812 6932 5341
376 5341 -6807 1686 9425 -2614 -3373 4875 -1714 -3218 6031 611 -7069 2242 7941 1049 2137
391 2137 6915 3532 6704 11768 1886 -2794 7208 6718 -2879 -2288 -1842 -6578 -588 5662 -6106
406 -6106 -11470 3069 4355 -9205 -7840 -1583 -6788 -7999 -4175 -9610 -11837 -1648 -314 -8320
420 -8320 -3320 4424 481 1019 5400 2973 4054 7217 3452 3737 9040 3249 -1984 8076 9025 -4389
436 -4389 129 10926 2311 41 9258 2592 -3420 8434 8297 -7225 -5796 3164 -2840 -6186 -2624
451b624o360K665J4107n516j2512P730J0152l443n373m032j245Q481K755j3662
465h877l671J2969J877m252P92n387J567J4416l736j8151O513J6884p507j1147
479g710O905K944l705M990j77o290N034N545k412n60q98k495O289M995j1789o594
495e928J1106R88j0386K625L459m891K716L741n438j649M663j769k707K502m354
510e322n035Q346L392r270N92Q075J08p35J879k645j675N600K699o104l483K965
526f13L801J682o551n895R925P418r797p254P653N128m555j638J741k249O43M088
542C527k782m144R17L167K270j971l457K940M905n45m301J038L788k818k701K137
558A970p52l891n37K729J958k731l147J705L729m22m367j080L681M7k258M10m60
$$ plain form
451 -2624 -8984 -6319 7788 2272 -10240 -2510 7642 4199 -1174 -5206 -6451 2030 4785 -8877
465 -8877 -12548 421 2298 -1954 -1162 -6549 -4982 9434 5698 -12453 -5940 10944 3437 -7710
479 -7710 -805 2139 -1566 3424 3247 -3043 1991 7536 5124 4564 3666 1171 7460 12455 666 -5928
495 -5928 5178 6166 -4220 -1595 1864 -3027 -311 3430 -2008 -3657 1006 -763 -3470 -968 -5322
510 -5322 -10357 -2011 1381 -7889 -7297 778 886 151 2030 -615 -2290 3310 6009 -95 -3578 -613
526 -613 3188 4870 -1681 -7576 2349 9767 -30 -7284 369 5497 942 -696 1045 -1204 -561 3527
542 3527 745 -3399 -2482 685 2955 984 -2473 467 5372 4827 526 1564 5352 2534 -167 1970
558 1970 1218 -2673 -3210 -481 1477 -1254 -4401 -2696 1033 611 -3756 -4836 -1155 -1108 -3366 -2956 -3416
575c416l48L300K701l704l532N282O181l708n881J606O937J685o179l365M817
590B376L465l344l662j81J907K072n8n029l308O341N399o373o215L610O118r83
606B135o141j307M829L566j785l904J284M734N22k427j708P74K010q0k182n91
622b71J13M47J077o3k513j262L196Q89m636j078L238m39j860J99K50O61L95k7
640a684M4P26J237j7j64J270Q24J29j248n82L484J481n330j705N017J538m933
657H7k138K933J299q48j274k280N59L155j481l550MK171P65j234p69N56M55J247
675c43J280n60j502j95L279J602m329j554M468J772k913k238Q92K185J84j493
691E35j839l34K925l70l297l37K427M60k143o40K631k80k011J656J978r38j182
$$ plain form
575 -3416 -3764 -464 2237 -1467 -4999 283 6464 2756 -3125 -1519 5418 7103 924 -2441 2376
590 2376 5841 2497 -1165 -1346 561 2633 2575 -2454 -5762 579 5978 -395 -6610 -3000 3118 2135
606 2135 -4006 -5313 -484 3082 1297 -2607 -1323 3411 3933 1506 -202 572 2582 2502 320 -271
622 -271 -158 289 1366 1303 -1210 -2472 724 1613 -3023 -4101 -863 -1302 -3162 -2963 -2713 -2052 -1657 -1684
640 -1684 -1640 -914 323 306 142 1412 2236 2365 1117 535 4019 5500 170 -1535 3482 5020 87
657 87 -2051 882 2181 1333 59 -2221 -1662 1493 12 -3538 -3534 -1363 -598 -1832 -2601 -2045 -1590 -343
675 -343 937 377 -1125 -1320 1959 3561 -768 -2322 2146 3918 1005 -1233 -341 1844 2028 535
691 535 -1304 -1638 1287 917 -2380 -2717 -290 170 -1973 -2613 18 -262 -2273 -617 1361 423 -759
708g59J130J936j019j071M05M14P99n26j396M50P67l03l57l22L10N19j047r05
726i75P87M60j801j695K748J001k926j20K087K69k01j16N62O15P36l91j138R91
744H93J001j371l1Q82j181l46P85l99j93n00n87M9J032p91k438J291K290k518
762b132q80K364k6n87P74K98n15J439J038j494n4J929n22j117J847J57j460O60
780A719L1j36Kn37j161N19N65j914q65J424q68j333J251n25j195J299M70j279
798b533O43J671j189j92K631m63k307K072J489j539K80R92m70PQ38j80q04O87
816A633m2j003K04m93r38R92m11j475Q17O69j057L77O59q14o81J827J92k221J124
835f41J647j084l65R72kK2L23j19n89J92M80o30j21J1p70qL53q21o0L21q35K18
$$ plain form
708 -759 371 2307 1288 217 622 1036 1835 1309 -87 363 1130 827 470 148 458 977 -70 -975
726 -975 -188 272 -1529 -3224 -476 525 -2401 -2521 -434 -165 -366 -482 80 695 1431 1040 -98 893
744 893 1894 523 492 1374 193 -153 632 233 40 -460 -1047 -998 34 -757 -3195 -1904 386 -2132
762 -2132 -3012 -648 -674 -1261 -487 -189 -704 735 1773 279 225 2154 1632 515 2362 2519 1059 1719
780 1719 1750 1614 1616 1079 -82 437 1002 -912 -1777 -353 -1221 -2554 -1303 -1828 -3023 -1724 -1254 -2533
798 -2533 -1890 -219 -1408 -1600 1031 568 -1739 333 1822 283 563 1555 1085 1092 1930 1750 946 1633
816 1633 1591 588 792 299 -639 353 -58 -1533 -716 -47 -1104 -727 -68 -882 -1563 264 456 -1765 -641
835 -641 1006 -78 -443 529 527 549 872 753 164 356 836 206 85 96 -674 -682 -329 -1150 -1210 -889 -1724 -1506
857a506R34l58o52J257R06r40J99J134o57j08J434o21r99J021Q94j52n37J64O
876A419K41K59r93j010N06k71q66jq46m51R47k2j211l7J307j06q85O31L44j44
896a189J083J09n60O76L99J21L21O6j19M83P98n24r83Q26K37o87M31o91j702Q02
916a03R76j635r67R57N56n76j23K07p95Q42R47q98n34M88L98N68k4j006R13J395
936A586k94j262P93P98p97J19L18j532J35J035q96p62K47K74n07J3j14o64N79
955i31J112r84P7N04l71J57P12R6l23l42O72M14m10J42L9N72O49j253k80Q11r5
976I68p83O3m51o46k3P86m68j292J119R27n84m49JP68O90p58n46N94J009k32q46
997a53N08N13k40O31m84j002N20J081n93q54M8L29m28r6m50o74N74L69j061J12
$$ plain form
857 -1506 -572 -930 -1582 -325 581 -359 -160 974 317 209 1643 1022 23 1044 1938 1786 1249 1413 1419
876 1419 1660 1919 926 -84 422 151 -715 -716 -1562 -2013 -1066 -1088 -2299 -2336 -1029 -1135 -2020 -1389 -1045 -1189
896 -1189 -106 3 -557 119 518 639 960 1026 907 1390 2188 1664 681 1507 1744 1057 1488 797 -905 -103
916 -103 873 -762 -1729 -772 -216 -792 -915 -708 -1503 -661 286 -612 -1146 -658 -260 308 284 -722 191 1586
936 1586 1292 30 823 1621 824 943 1261 -271 -136 899 3 -759 -512 -238 -745 -732 -846 -1510 -931
955 -931 181 -803 -726 -222 -593 -436 276 372 49 -293 379 793 383 525 564 1136 1785 532 252 1063 968
976 968 185 248 -203 -849 -872 -86 -554 -1846 -727 200 -384 -833 -832 -64 626 -132 -678 -84 925 693 -153
997 -153 355 868 628 1259 775 -227 293 1374 781 -73 -25 304 -124 -220 -670 -1344 -770 -401 -1462 -1350
1017a350O86m24L00L96K27k36J94R00j42o15L72O37J98l84j93N46K02n33J37K46
1037A164m85n06J41M49r75r46P78L28m90o41m10L43P70j63n56k69P91R24l53l10
1057d16K18Q01P75o10m60N66M79om47k37L97M0l45l16j96r7m1j30j91n59m60L18
1079i17L77k26q05j0J107j16o89M31L22L32K06O7J24k01M60N78r8k32q6J48M66
1100A238m96l11J31j98L46N6o37o25K39O48o26j128L38P97l30k13l44J56P54J85
1120b0k90j43P22L39l48K37M14o52O1L49l00j06l39N3K40r8l18k41K21K40k68
1141b47l85J19l04J67Q9m40M4L12k5O9J44N47P0J41Q25J21o97P01M3k5j46n11
1163F12k11L89m2n92k74K50K75n04Q8l65q5M82o67j42l6j80l98K48N04l45k57
$$ plain form
1017 -1350 -664 -1088 -788 -392 -165 -401 -207 693 551 -64 308 945 1143 759 566 1112 1314 781 918 1164
1037 1164 679 173 314 763 -212 -1158 -380 -52 -542 -1183 -1593 -1250 -480 -643 -1199 -1468 -677 247 -106 -416
1057 -416 -198 603 1378 768 308 874 1353 1347 900 663 1060 1100 755 439 243 146 105 -25 -216 -775 -1235 -917
1079 -917 -540 -766 -1571 -1581 -474 -590 -1279 -848 -526 -194 12 79 203 2 462 1040 942 710 624 772 1238
1100 1238 742 431 562 364 710 766 129 -496 -257 391 -235 -1363 -1025 -228 -558 -771 -1115 -959 -205 -20
1120 -20 -310 -453 269 608 260 497 911 259 320 669 369 263 -76 -23 217 119 -199 -440 -219 21 -247
1141 -247 -632 -513 -817 -650 -561 -1001 -957 -645 -670 -601 -457 90 160 301 1126 1247 550 1251 1294 1269 1123 612
1163 612 401 790 748 156 -118 132 407 -97 -9 -374 -459 23 -644 -786 -822 -1002 -1400 -1152 -648 -993 -1250
1184a250Q18M44j39K62q2M1Q24k8p57L1K45J04l00k08K44j19L09k54j48N01l40
1205A98j94M26m98n99L80Q3J2k80J09J33K44L60r9j88P63K02n57p8j17qN3j89
1227A56l32k28J42p3k17N3K15j93K0L45m24J50k86K84M2k34o8J37N86j43j70N36
1249B98N32k32L08P9j07J72o5j27j8l61j84l09n4J82k63k23q2k9k4j3j14r2P7
1272f49J1k60j33L68k6r4L24K27J37N64J65kL66N6j32J3Pj61l40K92q0m75p4J60
1296B64k16k22j27r3J02j99l6k95J96k05j19K66q1n2K28N1K36M35PJ45K67K96
1318H48Rl37J79J94m08M2P3k38j63L9j98ol3R2k75k02L8j90R4k04j52L4L86l40
1342g18L26J55J9J74J59M6J71K67q8l4j97L53j03j96K71j56k13j8j2m6k76Q1K3
$$ plain form
1184 -1250 -432 12 -127 135 53 94 918 890 133 164 409 513 213 5 249 130 439 185 37 538 198
1205 198 4 430 -68 -667 -287 -204 -192 -472 -363 -230 14 374 275 87 850 1052 495 417 300 292 345 156
1227 156 -176 -404 -262 -335 -552 -499 -284 -477 -457 -112 -536 -386 -672 -388 -346 -580 -648 -511 75 -68 -238 298
1249 298 830 598 906 985 878 1050 985 858 840 479 295 -14 -68 114 -149 -372 -454 -483 -507 -520 -634 -726 -649
1272 -649 -638 -898 -1031 -663 -689 -783 -459 -232 -95 469 634 632 998 1054 922 935 942 781 441 733 653 178 104 264
1296 264 48 -174 -301 -394 -292 -491 -527 -822 -626 -831 -950 -684 -765 -817 -589 -538 -302 133 140 285 552 848
1318 848 857 520 699 893 485 527 600 362 199 238 40 34 1 93 -182 -384 -346 -536 -442 -646 -798 -764 -378 -718
1342 -718 -392 -237 -218 -44 115 161 332 599 511 477 280 633 530 334 605 449 236 218 206 160 -116 -35 -12
1365a2j24j62P1p8J14l75m0M18l16K48K17k08K69j59M50q8J02L6l00JM16j97l52
1388f9L81k44P1lj05j02mj55M9k53K31n1m0J28O1o9M95k85J03j18J23Q2J19j4
1412C31j03n6J85M4j15J28l45K63j62p0p9j06j73J04k46j19K3k3LQ2j66K29J99
1435a72JJ53j0J59J22M1m1q9R6J71r9pJ64m3P7j6l4o7j92j0j03k31j27j40j55
1460e52P2j61J6J6J73Q7N4P0J50rK15O9Q6q3o2J69o7k7K40ll4Q4k2r4O6k4k32
1487A97k03j90L7j67K6j03m15L37j72n8K76K45N2L6J50K50k16n2P4j34K70Q7k80
1510D7L83o3j61R9J49j11J83k22p0n9k80J11m03l5j59r0n1J32L8J76N6N7l4M35
1534A28M6j8M7K33m7m5P3q8p5K01O0n1j5m1n0P3J99k01l32j02k57k16q8j91J9
$$ plain form
1365 -12 -136 -298 -227 -305 -191 -566 -606 -188 -504 -256 -39 -247 22 -137 313 225 327 363 63 64 480 283 -69
1388 -69 312 68 139 136 31 -71 -75 -230 -181 -434 -203 -254 -294 -166 -105 -174 321 36 139 21 144 226 345 331
1412 331 228 172 357 401 286 414 69 332 170 100 21 -85 -258 -154 -400 -519 -496 -519 -516 -434 -600 -371 -172
1435 -172 -171 -18 -28 131 253 294 253 164 260 431 332 325 489 446 523 507 473 406 214 204 101 -130 -257 -397 -552
1460 -552 -480 -641 -625 -609 -436 -349 -295 -225 -75 -84 131 200 286 203 141 310 243 216 456 453 419 503 481 387 453 429 197
1487 197 -6 -196 -159 -326 -300 -403 -818 -481 -653 -711 -435 -190 -138 -102 48 298 82 30 104 -30 240 327 47
1510 47 430 367 206 305 454 343 526 304 234 175 -105 6 -397 -432 -591 -681 -732 -600 -562 -386 -330 -273 -307 128
1534 128 174 156 203 436 389 344 417 329 254 455 515 464 449 408 358 431 630 429 97 -5 -262 -478 -566 -757 -738
1559g38J88k94P0K23P2K45O9n4J09j04J39K17k01K90k39K21R0J75j11P9J31J60
1581G37k6j40q9j41j42L6k85o8k20qJ65p3J25M8J48k58K77j25K80l64K66j87k37
1604b81J07L9O6r8P7j0J71r0J58j55J47n3J3k60j22M0O0j26j81J81J38j1JJ83
1628fM01k28%K60j97K90j32p6m4jk03Q8Q5o6J63j49Q6m9j44k67j92J54j11j25
1652d63J46l02J75Q2K2K3J4k0L22K1J69M6L1Q5M7j74Rj13J22M7j26Q7m0m4N9l64
1678a39K83r4j09q6j30k01M7p7K0j4J32Q7P6J87m3j22J19K78P8n9l0j10K92M6
1702D31j32Q7P2j27j12R0j04j28j20J69l29nJ6j03m8R1k00P6LQ5j3m3K6L77j4
1727D5M3j3n5L63j18N4j17N1NO0l0N2l03K80j37j00m3j78p3J87j37k03j04QL64
$$ plain form
1559 -738 -550 -844 -774 -551 -479 -234 -165 -219 -110 -214 -75 142 -59 231 -8 213 303 478 367 446 577 737
1581 737 711 571 482 341 199 235 -50 -118 -338 -346 -181 -254 -129 -81 67 -191 86 -39 241 -123 143 -44 -281
1604 -281 -174 -135 -69 -167 -90 -100 71 -19 139 -16 131 78 91 -169 -291 -251 -191 -317 -498 -317 -179 -190 -189 -6
1628 -6 395 167 167 427 230 520 388 312 268 267 64 152 237 171 334 185 271 222 78 -189 -381 -227 -338 -463
1652 -463 -317 -619 -444 -362 -340 -317 -303 -323 -1 20 189 235 266 351 398 224 233 120 242 289 163 250 210 166 225 -139
1678 -139 144 50 -59 -145 -275 -476 -429 -506 -486 -500 -368 -281 -205 -18 -61 -183 -64 214 292 233 203 93 385 431
1702 431 299 386 458 331 219 309 205 77 -43 126 -203 -208 -192 -295 -343 -252 -452 -376 -373 -288 -301 -344 -318 59 45
1727 45 88 75 20 383 265 319 202 253 258 318 288 340 37 317 180 80 37 -141 -214 -27 -164 -367 -471 -463 -99
1752i9m15M9L07j55R0j44K83J85j88J43P0J37L1r0Q4J1NM4j5j81l9l5K3j90K29
1777A40j06j93m1N5j35J49j17o1J58J01j33K3K62k25Q6J45l8M6l5K30k03mK66
1800C70l08K21J16l49n1j6J18j18m0k21O4M9P5k20J72J20k81K71N9k19n7J80r9
1823a64J72kJ98q9j0K89j00Q0l1n4j7N4k98r7pj8r5k6L49l45L4K20l64J66J10
1848d5q9q7N2kJ00J19j38j23J01K40nJ1J49K21k21Mj50P0j24j90j66K14l2R7j4
1873hr2N4j73J08R2r7k6K3O7k57J98L9R5K49k66K6R1K01J20j45K9j6J28j95kn4
1899A89l05J13l01N0O8j31LJ97j32o6J5o0J15J41j57J84l4Q0j3R5N6oL7J96k2
1924C12N7L2j16P3l0M8j01j27o3n7j49J58j19k49P2o5J08o8j78L06k70K07R0j29
$$ plain form
1752 -99 -514 -465 -158 -313 -223 -367 -84 101 -87 56 126 263 294 204 288 299 304 348 333 152 113 78 101 -89 140
1777 140 34 -159 -200 -145 -280 -131 -248 -309 -151 -50 -183 -160 102 -123 -37 108 70 116 81 311 108 104 370
1800 370 62 283 399 50 -1 -17 101 -17 -57 -278 -214 -165 -90 -310 -138 -18 -299 -28 31 -188 -245 -65 -164
1823 -164 8 6 204 115 105 394 294 374 343 289 272 326 28 -69 -76 -94 -189 -215 134 -211 -177 43 -321 -155 -45
1848 -45 -134 -221 -169 -171 -71 48 -90 -213 -112 128 123 134 283 504 283 287 137 207 83 -107 -273 -59 -91 6 -8
1873 -8 -100 -46 -219 -111 -19 -116 -142 -119 -52 -309 -111 -72 23 272 6 32 123 324 444 299 328 312 440 245 243 189
1899 189 -116 -3 -304 -254 -186 -317 -314 -117 -249 -315 -300 -360 -245 -104 -261 -77 -111 -31 -44 51 107 101 138 334 312
1924 312 369 401 285 358 328 376 275 148 85 28 -121 37 -82 -331 -259 -324 -216 -284 -462 -156 -426 -219 -129 -258
1948b58P3l5J01K01j03M2K00R8l8J54j61P0lj07J46l86L08j60l05O1J38k11K45
1971G0k7k03J03r8p4J03O5j99Q9o7J8j8J11J9J26K16k15k3J26J05R1j85P5k81
1995g3Q2K49k54k05J62n0Q2n5R0n2Q1k4k12J39k9J52j21M3J3n3k1Q6j9O2j86L67
2021B54l4j12J5Ll3k4r7l7j5M9o5O2q1j97n3L27k30J01j51J14R4P4J93k74J41
2046B4n6J24K4n9K20j72J30r3P5J9K7L5k60o6J02j00j10J55p1j65M9k0J2Q4j14
2071b06o9K42j25L5k5o0J94p2J19j81K60M4q1Qj18K01P8k71J75N1j16j4j19k2
2095g2Rq5J40ok51o7K87k58K68m8o7J08j66R4J89N2K7n9k0R3L3j58L8k4L11j46
2121B22j20k3j19J96j83RM0p2q6p2j1n1l5L4j19L68l08K09mp7O9J15J01r9K05
$$ plain form
1948 -258 -185 -220 -119 82 -21 21 221 319 281 435 274 344 341 234 380 -6 302 142 -163 -102 36 -175 70
1971 70 43 -160 -57 -155 -229 -126 -61 -260 -171 -238 -220 -238 -127 -108 18 234 19 -4 122 227 318 133 208 -73
1995 -73 9 258 4 -201 -39 -89 -7 -62 28 -24 57 33 -179 -40 -69 83 -38 5 18 -35 -56 30 11 73 -113 254
2021 254 220 108 123 126 93 69 -28 -65 -80 -31 -96 -34 -115 -312 -365 -38 -268 -167 -318 -204 -110 -36 157 -117 24
2046 24 -32 92 116 57 277 105 235 142 217 236 263 298 38 -28 74 -26 -136 19 -52 -217 -168 -188 -176 -92 -206
2071 -206 -275 -33 -158 -123 -148 -208 -14 -86 33 -148 112 156 75 83 -35 166 244 -27 148 199 83 69 -50 -72
2095 -72 -63 -148 -8 -14 -265 -332 -45 -303 -35 -83 -150 -42 -208 -114 75 127 154 95 75 168 201 43 81 57 368 222
2121 222 102 79 -40 156 -27 -18 22 -50 -136 -208 -219 -270 -305 -271 -390 -22 -330 -121 -125 -202 -133 -18 83 -16 189
2146A89j0P1j%k46K39j30L2j03pJ06J1n9j01o5r9P3k7J6j2l1k4M0r1P9K0L2P8
2174b0P0M8j5O5l6kO7k33j15M11l2m9Or4j25P2k4j07J24m04K69q6O6p6K6j41P4
2201b61J16P3J56l5K8j7P8j14J6J54m1o3J88j72J27j63R1o8P3k80KKk5M6k3j65
2227b77J79j57J70j37j17J10m2l0P3K2J03P1K57j68nK27j13jk6p1J23j05j05R4
2251G5k8J8M8k7K9j90ON6j20j1N8m5j5J3j3O6o6K06j71Q7j11K30k25K35n9M3J7
2278A06R0n7r0J6j9K2j32j07J29j63K03p7q9P0k5K3j72K70j5o2O6j05l0J36Q1
2303F9J07on0nK17j79L1k1Pn3n5O1j32J02n4j48Oj3J8O5j25P8k67R9J25M1kj40
2331b24JK12K7J0r2J56J14j48O5r1J38j2j3K2j25j7L0o0mm9k0J3J28j93J37r2
$$ plain form
2146 189 179 250 249 249 3 242 112 144 41 34 140 151 92 -9 -74 -173 -100 -127 -111 -123 -154 -178 -138 -229 -150 -130 -98 -20
2174 -20 50 98 83 148 112 110 177 -56 -171 240 208 159 165 71 -54 18 -6 -113 11 -393 -124 -210 -144 -220 -194 -335 -261
2201 -261 -145 -72 84 49 77 60 138 24 40 194 153 90 278 106 233 70 161 93 166 -114 -112 -110 -135 -89 -112 -277
2227 -277 -98 -255 -85 -222 -339 -229 -271 -301 -228 -206 -103 -32 225 57 52 279 166 165 139 68 191 86 -19 75
2251 75 47 65 113 86 115 -75 -69 -13 -133 -144 -86 -131 -146 -133 -146 -80 -146 60 -111 -24 -135 95 -130 105 46 89 106
2278 106 196 139 49 65 46 68 -64 -171 -42 -205 -2 -79 -168 -98 -123 -100 -272 -2 -17 -79 -13 -118 -148 -12 69
2303 69 176 170 120 115 332 153 184 163 170 117 62 123 -9 93 39 -109 -103 -116 -98 -33 -158 -80 -347 -248 -123 -82 -84 -224
2331 -224 -223 -11 16 26 -66 90 204 56 121 30 168 156 143 165 40 23 53 -7 -11 -60 -80 -67 61 -132 5 -87
2357h7j6kr3j07J35Q1m7K20j82M6kK00k72K35j5K50j61J1j12J25j50M5J23k12
2381A3K5j88J87j03O5L4j71l3J08j11J79r7Jk7N4K4J26j00k8J31J40k08Q3j9M7
2406A32r1J56q1j04M9k6j40J20r2L0j30R7k2M2j34J4k8Q8J24M9j97J40j17J55
2430C4J53l64J04K76p2L9nj58J28P4N4k24N9l0j1j08K29k99P2l7m3K4j95N5P8
2455a67p7J32r2mO1K52j68N3RJ47j08J59n6Jr5J25j36p0J27k51J60R4k5j64J25
2480C2p4j2r3l2R3m7k9j6M2J74j03L7n9J60q8O4Kj8J04R0k19M7R6r8jN2lm4j21
2509f4j8m2l6K13l01K70j79l0R7R0L4k20N9K95j14j34k0K45P0k06o2R2O6n6LO7
2535A19r2MN8M5j26r8n0R8k2k3pk8J87j20k21K26K8r4k4m7J66k23M08o5q7j6O1
$$ plain form
2357 -87 -103 -105 -198 -305 -170 -89 -136 84 -98 -52 -54 146 -126 109 94 344 183 194 82 207 57 102 225 13
2381 13 38 -150 37 -66 -1 33 -138 -171 -63 -174 5 -92 -91 -118 -64 -40 86 -14 -42 89 229 21 104 85 132
2406 132 41 197 116 12 61 35 -105 15 -77 -47 -177 -80 -102 -60 -194 -180 -208 -120 4 53 -144 -4 -121 34
2430 34 187 -177 -73 203 131 170 165 7 135 209 263 39 98 68 57 -51 178 -121 -49 -86 -129 -105 -300 -245 -167
2455 -167 -244 -112 -204 -208 -147 105 -63 -10 -1 146 38 197 141 142 47 172 36 -34 93 -158 2 96 71 -93 32
2480 32 -42 -54 -147 -179 -86 -133 -162 -178 -136 38 -65 -28 -87 73 -15 49 51 33 137 227 8 55 151 53 52 104 101 57 -64
2509 -64 -82 -124 -160 53 -248 22 -157 -187 -90 0 34 -186 -127 168 54 -80 -100 145 215 9 -53 39 105 49 52 119
2535 119 27 31 89 134 8 -90 -140 -42 -64 -87 -94 -122 65 -55 -276 -50 -22 -116 -140 -187 -21 -244 164 99 12 -4 57
2562E7k7N6J34k31K39j75R5k73K3J09j5P0j46n3J07j2m6j40K20k01M7NKJ03N0
2587bO0j57J45J17j09J02m0j3J6j03L11l58J61j34R9P1k37O9Kj62J31j4j29Q2
2611i2q3M8J2j66K74r2P2mP2j24R7J53n7O3o5J80j13N6j03Pj01J4MR8j76J32L4
2638A40K2k29j04R3O0j85J08j4j64J01PM3Q0l5O1q8J47R5m0J7LR1k13J07p8Q8
2664A13J02j37n3j09M4Ok4J95j90K9Oj19j0M2N3j47J34P5j13mn7J49J2N9R4L9
2690A89r0M9r4J01R2k31J81j74L3Q2l7j39Jn3J3p0J95k73J90r4N8k35P3K28j88
2715a93J85M7R8j07j25K44j10R5rQ1j35J87k27k0j32O4K6P0m8K6JPm5K6n5K5j8
2742d2k01P5J04O5j11K02o8j3pp7J85q2L4j07K93j27R5k61l7R5O2o9o8PPJ7k3
$$ plain form
2562 57 30 86 220 -11 228 53 148 -125 -102 7 -8 62 -84 -137 -30 -42 -88 -228 -8 -209 -162 -157 -155 -52 -2
2587 -2 58 -99 46 163 54 156 116 103 119 16 327 -31 130 -4 95 166 -71 -2 0 -162 -31 -45 -174 -92
2611 -92 -175 -127 -115 -281 -7 -99 -27 -31 41 -83 14 167 110 173 108 288 175 231 128 135 34 48 52 150 -26 106 140
2638 140 162 -67 -171 -78 -18 -203 -95 -109 -273 -172 -165 -122 -42 -77 -16 -104 43 138 98 115 118 209 -4 103 25 113
2664 113 215 78 25 -84 -40 -34 -58 137 -53 -24 -18 -137 -147 -105 -52 -199 -65 10 -103 -107 -164 -15 -3 56 150 189
2690 189 99 148 54 155 247 16 197 23 56 138 101 -38 -37 -90 -77 -147 48 -225 -35 -129 -71 -306 -233 -5 -193
2715 -193 -8 39 137 30 -95 149 39 134 125 206 71 258 31 11 -121 -57 -31 39 -9 17 18 25 -20 6 -49 -24 -42
2742 -42 -243 -168 -64 1 -110 92 24 11 4 -73 112 30 64 -43 250 123 218 -43 -80 15 77 8 -60 -53 -46 -29 -52
2769e2J5j7J68j55J07j28M6RP4j09K20j91m1J78j9Or3J90l5j92Q0l2j30O1M9l6
2795b7j2kn6J28l5j53m9J96k9k6k7J86q6o6j0Jm9K37R8o8k28O8K34k07k2L4QN2
2823I0j6j26J35r6p3J30r2J36j61j3m3Q9q2M3O3l6J8L4N4k8kl5omK49N3j69j32
2851b0n7P2J84nj33m3Q5m5K7m4N5l01K71j00J5M9r1p9J3j1K07j23J18l6j71K03
2877D0o8J75j47p6J31P4j1N4j3M4j56J18J5j44J41j47j17N8o4Q4n2jk0k1j13J85
2903c1L4q8K66j02j58N0J8j01J60J52j7r3j0J30q7J3o7R3j23M9j59O3j4K6k24
2928b20K64q4j31J31N7J4j79J45j61J17PK5k81K06Q3j77L23j8j55O4o8N5J7R2
2952A26n7O1j07Q9j29Rl8l2p6J38j27J02j16K3J02r0J00j12J16j6K7l9l8J92j36
$$ plain form
2769 -52 -37 -54 114 -41 66 -62 -16 -7 67 -42 178 -13 -54 124 105 111 18 208 173 -19 61 29 -101 -40 9 -27
2795 -27 -39 -41 -97 31 -4 -157 -206 -10 -39 -65 -92 94 8 -58 -68 -67 -116 121 219 151 -77 -9 225 18 -4 30 38 90
2823 90 74 -52 83 -13 -86 44 -48 88 -73 -86 -129 -40 -122 -79 -16 -52 -34 0 54 26 24 -11 -17 -21 228 281 112 -20
2851 -20 -77 -5 179 174 41 -2 83 38 65 21 76 -225 46 -54 -39 10 -81 -160 -147 -158 49 -74 44 8 -163 40
2877 40 -28 147 0 -76 55 129 118 172 159 203 47 165 180 36 177 30 -87 -29 -93 -9 -61 -62 -82 -103 -216 -31
2903 -31 3 -85 181 79 -79 -29 -11 -112 48 200 183 90 80 210 123 136 69 162 39 88 -71 -8 -22 4 -220
2928 -220 44 -40 -171 -40 17 31 -148 -3 -164 -47 -40 -15 -296 -90 -7 -184 139 121 -34 30 -38 17 34 126
2952 126 69 130 23 112 -17 -8 -46 -78 -154 -16 -143 -41 -157 -134 -32 -122 -22 -134 -18 -34 -7 -46 -84 108 -28
2977b8j64J93j1J34j59K28j78K6jl6j33K04j46J28r1P3%j79K71j48j15p4J38k9
3001i7j7J09m9M3j19J00J99k40J72j2K9o0R2j72J37j92K75m3j14j3l8r2J5K6j18
3026a79J95J18l16R8j73L02j95qJ34j25N2K04j42R1k0J3pJ3M9j00J07K4j80L1
3050a4L2j18P4M7r1L3p1J19j15J01k7p6J32r9l4j72K51m6m4M5J02J34k83K56m8
3075H8Q2r4M2j52J47l3j0j01J12l5k8m0K9r7Nj08QM2L7Q8M2m8N9M2l8j98J13J38
3103I2Oq5l9J64p2n0J25QJ01p5q8o3n1K12j09j25J20j20k1n4L2N7j27j2J03R1
3129B0rj03j02K88j67p4L38j71J37j10pK07l52J15R4K2qj68K28j70j10Q4J24j25
3153a9j53L89k63%n0kj0L6P7r6m7J51K00j73j11J92l18J95R1k9P0o6l7j8Q4k15
$$ plain form
2977 -28 -192 1 -10 124 -35 193 15 41 40 4 -129 75 -71 57 -34 39 39 -140 131 -17 -132 -206 -68 -97
3001 -97 -114 -5 -54 -11 -130 -30 169 -71 101 89 118 58 150 -22 115 -77 198 155 41 28 -10 -102 -87 -61 -179
3026 -179 16 134 -182 -84 -257 45 -150 -158 -24 -149 -97 107 -35 56 36 49 42 55 104 4 111 135 -45 -14
3050 -14 18 -100 -26 21 -70 -37 -108 11 -104 -3 -30 -106 26 -73 -107 -279 -28 -74 -118 -73 29 163 -120 136 88
3075 88 170 76 118 -34 113 80 70 -31 81 46 18 -22 7 -90 -85 -193 -185 -143 -106 -18 24 -24 35 77 39 -159 -46 92
3103 92 98 13 -26 138 66 16 141 149 250 175 87 24 -27 185 76 -49 71 -49 -70 -124 -92 -35 -162 -174 -71 20
3129 20 11 -92 -194 94 -73 -147 191 20 157 47 40 247 -105 10 104 126 118 -50 178 8 -102 -18 106 -19
3153 -19 -172 217 -46 -46 -96 -98 -108 -72 5 -91 -138 13 213 40 -71 121 -197 -2 89 60 130 64 27 9 93 -122
3179a22J74N6j98k0Q2l4RJ1m4J47j59N1p2R8p3Q5N4M9j25P9J10pk37J11J3R8n4
3206H2j2J3l1k9J5Jr5K6R3k22K54j48j05J52Mp2j3j00Q6K6R8j36K05j08N3J7j5
3233C9M5k2K3o4J81j60p8J43j37N1m6j16J65P8k00J9Q2j18R5k5j59R3K50p1l5
3258C3m4M1k2O9J4K5kjJ8j69P4j09J03K0M5j46m4o3J53k2p5J63l1r4j38P4k5J0
3286a43J01j02J61K9q0J93k35M2P4m0QJ07m4L9Qp2p9j79K16K6M2N7j32O0j16J0
3312d9MJ97j69O2j70Q8k3q1J33l2K9J11j85J43n3J55j01j07O4j67J16R9J23r6
3336I1J60j82j11L9M6j74J40j81M5J5P4n8N6j34J12m4L4J10J4K8l4j4o6J23j6
3361G3Q1r0J48k35J4J23J04j96K4M0q6L1q9R1j01K66k79KK1n0M2L6l6M2k20O3
$$ plain form
3179 -122 52 108 -90 -110 -28 -62 -53 -42 -86 61 -98 -47 -119 -21 -94 -9 45 94 -31 48 158 151 -86 25 38 136 82
3206 82 70 83 52 23 38 39 -56 -30 63 -159 95 -53 -158 -6 -2 -74 -87 -187 -101 -75 23 -113 92 -16 37 54 39
3233 39 84 62 85 21 202 42 -36 107 -30 21 -25 -141 24 102 -98 -79 3 -115 -20 -45 -204 -111 139 68 33
3258 33 -11 30 8 77 91 116 114 113 131 -38 36 -73 30 50 95 -51 -95 -158 -5 -27 -102 61 30 -64 -202 -128 -153 -143
3286 -143 -42 -144 17 46 -34 159 -76 -34 40 0 8 115 71 110 118 46 -33 -212 4 30 72 129 -3 57 -59 -49
3312 -49 -45 152 -17 45 -125 -37 -60 -141 -8 -40 -11 100 -85 58 5 160 59 -48 16 -151 -35 64 187 91
3336 91 251 69 -42 -3 43 -131 9 -172 -127 -112 -38 -96 -40 -174 -62 -106 -72 38 52 80 46 32 -34 89 73
3361 73 154 64 212 -23 -9 114 218 22 46 86 0 31 -58 33 -68 198 -81 -79 -58 -108 -66 -30 -66 -24 -244 -181
3387a81J76m6J70p0l8m9J26l0Q2L0k50K29p2o2j22J64k58j6J89K45j41M5j79J13
3411E5j36l1J9j12K05q0J5J29j22O9M6q9J04j16j1J08l7R2K5m2N3k11J0m7R2k0
3437c2Q1l7j04J15q5J18j2Jj38N3p6O1J69j27LO3K1N5k40J64N6r0k2R7R9j63l27
3464b97L12L6p2n3J7J08j8j32J36j09oJ61k01j5l9J56o4Q8N5j32J6K0J17j06J17
3489I5rL0r1q4J38J03k68O3P4l1J24l9k05L2%lp8L8L1l8J08q1K59k95J90k46k2
3516b05K78qj64N6o1K11j98J74j12J43Pj98K16l7P3n1r3m4P2K4k83R2K67j15q1
3541c7Rm9J8q5P8L0N0J17n8o7M2q9K2mK9m3NJ17p8m1J1k3j8N2J1Q5q5j27J03P5
3571E0kk23P3J14M8j55J14L9k4LM0j06L8J0M2Lj19O0lk3O1n6K2l3J66k56J83j40
$$ plain form
3387 -181 -5 -51 119 49 11 -38 88 58 140 170 -80 149 77 15 -107 57 -201 -217 -28 217 76 121 -58 55
3411 55 -81 -112 -93 -205 0 -80 -65 64 -58 11 57 -32 72 -44 -55 53 16 108 133 91 144 -67 -57 -104 -12 -32
3437 -32 49 12 -92 23 -62 56 44 45 -93 -40 -116 -55 114 -13 -10 53 74 129 -111 53 109 19 -3 94 193 30 -297
3464 -297 15 51 -21 -74 -57 51 33 -99 37 -72 -78 83 -118 -133 -172 -16 -80 8 63 -69 -53 -33 84 -22 95
3489 95 86 116 25 -59 79 182 -86 -23 51 20 144 105 -100 -68 -68 -71 -149 -111 -80 -118 -10 -91 168 -127 63 -183 -205
3516 -205 73 65 -99 -43 -104 107 -91 83 -29 114 121 -77 139 102 175 124 31 -13 59 83 -200 -108 159 44 -37
3541 -37 -28 -77 -59 -144 -66 -36 14 131 73 6 48 -41 -19 -23 6 -37 -32 85 7 -34 -23 -46 -64 -12 -1 84 -1 -128 -25 50
3571 50 48 -175 -102 12 60 -95 19 58 34 37 77 -29 9 19 61 64 -55 5 2 -21 40 -16 6 -27 139 -117 66 -74
3599g4o0K30o6j26J68j35j13K28Mk44M5K22k70K47o9km8o2J32j26J56J51p3j80
3623f5J6J4OJ03J00k72j26O3K44j91J24N2Qk17M5N8l9j2Q2J01Jq2j1n4Q9L2J9
3650H8M9k33J04mkp0J40p9Q2k37J20J6p3J76k62J84mq2J71l4M7k16K41j83J42
3675H1j1K7j71J67PK8l3r1J24l6j12J63j88j04K45n2k5kn5n4pQ4o7m2j8J59j39
3702a22r5K24j47J72l8m8P1K2L0L8Q7j22j60J30j23J27o1m2J18J48k31l5j47J26
3726g8j5M4J7n8J27k49J96L6m0J00J1k4j42p2K27k2j30k4P1J59r3m6J16J1k03
3751h1PM9j09R0N4j40P5r7Q8k6K20k38n9O2k1P2K2L9%O3o8J06r9m6R3L6o0N7N2
3780A41j64J73n3j33n1lJ62j22J14P4p9k53J22L3M8k6n3R3j51J22r9J13k1Nl6
$$ plain form
3599 -74 -134 96 30 -96 72 -63 -176 52 56 -188 -143 79 -191 56 -13 -15 -63 -125 7 -119 37 188 115 -65
3623 -65 -49 -35 -29 74 174 -98 -224 -161 83 -108 16 68 76 -141 -96 -38 -77 -89 -7 94 95 13 2 -52 37 69 88
3650 88 137 -96 8 4 2 -68 72 -7 75 -162 -42 -26 -99 77 -185 -1 -5 -87 84 50 97 -119 122 -61 81
3675 81 70 97 -74 93 100 128 95 4 128 92 -20 143 -45 -149 96 44 19 17 -38 -92 -99 -15 -82 -124 -142 17 -122
3702 -122 -217 7 -140 32 -6 -54 17 39 69 107 194 72 -88 42 -81 46 -15 -57 61 209 -22 -57 -204 -78
3726 -78 -93 -49 -32 -90 37 -212 -16 20 -20 80 91 67 -75 -147 80 58 -72 -96 -25 134 41 -5 111 122 -81
3751 -81 -74 -25 -134 -44 10 -130 -55 -152 -64 -90 130 -108 -167 -105 -126 -54 -32 7 7 70 2 108 9 -37 56 92 32 89 141
3780 141 -23 150 97 -36 -87 -90 72 -50 64 138 59 -194 -72 -39 9 -17 -70 23 -128 -6 -105 8 -13 -8 -44
3805d4j11K27j19J52j51M0l7K6J13J8j16q6Q7j17J78j74K74Jj57j21J53P5k31
3828a20Q2P3K1r1Q8j96J36jpmL1NJ21j84m7M5J3R3j1O8j29O3K1K4j12r0J50j01
3856e9l3N9m9K4k0L7l8j53J81n8Q5Q8k10L34j97K06o4j94J91J4o7q5J39k15J62
3881G8j55j2N8J35j2j44l4M5o0K6R2R7k70J85Pj89J67p5k0J08M7pN2r1R7j16o7
3908e8m6J21J6P3O1k95J53o3L9K09j56j38P4K4o4j49J65L1J06Nj58R3J9j00j0
3933d8P5rn8J93j38P8K2j38l5J68j27R2p4N9j24N9K4q7P9J29k74O1R6q6P8L0q0
3960c5m8L3O0q5M9J20Q0k12M4kj02k0K28o8q4J07r1L8j04L3Q9J4j04p8R1L4j54
3987a67j5K74j26Nr3J68j53J71j0p7j6M5L9P6M9k43J45K0k30M0J75j86k7P9Q4
$$ plain form
3805 -44 -155 72 -47 105 -46 -6 -43 -17 96 114 -2 -88 -1 -118 60 -114 160 161 4 -117 36 111 -120
3828 -120 -38 35 56 -35 53 -143 -7 -8 -15 -19 12 17 138 -46 -93 -48 -35 58 47 115 -14 49 70 94 -18 -108 42 -59
3856 -59 -92 -33 -82 -58 -78 -41 -79 -232 -51 -109 -24 64 -146 188 -9 197 133 -61 130 144 77 -8 131 -84 78
3881 78 -77 -89 -31 104 92 -52 -86 -41 -101 -75 17 114 -156 29 36 -153 14 -61 -81 27 74 67 119 28 125 9 -58
3908 -58 -104 17 33 106 167 -128 25 -38 1 210 54 -84 -10 14 -50 -199 -34 -3 103 108 -50 43 62 -38 -48
3933 -48 27 18 -40 153 15 93 115 -23 -58 110 -17 75 1 60 -64 -5 19 -68 11 140 -134 -73 23 -63 15 45 -35
3960 -35 -83 -50 10 -75 -26 94 174 -38 6 4 -98 -118 110 42 -42 65 -26 12 -92 -59 30 44 -60 -138 -47 -13 -167
3987 -167 -182 92 -34 -29 -122 46 -107 64 54 -23 -39 6 45 121 170 -73 72 92 -138 -98 77 -109 -136 -57 27
4012B7k3j67J36q7K75j15j87P4R9Ro0k0p7J08K06j23j29KR3nr9J29r0P0j23NK35
4039A63k05J48j45R4j10M8O3m7l5r7k3J68K0q3N9J7n6m3j21O8J85pL5p1J1o3k9
4066e6J45j03L5J57n7j92J47j44qO9J1k0q9J08q2l9Q0K2j41J37j80J08O4J9j09
4091a18l3J57N9n0j65R0J76m7o0J50j23j9R8j29p4m8J47n8%L8j3q1o8R6m8P4M5
4118dj15J12j01Q7nj1L4n0J54r0O0p8Q3l4n1M9M9n4mj00O6R7j46L7n8LkP2m1o1
4148a02J01j49K55K0j01R8k24J56R4j63J17j12j25J14J28k73J16K74k62K8j8J10
4170H2j54J29j81K75j08j63J32m9m7j98K96j49O9J78k03o0N2M9o1R2M8j2J21j40
4194bl3J4J56j32J70k93Q3J73j82P9%%j86J10M0J44j78j54J70K68k61M8n3pj8
$$ plain form
4012 27 4 -163 -27 -114 161 46 -141 -67 32 41 -19 -39 -116 -8 198 75 -54 -52 41 36 -63 66 -24 46 -77 -72 163
4039 163 -42 106 -39 55 -55 -7 56 9 -26 -123 -146 22 42 -41 18 35 -21 -64 -185 -117 68 61 96 25 36 -27 -56
4066 -56 89 -14 21 178 121 -71 76 -68 -76 -7 4 -16 -105 3 -79 -118 -38 -16 -157 -20 -200 -92 -28 -9 -118
4091 -118 -151 6 65 15 -150 -60 116 69 9 159 36 17 115 -14 -88 -136 11 -47 -47 -9 -22 -103 -171 -75 -123 -49 -4
4118 -4 -119 -7 -108 -21 -26 -37 -3 -53 101 11 71 -7 76 42 -9 40 89 35 31 -69 -3 94 -52 -15 -73 -70 -72 0 -41 -102
4148 -102 -1 -150 105 125 24 122 -102 54 148 -15 102 -10 -135 -21 107 -166 -50 224 -38 -10 -28 82
4170 82 -72 57 -124 151 43 -120 12 -37 -84 -282 14 -135 -66 112 -91 -151 -99 -50 -111 -19 29 17 138 -2
4194 -2 -35 -21 135 3 173 -120 -37 136 -46 33 33 33 -153 -43 -3 141 -37 -191 -21 247 -14 34 -19 -26 -44
4219d4J2M8n4N9J25j94O2K3O4n5k3Q3j20P1r0O0K6j46J41k7n3o7Q4l6j11%J41
4246b1J2l0J09j42q6J60p7L63m3l44L8J01rl9P0kj29LN0Q8j58J11j15j18K03N8
4272E3p5p1K68k99P8K8P7M3j04N8j35p8N9M5kK35j42Jko8K8J04n9k4K18k71M4
4299IM0l3Ko1J84o4j23n5J53j56K02j37J97l93K45%p4J14j27J35k9M3j0j7j00
4324e5R6jm8N0n0J5j32J08n1m8J3K1J59n4l2p6R5L0N6j51Q7O3O0j9k33L1L09k53
4352a0o3Q8k9L8k15K28j21J16J23k30O4o7P2O0kk28J52P7j12J22k4j05m2P5J34
4377A01o4m7p7l7L60k46M9N7K1o9M9l9mj72L3K09j6p5J09k24J21j27J6L6J2J19
4403I5j70J08r0n6Q8R7j79J67j5M1k9p0O8J25j44k53Q2k3K37q5No8J22j53J58
$$ plain form
4219 -44 -32 16 -38 21 146 -48 14 37 101 46 23 106 -14 57 -33 27 53 -93 48 21 -32 -99 -15 -51 -162 -162 -21
4246 -21 -9 -39 70 -72 -158 2 -75 288 245 -99 -61 40 31 -8 62 60 -69 -66 -16 72 -86 25 -90 -208 -5 53
4272 53 -22 -93 175 -124 -46 -18 59 102 -2 56 -79 -157 -98 -53 -55 180 38 39 37 -31 -3 101 42 18 236 -35 9
4299 9 49 16 18 -43 141 77 -46 -101 52 -104 98 -39 158 -235 10 10 -64 50 -77 58 29 72 62 45 -55
4324 -55 41 40 -8 42 -8 7 -125 -17 -68 -116 -103 -82 77 23 -9 -85 10 40 96 -55 32 95 155 136 -97 -66 243 -10
4352 -10 -73 15 -14 24 -191 37 -84 32 155 -75 -11 -78 -6 54 52 -176 -24 53 -59 63 39 -66 -108 -33 101
4377 101 37 -10 -87 -124 236 -10 39 96 117 48 97 58 54 -118 -85 124 108 33 142 -82 39 -88 -72 -36 -24 95
4403 95 -75 33 -57 -113 -25 72 -107 60 45 86 57 -13 55 180 36 -217 -135 -158 79 -6 -1 -69 53 -100 58
4428E8j28O9N9m4j66J90j38MJN9J46j50J26L6j04K04q2k89J90n2J04p8M6m9%Q6
4454I8j6o5j15J5J7O6J56j87R8r5j80K62j98J50k5p8R4r8N3l3J2k7J21Q4k12J22
4480A9K5m3pJ4P0L2j47R5j49J4o0J85q3j3k1k03K01J2Q6L4j57O2q0o5K93j39K3
4507bn9j1J77q2j32J93Q3k61K89m1KR3k17k11K24p0r6J25j07N3r5L63k36L1K4
4532C7k15J96p9j24K53Rj8r6R1K1p2J43N7j11P5j71J6qQ8j55J00M3o8L1M3k32
4558a46J07qJ01p3Kj47Q8K08j38n4J41J11l33J42k0Ln3j6K16r5Oj00N7O8Qj35
4584f0O8j04J61lp0j81K62r7MJ00N5k69LmP7J7J86k23J11l5k8J64j43J06o1J69
4610B05j08p5Q9j13p9k3J45Q7j47Q9j65O8k1J7M5j33j10K45R5j48N1Rj9j11p2
$$ plain form
4428 58 -70 -1 58 14 -152 38 -100 -96 -95 -36 110 -40 86 122 18 222 140 -149 41 -11 93 15 61 12 12 98
4454 98 82 17 -98 -83 -66 0 156 -31 67 -28 -208 54 -144 6 -19 -97 -3 -101 -48 -81 -69 -96 25 109 -103 19
4480 19 44 1 -6 8 78 110 -37 58 -91 -77 -137 48 -35 -48 -69 -272 -71 -59 27 61 -96 -34 -114 -179 114 -25 -2
4507 -2 -61 -72 105 23 -109 84 167 -94 195 154 156 249 32 -179 45 -25 -121 4 -103 -50 -145 218 -18 13 37
4532 37 -178 18 -61 -185 68 77 59 -37 54 75 3 146 203 92 167 -4 12 4 92 -63 37 80 12 43 86 -146
4558 -146 -39 -47 54 -19 -17 -164 -76 132 -6 -60 81 192 -141 1 -19 -16 -69 -85 131 36 42 -58 -1 67 75 -60
4584 -60 8 -96 65 62 -8 -189 73 -24 -20 80 135 -134 -131 -135 -58 -41 145 -78 33 -2 -30 134 -9 97 36 205
4610 205 97 22 111 -2 -81 -104 41 128 -19 70 -95 -27 -48 -31 14 -119 -229 16 111 -37 14 23 4 -107 -179
4635a79M9R8L7J52j95M4J32j8j51O2k7j49O0J84j80J53r1j39J38j7qrL3Ql5l1
4661g9J0K39j44j77P8r5J64N2N2k43L52m2j45J37N2j74J1Oj86J05kJ04j33K2Q7
4686E1j09L7K26m2j00n5q3P3Q2O7j37r8L6J90k70L49j55q8M9j5Q9k21J69q2R8
4711F1j10M7P2k38K57j39o7J67q5Qk6mJ01j24J92k1Oj22lJ75r6O6J35j13p3j7
4737D9r1J41J4j45N2o3J02p3L6j04K2M3j14J68j28k0pR5M0j27nJ59l2Q6j89J45
4763E4K8j91K14m8J42j76J68j09r8j00J37Rj2n8P0p5M5J13k07j56K12p3o9K26
4787D6k09K8J9J44j35J42m5J62j95J42l7j71Q2l5qJ17M8Q7j49OK3j87M0J23k9
4812Io9l0O1jJ6j7N5P2p9KL0j48J07m2R9o7j02j13M20j15r0K7P3oj40J9J74q6
$$ plain form
4635 -179 -130 -32 5 157 -38 6 138 120 -31 31 4 -145 -85 99 -81 72 -19 -158 -20 -37 -45 -54 -21 -13 -48 -79
4661 -79 -69 170 26 -151 -73 -168 -4 48 100 -143 209 167 22 159 211 37 48 54 -132 -27 -29 75 -58 -36 51
4686 51 -58 -21 205 163 63 8 -75 -2 80 147 10 -88 -52 138 -132 217 62 -26 23 8 97 -124 45 -37 61
4711 61 -49 -2 70 -168 89 -50 -117 50 -35 -27 -53 -57 44 -80 112 91 97 -25 -28 147 51 117 252 139 66 49
4737 49 -42 99 113 -32 20 -43 59 -14 22 -82 -60 -17 -131 37 -91 -111 -118 -23 17 -110 -115 44 12 98 -91 54
4763 54 82 -109 105 57 199 23 191 82 -16 -116 21 30 18 -40 30 -45 0 113 -94 -250 -38 -111 -180 46
4787 46 -163 -135 -116 28 -107 35 -10 152 -43 99 62 -109 -27 -62 -70 47 95 182 33 39 62 -125 -85 38 9
4812 9 -60 -90 -29 -30 -14 -31 24 96 17 19 49 -99 8 -34 65 -2 -104 -217 203 88 -2 25 98 92 -48 -29 145 59
4840E9j51K12k01P1R8M3p8Q5k73K3J27K8j35M6Q4q3nJ64k85J67L9J18q3k66K20
4865B4O0KQ5k05N7Pj78Q5O6k6Q0k23J97o7N9J4p5J25q6q4K90j62n2l2n1J58J49
4892B17j96m2J46j83J48j01N0L4j26K5J9j22R7R9j04%r7M1Q1o4J31n9J10j78l8
4917a12P8J03j54oJ87j43k8N5O3j08J39n2Q2j93K21P5n8j91J14q9m9N9l9r2N3
4942h5l8P7Q0M1j72N8p6j28K37K0j16J54R1j08m9J22j03r4j7J19Q2L3k29J18J2
4967B9m7K3N7R2j20K4O0j33J8l4O3J49l42K19q7Pm1j6P0Kr1K31q8j04J68p5O6
4994A00k20O0J11M2j1j57P7p0P6l2K4J23j53J11j99J73Oj30oP6%j10J87j29J43
5019I2j07J0J54j27pP7p9J74q1q1N1j05O4r1r5R8k2n3l6K15Oj57j13L17n7p5J1
$$ plain form
4840 59 -92 120 -81 -10 88 131 53 138 -135 -112 15 43 -92 -46 38 -45 -50 114 -171 -4 35 153 70 -196 24
4865 24 84 86 171 -34 23 30 -148 -63 3 -23 57 -166 31 -36 23 37 -38 87 1 -83 207 45 -7 -39 -90 68 217
4892 217 21 -21 125 -58 90 -11 39 73 -53 -28 -9 -131 -34 65 -39 -39 -136 -95 -14 -78 53 -6 104 -74 -112
4917 -112 -34 69 -85 -91 96 -47 -75 -20 43 -65 74 22 104 -89 132 207 149 -42 72 -17 -66 -7 -46 -138 -85
4942 -85 -123 -46 34 75 -97 -39 -115 -243 -6 14 -102 52 143 35 -14 108 5 -89 -106 13 95 128 -101 17 29
4967 29 -18 5 62 154 34 58 118 -15 3 -31 32 181 -161 58 -29 -22 -63 -79 -9 -7 -98 133 45 -59 109 34 100
4994 100 -120 -60 51 93 82 -75 2 -68 8 -24 0 123 -30 81 -118 55 61 -69 -75 1 1 -109 78 -51 92
5019 92 -15 -5 149 22 15 92 13 187 106 25 76 -29 35 -56 -151 -53 -75 -128 -164 51 57 -100 -213 104 47 -28 -17
5046a7r0N8J02kj29O1J31j25m2L4J55j91J43Oj13Q3j67K70l2mj36l4N3M4Q4j31
5072A1LJ56k63R9r8L7m7N4l5JJ30r0j3Q3k1J57j26n4j02K10k5M2q0qj00J58q8
5099iJ22k6j06m6J66j07j14K07p7j19O3J59k98J26J23K2J96l52R3P8j45L8p7l9
5123a22J71j44Q1O6k38J71K2q0J50p6J9o0n4J26k21M13k87n8J22J2M7j56K48k39
5147h7J1J41l5K11j60p6J16q0j22Q0N7k1j96J88j82N1R2J3k82J96L50m69K21q2
5171f5J17J7m4q9J81p1P7r8n7J04k54J74N6r3n9K00j26L37l25J71k42R2m6L9J24
5196A20o2p5j64J56j42J29o1J26k54L57j10j9n5j11L26j86J12k7j5k6J43J8k11
5219c1J2J5j43J35k04M41j49j59K53k08L5r4j96K81P4M6q1l1J2K6n2q3P9l0N6
$$ plain form
5046 -17 -107 -49 53 51 -78 -17 114 -11 -53 -19 136 -55 88 94 -19 64 -103 167 135 131 -5 -39 14 58 142 11
5072 11 14 170 -93 6 -92 -55 -102 -48 -83 -82 48 -42 -55 28 7 164 38 -16 -118 92 67 109 29 21 -79 79 -9
5099 -9 113 87 -19 -65 101 -6 -120 87 10 -109 -46 113 -185 -59 64 86 282 -70 23 101 -44 -6 -83 -122
5123 -122 49 -95 -14 52 -186 -15 7 -73 77 1 20 -40 -94 32 -189 224 -63 -121 1 13 60 -96 152 -87
5147 -87 -76 65 30 241 81 5 121 41 -81 -1 56 35 -161 27 -155 -104 -12 1 -281 -85 265 -204 17 -65
5171 -65 52 69 25 -64 117 46 123 25 -32 72 -182 -8 48 -45 -104 96 -30 307 -18 153 -89 3 -43 -4 120
5196 120 58 -17 -181 -25 -167 -38 -99 27 -227 130 20 1 -54 -165 161 -25 87 60 45 19 162 180 -31
5219 -31 -19 -4 -147 -12 -216 225 76 -83 170 -38 -3 -97 -293 -12 62 108 27 -4 8 34 -18 -101 -22 -52 4
5244Do5R0L7n9N0j40J16M5L1j12J14r0j68J00R9%Nj00J14j05N1J51j25M6j27R0
5270E2m4j93J73j8L3k9R0k4J8K88k28q1j83J08P0j7r0P6l1J23q7N7l6r0r4R7N2
5297hj08K40k91Q2K9J00j36j04K31R6J16k11n2K7O2j24J26%r8K9n2m3J15p7J04
5322E3j81J43j51J32o5J69j15j07J44J37l02J53Q6p2l3J33j06J56k46J90J01r1
5344A28r4j24Q5Q4k9j22qJ75j28J3M0OJ16j70n9J48Nj18L5p4J74k10P2k5P3k2
5370b9rJ01J41k02O8p8J4N7j22J02q5O1J9j00M9lj05J6o1K88k35j05K65R6p6r8
5396c1pr2J18j3K09k42P8J8O9K7qj71N0l1m0M5L2N5j52J01J06l23J23P7o3KJ8
5423d5j71J47j40J36P5k5J76k2j08Lj9Q2n3Pj47O3R7R4o7l9j01p9J59j3J89k2
$$ plain form
5244 4 -61 29 66 7 57 -83 33 78 109 -3 111 21 -147 -47 52 52 57 -43 71 -34 17 168 43 89 -38 52
5270 52 8 -185 -12 -30 3 -26 64 40 58 346 118 37 -146 -38 32 15 -75 1 -30 93 6 63 27 -63 -157 -60 -8
5297 -8 -116 124 -167 -85 -56 44 -92 -196 35 131 247 36 -16 11 73 -51 75 75 -23 6 -46 -89 26 -51 53
5322 53 -128 15 -136 -4 -69 100 -15 -122 22 159 -143 10 96 24 -9 124 18 174 -72 118 219 128
5344 128 34 -90 -5 79 50 -72 -80 95 -33 -20 20 26 142 -28 -87 61 66 -52 -17 -91 83 -127 -55 -80 -7 -29
5370 -29 -38 63 204 2 70 -8 6 63 -59 43 -42 19 38 -62 -13 -16 -121 -105 -166 122 -113 -218 47 143 67 -31
5396 -31 -38 -130 -12 -25 184 -58 20 38 107 134 126 -45 5 -26 -66 -21 11 66 -86 15 121 -202 -79 -2 -65 -63 -45
5423 -45 -216 -69 -209 -73 2 -23 153 131 23 26 7 89 36 43 -104 -41 56 150 83 44 -57 -136 23 10 199 177
5449A77j73Q4k93J72J9Mo5QO6k40J47q1Q8j21J89K9KR3l8l7jl2m6N9J12o5M3k14
5477a14R4L3l5k3J45r7N5k12K59n0J6o5n3K7j71J54M0j5J84m9Mq8K1N4j49R5%
5504F0j45K32k06R1n1p5K17k16J51m2p5Q7o6J45j88L2J63j43n7J20l1j88J07J36
5528E8J0R9j48n3P7j3J2j6J3RJ4n5q4M2k3n5J63K7r6r8J76m4p0Q3k69K23Q2J0
5556G4K28l12J40o2r0j2K25p3j39M9J9q3J60k53J23J87r5J0j5j49J24k12QK09
5580F1j99k4J85j20L8o7J27j2j07%N8m0K14k00N7J08j6j51J61j48J97p8J53q3
5604A14j10J17j21J41o9m6J44k28L11l14L1MJ24j52n3M5K14o1j44J08j28QPJ26
5628F8j47J33n5J46n8j09L4Q5p8k02K33L6m7j22l8K16j45M8o8M1K1J27j63J5p5
$$ plain form
5449 177 4 88 -205 -33 -14 -10 -75 -67 -1 -241 -94 -175 -87 -208 -19 10 12 105 67 30 29 -3 -49 10 122 57 100 -114
5477 -114 -20 13 -22 -45 100 3 58 -154 105 55 71 6 -47 -20 -191 -37 3 -12 172 123 127 39 60 114 -35 60 60
5504 60 -85 147 -59 32 -19 -94 123 -93 58 16 -59 28 -38 107 -81 -49 114 -29 -86 34 3 -185 -78 58
5528 58 68 167 19 -34 43 30 42 26 39 48 62 7 -77 -35 -58 -113 50 77 -19 -117 59 15 -55 28 -241 -18 64 74
5556 74 302 -10 130 68 -22 -34 191 118 -21 28 47 -36 124 -129 -6 181 86 96 81 -68 56 -156 -148 61
5580 61 -138 -162 23 -97 -59 -126 1 -11 -118 -118 -60 -100 114 -86 -29 79 63 -88 73 -75 122 44 197 114
5604 114 4 121 0 141 72 26 170 -58 253 -61 -30 -26 98 -54 -107 -62 152 91 -53 55 -73 -65 -58 68
5628 68 -79 54 -1 145 87 -22 12 97 19 -183 50 86 39 -83 -121 95 -50 -2 -70 -29 -8 119 -44 -29 -104
5653a04j4K54j58J21o6l8jj88J99j11O7J03Q4j33PPk1K0Q6p1J21n3j56m7l3J31
5679Fj61n8K92q1J04r4O2q8l2j1P6Q9p5n2MJ06K5j63N4O6r0J40j03J10j61K0M7
5706C2P9j34P5n6J6L7Qj16LL8l5J08r8J12p3K06k72J20j40R7M9r9J36p3J14j2
5732A22o1M7n8Q3j70J11n3P1p1J39l71K52J20q7j64k6K20k01J14ML2r8J39j47
5756e3j37J47Q9OO1k9j26J49M7l03J90l2k8K8rn9L7l9L1j7J23o3j30R6J09KKK5
5784A17j78K76q4j27P7j12N8j02qR9J52r8n9j73L21q3O1j66P1O1j68O0l1m9J10
5809B5Ok4p7O6O7r3j4n1J97j4j0J2n4O6l9o1k0o5M1J28n6l3j95J81J5J4j08K17
5837A21j82J75j93n0M0N4J18p4J2p8M1p1J33Q8kp7j27K28k01O7np9J27j45J71
$$ plain form
5653 -104 -118 136 -22 99 33 -5 -6 -194 5 -106 -39 64 148 15 22 29 8 28 114 43 164 111 -45 -92 -125 6
5679 6 -155 -213 79 -2 102 8 70 -18 -50 -61 15 104 29 -23 -19 87 112 -51 3 69 -21 119 16 126 -35 -15 32
5706 32 111 -23 52 -4 12 49 57 -59 -56 -18 -53 55 -43 69 -4 202 -70 50 -90 7 56 -43 93 20 134 122
5732 122 61 108 50 133 -37 74 21 92 21 160 -211 41 161 74 -90 -116 104 -97 17 21 53 -45 94 -53
5756 -53 -190 -43 46 52 113 84 -42 107 154 -149 41 9 -19 9 0 -59 -22 -61 -30 -47 76 13 -117 -21 88 90 92 117
5784 117 -61 215 131 4 81 -31 27 -75 -83 16 168 70 11 -162 159 76 137 -29 42 103 -65 -5 -36 -85 25
5809 25 31 7 -70 -4 63 -30 -44 -95 102 88 78 90 36 102 63 2 -18 -83 -42 86 30 -3 -198 -17 -2 12 -96 121
5837 121 -61 114 -79 -129 -89 -35 83 9 21 -57 -16 -87 46 134 132 55 -72 156 -45 22 17 -62 65 -80 91
5862I1p9ok6j32P1N5J2q8O3J1m1J79p9N6l2m5N3l5O1j58J76j58K2N1kn1R5N1k14
5891i9J02j1j57N1K70k05J33o0o9J00J02q8r8Pl9l0J13J25p3j31J11j8j65M9P3
5916gO0J7J3rj37j34J85n9N5J01j59J34n0J1o7L0q9k8R1Q1l4K7k6j36J16MJ47
5943A37j90J08j23R1j30N9J48j87J21o8%J28l22L41j38p9k7J70l4L4NJ8p8J0k2
5968b8q6J51j96J74J7q2J7q9J78ko9mo7J51p2J35j08j0J9j21k1KJ17J04k7j23
5994d0m1Qn2J31J07q3k6q5J22oj29R1N9j27J10l5J6J4p1K07j06j22M0J37m5p6
6020bO1L5j04Q2n5jn0j05n2J36O5P2m6m7j24J55p7r7J75p1J05knqP6j22p5K35
6048A54j39R1j52o5l1J28rk5N0n9P6j38N9K2o1P0q4J69r6J33%k0qr6kJn5K81n2
$$ plain form
5862 91 12 6 -20 -152 -81 -26 -14 -102 -39 -28 -69 110 31 87 55 10 63 28 89 -69 107 -51 -29 22 20 -31 64 115 -99
5891 -99 3 -8 -165 -114 156 -49 84 24 -45 55 157 69 -29 -22 -61 -91 22 147 74 -57 54 36 -129 -80 -7
5916 -7 53 70 83 74 -63 -197 -12 -71 -16 85 -74 60 10 21 -46 -16 -105 -133 -42 39 5 32 6 -130 -14 -10 137
5943 137 -53 55 -68 23 -107 -48 100 -87 34 -34 -34 94 -228 113 -25 -104 -131 39 5 39 44 62 -16 -6 -28
5968 -28 -114 37 -159 15 32 -50 -33 -122 56 54 -15 -19 -86 65 -7 128 20 10 29 -92 -113 -111 6 110 83 -40
5994 -40 -81 -73 -125 6 113 30 4 -81 41 35 -94 -3 56 -71 39 4 20 34 -37 170 64 -58 -18 119 74 -2
6020 -2 59 94 -10 72 17 16 -34 -139 -191 -55 10 82 36 -11 -135 20 -57 -154 21 -50 55 53 48 40 116 -6 -81 154
6048 154 15 106 -46 -111 -142 -14 -23 -48 2 -57 19 -119 -60 -38 -99 -29 -113 56 -40 93 93 73 65 -31 -33 -32 -87 194 142
6077A42j18j22N4l0R9p4M2j29Q3J13j26J00r9J39m3R8k11P5l1l3j16M08l27J03
6101cJ07j15Q3l01J44J62j77N6N1O7l0m7J32l3j18j14O4J54j23k9R3Nk94J83J9
6126f4j1Q0N4%m4j12J25J4j73J45N7j20J40k03J26o8N6J69m24J92P9N9r4Q7j92
6151a22K56j34J46k33J50q2p8M2R9L5moJ8O9j61j46K74k18J08J08j09j07J78M
6175H7j84K57o8j91J91j09m0O7n6j45P6J64oq1J80r7l0j6P7M3J37k63j07Q6J16
6200H8l9o2R9q5J73j65l6q6J38N0Oqj00n5O7R6n2n3M7O0m8k4k3j45J17Nl3l7P3
6229c2P3p7J2l0R3K8R9j29k5l9N2J13j85M6J57k69J26j05p8K03j10j8K07j61P9
6254C0k17J90j30O6J01m7MQ8j39M1J46k54J58k05L68k95l1J22j38K72q8KL6j76
$$ plain form
6077 142 24 -98 -44 -74 25 -49 -7 -136 -53 60 -66 34 -65 74 31 129 -82 -7 -38 -71 -187 221 -106 -3
6101 -3 104 -11 72 -229 -85 77 -100 -44 7 74 44 -3 129 96 -22 -136 -72 82 -41 -70 23 28 -266 -83 -64
6126 -64 -75 5 59 59 15 -97 28 42 -131 14 71 -49 91 -112 14 -54 2 171 -253 -61 18 77 -17 70 -122
6151 -122 134 0 146 -87 63 -19 -97 -55 44 79 75 69 87 156 -5 -151 123 -95 13 121 12 -95 83 87
6175 87 -97 160 92 -99 92 -17 -57 10 -46 -191 -115 49 43 -38 142 45 15 -1 76 119 256 -7 -114 -28 88
6200 88 49 -13 86 1 174 9 -27 -113 25 75 81 73 -27 -82 -15 81 29 -24 23 83 35 11 -12 -157 -40 -35 -68 -105 -32
6229 -32 41 -36 -24 -54 39 67 166 37 12 -27 25 138 -47 -1 156 -113 13 -92 -170 33 -77 -95 112 -49 30
6254 30 -187 3 -127 -61 40 -7 -3 85 -54 -13 133 -121 37 -168 200 -95 -126 -4 -142 130 42 44 80 -96
6278i6J07o9Q0j10J31k5m5o4K6M4l7l4J68j02O9M2M8o8o1J31O0j56j05J80n9O5
6304A20j80J12o3o8R8j46M2J8J05j26j27J63J0q1J50M2J30l32J61K7k3rq1J22
6328F4r8P3N1j6j3n6p2M6J17r9N8p3ON4j04J09k40L19k56K14j27J22j66J08p0
6353d9J15jl4J7nr0K2m7J62q4RP1K5M8j45O9n8k8o9P5j35K12j15mj69M8J19j97
6381b38K37k5qJ2n1Q3k3k6M6K0n7k9Q3J81j55j32K00j57J17mK8M6j13O4j63J26
6407F2m1r4J32n4o1K1P1j0O1k01J27n9P8j09K9q2J49J50j07l6%q2Q4P3j83K4J6
6434d2P9N0q8K5o0m3J8p9L36l12J40L9m3K6l5N6j31J73l8j35mJ37k1l1m2J7J61
6461A53j05o4J57k02l3K99k96J00j18J43q1j3J57J53l70J68j36K22j55l7K26j48
$$ plain form
6278 -96 11 -58 22 -88 43 18 -27 -91 -65 -21 -58 -92 76 -26 43 85 133 65 4 135 195 39 -66 114 55 120
6304 120 -60 52 -11 -79 19 -127 -85 -67 38 -88 -215 -52 -42 -123 27 69 199 -133 28 55 32 23 -58 64
6328 64 -34 39 90 74 61 5 -67 -21 96 -3 55 -18 -12 42 -62 47 -193 126 -130 84 -43 79 -87 21 -49
6353 -49 66 65 31 48 43 -47 -25 -72 90 6 15 86 111 159 14 83 25 -3 -72 3 -132 80 -35 -39 -208 -160 -41 -238
6381 -238 -1 -26 -34 -22 -73 10 -13 -39 7 27 -30 -59 24 205 50 -82 118 -39 78 74 102 148 35 99 -64 62
6407 62 21 -73 59 5 -56 -35 36 26 87 -114 13 -46 32 -77 -48 -130 19 169 62 26 26 -56 28 101 -82 -58 -42
6434 -42 37 87 -1 24 -36 -79 -61 -140 196 -116 24 63 20 46 11 67 -64 109 71 -64 -68 69 48 17 -25 -8 153
6461 153 48 -16 141 -61 -94 205 -91 9 -109 34 -47 -60 97 250 -120 48 -88 134 -21 -58 168 20
$$ [...]
8191a52
##END NTUPLES=NMR FID
##END=
