##TITLE=1H_Pr 37-ACid
 CDCl3
 8 sc, 
 20.2.2023
##JCAMPDX= 6.0         $$ Bruker NMR JCAMP-DX V2.0
##DATA TYPE= NMR FID
##DATA CLASS= NTUPLES
##ORIGIN= UXNMR, Bruker Analytische Messtechnik GmbH
##OWNER= root
$$ XWIN-NMR		Version 3.5
$$ Mon Feb 20 16:21:23 2023 Russian Standard Time (UT+4h)  she@DPX200
##.OBSERVE FREQUENCY= 200.13135
##.OBSERVE NUCLEUS= ^1H
##.DELAY= (6, 6)
##.ACQUISITION MODE= SIMULTANEOUS
##.ACQUISITION SCHEME= undefined
##.AVERAGES= 8
##.DIGITISER RES= 18
##SPECTROMETER/DATA SYSTEM= spect
##.PULSE SEQUENCE= zg30
##.SOLVENT NAME= CDCl3
##.SHIFT REFERENCE= (INTERNAL, CDCl3, 0, 15.7039)
##AUDIT TRAIL= $$ (NUMBER, WHEN, WHO, WHERE, WHAT)
$$ ##TITLE= Audit trail, XWIN-NMR		Version 3.5
$$ ##JCAMPDX= 5.01
$$ ##ORIGIN= Bruker BioSpin GmbH
$$ ##OWNER= she
$$ F:/spectra/data/she/nmr/H-F/1/audita.txt
$$ ##AUDIT TRAIL=  $$ (NUMBER, WHEN, WHO, WHERE, WHAT)
(   1,<2023-02-20 16:19:35.54 +0400>,<she>,<DPX200>,
      <created by zg, POWCHK disabled, PULCHK disabled
       configuration hash MD5:
       00 E9 B6 7A A2 85 ED C7 34 08 36 98 17 FE 4E 26
       data hash MD5: 16K
       DF 55 07 36 85 3F F8 7F 9F A4 7C 8C 59 34 37 18>)
$$ ##END=
$$ 
$$ hash MD5
$$ 8E 03 A7 CC 48 42 AF 7F EC 2B 01 44 43 D1 FB A4
##$RELAX= 
##$RELAX= 
##$RELAX= 
##$RELAX= 
##$RELAX= 
##$RELAX= 
$$ Bruker specific parameters
$$ --------------------------
##$DU= <F:/spectra>
##$EXPNO= 1
##$NAME= <H-F>
##$PROCNO= 1
##$TYPE= <nmr>
##$USER= <she>
##$AMP= (0..31)
100 100 100 100 100 100 100 100 100 100 100 100 100 100 100 100 100 100 
100 100 100 100 100 100 100 100 100 100 100 100 100 100 
##$AQSEQ= 0
##$AQ_mod= 1
##$AUNM= <au_zg>
##$AUTOPOS= <>
##$BF1= 200.13
##$BF2= 200.13
##$BF3= 200.13
##$BF4= 200.13
##$BF5= 200.13
##$BF6= 200.13
##$BF7= 200.13
##$BF8= 200.13
##$BYTORDA= 1
##$CFDGTYP= 0
##$CFRGTYP= 5
##$CHEMSTR= <none>
##$CNST= (0..31)
1 1 145 1 1 1 1 1 1 1 1 1 1 1 1 1 1 1 1 1 1 1 1 1 1 1 1 1 1 1 1 1 
##$CPDPRG= <>
##$CPDPRG1= <>
##$CPDPRG2= <>
##$CPDPRG3= <>
##$CPDPRG4= <mlev>
##$CPDPRG5= <mlev>
##$CPDPRG6= <mlev>
##$CPDPRG7= <mlev>
##$CPDPRG8= <mlev>
##$CPDPRGB= <>
##$CPDPRGT= <>
##$D= (0..31)
0 1.2 0 0 0 0 0 0 0 0.06 0 0.03 0 0 0 0 0.0002 0 0 0 0 0 0 0 0 0 0 0 0 
0 0 0 
##$DATE= 1676895574
##$DBL= (0..7)
120 120 120 120 120 120 120 120 
##$DBP= (0..7)
150 150 150 150 150 150 150 150 
##$DBP07= 0
##$DBPNAM0= <>
##$DBPNAM1= <>
##$DBPNAM2= <>
##$DBPNAM3= <>
##$DBPNAM4= <>
##$DBPNAM5= <>
##$DBPNAM6= <>
##$DBPNAM7= <>
##$DBPOAL= (0..7)
0.5 0.5 0.5 0.5 0.5 0.5 0.5 0.5 
##$DBPOFFS= (0..7)
0 0 0 0 0 0 0 0 
##$DE= 6
##$DECBNUC= <off>
##$DECIM= 32
##$DECNUC= <off>
##$DECSTAT= 4
##$DIGMOD= 1
##$DIGTYP= 9
##$DL= (0..7)
0 120 120 120 120 120 120 120 
##$DP= (0..7)
150 150 150 150 150 150 150 150 
##$DP07= 0
##$DPNAME0= <>
##$DPNAME1= <>
##$DPNAME2= <>
##$DPNAME3= <>
##$DPNAME4= <>
##$DPNAME5= <>
##$DPNAME6= <>
##$DPNAME7= <>
##$DPOAL= (0..7)
0.5 0.5 0.5 0.5 0.5 0.5 0.5 0.5 
##$DPOFFS= (0..7)
0 0 0 0 0 0 0 0 
##$DQDMODE= 0
##$DR= 18
##$DS= 0
##$DSLIST= <SSSSSSSSSSSSSSS>
$$ [...]
##$SUBNAM2= <"">
##$SUBNAM3= <"">
##$SUBNAM4= <"">
##$SUBNAM5= <"">
##$SUBNAM6= <"">
##$SUBNAM7= <"">
##$SUBNAM8= <"">
##$SUBNAM9= <"">
##$SW= 18.05172834244
##$SWIBOX= (0..15)
0 0 2 0 0 0 0 0 0 0 0 0 0 0 0 0 
##$SW_h= 3612.71676300578
##$TD= 16384
##$TD0= 1
##$TE= 0
##$TE2= 300
##$TE3= 300
##$TEG= 300
##$TL= (0..7)
0 120 120 120 120 120 120 120 
##$TP= (0..7)
150 150 150 150 150 150 150 150 
##$TP07= 0
##$TPNAME0= <>
##$TPNAME1= <>
##$TPNAME2= <>
##$TPNAME3= <>
##$TPNAME4= <>
##$TPNAME5= <>
##$TPNAME6= <>
##$TPNAME7= <>
##$TPOAL= (0..7)
0.5 0.5 0.5 0.5 0.5 0.5 0.5 0.5 
##$TPOFFS= (0..7)
0 0 0 0 0 0 0 0 
##$TUNHIN= 0
##$TUNHOUT= 0
##$TUNXOUT= 0
##$USERA1= <user>
##$USERA2= <user>
##$USERA3= <user>
##$USERA4= <user>
##$USERA5= <user>
##$V9= 5
##$VALIST= <valist>
##$VCLIST= <CCCCCCCCCCCCCCC>
##$VD= 0
##$VDLIST= <DDDDDDDDDDDDDDD>
##$VPLIST= <PPPPPPPPPPPPPPP>
##$VTLIST= <TTTTTTTTTTTTTTT>
##$WBST= 1024
##$WBSW= 4
##$XGAIN= (0..3)
0 0 0 0 
##$XL= 0
##$YL= 0
##$YMAX_a= 685326
##$YMIN_a= -1078847
##$ZGOPTNS= <>
##$ZL1= 120
##$ZL2= 120
##$ZL3= 120
##$ZL4= 120
##$ABSF1= 10
##$ABSF2= 0
##$ABSG= 5
##$ABSL= 3
##$ALPHA= 0
##$AQORDER= 0
##$ASSFAC= 0
##$ASSFACI= 0
##$ASSFACX= 0
##$ASSWID= 0
##$AUNMP= <proc_1d>
##$AZFE= 0.1
##$AZFW= 0.1
##$BCFW= 1
##$BC_mod= 2
##$BYTORDP= 1
##$COROFFS= 0
##$CY= 11.3945322036743
##$DATMOD= 1
##$DC= 2
##$DFILT= <>
##$DTYPP= 0
##$F1P= 2.36226072786647
##$F2P= -0.459571619588291
##$FCOR= 0.5
##$FTSIZE= 0
##$FT_mod= 4
##$GAMMA= 1
##$GB= 0.15
##$INTBC= 1
##$INTSCL= 1
##$ISEN= 128
##$LB= 0.24
##$LEV0= 0
##$LPBIN= 0
##$MAXI= 10000
##$MC2= 0
##$MEAN= 0
##$ME_mod= 0
##$MI= 1.114404
##$NCOEF= 0
##$NC_proc= 0
##$NLEV= 6
##$NOISF1= 3.799351
##$NOISF2= 2.8
##$NSP= 1
##$NTH_PI= 0
##$NZP= 0
##$OFFSET= 15.70392
##$PC= 1
##$PHC0= -19104.28
##$PHC1= 9.60078
##$PH_mod= 1
##$PKNL= yes
##$PPARMOD= 0
##$PSCAL= 0
##$PSIGN= 0
##$REVERSE= no
##$SF= 200.130013532006
##$SI= 16384
##$SIGF1= 3
##$SIGF2= 2
##$SINO= 400
##$SIOLD= 16384
##$SREGLST= <1H.CDCl3>
##$SSB= 0
##$STSI= 0
##$STSR= 0
##$SW_p= 3612.71676300578
##$SYMM= 0
##$S_DEV= 0
##$TDeff= 0
##$TDoff= 0
##$TI= <>
##$TILT= no
##$TM1= 0
##$TM2= 0
##$TOPLEV= 0
##$USERP1= <user>
##$USERP2= <user>
##$USERP3= <user>
##$USERP4= <user>
##$USERP5= <user>
##$WDW= 1
##$XDIM= 8192
##$YMAX_p= 0
##$YMIN_p= 0
$$ End of Bruker specific parameters
$$ ---------------------------------
##NTUPLES= NMR FID
##VAR_NAME=  TIME,          FID/REAL,        FID/IMAG
##SYMBOL=    X,             R,               I
##VAR_TYPE=  INDEPENDENT,   DEPENDENT,       DEPENDENT
##VAR_FORM=  AFFN,          ASDF,            ASDF
##VAR_DIM=   8192,          8192,            8192
##UNITS=     SECONDS,       ARBITRARY UNITS, ARBITRARY UNITS
##FACTOR=    0.0002768,     1,               1
##FIRST=     0,             0,               0
##LAST=      2.2672688,     0,               0
##MIN=       0,             -1078847,        0
##MAX=       2.2672688,     685326,          0
$$ Real data points
##PAGE= N=1
##DATA TABLE= (X++(R..R)), XYDATA
0@%%%%%%oJ4j6J6k4M0m8N6p2R6j21J53j92K24k69L25l84M56n37O29p33Q49r84
29e28J134j299J482j684J911k164K440k741L073l442L847m286M766n293N867o494
45c411P178p924Q741r638J0619j1696J2886j4200J5659j7288J9117k1188K3554
58A2409k6282K9473l3268L7861m3558N0844o0532P4124r4700J29831k05364O28605
70D99443n73778q57380J513098q0903q43446K91100M03930o28655J32945N32344
80C88698m21912l92049N07945J36525k24610j54659N5212J78161l118k41988N7426
91a14369K14140j60864j40740L64146j22189l81153M08429K55354n09126j7076
101b03448M95677j37219l75786K85032J15263l12697J36475J90705k40974o8446
$$ y = [0, 0, 0, 0, 0, 0, 0, -6, 8, -8, 8, -16, 24, -24, 32, -40, 56, -65, 88, -104, 120, -149, 176, -208, 248, -289, 340, -393, 456, -528, 606, -693, 789, -895, 1016, -1148, 1292, -1449, 1624, -1818, 2029, -2257, 2509, -2784, 3083, -3411, 3767, -4157, 4584, -5054, 5565, -6131, 6755, -7445, 8214, -9074, 10043, -11145, 12409, -13873, 15600, -17668, 20193, -23365, 27479, -33053, 41071, -53629, 76202, -129162, 499443, -74335, -931715, 581383, 500480, -342966, -51866, 352064, -276591, -143646, 388698, -33214, -425263, 82682, 219207, -5403, -160062, -104850, 73311, 70193, -171795, -114369, 99771, -61093, -201833, 162313, 40124, -341029, 67400, 322754, -186372, -203448, 292229, 155010, -220776, 64256, 179519, -133178, 3297, 194002, -46972, -115418]
111a15418K04514M587j68337O5074J38991m8332q5951n8978J19245J27042k38181
122e5744j13823K66512N4835k76946m2415K57747l6062j74385J19648K7193j11337
133h4777P9175R0886j00767r6359J20887O9149j10291j126L1781k5507L1139K4684
145B8874k9142m1988M9599P4215m7135m2316J0813L5241L2425n8153l5687L6635
157A3381K1242j7193l8711J7203J8040k258K4476m1976k0106O6940J0003n8466
169g425l3257N3235J5568o0669K2167J5013m9772K652L9674J3545n3811j5162
181e8242P1337O637l8283j5690K1844L8362k3513j3769J1273j2040K0576J3385
193B1877j9304j3304K2880L9547l5050k1139M3684r505k3562J4448P378k7303
$$ y = [-115418, 89096, 93683, -74654, -9580, 129411, 81079, -4872, -63850, 55395, 182437, -55744, -169567, 96945, 151780, -125166, -167581, 90166, 54104, -120281, -633, 26560, -84777, -5602, 85284, -15483, -111842, 9045, 78194, -32097, -33223, -1442, -26949, 4190, 28874, -268, -42256, 7343, 81558, 34423, -7893, 2920, 38161, 70586, 12433, -23254, 13381, 34623, 17430, -21281, -4078, 13962, 11704, 36180, -5796, -25902, 41038, 51041, -7425, -40682, 12553, 28121, -32548, -10381, 4632, -45140, -42488, -2814, 10731, -43080, -58242, 13095, 19732, -18551, -34241, -12397, 25965, 2452, -11317, -44, -12084, 8492, 21877, 2573, -10731, 12149, 51696, 16646, -4493, 39191, 29686, 6124, 20572, 27950, 647]
205F47j3591L7923j6027m3164K6508J7514j5237j3392M599J3388j0897N293J862
218d574j3080J3769K313m354r467p283L0516n192l0164J4250K5574l867l2730
231b4289J6004L6502k9598r003K0228n067l370J198M607j0786L77K4836j5923
244E716j3912J8195N144l106r267N464O917j4097P373O066j4197p863J0126J4398
258A6957k4081j4209K6480Q8j6711n42P617r4n454Q435r175q153K2024l602j7280
273a7700L423J4406M985j8457K584J6932m798k760q78P799J916j0389J3463l03
287A0223j3671J1600M006p388l886P438J910j4575J1668M812k0406Q440R684j1768
301a913o100O186M214j0553o50L275m992O736m247q319Q883K361m051j146L364
$$ y = [647, -12944, 24979, 8952, -34212, -7704, 9810, -5427, -18819, -14220, -832, -11729, -6436, -4574, -17654, -3885, -1572, -5926, -15393, -22676, 7840, 2648, -27516, -13266, 12308, 8441, -24289, -8285, 28217, -1381, -10384, 9844, 4777, 1407, 2605, 7212, -3574, -3197, 21639, 5716, -8196, 9999, 15143, 12037, 2770, 8234, 15151, 1054, 8427, 14493, 296, -7567, 2559, 16957, -7124, -21333, 5147, 5235, -11476, -12018, -4401, -4495, -9949, -1514, -10689, -18842, 3182, -420, -17700, -14277, 129, 5114, -13343, -10759, 6173, 1375, -1385, -2263, 5536, 7452, -2937, 10526, 10223, -3448, 8152, 12158, 4770, 884, 8322, 10232, -4343, 7325, 12137, -8269, 171, 9855, -1913, -8013, -1827, 2387, -8166, -8816, -5541, -10533, -3797, -8044, -16363, -7480, -5119, -9170, -10316, -6952]
316f952L243M2K957l746N082R215r680L796Q304q060L242P570n562o788J1239
331A3902K532j9400J2202R649k4420O351J4716j8660p702J7116r41k0856R864
344e647J0677k0095O365J0803j4918M168R599q261k997R799J249o986O330k256
358b170n591J4760p082j3730J7063K838j6552O218J2773j4197j534K0172j3442
371d74j1568K3901k772j7815J4409R309j8216K827J9750j6772r529K2430p901
384G579j5086J4236J149j4379N506J0248j5833m391J8371j0929j1326J5232m624
397d247j1708J1487N245j4409J820J7229j0187p238J7720n545q653J8067l60j8241
411i020R735J8012j5058p769J6772p745p671J7327p341j8006J7187J2073k1895
$$ y = [-6952, -3709, -3667, -710, -4456, 626, 9841, 161, 3957, 12261, 4201, 7443, 15013, 9451, 2663, 13902, 16434, -2966, 9236, 18885, -5535, 816, 15532, -3128, -10830, 6286, 5345, -15511, -5647, 5030, -15065, -8700, 2103, -12815, -8647, 952, -7309, -10306, -507, 742, -6244, 86, -2170, -7761, 6999, -83, -13813, 3250, 6088, -10464, -4246, 8527, -5670, -7204, 12968, -474, -12042, 11859, 9087, -8728, 5681, 14990, -3226, -399, 19351, 2579, -6950, 15480, 7579, -7507, 6729, 7878, -6501, -995, 9253, -6580, -10971, 7400, -3529, -14855, 377, -4247, -15955, -4468, 777, -13632, -11812, 5417, -4770, -12008, 5712, 167, -8486, 9581, 9221, -9020, 715, 18727, 3669, -4100, 12672, 4927, -2744, 14583, 7242, -10764, 6423, 18496, -3399]
424c399k274J7368j1676m442J4398j4125r442J9911l842k0019J2404J1024k1088
437a5202O632J9934k2399n225K7274r502j7411J8422N540j8783R684J4108k0856
450g784J856K1463j4742o964J9067p122j2292J7362L703k1496O238J4737j4971
463i45k728R133j2644p12J6762j0827j5132J5741Q034j2807N355L147j3062J1731
477A046J4107k1776j0252K4116M239j9557K868P088n790P257J532j3560M519J2207
491H044o839p223O275k542l267J3310n719j8327J3674J4148j3120n920J0332K424
505E250k333N456l231o013J0038J507j0100L499J893p713K196O130q098n719R050
520A812J038p683K811O16n101L618L922n336k458L016k66J535J840p035P25J2078
$$ y = [-3399, -5673, 11695, 19, -4423, 9975, -4150, -13592, 6319, 2477, -17542, -5138, 5886, -15202, -8570, 11364, -11035, -16260, 11014, 1512, -15899, 2523, 8063, -10720, -1036, 13072, -7784, -5928, 15535, 793, -6171, 12896, 5774, -6518, 10844, 14547, -6949, -711, 14026, -945, -3673, 5460, -7184, -7896, 8866, -1961, -17093, -1352, 6682, -6125, -770, 2377, -10685, 1046, 15153, -6623, -16875, 7241, 11480, -8077, -5209, 1879, -3911, 3346, 4878, -8682, -4163, 8044, 1205, -6018, 257, -2285, -5552, 7758, 2039, -16288, -2614, 11534, -1586, -7506, 2826, 5250, 2917, 8373, 5142, -871, 9167, 10674, 574, 4073, 5966, -1747, 449, 6579, -1519, -7238, 1812, 2850, -4833, -2022, -1406, -6507, -2889, 1033, -4303, -6761, -3745, -4011, -2476, -636, -7671, -6946, 5132]
536E132p03j0879J563J0799J19m612P36j690O25M987k385n576j704M019M892k050
552C273p218j427R535N713j1179o204R199N025n131n824K49M145J654j651l627
567c468j99M134O15o11j015k094K251M282j696n351M96M445o94k504J59r03n84
584b737K803K520k743k634K504L443M70l868k295L669K534l392k718K037K176
599A769j583Q94J064l501J242M700l35n244k244N848K827n196m475J614M928j28
615B180o046j546L670L016j192m406o18N028K079l522l105L230K086j609l94K61
631h88K38J768J642k344p83L593J243k587o98J237N05j063o69k4k14r10m24J014
649F36p67k462J948K109m176q87M576k63m929J115N254k250m103K819K401q94
$$ y = [5132, 4429, -6450, -4887, 5912, 6031, 1419, 2155, 465, 1090, 6077, 3692, -1884, -3588, 431, 5323, 3273, -3945, -5372, 4163, 9876, -1303, -7507, 1692, 6717, 1586, -4238, -3989, 156, 1810, 159, -3468, -3667, 467, 1082, 471, -544, -2638, -387, 3895, 2199, -3152, -2656, 1789, 1095, -1409, -1250, -2153, -2737, 66, 2586, -157, -2791, -287, 3156, 3626, -242, -2537, 1132, 3666, 274, -2444, -407, 1769, 186, 1080, 2144, -1357, -115, 4585, 4250, -994, -3238, 2610, 5437, 241, -4234, -2620, 2308, 2180, -3866, -5412, -1742, 1274, 82, -4324, -4942, 86, 2165, -1357, -4462, -1232, 854, -755, -1149, -888, -650, 1118, 2760, 416, -367, 3226, 4469, 1882, 1184, 2421, 2926, 1863, 1194, 1170, 956, 46, -378, 636, -131, -2593, -645, 1464, -2712, -3599, 977, 714, -4215, -3100, 2154, -96, -4199, -1380, 1021, 127]
665A27n99j75M74J019J076n95k083J283K417j463k633L29L333r96l399J196K350
682A661j725r42J688r02j738K125J516k765j483K724J180k128o2J528o61L2R55
699A003l20j634O72K928j629l370K466K376k588j635J649J435j797p00J263r31
715h12O02Q04j294j06O39K77l37l72O23K21K8L10n10M55Q0n89J102j97j706J355
735E73J352k364j224K116O01j821J70O79r76M47J304k395q98L205l34k820Q87
752a498J438n71j10P88n48k82K249r01j019J999o77n05K091r53j971J787J612
769B929k643j036K656j152j697K319j156k539K385J080k987o8K201j230j505J848
785e95Lj725J495J82q66J566J24j536K185J355k407L35K496j566r90K415r02k844
$$ y = [127, -472, -647, -173, 846, 1922, 1327, -756, 527, 2944, 1481, -1152, -823, 2510, 1514, -1885, -689, 1661, -64, -1006, 682, -220, -1958, 167, 1683, -1082, -2565, 159, 1339, -789, -851, 677, 16, 48, 1003, 683, -951, -279, 2649, 1020, -2350, 116, 2492, -96, -1731, -82, 1353, -444, -1144, 119, -812, -210, 594, -700, -806, -167, 110, -227, -599, 24, 245, 273, 583, 73, 528, 608, 19, 1121, 924, -782, 573, 1925, -439, -1663, 453, 1054, -767, -597, 82, -894, -447, 857, -1538, -2436, 769, 435, -2385, -1498, -60, -631, -741, 47, -501, -783, 1466, 565, -454, 1545, 868, 363, 2454, 1501, -470, 1317, 2929, 286, -750, 1906, 754, -943, 1376, 220, -2319, 66, 1146, -1841, -1909, 292, -938, -2443, -595, -592, -2317, -822, -640, -1506, 60, 184, -1352, 833, 2188, -219, 116, 2612, 1046, 56, 2471, 1569, -1275]
803a275K461J794m241L54L040k240j609K398m95j990J393J143j893o50J525j73
819d58J77m2j274J161J961k027kJ626n17q96K183l51k939J748K446l341j011K610
837A054j114j896K022L17k574N35K240p31j331P40Q7L49M31o17O9J346l63m97
855F7J063j62r19J636P32k205K69K119j175j806K089o83k230J101R24k372l18
872a870J518l86r42N76J08o15J624M7j481P72R06m86N36K82j110O90J484o20j002
891C1R28M36m74P60m09j553J208J095j621j145N45k89L9L46j589m98J898N11j806
910a587L66J410j065N82J151j710l54K209j68j613O92J019p42o5J103j248k45
927b65J479m93o65J46j69NK28p14q00Q22M01p93J95O32j290M82J988r31j283J299
$$ y = [-1275, 1186, 2980, -1261, -907, 2133, -107, -1716, 682, 187, -1803, -410, 733, -1160, -1810, -285, -458, -281, -323, -1597, -436, 1525, -502, -504, 1122, 605, -291, 1892, 1541, -1398, 350, 2796, -545, -1556, 1054, -60, -1956, 66, 383, -2191, -1656, 584, -147, -1478, -738, -651, -302, 129, -488, -419, 927, 564, 67, 1130, 968, 49, 1685, 2417, 212, 481, 2600, 1425, -381, 1708, 1025, -1205, -104, 820, -1552, -1870, -352, -738, -1680, -1104, -996, -1611, 13, 60, -1421, -649, 257, -229, 307, 589, -521, 169, 1653, 1033, 31, 959, 1395, 921, 1681, 1272, -281, 927, 2022, 401, -744, -199, -488, -449, -103, -1692, -2190, -292, 219, -1587, -1221, 189, -876, -294, 857, -853, -1207, 1002, 834, -779, -87, 932, 190, 125, 1228, -20, -265, 1214, 721, 56, 202, 33, 38, 266, -448, -1248, -426, -25, -818, -623, 9, -1281, -799, 1189, 258, -1025, 274]
947B74Q18p26o2J88m27L17Q11j227m72Q38L15l90P0o66q4J049j86j531k5J255
967A39k81r24L04J23O3Q19m79p04J191N34m62J55J15k30K51R22p52r93R43O29
987A363j208J83M56l72k11K55l77m25M72k55m66M46j81r35N05N94j147K11P89
1006c03P7o49N44N20m61K94O65l78m39M01K99J79m40o31L38O87l94q64o0R59l22
1027B2o38K88k86k0L46l16k64J36M23M34k77m26N02O22K72q67K57R41J5m65j46
1048E53K78k54J41p8j24m11M6L1rl23k35J43J18j97r2J20j91K07j47J02J35l66
1070e53N7N90p6n38K12L74K56l94p4K10J70K41j61l75J00K84J4k32l6j13K13K19
1092C88n55l01N80N33p12k87L58k02J20O4l27J19J78n9k77K31K50l51K39L71j90
$$ y = [274, 1092, 366, 304, 492, 65, 382, 1193, -34, -506, 332, 647, 257, 327, -339, -423, 626, 440, -1091, -1116, 139, -142, -1066, -762, -639, -576, 243, -236, -940, 251, 785, 323, 478, 593, 363, 614, 1536, 784, -209, 734, 1363, 155, 338, 794, 422, 211, 466, 89, -336, 136, -119, -585, -139, -320, -1255, -750, -156, -1303, -1092, -303, -226, -875, -331, 189, -272, 22, 687, 309, -130, 271, 570, 749, 309, -322, 16, 703, 309, -555, -615, 344, 22, -616, -328, -614, -634, -288, -604, -868, -732, -309, 125, -152, -578, -76, 546, 818, -49, 208, 1149, 1164, 699, 553, 831, 577, 718, 640, 516, 105, 151, 182, 173, -150, -385, -242, -124, -321, -413, -293, -484, -277, -424, -322, -187, -553, -496, 94, 18, -520, -308, 66, 322, -72, -146, 64, 234, 475, 314, -61, 39, 323, 337, 105, 69, -44, 169, 388, -167, -468, 112, 645, -67, -354, 4, -198, -78, -14, -341, -222, -44, -103, -380, -149, 101, -250, -11, 360, 170]
1113A70p0M87m66p8L83j65l18O0J90k74k37M01n06j06O77n19k98P07P5n50K84
1134a53J23k68J83M01m91k70R40Ll42L88o9jN68k18q43K96O18p12n40M12l64m97
1156h36P19j48o78N99L14o33K96N75j94k31M70j40l31O28Nm56L06J48n06L17L14
1177E38n30OL71l16j79J85j34o13M63J06o68K76L00n56R3P34l21j6M96L6m29L88
1199B30O2l03J11K97m14o6M62l28j33L43J0p9J19k36j00L09m3n07l2M31m37K1
1221b83L69l31j45N92j83PJ54J40k50K19K39l85k2L53k35p6L28k76K89k2n1J24
1243E55K54k00j80qq8l96j56L43p99l9L37k64m12M84J12m17K97M52k97k70P54
1264F2j51l03K22L23j24J70K92k69J7J18J17j07p1N7k25K24l11l69L04P4p65K56
$$ y = [170, 100, 587, 121, 43, 426, 261, -57, 3, 193, -81, -318, 83, -423, -529, 148, -371, -669, 38, 113, -437, -153, -30, -298, -115, 286, -205, -475, 465, 468, 126, 514, 445, 444, 1012, 794, -49, 247, 865, 153, -387, 25, -339, -836, -117, -265, -943, -344, -30, -663, -367, 208, 14, -217, 253, 113, -218, 410, 415, -41, 265, 413, -93, 224, 538, 8, 14, 385, 69, -110, 75, -59, -672, -209, -103, -771, -495, -195, -751, -658, 76, -245, -261, 235, 271, -158, 230, 292, -11, 100, 397, -17, -83, 379, 51, -82, 261, 271, 192, 311, 75, -25, 284, 241, -266, -298, 133, -304, -283, 86, -245, -390, 202, 19, 26, 180, 320, 70, 289, 528, 143, 121, 474, 239, 163, 491, 215, 504, 482, 431, 555, 809, 609, 429, 421, 333, -63, -219, 124, -675, -714, -377, -641, -1053, -569, -457, -874, -577, -125, -422, -692, 62, -89, -392, -170, 153, 29, 199, 491, 222, 239, 357, 474, 367, 296, 353, 128, 352, 41, -328, -24, 50, -715, -459]
1286d59L4k42L31K32j27k00N28J31j59J78K58k65J39J90l25K64L9q7j24K2L7j67
1308B28n7j71l31J60J56m17K1L17l43j19K81Q3k10J82M23k39o6M97J24l07J32
1329C44Q8k1p7n8m1p0J64n09J12O5l22M4K74l75j79K98P6m49J97L34k87j60N90
1352C8j09j81L31J45j50K84N0q6J67M3o4k33k9J56j97j00%j06pk46k03L40k29
1375c86k34P0L83n03J03L95p3j83K05R6k27J00K92j39O3M23k30j08L87j14j05
1396B15K18l9j11J19m3k30qJ27k39K5j70p0j2R3k35R7K90k12J4j4M7j35J70J69
1420F6j88K5K31R4O8r7K74j66J4K40k43J17r3j26K0l1l99L5R2k16j30j72J22J86
1444b77l14K11o9K68M4j57P7K44R5p2J81j98N1J61R7mm4j07k4R8m2k09j29J25
$$ y = [-459, -425, -667, -336, -104, -231, -431, 97, 228, 69, 247, 505, 240, 379, 569, 244, 508, 547, 460, 336, 358, 395, 228, 171, 0, -331, -171, -15, -432, -411, -94, -437, -556, -275, -192, -402, -220, 203, -36, -102, 395, 519, 212, 344, 432, 411, 334, 276, 235, 165, 329, -180, -68, -3, -325, -281, -7, -382, -561, -263, -187, -636, -439, -105, -392, -552, 38, -71, -252, 79, 224, 74, 358, 408, 322, 489, 532, 468, 235, 206, 362, 165, 65, 65, -41, -48, -294, -497, -157, -386, -620, -550, -167, -670, -567, -172, -245, -428, -223, -127, -354, -254, 38, -101, -38, 385, 155, 47, 434, 320, 215, 433, 394, 283, 402, 359, 129, 121, 248, 9, 34, -136, -206, -218, -125, -360, -263, 27, -185, -171, -185, -138, -273, -103, 66, -122, -97, 134, 228, 296, 199, 473, 307, 321, 561, 318, 435, 342, 216, 236, 205, -194, -159, -67, -283, -413, -585, -463, -277, -591, -380, -449, -181, -137, -294, -217, 27, 122, 50, 231, 33, 84, 245, 342, 338, 294, 187, 163, 261, 219, 10, -119, 6]
1468Fj28j62p1K07p5Q3NJ02J98j07J97lJ10p5Q3j5O7o9k08K25n4k62L77k76j83
1493b8M23j51m41J48P0k00j40J17r3k76J88P0k06L91N0j17L00o7l1N6Q2q6q1j
1517b3j09o9R9N3o5K41J53m55L26K83l62j53K13j15j11J91o8k48k1L11l61K79
1539a1j35q8J69J68j94J35J01j52n8M5O4o3M7K98k84Q0L30l60J80J34m59J10L
1562F0j79P8k08J0j57J42q5LM8J49l5P4R0l8p1J42J44j10P8P5j6N7J39p5m4J12
1588C83r5Om0l8P2j61k00K0J76k96j36L5K00k53j45L09J07p4m3J1P6L0M9J49R0
1613B32k0j16L1l8J09M2l8k1J66l4j13P9o1k52oN4j37j40n6K58j60l2n2J33K12
1638D0j94Q8J43j41k4Q9k5O5j69J53M4j6mK24l3k16K65o0k9j79M5Pk7N3k3k89
$$ y = [6, -122, -284, -355, -148, -223, -140, -135, -33, 165, 58, 255, 252, 362, 287, 370, 355, 422, 353, 145, 370, 316, 54, 431, 155, -28, 395, 244, -197, -49, 21, -179, -319, -202, -295, -571, -383, -313, -519, -128, -78, -195, 105, 38, 7, 63, 145, 59, -22, -23, -132, -201, -102, -49, -114, 127, 280, -175, 151, 434, 72, -81, 132, 17, -94, 97, 29, -219, -240, 71, -290, -11, -146, -234, -65, 103, -91, 44, 145, -7, -65, -20, 44, -19, 28, 326, 42, 122, 452, 92, 272, 406, -53, 57, 60, -119, -41, -249, -239, -396, -254, -339, -336, -288, -139, -174, -100, -10, -48, -119, 23, 167, 57, 135, 210, 194, 251, 390, 315, 271, 383, 288, 294, 254, 216, 288, 127, -73, -53, 123, -173, -309, -274, -74, -327, -472, -163, -56, -130, -173, -162, -86, -56, -7, 142, 232, 212, 96, 127, 89, 198, 240, 202, 181, 347, 313, 200, 279, 218, -34, -40, 14, -123, -263, -319, -61, -221, -253, -305, -172, 40, -154, -66, 77, -64, -88, 1, -24, 41, -128, 25, 69, 53, 49, 273, 240, 24, 289, 229, 200, 21, 66, 73, 46, 99, 76, -213]
1664b13K12p3n4m6R4J95n1LP6K9Q2k6j12J51k07n7J69R2l27J67J87j22j78q6J44
1689D9j62J09k58K6o1Q0n7p1l4L1Q9K5J46j43K98k0n5J18O2j24J27M8K5l56M52
1714C44l05K3J36j18K0q2j7K5k72M4J63m0k06J3P5K47j41r8J09%j2J60J39j44
1738F3J09K35j98J74O3l4p1n8o1M3k67K60j34k36Q0k54K23k7j51j33R4P8j72K50
1762a24k29J36J13j80Q9J1J99j2J23N0K3Q8j96N9O6J29j92K00j94j35N4j44j05
1785a71J65j74K44j06l21L10J45j70RP4l8pJ72l8j94R7K3J7r1J32j19K44r5K6
1809A34o7L1j11L2j08M0m0J51Pk73L9J7K3K0O2Oj1J75k6k21M3K77l00K28k3q5
1835B0j52L76j21K6o0N9Pj92J46K3j54L7j4j49Kp5p0K70N6l49J99K05j14k21J82
$$ y = [-213, -1, -74, -128, -174, -80, 115, 64, 67, 143, 172, 254, 228, 116, 267, 60, 3, 172, 264, -63, 104, 291, 169, -9, -95, 49, -113, -4, -262, -236, -297, -217, -274, -345, -379, -348, -259, -234, -88, -231, 67, 47, -8, 110, 172, 48, 175, 223, 248, -108, 344, 39, 62, 198, 80, 100, 18, 1, 26, -246, -202, -39, -79, -285, -272, -197, 50, -91, -189, -80, -80, -92, 68, 207, 63, 172, 407, 209, 383, 446, 412, 341, 283, 222, 265, -2, 258, 124, -112, -32, -286, -63, -90, -241, -374, -280, -202, -374, -124, -353, -217, -104, -284, -195, -184, 15, 3, 126, 176, 199, 287, 91, 150, 216, 345, 153, 353, 159, 24, 78, -66, -171, -6, -180, 64, -42, -363, -53, 92, -78, -69, 5, -33, -40, 132, 94, -100, -3, 20, 37, -54, 78, -41, 203, 108, 134, 67, 98, -13, 19, -89, -49, -89, 62, 69, -204, -165, -148, -125, -105, -43, -37, -48, 127, 101, -120, -77, 200, -100, 128, 105, 20, -132, 244, 123, 149, 89, 148, 155, -37, 109, 132, -22, 15, 1, -148, -146, -221, -291, -21, 35, -314, -115, 90, -24, -245, -63]
1860f3k8k2K73j53j02N8K41j43p0J94j1j35M5J8j46J74J53m32J1K31k14j79J91
1883a09j22r9K86j05J34r0J05J1O7Pj88K48nr0JM3o1R4Q9K6j70n9J05m6k17J43
1909bj64J29o5J23l11K91k77P8j2J08m2J33J21j58J78n2J49j57N6J71k57OP4j36
1933a6J42j6K2k99K06m9K8J08k17k0k06K58l6j50M6K7R5J22j66kJ39o2M4m7J05
1958E6k5k01L09N0j33j72J82j27J6mjJ31N2j05r7jK38j18q3N4j90J7K55j52q2
1983a31N2J67j85J48j0j74J42n5o1J20qM5Jn9J3J45p6On4j15J87j21N3j16J82
2008I6L8p2r2M3p8L7m1Q5oO4p9j2kj9P5K21k00LQ1k2j41jJ74k40M5P8n9j8m9L0
2038f1K07k12j15Q6L4o6J39r3k5O9J9J00r4J28r7N5j2p2K6p5K22j87NM2j8Kk1
$$ y = [-63, -91, -113, 160, 7, -95, -37, 204, 61, -9, 185, 174, 39, 84, 102, -44, 130, 283, -149, -138, 93, -121, -300, -109, -231, -330, -44, -149, -15, -105, 0, 11, 78, 85, -103, 145, 140, 50, 51, 94, 33, 127, 216, 242, 72, 13, 118, 72, -145, -2, -166, -37, -102, 21, -290, 1, -276, -198, -210, -102, -144, -11, 110, -48, 130, 78, 227, 70, 126, 297, 40, 46, 120, -16, 126, 110, 132, -167, 39, -10, 18, 126, -91, -111, -317, -59, -95, -245, -199, -172, -77, 45, -121, -123, 16, -46, -2, -49, 56, 31, -170, 139, 189, 56, -116, 66, -61, -45, -49, -50, 81, 133, 28, -69, -70, 168, 50, -33, 21, -169, -152, 103, -49, -131, -79, 88, -97, 51, 41, -133, 9, -46, -107, 13, 5, 50, 51, -8, 5, 150, 74, 80, 26, -89, 98, -23, 30, -86, 96, 134, 62, -30, 13, -65, -28, -69, 16, 10, 74, -5, -17, -19, -38, 37, 258, 58, 61, 142, 120, -21, -22, 152, -88, -43, 35, -24, -42, -91, -61, 146, -66, -181, -95, -61, -127, 12, -81, -106, -37, -18, 82, -12, 116, 19, 74, 62, -10, 16, -59, 163, -24, -19, 23, 5, 7, -14]
2065a4r0j53J77k8J72o2n8M5Q6N5j24k35J85P8r3P1L6N2j0q1J3P6p6J35n0J36
2091B43k29J12p3O4j26mP1l4q9J7J81j17K8l8k27l1J91R7j32K12l57L10qq0pJ87
2117A61k36J59o5K6J97j02M4k87J87k6j79L9K96j06Q1k07Rj23N6N5j3N7O3o4j89
2142a67J08L5j02J73J5j02R4l4Q8K6N0q1l5L2P3o0M9p8j74J24n4J48m8j13l7J18
2168D8k04j1R5P0j26M1J54p7q0L0M6k3J61q0k3M2k5J01j74l0R5J19j81J71p6k9
2194C4N2j45M7j83J13j01QK16j2J8j64J89nm4K8l9Q8n1R9p4K5k24J68Q2j80K02
2220A47m3k22K32j0m4q9K0J2n5L8M2q6R3j20j1K0K0R0j69Q9k1J19j12J48k39J55
2246Dr7J72l2J21p0JM8k24L3J21j84J44J35k07J1j47N9N1pJ30j18O7Jo7J49m4
$$ y = [-14, -104, -257, -80, -108, 64, 2, -56, -11, 75, 130, 6, -229, -44, 34, -59, 12, 48, 100, 90, 9, 22, 98, 22, 157, 107, 243, 14, 126, 53, 117, -9, -13, 58, 24, -65, -48, 133, 16, 44, 6, -221, -252, -61, 36, -96, 116, -241, 69, 61, -19, -26, 161, -75, 84, 19, 45, 242, 140, 184, -103, 84, 58, -121, -82, 214, 108, 189, -18, -9, -132, -76, -21, -34, 23, 86, 22, -167, -59, -24, -126, 47, 62, -40, 54, 20, 108, 134, 184, 103, 68, 100, 173, 113, 162, 84, -90, 34, -20, 128, 80, -33, -70, 48, -156, -167, -72, -2, -128, -87, 67, -10, -90, -60, -14, -37, 124, 44, 21, 63, 38, 139, -35, -65, 30, 149, -32, 139, 63, 34, 86, -59, -12, -195, -82, -183, -175, 41, 29, 47, -117, 72, 67, 23, 51, 12, 100, 49, 148, 74, 99, -125, 43, 125, -55, 147, 104, -118, 114, 104, 60, -29, -9, 3, -52, -14, 28, -58, 35, -85, -96, -76, -56, 34, -135, -46, -67, 52, -60, 88, -151, 4, -93, 79, 47, 168, 98, 99, 147, -77, -44, 77, -107, 37, 172, -35, -24, -171, -112, -61, -68, 62, -56, 11, 12, -55, 94, 50]
2272E0j09J35L5k58N0R8j06J10j05P4J47j25r9J21q0l4R9R0q5J53k71J10j52J23
2296b9j8j13K85k91J93L6j16N5l0j9P7j44J79M2M3j02Q7j44j5Q8nl3N8qj85J68
2322E9j44M8M3r8M4M7J48l27K36r1J67n2Q2m1j00q1J6J37j39o3J90onm6P5nj70
2349g6J47j18N7j29M6P0m5QJ73j79l2J34j23K8QN9k9O2j42J04k9k6N5l1J35m3
2375H4j30KrL8m9J10jj8Mn8J82k85R6P6j50L2J21l6Q9j25J84k05J66j91Q2J16
2401A25l04K33k7K23k78r4L1M4j25J41n6K51k80J36m1k9K10k01r7P6P1o2L8O4
2425D9j05OL3q9K6j04J85l5Q8Q0j40j60Q3j0J46j53J89J9k28K17M7k33K2J6q1
2450a32J45j15J22j57J82j63R9k08K58M4m1J11k26P2N4l2j01K42j04l7o1K29k13
$$ y = [50, -59, 76, 111, -147, -97, 1, -105, 5, -100, -26, 121, -4, -103, 18, -62, -96, 3, 93, 8, 161, -110, 0, -152, -29, -47, -160, 125, -166, 27, 63, -53, 2, -28, -47, 30, -114, 65, 107, 150, 48, 135, -9, -24, 64, 59, 26, 84, 76, -109, 59, -85, -37, 6, -92, -48, -1, 147, -180, 56, -35, 132, 80, 162, 121, 21, -60, -44, 93, -46, -109, 81, 75, 70, 24, 99, 94, -76, 71, -47, 10, -119, -73, -3, -48, -40, 133, -46, -78, 56, -67, -39, -31, 28, -1, 61, -81, 23, -6, -32, 23, -8, 127, 84, -46, -44, -53, -15, -64, 46, 45, 27, 31, -27, 155, -130, -34, 42, -108, -76, 45, 9, 98, -27, 157, -48, 118, -73, 9, 125, -179, 54, 27, 250, -28, -122, -91, -47, -172, -31, -87, 164, -116, 20, -21, -50, 160, -41, -138, -62, 9, -53, -15, 49, -56, -50, -17, -106, -80, -184, 1, -34, 54, 134, -6, -166, -83, -93, 53, -100, 89, 108, -120, 97, 144, -89, -67, -51, -132, 13, -102, 20, -137, 45, -118, -19, -227, 31, 75, 34, 145, -81, -9, 45, 13, -88, 154, 50, 13, -48, 181, -32]
2473c2jj20J47P5j22J7Q9pL5KM4q6r3J98j61m8O0pq8N0k6L5J94m5L0j56j7Q6k7
2502B6j87J96J16m8j05J19k05J15k27K17m9j01J73q5R9R2j61m6KRJ0R4j14J4J86
2527A40j72j26J17k5O9J13n6Q2j43P3m0q3K5M9j01R7j09J54m2j22K54k50j09K21
2551A6K8j12L19m26K16Qm2J2r2j5J30j85M3J66N4j68K72k65n2L3K31j89mj12J10
2576b4j17nr9K39N1j48J31j18N8O1J66j77j04J6O0J46k5pj15j1j5P1n0lO8j26
2602g7J50j12J4JJ3j28J46j52Q9Qj0N5M9Q2j90J50j07N6J2L4j39K39l17J24j77
2627a87J25J63o2n9rm6p0P2J49j10L3J06j67J12j08P6p0J62m7j45l8Q2M1j41J75
2652C7M1j3J05k77P2J01o1q6R6J56p2j78P6N0j36N1j61J95p9p1L1P2j0N2R6j21
$$ y = [-32, -33, -153, -6, 69, -53, -36, 53, 46, 81, 83, 127, 41, -52, 146, -15, -63, -3, -10, -98, -48, -74, -39, 155, 110, 140, -16, -33, 53, 26, -161, 35, 151, 103, -2, 117, -88, 27, -200, 17, -32, -133, 40, -45, 54, 146, -15, -61, -59, -50, -40, 54, -60, -46, 140, -32, -158, -41, -66, 3, 116, 60, 142, -1, 72, 32, -51, -26, 23, -78, 19, -90, 64, 22, -100, 154, -96, -205, 16, 44, -68, 251, -175, 41, 49, 7, 19, -73, -88, 42, -143, -100, 66, 120, -48, 224, -41, -93, -60, 171, -18, -22, -134, -24, -141, -146, -245, -6, 45, -103, 28, -90, -32, 29, 195, 18, -86, -70, -10, 136, 111, 104, -11, -22, -37, 34, -16, -19, 49, -77, 73, -39, -25, -24, -11, -139, 7, -145, -56, -48, -58, -3, 46, 128, -62, 88, -19, 37, 49, 83, -56, 183, -134, -10, -187, -62, 101, 39, -20, -29, -75, -145, -73, 76, -34, -1, 105, -62, 50, -58, 18, -52, 110, 63, -82, -120, -38, 3, -138, 37, 78, 65, 170, -107, -35, 66, 5, -81, 15, 171, 99, -79, -3, 47, -89, -38, -199, -4, -83, -154, -123, -51, -61, -9, 87, -34]
2678c4P7j24J6N6m9J65k19R2NK3J08j19J3Q6r5kRkj06J71j57Q3n5%J76o0j6j82
2706a40J41O5Ok39K48j33Q4j71N6Q2m4J65j85J26L5m3j18R6j37Q3N4k3J22j94
2730f4J23j5j47K1J48j47l9J36Q2l1j59J53j41J81r6J11j31l7K08j33R0o3q4L9
2754EK0p5K69k35p8J45M0k43N8K24j07pM2o1N9M1j07N2o3K2P9j70J96onp8O4r1
2782a0n3P1N0m7J9o3L9k9n0j51K70J69j53j25J8J59k46l6R4J65Nk87K04o2J7m7
2808g9k3R9jn4R5L4P8Kk29K58j50oL8j35r1J71j27R7Q3j66j0k05L67j78Q4kJ19
2835F9J1j07j41J76j05J7J8n1R2J43m1j00r8J52q0n6O9P6K3q3k0J7J35j11P8k
2861H1n1k4o0J83o6k8j3j34R1N7n6O0jj11j2k00L55k5r0%m5L0K05j40j1P9o7J5
$$ y = [-34, 43, -81, -65, -9, -58, 107, -112, -20, -15, 8, 116, -3, 10, 96, 1, -1, 8, 6, -100, 71, -86, -3, -58, -58, 118, 58, 42, -140, 1, 66, 72, -167, 81, -52, 32, -139, -83, -1, -45, 120, -65, 61, 96, 53, -65, 31, -106, -23, 31, 8, 130, -64, 59, 44, -103, -82, 66, -81, -120, 16, 98, 67, -92, 61, -80, 101, 5, 116, -15, -52, 156, 23, 113, 50, -34, 5, 25, -50, 219, -16, -94, 51, 91, -152, -94, 130, 23, 16, 58, -3, 56, 97, -10, 42, -21, 1, 80, -90, 106, 100, 95, 17, 81, -10, -63, 8, 58, 11, 30, -33, 6, -23, -73, -224, 46, 215, 62, -63, -45, 114, -132, -168, -74, 91, 96, -191, 13, -49, -32, -79, -102, -3, -4, -58, 37, 71, 149, 151, -78, 180, 30, 24, 62, -73, -164, 7, -120, -23, 60, -106, -116, -321, 46, -132, -48, -50, 69, 80, -27, -168, 8, -97, -80, -62, -113, -21, 122, 81, -19, -117, 35, -45, -101, -32, 44, 67, -16, -36, -19, 116, 5, 83, 81, 30, 6, -54, 129, 63, 35, 22, -112, -21, 36, -20, 40, 39, -72, -84, -284, 71, 46, -44, -44, -89, -59, 146, 6, -5, 74, 7, 22]
2889B2j6J02k01J18o9J09L0o5l1n6K08l07K55j9j50J4K57k96K20p1J2o6n0M8p8
2914h0P3O8O0j53J89k94N6K07j06o7J44j14R0j23M2J62k72L2J11n2k1l4L2J51
2938A01M5o4p4O5j1m2Jm9j06K06j37K1R8j32K22o3N9j94o4R3k7M4km9L2K7M0J2
2966E2N0L1j31J7j1M5J11j73PK0j28J03J51j41Q2j43J41j13N1J00l2j01R6o7j51
2991a34P2l8R8K9j9m2L8N0p7Q8LN5j15j4p1J69j10J62j94o4K37j00J92Rj95O3
3017I2o7L3K2O3j49j5j20O5L2Q4j06j7J66n5l7j30Q6q0K10j00N1m2J18k8p6q8
3043h8J96n5q9K40j19m9j83L8L5J70Q8k12MmJ02l7J9j33J83p8j56Q5J29j20R1
3068E7p8J6jJ00j54j0J04Q4j77K8m9J7K8J28k3m4K3O7k0j73J05l1J40j95K0J41
$$ y = [22, 6, 108, -93, 25, -44, 65, 95, 30, -1, -57, 151, -156, 99, 80, -70, -56, 201, -95, 125, 54, 66, 0, -50, -2, -80, -7, 61, 121, -32, 157, -137, -81, 126, 20, -47, 97, -17, 73, -50, -8, 154, -118, -86, 25, -27, -48, -82, -50, 101, 146, 82, 8, 73, 62, 20, 21, -28, -134, 72, -65, -44, 54, -78, 144, 81, 140, -54, -118, -25, -52, -8, -10, -59, -27, 0, 40, 52, 102, 133, 2, 19, 8, 53, 164, -9, -2, 18, -110, -7, 144, 3, 85, -58, 83, -30, 21, 121, 89, -12, 84, 17, -134, -62, -100, -2, 27, 8, -34, 4, 54, -23, 65, 68, 123, 8, -6, -77, 92, -18, 144, -50, -114, 123, 23, 215, 224, 29, 92, 25, 58, 80, 143, -6, -21, -141, -76, -44, 40, -66, -83, 83, 28, -9, -139, -53, -133, 77, -23, 28, -14, 104, 76, 0, -88, 108, 53, -36, 204, 85, 36, -147, -109, -74, 96, 184, -28, -24, -28, 74, 37, 56, -77, 106, 28, -128, -43, 86, -34, 57, -21, -5, -6, 94, -60, -70, 34, 118, -59, -31, -80, -63, -35, 93, 70, 26, 49, 116, 96, -77, 28, -3, 137, -58, -38, 103]
3094A03j14j48J06N0L9L1l5Q6q2j70N1J00N4p1L5nNj08K06j63KP7R3j92O2M1n
3121D8j5p7r7J26P0k0j51K50n6Jj2o7j12J35J1O6j42M2p0J3q5MJ30L2k39K92O0
3148A37j13J58j67L9r2nJ9PN0k7m6JJ68j81K3J86k3j41J00K3J9j60k1n3N4K7l2
3175e0k5K03k88K87k51R2N1j49J35l8R4r1N4KN2o6L1Q5j17o5N2n2J03KJ73l33
3201a09R8j36K91l9j70k4R0N9j13K2RK04k36R3k32K75rj5m6L3k57O8J89o6J95
3226A74j74k8J6J63k15J89p6J7Or0pJ02op9n8L9jL1%Q2j54J94m29L37j6J8M1m2
3254C4j12q8K00k1j10J50Q1j10L2q6N3j11K9MO0Q5k88K99j24J06r3j15J40k7q1
3279i3J98J07l37J70r7j16J65l6J95j06l2o7jP3R1n4k13J02Q9r3N0n9J0Q8J2L
$$ y = [103, -11, -159, -53, -3, 36, 67, 32, 118, 36, -134, -83, 17, 71, 0, 35, 30, 35, -73, 133, -30, -28, 49, 142, -50, 12, 53, 48, 33, -44, -141, -15, 55, 35, -116, 134, 78, 79, 67, 0, -112, 23, 34, 100, -42, 0, -70, -57, -142, -138, -8, 24, -215, 77, 137, 24, 182, 15, 54, -38, -43, -24, -17, 33, 6, -40, -39, 129, -52, -29, 157, 134, -7, 93, 116, 135, -25, -46, -99, -45, -18, -50, -75, 128, -160, 127, -124, -32, 19, -130, 5, -33, 61, -30, 24, 26, 78, 12, 43, 128, 11, -54, -2, -54, 49, 51, 224, -109, -11, -147, 144, 105, -65, -89, 1, 60, -53, -31, -22, 182, -54, 39, -193, 82, 73, 58, 12, 45, -212, -144, 45, -21, 174, 0, -28, -12, 151, -64, 125, 49, 66, 72, -18, -25, 77, 71, -8, -66, -27, -28, 3, 3, 85, -69, 125, -304, 33, 17, 35, 76, 34, -78, -166, 34, 13, -97, 53, 134, 24, 56, -30, 23, -88, -59, -55, 5, 90, -198, 101, -23, 83, -10, -125, 15, -12, -93, 105, 212, -125, 45, -52, -168, -3, -39, 156, 50, 18, -49, -50, 23, 114, 60, -153, -51, 38, -55, -5, -64, -54, 34, 46, 49]
3305D9p7Q1pL2J5q9J12l00K05qj20L48l17M6L3J49j50M5o7Q2k00J9Q7m2Q4j1K1
3332B0L8J48p6j39q4J4R4Pq3J70j20J3o6K8k8O1j79K74p3j02l0j31J76r6J23O4
3358B3j1J4J7p2PJ67j51L2J51k15R0J30j23j36mJ82k15J07RJ40j75K10p9j10P8
3383F6j61M1R3k4mL7j01N3m5J64j49Q5j97o3J02R5J42k35J21o5L7l8J74k21R7
3408DJ24k50R7J44j87J52J10k86Q2l7k2k2P8j1J65o2j03o5R8o2L3N0n1j74P5J93
3434G3k87J81J80j11l3m4N0o3N8K2pN6j19J23j12K6J68k61J04Q3j59J22M6K3k86
3459a67L25j54N3m5o8J66j78j5oJ25q4P7o2j07J65nm6o1L4J8L1N7lON3r6R9p8
3487C4J1o8Q0j57P8m5K39k49L6PL1R6L8p4p5Q5q9N4J9Q7k85J84J4j21R5mj5l8
$$ y = [49, -28, 53, 46, 78, 93, 4, 116, -184, 21, 13, -107, 241, -76, -30, 3, 152, 2, 47, -20, 62, -138, -119, -32, -74, 10, -1, 20, 58, 206, 130, -9, -93, -79, 15, 22, -61, 109, -11, 2, -64, -36, -64, -3, -182, 92, 19, -83, -113, -244, -68, -164, -41, 23, 12, 26, 43, -29, -22, 145, -6, 26, 177, -38, 52, 182, 59, -77, -81, 101, -114, -7, 2, 142, -33, 177, 98, -12, 66, -95, -54, 39, 15, 11, 48, -53, 0, -45, 119, -30, 55, -142, -205, -103, -8, 134, -101, 20, -45, -8, -46, 128, -93, 4, 128, -122, -25, 119, -68, 84, 194, -92, -10, -47, -69, -91, -13, -24, 141, 79, -24, -89, 9, -53, -20, 30, -21, -195, -120, 73, -214, -33, 147, 36, 3, -41, 9, -54, 4, 26, 19, 75, -44, 79, -33, -7, 161, -100, 4, 87, -72, 50, 96, 119, -167, 158, 4, 57, 12, -56, 110, -68, -83, -89, 36, -48, 29, -33, -140, 25, 20, -26, -87, -53, -35, -4, 53, 50, 56, 109, 13, 112, 34, 45, -23, 57, -100, -22, -67, 172, -77, -41, -34, -3, 93, 131, 57, -18, 67, -22, 32, 51, 138, -147, 37, 51, -70, 25, 21, 6, -32]
3515c2l8J45j02nO2L7N7k15J55k5r6J52j94J24r1M7O7q4J34J8k91J95N4k24O6
3540h4R1J34j5j45J00j47o2M8J98k3j24k0o5K0j10Q4l0K35n8qO7j44n0Q4J46p7
3566D5k7P6J2j23O6J6pm6Np8J64r7m8J57o8r8Q8R2j12k66K14n9L7RJ09j87J39
3593A3j1o5J32j02M4r6J73K3k33K64j82m5J59j72J75j19k0J40no1j46K39J41k25
3617B1p4RJ82k45J00k48J60J14J6j0p8p9J54j0j55J91o3QJ35r0lL7k00J73J80
3642B25j62j14J03k23Q4J46k50K01j26J32j6J7kl4%M8j55J32O4j22J71q8o0m1
3666g0P1n8o8QJ86r9Q3j47n2J8K01k04J07L2R7l6N3j33P8j56K1P4Q2j42J14r8
3692c8j46K64j22j6O7j35K91j8j93K9J23j22j34J62O7j07m5O7J64j29l3p1K10
$$ y = [-32, -70, 75, -27, -32, 30, 67, 124, -91, 64, 39, -57, 95, -99, 25, -66, -19, 48, -36, 98, 116, -175, 20, 74, -150, -84, 7, 141, 126, -19, 81, -66, -128, -80, 118, 95, -29, -49, -114, -94, -204, -120, -150, 85, 27, 19, 86, -58, -108, -24, 122, 45, 18, 94, 106, -17, 49, 65, 58, 12, 17, -61, 103, 6, -42, 115, 47, -51, 37, 129, 17, -249, -35, -94, -57, -48, 61, -126, 13, 2, -63, 69, -33, 11, -85, 88, 111, -122, 142, -40, -85, 74, -98, 77, -42, -62, 78, 73, 12, -134, 105, 246, 21, -53, -44, 138, -107, -7, -255, -95, 19, 35, 25, -53, -132, 22, 12, -143, 48, -15, -7, 128, 38, 35, 72, -128, 45, 225, 63, -51, 52, -171, -87, 59, -191, 10, -116, 16, 0, 17, 15, -19, -19, 29, -126, 6, 70, -52, 119, 31, -29, -70, 1, -57, -125, -117, 69, -30, 53, -94, -146, -128, 73, -131, -24, 8, 105, 69, 122, -11, 67, -89, -68, 6, 88, -54, 60, -38, -184, 80, -42, -58, 9, -126, 165, 147, -46, -17, 106, -16, -150, 12, 79, -28, -73, -6, 158, 29, -4, -75, 135]
3715A35k54K06L1p2J87k72J06o5j1R3j24j32K07j0M0j62n4J61k05J50r3J78p3
3738c3J11o3j5l7J1J51n2Kj39j34K62j33Q9K77l88M9m4J25n3P0r2m7K9J33j12
3763c3j18J40q8J20n3m5L5J94k25M5N8r1J63j76Rk8L23k97j67M14j12l8r6J12
3787D6p2Q7j21N6K42k38J15O4k16L5oj54K63Q2L6j05r4M4rj32J15J2j78K43j34
3812a9K5j01J17p5J88j23J7k1j31J02J40j36q2kJ14l1K5RL0m2M6J22j32j26j3
3837i9K03j16J07l4R0k96R4J00M8l3j01J08mj4P8l41K14Qj51K33p7j3L0L1q8q7
3863a10J66j27Q2j20J24Kj25J09j10J92r9J67j68J26MQ5j5k83J23o2J62lmq9k2
3888EJ2J03j11lO0j17R2R4k08K50j51L0n7O8j76J00N8k1j16J25m9J15j9l11L14
$$ y = [135, -119, 87, 118, 46, 233, -39, 67, 2, -9, 84, -40, -172, 35, 25, 65, -97, -151, 10, -195, -45, -138, 40, -33, 78, 15, 0, -37, -26, 125, 73, 75, -64, -198, 64, -69, 20, 297, -91, -42, -86, 39, -14, 56, -36, -83, -54, 79, -33, -151, -11, -99, 21, -32, -77, -42, 152, -73, -28, 30, -61, 102, -74, -65, -93, 230, -67, -234, 180, 68, 30, -66, 46, -26, 61, -60, -4, 238, 0, 115, 179, -37, -2, -8, -162, 101, 183, 219, 114, 20, 64, 55, -77, 38, 50, -128, 115, -19, 6, -95, 22, -53, 135, 12, 29, 8, -123, -21, 119, -17, -99, -101, 13, -18, 7, 16, 46, 4, 50, 172, 40, -86, -99, 104, -12, 95, 61, 151, -145, -51, 49, 97, 64, -37, 71, 67, 53, 131, -210, 4, 12, -139, 94, 17, 4, 34, 65, -23, -110, 56, -71, 11, -109, 15, 17, -108, 1, -109, 83, -16, 151, -17, 109, 113, 198, 183, -100, 23, -39, 123, 120, 116, 27, 5, 17, 120, 9, 6, 66, -51, 41, 135, -73, 177, 26, 56, -1, 67, -109, -9, 49, 28, -88, 37, -12, 103, 84, -227, 87]
3913H7p3M7q2N3L8j96J7M7L7K8q2P4K13j42j78N1J06j70J07Lq9J15q7J27o6q4
3939i9M2J64k17q9J83R5j95K44j19p7K1n2P9J10k39J99j56N5K4J00k4q9J45r7
3963HK4n0j1J44j8j32m6K5R8n0M6L9j15P7j1Kqk07K55j11N1o2R3MJ5m0j17L0Q0
3992A3j11N5qL8j20J50k9j0k5J6M4Q7l09J76M4p5r0J45L5k1Q9k24J71j26R2rk
4019dn9M1j14K05j31J99p8o0n3m1L7j9O2j79K83k77J20L1K4n8K7J0j00J84rm2
4045aJ19Kk48K01q5j54Q7J50Rk13R6j65K85j7m0K0Q5k24J4L6P4O3j58J16J00j69
4071a7J94j56r6J3L7O8P0l9qo0M3j81J81k04J91m6M4J2Q7J07k79J22o8QO0R0L9
4098B12j98L2PJ57k11J7j69J03M4oq3K2J43q5j30J24n4J16j36NK16m5k11J14k2
$$ y = [87, 14, 61, -21, 32, 70, -126, -109, -62, -25, 3, -79, -5, 208, 66, -112, -61, 45, -125, -18, -15, -104, 11, -76, 51, -15, -99, -57, 107, -110, -199, -16, 79, -116, 128, 9, -68, -47, -99, -20, 90, -149, 50, -106, -51, -27, 73, 49, -40, 105, 8, 32, -18, -29, 115, 97, -35, -81, -56, 42, -8, 38, 77, -38, 39, 28, 30, 22, -185, 70, -41, 10, -52, 41, 45, 60, 20, -97, -67, 13, -98, -43, -51, -13, -133, 17, -12, -22, -47, -31, 13, 100, -209, -33, 11, -64, -154, -9, 26, 5, 94, -130, 41, -85, 7, -2, -4, -63, -22, -136, 69, -62, 137, 59, -1, -54, -95, -58, -77, -15, -194, 89, -188, -68, -37, -13, -71, -44, -34, -134, 50, 41, -1, 118, 120, -128, 73, -12, -166, -79, 71, 80, -133, -37, -202, 83, 66, 26, 46, 131, -93, -79, -43, 31, 94, -64, 52, 152, -17, 177, 21, -75, -62, -25, 43, 113, 74, 66, 6, 49, -132, 49, -155, 36, -10, 34, 46, 133, 240, -39, 83, 15, 23, 83, 173, 212, 14, 46, 53, 210, -1, 16, -153, -50, -6, -12, -95, -73, 70, -15, -145, -21, -75, 41, -95, -90, 126, 81, -130, -16, -38]
4123c8J20j23Q8m6m0J37j27P2L5k4N3j70k8J95m8n7O6p2M1rn6n2J40j00k6N8o
4150a7P5n6J6m1J06n2j68J52k5J49L1j05j31K7O1j02J72o4l10K08L0Q3O9k52P9
4175f5Q5P5L0P0l21J00L9M9J6j31Q9k5J4P8j67O1j7q4Q1J14j31j16K54q1l7J12
4201I2j63j07L4O1J10L4j11m2J84p7Qnq3M9r0m0K0J67j99J09M8q4L1J02j3J16
4227A51k21J26J13q9m5p9j6J24K5j34k6Q4k0qJ10o4J10j57p0m6J29mJ18j96P7
4252hK26lj04k27J09j8N1J08r7k9J09j87m3rK30j52Q8r6P2M1p5j09j34L29r4j38
4278a60J29m7q5K30n3j21J18j24L4R4M7Lp3q5L4Q4N4j43p0j1J86O8q2J0j58R5
4304b6R8j21P6j93K38J46j19j6q6Ql7K0Q3j52j9K1p4L03l8k06P7M7J30Pk26P9
$$ y = [-38, 82, -41, 47, 1, -39, 98, -29, 43, 78, 54, 107, -63, -91, 104, 56, -1, 65, -7, 34, 25, -31, -83, 57, -43, -69, -11, -17, 58, 2, 18, -23, 83, 31, -137, 15, -10, 139, 170, 65, -66, -39, 22, -80, 92, 28, -282, -74, -44, 39, 108, -144, -65, 20, 95, 125, 195, -126, -26, 13, 62, 78, -53, 36, 11, 25, 103, -64, -3, -20, -104, -23, 91, -40, -156, 98, 17, -20, 92, -71, -178, -144, -83, 27, 61, -50, -92, 92, 15, 23, 18, -65, -16, -106, -146, -126, 41, -158, -49, -1, -85, -54, 48, 35, 151, -70, 56, 169, 80, 35, -44, -60, 64, 89, -45, -71, 13, -7, -15, 95, 31, 141, -16, -86, -132, -3, -7, 111, -85, -8, 218, 215, 111, -116, -7, -25, 26, 134, 37, 8, 117, -70, -113, -122, 108, -44, 44, -52, 20, 61, -14, -123, -257, 72, -22, -160, -31, -78, -163, 67, 14, -107, 11, -113, -79, 15, 62, 65, -8, -93, -59, 25, 79, -64, -134, -145, 41, 109, 27, 37, -121, -26, 72, -49, 27, -166, 72, 218, 99, 83, -3, 5, -32, -12, 71, -81, -100, -79, -153, 150, 112, -94, -17, 30, 160, 167, -59, 20]
4330B0M2p1j3j8N3r5J4Q4j8P3j40J61j98R7N6j19LP7PM8j44M8O0j44P7J55k20
4357a05p1J64j22j6J64P9j14n2P2k9Q1j38n0J42l6J11q1j6J7P0N4j0j42M1j02
4382h9L06l75J74k36K43Pr0J35L4j84M1J38j91J10j83J70j67P5K01q8k1l9k5r8
4406a52J98j37rP6J73k00O3m6O9o2J65l04L52l9k23J88J9j89p3R3k1J05j88J80
4430C8l7J18j80m7J68N5%k02M8k9P9P3j25J72p5Kk88K18K2J65j92m1j70J82O8
4455B2j13N5Jn8J40mJ09k25r3K53j87J02o3J31k53J67j0OL3j11J91o1Qk31J00
4480i1J96j01k5P3l3m4n9J89k57K83j31PJ00n6k1k1k3J9ml38M37j36Q2j61K25
4505A10k21J59q5J31j95O6n1P1O4j5J6j1L7j96L02p9n7q2qJ79n4L9j41p7J46J9
$$ y = [20, 62, -9, -22, -40, 13, -82, -68, 16, -2, 71, -69, 92, -106, -9, 47, -72, -69, 8, 15, 63, -81, -33, 27, -117, -40, 115, -105, -176, -12, -134, -150, 14, 93, -21, -73, -1, -30, 51, -87, -137, 5, -31, 80, -1, -17, 0, 70, 124, 114, -28, 13, -89, 217, -158, 16, -220, 23, 30, -60, 75, 109, -75, -34, 104, -87, 23, -160, 10, -157, -82, 119, 31, 10, -29, -54, -152, 46, -91, -100, -24, 149, -51, 12, -34, 35, -27, 138, -166, 186, 147, -76, 112, 131, -58, -131, -38, -59, 46, -142, 38, 1, 119, -61, -108, 60, 115, 115, -87, -39, -68, 11, 84, -41, 131, 56, 58, -230, -12, 10, 175, -17, -58, -228, -46, 22, -91, -36, -35, -93, 47, 43, 152, -73, -166, 87, -100, 2, -61, 70, -183, -16, -26, -20, 13, -98, 93, 32, 40, -191, -91, 105, 4, -21, 52, 19, -25, -84, 105, -152, 131, 0, 7, 107, 51, 30, 9, -14, 5, 1, -337, 100, -36, 46, -115, 110, -111, 48, -37, 94, -101, -35, -86, -15, 49, 34, 50, 39, 76, -120, 182, 103, 46, -36, -44, 135, 81, 120, -21, -98, 48, 67]
4531F7j69K17j42M3o7Q3l1k3R3Jr5Rj82J11J48Q0k51J00O4k83J72P7m3J9r3M1
4557e4m0R7L3q8P2J11j90LJ39j66K34k03O0j01K98l09J39O4K4p5N4j87lJ25K7
4582F4l4j06Q3O3j17oq3Q8n5J14M2j87J72np8j8qM6Q0q4q1oK9J1N0J17r4j33Q9
4611d7J07rn1L9M2j63J10M4n7M7R7j48mJ91k78J19q4R4K5j78J16oj78N2O1j25
4637a84K45k9j97J82J28K0j60K7j8j13J32q7J04j34K2p8J74k8K3l7QN3k6n6O7
4662C8o3n0K01j72n5N6J00j43j5R3j47K29j22Q7J08j07P8j64J40m2l1j40K2Q5
4686a4m8J26O6j51O6p6O1%j04o1N7O4L3O8q9o6J15n5p2J15j7J5o0N2k08J25L8
4713b0J37j39O3m9m6J56n0P3j36r4Q0J27j29J30L6n4or2J20n4j56K00j20jJ21
$$ y = [67, -102, 115, -27, 16, -51, 32, 1, -22, 71, 72, -23, -14, -196, -85, 63, 143, -108, -8, 56, -227, -55, 22, -21, -2, -95, -54, -94, 3, 36, -52, 20, 131, -59, -56, 83, -83, 151, -52, 8, -93, 205, -104, 35, 99, 123, 48, 102, -85, -88, 37, 64, 30, -76, 7, 70, -47, -53, -136, -48, -103, 11, 53, -134, 38, 33, -45, -63, -71, -25, 55, -29, -110, -116, -87, -76, -26, 91, -3, -136, -47, 60, 51, 0, 39, 81, -82, 28, 72, 15, 62, 159, 11, 7, 198, -80, 39, -45, 49, 74, -104, 12, 6, -172, -120, -59, -184, 61, 32, -165, 17, 145, 165, 5, 32, 14, -99, 33, -54, 50, -84, -62, -140, 34, 6, 29, -8, 0, 53, 27, -29, 38, -25, -75, 126, -46, -101, -45, 55, -88, -103, -10, -157, 72, -50, 37, 145, 38, 116, -48, 92, 50, 19, -121, -99, -14, -62, 64, 130, -21, 45, -31, 30, 30, -74, -135, -78, -14, 19, 87, -2, -68, 47, -8, -80, 35, 18, 33, -27, 25, -183, -58, -20, 117, -22, 41, -8, -54, 102, 52, 125, -11, -105, -25, 102, -27, 103, 139, 85, 79, -13, 107, 53, -103, 97, -23, -24, 97]
4738I7j00J5n5K08k07j3m2MJ44jJ6j39J07m7k9O3l1p5M5n0R6nJ8K09m27J00O9
4765c0J7O8k46Q8k9J75pj34K8j6M5J19j22J19j27J36j44nK23o1k44K21O6j53O9
4790E6q9lj15J06p8j9J01R2r0M2L9n7j20J49J01J8k2j04R5k15O6J90j66J21k1
4815G7p8m7J18j93K17j04o3j6j13J47J59j90k9K61r5j07J0M5q2J00n1J07k79J96
4839a0n0J38j46j1n7K1J96k1J11k32O1j3N0j01jJ77j05j36J06r8M1op0K25m2p3
4865d6K6k2J06o1J45p3m4Kj05rJ11p8M5PJ82k99J23J10j07l4J4O4j02K0K0r0k3
4892a18K70j97J12j19J83j89P6o5r8M1K49l01K59j71jJ60j68mJ51Kl8q6J33r4
4916a3k8r7J86k2J03k44M4O3O1j7L0m6R8k53J36L5r3J06N1n3J27l4j35n3n0K17
$$ y = [97, -3, 12, -43, 165, -42, -55, -97, -93, 51, 50, 66, -73, 34, -13, -42, 21, -10, -85, -40, -90, 6, 1, 19, 228, -199, -99, -30, -13, 55, -191, -103, -132, 43, 36, -98, -70, -86, -41, 78, -44, 75, -52, 84, -60, -65, 158, 97, -147, 74, 140, -13, 56, -33, -36, -151, -45, -123, -142, -41, 51, -39, 3, 42, -15, -135, 14, 115, 133, 111, 7, 102, -113, -47, 143, -23, 98, 77, -1, -48, 70, -123, 94, -10, -73, -89, -202, -55, 104, -86, -115, 146, 51, -56, -46, -1, -83, 17, -34, 73, -206, -10, -60, 78, -68, -79, -136, -115, 81, 60, 171, -61, 0, -13, 37, -64, -65, 112, 7, -129, -23, -121, -80, -86, -156, 69, 27, -46, -20, -42, 64, 3, 148, 75, 31, 33, -72, -81, 30, -48, -3, 4, 186, -113, 10, 120, 13, -21, -7, 57, -45, -25, -5, -95, -118, 152, -45, 67, -52, 131, -58, 18, -47, -145, -104, 145, -156, 103, -68, -69, 91, -77, -81, 70, 72, 34, -52, 81, -13, -41, -138, 48, 26, 129, -115, -71, -8, 53, 36, 66, 20, 118, -135, 1, 36, -57, 49, 100, 47, 174, 140, 5, -48, -98, 119]
4942A19j00n2J51k19J64r3J36n3m6Rj19R1rp8oJ37J13q1k0j04J21j40PJ23k95
4967b44J62jJ06k30K05m8J20l06K55J3j32K39j09QJ9O4j71R8j16qJ72J9j08R1
4991I8k12M4J28j40o2J81n5J10j33mQ9P3l74K58n4J19p7n7R5J71ll08J52r2n1
5016a04P2J86o8o3Nm9J29O4q7R3k18LJ31p4qL9j04O0n4J63k56J47J36o8j91J96
5042H0k58J11l0OlJ32J38q2k8Mk91N5L79k20j7L5J7j05O6K6O4j16J21K7m0j53
5068h2M8n9R4j05K01l01Q9K4J11j04J31k9l3k6P7j27J54R1p5l5p2K5o6K78k99
5093i0K14p5M2j50J0J02l2n9P5n0q4JL7K22k55J19k01J89J0l6O9rp6N4j84J58
5119Aj08K95k46J31j0J0L1k32K84j53m0J8J43j70J87q1P4j47QK7l9j49R9R3j0
$$ y = [119, 19, -33, 118, -101, 63, -30, 106, 53, 7, 16, -103, -12, -21, -99, -105, 32, 145, 64, 44, -60, 61, -79, -72, 51, -244, -82, -83, 23, -207, -2, -50, 70, -236, 19, 32, -100, 139, 30, 38, 57, 121, -50, 48, -68, -76, 96, 115, 7, 98, -114, -70, 58, -82, -144, 37, -18, 92, -41, -45, 44, 117, -257, 1, -53, 66, -11, -68, 27, 198, 195, -113, 39, -53, -104, -32, 154, 86, 23, 28, -21, 108, 172, 85, 178, -40, -37, 94, 20, 12, 51, -53, 7, -47, 116, -140, 7, 143, 75, -116, 80, -178, -67, -97, -91, -94, 38, 176, 94, 66, 70, -221, -166, 213, -7, -24, 11, 28, -77, -11, 15, 79, -37, 84, 111, 71, -82, -34, -93, 1, -104, 97, -204, -115, -91, 20, -84, 47, 18, -15, -41, 36, -91, 63, 154, 79, 44, -28, -3, -69, 209, -90, 124, 49, 91, -59, -49, 53, 21, -38, 37, -13, -97, -96, -59, 163, -92, 27, -174, 15, 25, -11, 58, 49, -27, 27, -157, 1, -107, 188, -58, 73, 63, 73, 104, -128, 156, 3, -37, -19, 124, -46, 141, 60, 134, -13, -5, 22, -17, -166, -67, 26, 16]
5144A6m7J4N0o5p8QJ23j16Q1J39k2j6j99J18J01j49K0q8J20j79J25K4J38k41j1
5169a34J76o7K7n0p9J1J70q5m0P3O0j5oQ8j96k0J02j03k3J61J05k85m3R7j09J23
5195f2j0J50j03q9K46j36O8k67Q2K4J13J39j84j50K57q2M7pl7J1j17q6K74K9J3
5220A23k33k7J23j41J53k0J13p7J25q1Ln7l1J12j38J81j95K9j6j30jK77j80J47
5244E9j29K56k30K9N5j3L8j30K4R6k7j4j5K0j23M6K3r4N3p1J57j24oJ22j63K24
5270F3L4j12J18o1N8J7r0p1r9J93o8n5R3J33j72Jk6M1J55j20l6l8Q8j18R7N8j20
5297c7J7l4m9K02%n8l1j1m3J72j27Q5j42%K12j30J7j61J51N1l03K61qL7k5j36
5323i0P2q8J00k24K15K30k61Q8n4qM6o9J73k59J24J4P4J36j89J68j30j34j9J94
$$ y = [16, -31, -17, 33, -32, -110, -102, 21, -95, -14, 125, 103, 87, -112, 6, 107, -42, -22, -110, 10, -169, -44, -20, 118, -123, -134, 42, -25, 2, -48, -127, -116, 54, -31, -71, 2, 62, 47, 41, 129, -67, -87, 15, -88, -111, 50, 155, -130, -173, -76, -185, -62, -72, 78, -25, -114, 132, -4, 64, -203, -121, -97, 16, 155, -29, -179, 78, -4, 43, 36, -1, 10, -107, -193, 81, 110, 123, -110, -137, -14, -155, -2, -22, 91, 14, 139, 58, 61, 4, -27, 85, -53, 128, -67, -38, -54, -184, -185, 92, -88, 59, -70, 186, -44, -15, 40, 27, 65, -65, -41, 55, 28, 14, -1, 19, -104, -58, -35, -129, -76, -147, 10, -114, -120, 2, -161, 63, 97, -15, 103, 42, 100, 117, 27, -44, -143, 50, -18, -73, 20, 153, -19, -18, -44, -3, 152, 32, -4, -42, 46, -72, 25, 83, -37, -20, -54, -103, 99, 99, 41, 10, -1, -44, 128, 1, 86, -56, -56, 156, 26, 43, -118, 33, 84, -219, 42, 34, 71, 46, -90, -18, -106, -6, -230, -15, 215, -46, 42, -12, -20, 26, -43, 130, -129, -5, 9, 83, 219, 30, 198, 68, -66, -85, 109]
5347A09k09Q5J09k09J16m1l2r3K63q6M5kq6J13l01J93m6J12j27j3QJ83j8j01J44
5372A16q9KJ4k16K28m2J1p7l0J64j15R1o0J50l10J89n9n2N0p9P2L2J28k0o0Jn6
5399a7K9j15R4n3p5J72p9j45J76o3J37M9OJ3j70j01K90n5j1k61L10j96J28p9k5
5424d1N4j0N0L6j35J3p6P5r4J59nq9J22j35Q4Kr6j6o5O8O3o3J52j11K09q3N6j03
5452B1m6M7o9J06j18m2K38p7Rk19K67j42J83k54J03l6P8r7K7K6j1M1M7o8n1q4
5478a21J42j4q4J45K0r9P0L8j10J5nj5O8N4J2N9j37K5j45J15o6L0Rm8L9K5o9n8
5506a05J31j45J49k3J25j17nr1M0K1J14N1j05q5J05n4k11K19NOM7m5M7j2j33J88
5532A17k64K66j69Q1r5P8M5j79K15j87J03k11K59J64K6j82l8m5R4%j15j6J70j36
$$ y = [109, -100, -15, 94, -115, 1, -40, -72, -165, 98, 12, 57, 55, -31, 82, -219, -26, -72, 40, -87, -100, -92, 91, 73, -28, 116, 27, 29, 43, -173, 55, 13, 24, -53, -83, 81, -34, 57, -3, 147, -163, 26, -33, -85, -35, -114, -42, -10, 118, 98, 38, 39, -17, 12, -103, -9, -62, -137, 35, -44, -189, -13, -76, 61, 110, 116, 129, -41, -142, 148, 93, 82, -179, 131, -65, 63, -16, -41, 13, 3, 53, 89, -46, -33, -109, -34, -128, 31, 26, -63, 59, -76, 8, 10, -86, -102, -167, -99, -36, -99, 53, -58, 151, 68, 124, 21, -25, 22, -47, 59, -59, -101, 137, 60, 69, -150, 117, -25, 158, -96, 7, -29, 49, -48, -21, 5, -6, 35, 82, 14, -37, -121, 21, 7, -77, 68, 88, -11, 59, 97, -13, 2, -3, -18, 50, 104, 116, 175, 38, 63, -82, 33, -33, -3, 6, -42, -3, 22, -47, -105, 26, -119, 30, 7, 132, 15, 10, -81, -41, -20, 94, 145, 40, -45, 60, 6, -205, 14, 19, 25, 72, 27, 74, 62, -71, 117, -147, 119, -50, 31, -64, 14, 59, -120, 95, -92, 11, -200, 59, 223, 249, 67, 29, -16, 78, 78, -37, -53, 117, -19]
5556a9J09j72O0j4J08j54K00j52P4m4j11J21o5M7J07j59l5J44Mj45m2J43O2jj6
5581E0K8J16k10r3J93L9M2l50L41j00j10J77q9K31k95n1J23J19j7n6j3j12m4M
5605g7Q5p9K06j44rL5K17j71J9j25nJ05O3K7q2n1N1m3q1J20kj41R0rMJ60j23r7
5633e7k3Q4p8J63k38K51k11O3m9J99k65K13j00K76l18K4n9P2J72j34K6n0J16O2
5657A39j97Q3j53l7K17j25J12P7l11J62J13j52mJ54j06R9k38N9J97k50J43l9P2
5680A5n6M7q0J16j35O7J38p2j71J69n6P6O4k21J69Op3rL8J6m6J46k43L16k19J31
5706A33m9L2j00K4K3L8j26j86J63P5M8O2j14Q3j82m7O9K58j62k01K43j54J16K0
5730F6J6k59K51j78P4R7o6L6q6r6J08k06J21K57k99k3K23j87Q5L0O9n2j08J38
$$ y = [-19, 90, -82, -22, -36, 72, -82, 118, -34, 40, -4, -115, 6, -59, -12, 95, -64, -99, 45, 49, -96, -138, 5, 67, 66, 50, 78, 194, -16, -109, 84, 123, 165, -185, 156, 56, -54, 123, 34, 265, -30, -81, 42, 161, 144, 88, 75, -37, -81, -77, 8, -71, 135, -9, -18, 17, 234, 63, 82, -43, -48, 57, 120, 147, 65, 14, 65, 22, -59, 61, 59, -82, 8, -1, 3, 163, 40, -57, -80, 4, -74, 89, -149, 102, -109, -46, -95, 104, -161, 52, -48, 228, -90, -66, -125, -53, 119, -15, 11, -39, 77, 139, -58, 25, -128, -165, 52, -73, 39, 116, -195, -33, 80, -72, -76, 78, -28, 71, -167, -108, 89, -161, -18, -57, 15, -41, 6, -74, 42, -93, -26, 112, 40, -131, 38, -18, 58, 122, -99, 70, 76, 3, -6, 32, 48, 2, 148, -95, 221, 2, 133, 84, 116, 16, 40, 63, 101, -25, -211, -48, 27, 75, 137, 23, 106, -76, -123, -54, 204, 42, -159, 84, -70, 46, 66, 82, -177, 74, -104, -30, 67, 1, 37, -49, -145, -37, -243, -122, 135, -164, -187, 36, -151, -66, -36, 33, -19, -127, 11]
5754A1p1p8J78L2j51J92k00j2J30m3R4j07j03R6p7J36Q5k48o8L58P1l44R8j39
5778a60J08P9m1r5RK8N4R1j85K41o3L5q3p9o8R0J53K3q2N1r6r7Q4j4M1J05r9j09
5806g9K04k33J84nj27J57p3n6OJ15L0k84K73j9j97J20j20K51r4J03j09l3Q2j69
5830g3J2L9M8j01p0K40Kj96O1o3O4m3J34j60J93k02J26j2M5j30K50k31J8J53j52
5855d8K9O9k19J23K3jj1j06M5R7Q9j55J18Q9j94K00j48M7L2K8M3j41Q8r3q2Q8
5881A0O9j68J92k30mJ85k5J04j13j72JJ68K5n8R1k13n0J89R9j79N9M3j8j4m4j28
5907a81K68K8j01p9L9k4m2j2J48J03p2K0j33J17k07M6J07Oj17j9R4j75K66j70
5931i0n1J59j55L42j86m9o9J80l2r7M0m6K08k54J84j49O7o5N2N2N0O5k47q3J04
$$ y = [11, -60, -138, 40, 72, -79, 113, -87, -99, 31, -12, 82, -25, -128, -32, -109, 27, 112, -136, -204, 154, 225, -119, -21, -160, -52, 27, -14, -109, -100, -72, -18, 73, -112, 129, 66, 101, 18, -61, -129, -39, 114, 137, 55, 106, 10, -87, -3, -17, 24, 129, 30, -79, 125, -108, 76, 71, -56, 101, 28, -28, -22, 93, 123, -161, 112, 93, -104, 16, -104, 147, 53, 156, 47, 14, 96, -73, -61, -22, 26, -75, -145, 95, 97, -99, -38, -101, -37, -80, 54, -106, 87, -115, 11, -1, 44, -86, 164, -67, -49, 104, -48, -19, 50, -169, -46, -23, -24, -35, -141, -96, 1, 90, -65, 53, 142, -52, 148, 0, 47, 79, 107, 150, 9, 97, 4, -78, 10, 79, -89, 103, -127, -131, 54, 29, 133, 20, -152, -151, 17, 42, -16, 75, -138, -188, 1, 100, -79, -20, 23, 5, -9, -53, -181, 87, 115, 14, -65, -26, -50, -92, -104, 44, 147, 75, 95, -38, 79, -128, -82, 25, 31, -86, -105, -11, -186, 80, -90, -141, 18, -137, 205, 19, -30, -99, 81, 49, -48, -8, -54, 154, -100, 84, -65, 2, -63, -11, 41, 91, 156, -91, -174, -70]
5956g0K1o6L4J88l27K17J36k55J59M9j60N4j13J65r3K3J19k80K37Q3Lr9j52J0
5980a17J33l6j9J33k41K5R6q6Q6mm6L0J2Q7o6j4K7K17j31J00j31p1K48j45M2j95
6006f6J27j96R6L1n9K3N4O5j84J99r8M2m6R6q9n5J43j09O4j15K2M3j9K07n9k43
6032a26J88j90J85J13k67J91l5J6k00J72m2L3J03K2j11o7M7j50Q8O0Qj49J21q4
6056g4n5J45k9j15K11j54L15k17Lp6m9J07Q8k74K55j79R7Q4L4k71Q2J01rk6J48
6081A42j48L8j32J46N6N3o7j72J40j09l1J37R1j58J84j72J17j01J12j74LP3j00
6104g2J63j16J33j54m6n8P6P7OL0J17j98K6J38j22mk8M0p7L0N7%J4J26k4j94J51
6131I1r7n4R8k5q9Q0J5m3j06J05q9J83J6k42J90M3j12k2qK37k49Q8q0l2O2J10
$$ y = [-70, -49, -115, -81, 107, -220, -3, 133, -122, 37, 86, -74, -20, -133, 32, -61, -38, 81, -199, 38, 121, 124, 25, -127, -117, 16, -20, -39, 94, -147, -122, -26, -112, -26, -30, -76, -46, -34, 53, -13, -27, 0, 217, 86, 186, 55, -16, 232, 87, 129, -66, 61, -135, -39, -8, -67, -44, 10, 75, -109, 90, -8, 34, -12, 84, -5, -60, 83, -26, 38, -77, -55, -12, -31, 176, 117, -126, 62, -128, 57, 170, -97, 94, 59, 75, -125, 47, 5, 38, 141, 163, 52, -15, 32, -118, -30, 30, 38, -111, 10, -74, -129, 16, -13, -128, 83, -71, 244, 27, 30, -46, -95, 12, 100, -174, 81, -98, -1, 83, 117, -154, -72, 29, 20, -6, 142, -6, 32, -100, 46, 102, 155, 88, -84, 56, -53, -84, 53, 144, -14, 170, -2, 115, 14, 126, -48, -45, 28, -72, 91, -25, 108, -46, -92, -150, -74, 3, 9, 39, 156, -42, -16, 122, 0, -4, -32, 8, -69, -39, 18, 18, 32, 158, 134, -60, 91, -6, -60, 38, 13, -76, 4, 19, -24, -130, -25, -114, 69, 85, -157, 33, 76, -36, -58, -66, 171, -78, 10, -70, -102, -40, 70]
6157G0k6m9K9O5J1k12k3J36j63J20N0k5QP4j05J4j01J49J9o8j08J12K15k46L0
6182b4K3q1J16j11K91j07o4Kq6J98L2o0j8p5l9M6P5n5K1j38q0J05P1j53J93l9
6208D3Nj34J16M4k85J62M9J65j39m6P9P6k05N1O8J51k15J03j19J03j58M5m4R0
6232El7O7k7N7l0oj6J31k42lJ36J03M5j05o2q1N2j46L07j75J47n2j28K6n1m4J95
6259F6j34j5J79j09m5o2K07r8j7q8K01j6J39j76q0J47k22J90q6O0j28J61m4QJ4
6284E2j09J28K7q2j46J52j05O8j30J45n4l1R7K8K0k73K21N0j27O2k00L11l36J22
6308a10J55j24O8J0P5j23K8k5O5o6ORN9k9j5N7P7r1j03N0M5pl6j14K2M5J62j92
6336a02P4j49K44k29J66O5o8K13k61N0N0n7J43j01l7q9KJ26j05K9o2J52Pj44l
$$ y = [70, 44, -5, 24, 89, 100, -112, -135, 1, -162, -42, 8, -17, -9, 65, -40, -26, -127, 22, 41, -27, -135, -23, 192, -54, -24, -1, -82, 34, -77, 214, 107, 43, 45, -41, 157, 189, 129, 111, 36, -3, 43, 118, 63, 84, -54, -134, -29, 42, -111, 82, 43, 48, -86, 30, 74, -211, -49, 0, 165, 26, -20, 59, 135, -70, -19, 49, 200, -15, 88, -31, 72, -86, -41, -85, 5, -32, 35, 8, 65, 35, 29, 13, 144, -98, -101, 35, 138, 183, 78, 16, -65, -13, -159, 148, -27, 120, 68, -60, -34, -85, -129, 66, -68, -83, 96, -13, -58, -120, 87, -11, -28, -116, 85, 69, 208, 32, -48, 99, -123, 67, -19, 41, -87, 74, 30, 38, 52, -57, 71, 98, 16, -130, 22, -83, -15, -145, 0, -54, -85, 12, 40, 60, -213, 8, 58, -69, -7, -207, 104, -232, -110, 45, -79, -11, -1, 74, -49, -21, -46, 19, -47, -41, -32, 27, -2, -17, 40, 117, 26, -77, -27, 18, 11, -25, -139, -117, -72, 90, -102, -28, -177, 67, -162, 4, 69, 1, 214, -47, 3, 53, -4, 139, 38, 1, -88, -86, 40, -65, -36, -98, 54, 61, -83, -86]
6361h6N6NK3L8K0j42O5J3J32q3p2j21K0J74K43m16J16J0p6j8O1oj21K55r7q0o
6388i3L9R9L0k0j68J39P8j95J59M6j24j09J67n5P1j91J3J50K3j69K14l1j09K8
6412hKJ80k42Q2l2L2R5j33l6Q6n0j19J04Q1J40p2k11M1R5R2l01J13NPj2O8L1K00
6440B38j75m2l9O9o7n0J09o7J70j77K8k9j12J56j32O8j13P1L6N0J21j93K8R9j88
6465a41R4J59r4L4M4j10J00m1Mm5m9J4j64K80j02Q9j55J58M2k51J12oJ04n2J7
6490D1R6j56Q2pr2j39K12j15J29J4o6k9K24j38l9Jm8J8q9J22O6M9P8q4j50J27
6516A07p3o5k27K43RJ41j94P8J86p6n7l9J6r5p1M7J25k2m6N4J0j0j9rPp9p4K49
6544A16j51o5K90k87J02n4J10KM0k28L04k41J90r5k9j02J83n7R9k35l8K26o6n7
$$ y = [-86, -30, -25, -2, 36, 56, -86, -21, -8, 124, 41, -31, -152, -132, 42, 285, -131, -15, -5, -81, -99, -38, -44, -165, 90, -7, -87, -93, -54, 45, 75, 55, -113, 26, 104, -91, 68, 114, -10, -119, 48, -7, 64, -127, -114, 36, 59, -110, 104, 73, -36, -8, -6, 174, -68, 14, -18, 14, 109, -24, -60, 26, -24, -143, -39, 42, 182, 110, -101, -60, 35, 127, -174, -61, -56, -49, -61, 7, 38, 238, 63, 21, -18, 51, -16, -66, 43, -24, 146, -31, -3, -32, -144, 12, -120, -52, -165, -94, -58, -8, 113, -80, -52, 47, -141, -47, 112, 18, 52, 96, -14, 86, 45, 49, 4, -45, -31, -195, 85, -17, 72, -83, 75, 117, -134, -22, -28, 76, 24, 41, 137, -19, 63, 56, -36, -175, 37, -78, 51, 65, -1, -30, 194, 56, 17, 18, -30, -12, -101, 21, 87, 136, 214, 130, -20, 107, 34, -31, -258, -15, -6, 135, -59, 19, 205, 129, 72, 33, 49, -46, -117, -70, 55, 33, -13, 41, 51, 41, 22, 13, 20, -59, -133, 116, -35, -100, 190, -97, 5, -49, 61, 63, 103, -125, 179, -62, 128, 33, 4, -98, 85, 28, 127, -108, -146, 80, 14, -43]
6568d3J61k74J34N3L4M9j52j59J85j5J0Oo3K86k26P1r0l0J02K5r5Oj3N1j56P9
6594f4R4K9j42J06J52j90k6J03n2j63J44J57k13L10k92J1J09k10K62j44J38r4
6616B5n8O0l4K8q3j8K3j4O7J55j03Q3j51k9J3O4J7j1j20Q6j38M7J29PO3j75J57
6643I0l1J12p2P0k57J6J19n0o2J16q6J17j92K77r6q9K24l60J56N0j61L7K2k7L6
6668d1J8J46l00J88K6ln6L2rJ12p8j23K76k47P1n7n9j24J80j1K49m1j59QM0n7
6694a9P0k17J28Q2q3J09j41O9j7K4Rr4K43o9j78K24j04J33k54K1J45q3o6O3l8
6719d3QM8r1p1Q9L0P2j44K3j1Q2n4J74j60J00J7j8J5L5j4j56j5P3o5N6j2k54L47
6747F1m6R0N9q2k8j84Q0K07r1q9j72Q4R9PJ3r3O3J59r5N4r5Oj74J75M3n0r4J60
$$ y = [-43, 118, -156, -22, 31, 65, 114, -38, -197, -12, -27, -17, -11, -74, 212, -14, 57, -33, -63, 39, 64, -31, -25, -38, 13, -143, -64, 30, 59, -83, 23, 175, -15, -41, 62, 10, -153, -9, 148, -65, 245, -47, -36, 73, -137, 125, -19, 119, 25, -33, 27, -7, 21, -62, -80, -57, -71, -4, 151, 48, 131, -20, -49, -36, 28, 45, 34, -86, 0, -138, -91, 38, 45, 108, -67, 90, 59, 171, 99, 169, -88, -72, 47, -3, -65, 51, -35, 82, -110, 167, 71, -18, 206, -154, 2, 52, -109, -72, -50, -77, -41, -23, 123, -177, 11, 37, 34, -22, 10, 1, 113, 35, -88, 188, -59, 12, -45, -104, -228, -48, -59, 190, 149, -10, -2, 38, -19, 51, -166, -38, 44, -39, 70, -71, -2, -19, 5, 14, -80, 163, 94, -84, 140, 36, 169, -85, -64, 81, -2, -68, -5, -43, -35, 13, -78, -149, -60, -30, 42, -102, -79, -90, -8, -62, 112, -48, 52, 69, 51, 66, 101, 87, -69, -84, -11, -76, -20, -32, -286, 61, 15, 105, 164, 82, 54, -130, -50, 157, 66, -23, -195, -111, -12, -5, 8, -85, -22, 137, 42, 96, 1, 7, -167, 8, 51, 1, -93, 67]
6775F7m7J3N3q6k8j4J72l2j26q7L0J10j2K5lq1j67J09K09N2j91k6J39k0k8on4
6802b9j24J39r9J6J39r8P2j86K41k2Q1j73n8l9P1o9K15K9j91J70j54k1PR7Pj2
6828Ij37J85j3k53j2K27m9J03j19O2m7RJL7j6M5k98R0K52j22k1R0j16L5N2p1M7
6855c0n6P8R0j03L2k1J8O9j22m2JK9K31k41l7K00j61R7q3m0J08j30J95q6l4m4
6881h2J12N4j62K48l3k31K01p0j8p4J76o3j05m7J37j81K67m5j67qJ14k2n2P0j01
6906h2K42j29j0L0j26O0J10j86Q3P5j03J41j36j8J42k14J57L9K5k8j03j5P7o8
6930c7N0l7j46K14Q4j9k56J32L9l6J44k4M4j18j69K00l8r5J52j33K9J2j43J65
6954A4l8O2l5P9q9J80k58J57kn0M1k87L11j2q6J14j63NO6k5K09j05o7k8rp8K32
$$ y = [67, 20, 33, 86, 0, -28, -42, 130, 98, -28, -115, -85, 25, 13, 38, 35, -46, -213, -104, 105, 157, -34, -60, 79, 59, 31, 25, -29, -153, -14, -113, -97, 42, -56, 16, -170, 71, 49, 130, -43, -101, -140, -69, -138, 77, 106, -85, 85, -69, -90, -83, 14, 21, 9, -128, 57, 44, -209, -221, 6, -43, 60, -59, 3, -44, -35, -34, 3, -13, 32, -266, -176, 76, -46, -67, 23, -93, -58, -6, -77, -30, -86, -8, 82, -21, 11, -10, 8, 77, -45, -87, -86, -57, 174, -67, -104, 96, -65, 32, -51, -91, 17, -113, 82, -4, -38, -82, 30, 84, -78, 170, 137, -94, 107, 37, 19, -55, 121, 58, -47, -94, 43, -138, 129, 84, -83, -91, 23, 1, -51, 19, -82, 160, 31, 21, 51, -75, -15, 95, -91, -8, 67, -36, 105, -31, -49, 93, -121, 36, 75, 100, 72, -31, -46, 31, -37, 13, -24, -170, 44, 128, 109, -147, -15, 24, -12, 132, 108, 152, 34, -135, 65, 27, -68, 84, -49, -20, -8, -151, 14, -24, 38, 3, 82, -7, 173, -85, 72, 70, 20, 61, -226, 85, 73, -13, 101, -62, -57, 9, -16, 193, 88, 21, -7, -16, -94, 138]
6981A38j79k1PJ33j81K47m7qj81M4J6j3J30J8o2k8p7l2J65l5K1J23j95J8Lj27
7007a23L5L1Q3k86L02o0j20J42JP6p4m8O6L0k2o6M1o9O2j11M2l2K47q0O7j55R8
7034G7N3q0j79L7K18j94J0O1j01K37j60o1L9nQ4o3j31K62Q8q9N5j41j02P9L8q5
7060e3l4J26l6o8Q8q4O7k9rM6N3k14K99r7J5j0j01L0J15j73o2q6K79o9o4P9j8
7087a0J69k7j27j55L11k44Q6L3J77k84K7J77j65j31J68j6P9o8K5j39J6J16J14
7110A32n0K9j04j7qQ3j13J4p6K10j16n3O5Rk1j07J65j08K3l6O7l1O8m9K1p3RJ03
7138C6j13J89p7l8o8J36k2j17j68J92K1K6q8r0R3J15j05J18q5K8K24j26j2j60
7162i1J36j49J04k2P1m1Nj4p6Q7M9j43p3L23k16k9o6P7K73j77j57K41q9r2J19
$$ y = [138, -41, -62, -55, 78, -103, 144, 97, 89, -92, -48, -32, -45, 85, 103, 41, 13, -64, -96, 69, 34, 55, 178, -17, 1, 4, -123, -88, -57, 26, -260, 42, -18, -138, 4, 5, 81, 7, -41, 25, 55, 33, -33, 8, -61, 1, -110, -68, -100, 147, 67, 134, -21, 77, 130, 50, -129, -92, 126, -68, -58, 3, -98, 139, -21, -82, -43, -48, 36, -27, -158, 104, 192, 103, 158, 17, -85, -6, 32, -53, -87, 39, 3, -65, 23, -61, 6, -23, -32, 14, 67, -147, 152, 55, 70, 60, -41, -11, 104, -69, -131, -217, 62, -7, -71, 8, -10, 159, 132, 5, -150, 161, -83, 3, 36, 213, -71, -44, 133, -32, -163, 5, -11, 68, 0, 25, -114, -98, 18, 132, 82, 111, 7, -10, -18, 65, -48, -34, -110, 100, -16, -69, -4, 5, -16, -123, 42, -66, -43, -79, -12, -43, 25, -24, -3, -76, -67, 36, -77, 112, 35, -3, -71, 65, 43, -74, -242, -50, -29, -3, -91, -181, -88, 27, -78, 40, -45, -17, 207, 81, 69, -91, 45, -104, 0, -22, 49, 8, 13, -1, -77, 10, 59, -84, -157, 166, -50, -79, -145, -68, 205, 28, -129, 112, 23, -69, 50]
7187E0J7qk01J97RK6o5m2K1J6J51k91J32nj39N7J35j4m4Po9J3P0K9L1j94J66j74
7215a19O9q7J33p7p5J06j18L38k26OJ7j0K00j80J5P1j06L9Q1Kj89J19pJ3J15k02
7241g2R4N3l4k20L06j71J6p1J04M1m6J63o7j1j5j94N2N6l3K1J73L2k82Q6P2j34
7267h1K4R3k7R3j31j68J99j14K28j37JN2j77J77J6k51R8P2L2J13q1pQ2k32J51
7292B5j99J73Q7M3j27Q4Pj36m1Q9r9M8J33k18K18k85J98J40k40J61j18Q9n1n1
7316g0KP6N0q4r7Q0Kp3J93p3J7j41K61l92K44l7j15K80k4j11K8N5L3l69L54k04
7342a15Q3P6p7o2j45L21r0m7k9J46j30L6K36k78m4R2N0j11K04q4j33J81j97L2
7366h5J30r0l1J22Qj70K07k30J61J82k81J35j72O7l6K5J2O2O9k40J92O1j02L5
$$ y = [50, 67, 59, -142, 55, 64, 90, 25, -17, 4, 20, 171, -120, 12, 7, -132, -75, 60, 46, 2, 9, -60, -47, 23, 52, 83, -111, 55, -119, -50, -137, -4, -81, -156, -50, -168, 170, -56, -50, -33, -43, 157, -23, -8, 63, -43, -4, 77, 79, -110, 9, 2, 15, 130, -72, 22, 75, 41, -179, 127, -44, -28, -99, 5, 46, 0, 163, 96, 85, 70, -124, -72, -16, -49, -28, 145, 177, -105, -19, 53, -81, -57, 36, 9, 102, -29, -197, 2, -112, 116, -21, -20, 32, -145, 32, 48, -203, -105, -33, -1, 112, 31, 24, 106, -126, 25, -174, -1, 86, 129, 2, 86, 93, -43, -84, 5, -94, -46, 87, -131, 87, -198, 0, 140, -100, 61, -57, 32, -19, -70, -68, 8, 58, -26, -123, -43, -41, -114, 79, 6, 23, -118, 143, -249, -5, -42, -157, 123, 99, -12, 16, 71, 104, -265, 89, -115, -32, 44, -33, -95, -240, 81, -9, -56, -85, 61, -69, -33, 203, -75, -119, -27, 23, -88, 116, 32, -101, 80, -117, -85, 45, -45, -76, 46, 54, -116, 91, -139, 22, 204, -77, 58, -114, -47, -83, -58, -46, 16, 85, -155, 37, 98, -4, 31]
7390C1P2Pp8j02m4K94q3l8j42N8R8k33K35N1k41K60j78L5m5J6O6j8j60OJ12j01
7416a22Q4O5k26J56L5K4K8m4K4j77J68o3m1n1k4R5K1J17k35J65o5q8K14r6O4P4
7442A02k37K93k33M2o9N3j9m7J2Q3k4J88l3q8J13m0j78J46j30L3m2K34j00l6j2
7467A1n7J17nM5n9J4m3l01M74m05J82N7j1l2njN0r0N8j56m7K43o6j31K52q9j38
7494a33K64K2k11p2J84J7r9m4K21m3j60J91n7q8j27K12l8o4r7M4J20k07J29J68
7518A32k2k32K69n3r0J3m9J20J15j72k5J04j74QJ66j3j75J72j68J05j11p1K59
7541A08p6l5k9p2J11rj75K63o9O9j33J91k42L6P0l4J23j24K2J4J9k8m0O1J06r0
7567C7m3n2o0J31n1J77n3j63K4J24j19K09j26j34K75j85n0M4K4q5J72pj57p0M1
$$ y = [31, 103, 110, 32, -70, -114, 180, 97, 59, -83, -25, 73, -160, 75, 126, -115, 145, -33, 2, -43, -27, 39, 21, -139, -133, -21, -122, -38, 27, -199, -43, -8, 16, 44, 0, 24, -153, 15, -48, -89, -140, -164, -69, -48, 69, -166, -1, -66, -154, 60, -36, 28, 102, -135, 158, -75, -33, -102, -49, -68, -115, -103, -20, -44, 144, 111, 23, 136, 96, -82, 64, -66, -33, -75, 159, 59, 23, 11, -46, 71, 66, 111, 52, 66, 23, -278, 196, -209, -27, 30, 19, -13, -18, -19, 31, -59, -1, -157, -204, 39, -27, -158, 94, 5, -133, 131, 153, -58, -130, 54, 71, -28, -72, 149, 106, -54, 137, 80, -8, -135, 77, 39, -25, -122, -78, 42, -165, -36, 132, 110, -122, 147, 94, 4, 17, -32, 88, 203, 31, 6, 110, -64, -56, 110, 97, -78, 94, -74, 31, -80, -151, 108, 32, -3, -32, -104, 7, -2, -177, 86, 17, 86, -47, 144, -98, -62, 8, -26, 97, -27, -5, 9, 28, 0, -40, 21, 127, 37, -6, -58, -118, 13, -38, 139, 86, -77, -53, 71, -48, 161, 35, -99, 176, -9, -59, -15, 9, -76, 96, 89, -68, -138, -97]
7592i7J25J58k25J49j15J04r0M8K7k4n9Pk5LP5l12N23l83Q6k2m6J6K6M7J06k61
7618a59k1M3R7o2Q5j53P2K7j19K30O8k80J72r1p1R8mM4k0Q1kQ8m8j25r6R0J1J08
7646F3j54K0M5k9KJ29p7K3q4K8K0M4%J64k21m9J97n1K3j92q6J60L5J02L5l31K78
7673I4mk3j28R9j60J40j30j3J53j11O9l6J39o6J9qn5O9P3k19J89p8J23n6k14J91
7699E7p3K8J45k49L6J20J35k93J09K42l98NJ76J3m7k0o4pK10j65J03r3k5P7q2
7724f0mO1O5j55K04j45Q7k4m8L1j8K21k45J2j21J26q5R0K49k45O8Lm6l2lj64J81
7751Ck5J33l0j14Q9Oj06J13j49J08j68K99p8m7o8L0p3N8j5r1K44j04L4j0j16q7
7777a64J17K7p2K45r1j29k5J66j92L6P4m8Q7r7J21J0Kn0l7O7j36O6%M3L7q4o8
$$ y = [-97, 28, 186, -39, 110, -5, 99, 9, 57, 84, 60, 1, 8, -17, -14, 61, -251, 272, -111, -25, -47, -93, -77, -51, -4, 102, -159, -180, -137, -40, -102, -17, -170, -98, -71, -190, 40, 108, -172, 0, -91, -162, -64, -68, -24, -44, 37, 35, 123, 75, -50, -146, -56, -45, 63, -91, -71, -26, -55, -53, 76, -1, 22, -62, -34, -14, 30, 30, 194, -27, -76, 121, 70, 93, -99, -185, -25, 10, 112, 147, -184, 94, 90, 67, -61, 38, -122, 18, -112, -125, 28, -83, -14, -50, 89, 23, 42, 34, -21, 48, 121, -98, 91, 13, 136, 80, -134, 57, -16, 12, 157, -92, -56, 64, 199, -94, 15, 257, -141, -136, 40, 53, 6, -14, -78, -85, 125, -40, 63, -30, -55, 22, -60, -64, -3, 62, -93, 111, -34, 53, 29, -19, 12, -6, 215, -30, -18, -139, -13, -98, -8, 241, -4, 64, 67, 21, -11, -14, -178, 3, -22, 111, 81, -33, 56, 62, -44, 69, -80, 28, -140, 159, 81, 34, -34, -4, -77, -19, -34, -125, 119, 15, 49, 39, -77, -164, -47, -20, -92, 153, 62, -67, -92, 74, -118, -82, -8, -56, 31, -66, 55, 65, 67, 17, -20, 47, -89, -23, -23, 20, 57, -27, -95]
7804i5K04j46J1q2Q0K03k23O6J01j35Q2kp5J2r1J29%R7r8ol2j11J27j21O4pJ02
7831E4j64J70k25K29lN6j23Mj07J26k8l6P4Q2k2j46Q7n5Ol9J41j28J67j45qP2
7857C9j68K65j49J71p3l6q5m3k9J68p2J69r1Mq6o3J31m2r2M3k1K8r4J46J20j87
7883d7Pj09J33k2K3L6N9q0J9o1n8N1L4N0k4m2K9r7N7R2o0NJ12q3j88J63No6M3
7912a9j01L30l29J42p7L7N5L6j78L6J51k37P6P5Q6%j22L2m0m5L5J14k0M9r2J15
7938A09j00P1j39jQ6J2mJ13j28O5J01k07J6M9J10j78o1J58M5j74J68k45m9K01
7962A8P8o9q6O7l2J2k1K08k27j70J75MJ65j33L8J5j07J38j73j26L45j59Q5j3j24
7987i2k6J30Q5n1o4p4J26J21L3j07r5O1r6K7P2q8O2k5r3J64M5k56J74Q1O5j63
$$ y = [-95, 109, -37, -26, -108, -28, 175, -48, 18, 119, -16, 66, 64, -11, 1, -90, 39, 39, 136, 38, 32, 0, -111, 16, -105, -41, -48, 54, -110, 60, -165, 64, 61, 117, -6, -2, -109, 17, -11, -47, 27, 109, 87, -59, 28, -27, -21, -60, 81, -47, 120, -25, -33, 39, -129, 136, -13, 158, 85, 49, -36, -79, -108, 60, -12, 157, 66, 70, -16, -79, 52, 10, -82, -39, -60, -32, -126, 20, 140, -47, -40, -149, -16, -38, -15, 21, 80, 0, 19, -42, -100, -49, -15, 35, 11, -31, -2, -99, -42, 50, -10, -5, 107, 24, -164, -1, 4, -62, -19, -120, 210, -119, 23, -54, -17, 38, 74, -104, -68, 83, -154, -78, -3, 83, 83, -39, -7, -47, -92, -57, 57, 37, 86, -6, 109, 9, 80, -59, -60, 26, 38, 34, 147, 19, 84, 185, -22, -6, 43, 153, -25, -86, 72, 117, -57, 111, -134, -183, 18, 96, 27, -59, 8, -24, -12, -33, 175, -52, -222, -47, -43, 122, -11, 27, 42, -65, 73, -100, -226, 119, -40, 45, 32, -92, -118, 12, 97, 46, -18, -92, 34, 155, 188, 81, -14, 47, -49, -22, 50, -38, 24, -1, -94, 70, 115, -141, 33, 114, 179, 16]
8013A6J20k15L8l4M2J45j8j28NN4j33J88k24P4jR9j0M2j25J49k72K09JP4l8o7
8039iO4k20L54j76k0r6J22J2l1o2m1RQ5o8j6J39j55J44r8J43l0n6Q4r4J17j86
8065h5j7J75j24j0RJ0J2p4J03p0Q6m3l1jJ18j79O0jJ60M5j07r7J3N9o7M2m7J30
8093F9J60k22M7j02n4N0J05l3Q2o1p7J84k51L0J55n6J1j43O2k4k0P4R8k1j75J05
8119gJ0J44Pk63J36j11J42j71J59M7j8p2M8j83rO6O7qQ6J02k80J11M9j20m8R5
8145b1p6l5L07j89M1K24l97K64k44J52j27O5J22n1K2J9j75r2K17j03J98l09J50
8168c8j19J92n1O3j11Q7k9N7M4j95p5J52rR2j50R4M8m0p2N7mN7m1
$$ y = [16, 136, -79, -41, -75, -33, 112, 94, -34, -29, 25, -108, 80, -144, -70, -71, 28, 18, 60, -65, 84, -188, 21, 22, 96, 58, -9, 55, -165, 189, 13, -7, -103, 19, 31, 0, -62, -103, -94, -9, -77, -93, 46, -109, 35, -63, 80, 50, -6, 78, -16, 101, -85, -102, 73, -51, -61, -52, -42, -30, -104, -1, -71, 15, -28, -59, -60, 58, -121, -61, -62, 98, 143, 36, -61, -48, 11, -56, -14, -61, 69, 229, 7, 54, -48, -102, -52, 53, 20, 102, 41, -36, 148, -103, -73, 82, 26, 37, -106, -44, -68, -88, -14, 84, 63, -112, -7, 3, 147, 154, -109, 27, -84, 58, -113, 46, 93, 75, 3, 51, -132, -141, -75, -8, -16, 70, 172, -108, 3, 52, -68, -116, -21, -97, -132, 175, -14, 27, 251, -146, 118, -126, 26, -101, -36, 86, 35, 57, 76, -99, -191, 26, -77, 121, -188, -38, -157, 35, -16, 47, -64, 23, -6, 51, 95, -100, -175, -23, -32, 60, -90, 4, 52, 12, -60, -3, -7, 50, 9]
8191I
$$ Imaginary data points
##PAGE= N=2
##DATA TABLE= (X++(I..I)), XYDATA
0@%%%%%%Qq%%Qj6J6j6J9k7L6m4M8n6P2q7J02j19J36j56J82k09K41k77L11l51L98
33B11m50N08n68O34p10P93q79R71j076J192j318J455j602J764j945K141k354K592
51A359k858L155l485L858m286M777n348O024o836P830r082J0708j2905J6028k0788
66a1849K8816m4637Q6285l83290p54172J383236L80937j201864J73545O95130
76C52137n65573n7591N88277l22915m16010M57427K88390l75628j70679J87246
86c4919J03019J5785k05659k3937K97225j35522j76881L00571k3891l34222K45369
97B6938L41913m47449j92546N59979r1232m64097K61465K03078k76454J1230K44136
108A76961j64024j72488K59859L0080k15556P9191J09283n3610j05036l9940J30385
$$ y = [0, 0, 0, 0, 0, 0, 0, 8, 0, 0, 0, 8, -8, 8, -8, 11, -16, 20, -24, 24, -32, 40, -47, 55, -64, 72, -84, 98, -111, 130, -147, 164, -187, 211, -239, 269, -299, 335, -375, 418, -461, 510, -566, 626, -692, 763, -839, 925, -1020, 1121, -1233, 1359, -1499, 1656, -1829, 2029, -2257, 2520, -2828, 3196, -3640, 4190, -4892, 5816, -7089, 8939, -11849, 16967, -27670, 58615, -324675, -1078847, 304389, 685326, -516538, -342993, 352137, -213436, -271027, 317250, -5665, -421675, 35752, 324142, -51486, -222165, -34919, 68100, 83885, -121774, -145711, 151514, 15992, -160889, 139682, 115791, -218431, 26938, 368851, -78598, -271144, 288835, 197603, -266494, -5029, 198049, -78405, -67175, 176961, 12937, -159551, 100308, 130388, -85168, -5977, 103306, 49696, -55340, -95280, 35105]
119C5105O2184j74528j18847K18334J23227l01960m6930K98669k6846j82236P2104
130d1724J01416r2068j759J32472j04078j05000J45885N3636r4589l3024O0014
141B1181J9973k4388M4497k7232n5175O9940L0176m7244n3383J879O3100j2712
153C0612m9649k4759J9412N3942m2649l6711L6578M712J2912j434k7993k186L0781
166C568L2392o7299l7835P7609L232m5277P718K4032j2639j9408N7100J6345o2836
179b3298P865M8876J2123m4100l0307M8278J6622k5147j3012o48J8402j840O414
192B0228m183l2083L4860K4698m1204j6427K1797J4963l4953l150K9993l8689
204b4150n761L7544j7064k5167J1544L4943j1340l0022K5326M604q846P820r506
$$ y = [35105, 97289, -77239, -196086, 22248, 145475, -156485, -203415, 95254, 68408, -113828, -41724, 59692, -32376, -34135, 98337, -5741, -110741, 35144, 88780, -5809, -38833, 21181, 41154, 16766, 61263, 34031, -21144, 48796, 78972, 31728, -21655, -19776, 43324, 30612, -19037, -43796, -24384, 29558, -13091, -49802, -13224, -8512, 4400, 2966, -25027, -27213, 3568, 35960, -31339, -69174, 8435, 11667, -33610, -25892, -1860, -14499, -33907, 23193, 39538, -23298, -15433, 33443, 45566, 1466, -28841, 19437, 36059, 10912, -2100, -2748, 15654, 13814, 20228, 16045, -16038, 18822, 43520, 2316, -14111, 7686, 22649, -12304, -15454, 14539, -24150, -29911, 7633, -9431, -34598, -23054, 11889, 549, -29473, -4147, 457, -8389, -569, -10075]
217a0075K303N38K829M470j7836R945J9769m023j4940j157L6742o678l8336K4389
231G940K5876j8312j9752J4689J4298k1616N553Q701j9658Q441J0964r993j3042
244e911L919J7711j6742j1734J1852n840l498l560L761n88j8115J8597J2696k3228
258b0680j789J8363J2435j7905p348K4969n785m581J0472j0506J694J2107J398
271A2844j3633n899K3980k031j9737N294P887J926j0933l271J2370p431n659O101
285A808l47o221j590J1780p044r917J6049k981j0069Q963L786r087k895J4899
299G134o345j5186J6230J516j1341L032k34L181R16l077j729L52J0796n498n625
314e878J1171l358J968L259o633Q040K654n873P71M396l68o944P450p42j4444
$$ y = [-10075, -7772, -7234, -4405, 65, -17771, -7826, 11943, 7920, -7020, -8177, 28565, 21887, -16449, 7940, 33816, 15504, -4248, 10441, 24739, 3123, 8676, 17377, -2281, 6160, 17124, 7131, -5911, -1992, 15719, -1023, -12757, -905, -6745, -10243, -13803, -10042, -10630, -28745, -10148, 2548, -20680, -22469, -4106, 8329, -9576, -16924, 8045, 2260, -2321, 8151, -2355, -661, 11446, 12844, -789, -6688, 17292, 15261, -4476, 818, 8705, 10631, -302, -3573, 8797, 1366, -4293, 1808, 1461, -4760, -6350, 5430, -1614, -11531, 4518, 1537, -8532, 431, 4217, -4870, -7765, 7134, 789, -14397, 1833, 3349, -7992, -4960, -5194, -2013, -1097, -4174, -5903, -5551, 5245, -253, -5878, 5293, 1935, 3903, 7162, 529, 8569, 11223, 5350, 6121, 10517, 10149, 3205, 10655, 9913, -4531]
329d531J2942J505j9445Q609R029j6399m561J6492r618j7669K1310L092k4582
342b3826J0888J2493j3224RJ3249n988o098J5998l741j0145J5570J9p975P747
356D976j268j995P336n55j0840P966J2397j9479m37K0001j5414n200J7576r692
370E372j3233J5527N304k2220M514J7482k1119l364K1559j5070j1612J8680N93
383B413j7190P701J2059j6530K201J6595j4594m427J8257l985j1740J1141N582
396G483j4156O974J2482j6256m89J7239q403r336J2247J675j3382Q769P194k1615
410i574M546K0507j6387j0539J5729l56j0649J0345L059j9143J1816J8362k3979
423f263n952K0961o977r494J1485m443j2878J5801N552k4030Q372J7489j9602
$$ y = [-4531, 8411, 9916, -9529, -920, 8109, -8290, -12851, 3641, -5977, -23646, -2336, 756, -23826, -12938, -445, -13669, -13660, -411, -6399, -12497, 3501, -240, -10385, 5185, 5204, -2771, 4976, 3708, 1713, 9049, 8494, -2346, 5620, 18017, -1462, -1899, 18102, 2688, -2512, 15064, 5372, -7861, 7666, 12970, -9250, -4736, 12746, -8373, -11737, 9822, -5248, -16860, 1820, 2413, -14777, -7076, 4983, -11547, -9346, 7249, -7345, -11772, 6485, 2500, -9240, 1901, 7483, -6673, 301, 12783, -3473, -3962, 13277, 4874, -4462, 7785, 9460, -3922, 4847, 12041, -9574, -5028, 15479, -908, -11447, 4282, 3926, -6723, 3622, 6681, -12462, -646, 17716, -6263, -12215, 8746, 1769, -7725, 3760, -683, -13561, 2240, 7792, -16238, -7866, 9623, -9979]
436i979J93K0535j4981j1790K4558L65k4089J4255J4011k1543N086J7825j6361
449a915l802K1393o569j4843J6937J511j9314J3683P824k3203K088J6633j1530
462a107r224J0813m117p465J5487m449j8969J5919J1109j5513P69P405p981L919
476c404J3999j5625j3874K5732P812k3465K316J3112l188J583L257r282K29J4078
490A3280n799j2512Q164J026n679R183k899j5576R304J6781j3068j1901J2898
503C202K798p260K607k121n718O252L486r531m10P329o536n32R153n987n124J0124
519A732K585o900M45M600l599K62N664n877l646N178k20p7J244m471Q25Q590J02
536F437j2122K73J2367j956p697M65P69J231L227q26n031K11O045L111k925n696
$$ y = [-9979, -9786, 10749, -4232, -16022, 8536, 8901, -15188, -933, 13078, -8465, -3379, 14446, -1915, -5717, 15676, 9107, -5736, 11201, 12712, -6602, 7081, 14905, -8298, -6210, 10423, -1107, -10331, 482, -3635, -11100, 4387, -62, -19031, -3112, 7997, -7516, -6747, 658, -7323, -3404, 10595, -5030, -18904, 6828, 14640, -8825, -6509, 6603, 3415, 4998, 8255, -1027, -798, 13280, 7481, -5031, 3133, 4159, -1520, 7663, 4764, -10812, -1508, 15273, 2205, -9696, 3202, 6000, -1260, 1347, -774, -6492, -240, 3246, -6285, -6695, 634, -5902, -6434, 2719, -3268, -8392, 1732, 4317, -2583, -2138, 2462, -1137, -875, 4789, -1088, -4734, 444, 224, 147, 1391, -3080, -2255, 6335, 6437, -5685, -5412, 6955, 4999, -2698, -2233, -1464, -233, 2994, 2168, -2863, -2652, 3393, 6504, 3579, -2117]
552b117m40R501L100j0976o324R319N647q375o189K428L690J325l236k993J617
567d023L413J327k282j062K06P39M008j591n394K471N006k09k604M70K212m40
583B247J780K297l786k247K299K352p94n040j675L350J702l849l464K484K782
598D38k491j95Q83j718N85M055n3n936n46O089K243n152l709L784N633q74m786
615a750p61M899K824k906l492k48M264J697n108k508L320K075k119j852J156L99
631a10M50J223k493r25L477Q14k710q80J733R86j457n62M70J53P8l98R97J2k407
650a549J669K164l285j849M108K64n294L21N147j761m624K488L705j782j634R38
666i74N16J048P83j176o47J115K322r39k957J546K933m46l349N41L148j757k328
$$ y = [-2117, -2557, 6944, 10044, -932, -7256, 2063, 7710, -665, -6854, -4426, -736, 589, -2647, -5640, -4023, -610, 717, -1565, -2627, -2421, -1682, 2326, 735, -4659, -2188, 2818, 2609, 5, 475, 2687, 2247, 4027, 6324, 2538, 291, 2590, 4942, 4148, -892, -2567, 783, 2485, -1364, -4828, -2344, 438, -2053, -2248, -1365, -3083, -2498, 1557, 1504, -4432, -4978, 1111, 3354, -1798, -5507, -1723, 3910, 3036, -1750, -2511, 2388, 5212, 2306, -1186, -1434, 2830, 4527, -581, -3089, 231, 2306, 187, -1665, -509, -110, 340, 1563, -930, -1855, 1622, 2436, -274, -1154, 579, 1565, 108, -454, 16, 169, 247, -151, 846, 858, -1549, 120, 2284, -1001, -2850, 1258, 1522, -3772, -3451, 1696, -65, -4689, -2201, 1504, -278, -1912, -974, -458, 590, 1373, 197, -450, 665, 2987, 2048, -909, 637, 3570, 3124, -225, 316, 3464, 1707, -621]
683f21K077o46j964J342P47k407j861K443J275k939l36J800k35k42M39M54j097
700a771P79K840j223k447K303K890j917k188K508J694j981p39J024m05m16N64
716A515j083j091Q48j80r47j77j48P7o5l37L6k0J66k33N34Q19j331R59K213j769
736b14r52K566J051j659l50J545o05n67J543j780j472K900j43l331J97J777n19
753a3j284J053m63p54J475j77j311J306L68j149J480O4j811J236K153k014j214
770a055K666J16k117J498L31k783J522K000l077r61K541j110j910J693O74k069
786b041O29J334j306J017P45j631J475J692k400j25K737o63k093K371L77l152
802a034K032K247l612n18L501j713k267J945L19k427N16J569k115p78J407J5l51
$$ y = [-621, 1456, 810, -1154, 188, 935, -1472, -3333, -890, 385, -2554, -2890, -1090, -1325, -1567, -1128, -674, -1771, -992, 1848, 625, -1822, 481, 3371, 1454, -734, 1774, 3468, 1487, 748, 1772, 1367, 951, 1515, 432, -659, 189, 9, -938, -1115, -1263, -1186, -1251, -1588, -1552, -1572, -1406, -1639, -1105, -286, -1617, -658, 1555, -214, -1166, 1400, 2451, 792, 442, 1987, 1382, 815, 2358, 578, -894, 2006, 1863, -1468, -1271, 506, -13, -1297, -244, -707, -1461, 14, -163, -1474, -168, 200, -949, 531, 595, -1216, 20, 2173, 159, -1055, 1611, 1727, -390, 1108, 1439, -1344, 178, 2178, -899, -1860, 681, -429, -2339, -646, 28, -2041, -1412, -78, -1384, -367, 378, -1253, 222, 1914, -486, -611, 2126, 1463, -630, 1741, 2118, -1034, 998, 3245, -367, -885, 2616, 903, -1364, 581, 900, -1527, -1011, 558, -1557, -2335, -928, -913, -1264]
819a264J93q40O95J945j381r64K113l9j242J869M03k521R71L183k310k128L198
836A881R3k506J680R15k561n6K475o41k051N68N22o38L12n68q28J383l04q61J011
855a74J53j030J247J020j810n96K790q53k077J877L41j893R19J545k050m39J965
872I35N7j483M60L41o44O56J38j616J47J345r34p9L09q07L44J631n15j130P76
891f9J334q55K02K59j428J054J054j313j106J035L27j50Mq58m64J471P03k387
909a187M2J448q20l37R30j358n45J843P5j707N33J474n25k00J181n18k90J540
927A579j31j142M05K61k99M29p61n79O96P39j039k51Q14j018m87J658q82j930
945a938J116R26j110n38Q86l33J02J037o21n43J197Q46p13J23J42J25Q20j91j313
$$ y = [-1264, -1071, -1911, -1216, 729, -652, -1616, 497, 458, -784, 1085, 1488, -1033, -62, 3121, 811, -1317, 1881, 1974, -532, 1148, 2063, -498, -554, 1921, 1280, -771, -203, 319, -319, -7, -575, -1403, -20, -324, -1185, -174, -21, -1051, 196, 1216, -594, -1190, 1600, 747, -1330, 547, 888, -1005, -86, 1459, -591, -1030, 935, 992, -491, -31, 310, -334, 322, 460, -1156, -1009, 336, -598, -677, -368, -1175, -831, 800, 285, -845, -69, 1265, 410, 612, 871, -557, 497, 1551, 238, -868, 167, 494, 344, 348, -510, -974, 497, 1200, -1187, -1145, 303, -517, -854, 76, -1282, -1827, 16, 91, -1616, -1083, 391, -134, -334, 847, 329, 39, 1579, 1448, 306, 711, 972, 673, 1102, 341, -238, 458, 1197, 158, -93, 721, -297, -784, 874, -8, -1938, -822, 104, -1006, -1544, -658, -991, -889, 148, -473, -1016, 181, 1027, 314, 437, 579, 704, 1524, 1333, 20]
964B0rJ471k89j418L50N27l29L03k73j035P44K24q05k81J79r1o1M56l93p88Q78
985f20J133j055J68Q96k38j34L31j48j3J72J11p64K36M56r83J69Q73j107k52Q32
1005F3j12p48m4O41k42k57O42m49n72P65L74l4q1m03N54R53l08q08K44J105l2
1026A251q63L08J49j69J31k99l79J14K1O9m82m61K00N25j70p14j05J005n2q57
1046g78J9L65J31l9JL14j6NO31k39k12J72J35J54jm17k8k5k71K10l24q1k86PQ5
1071d88k1o04L06K25K68l90Q9M00R5L58P1q0L37K79L0M8Oj17K17R8o09j95J61
1094D84L10o90o42L56j58k87n7l56QK70k23o0K50L49j12K49L76lJ25N32l3m46
1116B42Q01j60o03M02K31l18l12M69j51l83K00l64m98O28q9q67M3K46k05l0M19
$$ y = [20, 11, 1482, 1193, -225, 125, 652, 323, 626, 353, -682, 62, 286, -519, -800, -621, -712, -773, -317, -710, -1498, -620, 513, -542, -374, 522, 284, 150, 481, 333, 320, 492, 603, -161, 75, 531, -452, -283, 590, -517, -769, 63, -49, -797, -841, -200, -442, -699, -57, -506, -1078, -313, 61, 27, -54, -457, 97, 1050, 742, -66, 178, 1283, 1251, 388, 696, 845, 676, 807, 508, 129, 243, 264, 333, -149, -610, -410, 115, -55, -769, -874, 131, 79, -778, -759, -394, -263, -302, -301, 13, -3, 2, 633, 394, 182, 354, 489, 643, 642, 225, 197, 172, -99, 111, -213, -294, -580, -573, -488, -509, -1113, -807, -582, -314, -704, -615, -215, -120, 238, 309, 229, 566, 845, 875, 923, 929, 812, 1029, 1127, 518, 323, 484, 794, 104, -538, -182, -340, -627, -684, -1040, -1032, -762, -985, -1045, -795, -446, -558, -309, 67, 64, 189, 721, 688, 242, 1043, 883, 280, 682, 913, 595, 283, 752, 601, 218, 418, 54, -444, 184, 95, -772, -729, -483, -688, -718, -299]
1137b99k39l58Q65L20o57K76N51k93L10K12p38M09N09n17m95M39J61o14M36K78
1157E56p73L17M98r19Q4M92m58m35J11J09o60L45K72l71K26N92m13J90L89l37
1177a85J81L96L3l00K45M7k09J68L54n22n7O28m84k88N55k65m66K44q8n66K3M09
1199a47o51p1M19j90K19M26k19kQ19j59j43J25P0N2P1P6k64l2N09n58j28L18l39
1222B01r0L07j50l77j42J06l06q8K87k30k64L56J78l52L67K52M5Q0j4P3J66r1
1244C14k41M0Q8j62k64N7k88q4L97j13m84L91J36l87M0L85k44j16K90L90n52K29
1266a78L51j64N7N58j73NJ47J31j55J27O7k59P8p1m85L55j97m03J43L38l52m5
1288a25K03k56k62L44K44o35K32Q7M0l22M91k92j27M35j06RL22K38l83J13J82
$$ y = [-299, -538, -896, -31, 289, -368, -92, 459, 166, 476, 688, -50, 359, 868, 351, -144, 295, 456, -158, 278, 556, -217, 100, 598, -321, -237, 255, -203, -638, -527, -418, -1078, -733, -461, -832, -606, -14, -427, -237, 152, -185, -4, 392, 425, 125, 370, 417, 208, 376, 730, 208, 151, 779, 295, 7, 562, 297, -169, 75, -13, -579, -556, -147, -798, -869, -450, -640, -421, 5, -214, -216, 603, 444, 301, 426, 496, 548, 619, 695, 431, 399, 908, 350, 222, 540, 201, 111, 418, 268, -109, -251, -145, -451, -539, -252, -482, -746, -390, -212, -564, -197, 55, 100, 180, 166, 239, 405, 314, 73, 113, 201, 39, -225, -168, -456, -540, -143, -256, -740, -349, -213, -600, -560, -175, -419, -535, -245, 145, -407, -178, 173, 9, 66, 624, 451, 456, 603, 734, 579, 706, 773, 514, 592, 521, 36, 391, 194, -209, -66, 272, -80, -125, 78, -178, -440, -96, 148, -487, -255, -168, -128, -450, 41, -251, -378, 57, -49, -40, 282, 520, 137, 250, 432]
1309D32j86j03K95m38q2M96j36n38M51j24k12O9K36m46j16M71j47n27L54K0m58
1330f89L45Q0j14j9J08J08R3L16k1q6L47j11k34M91l5m74K23L25l11j94J06j5
1352B39m25J78P7m90l1J65n0k52K74j42j19J23L14k32J51R3p3K92J9n6K62J36
1374D53j30K0K08k07o2J59k17k13j2K77m58p7M57k45k55J37n8LJ64R8k07K33N8
1397A26j98K70Q0k11p4K41J3j14L35l51M3L2J97m57oJ04k37j66J70k28P4J96j46
1420c07oJ53j08Q8K85q7j6k8K85k69KJ90p7j67J55n2j13K50k60J12Q5Q7r1k79
1444a68L39j37k11O4j3m8J04j92j2J67M4Jj24J90N6j35K88Q3l14L35j44l5K75
1467D13L5l5N9O1p4J4k18J59j55K4J2n14J86k85o7N9j76m8L0Q7j0J0K92j26q9
$$ y = [432, 246, 143, 438, 0, -82, 414, 278, -260, 191, 67, -145, -76, 160, -286, -402, 69, -78, -605, -251, -231, -689, -344, -264, -378, -397, -289, -181, -88, 228, 207, 121, 468, 357, 123, 614, 579, 105, 328, 653, 342, 148, 254, 239, -186, -8, 69, -421, -452, -287, -337, -589, -315, -457, -576, -453, -139, -371, -220, -127, -200, 92, 111, 55, 317, 453, 323, 343, 551, 344, 282, 441, 224, 11, -1, 276, -182, -259, 198, -47, -302, -165, -223, -220, -56, 42, -165, 68, 126, -72, 198, 278, 67, -7, 234, 247, 133, 468, 117, 160, 192, 389, -68, -74, 30, -207, -373, -203, -431, -357, -161, -307, -313, -160, -268, -180, 105, 18, 2, -26, 259, -10, -8, 182, 105, -62, 93, 41, -72, 178, -82, 30, 115, 202, 111, -168, 171, 34, -177, -113, -126, -174, -70, -262, -274, -107, -63, -62, -186, 4, 60, -75, 213, 296, -18, 317, 173, 138, 413, 448, 413, 472, 533, 459, 473, 255, 414, 259, 283, 295, -219, -33, -318, -385, -326, -502, -550, -520, -433, -443, -433, -141, -267, -356]
1492c56L38nk47L06M7J31j73K06j89L27mq7k22K36k1k81j5J06m61L07k20j81J37
1515c21j32O5m36N56R7%J75K17j01L1L40k58K6J57O8k52J97j46n4j9Q3j34j04
1538E5J53j08j98J71m24j17M4L0j18R4L24k84l6M59j26K8K42J52j78K5J3k58J56
1561I9Q8j06J2l3p2M2J06o5M5K17j63l77L42j85k38J57qN6K2O0j72M6j5J82J8
1586E8RJ7M9l6j35J5J10j57Rl5j6l6K70j4j12o1R1Rq7L5l9l8j05n2J50k11Q3J20
1614a09j6J65j40K23M1M6K0M6p0j01P5P3p0r2j9n7j57K90j10k40K98j02j11Jm1
1639a57j50K00p8P0r6J89k24K12K5P6N3J63R3k49K67M3k17J25M9r4l04J04n4O4
1663A10k0j76O3M0l8j28j45J4p0j19J28l4J62q7R9k1J05R4l9n7K40R6q2J38r9
$$ y = [-356, -18, -23, -270, 36, 83, 214, 41, 247, 58, 385, 381, 294, 72, 308, 287, 6, -9, 97, -364, -57, -277, -458, -321, -453, -388, -824, -268, -171, -171, 4, 221, 120, 151, 491, 233, 259, 416, 484, 232, 429, 283, 229, 210, 293, 159, 55, 208, 100, -98, 73, -351, -468, -424, -394, -512, -418, -94, -378, -414, 45, -81, -53, 189, 341, 163, 188, 201, -57, 99, 187, 81, 93, 60, -12, 30, 136, 71, 116, 333, 170, -207, 135, -50, -288, -131, -139, -83, -61, -1, -173, -127, -142, 40, 58, 67, 84, 133, 97, -38, -23, 87, -70, -61, -96, -112, -148, 122, 108, -4, -65, 26, 35, -52, -17, -56, -94, -199, -251, -101, -312, -229, -109, -125, 40, -100, 123, 164, 210, 230, 276, 206, 105, 180, 253, 183, 91, 72, 15, -142, 148, 38, -202, 96, -6, -117, -116, -157, -307, -107, -185, -115, -211, -22, -246, -34, -9, 67, 120, 283, 376, 127, 394, 437, 220, 345, 394, 300, -4, 100, 46, 110, 90, -86, -23, 17, -21, -149, -294, -280, -350, -469, -341, -375, -213, -300, -201, -222, -117, -23, -62, -119, 121, 217, 135, 273, 174]
1688A74n5K7L7j38Mm8j7p2J40q6j2J3N6j75K30l06jJ91L4k24J58J57j65N1K19
1713A92j34O4Q3j21Rj81L45j17j38R6lj41J81k69J93M6j78J46k26K01j4o1J99
1736A72j90o1J02l0k36K77M1k07K7K74j83n2K12j86n4Q2J02j84L2J22m7Q2k0m6
1760B9q9k2NL5n1m5j4P6P7j36J43J03k25J39O7n9nj4k6l1P0J13j05L5K16k07j6
1787F3N4o5j35J88p0k24N3qJ35r3r7L3Q1M9j63J23M1j74k2K87q2O4J45p9Q1j5
1813A70o1J00j21K64k35o9J68j51N5p2j3L0j8j6k32o6P8Jj67K79N7r9K29k58K23
1838G6k1J90n2r5JQ5oj6N3k61J21J18k39O0j8p3J68q9Mj82J29l1RMj29K9J3J51
1866ak18R9O5M3j33K43k4j55N4qo3Q3R9j68J80n9l0Q4j57K07m05J43J47j04j24
$$ y = [174, 119, 146, 183, 45, 49, 1, -16, -88, 52, -34, -46, -33, 23, -152, 78, -228, -229, -38, -4, -228, -70, 87, -78, -27, 192, 58, 122, 205, 84, 93, -88, 257, 140, 2, 98, 95, -46, 135, -134, 59, 105, -73, 73, -153, 48, 34, -27, 172, -18, -79, 23, -7, -243, 34, 75, -132, -105, 169, -14, -66, 146, -40, -94, -12, 90, -94, -62, 60, 13, 95, 75, 29, -60, -82, -77, -42, -93, -138, -152, -76, 1, -135, 8, 111, -114, 25, 92, 33, 28, 14, -12, -43, 27, 140, 35, 70, 286, 79, 63, 117, 52, -83, 105, 35, -189, -136, -144, -9, -102, -199, -166, -85, -36, -199, -76, -35, -209, -231, 56, -26, 38, 183, 104, 185, 170, 109, 209, 88, 352, 117, 48, 216, 65, 120, 48, 35, 65, 47, 31, -201, -267, -189, -188, -355, -76, -19, -118, 111, -147, 76, 55, 245, 193, 98, 99, 184, 178, 162, 215, -46, 75, 193, -46, 14, -4, -77, 91, 2, 6, -176, -47, -78, -69, -65, -194, -165, -152, -1, -219, -120, -55, -12, -145, 98, 74, -81, -27, -35, -98, -15, 84, -84, 96, 37, 7, 91, -66, 141, -264, -121, 26, -78, -202]
1891b02R7J3L4j15q1J95K5p1lqJ16M0P6P0k13J10J2r3J32r0N5J18j96K35k8k65
1917c7K75l65J67m7j38Ko4K8J27o9J1j03L2JP0jL7R3p7J67m7j29J98j85J36q0
1943BJ08jj51K91L0m18K31p9j66J64n3n6m5o3Q3K8n0K08j25K3J93p1m6J41j90
1968a2K19j54Q0r5O7m3L8j51J07J05j93k8M0j8j24q6mJ09Nk7J35o5m1O8J46NM
1995H7n7R4rp7p1K30Q4j68r2K80j27j58j47R3K05M1k98l4J10O5o0p8K3j1L7j46
2021a84j8K65o6j58J98j58K70k40q9L10j12J16J0j1P0j59l2K38k95J02l3j58J74
2044D0o2Lj91K40Rp2j40J13o4j1J6L7K19o8q9J02l9j86K81k01K54j00R3k01J84
2069A67n8k9nq0K4O4k84K81j54K53j17m4j67J60q1q3M7q2J58j22K53l4m4nR9j15
$$ y = [-202, -105, -92, -58, -173, -254, -59, -34, -105, -108, -116, 0, 40, 116, 186, -27, 83, 95, 2, 134, 44, 99, 217, 21, 256, 228, -37, 238, -127, 40, -7, -145, -143, -207, -179, -52, -121, -110, -213, -181, -180, -110, -111, -74, 19, -58, 109, 62, -67, 131, -54, 82, 2, 110, 109, -42, 249, 279, -139, 92, 13, -153, 11, -42, -98, -143, -206, -123, -95, -145, 63, -62, -39, 154, 83, 37, 178, -12, 207, 53, 133, 38, 105, 62, 100, -51, 56, 161, -32, -60, -20, -38, -162, -248, -252, -143, -138, -165, -30, -95, -136, -68, 78, 83, 87, 30, 124, 115, 38, -33, 197, 281, 113, 21, 301, 174, 16, -131, -38, 167, 208, -90, -124, -14, 51, -9, -87, -64, -75, -38, -184, -202, 63, -3, -161, 37, -121, 149, -91, -180, 130, 18, 134, 144, 133, 203, 44, 12, 250, -45, 57, 24, -134, 40, -22, -19, -210, 30, 39, -33, -173, -60, -124, -135, -119, -82, 137, 69, -20, 82, 43, -143, 138, -63, 191, 91, 184, -17, 167, 109, 80, 75, -5, 19, 83, -201, 80, -74, 179, 62, 18, -149, 11, -70, -153, -106, -188, -30, -152, 101, 67, 23, 18, 117, 2]
2095Bk5l2Q1J69j91NK15k65o0J74j42L4J12k71K94p7j60J34L5o0r1p8K80O8j05
2120D6j58J90q4J27o8M9j22J40p7J3n5K3K4o6K1j7M3J00j31N5N7j43j0l3K48k12
2146d0K2O9Q5j29l1n5J49m5N0M3m1m4p9J19K8kO4L7k34o0J34j2j56J11M1j86Q8
2173g4J98q9j78K12K4j18O0j10J43j44o8J64j09K7M1J1n5R5J02j04O5j96J61R
2197F7R2j13nK7m6j68K47j73J11j23L2O1n5L8l0O5j19J5l1N8j4J85j46m0O4J52
2223A51j47m3kK75l34R7J1m5J26k34j01Q9J51O3o8p2J40j87J68l7Nr4O1j76K79
2248G6L2j04j03P5kK07rj31j7k2J64l4j55J28p2L6m2N0Q1j15j39N0l9j5m6J25
2274b1J04k3j55m9J23j5mQN0J95k58J62j64M0M6j6m8N8o5L0k17J68MJ19J51l84
$$ y = [2, -23, -55, 26, 195, 4, 9, 224, -41, -101, 73, -69, -35, 77, -194, 100, 23, -137, -3, 32, -28, -119, -197, 83, 151, 46, -112, 78, -6, 121, 53, 102, -20, 120, 43, 56, 1, 24, 48, -18, 3, -14, 29, 129, -2, 53, 110, -33, -43, -76, 172, -40, -18, 51, 136, 7, -24, -79, 70, 25, 75, 118, 77, 33, -46, 73, 101, 99, 163, 200, -34, -94, 40, 28, -128, -17, 24, -162, -74, 124, 35, -143, 69, 93, -25, 35, -75, 68, -76, -144, 20, -89, -62, -21, -10, -65, 30, 132, 28, 93, -103, 58, 67, 159, 46, 41, 68, 22, -146, 101, -72, 39, -84, -52, 9, -46, -8, -38, 27, -92, -77, -108, -50, -64, 121, -25, -65, -1, 151, 4, -39, -41, 234, -100, -3, 8, -37, 89, -145, -246, -157, -6, 57, -11, -83, 57, -130, 38, 1, 6, -88, -27, -203, 76, 108, 4, -99, -24, -26, 181, 172, 41, 24, 2, 166, 132, -23, 105, 33, 69, 27, 77, 158, 43, -96, -46, -85, -100, -146, -21, 83, 60, -95, -144, -21, -36, -40, -32, 18, 213, -45, 117, -47, -7, 39, 23, -25, 33, -32, -2, -219, -51, -47, 72, 223, -161]
2300a61J02L5J05k43J96m2J95k48r4J24P5j40O8J56n3L6l02J14K25k06K0J09J02
2323A73l27J30L7J20r7l0J45k11N7j10N9l0j17J96O8O4j2k5P0k26J2R4j19Q1j12
2348a10J32p4J03O2j51L8k4p9J65J40l15J49l4r4P3q6N3q5J09m9Q5j27l7J76j2
2373HJ89j90J19r8O2mJ02n7j8J13j54n1J16j38R9m9j29mN6J8j49K46l36K63j70
2398a56J54j11J07Q5r3J37m2j07J07j52p7K34j18K03m3j28jl7J24n1Q0j1n8n7
2422a1j42j52J45J62k0J27l09J91o4J05j97R6J26l6rJ28O3j43K4m5k7j4J00N2
2446A50J9j58Oj01J62o3q7l5K3Q1r1K38J9k02P4n0j29K08k4k3k23j41L84m0o5
2471f8k6M9o8l4J14j6K37k48kQ3Qk13L26j52k0K47k97R3J8j33K27q4j06J83o8
$$ y = [-161, -59, -24, 81, -162, 34, -8, 187, -61, -155, -31, 44, -96, -28, 128, 75, 111, -191, -77, 148, -58, -38, 71, 173, -154, -24, 13, 133, 36, 6, 151, -60, -3, -113, -54, -84, -201, -5, 63, 127, 115, 90, 160, -66, -54, 40, -79, 2, -110, 22, -52, 51, 113, -38, 0, -24, -103, 62, 202, -113, 36, 2, -92, -19, -105, -52, -137, -28, -77, 8, -119, -156, 20, 8, 197, 7, 126, 28, 90, 86, 188, 131, 113, 226, 72, 21, 137, -1, 98, 49, -80, -84, -28, -10, -159, 87, -249, 14, -156, -2, -113, -6, 79, -14, 123, 81, -26, 81, -71, -148, 86, -32, 171, 128, 0, -1, -38, 86, 35, 115, 104, 46, -11, -153, -305, -160, 2, -18, 109, -200, -9, -73, 32, -165, -69, 57, 21, 12, 140, 203, 60, 84, 39, 12, -2, 98, 150, 169, 11, 17, -84, 78, 15, -72, -107, -84, -3, -94, 144, 163, -39, 35, -15, -144, 64, 40, 17, -206, -347, 37, -3, -68, -94, -45, -113, -147, -33, -49, 188, -60, -62, 21, 29, -184, 142, -10, -30, 217, -80, 13, 31, -102, 125, 41, -65, 118, 50]
2496E0j46J54j41R0j0n2M4k1j1O6j92J94L2j28p8K24l5J2Q8r3j41K53j79l2L6
2521a6pO4j78J57r3k0P0o1L8mN0K06k21n0J09p3K39j96J42j27j58J10l3l2r6K47
2547F7j98J40J3j13J95j12o0p6M2J11j0L7R6n0j23O0J1o2O6o5q1Q1N0j9k4K4N2
2574E2J3j93J71r8O0l4j04Q7J06j39J76j47j32K26O1j31q0O8l4J06n5O5L2q2j05
2599a11P5m4L8r9K72l75L32m7q0Q2Mq6J8n3J8Q9Oo5K0m0M3J42j39k3m3P0m5Rj6
2628d8ol6R4j5P0k0j0j13l3P6Q2j6J88q5n4j15o6Q6R1L7j40J6m5roo7L35m3k19
2657g1J74q5n0m2L6PJ02Pj49K7j5J12m3Q6j32JK8N5k2K5k50Q0K36n9j35o0K14
2684G7r5j5J05n7N5j4j34Q0lM6l3N8Jo7o3L1P9j61J43n2J85J0j70j6P4j18J32
$$ y = [50, -96, 58, -83, 7, -3, -55, -11, -32, -43, 23, -169, 25, 57, -71, -149, 75, 40, 52, 140, 47, -94, 159, -20, -52, -16, -23, 41, -137, 20, -73, -93, -23, -84, -46, -50, 0, 206, -15, -65, 44, -29, 210, 14, 156, 29, -129, -19, -52, -84, -180, 67, -131, 9, 22, -91, 104, -8, -68, -144, -102, 9, -1, 36, 132, 82, -41, 19, 30, -32, 34, -31, -112, -31, 19, 0, -24, 0, 52, 65, -128, 43, -55, 5, -29, -133, -46, 60, -79, 97, -50, -182, 44, 105, -26, -106, -38, -72, 34, -21, 44, 76, -6, -111, -36, -80, -42, -141, 131, -244, 88, 41, -39, 43, 47, -39, -21, -74, -56, 33, 39, -26, -6, -46, -3, 139, 0, -23, -66, 4, -41, -32, -48, -54, -90, 4, -11, 59, 39, 29, -84, -117, -41, 41, 25, 213, 128, 74, -41, -107, -21, 70, 107, -33, -17, -62, -71, -77, -144, 191, 148, -71, 103, 18, -32, -74, -38, -31, 71, 78, -71, -44, -59, 53, 10, 96, -36, -35, -7, 48, 26, 51, -199, -119, 117, 58, -77, -137, 77, -18, -33, 72, 15, 70, 56, -78, 2, -1, 45, 12, 70, 71, 4, -59, -28, 51, -110, 33, -19, 166, 176, 6, -10, 64, -54, 78]
2711G8k05J99j23P5q5J56M7o2k29J9J03K31k8k20k8J25r6J24r3N2l8J5oj08J63
2736F6j45K9Q8n9j8m8Q8K1p7K0n9P4p4l0OK70j99J2J30k42J57J76j42N1k25Q0
2762e0pJ81l4j8j31J29o3j05O8qo1P7jl7K47j23O9j96J29J0j74J15p6K8l0J23
2788F2kq4k7lJ15j89K09k19Q5J04R9rj98J21j33J12j98J41j35J11L2J02L1j34
2812gp9J10o4K9O5j80K27K9o8k07J04M2k6J27k17J31L2J44j59k7K6rq2K2q7j7
2838a41J24N9o6R1p3M2o1R5j69N6K0mJ55j58P8j81J02m8K68k23M3J14j46J27M9
2863A53j00j46M9J39j91OJ6j07R6kj41J07J97q8P0r3K57j32j4k84L06m2mJ9qk9
2889C4M2j03M4p3pJ12o0o3j55K62Mj8j14J45p7J94j83R3j3Kj34Rk6K35j1j80O9
$$ y = [78, -127, 72, -51, 24, -61, 95, 142, 80, -149, -130, -27, 204, 176, -44, -72, 53, -43, 81, -12, 40, 2, 17, 11, -97, 66, -79, -50, 38, -21, -39, -87, 1, 22, -55, -35, -94, -20, -94, -124, -118, 152, -47, -35, 95, -147, 10, 186, 44, 95, -130, -50, -57, 124, 90, 72, -59, 70, 7, -98, -30, -38, -99, -22, -23, -60, 187, 64, 133, -63, 66, 76, -98, 17, -59, -31, -61, 62, 60, -24, -51, -54, 61, -128, 81, -138, -53, 51, 150, 141, -57, 64, -69, 43, -155, -14, -149, -38, -6, 96, 127, -7, -86, 24, -40, -11, 54, -126, 101, 130, 62, -145, -41, 1, -25, 102, -115, 16, 48, 192, 33, 6, 32, 23, -59, -37, -124, -141, -17, 42, -24, 67, -6, 36, -25, 70, -99, -43, -23, -27, 128, -30, 48, -133, -31, -79, 189, -34, 9, 123, -23, 104, 153, 53, -93, -44, 95, -96, -90, -74, -181, -85, -87, -228, -121, 76, -12, 58, -35, 222, 90, 76, -208, 98, 56, 52, 71, 63, 34, 76, -27, 17, -56, -63, 49, -11, -74, -229, 33, 37, 19, -95, 50, -27, 167, -16, 77, 64, 66, -68, -59, -85, 150, 139, -41, 28]
2916B8n7J25o7J02j03N1M7k29m3J47l0JN5l6k3R0j38J77j54p2m4M1J47J14k52
2941a23J24j19J28j7k12K27j63K37k99K71j47J25K9r1k0q1J78K5o5p4K20j58J15
2964A10l8n2O4n1p0o8K9J88j37J00m2j32L9K3R7k9l0J62j84j07J19j46K60j14
2988io9l9K78j52J7n2L0K03l84J82J23j78LL7N5r8P5j26L7J3J29r6k0j9N5J7k8
3015a6n1K2P6N1q3K1M2o1k9M5p1J88k71L9N2m5Q0j9J20p5J35n6k50J58j58Q9J07
3042D0N5o7J14q0o3O4l41L84j35L2l6L0M7r3P4j39J38p2O7o3m6o5J40Q0n9R7j97
3069i4O4L26k71k9p6J21k9j27J17j03J57j83J59j57J12R6j67J58j41J69r2J33
3091A43j77J21r3J4r1J28n8J7K34j71q0j40J67J03q2r4j62J14J04o4R1j42N0K6
$$ y = [28, -29, 96, 29, 131, 28, 79, 126, -103, -146, 1, -29, -28, 27, -9, -32, 58, -80, 97, -57, -129, -173, -132, 15, 129, -123, 1, -118, 10, -7, -219, 8, -155, 82, -217, 54, -93, 32, 61, -30, -50, -131, 47, 72, 7, -67, 153, -5, 110, 72, 20, 84, 33, -37, -105, -76, 112, -25, 75, 33, -99, -60, -37, 60, 31, 1, 163, -21, -128, -9, -155, 105, -9, -78, -117, 161, 9, 26, -26, 4, 207, -177, 5, 128, -50, -47, -10, 45, -53, 22, -104, -67, -54, 75, -21, -41, -60, -5, 12, -16, -67, -45, 31, 82, -1, 20, 62, 1, -28, 17, -54, 134, -137, -98, -46, -91, -11, -30, 90, 15, 150, 94, -156, 2, -156, -67, 40, 95, 28, 142, 62, -1, 63, -278, 106, -29, 3, -33, -3, 44, -49, 25, -114, 24, -48, 19, -44, -90, -155, -15, 65, 6, 103, -94, -30, 296, 25, -4, -80, 41, 12, -115, 2, -101, 56, -127, 32, -125, -13, 83, -84, 74, -67, 102, 10, 143, -34, 87, -6, 8, -83, 45, -13, 4, 238, 67, -13, -153, 14, 117, 35, -59, -221, -107, -3, -67, 24, -118, -68, -42]
3115d2NO9J24j12K4O6k16K62j66o4M3j24O4L3J77j04l6L0k1Jj69K69j01J03k73
3140a58K77j84K50k10N4K2N4n6N7q7P8m1P2J21l10R6j36M9K14qj47J47l02J9N9
3165g0j29J53J37k04J22%l7P0j15r9J99q0O2rM6mp2M0Q3n6kk6J6p4J7k1lK5qR9
3195F0N5o8J01Lj64J2q5j4Q3nJ02k25J6J64k5o2J31r1P3J9j59M9J39j11K01l20
3221a21K88k04j06J44k0J19K6j34oR0l0K15k23J2k50K30j3R0n3r6Q1l5N6P4J5
3246A49j19J87j95o9O0j69J01P1l7o4J64q6j05OJ01k0o8J42k63J24O5J72q8p1
3270a2M5k0j44K97k75pP0n7J15L3J3k7j31J05l4NO2k4O5r7k72K02k7lK07o4M6
3297G1l3j83K1J62j97J64J00j38j8P3n9j48K39l4O5j88J35j65K22k61J88K3k0
$$ y = [-42, -37, 32, 156, 44, 68, 134, -82, 180, 14, -50, -7, -131, -67, -34, 143, 39, 3, 33, 12, 13, -156, 113, 12, 115, -158, 119, -65, 185, -25, 29, 51, 105, 49, 106, 19, 97, 56, 128, 249, -61, 35, -101, -52, 162, 154, 7, 154, -148, -129, -70, -199, -46, 91, -113, 9, 9, -28, 42, -73, -172, 27, -53, 9, 0, 46, 42, -30, 10, 93, 37, 35, 9, 25, -49, -32, -53, -56, -31, -39, 60, 115, 47, 148, 151, -13, -1, -86, -100, -17, -22, 80, -145, -129, 35, 10, -52, 79, -12, 61, 80, -79, -30, 109, -2, 199, -121, 167, -37, -143, 1, -19, 100, 126, -8, -14, 76, 46, 261, 38, 50, -200, 30, 17, 107, 54, -42, 39, 4, 60, 134, 149, 30, 217, 22, -47, 13, -156, -55, 16, -21, -85, 79, -7, -112, -106, -5, -25, -93, 49, -214, -90, -25, 147, 59, -12, 33, 13, -131, 166, -109, -116, -46, -103, 12, 45, 58, 31, -100, 5, -29, -24, 38, 14, 79, -18, -290, -88, -115, -118, 89, 25, 71, 38, -145, -124, 38, -159, 5, 105, -33, -51, 22, -37, -185, 54, 20, 85, -103, 32, -133, 89, -172, 16, 39, 19]
3320A9L0p3L2R8j85J48j60m8K02O9q8J19j5j24l3jj67L30k37rj8J73Np5J14l3
3346G3j36P6j28L87j84j32J05j27R8l3Nl7K39k89J62j79K2J17nk9m4L3j09J66
3370E1k4J57j57m9J33k16R7j38J55J40Rl08J31N1k04L39j04l57L04k6k1M0J75
3393A78j28l5J8j23jR3Q3j18N5k31J71N2Qj7K7Kj80J36J49k24j41J77O3Lj80J04
3419e9N7l8j00J85j01l2J17j13J11nj49J92j1q5l5R1MQ2j05J9Q4j56J40j16p0
3444i3j5L14j85K6J6p1l8o8J35j41J49l0J42l37J98j25J18N1j1k2j0J73l21M8
3468i7J93O4j50K2Pk7n2Pn4R4J65j28l2j56J76n2J8l6J72j36R4o5O3L3j40Om5
3495e6M0q7k3J94J2j56K9pl2K19k59K07j6pl2k12K18j00Q1l6R5Lr7j08R5L5P0
$$ y = [19, 49, -24, 8, 106, -79, 69, -91, -139, 63, 132, 44, 163, 148, 24, -9, -10, -177, 153, -84, -93, -111, 62, 67, -8, 106, 73, -63, 13, -115, 272, 88, -44, 61, -66, 32, -1, 4, -33, 206, -83, 79, -100, -78, 39, 34, 5, -39, -6, -115, 51, 27, 184, 27, -22, 111, -105, -8, -146, 9, 149, 158, -150, -19, 32, -172, 167, 63, -294, 10, -16, -37, 3, 178, 50, 15, 33, -90, -91, 2, 85, -33, 22, -209, -38, 14, 22, 5, 32, 34, -146, -10, 139, -85, -226, -49, 14, 17, -163, -59, -2, -40, -140, 45, -56, -88, 29, -84, 27, 22, -127, 65, 54, -31, -66, 25, 29, 111, 6, 25, 109, -47, 93, -23, -93, -108, 206, 21, 47, 63, -8, -46, -114, 21, -120, 29, -1, 141, -196, 2, -123, -5, 46, 35, 13, 3, 176, -145, -97, 96, 160, 10, 32, 39, 12, -40, -33, -87, 7, 172, 44, 12, -144, 32, -20, -2, -38, 134, -2, 92, 27, 90, 123, -17, -11, -56, -16, -103, -126, 68, 80, -76, -47, -54, -86, 133, -126, 81, 65, 58, 26, -186, 32, -68, 13, -23, 72, 75, -22, -130, -35, 0, 70]
3522G0p8N9l9O7j03J82r2l8k2j82K24n2nP5M1k20J45%j24P8J3o8P8Q4j14pj51
3549a79L0R2L9Mn%m4O4n6j69J14K80j42J13j28JJ09j70j0J5r2J07q0LO2J7KK5
3577Bm8kJ10l9j82K15J24k59N5J13o0k65J30J8P4n9J30n4p8j70L34p0l6M2j15
3602i0J39o4k8M8J48j83m9J09K6j76J3J33N4k95K50l4k8j16K52j82J98Lj65J79
3626A42j56k8J8J08j3k36J79j86Q9R1L0l1n5j3J6Q2o1m3P1m6J38l2q8J7r0K15
3652A18j16O2j61J28q8J20q4M3jq4O3j9p5J18j8j92J73j3O0j09Q7Kl3m6O4M8j94
3679a47K24k0j22n8Q5L9K6j99K44j27j27J60M6j01k4K05j50J43j62L2K36j99%
3702DJ0m0J11o2P3p6l1q9K52j73j2J29o2M9m4P8j68K1L4L5k3j7Kj23J90P3k53
$$ y = [70, -8, 51, 12, 79, -24, 158, 66, 28, 6, -176, 48, -4, -9, 66, 107, -113, 32, 32, -92, -14, -1, -69, 9, 93, -21, -28, -179, -149, -57, -18, -14, -19, -19, -63, 1, -55, -224, -110, 170, 28, 141, 13, 14, 123, -47, -57, -42, -134, -27, -107, -104, -42, -25, -23, 2, -46, -48, 62, 23, -159, 56, 180, -79, -24, 89, 29, -236, -106, -88, -14, -73, 57, 3, -75, -245, 89, 19, -17, 25, -90, 49, -15, -43, 5, 153, -30, -79, 30, 56, -120, -107, 26, 80, -215, 35, 1, -27, -143, 109, -73, 125, 128, -37, 142, -14, -42, -24, 84, 71, -165, 14, -172, -83, 8, 38, 7, -48, -61, -45, 37, -24, -67, 4, -42, 96, 64, -24, -7, -97, 118, 2, 64, -97, 31, -57, 63, -21, 22, 21, -63, 0, -19, -94, 24, 6, -186, -13, -26, 34, -75, 12, 14, -19, -65, -1, 47, -147, 77, 57, -65, -123, -38, 1, 27, -172, 72, -55, -182, -22, 24, -77, -101, 104, -46, 97, -65, -33, 203, 4, 4, 14, -26, 85, 23, 96, 20, -11, -100, 152, -21, -33, 96, 34, 83, 39, 117, -51, -30, 4, 39, 16, -1, 1, -122, 68, 141, -112]
3729a12J40k0o6k3k0J67k4K03k66j80O3R7J16j84J54k08J56j40N0J44o2m8J8Q3
3753C8q1L3N2j44O1j4Q2PRl7J3n8o0K9R0J84j86L9j26k4J24L2j54N3J15l4n6L8
3781B5j7j10L6P4j84o7L02j37Q3r8R7q7j9j16J69k8N1q0O0J13J04k90K46j2k04
3806h9J07L9j38J05j3r8K5o4J86o5j54J42RJ54r3j68Q1n0k6R9RJ59k44Q2N7q0
3832b8K14k10Q2j75Q4M2J16j01MK1Rj73k1J64p7M9L3q2R0J46l02O6J44L0KqJ7
3859A36j27J92l65J51q6K7R6k06J61m6J13K4k5o8n8L4j14J52K50l77mK41J1k12
3883a00L24j67j85N1N5N8j36q7J27R3p2J4OM7Llo6J03j34r5J49p0mR4L9J47j14
3910G7j22J40j97M3N6k4j5Rj31K15j81L5P0o9J87O3j63N3j00m7J45K8L0r6O3M8
$$ y = [-112, 28, 8, -58, -81, -101, 66, 42, 245, -21, -201, -138, -41, 75, -109, 45, -163, -7, -147, -97, 47, -15, -63, -45, 38, -43, -10, 42, -102, -41, -55, 27, 34, 43, 6, 19, -39, -99, -70, 20, 204, 18, 57, -69, -93, 31, 63, -91, -38, 77, 43, -13, 25, 8, -102, -66, 8, -176, -243, 59, -78, 5, -93, 4, -83, -102, -218, -49, -77, -26, -106, -46, 67, 171, -119, 127, 115, -89, 18, 57, -81, 24, 11, -87, -62, -126, 60, -5, -159, -17, -8, 146, 53, -115, -34, -84, -110, -11, -2, 157, -87, -5, 52, -28, 186, -24, 58, -117, -33, 9, 125, 24, 28, 49, 58, -115, -136, 28, -49, 0, 33, -49, 41, 187, -115, -49, 95, 125, 127, 119, 136, 9, 201, -164, -13, -99, -72, 24, -182, -21, -67, 46, 70, 45, -23, -81, -47, -161, -9, 241, -136, -140, 101, 112, -100, 224, 57, -128, -77, -22, 36, -100, -187, -60, 33, -39, -25, -19, 28, 31, 28, -38, 65, -69, -164, -15, -85, -89, 5, 44, 191, 77, -45, 95, -102, -59, -3, -27, -42, -33, -164, 51, -130, -95, -25, -94, 93, 156, -7, 46, -54, -101, 44, 72, 102, 6, 69, 117]
3936A17Nk69J3J88p5JJ65j7o7M8j99J31m4r3K19j49K8K9J27j18J3m0N6rq5l5K14
3963A54j14j75J72l1K7kL3j01K57k72Q6Kj4%p8J49k19K15r7kJ16j81j9M0J67r4
3989A9L2r9J39P0n1j53K7q0l2M1K4k2O5n4J69j20O3j11R4j24q3J97K4q0l8K06
4015A23o2O2j78J9l9N9N6j84J26j0M9Kp5j8M4J43j31k3q4J38rk1j21K09R2j75
4041hO3j98P4K39Rq4Mq2o2L0nk2j32J95j8j67J47o4L8J92k75R9l5L1j00R5o6R
4069i3J24Ll3j24K8L5J32j59J42j89J16K30k23L3l8N3j52J88j41oR0j2nJJ73k19
4095d6k19K77j08J84k18l4J93k03R5J42Rr3Q7j28J24o7m2K29k96Q2N1j03P5n2
4119f1J28r5N1J39j85k3Q2j50K50j3p8m7J60k20M6p8j4J63l8K6j5M5%p8M5p2K1
$$ y = [117, 122, -147, -134, 54, -21, -20, 145, 128, 61, 109, -90, 41, -3, -96, 123, -26, 2, 31, 158, 40, 53, 13, 69, 60, -25, -60, 154, 40, -135, 37, 6, 33, 31, 64, -37, 220, -52, 34, 36, 22, 22, -56, 93, -126, 89, -8, -10, 106, -75, -94, -54, 113, 19, 51, -48, 91, 161, 110, -43, -16, -96, -128, -87, -63, -85, -20, -74, 95, -25, 38, -73, 21, -103, -186, 11, 35, -45, -83, 123, 61, 123, -55, -36, -75, -16, 40, -144, -18, -28, 21, 23, -52, -70, -26, 117, -14, -37, -121, 17, 8, -13, -134, 75, 167, -8, 55, -143, -69, 170, 179, 95, 99, 17, -45, -15, -20, -42, -174, 21, 3, -164, -17, -81, -43, 149, -126, -27, -62, -31, -131, -36, -102, -93, 31, 34, 1, -123, -95, -60, 72, -87, 55, -134, -18, 212, -11, 22, -16, 37, -115, 73, -68, -74, 16, 4, -1, 0, 173, -46, -265, 12, -96, 88, -130, -164, 29, -174, -79, 63, 72, -21, 66, -62, 62, -5, -47, 182, -114, -32, 19, -84, -9, -61, 67, -28, 23, 162, -23, -46, 36, -114, 136, 123, 45, -2, 158, -62, -16, -94, -108, 55, 17, 43, 28, 73, 73, -5, 40, -32, -11]
4146a1J48j60n9N7m4J87k07J67k08J79j34K6J38k13J54Q3l5j09J19M3L0p8Q5j89
4170c1J5oo3N1j4J09j49Q1nK9J99j42N5k47O9P1L3j31L9j00R0j29J38R2k6J01
4196A29k5k15J44k1M3j95J0Q9N5q0L9j7k3o9R3k5R3M0o4J25j63Q5oq2J48l6j66
4223i4P3q0Q8J4o4L4P9j09J14O8j78J8K74m03o7K28j1j12K11j86O1L8k61K22J17
4248G4j58R9j18m8K14j81J91J2j75J49j55K24k34j07K11m1R8l7m7q4K2l0J45j07
4272h3j47J95P6j41M3J0k6Q2n2K48j81n9l8J62j25j65K18j3l6Jm6J42j74K59r
4297A41j5j18k3j05J19j62J28l8J80k8k02K02j55K07l2l95L29j00r5J54j21K01
4319G2k43J67o2J55m2j98J09J13j34O0K9L5j17o0J63m4L3j46J83j74J17p9M6R0
$$ y = [-11, 137, -23, -82, -25, -69, 118, -89, 78, -130, 49, -85, -59, 79, -134, 20, 103, 68, -41, 78, 121, 151, 73, 158, -31, -16, -22, -85, -34, -48, 61, -88, -7, -12, 17, 216, 74, 129, -118, -49, 22, 55, -76, -37, -137, -47, -176, -38, 54, 28, 129, 104, -111, 33, 12, 55, -140, -130, -41, 14, -66, -27, -44, -67, -136, -43, -68, 25, 65, 1, 126, -37, 48, 42, -40, 108, 72, -94, -21, -101, -13, 1, -63, -29, 50, -59, 55, 123, -55, -37, 237, -166, -233, -5, -16, -128, 83, -103, -42, -4, -265, -43, 74, -84, 15, -103, -151, 63, -118, 73, 85, -90, 59, -96, 128, -106, -213, -2, -43, 55, 18, -29, -113, -91, -121, 24, -83, -230, -35, 41, -100, -57, -47, -73, 9, -43, 205, 24, -35, -73, 89, -36, -201, 17, 4, -32, -31, -77, 65, -109, 150, 141, 126, 8, -15, -120, -1, -163, -35, -73, 107, 79, -123, 79, -76, 131, 99, -296, 33, -67, -162, -8, -129, 72, -171, -4, -66, 89, 47, -151, -42, 71, -63, -3, 26, 61, -56, -116, 47, 3, 36, -110, 73, -101, 16, -63, -17, 73]
4343G3m1r6J37j65M6K9RJ10k41J65p8l5K06l7j78N5R0j8o3q3J43k6M8K7j88J04
4369gk1LL6j38Q4J9N5M8p1q4J55j32j6N0J95k70RJ01J41j47j62K02o5O5p5P4R
4396E8k82Q0R9M2K17j49j60J64%p1M2j24J54j38j4J30l4q4MP8J4j23p5K28j02
4421d6J53j10j06J46q7n8J94j23n4J91k6q6j48Q2J26j45k7KQ5J14K6j19J01q3
4445Bq4P0q2J19n8P2k53M2J7J66m6k18K49n4R9j58J1J28O3Lk95M19r0j22k12K58
4471D6R3m2r0Rj07O5O7j73J55O3k3q9L0J0n4m2J14k52K08k9R3%J0mj24J03j52
4498a15Q5J75j27j1Lll5k7J42j0j9K8L5k36L11j95L2L9j74J45L2kn1L3j4q9Q8
$$ y = [73, 32, -64, 73, -92, -46, -17, -8, 102, -139, 26, -52, -87, 119, 82, -96, -41, 49, 31, -32, -115, 28, 2, 50, 77, -111, -7, -28, -25, 11, -127, -43, -24, 31, 79, 8, -76, 79, -53, -69, -19, 176, -94, -85, 16, 157, 10, -152, 50, -15, 50, -25, 49, 58, -224, -144, -45, -3, 214, 65, -95, 69, 69, -2, 40, -84, 70, -68, -82, 48, 14, -70, -66, 12, 26, -97, -172, 56, -46, 107, -3, -109, 37, -50, -108, 86, -37, -91, 100, 74, -12, -160, -78, 48, -97, -124, -122, -37, 77, 103, -16, 85, 2, -82, -12, -94, 25, -33, 39, -214, -172, -155, 11, -35, -253, -4, -58, 41, -117, -106, 22, 85, 88, -207, 212, 122, 0, -212, 46, 139, 97, 7, 16, -91, -26, 41, -132, 23, 86, 63, -26, 4, 14, -40, -82, 32, -220, -12, -41, 52, 52, 62, 58, -66, 37, -115, -30, 145, 18, 7, 10, 7, -28, -55, 87, 77, 58, 86, 121, -115, 196, 1, 33, 72, -102, 43, 75, 73, 22, 55, 41, -48, 40]
$$ [...]
8191f0
##END NTUPLES=NMR FID
##END=
