##TITLE=1H_Pr 37-A-2
 CDCl3
 8 sc, 
 21.2.2023
##JCAMPDX= 6.0         $$ Bruker NMR JCAMP-DX V2.0
##DATA TYPE= NMR FID
##DATA CLASS= NTUPLES
##ORIGIN= UXNMR, Bruker Analytische Messtechnik GmbH
##OWNER= root
$$ XWIN-NMR		Version 3.5
$$ Tue Feb 21 18:52:13 2023 Russian Standard Time (UT+4h)  she@DPX200
##.OBSERVE FREQUENCY= 200.13135
##.OBSERVE NUCLEUS= ^1H
##.DELAY= (6, 6)
##.ACQUISITION MODE= SIMULTANEOUS
##.ACQUISITION SCHEME= undefined
##.AVERAGES= 8
##.DIGITISER RES= 18
##SPECTROMETER/DATA SYSTEM= spect
##.PULSE SEQUENCE= zg30
##.SOLVENT NAME= DMSO
##.SHIFT REFERENCE= (INTERNAL, DMSO, 0, 15.7039)
##AUDIT TRAIL= $$ (NUMBER, WHEN, WHO, WHERE, WHAT)
$$ ##TITLE= Audit trail, XWIN-NMR		Version 3.5
$$ ##JCAMPDX= 5.01
$$ ##ORIGIN= Bruker BioSpin GmbH
$$ ##OWNER= she
$$ F:/spectra/data/she/nmr/H-F/1/audita.txt
$$ ##AUDIT TRAIL=  $$ (NUMBER, WHEN, WHO, WHERE, WHAT)
(   1,<2023-02-21 18:50:55.42 +0400>,<she>,<DPX200>,
      <created by zg, POWCHK disabled, PULCHK disabled
       configuration hash MD5:
       00 E9 B6 7A A2 85 ED C7 34 08 36 98 17 FE 4E 26
       data hash MD5: 16K
       CB C9 DC F3 77 C2 6C FF 88 E4 54 6E 9E C1 D0 5D>)
$$ ##END=
$$ 
$$ hash MD5
$$ 9E A2 5A A1 58 11 E5 42 53 F8 2D 65 EB 77 85 C2
##$RELAX= 
##$RELAX= 
##$RELAX= 
##$RELAX= 
##$RELAX= 
##$RELAX= 
$$ Bruker specific parameters
$$ --------------------------
##$DU= <F:/spectra>
##$EXPNO= 1
##$NAME= <H-F>
##$PROCNO= 1
##$TYPE= <nmr>
##$USER= <she>
##$AMP= (0..31)
100 100 100 100 100 100 100 100 100 100 100 100 100 100 100 100 100 100 
100 100 100 100 100 100 100 100 100 100 100 100 100 100 
##$AQSEQ= 0
##$AQ_mod= 1
##$AUNM= <au_zg>
##$AUTOPOS= <>
##$BF1= 200.13
##$BF2= 200.13
##$BF3= 200.13
##$BF4= 200.13
##$BF5= 200.13
##$BF6= 200.13
##$BF7= 200.13
##$BF8= 200.13
##$BYTORDA= 1
##$CFDGTYP= 0
##$CFRGTYP= 5
##$CHEMSTR= <none>
##$CNST= (0..31)
1 1 145 1 1 1 1 1 1 1 1 1 1 1 1 1 1 1 1 1 1 1 1 1 1 1 1 1 1 1 1 1 
##$CPDPRG= <>
##$CPDPRG1= <>
##$CPDPRG2= <>
##$CPDPRG3= <>
##$CPDPRG4= <mlev>
##$CPDPRG5= <mlev>
##$CPDPRG6= <mlev>
##$CPDPRG7= <mlev>
##$CPDPRG8= <mlev>
##$CPDPRGB= <>
##$CPDPRGT= <>
##$D= (0..31)
0 1.2 0 0 0 0 0 0 0 0.06 0 0.03 0 0 0 0 0.0002 0 0 0 0 0 0 0 0 0 0 0 0 
0 0 0 
##$DATE= 1676991054
##$DBL= (0..7)
120 120 120 120 120 120 120 120 
##$DBP= (0..7)
150 150 150 150 150 150 150 150 
##$DBP07= 0
##$DBPNAM0= <>
##$DBPNAM1= <>
##$DBPNAM2= <>
##$DBPNAM3= <>
##$DBPNAM4= <>
##$DBPNAM5= <>
##$DBPNAM6= <>
##$DBPNAM7= <>
##$DBPOAL= (0..7)
0.5 0.5 0.5 0.5 0.5 0.5 0.5 0.5 
##$DBPOFFS= (0..7)
0 0 0 0 0 0 0 0 
##$DE= 6
##$DECBNUC= <off>
##$DECIM= 32
##$DECNUC= <off>
##$DECSTAT= 4
##$DIGMOD= 1
##$DIGTYP= 9
##$DL= (0..7)
0 120 120 120 120 120 120 120 
##$DP= (0..7)
150 150 150 150 150 150 150 150 
##$DP07= 0
##$DPNAME0= <>
##$DPNAME1= <>
##$DPNAME2= <>
##$DPNAME3= <>
##$DPNAME4= <>
##$DPNAME5= <>
##$DPNAME6= <>
##$DPNAME7= <>
##$DPOAL= (0..7)
0.5 0.5 0.5 0.5 0.5 0.5 0.5 0.5 
##$DPOFFS= (0..7)
0 0 0 0 0 0 0 0 
##$DQDMODE= 0
##$DR= 18
##$DS= 0
##$DSLIST= <SSSSSSSSSSSSSSS>
$$ [...]
##$SUBNAM2= <"">
##$SUBNAM3= <"">
##$SUBNAM4= <"">
##$SUBNAM5= <"">
##$SUBNAM6= <"">
##$SUBNAM7= <"">
##$SUBNAM8= <"">
##$SUBNAM9= <"">
##$SW= 18.05172834244
##$SWIBOX= (0..15)
0 0 2 0 0 0 0 0 0 0 0 0 0 0 0 0 
##$SW_h= 3612.71676300578
##$TD= 16384
##$TD0= 1
##$TE= 0
##$TE2= 300
##$TE3= 300
##$TEG= 300
##$TL= (0..7)
0 120 120 120 120 120 120 120 
##$TP= (0..7)
150 150 150 150 150 150 150 150 
##$TP07= 0
##$TPNAME0= <>
##$TPNAME1= <>
##$TPNAME2= <>
##$TPNAME3= <>
##$TPNAME4= <>
##$TPNAME5= <>
##$TPNAME6= <>
##$TPNAME7= <>
##$TPOAL= (0..7)
0.5 0.5 0.5 0.5 0.5 0.5 0.5 0.5 
##$TPOFFS= (0..7)
0 0 0 0 0 0 0 0 
##$TUNHIN= 0
##$TUNHOUT= 0
##$TUNXOUT= 0
##$USERA1= <user>
##$USERA2= <user>
##$USERA3= <user>
##$USERA4= <user>
##$USERA5= <user>
##$V9= 5
##$VALIST= <valist>
##$VCLIST= <CCCCCCCCCCCCCCC>
##$VD= 0
##$VDLIST= <DDDDDDDDDDDDDDD>
##$VPLIST= <PPPPPPPPPPPPPPP>
##$VTLIST= <TTTTTTTTTTTTTTT>
##$WBST= 1024
##$WBSW= 4
##$XGAIN= (0..3)
0 0 0 0 
##$XL= 0
##$YL= 0
##$YMAX_a= 683708
##$YMIN_a= -774150
##$ZGOPTNS= <>
##$ZL1= 120
##$ZL2= 120
##$ZL3= 120
##$ZL4= 120
##$ABSF1= 10
##$ABSF2= 0
##$ABSG= 5
##$ABSL= 3
##$ALPHA= 0
##$AQORDER= 0
##$ASSFAC= 0
##$ASSFACI= 0
##$ASSFACX= 0
##$ASSWID= 0
##$AUNMP= <proc_1d>
##$AZFE= 0.1
##$AZFW= 0.1
##$BCFW= 1
##$BC_mod= 2
##$BYTORDP= 1
##$COROFFS= 0
##$CY= 11.3945322036743
##$DATMOD= 1
##$DC= 2
##$DFILT= <>
##$DTYPP= 0
##$F1P= 2.36226072786647
##$F2P= -0.459571619588291
##$FCOR= 0.5
##$FTSIZE= 0
##$FT_mod= 4
##$GAMMA= 1
##$GB= 0.15
##$INTBC= 1
##$INTSCL= 1
##$ISEN= 128
##$LB= 0.24
##$LEV0= 0
##$LPBIN= 0
##$MAXI= 10000
##$MC2= 0
##$MEAN= 0
##$ME_mod= 0
##$MI= 1.114404
##$NCOEF= 0
##$NC_proc= 0
##$NLEV= 6
##$NOISF1= 3.799351
##$NOISF2= 2.8
##$NSP= 1
##$NTH_PI= 0
##$NZP= 0
##$OFFSET= 15.70392
##$PC= 1
##$PHC0= -19108.63
##$PHC1= 10.60074
##$PH_mod= 1
##$PKNL= yes
##$PPARMOD= 0
##$PSCAL= 0
##$PSIGN= 0
##$REVERSE= no
##$SF= 200.130013532006
##$SI= 16384
##$SIGF1= 3
##$SIGF2= 2
##$SINO= 400
##$SIOLD= 16384
##$SREGLST= <1H.CDCl3>
##$SSB= 0
##$STSI= 0
##$STSR= 0
##$SW_p= 3612.71676300578
##$SYMM= 0
##$S_DEV= 0
##$TDeff= 0
##$TDoff= 0
##$TI= <>
##$TILT= no
##$TM1= 0
##$TM2= 0
##$TOPLEV= 0
##$USERP1= <user>
##$USERP2= <user>
##$USERP3= <user>
##$USERP4= <user>
##$USERP5= <user>
##$WDW= 1
##$XDIM= 8192
##$YMAX_p= 0
##$YMIN_p= 0
$$ End of Bruker specific parameters
$$ ---------------------------------
##NTUPLES= NMR FID
##VAR_NAME=  TIME,          FID/REAL,        FID/IMAG
##SYMBOL=    X,             R,               I
##VAR_TYPE=  INDEPENDENT,   DEPENDENT,       DEPENDENT
##VAR_FORM=  AFFN,          ASDF,            ASDF
##VAR_DIM=   8192,          8192,            8192
##UNITS=     SECONDS,       ARBITRARY UNITS, ARBITRARY UNITS
##FACTOR=    0.0002768,     1,               1
##FIRST=     0,             0,               0
##LAST=      2.2672688,     0,               0
##MIN=       0,             -774150,         0
##MAX=       2.2672688,     683708,          0
$$ Real data points
##PAGE= N=1
##DATA TABLE= (X++(R..R)), XYDATA
0@%%%%%%%Qj6J6j6K4l2L2m0N6p2Q8j09J33j60J92k26K67l19L75m34N04n84O73
30C60p69Q76r98J131j280J446j625J822k041K281k543K828l138L477l848M255
46B234m700N185n716O299o938P643q424R289j0255J1343j2572J3975j5597J7495
60I261j9752K2485k5874L0218l6012M4161n6560P7921j24618M04172l41712o93382
72g09692Q83165M69122n80752m84870M53264K68677k40380j93441Q2778k9311
82h1440P5349J55427j55527l53926J81001M27319j30957m48915J13486L84380
92A66197o3378k74549Q1947J67112l6650j1164N5042j27697m5167K69049R5227
103B75969l41633j27235L39698J29400l07387j14250K20175N1508j62852k9516
$$ y = [0, 0, 0, 0, 0, 0, 0, 0, 8, -8, 8, -8, 16, -16, 16, -24, 32, -40, 48, -61, 72, -88, 104, -122, 145, -174, 201, -233, 271, -313, 360, -409, 467, -531, 600, -680, 766, -859, 963, -1078, 1203, -1340, 1488, -1650, 1827, -2021, 2234, -2466, 2719, -2997, 3302, -3636, 4007, -4417, 4872, -5383, 5960, -6612, 7363, -8234, 9261, -10491, 11994, -13880, 16338, -19674, 24487, -32073, 45848, -78770, 325402, -16310, -709692, 173473, 642595, 61843, -423027, 30237, 298914, 58534, -134907, -52129, -81440, -6091, 149336, -6191, -360117, -179116, 248203, 117246, -331669, -218183, 166197, 102819, -171730, -89783, 77329, 40679, 29515, 84557, -43140, -88307, 180742, 275969, -65664, -192899, 146799, 276199, -31188, -145438, 74737, 126245, -36607, -66123]
113f6123M7178l1204L7457O7529j42265j32562J99267J68746k30171j56509K65384
124B6727J24390k83999m1047L40794o599l46555R4369L68064j52039l50112K25836
135a71L48396k61090l37789K51587K91824k29099k40895J66241J39249j40065
145a1812p5433P7240j3682l9350P2916k0121j46642N6653K04424o8181k23265
156a87253Q7982K29811q5200j82733J20545J59613j17610r9368J29670N6528j09199
167B786P421R7250o1623r0765Q6169O3929j08554n1911R1322N20j02259J4323
179e1392P8365m7007o5335N2865K3000o8494K2973Q8309n8684q7577J10048R7917
191I4988j35258p2319J91173P7826k08967o2414K29761O7027k12655n5984J82253
$$ y = [-66123, -18945, -50149, -12692, 54837, -87428, -219990, -20723, 148023, -82148, -238657, 26727, 151117, -132882, -173929, 166865, 160266, -186289, -91920, 276144, 124105, -226007, -171, 348225, 87135, -250654, 933, 292757, 63658, -177237, -10996, 128253, -11812, -87245, -10005, -23687, -63037, 9879, -10242, -156884, -100231, 104193, 36012, -187253, -99271, 130540, 45340, -137393, -16848, 142765, 25155, -74213, 55457, 111985, 2786, 10207, 107457, 45834, -44931, 41238, 105167, -3387, -55298, 36024, 36544, -65715, -51392, 26973, -20034, -85369, -32504, -9504, -77998, -55025, 33284, -25400, -112977, -2929, 94988, -40270, -112589, 78584, 156410, -52557, -114971, 114790, 181817, -30838, -86822, 95431]
202I5431L8889j50212l6110R3401J5387n3998k0985j9117r605N8462K1863j05133
214g1727n1920J21448O1990j29584n9034J36582O0926j18356l5610J11489K7134
225E3338o7709J8023N0365m3620j8750Q1765R374r6037q50R6797j1738r9151N510
238b2683P4426j5907o5069l226K0004p292N561L587m5747j7861O7864K5330q1733
251f2746k1600J00846K9009r5440j3565J04624J9771p7468L806O6721j0952l9514
263C492L2016K5302m2244j3632M0758o516m8044O621L2999k4202l9339J2396J6113
276d280k2448p662J7203j6688k3281L3025K8305m1635k1331O2130K7432n9712
288b8942j2171P6251K0588o0425p035N7026P998l7468J911K3213r512j3127N002
$$ y = [95431, 134320, -15892, -52002, 41399, 56786, 2788, -18197, -37314, -46919, 11543, 33406, -71727, -123647, -2199, 59791, -69793, -128827, 7755, 68681, -49675, -85285, 26204, 53338, -14371, 3652, 54017, 10397, -8353, 73412, 82786, -13251, -14101, 82696, 70958, -28193, -22683, 51743, 35836, -29233, -32459, -12455, -19747, -14186, -10599, -56346, -74207, -6343, 18987, -62746, -84346, 16500, 45509, -49931, -63496, 41128, 60899, -16569, -12763, 53958, 43006, 3492, 35508, 60810, 18566, 4934, 45692, 39176, -8868, -2247, 30752, 6550, -32789, -20393, -4280, -26728, -34390, -17187, -33875, -57156, -24131, 4174, -37461, -58792, 3338, 30770, -28942, -41113, 35138, 55726, -4699, -11734, 45292, 53290, 15822, 17733, 40946, 31434, 18307, 23309]
301B3309q048j5528J0305O271l1991k0784K6158J1928l6016j5954L0975O752l1052
314d3675K286L3774l326k1388K0510K3881j7559m610L5239R619k9005K542L3629
327D1917j905k4669N790J6576j1976j5579M380P08j2992l599J410j4518j2589
340b7046J0560N604k0265j0010J9248O546j9830J103K6185K250j6971J0711K3252
353A1337k867p544J6338J1164j0328j28J3595j006r563L162L461j0832q708M575
367A2656n75j3513r175K043j986r467l802J786l624k768N830k8p054Q219J8739
382b719l096j4175J2236K5863M52j5441M335J9176P206r510r945L983J4209J391
396C3965k1610j5682J3231J4908j6764k9495M9K1701n82k8225j1590J9651J2508
$$ y = [23309, 15261, -267, 10038, 16309, -15682, -36466, -10308, 1620, -34396, -50350, -19375, -12623, -43675, -41389, -7615, -10941, -32329, -11819, 12062, -5497, -10107, 25132, 34751, 5746, 8288, 41917, 40012, 15343, 21133, 37709, 25733, 10154, 14534, 15242, 2250, -1349, 61, -14457, -27046, -16486, -10882, -31147, -41157, -21909, -15363, -35193, -34090, -7905, -5655, -22626, -11915, 11337, 8470, 926, 17264, 28428, 18100, 17972, 31567, 30561, 20998, 24160, 27621, 16789, 8081, 12656, 12081, -1432, -10607, -8564, -10550, -20017, -23819, -22033, -25657, -28425, -22595, -22623, -29677, -21458, -2719, -5815, -19990, -7754, 18109, 18561, 3120, 7455, 26631, 33837, 24327, 14382, 18365, 32574, 33965, 12355, -3327, 9904, 24812, 8048, -21447, -21398, 303, -279, -28504, -40094, -20443, -7935]
409g935j4833j3198R004J4950N632j869m813K382J8474J4172r528j0682J2492
422A4248K0152l035j6934k014J4572N419j5196j3634L658N151p384r064n079o332
436a5472k740O301o64j5668p150J5470J3201j2021j5108J1758K6006L250j8682
449a1519k908K3660J7645o585j2667N06J3711J5968l482k7449j1232L1241K1342
462D8231l8312m3659K3819M8947j9958o5588m703O0567J5563n9192l2397M4967
474b1715L9666k6604l6080J2483L4437J1576j2853j6773L203L1041K4444k2946
486A9879l5093J8914M9942l306n5510j3020N1760K1245n0437l7365L2812L2448
498C2269k8404l7334R282K1426n928j4070j711L36M77J0551O794j2413p735K1075
$$ y = [-7935, -22768, -35966, -26962, -12012, -6380, -8249, -13062, -10680, 7794, 21966, 12438, 1756, 14248, 34400, 31365, 14431, 12417, 26989, 32408, 17212, 3578, 7236, 12387, 5003, -4061, -9140, -15472, -18212, -11911, -12575, -28243, -35393, -19923, -6722, -18743, -33851, -22093, 3913, 7163, -11519, -14427, 9233, 26878, 20293, 7626, 8132, 21843, 37811, 34329, 6880, -4352, 26889, 48231, 9919, -33740, -9921, 39026, 19068, -46520, -51223, 9344, 24907, -34285, -66682, -21715, 17951, -8653, -44733, -32250, 2187, 13763, 910, -15863, -12660, 18381, 42825, 19879, -15214, 3700, 53642, 50336, -5174, -18194, 33566, 54811, 4374, -32991, -179, 32269, 3865, -33469, -24187, -2761, -8689, -22759, -24470, -24134, -23657, -13106, -6312, -18725, -26460, -5385]
512e385K1869j2960j9376J8264K9513r836k1404J4372J9289j4890j2253J9608
524B6811M373l2628p534L6578J990n3125j5452N2041J7190o1486l2607N4532L7484
537B8167m8536m1653L7077M1743j8593k8223J0416K0370P388N441o237j6982J2862
550C240L9820j810m9309p187N6570K0454n8741l6901M7152M0256m1972n0809K0081
563a9156M0721j2567l8266n502K0895J0398q595j3995m674J3374J8854j276j9885
576a9674k737K8454K0712j9938k3079K2668L5092j2894l4950J1074L5763r121
588C1370l5551N547K8243j2400l2479Q571K5417j9127l2819J4803K9288k0677
600i814l3516J7765L2109j5021k6883J4557K3626m417q183P455L060Q98J5045
$$ y = [-5385, 16484, 3524, -15852, 2412, 31925, 22089, 685, 15057, 34346, 19456, 7203, 26811, 31184, -1444, -8978, 27600, 29590, -23535, -38987, 13054, 30244, -31242, -63849, -9317, 28167, -20369, -62022, -24945, 16798, -1795, -30018, -19602, 768, 8156, 13597, 7360, -9622, 3240, 43060, 41250, -8059, -15246, 41324, 61778, 3037, -33864, 13288, 53544, 11572, -39237, -19156, 21565, 8998, -29268, -34770, -13875, -3477, -12072, -26067, -30741, -17367, 1487, 211, -19674, -22411, 6043, 26755, 6817, -16262, 6406, 41498, 28604, -6346, 4728, 40491, 31370, -4181, 1366, 29609, 17209, -15270, -6699, 18718, -409, -33228, -18425, 10863, -9814, -43330, -25565, 6544, -8477, -35360, -20803, 2823, -1594, -9777, -2322, 738, 1636, 16681]
613A6681O388j9475o190L0067J5155l2259k2132K8896K5774k7588l3970J2944
625e709K7217r334k8911o930J4005R227p507j6850o787J6392J6969j1690k0672
638c0580Q443K8397N937k0637q754K1305K3023p179k3106K950K8440P880k6204
651I915j4609K1429J6220j9605k2625R038J5149j1098j7852K602P142p975n497
664a7766N202j864q214O310J0438n941p748J0979J2077m315l609Q468O059p98
678I278K904L653k881q87P734J018j0723l994Q319J008j3486p179O880N30j0858
693h684m618K650j702l867J919O56m963K522Q536k21n029M895J0104J568k369
708A397K099O371M043N65j730j065M380L770n386p962J648O607n992j2983m49
$$ y = [16681, 23069, 3594, -2596, 27471, 42626, 10367, -11765, 17131, 42905, 15317, -18653, -5709, 21508, 12174, -16737, -23667, -9662, -435, -7942, -24792, -31579, -15187, 1782, -9908, -30580, -22137, 6260, 12197, -8440, -17194, 4111, 27134, 19955, -3151, -201, 28239, 36119, 9915, -4694, 16735, 32955, 13350, -9275, -237, 14912, 3814, -14038, -11436, -4294, -12269, -17766, -12564, -14428, -22642, -16332, -5894, -11835, -19583, -8604, 3473, -842, -4451, 4017, 10076, 9278, 12182, 15835, 12954, 12067, 19801, 20819, 10096, 6102, 14421, 15429, 1943, -5236, 1644, 2174, -8684, -13302, -10652, -12354, -16221, -14302, -13646, -18609, -16087, -7551, -7772, -12801, -7906, 2198, 3766, 1397, 3496, 9867, 13910, 14475, 12745, 11680, 16060, 19830, 14444, 6482, 8130, 14737, 8745, -4238, -4687]
723d687P739m382j3276p35P642k496q119M95N963R9j414K405K400L023M720J711
739A088p00M008O901N43k978L013N006j187l960M89J870l844m519O89j551o677
755a809k945K567k976q613r29N489j836o479Q70O094J158j543R24L811M894L043
771A720o3L02N184O029m07l772K063N421n10n423j881K252p00n154l483j564k076
788b062j901j466m544l909K171L100m907m727N301N865j823l026M868O060K217
803A217q7J203L435N033J832k466p04M024L015m146n577J177M640m928q839n78
819a749M080l381q405j329K914j612l709o75P89J495K171O0j242L829O645M54
835C35k263L890P007R25k656J671M851J74k751m72O88k252j852J9l612n098k68
$$ y = [-4687, 3052, -1330, -14606, -15341, -7699, -10195, -18314, -17819, -11856, -11757, -13171, -10766, -8366, -5343, -623, 1088, 388, 4396, 11297, 11840, 8862, 11875, 16881, 15694, 11734, 12223, 14093, 10249, 5730, 6419, 4868, -1809, -4754, -2187, -5163, -13776, -14705, -9216, -11052, -17531, -16661, -10567, -9409, -10952, -10028, -6217, -1323, 1720, 1657, 1959, 7143, 13172, 12765, 8993, 11056, 16477, 15967, 10544, 8663, 10915, 10215, 5061, 1578, 14, -2062, -3963, -5429, -9973, -13882, -11711, -8611, -13518, -18245, -12944, -7079, -8902, -11928, -7060, -1000, 1217, 1130, 2333, 5768, 10801, 12633, 10167, 9463, 13487, 16502, 12356, 6779, 7956, 12596, 7668, -1171, -1749, 2331, -1050, -9455, -10784, -7870, -9482, -13191, -13866, -13077, -11582, -9411, -9351, -10593, -6764, -119, 335, -1928, 1962, 8969, 9894, 7238, 8909, 13760, 13934, 11183, 10711, 11399, 9147, 7295, 7314, 3702, -1396, -1664]
852a664J694n243o212J599K592m111l358K335J962l08J559J664L83K624N246K060
868B822j858K214O535J864l140L99L658Q23k162j146j106k796K45O99o160o885
884e994K782M283p461q706L767O260m701n880L036M367P5M69J453J11L568O562
900C991R62m482K435R695J763p345j329Q160J783p022l450K695j85l692k286k929
916a236l249O97J065o186m242L598K126m310j093M184J71j239N210L608m066R61
932d001J0547L411q808K17J2480K444r978j138Q547j96p836Q25J773o497k906
947a116O770m114j4052J700J3566n580j7654L438J6751k598j4931K667J3393J067
961f93o228J778N131K021L149L136l286k255Q307O131p724p688O620P534o307
$$ y = [-1664, 30, -5213, -11425, -9826, -7234, -11345, -14703, -12368, -10406, -10714, -9155, -7491, -7108, -4484, 762, 2822, 964, 3178, 9713, 11577, 8437, 8836, 12494, 13317, 11155, 10009, 8903, 6107, 6352, 7051, 891, -5994, -3212, 1071, -6390, -15096, -11329, -5069, -9770, -15650, -12614, -8247, -8172, -7703, -6250, -6139, -2571, 3991, 4953, 471, 2906, 12601, 14364, 7019, 5690, 13850, 15633, 8611, 5161, 7856, 7671, 3979, 1693, -1236, -4485, -3788, -2723, -8909, -13151, -9553, -7427, -11737, -12830, -8646, -8475, -9714, -4504, -896, -4962, -4001, 6546, 9957, 1149, 1366, 13846, 16290, 6312, 5174, 13721, 13525, 5689, 6514, 8287, 1790, -1116, 5654, 1540, -12512, -10812, 2754, -2826, -20480, -17042, -291, -2889, -17820, -15153, -1760, -693, -6921, -5143, -12, 2009, 5158, 8294, 5008, 2753, 11060, 17191, 9467, 1779, 8399, 15933, 9626]
976I626r388j36N309m78o458p146P43O221j350j0448k045R956J707r751N77J0592
992b469p00o293O390R381o707m184J3558O735j2976m071J6931L931j6497k363
1006F66J5108j838j5698K784J0076j0594j0983J1339M979j8371o586J9363L194
1019C439k2141l146K1905L116j7873r31J6842L045q859J848P587p11R4O609j509
1034I315p044N118J0361n926j2351L796J0411m240j1647k302N488K005n335q337
1048a0688j313Q512K986j1575o227J2112Q024j0658n915J2164O966q188m19J0546
1062F327o66n898P392P985r739n907J4023N290j7381m651J6744Q60k0027p71J5333
1077H914n324j7391O022J1695j1232j0946J2323P131j3768m332J5695L085j2857
$$ y = [9626, 238, 102, 5411, 4933, -1525, -8671, -7928, -1707, -3057, -13505, -15550, -5594, -3887, -13638, -13061, -2469, -3169, -9462, -3072, 6309, -398, -4582, 8976, 15711, 2735, -1336, 15595, 19526, 3029, 666, 15774, 13936, -1762, 1022, 11098, 504, -10479, 860, 5839, -12532, -19118, 245, 3439, -18702, -21848, 57, 3173, -14700, -15631, 1211, 4256, -4603, -2755, 4832, 4121, 4215, 10824, 9315, 2271, 7389, 17750, 11824, -527, 3269, 13680, 9440, -2207, -4509, 979, 2984, -2351, -10688, -12001, -3489, -503, -12078, -18305, -6193, 1831, -8827, -14742, -2578, 4388, -3800, -4219, 6327, 5661, -237, 7155, 15140, 5401, -506, 13517, 18807, 1426, -3225, 13519, 14379, -5648, -6419, 8914, 3590, -13801, -7779, 3916, -7316, -18262, -5939, 1192, -12576, -16908, -1213, 1872, -10985]
1090a0985K145J4073j291q579O680Q921n909l913J0225K184j0311M76R993l139
1104A0570j0662K126O717n569p201J995Q36m282J15O27n604o51P575j276q880
1119a3564L259J1380k460q914O433J0266m141n469Q001N311o115p3Q317k021q289
1134A921N149P319r772p841R351L747j3587m161J0620q02j3369J060J0095n437
1148e707q620O669O644p607k675J0490K125q448L280J1388k845p972P916Q809
1162A3447p262n688R139L983r580k074Q149k396q999K276M345p158m715N467J85
1177h81r010L93P482l589p451N441O656n349l599Q276L850n672O38Q805l63n766
1193a39M560O814m819m189O866K433q122j200O200k620p548J929M114p109m834
$$ y = [-10985, -8840, 5233, 3942, -4637, 2043, 10964, 5055, 1142, 11367, 13551, 3240, 3716, 13709, 10570, -92, 2034, 8751, 3182, -4019, -2024, -1188, -5470, -5355, -4728, -10332, -10983, -3408, -4684, -13564, -10305, 1075, -1385, -10299, -3866, 6400, 2259, -3210, 4791, 10102, 3987, 3914, 12231, 10210, 1921, 7070, 14389, 4617, -3224, 6127, 9874, -3713, -7874, 2746, 1944, -11425, -10365, -270, -5707, -14327, -7658, -1014, -8621, -11296, -806, 1319, -7129, -3849, 7539, 4694, -3278, 4638, 13447, 6185, 497, 9636, 13619, 4039, 1965, 10114, 7718, -1281, 995, 5340, -1818, -6533, -1066, -881, -9891, -9498, -2016, -5605, -13056, -7615, -959, -6308, -9907, -1631, 2219, -3453, -2815, 5990, 5627, -139, 4421, 11235, 6416, 2227, 9093, 11526, 3404, 2204, 8404, 5784, -1764, 165, 4279, -2830, -7664]
1208g664O082J03q551J43P456k471p108M434P328m105m106P453M348n401M74Q087
1224F502K28n960L804P129m606n262N662L521p231l177N969j111p790O37L837
1239B152m639n505M153J849o732j338O534m78n772K318O695j789l565M869M919
1254C671l355n66O251J046m439J579O001k905m768L937K670n469l378L864n91
1269C548n865k39K877l679m400L549J632n731j260N817L53n134J666O611p85l842
1285d882M450M745k258j274M678J930l768Q95M559k274l916K833K113n281k988
1300d38L654n21n869j045L666k641m421J790K558l337k030M087J606l633J196
1315e378N159Q5k945L060N149j809k169M059K958l428j202L597k1m025K11K239
$$ y = [-7664, -1582, -1479, -10030, -9887, -2431, -4902, -12010, -7576, -248, -4353, -8459, -1006, 3342, -2059, -1585, 6502, 6730, 770, 4574, 11703, 7097, 1835, 7497, 11018, 3787, 610, 6579, 5468, -2322, -1685, 2152, -2487, -7992, -3839, -1990, -8722, -10060, -3526, -4004, -9776, -7458, -763, -2552, -6117, -1248, 3671, 316, -250, 6001, 7047, 2608, 4187, 10188, 7283, 2515, 6452, 9122, 3653, 275, 4139, 3548, -2317, -2556, 321, -3358, -7758, -4209, -2577, -8308, -9568, -3751, -3398, -8532, -6866, -255, -1040, -4882, -432, 4313, 2055, 781, 5459, 7389, 3621, 4516, 9075, 6801, 2885, 5718, 7831, 2550, -438, 3216, 2695, -3174, -4219, -553, -3194, -7615, -5825, -3267, -6604, -8634, -4547, -2941, -6574, -5378, -219, -134, -3079, -19, 5130, 3321, 1152, 5211, 8169, 4741, 3539, 7136, 7115, 3090, 3301, 5540]
1331E540l195l065J636M83m476j274K029j197l540O34K511j675j818K865J805
1346b737j638L13L602J106j467K165L162q96n78K610J419k612M3K005p95l569
1362B133R81J716l697k764J886J95m730j259K876n31l962M47L308j022k254K038
1378d639K928q24r95L579J746j363O83L856L99k213J147K726j301j941J025P54
1394E567k270j127k55j100j867j38l79k394p51O34m43j362K51J258j82l20J674
1411c204R46K22O56K449M39q59K272K512o62j514J715J828k098j551J152O00l014
1428A889j178J113j502k983K13J019k148k507J271J562j662j734J765K431r66
1443c417o14J822K720J08m03J556J612L60M6J039K09n18K29n7l59j184q36rp67
$$ y = [5540, 2345, -720, 916, 1399, -3077, -4351, -2322, -3519, -7059, -6425, -3914, -5589, -7407, -4542, -2737, -4375, -4062, -460, 646, -821, 1344, 4506, 3610, 3032, 5642, 7061, 4449, 4492, 6497, 5702, 2133, 3114, 4830, 1133, -1631, 255, 450, -4280, -5539, -2663, -3194, -7156, -6709, -3401, -4423, -6677, -4639, -1711, -2535, -3530, 49, 1795, 432, 1115, 4971, 5370, 3157, 4304, 7030, 5729, 3788, 4813, 5567, 3297, 2170, 1915, 815, -1052, -1190, -1569, -3963, -4714, -4080, -4523, -5885, -5634, -4376, -4558, -4878, -3204, -2258, -2036, -1380, 1069, 1508, 649, 2921, 5433, 4771, 3257, 4972, 6800, 4702, 3151, 4303, 4903, 1889, 711, 1824, 322, -2661, -2448, -1429, -3577, -6084, -4813, -3251, -4913, -6647, -4882, -2451, -3417, -4031, -2209, 511, 619, 216, 1772, 3384, 3744, 3790, 4829, 5038, 4520, 4749, 4692, 4333, 3149, 2313, 2304, 1537]
1462A537k154j524O09J33k151j777J261Q66j910p23J465J943j194j75K113J630
1478e1p55M97K824R09j366R93K656l38k322O80K269j450k913K85J641k289k641
1495a371N40N00k060k228J654K88k496r65K493R47k002m61L167J757j955K16L302
1512A326J262j460O41K467O78j411K94J220j06k208L35Q26j813k222L91N73k124
1529a331k521J244J004k322j800J218J769j294r63J280K428p02k03J952J845p38
1545H66j04K326J152j256K69J933j73k041j09J457q29k820J01R06j260k675rJ021
1563a245j588j918P82J060j273j020J753J465j047j55K137J670o53j39K192J053
1579C074o11Q4J349N33q76j5K80k79j180k11P1j339j755m25M01j229j284o4Q72
$$ y = [1537, -617, -2141, -1532, -1399, -3550, -5327, -4066, -3200, -5110, -5833, -4368, -2425, -3619, -3794, -1681, -51, -806, -309, 2515, 3424, 2058, 3051, 5707, 5369, 3047, 3727, 5996, 4546, 1633, 1918, 3559, 1270, -1371, -831, -331, -2391, -4619, -2965, -2677, -5173, -6138, -3645, -2698, -4700, -5161, -1994, -237, -2192, -1976, 1326, 2588, 1128, 1769, 4236, 4914, 3503, 3797, 5017, 4911, 2703, 3038, 3864, 2051, -171, 220, 793, -1331, -3852, -2608, -1604, -3926, -5726, -4508, -2739, -4033, -4996, -3716, -1288, -1990, -2193, -241, 1604, 866, 762, 3088, 4240, 2984, 3253, 5186, 5013, 2972, 2863, 4320, 3491, 671, 772, 1678, 418, -2257, -2266, -1245, -2833, -4751, -3969, -2909, -4182, -5202, -3449, -1984, -3031, -3186, -1049, 621, -32, -171, 2021, 3074, 2463, 2547, 3896, 4429, 3553, 3538, 3818, 3539, 2359, 2148, 2219, 880, -875, -1300, -899, -2128, -3412, -3476, -2604]
1598b604q96r58N38R58J66n79J233J355R6L10J082J343J4J87J038P81q29k85J039
1617C989p8j173o74O35l59k073n79L53q45j478o56O00r03r56N79P25m10l36J035
1636b604Q69M5M90R09J316J33O01P34N95O1J62K75L19n08m39r9m60q20q27j55
1656E97o87j081r17p5k03r09m90L21K63l36L08R23N06N8M12J077Q11Q1N87J424
1676B670K88m40M63R81n50m53l12L39p79o05p36j65q81j054K0m66q56n54j43j83
1696c416q8j05O82M84j30Q13N44J009K42P23N73O69P60l01M51O31m45k53J30L9
1716C012j195k76l11p79q89p57K93p69j104l06M03m03m70N50O31k48M14N55N33
1735a116O65K67R58P87J90M62N63L66l72J54J98k15n36m76m15k80j002l56n68
$$ y = [-2604, -3500, -4458, -3920, -2962, -2796, -3375, -2142, -787, -691, -381, 701, 2044, 2058, 2245, 3283, 4064, 3235, 2950, 3989, 3911, 2738, 2064, 2699, 2340, 267, -312, 41, -804, -2282, -2938, -2338, -3241, -4197, -3618, -2893, -3303, -3639, -2604, -1735, -1690, -1200, -291, 1025, 1158, 1759, 2493, 3088, 3149, 3311, 3586, 3905, 3397, 2958, 2859, 2399, 1579, 752, 597, -90, -1171, -2088, -2163, -2366, -3275, -3765, -3444, -3181, -3517, -3209, -2286, -1780, -1722, -1310, -233, 578, 659, 1246, 2670, 2958, 2518, 2981, 3962, 3412, 2959, 2647, 2986, 2207, 1602, 866, 701, -180, -1234, -1214, -1680, -2536, -3090, -3233, -3416, -3504, -3609, -2927, -2443, -2573, -1760, -1216, -207, 35, 758, 1331, 2000, 2760, 2459, 2910, 3541, 3096, 2843, 2973, 3012, 1817, 1541, 1230, 451, -438, -1195, -902, -1671, -2775, -3081, -2678, -3081, -3551, -3001, -2370, -2618, -2204, -1649, -1116, -451, -184, 774, 1561, 1751, 2213, 2776, 3142, 2770, 2924, 3122, 2907, 2371, 1895, 1480, 1200, 198, -158, -726]
1754g26l00n66p79j8k93l18j16Q5M30n0L72N80O10J95P03Q00P54L65q8J035L12
1775B987j53l77N39k03n65m48J25m50q37o19K9q77q60j86j03n30m70O3K31J8J5
1796b671O98N03J24L15R69M43L40M64O54N20o8K54P3J04Lk63j20o74m07o70n85
1817Fm22m99n77m27J3m46m97q7K71L32k41K66Q17M59m7O98J150n2n3J282N73l86
1839B133j16P27K08o03m60L31k91j269l26L65p21j296l6K89p19j055N18K76l68
1858b413l54L88Q30j51M9Q62O54J73M48P61N35K28j8J67K92J74k60j84K03m58
1878A926q82l64Pn26j058k35J70j043n8k93L29k90n26Q07O31m13j64J135R00n31
1898d78L04J398P72o03K49J252j87j054J88R95o27j108L3L76q16j142O7J02j030
$$ y = [-726, -1026, -1592, -2371, -2389, -2682, -3000, -3116, -3031, -2601, -2651, -2279, -1699, -1089, -894, -191, 609, 1363, 1728, 1640, 2675, 2987, 2834, 2457, 2996, 2793, 2228, 1780, 1905, 1455, 618, -1, 28, -849, -1709, -1895, -1998, -2528, -2998, -2935, -2704, -2686, -2671, -1973, -1470, -1346, -1031, -62, 381, 721, 1185, 1839, 2359, 2291, 2545, 2618, 2722, 2725, 2462, 2342, 1668, 1261, 591, 6, -416, -915, -1492, -1919, -1906, -2352, -2849, -2936, -2665, -2333, -2574, -2308, -1491, -1032, -1079, -381, 769, 717, 664, 1946, 2519, 2133, 2017, 2744, 2952, 2349, 1889, 2220, 1929, 660, 334, 699, -22, -1318, -1354, -1065, -1784, -2839, -2321, -2045, -2413, -2767, -2379, -1549, -1700, -1651, -789, -135, 38, 486, 1247, 1782, 2010, 1992, 2159, 2451, 2625, 2365, 2181, 2384, 1926, 1044, 680, 687, 161, -897, -1132, -962, -2005, -2063, -2356, -2027, -2317, -2843, -2036, -1405, -1818, -1982, -847, 53, -478, -174, 1224, 1996, 1393, 1642, 2894, 2707, 1653, 1841, 2836, 2209, 1101, 1134, 1510, 694, -448, -381, -279, -1309]
1917a309o88K44L46j012j15P56j78j94K53P46L62K18M38O35J08L00L17M79O90
1936B396k07j06J31j88J6m19m48J38o44q23R8n5j232n76N24n2r96k51Q96L23o54
1957b129r7J476Q6o80P19J512j79m54R72J001m89k53P65N18q98p23Q83j56r49
1976I25n91K4j14r33o39N99m92p84K52j22r6k81M37M42K6K15N19L00M69K01M27
1997G84N90K41k2R5J74M17m09k50L12o24m47n26K82k80r50n45M05l82r28J49M52
2018a462l17p51O54P33k74k02J044Q56o32K95J239K95n69N13P47J36p50L0P37
2037B322p77m64K04j11q58o97J01r1q20l03J57M3n88j94L89j32K10K06L92K38
2057g73J35O26L55J48P09L37k62L39L27j43r1M4Q3q75K1N2l45j071K8J71o77o34
$$ y = [-1309, -1997, -1753, -1407, -2419, -2534, -1778, -1956, -2150, -1897, -1151, -789, -571, -133, 502, 610, 910, 1227, 1706, 2396, 2189, 2083, 2214, 2026, 2042, 1623, 1175, 1313, 669, -154, -56, -111, -1343, -1919, -1395, -1447, -2443, -2694, -1798, -1475, -2129, -2226, -750, -664, -1344, -625, 887, 708, 254, 1226, 2227, 1738, 1485, 2250, 2768, 1870, 1147, 2030, 1874, 925, 334, 358, 244, -689, -1328, -729, -1221, -2005, -1753, -1875, -1971, -2252, -1815, -1373, -1347, -1132, -613, -313, 156, 357, 784, 1374, 1615, 1593, 1688, 1862, 2279, 1870, 1620, 1932, 1308, 861, 335, 617, 337, -613, -1158, -753, -1135, -2063, -1914, -1462, -1779, -2530, -1876, -1143, -1417, -1619, -575, 281, -351, -56, 1183, 1478, 909, 1422, 2169, 2305, 1555, 1585, 2322, 1545, 1081, 1285, 1174, 316, -381, -280, -371, -1191, -1494, -1337, -1294, -1882, -2076, -1687, -1819, -1609, -1403, -1011, -773, -638, -12, 343, 491, 1200, 1537, 1275, 1614, 1941, 1798, 1707, 1751, 1834, 959, 980, 1032, 687, -384, -356, -185, -862, -1496]
2079a496j77P47q45k39M49J45o18O38Q10J53k98M73R52q7l24J030N42m69j26M90
2099A750M46o42l21M79l10j139K48K12p67q95J71K8l43p46M11M6n76J78N88P3
2119a109k5L40P59l67K81O59M32j45M03L35j07p2M43k15m29J85K45o87o96K83
2139E13k1j029n37M60k53q08k31R32n00p82P86P41m59l0Q94M56l42P6J035K64
2159A165m43J92J065j72o21M32J25l96n30L58j98r07k35M89p32p34J68J24n26
2178a376m61M59J56m22L59L14q8M35O53j1N1L14R87m90l8N08M56l62m60N53Q7
2199A624j023P0K53j27j392K42O62j023q10O24J65p99m49Q76k3n38K26J133j06
2218d15m85Q12P62m23P2O06N16l31M7L61J09o05K06K66n62n73L76k86p46k61J92
$$ y = [-1496, -1673, -926, -1771, -2010, -1561, -1416, -2034, -1396, -586, -433, -731, -258, 694, 607, 283, 1313, 1855, 1386, 1260, 1750, 2196, 1554, 1233, 1712, 1402, 263, 511, 723, -44, -939, -768, -740, -1083, -1829, -1418, -1372, -1948, -1770, -1182, -1109, -1134, -794, -35, -402, -121, 538, 970, 825, 1228, 1563, 1456, 1384, 1827, 1612, 1183, 1368, 1613, 926, 230, 513, 492, -537, -1074, -614, -867, -1675, -1906, -974, -1474, -2256, -1470, -729, -1188, -1218, -324, 132, -210, -134, 901, 1165, 722, 914, 1979, 1807, 1186, 1618, 1743, 1347, 817, 1175, 977, 70, -165, 324, -408, -1142, -974, -850, -1376, -1837, -1378, -1222, -1644, -1285, -971, -1059, -624, 29, 18, 69, 383, 1370, 880, 842, 1350, 1806, 1444, 984, 1537, 1624, 601, 671, 924, 797, -595, -353, 309, -714, -1524, -900, -735, -1534, -1983, -1107, -1130, -1668, -1442, -309, -415, -900, -88, 674, 251, 323, 929, 1445, 1114, 1161, 1522, 1631, 1026, 1232, 1498, 936, 363, 739, 453, -293, -554, -362]
2239c62j48q69K67J14m70r7L95L44n72L94N61l75K25O07M49k08K80Q56K04p26
2259H69K37P11m81o76N11K59p94l79J76j44p57m61P23o43m25m7N63o89n24Q27
2279a144N75p12K98P51N1k3K88Q30k24j16P84O6k05o9L85k41l82r9J58n60k24
2300A87Q9m20n71k63M76n57k71L9L60n18j39O04L18m43N51N50J61m25Q96N57l50
2321H31l21P93L30m81k08L65n5m89q3J63j91r83K70j01m31n26K89k32k68j14M04
2342a038j19j16L35N14l12K29O27K41k11M23J47K11n2M36J2k50R0j01m7o91O21
2363I49m05m63l63K50l33m78k36J75n6n44K46Q59p76J1K81N11k9k0N18M02k20
2384B79O2P51j56l83M43N15j14o26J9K71m46m26j79K8l80k74K30l34m90N85n90
$$ y = [-362, -510, -1379, -1112, -998, -1468, -1565, -1170, -826, -1398, -1004, -443, -818, -593, 14, 463, 255, 535, 1391, 1595, 869, 1106, 1817, 1336, 660, 1171, 1430, 636, 257, 433, 289, -468, -929, -206, -849, -1274, -1321, -758, -1447, -1971, -1144, -569, -1281, -983, -232, -181, -204, 84, 914, 690, 574, 1358, 1424, 1219, 1150, 1535, 1294, 912, 813, 971, 411, 187, 276, -144, -715, -978, -502, -1059, -1330, -1291, -931, -1449, -1588, -984, -666, -1109, -558, -8, 153, -272, 624, 1181, 831, 510, 1303, 1633, 1152, 944, 1309, 1254, 765, 682, 845, 654, -329, -59, -160, -591, -1117, -828, -1060, -1328, -1442, -1038, -1157, -1273, -938, -424, -736, -507, 120, 361, 150, 573, 720, 931, 879, 1315, 1327, 1077, 1167, 1066, 1019, 328, 949, 544, 81, -282, -32, -365, -843, -1079, -904, -960, -1504, -1258, -399, -1175, -1164, -883, -372, -401, -421, 97, 499, 279, 341, 1092, 936, 553, 996, 1511, 1397, 771, 790, 1061, 615, 189, 10, 38, -342, -616, -386, -720, -1210, -625, -1215]
2405a215q8O1K20K76j4J38J49R6L08L41o4L42K9L31O8R5J67n1k59j34L74m95m02
2428B73j19J06n68p0q0K2n81j1J39J11k51j40M75J4j37L56M86j70P0M42J23J17
2450F07j20O66j96R3k22J30m0n72m8P7k47o8j36j25l63k51K02k41j80K20j85L23
2472f76l52J62L24J92j26L89J42K36K30J13R0L64k82K81L8k06J29n86R7N6l09
2493C06k87j23m5m65l%o6k33p6J75j10J8J9M48L4l2L90k07M97k7L37M40m1l91
2517E58M87j00J41j97j8K3m31q9J8k72k24j31j95l18j29L04k33j40mr7R3K45k
2540g11M09k12L15L63J22K14J44K59OM1kJ36l19Q0j38k03k29Kk17k00n1j24j74
2563d89l9o4k11j51P4J53k8l0M34J16J32J41N2M0L08J08m9L06j98J36Q9J39m95
$$ y = [-1215, -1303, -1242, -1022, -746, -760, -622, -473, -377, -69, 272, 208, 550, 579, 910, 978, 1073, 1240, 1189, 930, 796, 1170, 675, 273, 154, 260, -308, -378, -458, -436, -1017, -1028, -889, -778, -1029, -1169, -694, -680, -817, -461, 25, -145, -75, 367, 490, 607, 487, 1153, 957, 1050, 828, 958, 918, 346, 298, 375, 128, 60, -76, -201, -564, -815, -613, -854, -1034, -814, -999, -676, -1028, -866, -542, -350, -476, -87, 55, 291, 521, 634, 724, 1088, 806, 1087, 1125, 919, 1048, 462, 559, 615, 306, 19, -104, -149, -614, -617, -617, -683, -916, -992, -817, -927, -909, -890, -442, -408, -440, -50, -257, 240, 213, 550, 990, 949, 558, 1045, 945, 1086, 889, 871, 894, 463, 374, 392, 120, -104, -235, -430, -748, -877, -573, -806, -946, -950, -1047, -954, -709, -711, -302, -514, -199, 164, 286, 500, 644, 903, 909, 950, 948, 1084, 765, 845, 707, 504, 275, 277, 60, -140, -191, -315, -489, -528, -592, -803, -954, -880, -727, -755, -785, -351, -235, -103, 38, 90, 130, 438, 546, 497, 803, 605, 741, 830, 969, 474]
2586D74K62j2m47j90J8J52j82m80j11J2j88j26OR9k43N37j49J93r9K38O8K61M4
2609A37J97J71J16j6L27j15j78J03m0k66j29R4j50j78J01k26k77j79j23j62K97
2630d96k88j69L6J66M57k37L9K59j76J76M20J54K51j34J86J20or4J1P5p9k87J96
2653E80q3m09rL9n1o18J24p2Q3l66j35L44o0j71J89J09K06P5K5M39k6j30M19J24
2677F26j65m1M28R6j94j91k9M8j12k95J01j58l61k83K20j06m40J59R8p1l64N34
2699e00R3k07Q7K40L85j18L78j39l5M54k21K01K04j90q5J68j84pk11m7r5k32q4
2722a45j53j19o9k64J27r6N2j15m1N97l73J39M23k19K02JK97J40N8J06K35k6M5
2745H02j90J81l42o8j16L30l08j36l50M7ml58J69k48ql34J94L30m7k41K65K08
$$ y = [474, 736, 724, 277, 87, 105, 257, 75, -405, -516, -504, -692, -818, -812, -713, -956, -419, -568, -375, -474, -236, -168, 93, 137, 334, 505, 621, 605, 932, 817, 639, 742, 702, 436, 307, 401, 251, 73, 174, -52, -329, -508, -631, -793, -496, -784, -953, -917, -751, -294, -531, -492, -233, -409, -233, 187, 341, 592, 458, 644, 764, 758, 664, 675, 750, 671, 384, 580, 497, 88, 79, 118, 67, -551, -427, -499, -416, -782, -917, -573, -633, -804, -615, -506, -300, -225, -200, 239, 213, 83, 502, 626, 461, 420, 848, 944, 750, 559, 530, 578, 466, 171, 272, 114, -247, -530, -310, -416, -856, -697, -599, -670, -1034, -500, -407, -614, -527, -287, 98, -20, 358, 219, 184, 638, 417, 618, 822, 632, 547, 715, 531, 524, 313, 266, 171, -61, -145, -298, -417, -486, -750, -623, -719, -667, -782, -823, -226, -599, -460, -37, -256, -54, -53, 244, 384, 442, 548, 783, 757, 802, 612, 793, 451, 383, 267, 597, 289, 153, -197, -150, -154, -512, -343, -591, -599, -933, -739, -409, -456, -697, -432, -224]
2767b24K44j21J90L15j14j69K32M62k12j49K86j9j95r6M21m59j04l4j58k24j22
2788b50j31o4k18M2N7l7r8MM22k5J25j60K46oK29M3K09J13J97l40L07J32k77j63
2812C57K04J36m14n1M4j36l45j59J37l11J28k50j0PJ6J41L21j77q6K5K50M82l04
2835EL02J48M5k1K39m7m03N02k99P3k65j60J77L9k04m92M96m13j79P5J4m37K71
2858e34Q5j32L5J29r0K23L69j96L23k0O0r5J02M96j87j48L39j25k18J38j46k49
2880A59k44K23j32j10k81k53K39r5j28j12K23K73k92k38L71R5l0K98k6K17k08
2901e1L60N1k18L30m3L15j13j26r6P0j61k36J84j06q2k99n0j15l06J94j79J24
2923e53k4J31k07J48J47Q9J65P4j4Q4J91K16j85K27Kn7k15M22o6L9k77M1j65j68
$$ y = [-224, 20, -101, 89, 404, 290, 121, 353, 815, 603, 454, 740, 721, 526, 430, 851, 392, 288, 254, 96, -128, -250, -381, -445, -663, -621, -564, -601, -699, -695, -273, -298, -173, -333, -87, -93, 136, 179, 388, 501, 698, 358, 665, 797, 520, 357, 561, 697, 283, 232, 276, 140, -205, -364, -227, -538, -410, -660, -670, -663, -647, -506, -185, -362, -448, -423, -173, 309, 5, 307, 455, 500, 479, 718, 671, 268, 770, 471, 544, 279, 119, 296, 335, 131, -361, 135, -278, -457, -382, -368, -805, -534, -449, -581, -546, -417, -507, -284, 85, -111, 212, 192, 252, 157, 259, 755, 568, 420, 759, 634, 416, 554, 408, 159, -85, 138, 6, -104, -385, -638, -399, -494, -622, -734, -511, -238, -530, -768, -397, -302, -332, -34, -60, 157, -51, 309, 360, 142, 472, 429, 744, 631, 505, 409, 479, 318, 82, 266, 160, 78, -221, -271, -386, -692, -498, -677, -553, -577, -446, -653, -505, -358, -269, -104, -30, -44, 40, 231, 447, 262, 489, 491, 434, 219, 641, 575, 614, 337, 378, 213, 45]
2947D5j15r5k42j0j9k6K25m05K4j00L03j32j72M76K71k24M4J43L06j10p2J56K6
2970B97N6K67j50j39j91R5K55j15k80k87J83m27M5J4Q1l56L7Q0kN3J16q5M0m4
2994d57L71M33l04L53m48L49R4J5P3n8o6k02M36m64K80j71k58L8P7j13l43J56
3016b09j65j59K63j73j08K20r1k1J94M0j20M6K65J97k29L17kJ97J27r1j24L76
3038G50r5l81Nk72K15j68j72k8R3j73k60K48o7l77K3M19j53l5O9J73O1O5O0Q1
3062H1J03Q7J4J51j79K11R2l61J07j4pJ7l01k2L2k84J86n9j21j64j57J45M7J54
3086b42l8p7j04J87J25m9J81J19J66J8P6m4O0j3j25J92j28J62k23j3J47l39o3
3109b5K54m88k2N7r5p2j12J34P5k19M5J47J52p7K60k37L11R2L2J84l0q6J47j0
$$ y = [45, -70, -165, -407, -417, -436, -462, -237, -642, -618, -718, -415, -547, -719, -243, 28, -196, -152, -9, 297, 187, 115, 271, 297, 353, 620, 470, 331, 140, 235, 490, 375, 95, -192, -9, -436, -391, -377, -296, -652, -615, -535, -537, -484, -368, -453, -413, -457, -86, 347, 43, 396, -52, 297, 391, 406, 479, 421, 355, 153, 589, 125, 405, 234, -24, 14, 91, -22, -365, -209, -374, -533, -270, -443, -551, -331, -422, -443, -249, -209, -329, -283, -18, 179, -50, 267, 265, 462, 589, 498, 374, 750, 655, 274, 279, 7, 222, 54, -118, -146, -53, -226, -486, -238, -305, -682, -659, -240, -393, -428, -359, -186, -125, -60, 0, 81, 184, 271, 285, 436, 257, 468, 560, 199, 306, 292, 285, 302, 1, -21, 11, -273, -87, -146, -267, -431, -588, -443, -396, -242, -280, -357, -461, -274, -149, -198, -17, 102, 268, 286, 362, 318, 378, 365, 240, 432, 304, 466, 243, 230, 377, 38, -25, 229, -259, -281, -224, -319, -391, -503, -369, -294, -513, -468, -321, -169, -246, 14, -223, 88, 180, 212, 396, 366, 280, 427, 417]
3133D17j25J53n5k5k60K04j33j13l03M80n35p7o6J45j22q3O3J87L5k86M19l39
3155d19M25k97N76o9J08N0j57M9J60l32L20k9M3o6QJ7j89J18k78k2j55j33k3k19
3179e14J33J01l04k5L10k18L27J66N8k03pK92j6j00L38Ok5O5j52J09o0Q2J82l77
3203A68k04J55L9k70j64K8O1o7J62k31j46qN0J35k52P7L02L1J7O0K09m7K04L4
3227C43O4k8K35l54J39m1j03n6K3j77J95j87j78L7j86K36l05O7j04M8L7M4k9j85
3251d65J56m1J70J72J04J03j36k5K59K99j86n5nk7j81R7K13l58j03Q9K8l27j49
3274c68J19O5q0m07K34J24l27K53K32PJ01j46nJ65k9O3J40KL41j60m2J46l78M28
3298D78k48K64l46j05N2Kk47pr9J13j97m3Q2p2o0N9l0N9L20P4q0l4J80k24L68
$$ y = [417, 292, 445, 390, 365, 105, 309, 176, 63, -240, 240, -295, -372, -438, -293, -415, -498, -435, -248, -213, -499, -80, -419, 6, -291, 285, 216, 324, 374, 217, 266, 426, 94, 414, 385, 428, 362, 370, 387, 198, 316, 38, 16, -139, -272, -295, -514, -381, -280, -584, -609, -299, -517, -190, -24, 34, -169, -176, 116, 100, 0, 338, 344, 319, 384, 232, 341, 281, 363, 545, 168, -36, 119, 158, -112, -276, -248, -187, -254, -92, -323, -469, -477, -427, -292, -544, -467, -165, -134, -117, -57, 152, 105, 309, 343, 407, 379, 614, 260, 399, 358, 255, 199, 222, 45, 240, 53, -125, -88, -274, -38, -343, -276, -380, -332, -295, -251, -280, -465, -309, -350, -180, -8, 96, 199, 63, 38, 297, 596, 410, 355, 350, 323, 142, 239, 452, 94, -9, 80, 108, -219, -368, -249, -184, -264, -671, -437, -313, -640, -387, -155, -148, -47, -193, -198, -33, -62, 1, 141, 143, 484, 324, 282, 428, 50, 478, 230, 494, 148, 43, 95, 97, -150, -157, -256, -143, -340, -383, -301, -373, -433, -374, -404, -345, -25, 49, -31, -65, 115, -109, 259]
3323B59p2j49M55j69O7k24L42j78j73K06m88J98k00P8o1j23r2J89p8p9j15J4K46
3346a47n43K82K12J35j04M07j05Kj56L24o6J41K4j21M2J44k2r6l11J22K28l69
3368B3j3j12J34q2k94K27n2k27R3J46k49J58J10P%L6J52k3P7j6J34M3k04O2J85
3393C15K31m30N4J72k4k99J68j62j53n2J56j1k91p2L21k77j22J76P5j63K28rL22
3416A53k82M32j33L24n9k06J61L1j23k81L12J34l23K54l61o5J67j61P0n8j36j76
3438c26P7J15k21p5o5K38J11k69K67J55k54L40R7L7j58J54J53j47oj20N39m22
3460B20np3J14j65j89O5K34k45l59L47k09m24M61q6p8J33j82L89k5o2k17M17J12
3483A73j74J66J76k80R3L05j01j7l7r5J20J73l33J8l3j59j22l18K71J06l14lJ37
$$ y = [259, 187, 38, 493, 324, 391, 167, 509, 331, 158, 364, -124, 74, -126, -48, -109, -232, -324, -135, -213, -292, -407, -393, -147, -690, -408, -196, -61, -165, 242, 137, 139, -17, 307, 241, 382, 406, 285, 327, 471, 449, 353, 42, 164, 392, 23, 10, -102, 32, -50, -344, -117, -169, -396, -303, -157, -406, -248, -138, -131, -131, -95, 57, 34, 111, 95, 229, 272, 68, 130, 315, 546, 116, 170, 342, 318, 19, 187, 25, -128, -180, -24, -35, -326, -398, -77, -354, -476, -300, -225, -388, -160, -169, 153, -129, 303, 170, 494, 435, 229, 390, 421, 298, 17, 329, 463, 140, 394, 33, -32, 135, -26, 44, -14, -150, -326, -249, -134, -355, -430, -495, -257, -146, -415, -148, 7, -247, 93, 190, 227, 69, 223, 376, 229, 223, 103, 642, 220, 215, 142, 256, 91, -98, -33, 201, -44, -403, -56, -265, -689, -228, -314, -392, -259, -441, -52, -77, -139, -356, 61, 173, -1, 165, 341, 61, 154, 459, 358, 341, 304, 209, 329, 502, 169, 187, 154, -5, -127, -445, -174, -68, -382, -385, -248]
3506b48j55P4J6J27J91j71J12K18M6j51j47O55k63j49J71K95l86J14O7r8l7k21
3528F0N6Pk93P2J31k46j79J92q5q3K7o0K6j6K43K5R3J83K25q2j42LN7q3L03k21
3554B13L02m10O3J61L1n5q9l0k23J09m32l3K89j73k26K24k05J87K65l79O7J1L38
3577Ek59J99J46O3q4J32J27j32j2K64J0j51N3k38K53k11L6j78j17J4l3j19j04
3600c36K02r1K85l52ML7L4m8J56K80k89K27k02K39K86j63K4J10k11J12Q5r2K19
3623E16m02O0N1k20K3N0J6l43J62l35J24j65L21k27L10k3k23J71J00J7j77L4J34
3646b6L68R4j34p3k09J75J61j3Q5k32J73l65J93j69K47m50K53j31r9l10kJ40q9
3669d13J58k94L41j81L68r0J46J96j01p4K87J3k0N9r5M6k31L10k37O1k32p0K56
$$ y = [-248, -403, -329, -313, -186, 5, -166, -54, 164, 210, 59, -88, 567, 304, 155, 326, 621, 235, 349, 416, 318, 281, 60, 116, 123, -170, -98, 33, -213, -392, -200, -285, -368, -341, -401, -375, -391, -148, -123, -30, 153, 378, 296, 154, 157, 214, 131, 434, 213, 515, 105, 168, 329, 360, 305, 216, 186, -37, 72, -360, -393, -104, -277, -503, -279, -484, -297, -32, -411, -344, -333, 5, -254, -55, 91, 154, 70, 202, 329, 197, 185, 449, 459, 308, 361, 123, 376, 165, 201, 23, -94, -80, -113, -232, -336, -134, -225, 60, -292, -288, -251, -217, -265, -109, 171, -118, 109, -93, 146, 432, 269, 293, 403, 192, 304, 389, 297, 516, 114, 174, 225, 5, 28, 78, 94, -249, -87, -422, -298, -463, -142, -369, -59, -82, -305, -134, -34, -17, -194, -160, -26, 342, 436, 302, 229, 20, 195, 356, 343, 428, 196, 369, 4, 197, 28, 275, -175, 78, -53, -152, -462, -464, -324, -413, -255, -549, -208, -389, -21, -111, 35, 231, 130, 56, 343, 356, 336, 395, 300, 346, 115, 425, 188, 249, 17, -53, 203]
3692B03k40p1j06kj23L86n00J86k03P3k3j55M96Q5j67QJ99j0K12k3J5N0j23L5
3716B02K10j27P6q0Jk02j5j93M7N1m2l48K18k19J2L12l21J27J4o2P8J65j69J87
3740g8o7L91j15q4o5M91k50K1K32j24J96k13j56J12j98l4k8j02J4j08k34J5K43
3763a41j44j0m2o7J03N6J91p5m3K68k4J6J18n7j21K21K47m1l7j34J3M2n7j88K00
3788B94j67O2m08L15m08l0P5J3R3l24P4p2M78j30k21M70J3N5m8R8Lj74J70M15
3812F46l85J6l6K58l79n0J25n27M75k63M1k38R9J11j92o4R0K8j11J54N6o2J41
3835f7J29k30M9M67k64J0J24J91j80J30n7j4r2J36K36l52j44R2O5m31J71k6l30
3858c87j12J78j76J38q6P7L60p0j12Q6Q6j77K75J03O3o8M2J42j43J0J27m0%j1
$$ y = [203, -37, -108, -214, -216, -339, 47, -453, -267, -470, -397, -420, -575, -79, 6, -161, -153, 46, 36, 248, 225, 240, 290, 167, 202, 412, 285, 361, 281, 282, 80, 65, -128, -81, -30, -72, -420, -202, -421, -409, -97, -418, -291, -277, -339, -261, -96, -265, -78, -145, 246, 131, 47, -18, 473, 223, 244, 476, 352, 548, 335, 179, 291, 93, 59, 31, -71, -57, -165, -399, -384, -141, -285, -295, -337, -404, -301, -245, -54, -129, -172, 96, 72, 88, 206, 149, 28, 249, 496, 455, 418, 284, 297, 339, 282, 94, 294, 127, 189, -219, 96, -312, -342, -267, -254, -161, -485, -411, -483, -5, -135, -356, 114, 127, 182, 134, 232, 235, 61, 231, 646, 261, 277, 241, 499, 120, 70, 195, -332, 143, -120, -79, -317, -218, -107, -299, -363, -273, -245, -356, -202, -146, -208, -67, 62, -168, -119, 348, 84, 94, 218, 409, 229, 359, 302, 288, 196, 332, 568, 216, 72, 164, 229, -202, -31, -57, -387, -499, -321, -497, -359, -445, -368, -8, -78, -190, -104, -18, -195, 80, 183, 246, 178, 220, 362, 219, 229, 356, 316, 316, 305]
3882C05k4J27k02n3J01l32k57J17Q1j07n6m4k0J64L1k27R8k09N62K4N7L7l7M10
3906E46n54N39k36l8p3K84l9m67J55N0j40L4J38k49j26q0k7l9L2q8O1j6K15k8
3930a46J75m45K49M13k68L20k13J12q3J98O6J2J47J08j73K3k89l32M86k90k17
3951a47k36J70P1k47j22L14m7k88K54k26L67l43K89K05n9J1J42J17LR0K5n8Q6
3974C71k9o7J58J43l19mP3J6l74P3p5p9j98O6r9j33K52j84O3N5J66j2l4mR6q4
4000a63L74Q9J7k18K63j99M9J59j73Q5k62J91J96l28j89J1l6K76j24j98K7k21
4022c74p2J40m3Q3Qr5J00K7M88k44J20J92n9j56K84l37J78L1L3k30L2j32R9M5
4046A18j52P8r2M5j88J24j48j06j22N9J1K1N1L18KL3j04l3j8K67mK7K05Q7j81
$$ y = [305, 281, 408, 206, 153, 254, -78, -335, -218, -137, -244, -300, -344, -364, -200, -169, -396, -298, -507, 55, 79, 136, 173, 136, 546, -8, 531, 295, 257, 184, 468, 429, -38, 117, 167, 27, 61, 199, -50, -176, -256, -283, -322, -290, -378, -317, -333, -118, -146, 29, -416, -167, 246, -22, 298, 85, 197, 114, 312, 378, 390, 537, 645, 472, 495, 206, -126, 360, 70, -147, -383, -213, -142, -389, -511, -197, -244, -532, -278, -504, -137, -480, -191, 14, -45, -34, 108, 225, 228, 318, 343, 285, 371, 342, 275, 433, 576, 257, 253, 326, 342, -32, 41, -34, -113, -311, -245, -344, -477, -225, -409, -346, -291, -125, -137, -171, -175, -79, -163, 211, 300, 317, 99, 362, 163, 212, 371, 198, 283, 21, 212, 408, 80, -109, -98, -134, 142, 18, -180, -153, -374, -446, -306, -349, -266, -258, -353, -253, -226, 262, 18, 138, 330, 271, 115, 399, 62, 240, 271, 304, 74, 106, -26, 73, 118, -34, 44, -48, -3, -191, -67, -215, -321, -443, -384, -373, -352, -301, 17, 19, 52, -52, -85, -103, 164, 160, 187, 392, 479, 298]
4071B98r8K57k18j04L96l60J37l89J1J08l26J57j87Mm1j50J28m3J19K51j33p9
4093b62N52k88P2m4K80l12L14m5l97N92p8j18J30q7J3k38P1j13n0K9j13K4k50
4116c18J10m2K7l52P5N0K01l9j25J84N8K93j45Q1K03j20J67j02L73j74J06m9j06
4139C56Mk24R6J40n87K21O9l06J38k32P6r5l5m6L10j15l42M37R8r1L23j84M72
4162D83m64J52Q6p3P6l02N76j75j74j38M03r6j83r2k40j28O2L2j41j04P0Q8j18
4185d00j8j26J90J5L44l8J43k0K4P9j43K84l3K90m74L47r1q2QL7j52j20K2J08
4209A94l55Kl7j4k3p0M8mk01J6J8L24j79K35N4J02J7J76m18L26K77m7K8p4j47
4234B48K18l84J95q2l48L75k58N1k8k64r7r7o3J55p0J86j92J15K95r1m9L22p6
$$ y = [298, 200, 457, 239, 135, 531, 171, 308, -81, -70, 38, -288, -131, -318, -314, -355, -505, -377, -420, -301, -50, -183, -262, 290, 2, 74, 30, 310, -2, 312, 267, -130, 462, 384, 266, 396, 309, 322, 84, 155, 42, -8, 21, -92, -68, -318, -208, -250, -223, -575, -500, -450, -249, -288, -413, -229, -171, 122, -23, 58, 261, 141, 308, 206, 579, 405, 511, 462, 356, 360, 136, 232, 372, -215, 6, 75, -231, -93, -325, -249, -344, -379, -425, -115, -230, -572, -135, -37, -128, 195, 11, 483, 19, 171, 257, 184, 260, -42, 534, 359, 185, 47, 450, 354, 171, 79, -161, -289, -227, -195, -336, -440, -370, -282, -400, -418, -544, -354, -339, 5, -33, 110, 90, 114, 193, 50, 334, 301, 591, 117, 464, 373, 291, 299, 336, 184, 64, 86, 194, -161, -159, -196, -210, -233, -303, -255, -259, -460, -444, -426, -102, -281, -46, 8, 110, 127, 303, -115, 211, 488, 441, 469, 395, 248, 466, 82, 277, 195, -153, 222, -36, 15, -13, -277, -374, -471, -534, -379, -449, -263, -455, -340, -45, -136, -185, 137, 61]
4257F1j01J1M29k49J78L06l54J75k10L48l56j0j51Q8p3m9k46j63K18r1O9p3J1
4280b32n6j39k31L96J81P5j88K73j29j40L79l36M02O4n6J80J44j23J06n5l49L55
4302E21l24l82J89j98l34K09J33j60M8l3O5m51O47q2q9J68JJ73j29pK16J3j17
4325G7K90M2J65l5j98m3p0m4Q6k39O9l11J90p9kk22n3J9K43OK2l15K5J51N4J11
4351f1J40j08nK24J74L2j96J02rj4J33k20L24l02k2rk82L45m39J50j53l9k32J20
4375c47j58K28j86O4K6J73J97r4o4J53L8J15j7N2Q5q7K87O1j59K30k63o6R0j85
4399A73l04J15k37K44L5j09k45J8Q9j18j40J70K07l81K68m1K22l6j20K54J13L27
4421E04j20k93J95j27Q6J67M9k60k45M30m35K82l66O9j22k1J02r3Q9m44J91k24
$$ y = [61, -40, -29, 400, 151, 329, 635, 281, 456, 246, 594, 238, 228, 77, 165, 92, 43, -203, -366, -148, -239, -170, -243, -232, -288, -427, -658, -262, -81, -6, -194, 79, -50, -190, 189, -147, 255, 319, 263, 443, 587, 464, 570, 515, 166, 521, 197, -185, 4, -194, -528, -319, -186, -346, -298, -331, -266, -717, -70, -152, -241, -73, -72, 101, -28, -35, 181, 194, 77, 367, 409, 574, 539, 341, 298, 228, 184, 270, 31, 100, -211, -21, -100, -102, -324, -377, -358, -115, -109, -87, -402, -377, -226, -172, -61, 79, -29, -34, 190, 364, 396, 200, 302, 293, 279, 412, 192, 516, 214, 192, 183, -99, 246, -193, -43, -196, -235, -467, -347, -505, -277, -463, -399, -373, -200, -3, -97, -161, -8, 30, 145, 128, 180, 265, 178, 465, 526, 367, 597, 334, 268, 358, 173, -131, -16, -253, -9, 26, -83, -328, -310, -221, -339, -479, -309, -102, -483, -215, -256, -34, -70, -190, 64, 177, 504, 384, 91, 286, 159, 245, 412, 461, 201, -44, 386, -49, 233, -133, -64, -186, -207, -105, -198, -109, -553, -362, -586]
4443e86L63j49J42j46M19J18j12J59NJ44k13N2L3P6K21q6j34Q8n7j45K09l59k11
4466a69lk6q8L3k33K4K05o5j56K65k8R1j78j44O06k28Q9K58l83P8M27J16j09q6
4490B96K42l67K78r1j01j91j26J71j8n5k89L3J7p6k6q9M7m7J74K3k6Q5O2K06k40
4515a08K39K79k31K92j11J40k02k9J44k20J18l79L61j56J0n49jJ69j02O2o7j30
4537d71L29j30J8j60K52j37O4J96j70K01J69J5O5p7K02J38l80K78l21K73j29q4
4559A41q0N7p8j32Q2rj76j14J55l73L04k1P0j50J45J84j14j5J3J98j7l4J08K93
4583D37l27L5J85k42R6j10J00j37j5j0J56j82J24k61l3RpL9k11P2k33L03j17K52
4607g7j73L76j89M4P6q7K40j76K06j1M0nK73l68J74o7k25k6Q8l20L36k89J7lj59
$$ y = [-586, -223, -372, -230, -376, 43, 161, 49, 208, 213, 357, 144, 196, 229, 305, 526, 440, 306, 394, 337, 192, 401, 42, -169, -172, -198, -286, -253, -486, -462, -257, -322, -478, -213, -241, -150, -328, -472, 134, -94, -5, 253, -130, -52, 375, 491, 382, 296, 538, 171, 449, 358, 257, 66, -60, 111, 93, 38, -251, -218, -201, -277, -303, -392, -345, -392, -218, -195, -221, -136, -74, 132, -108, 131, 410, 179, 471, 360, 500, 298, 269, 413, 193, 311, -68, 293, 137, 147, -402, -403, -234, -336, -274, -341, -471, -142, -272, -254, -414, -162, -299, -235, -39, -209, -8, 161, 176, 241, 164, 366, 504, 124, 402, 81, 354, 225, 141, 61, 118, 40, -92, -10, -19, -195, -309, -154, -527, -223, -244, -174, -324, -179, 5, -109, -124, -111, 87, 70, 36, 144, 437, 110, 145, 330, 88, 184, 74, 174, 37, 22, 12, 168, -14, 110, -151, -184, -175, -182, -143, -354, -282, -515, -212, -329, -77, -250, 126, -63, -19, 57, -30, 210, 34, 240, 229, 269, 264, 537, 169, 343, 276, 51, 25, 113, -207, 129, -160, -143, -146, -305]
4632c05j9N68n68J08j50O3N7K15r0J86j67K05L37j38j7K5m4P0j2m2J5p3N1j82
4656I3J75l88pL15n91J58K24l28R1j01K15J2k94J91J1L24n2k25L26J02j83J16
4678A84J72o3j31%L38k93N8L4j11j19n6j4M7K6n7j53o7q3q7J22j01L0J4K64j47
4703a93j0J90J4l15K28L34nP1j69O3J60k70J11q1K28j16j45Q3k37k5M4K98k05
4726E3j45k55o3M52n91N40k48M2l0j17K9K65K78r7J6J21pK17k56N3K12k31J2K74
4750E24j78j83J9j28K46l11J80l03k49p9K30k13J54j57L30j78J81j75K74j19J01
4771c4P9j66M32j63L31j27j93j67K91j5LQQ2j73k76J61j04j92N7n8j17K10k92
4794d23K67m8n2j70K35O1o5Q4J42q2j4J01K72j47M29m92J46K50k96J22j02Q2j37
$$ y = [-305, -324, 244, -324, -216, -366, -303, -246, -31, -121, 65, -102, 103, 440, 302, 285, 310, 266, 336, 324, 282, 297, 224, 275, 93, 268, -120, -127, 188, -403, -245, -21, -349, -258, -359, -144, -132, -426, -235, -224, 100, 48, -177, 149, 251, 68, 184, 356, 293, 162, 162, 500, 207, 265, 299, 188, 69, 13, -1, 46, 72, 15, -138, -205, -288, -375, -253, -354, -324, -310, -46, -193, -203, -13, 1, -314, -86, 248, 243, 314, 145, 208, 368, 98, 209, 128, 356, 240, 95, 178, -59, -84, -40, 258, 53, -92, -347, -410, 42, -549, -9, -257, -215, -245, -362, -333, -68, 210, 113, 129, 250, 243, 460, 204, 257, 469, 238, 250, 524, 346, 163, 182, 54, 300, -11, 169, -134, -383, -462, -232, -445, -291, -448, -118, -296, -115, -290, -16, -135, -34, 45, -121, 311, 148, 479, 352, 159, -8, 283, 268, 271, 279, 361, 188, -88, 73, -31, -223, -166, -224, -341, -131, -423, -156, -204, -256, -426, -191, -130, -195, -111, 31, -51, -65, 36, 308, 161, 590, 98, 244, 494, 198, 320, 218, 300, 163]
4817A63j69K48l59J20j42m2j05Q8l13J20n3J28N0k4J34J14l32M06J05o8J16qM8
4840B25J15j30K72r1m9K62n25R1M9k3J07k44k65J22lj40j09K66j96k97J45K19
4862a99J1p0J03N9j08M71l90L42N5k52L68Q5l13K21l24Q8J64Q6k33O5l24K81m76
4885b90J39p1l2N2j96L5J32R0P2j9j58K03P9p2j4L49k97K04R5m5J05j39K65j57
4909C30m4r1j1j27P8O6k14j3j49j46J16j54J55k83L63n8j02K93j87K75r7P1N6
4932A27j82J73J4R6J25k43J69J41n6j14j69m0J59J9k11k4M7p0k14j15q0J36q8
4955d00nN2J75j94K26K34l85L19p2L27j00Q0j9p4J15k01K52k3k26M00l59k0Q6
4978A88qj56j59j55K77k57P0j08J41l1j03m0L3K08o8qK72n2J66n6qJ64p5M7qj7
$$ y = [163, -6, 242, -117, 3, -139, -181, -286, -198, -511, -391, -444, -316, -266, -290, -156, -42, -374, 32, 137, 69, 185, 177, 225, 340, 210, 482, 391, 342, 604, 79, 170, 219, 196, 303, 59, -206, -84, -87, -227, -336, -70, -266, -563, -418, -199, -188, -258, -155, -96, -204, 267, -123, 219, 274, 22, 390, 475, 162, 383, 59, 147, 311, 397, 164, 229, -95, 186, -290, -151, -222, -254, -202, -398, -363, -231, -141, -69, -88, -246, -43, 36, -36, -50, 299, 2, 206, 301, 256, 361, 222, 487, 330, 286, 195, 184, 57, 135, 201, -13, -26, -175, -321, -205, -359, -204, -487, -124, -182, -284, 9, -178, 97, 0, 71, 127, -55, 118, 132, 228, 353, 110, 279, 420, 364, 250, 81, 41, 200, 219, 8, -16, 31, -39, -253, -368, -448, -312, -400, -405, -353, -178, -372, -146, 88, -297, 22, -50, 277, 177, 257, 238, 164, 279, 78, 330, 307, 81, 481, 122, 102, 188, 180, 24, -135, -290, -13, -270, -200, -308, -167, -198, -301, -341, -308, -100, -168, -176, 96, 44, 210, 154, 146, 310, 235, 282, 274, 257]
5004B57M2l8k0O1k86J75Q5l09M5l6k78P2J33j73R9l52K63J36j32L6J50k05J71
5027a04Q5J11p1J19Q7l5j89J55%M5K32k32J12p2j24qJ2k2K2l98N4j83J00k20K55
5052b69N2r2j53P0K49M3n0K66j73K86j94J35K12k44j0J16J09j27j33P8l50K89
5074A10j02Q2N4m03L03P7m27K19j3k67Q3r2j1K02P0Q9k20K70o2j0J33Q7j96K36
5098B12J9J29l36J76J32k46K24k73k7J38r3r4j68J47m1j99K0N1R0n4k66N5J92
5121b12O7K30P2j94K49qJ45q8J30p1L4j94K95r1k06Nj73L6k7L3J12k67o1l25M42
5146f7j08j46o5R2j5J96N3P7j4j31K15Q4O0j12k5J84j6R6j71K5p2Kj01j17J26
5171E0j41QJ06l02J03n8J64l30j16L52l64Q1K93J1P0K64l48K04l1K03l5J70n2
$$ y = [257, 299, 261, 241, 302, 16, 191, 276, -33, 12, -24, -302, -230, -97, -270, -171, -523, -260, -124, -256, -220, -70, -275, -104, -19, 92, 21, 140, 227, 192, 3, 158, 158, 203, 435, 203, 315, 243, 119, 111, 123, 101, 123, -275, -221, -404, -304, -524, -269, -217, -309, -462, -392, -143, -100, -150, 116, -57, 229, 35, 170, 382, 138, 128, 244, 353, 226, 93, 171, -179, 110, 8, 90, 144, -259, 44, 121, -306, -87, -100, -367, -284, -376, -387, -185, -115, -26, -246, 24, -38, -48, 85, 172, -24, 212, 231, 360, 24, 200, 332, 86, 310, 37, 10, 148, 55, -39, -207, -60, -101, -300, -280, -229, -139, -193, -459, -404, -212, -145, 85, 157, -37, 212, 204, 349, 261, 391, 320, 354, 160, 455, 364, 158, 163, -10, 26, -1, 32, 144, -123, -184, -509, -67, -175, -321, -386, -294, -309, -113, -60, 17, 3, -128, 87, 171, 231, 119, 94, 278, 262, 358, 187, 212, 140, 142, 41, -76, 50, -91, -83, 23, -279, -176, -234, -70, -400, -516, -164, -528, -447, -154, -143, -73, 191, -157, 47, 16, 219, 184, 354, 302]
5194C02j21K00j70l0N4J32j43j03Q7l93O1K57k07l0k65P9J36M4m3j12R3l5P3L4
5218a00l5J78J82j24k24J49J29P4J84j5j71Q4o9k07K39n8k49P9J4j32L1j06%m0
5242a87p5p0j39J71J5K54k65K24O7j81J60JK07m0J86k82K30j77J01Q8o3J01Jo5
5266B62K4j69o4r2l90J74j10O8J02J20Q3j31P6j20J14j47J12J95m3m7J79J09j18
5289A87r2l6L13J7j9j68M3j73K06j26N2l95R5O1k0j36R2j67Rj13L7J4r9J31K65
5314b2q7J25J11m0N5K2J41l29J35K63Q9k71J36j92j7m2K56l13j12j16J50k71n8
5337c87J30j4J32j61K27k39O8N6K98l16N4k1L9k4K96M0K55j63j55J86k22lJ92
5360B68j4K00m95J64j26O2j49j49o4R1K25l17NJ51Jj2LK36q6M8j53K09J59l84
$$ y = [302, 181, 381, 211, 181, 235, 367, 224, 121, 208, -185, -124, 133, -74, -104, -369, -290, -154, -110, -153, -265, -172, -207, -134, -100, -135, 43, 225, 101, -123, 26, 155, 229, 413, 398, 227, 311, 242, 35, 274, 216, -33, 46, 60, -72, -41, -147, -147, -187, -262, -332, -471, -300, -285, -31, -296, -72, -5, -186, -26, -25, 182, 142, 328, 46, 276, 99, 200, 288, 225, 326, 327, 262, 286, 117, 53, -39, -429, -255, -365, -297, -195, -75, 8, -123, -47, -167, -53, -200, -88, 107, 64, 17, 196, 305, 187, 95, 59, 372, 389, 370, 202, 245, 72, 278, 152, 204, -191, -96, -35, -55, -191, -99, -266, -257, -370, -333, -319, -418, -287, -22, -109, 16, 127, 87, 142, 164, 305, -24, 111, 374, 463, 192, 328, 136, 119, 77, 333, 20, -92, -208, -58, -329, -387, -257, -271, -139, -300, -73, -312, -244, -188, 110, -206, -152, -173, -134, -158, 138, 178, 433, 270, 115, 301, 79, 76, 268, 254, 454, -41, 123, -3, 59, -90, -239, -303, -212, 13, -304, -299, -148, -147, -159, -156, 80, -6, 42, -111, 98, 257, -127]
5384a27M86j35k30M46k96J56j16J24k39R1m7Q9j93K73m45J36K8p8j74J32k39q5
5406d43J47L10k41P7j08J4K02m2J59Q1m1O1Q1l3J90L2k63k47K40pN6m35J36Q9
5430A5%k30N0j68nJ98l2j60NJ37k39K71k08L10p2K40K9n6j15K01J69P1J96l34
5454B73l06J76o2l76L15J34j65J31l64J25j65J94j32j58J90j4O7l5N8Q3l5n2Q2
5477c6n3K04J9n1L9L74k38R0r3q5J52j36j02K40j87j25N9j23P0j07M7p5j18m8
5501b83q6j5K4J41o9K97m33M49j57M5K53k13L80K5j35o7J46J4l0k44K76k40j07
5524b9k4n3K02rr2l42M2L07k01q1j04M23j44j34J22k79N60j63k30L93l8o8M51
5547E09l86J54J02n7J1j82R4m8J1j10j34j68P4n4O8J55m15J99j44m0J31N5j45
$$ y = [-127, 359, 224, -6, 440, 144, 300, 184, 308, 69, 160, 113, 202, 9, 282, -163, -27, 1, -77, -251, -119, -358, -443, -296, 14, -227, -150, -258, -244, -42, -84, 75, 156, 115, 176, 257, 224, 414, 446, 183, -64, 176, 169, 225, -210, -74, 15, 15, -215, -165, -333, -338, -140, -172, -332, -327, -190, -429, -158, -366, -56, -128, 112, 141, 85, -30, 171, 340, 411, 607, 273, -33, 143, 81, -295, 20, 154, -11, 120, -244, -119, -284, -90, -222, -380, -190, -204, -137, -172, -114, -31, -66, -118, -36, -89, 115, 134, 83, 122, 496, 258, 348, 255, 170, 322, 186, 84, 324, 137, 12, 71, -52, 18, -89, -42, -117, -235, -283, -369, -384, -360, -219, -288, 9, -424, 25, -132, -87, 166, -47, 333, 358, 223, 156, 302, 316, 286, 42, 318, 78, -29, -53, -106, 96, 87, -5, -347, -305, 2, -199, -280, -384, 39, -105, -239, -117, -396, 164, 1, -229, 164, 126, 58, 509, 123, 277, 379, 322, 333, 151, 245, 197, 208, 98, -36, -204, -130, -184, -116, 39, -376, -177, -321, -361, -230, -175, -320]
5570c20M53l54K08j3J02O5J75N8k27J20j85J81K32k48P2j09k30o1K8J1O8j6K06
5593B16l36j45Q5l0J53r7j39J34J16j56M4J18P8J97j13P0J83N5k77L3P5j15J32
5616B81k46K51j35J20l76j23j05N7k8j01K5l6P7K26Q6q4k46N2K62l24L38j00j61
5639b90K17J04K68r5j71J01k7K81k62P4M9l39K90j81R4j04q0P8l26M6J13P8L2
5662e0k5j94J49j42J89J06j9q5P3n3K72l32N9L46l1j59J06M1j62p0J21J52q8r3
5686A11K0k29j23K0k79MJ22O1k6J58K7l33L69k4q7J23J19J43l4l66K81J75j88
5709D4K30%j08j48J35j84k8J51R6j92l8j71j2k04K59l09l4N2K03Q4k5Lj34M20
5733I0k5j6kJ28q6J86n1n4j38L62k55j49M29m10J72J97l37p3j69J09L6k79q8J57
$$ y = [-320, 133, -221, -13, -26, 76, 141, 316, 374, 147, 267, 82, 263, 495, 247, 319, 210, -20, -81, -53, -42, 26, 10, 216, -120, -265, -180, -210, -57, -154, -293, -159, -43, -199, -155, -37, 41, 238, 125, 195, 378, 433, 156, 189, 264, 149, 281, 35, 286, 151, 271, -105, -228, -333, -276, -304, -405, -380, -416, -339, -113, -27, -111, -357, -305, -43, -367, -29, -129, -290, -73, 31, 299, 204, 33, 134, 107, 388, 126, 200, 249, -90, 200, 19, 113, 9, -71, 7, -319, -273, -160, -82, -50, -75, -269, -120, -262, -73, 33, 14, -71, 2, -51, 221, -111, -52, 294, 263, 104, 210, 251, 89, 19, 140, 292, 204, 111, 131, -98, -221, -201, -480, -476, -354, -293, -319, -161, -134, -467, -98, -122, -209, -86, 33, 176, 142, -224, 57, 232, 44, 274, 274, 166, 18, 153, -31, -59, 92, 188, -4, -42, -213, -225, -429, -170, -479, -513, -461, -258, -174, -199, -196, -330, 90, 65, 49, 47, 175, 89, 275, 224, 170, 32, 394, 139, -10, 419, 9, 181, 378, 41, -32, -201, -92, -56, -335, -423, -266]
5757b66J21k35K8J93j06m2qK43J24l6l4M8P2l0M9L30l0j83K6j5J39l05l9L33k64
5782A13k85J3o6j01J9nJ25j08J51j42J04j84J64J2J17K08k46K00j13J89j92K26
5804A99P9O6l22K04N5rM7n33L22mk47j03L11q3q9nK0j6o6n5m4r8J55M8L77k34
5830b5K2o3J30l8J68o5K24k98J95j20Q9J95q0k45l07M88j63n06N2R6j72K84j3
5853a52q7k88K29o4j08L36K3p1j3L29n2J51m0P6l%l3N4O9j46o6J81k84P2j45P6
5879D4l38L23k71K41l15J90m4k81J75J53O3j74K79J29j43k78M20k8j04J8K34j88
5901A05J54J27j40k23K95j50r8J1Pj51Q8j33K0P8j44o7P4j67p1J57j75L41k21
5924b83J26J68r3R3l0Q2J3N0J6RJ77K8k68N0j05N1j28L6J92k7k03l2M8j44P4k30
$$ y = [-266, -145, -380, -352, -159, -265, -307, -315, -72, 52, 16, -18, 30, 102, 72, 121, 451, 421, 238, 264, 249, 388, 83, 44, 377, 113, -172, -159, -225, -326, -307, -312, -187, -295, -144, -286, -182, -366, -202, -190, -73, 135, -111, 89, -24, 165, -27, 199, 278, 344, 22, 226, 281, 272, 319, -214, 108, 104, -143, -246, 65, -18, -107, -112, -92, -108, -174, -229, -273, -371, -216, -168, 209, -25, -3, -66, 64, 26, 194, 129, 353, 55, 250, 130, 219, 414, 334, 89, -218, 270, 107, -399, -347, -251, -423, -139, -152, -239, -527, -298, -362, -470, -134, -111, -182, -195, 134, 82, 233, 193, 269, 266, 266, 233, 287, 356, 210, 144, 325, 41, 113, -32, 44, -294, 29, -242, -1, -316, -126, -170, -451, -276, -123, -60, -234, 45, 174, 31, -247, 173, 145, 41, 59, 293, 105, 259, 386, 246, 23, 318, 168, 70, 81, 88, -63, 25, -108, -88, -10, -154, -221, -147, -314, -385, -228, -403, -62, -283, -157, 11, -82, 11, -19, 63, 76, 126, 142, 151, 328, 356, 88, 138, 33, 84, -44, -8, 184, 157, -46, -78, -30, -174, -100, -330]
5950c30rp2J24K47j97J8P9K61j99K95p4k04J92p2J63n7NJ42k27O3j74J41m2q1
5974hM7j5q1M6l04L17k83K31l60N02j41j85m8J54j57J69J43m4M11j44o4K4j69
5997D1j37M04r8k83N10l43J37j74J99j61j98Qr7j7K20j54NQ4K38k61k39M48j50
6020a8r7Q4K7j77K54K7Q5J20k20J94j1l03K77J70k01J07k73k5J01m7j7n7l52L28
6044b4J06l90J58k37M53k18j80K11N8J66pq1N1K26p6k87M20p0k93J44J03j27m7
6067E9j59J47m1K5J60l58P1j26J27j47PL0q1o8L08k5M2j17Lk93N55mJ0K25m00
6092e0L39k63J99Q3k40kL23o4l64O0j00q8m9Q7Q0k77P2k4j88K97P3o2j10K6J09
6117a33J4M5N6J9R7Q1j46K14j13J19o5j00J42j4R2k45J64j72j05o2L6j70J81J0
$$ y = [-330, -339, -411, -287, -40, -237, -219, -140, 121, -78, 217, 143, -61, 131, 59, 222, 165, 170, 312, 85, 148, -26, 115, 73, -8, 39, 24, -57, -11, -315, 2, -281, -50, -410, 92, -49, -234, -282, -128, -285, -116, 27, -17, 394, 250, 186, 210, 41, -96, 308, 210, -73, 437, 94, 231, 57, 256, 95, -103, -95, -192, -209, 11, -143, -138, -54, 184, -77, -316, 132, -18, -115, -31, -4, -181, 73, 100, 185, 305, 85, 279, 268, -35, 242, 412, 211, 318, 45, 20, 121, 74, 57, 0, -352, -24, 82, -308, -150, -387, 66, -152, -332, -121, -63, 103, 96, 15, 66, 292, 216, -71, 349, 279, -14, 130, 233, 106, 59, -100, 47, 6, 31, 191, -167, -96, -222, -95, -242, -235, -205, -286, -354, -46, -71, -29, -146, -143, -436, 119, 115, 125, 350, -50, 289, 26, 225, 308, 68, 66, 389, 325, -39, 21, -79, -167, -216, -129, -49, -326, -254, -278, -466, -169, -96, -158, -268, -242, -133, -119, -74, -18, 1, 98, 179, 33, 247, 134, 253, 188, 88, 230, 216, 308, 63, 227, 55, -50, -112, -76, -246, -65, -55]
6141e5j44J97J1j40l18N30k23J22j46K01o5J76J02l11J48Q1R7k29K34j60K33l69
6163b8j0J27p7jj62K71j36r6J98r9l28J29J5P7j25j13J32j77K34NK03K0j07K07
6187A59k07L06l53J23K22o7K7k76K26m5L3j13o9l6q7O4j59J90J1L2q9j46k21K56
6211b19j64K44j07J20N9K43m3o0j09J41J8L8O4q1j6Q8j07k3K4k71O4K0M3P0k20
6236a84K07L3m10L24q7J92j79Q4j01o0J75K24k92M9q7J01L34l37P1K02k44o7L56
6259C04j38l2j05j80L47j64j24J50l02K8n4N6RM2n4k08K93j15L14Qj15n4K50R
6283A65k49L7K52J25j88Q9jl46L22o6l3K3j61P2j34k35L12l46L92l38L42j25j14
6306b05K23j71R2J19r6J9N4K61m41M04l3j39J53M4o9J17n0L6k48pp6j60q7J94
$$ y = [-55, -199, -2, 9, -131, -449, 81, -142, -20, -166, 35, -30, 146, 248, -63, 85, 166, 263, 34, 268, 108, 341, -28, -38, 89, 12, 11, -151, 120, -16, -112, 86, -13, -341, -212, -197, -120, -245, -358, -226, -403, -169, -164, 39, 59, -48, 159, -48, 258, -95, 28, 250, 183, 210, -66, 160, 115, 148, 35, -34, -70, -157, -93, -252, -62, -51, -19, -108, -254, -475, -219, -383, -139, -246, -126, -67, 176, 133, 73, -36, 105, 123, 161, 225, 144, 128, 216, 109, 86, 110, -161, -97, -77, -34, 36, -184, 23, 56, -354, -30, -117, 75, -104, -20, -121, -181, -6, 218, -74, -25, -112, -11, 323, -14, 57, 259, 15, -52, 304, 166, 134, 29, -151, 196, 32, -92, 58, -244, -216, -270, -214, -205, -163, -217, -425, -132, -247, 67, 75, -40, -94, 156, 165, -84, -47, 205, 330, 142, 231, 230, -116, 206, 140, 107, 130, -31, 41, -93, -328, -16, -362, 30, -308, 34, -91, -205, 18, -153, -61, 58, -38, -19, 35, 296, -145, 259, 226, 87, 240, 284, 215, 332, 282, 318, 70, 63, -13, -173, -260, -66]
6330f6R5mj27l9JJ23p3m2J15o0J41k51K24p4J04j04J19o6J22l4J42j28j5m4K1
6355H0L2Q3m04J60K17j14j65k32M17k01m8J41k82k4J46J82O6l67K97j51L5J08
6377b4j5J05r7J53J93k99J61j24R4Q7%n8l83K65j61j40K66O9j66l1k30M53j08
6400A0k26O0j84J65K82l46J28QO7J79j58K75j63J62o4K2J7J46l25l3J4j8j31M
6424a09K36j93K41j01q6k7k13K09j95r8P9K0J13M8J3J1K77l01K11n5J4K38k15
6447A17P1j53K13n1M2k59L32mj61k89J04p7%J01N3q7Q2k21oj49J63q1P3L1K61
6472A05M9k00J69Q6N1j22r2M3n0n4J94n8M4k52L31k4l06k10J09O3Q5m0J25L0k43
6497a67L09k24l10L41J10k05K33j30R4R8N5j47N7K13j97L8J00l18J90P2K5l75
$$ y = [-66, 29, 25, -102, -141, -140, -17, -90, -132, -17, -77, 64, -187, 37, -37, 67, -37, 82, 16, 138, 104, 246, 118, 103, 59, 80, 112, 195, -209, -49, 168, 54, -111, -343, 74, -127, -175, -34, -316, -340, -194, -12, 54, -313, -16, -167, -132, -24, -39, 66, -31, 122, 315, 16, 177, 53, 147, 234, 234, 176, -207, 58, -103, -243, 23, 92, -74, -105, -335, 118, 10, -216, -156, -340, -175, 107, -239, -111, -103, -36, 143, -15, 260, 97, 259, 195, 217, 234, 380, 55, 22, 36, 18, -113, -109, 127, -66, 175, 74, -12, -39, -252, -43, -238, -336, -257, -237, -124, -76, -63, -52, 225, -76, 135, 80, 94, 332, 117, 188, 35, 248, 197, 239, -20, 312, 308, 147, -142, -38, -115, -115, -14, 39, -48, 34, -187, -193, -342, -179, -260, -187, -156, 105, 154, -46, 123, 209, 260, 138, 46, 89, 39, -15, 179, 121, 165, -87, 244, 220, -86, -296, -187, -124, -39, -79, 46, 76, -167, 142, -82, -392, -51, 59, -146, 87, -43, 51, 149, 204, 57, 114, 327, 130, 168, 268, -50, 140, 212, 237, -138]
6519a38K81k31J59J4l39J25k11L58l32R8m1L05k05J24j51L99k99j7J37NK20k90
6541b9j2k07N25q5M03m38j63M5oj4m5J24K9k53r0K51k59k1l3J04L8J68k96R4K8
6566a42oP2J40k57J74Q3j82J35L23kk37K44k74K91j27j94j9M45l51j04j74M2J56
6589C6j66Jj00pR5l5NK9j78L75q5J40K5k2J24k20J3J70j71J43M2j61J99p0N8K12
6615D52m44K43l47o5R7K65m64K33k27J59k5q0L30l35J47J2L22j15l31K81q3n7
6637c2M8O6K59k05Q3j92K44q9k17L14l37K85l11k9L43j71j12r1m7l8J55j63O5
6660a72Q8K6j70L44kj59L4J69o4J74l97K56K12j46J67j35l50J63J37j4l17M4Q8
6683b4J66k86j26J66J5J15k34J34l18J87J84J27k07L40l45L1J03J29j04q8K44
$$ y = [-138, 143, -88, 71, 85, -254, -129, -340, 18, -314, -216, -257, 48, -157, -33, -184, 215, -84, -101, 36, 41, 261, -29, -41, -248, 277, 192, 595, 157, -6, 39, 33, 19, -26, 98, 127, -126, -216, 35, -224, -245, -278, -174, -136, 32, -264, -170, -142, -148, -76, 64, -193, -19, 64, -118, 17, 340, 338, 101, 345, 71, 362, 235, 41, 22, 467, 116, 12, -162, -120, 36, -130, -129, -229, -236, -141, -176, -171, -142, -320, 55, -30, 110, 135, 113, 237, 17, 30, 200, 29, 172, 214, 53, 252, 182, 240, 452, 8, 251, -96, -161, -64, 201, -263, -30, -257, -98, -123, -203, 127, -208, -61, -49, 273, 158, -173, 108, 25, -32, 16, 82, 341, 136, 219, 27, 271, 182, -35, 279, -58, 227, -84, -113, 230, 59, -53, -144, -191, -229, -74, -237, -172, -84, -58, -228, 116, 114, -45, -11, 158, 94, 268, -129, 127, 339, 193, 360, 225, -125, 38, 175, 161, -156, -112, -24, 142, -144, -270, -104, -89, 26, -208, -74, -392, -205, -21, 106, -101, 239, -106, -75, 28, 157, 53, -35, 209]
6704B09j56J29R8j61n3J68k81J28p1O3l5k25L64k45m9p9j77K63J09l07O4Q1M3
6727a20J84j35Lj3J57QP2q2j2LRk2J53O5j10Q6p1j74m4J7q7L7J63l02J08l8KM1
6755a02pO3k22L94m12K81K2KL0k70M39j68mm0K3K21k9r2p7M9M8j95J49O3L0m18
6781b22J14j27L9P3j21K6r6L81l41L2K80r1K47m61M70J26k17m6J10l5q1Qj86J89
6805G1O6N7j92kK1q1J07j14j03J95p2k21J59q4l4K6o7K20m08M71K5N5k21R3J98
6830A65k02m9J86p1N0J21M4k86M0L22l31J82kk25O5o3k05j5J66M6J20j50M5j56
6854b03J83mj61K42j0k02J25J61p8l7J87K1j13J59l64L21j79J92nP8j13j28j39
6877f7j18R3RoQ8k21K76k21j02K44l6J50j01j15RJ09r4J69J32K8k19Q7N1n3J30
$$ y = [209, 53, 182, 280, 119, 66, 234, -47, 81, 10, 73, 38, -187, 177, -68, -117, -196, -373, -110, -1, -308, -244, -163, -120, 64, -71, -68, -81, 76, 84, 156, 74, 62, 65, 74, 52, 205, 270, 160, 246, 175, 1, -43, -26, -113, -76, 87, -215, -107, -145, -143, -102, -109, -46, -268, 126, -286, -5, 17, 19, 49, -221, 218, 50, 46, 6, 29, 250, 221, 129, 52, 101, 149, -46, 103, 166, 196, -222, -108, -235, -196, -123, -244, -218, -314, 67, -274, -242, 38, -53, 194, -267, 203, 329, 112, 66, 176, 141, 60, 68, -118, 71, 137, 194, 2, 0, 21, -60, 47, -67, -170, 25, -47, -268, -109, -193, -227, -201, -268, -48, -456, 15, 40, 95, -126, -33, 165, -37, -86, 100, 29, 79, 200, 244, -42, -2, 320, -11, 171, 169, -56, 9, -54, -259, -274, -108, -62, 58, -92, -47, -203, -20, -24, -185, 57, 47, -155, -30, 131, 53, 16, 203, 224, 111, 270, -94, 227, 48, 240, 235, 313, 200, 72, -67, -185, -92, -83, -89, -1, -222, 54, -167, -269, -25, -61, 89, -12, -127, -118, -9, -103, 66, 198, 226, 7, 94, 145, 92, 222]
6902B22p7k31m1J67j11M2M7j8Q7l02J11P8j21K05m5j74R2q8M35m53M0J00J34M1
6926A40o5P5K01j09P1k84K8K09l09K90l51N2O3N9j45j70K94j84j60J41L2L3J66
6949G7k25P8K54j92k72M23k06K94l66P4K28p9J12j79R7M5j1P6k69Q2O0j17Kp7
6973i1J59P0k21O0lJ38m8k24K0lN2n6J13p7J35n6K52j27Q4J06l81L72k36K71j51
6998A58j41M5K7r1K05k24L8q2P7J11L2k87K0j2l6K74k94J03Jk7j2J46Pk15O3Q1
7024c3P9K17r1O7l70L46k69L6K13l34K17m1k29L14j41oQ0m3j09l9m2K1Q0Oo3Q9
7050d5r3N1J91j09l17M88l6m2J86l91L63j93J97p6l99K24K4j35J36j57q5J95P2
7073D9l18J29J71k89K85k44J8QK66j38K12p5J35J5j38j3o7M8J45j79M1J2j21J24
$$ y = [222, 145, -86, -127, 40, -71, -29, 18, 0, 87, -215, -104, -26, -147, 58, 13, -161, -69, -157, 278, -175, -135, -35, 99, 140, 75, 150, 351, 242, 313, 29, 57, 266, -43, 247, -104, -52, 11, 70, -75, -245, 49, -135, -295, -154, -122, -89, 77, -148, -70, 184, -8, -280, 143, -63, 231, -135, -61, 167, 88, 200, 21, 118, 163, 152, 228, -41, 41, 101, -16, -14, -91, 68, 138, -83, -23, -26, 112, 64, -160, -140, -143, -91, -147, -34, -111, 24, -32, 220, 93, 177, 283, -98, 274, 38, 309, 158, 17, 62, 89, -2, 203, -21, 17, -65, 12, 123, 155, -132, -112, -124, -160, 114, -180, -77, -76, -103, -115, 31, 38, -177, -114, -33, 46, 263, 172, 239, -131, 215, -54, -18, 195, -139, 78, 37, -192, 122, -19, -25, 55, 12, -97, -136, -178, -157, -77, -71, -134, -45, -138, -87, 104, -5, -322, 166, 130, 88, 274, -117, 246, 53, 250, 174, -225, -1, 23, -112, 24, -133, -218, -23, 49, -269, -140, 31, -258, 27, -217, -199, -191, 75, -63, 149, 74, 209, 224, 86, 73, 6, 54, 199, 20, 61, 73, -48, 76]
7097G6J07k44j33J03P4K4L8M6k48Q0j0J52j72m3L32m6j39p2Q6l5L91k59m06K13
7121h5P0J5R6p0rJ00N6j38Q9k19J70q6J56j77n1J57k08J17M4M1o5j95J45k33M61
7146A81k94k5K40K0k02p8K77RO1j28p1K26K5j58R0M1q3j22m1k25L74j10k52K60
7170A5J24j93j7M3Lq1j01J59J23j38J60l3j22M79p8k57K86j05k50j02K58k21K88
7193B40l23J54q1J06j95r7P8o7N3K05k60P3Lr6J78j26K42j67p3j48K00J41J11
7216A51L7j06J67j39k68R1J57J58l18n1L55k15l6J90l58K66k36R4J27j29J6R6
7238D9j55KR4l2j6J94k05lP9q3RjL14l00K95K8k17J01j63Q4k13J77p0R2Q2k79
7264a37Q1L2Ok81M26k26mj13J65K0r8J71k56K8m0L59j39P2R3O8j99m6Q4j72J16
$$ y = [76, 183, -61, -194, -91, -17, 7, 45, 91, -157, -77, -87, 65, -107, -150, 182, 136, -3, -75, 11, -24, 367, 108, -298, -85, -15, 0, 96, 26, 17, 117, 173, 35, 124, -95, 75, -11, 145, -32, -83, 74, -134, -17, 27, 68, 3, -192, -47, -280, 181, -113, -138, 102, 122, -80, -158, 119, 128, 189, 61, -10, 216, 241, 83, 173, 214, 131, 9, -32, -257, 117, 7, -245, 15, 139, -54, -71, -28, -25, -106, -207, -48, 75, -63, 97, 64, -58, 421, 343, 86, 372, 267, 17, -85, 173, -48, 240, -83, 71, -10, 96, -99, -196, -118, -185, -132, 73, -187, -114, -111, -207, -29, -155, 87, -80, -153, -301, -101, 40, 151, 188, 82, 249, 110, -158, -67, 90, 248, -70, -121, 234, 19, -17, 173, -185, 81, -155, -61, 66, -63, -47, 49, -106, -104, -10, -42, -58, 136, -69, -72, 7, -76, -67, -68, 246, -54, 241, 269, 52, 153, -10, 74, -139, 38, -32, 60, 142, -137, -56, -24, -18, -299, 127, -99, -103, -216, -51, -31, -129, 42, -214, -186, -226, 133, -6, 66, 159, 227, 28, -18, 66, -106, 10]
7289A0J51%q3J38m05M4J47j75O2J0p1Q4J73k83J77J32j86K07k35L4J08R8j6K4
7313A45j34n8j13J56J55k50J22K5q1J96j39j79L19k18n1J03r9P0J51k79m8JM35
7336B29n61K57j69M33k68N27m69J04J13k32j41L57p6J8n0J2j16j00K95k8l12K18
7358D1j50J23N2k79J75j15J40O0j04j35j92K25K21j57J44R1Kj54J16o4J06j32
7380A4J49k16J65Lm2J60n1p8k59K5J69J08r5M6k38P2r0J29j5Mk20K04j77M71k32
7405FK70j27L3k36o8N88l82J70j42qj05n2J8l3j08K3J09K82k72N2j53L4k05J53
7429a53J63k79J59L15k33j64J99K83l62Q7R1j33R0j33Q2O7J52k76J18J17k41K26
7451A75Jom93J84L60j06J59l14j40J65k55J46K13j71J24n0l5O9j75p7M24k02K55
$$ y = [10, 161, 161, 78, 216, -189, -145, 2, -173, -111, -101, -172, -88, 85, -198, -21, 111, -75, 132, -103, -69, 39, 137, 121, 145, 11, -47, -160, -4, 151, -99, 23, 48, -33, 163, 24, -155, 164, -54, -105, -2, -101, -31, 120, -159, -207, -206, 229, -332, -75, -244, 189, -79, 448, -21, 83, 196, -36, -177, 180, 104, 122, 72, 84, -32, -132, 163, 135, -177, 41, -109, 14, 66, -213, -38, -153, -13, 47, -57, -192, -384, -159, 62, -95, 49, 140, 142, -12, 104, 40, 146, 14, 163, -53, 112, 115, 73, 233, 182, 104, -155, -130, 39, 147, 52, 98, -140, -68, -158, -29, -44, -40, -260, -56, -233, 238, 6, 276, 149, 182, -54, -122, 466, 84, 254, 112, 104, -1, -53, -35, -68, -176, -153, -44, 238, -34, 18, -135, -101, -306, -153, 10, -269, -110, 205, -28, -192, 7, 290, -72, 15, 106, -27, 63, -70, 12, 79, 231, -45, 73, 190, -51, 175, 176, 170, -323, -139, 221, 115, 274, -40, -180, -15, -270, -124, 89, -82, 42, -8, -43, 26, -149, -226, 198, -4, 251]
7474B51j84p3J41k84K57k41J38O7P8j32J32k04K19m6l26L5J62m5n6R0j4q7j48
7497b70N85n34P0kp4L87l10K27r2Q0m8K89l54K04j17j1P4k04L53m48L11j32J5
7520aK2l04L58L8p8k43J78N4O8j4l70K41J16j60%J86q1J55k93L24J11k96j47J65
7544B9L1L9k17J68J7l03L48j45j03o1L58k10l9j0O0j21O5J13O6n1q3N6K4O2l25
7569b32K96n9q0K34j79QJ15M3Q9l44J79m5k0p0J81k53J36k8k3q4L27l38k1J01
7593f7p5l10K77K45o4J28J4r2K2n6M5M0j49L90l02J56j4q4m1K42k50j00k6K81
7617B10k77Pj02j79J14K30p2Q9k10J63k87L22k05M84o7r9j69K1M9k2J47n1J28
7640B24j16j59J33q4O1j35P8Q2j27K85k85j2k5L2Lj2j79M17l04R1k24K07kQ6L5
$$ y = [251, 67, -6, 135, -149, 108, -133, 5, 72, 150, 18, 150, -54, 165, 119, -207, -172, -10, -55, -111, -21, -35, -122, -270, 315, -219, -149, -151, -225, 162, -148, 79, -13, 67, 19, 308, -46, 158, 41, 30, 104, -100, 253, -195, 116, -16, -1, 21, -283, 75, 113, 35, -208, -30, 24, 92, 78, -292, -51, 65, -95, -95, 91, 10, 165, -128, 196, 307, 11, -136, 29, 60, 99, -118, 50, 67, -236, 112, -33, -136, -197, 161, -49, -88, -98, -38, -159, -94, 19, 85, 34, -49, 7, 31, 93, -232, 64, 5, -75, 159, -20, -12, 103, 146, 235, -109, 70, 25, 5, -65, 116, -137, -1, -29, -52, -136, 191, -147, -168, -67, -142, -452, -175, 70, 6, 134, 148, 56, 78, 22, 67, 107, -42, 348, 46, 202, 188, 104, 63, 305, 55, -45, -71, 210, -67, -60, -162, -341, -227, 3, -69, 20, -190, -27, -314, 8, -197, 287, 220, 121, -48, -27, 22, 0, 147, 96, 224, 108, -51, 82, -2, 59, -76, 2, 84, -43, 242, -43, -55, -80, -48, -45, -57, -236, 181, -123, -32, -256, -49, -51, 35, 70]
7665G0j05J54j72R2O7n6j75J76j88K01RJ28m65K89J17k59K85l20K8R9o6J16k05
7688a80J17J05m37M41l79N41m37L25j58K3q6L8M2k80M82l07J93j20L8J54p0qM2
7711G9ol72J5R9L52k84J97l46K24K24k63l8J78l5j96K51k16K81m6q6J14r5j39
7734a08n2K74J04j87k14K61j91K3J15N6j77L19l51P0k1j12M26k11l9k32R2k1R0
7757h6J87k72L25k93J16k25K90J59j91K85k44j26N9J78l8J4j35K3k20Q9O9L9j98
7780a95L70J9l9j97j02rL5J33p4r3K87j37p3l4K84k09K01r3J5J33o6j82R6K12
7804B82n11K27q1K22Rr8j20J43J1r3j5J47o1k57K49k1J51j73j64K77k51K16k67
7827a78J89k2O0J22J24k63J48k53mNK54r9P2k7P0k18Q3j58j62Q8M5J00j13RJ98
$$ y = [70, -35, 119, -53, 39, 106, 50, -125, 51, -137, 64, 73, 201, -264, 25, 142, -117, 168, -152, -124, -25, -91, 25, -180, -63, 42, -395, 46, -333, 208, -229, 96, -62, -39, -125, -87, -45, -325, 157, -150, 43, -77, -39, 115, 45, 37, 79, 73, -299, -284, -185, 167, -117, 80, -266, -42, 182, -81, -119, 59, 24, -172, 79, -137, 144, 98, 12, 126, 31, -108, -160, 114, 218, 31, -183, 78, -113, -90, 25, 81, -96, 223, -128, -58, -79, -191, 235, 24, -15, -247, -155, -176, -86, 101, -171, 154, -139, -23, -248, 42, 201, 10, 295, 51, -75, -16, 162, 124, 138, 3, 26, -194, -105, -36, 3, -195, 175, 194, 155, -42, -144, -153, -118, 15, -59, -152, 135, -2, -75, -109, 175, -34, 167, 74, 89, 222, 156, -26, 70, 282, -229, -2, -83, 139, 148, 50, -70, 73, 84, -9, -24, 123, 62, -195, 54, 33, 184, 11, -153, 124, -127, 89, -178, 11, -11, 49, 171, 295, 32, 180, -73, -77, -72, 182, 83, 155, 128, 198, -20, 63, -95, -257, -169, -124, -24, -137, -128, 70]
7852G0j25J5J67p3K17m37M35m51K64K0J9q0j46K49J10k80K39k22k06L51r2L3j96
7875a19L56m05J34J81j12m7r6m6J36J15j24j9J23p5J58k58K76j91J90N2l17L65
7897B77q9j39q6j07K42j18J22j89N9o0J16j38J03K7L6k3r3O9J1K5m90N55n9P8
7921A29K0k8L6O1l81L89l3q1J45l36J77j06K82J3o2m18j12L24k10J73k28K61Q6
7944A01l5m3j09j65%J29J68J11J07k47p8K66m48M67k33L7r7O8J78j41k7K02j96
7967A5J60j66mJ1j61J84k64O4R9o8mJ01K56k19oL2j92K75o3L4N4n3k70K41j21
7992f5L21j62j83OQ5J67k76KJ1j7K11k42J40K2N9j26j06L5l27L0K83Lj03L18J60
8017B46n4j91p9J81k41J11J16j0K15l36QO3J06k12J43k66K45o3R9l8O2o5k02J06
$$ y = [70, -55, -40, 127, 54, 271, -166, 269, -182, 82, 102, 121, 41, -105, 144, 254, -26, 213, -9, -215, 136, 44, 77, -119, 237, -168, -34, 147, 35, -12, -108, -154, -18, 97, -27, -46, 77, 2, 160, -98, 178, -13, 177, 229, -88, 277, 188, 49, -37, -144, 98, -20, 102, -87, -28, -88, 28, -110, -7, 20, 56, 33, -60, 9, 20, 45, -445, 110, 51, 129, 149, 121, 157, 218, -163, 226, 193, 112, 257, -79, 98, -8, 274, 287, 225, -193, -305, 19, -191, -18, -246, 15, 101, 66, 23, -86, -251, -251, -122, 46, 157, 264, 17, -61, 205, -243, 224, -9, 28, -69, -1, 177, 36, 9, 211, 15, 175, 9, 5, 16, -145, 39, -225, -161, -62, -130, -134, -33, 223, 4, -2, 30, -162, 113, 50, 84, 138, 85, -185, 56, -65, 256, 94, -89, -83, 2, 169, -107, -105, -94, -111, 100, -142, -2, 20, 79, -47, -153, -118, -445, -415, -132, -129, -232, 86, 246, 192, 1, -78, 103, -138, -27, 89, 79, 294, -42, -34, 29, 135, -77, 66, -200, 45, -18, 81, 43, 105, 40, -162, -56]
8041e6J22j29O9O7j00j01O6j35k4L33k39K16m6p8j14K34Lp8J37j45K55l43K22
8064A36k14P2j34J32r8J03j11m3J00J09J59k38j5L78l09k55J99Q7Nj9q0o3J76
8087G7Q5k44J47k38j15M43M9m3j89L23n56K94L5k02L48j43O6j05o5P8k47K06O4
8110F8J15q8j63J44j56J80n7Rj54p4J31M6K95l25j08Q5k8J27j22L30j38j6N0j05
8134D6k00J16J30k85R6O8J80k68O1r6J49r7K76j91J0J61j34J65k46j60J97K0k5
8157b7P1j46KL44j20N8l11m2K9J53l57O29k90KR4k22mJ27J71k37P9O2M5k40N0
8182h0N2k3Q7P8R0q3Lm4j27
$$ y = [-56, 66, -63, 6, 73, -27, -128, -62, -197, -221, 112, -127, 89, 43, -35, -149, 85, 88, 10, 147, 2, 257, -86, 136, -78, -6, -140, -8, -106, -3, -114, -157, -57, 52, 211, -27, -42, 336, 27, -228, -29, 58, 63, 44, -36, -99, 77, 162, -82, 65, -173, -288, 155, 204, 161, -28, 295, -261, 33, 68, -134, 214, 71, 137, 32, -33, 45, -202, 4, 68, 183, 95, -68, 76, -80, 100, 43, 52, -102, -176, -45, 1, 296, -29, -137, -52, -80, 47, -75, 255, 117, 101, 151, 46, -154, -38, 92, -193, -97, -29, 151, -117, -56, -152, -3, -100, 176, -15, -5, 156, 22, 187, -59, -219, -22, -2, -27, 44, -102, -100, 244, 124, 182, -129, -171, -142, 11, -346, 283, -7, -5, 89, -133, -137, -10, 161, -76, 3, 65, 110, -130, -80, -28, -51, 36, 114, 204, 121, 124, 80, -47]
8191d7
$$ Imaginary data points
##PAGE= N=2
##DATA TABLE= (X++(I..I)), XYDATA
0@%%%%%%%%%%Qj6J6j6J6k4L2l4M2n4O2p2Q8j04J20j38J62j89K17k46K79l19L63
33A93m10M64n20N82o53P28q11R02j002J109j225J353j497J652j818K003k207K430
51A273k677K951l257L605l998M446m963N568o288P158q238R621j1456J4010j7810
66a0055K4051l5989O6440k77980n40617R04293N53565o89151m92290N44027L75222
77D21516l28955k38281J68557P5540K072P8396j29918k76023J67442L83261j70534
88A53073m65929J09566M08801r4309l42561O7822K17974n9062r0556M9902n1833
99i7112l6345K13600Q1601l01558r9203L61572J46411l16865j15469K72881Q9229
110A98742j90316l9171J04946m407j2193L9433j03030j11956J62783J42572k29052
$$ y = [0, 0, 0, 0, 0, 0, 0, 0, 0, 0, 0, 8, -8, 8, -8, 8, -16, 16, -18, 24, -30, 32, -40, 48, -56, 64, -74, 88, -101, 116, -130, 149, -170, 193, -217, 247, -273, 309, -344, 384, -427, 475, -527, 582, -643, 710, -787, 865, -953, 1050, -1157, 1273, -1404, 1547, -1710, 1895, -2103, 2343, -2620, 2948, -3340, 3818, -4420, 5201, -6255, 7755, -10055, 13996, -21993, 44447, -233533, -774150, 130143, 683708, -5443, -497733, 46294, 421516, 92561, -145720, 22837, 98377, 100449, 178845, 48927, -227096, -59654, 323607, 153073, -312856, -203290, 205511, 111202, -231359, -163537, 54437, -4625, -95181, -45279, -97112, -133457, 80143, 161744, -139814, -239017, 122555, 268966, -47899, -163368, 109513, 198742, 8426, -30745, 74201, 69794, 57601, 97034, -5996, -117952, 44831, 187403, -41649]
121d1649j79921K36583J35393k80854q8988L09852J6579l44931N4159L65722j15457
132F6488l50254K01576L60810k36596l33440K72189L28885k34349k62674K02896
142A5531J93762j52243j07786J05433K4389o6511L4696j336j20803L0258J67372
153A22762p4486k27285P0080K23889q9798k11360J01833J72979j17844j25355
163a54585J32600Q7024j11559j4886J13452k6233q4159Q5875Q6085r3235n4449
174c4070J03490K7481r8228M794Q7128l8384q1361M1201L6997p0066r507O9465
186C8940m9926r6684P8621Q9799j25166q6386J64236P6862j97979o3870K29619
197E8066P2899k15774n2971K08294N6378j59091k9523J28875K9926p1977j7664
$$ y = [-41649, -221570, 15013, 150406, -130448, -219436, 90416, 106995, -237936, -183777, 181945, 66488, -283766, -82190, 278620, 42024, -291416, -19227, 309658, 75309, -187365, 15531, 209293, 57050, -50736, 54697, 79086, 12575, 47271, 45935, -74868, -44610, 122762, 48276, -179009, -108929, 114960, 25162, -186198, -84365, 88614, -29230, -154585, -21985, 65039, -46520, -61406, 52046, 25813, -58346, 27529, 113614, 20379, -34070, 69420, 96901, -1327, 3467, 90595, 52211, -29150, 12051, 49048, -21018, -30525, 38940, -10986, -107670, -29049, 60750, -64416, -150802, 13434, 90296, -107683, -171553, 58066, 130965, -84809, -137780, 70514, 126892, -32199, -61722, 67153, 97079, 25102, 7438]
208G438J7253M279L6026J0086r0638m5080J06439N0036j35264p0652J26721N4021
220G0665j34591n3495J13161L1773q9866l470O2273k6203k7514P1039K0958q2321
232d7591L671J05428K086r2066J5171R1977q287o9592N939M1900m426j2465j137
245C0608l2998j8599M9895J4306q3581l1690Q5613K0333j03223k4455R9830J7405
257B3444r0215n872P7114j911m6325K9374L8994l0273j1217M8862J0205l9410
269B770J1060M4106j4458l7042J7503K5834k1448j7992J3185j1549k7371J7542
281B140J8506m4257l1526M6440K0537o3991k1292O8959J7498o6578j0319O4812
293I29J3614m1126L902L7701P65j1187J3399P846n870J2353J2057k1410j4661
$$ y = [7438, 24691, 28970, 64996, 75082, -15556, -60636, 45803, 95839, -39425, -110077, 16644, 70665, -63926, -117421, -4260, 27513, -62353, -65823, -3550, -29753, -57267, 13772, 34730, -47591, -43920, 61508, 63594, -28472, -13301, 78676, 70389, 797, 6736, 48636, 44210, 31745, 30608, -2390, -20989, 28906, 43212, -40369, -72059, 13554, 33887, -69336, -93791, 6039, 23444, -66771, -72643, 4471, 2560, -43765, -14391, 24603, -5670, -16887, 31975, 42180, 2770, 13830, 57936, 43478, 6436, 23939, 49773, 28325, 10333, 23518, 11969, -15402, 2140, 20646, -23611, -55137, -8697, 11840, -52151, -73443, -4484, 13014, -53564, -63883, 929, 14543, -26583, -22681, 15020, 15785, 4598, 17997, 25843, 19973, 32326, 44383, 22973, 8312]
306H312K7538J3247l6657j9879K7095M300l7828r350K5866q615l3141P795K0301
319a1016k0652j4488K7869R434k9280J367L7082M040k2800J0298K6928k250j0359
332F173J2919J2353n716o08P654o588q721R791M449k0676j4317J3518J800k5762
346a3731r138J7490m263k6063J369J8935p397j4514J2048J2101r142o66J7680
359e291N884n211P693J2281j616q29J1400O975p159l815O972J998q429n124P31
374A6460m938q307j605m486j1964j263Q237j0048j9590O197K0021n580j9679N243
388c1302K1171O157r236l183J2749J8150L978j3014l928K1588J8508j3846k1886
401E906Q224K4517k613k8942j0075J9526P060k3416j8978O521R295o298j2111
$$ y = [8312, 35850, 49097, 12440, -7439, 19656, 23956, -13872, -23222, 2644, -5971, -39112, -31317, -11016, -31668, -46156, -18287, -8853, -38133, -36766, 316, 4356, -18444, -8146, 18782, 16532, 6173, 19092, 31445, 25729, 25121, 32775, 26187, 17466, 27257, 31706, 11030, -3287, 10231, 12031, -13731, -22869, -5379, -9642, -35705, -34336, -15401, -22798, -37312, -25264, -13163, -22305, -22971, -5291, 593, -4618, 3075, 15356, 13740, 12911, 24311, 31286, 24127, 20312, 27284, 29282, 20853, 15729, 16460, 11522, 3215, 1610, -2876, -14840, -16103, -7866, -17914, -37504, -31307, -11286, -16866, -36545, -31302, -10131, -3974, -13210, -16393, -3644, 14506, 18484, 5470, 1542, 23130, 41638, 27792, 5906, 14130, 38647, 36034, 7092, -2983, 16543, 23603, 187, -18791, -12270, -2975, -9273, -21384]
414b1384q897M22J1701N765j2687j0022J4837J9663l293j3395O401K1535Q784
427A9430j0126n349J2978J2841l553o903Q23K87j409L863l030j5871q156J0583
441F408M872j9423j9118P537J7309p183k5055m115K2129J2017j3790j2712P600
454b3524J8307J2820m031j6613J363L5075K0081l1852l0044L4020M7940k2605
466D0937n9148N826O1081O736o4854k9107M7659L1680m0916m3700J5330L2051
478C575k722k6005j6355Q140K6179J2277k5393k6386K5569M7809o537m8466J69
491b8146N8817K2142m8153k7439M4228L6764l0616l6537J6486K7406j0194k1769
503B989l099K227l106N64j938j5791j0531J3868J3430j8721k1301J6700K6383
$$ y = [-21384, -30281, -29859, -18158, -12393, -25080, -35102, -20265, -602, -3895, -17290, -10889, 10646, 19430, 9304, 3955, 16933, 29774, 26221, 19318, 20141, 20428, 19019, 22882, 19852, 3981, -4175, 6408, 11280, -8143, -27261, -19724, -2415, -9598, -34653, -38768, -16639, -4622, -18412, -31124, -23524, -5217, 7603, 3572, -13041, -11678, 23397, 43478, 11626, -18418, 15602, 63542, 40937, -18211, -12385, 48696, 55432, -9422, -38529, 9130, 40810, -106, -43806, -28476, 3575, 853, -25152, -41507, -33367, -7188, 5089, -20304, -46690, -21121, 26688, 20151, -28315, -28146, 30671, 52813, 4660, -22779, 21449, 58213, 27597, -8940, 7546, 34952, 24758, 2989, -110, 2117, -989, -425, -2363, -18154, -28685, -14817, -1387, -20108, -41409, -24709, 1674]
516A674j1584k2394J5502K4951r201j1291K1479J2768k1779k155L7678N852m3848
529b348p707N1798J4816n9562k8222N4883L1303n6665m4742L8804L8160l1706
541a188l9430J1551K2792k407q279p053r799J2573L1868m631m1311K093N8790
554B5569J7930n4186k4895N7239M2084m3075m5246L1959M5833j7767m2402N59
566f398K6537M997j9235j7302k400R926Q200j0991k2567k592K3120J1121k4050
579b1634k1028K3505L1784j4301l1804J6379L9575n446l1288J0694L5279n709
591B6006k8322J1968K9030j3907l0299J5172K8540k1292l5448J5364K9361k0883
603E290l3617J0971K2234j2203j8257M202N012k418P257M348j5387l564K9153
$$ y = [1674, -9910, -32304, -16802, 8149, -1052, -12343, 9136, 21904, 125, -2030, 35648, 41500, -2348, -10055, 41743, 56559, -3003, -31225, 23658, 54961, -1704, -46446, -7642, 30518, -1188, -40618, -29067, -6275, -8682, -16961, -24014, -33813, -21240, 10628, 5997, -35314, -33221, 25569, 43499, -10687, -35582, 21657, 63741, 20666, -24580, 7379, 53212, 35445, -6957, -6398, 20139, 25136, 5901, -11401, -13801, -3875, 4325, -6666, -29233, -31825, -8705, 2416, -21634, -42662, -19157, 12627, -1674, -33478, -17099, 22476, 17030, -14258, -3564, 31715, 26006, -2316, 9652, 38682, 24775, -5524, 9648, 38188, 16896, -18552, -3188, 26173, 5290, -28327, -17356, 4878, -7325, -25582, -21380, -16368, -18786, -11529, -7181, -22568, -26132, 3021]
616C021J4331k7269j4816L5290K7764k5561k7093K2420L2589j0443k8702O9K0328
629B1928N509j3906j6739l463J3260P977j8464k2798P132K2416l500k6158q354
642c5160K1372J7191j2747k1603Q113K9475O222k4047p408K7725J9173j6988j7179
655e861J6479K1086r688j6921O101J1213p429q754L092k057j0355K73N603r352
669f570j2363N770P541q926q701O436O118l201P7M537J48J107R095M619n512P74
685I49J2885N420r008k485J1102L930r341m404N199j383o300j154j669p272k096
700e627L283m812r660R25O209k524o432N74O099K611n26k77K452O630N751r57
716C719k816O495J0051j780q011L245J0889k537j1739K14Q287l482j1693j887
$$ y = [3021, 17352, -9917, -24733, 10557, 38321, 12760, -14333, 8087, 40676, 30233, 1531, 1600, 21928, 27437, 13531, -3208, -6671, 6589, 14566, -3898, -26696, -19564, 2852, -648, -26806, -35160, -13788, 3403, -9344, -30947, -22834, 6641, 12863, -11184, -18592, 9133, 28306, 11318, -5861, 10618, 31704, 22016, 5095, 11196, 22409, 14980, 6226, 9318, 7261, -3094, -2821, 2782, -6570, -18933, -13163, -5622, -14548, -23249, -16813, -10695, -13896, -13819, -9282, -9134, -8027, 1068, 5687, 175, 949, 13834, 19254, 10246, 7761, 18863, 22793, 13452, 9048, 14247, 12864, 6564, 5410, 3741, -3531, -5627, -2344, -7156, -16816, -15891, -9682, -12206, -18638, -18064, -11965, -9354, -9880, -10157, -7705, -1075, 4676, 3719, 903, 7398, 17449, 15669, 7658, 10903, 21792, 19255, 7516, 7730, 16017, 12535, 842, -1045]
730a045M172m080o837j861o79j669l13j633k794J417M876K1k820L918O796J303
746a228j003M082N994O95l92M046K994k505m44M370j093o989j181M619l226r377
762f38k245L513l234o764k637Q10K95j375k565j691L878M751j018k591M140P802
778D31J625j720J998O720K864j714R1K925J333p90j09k955l028O74J074o691o762
795d034K203J896o319o661R84K861k057l845l65L317L032Q08j471J718O141M530
811B738j159j679N946P303j089n145L115P137j442p475K98L820k291n740k458
826A879o93j752k091l480m470J36K535k908n132J946N248j24l394K706O024J905
842a665n31K584M148J561J539K745Q32j744K346L516l110m997J852K165n094n481
$$ y = [-1045, 3127, -953, -7790, -9651, -10330, -11999, -12312, -13945, -16739, -15322, -10446, -10425, -13245, -9327, -2531, -1228, -2231, 1851, 7845, 8540, 8148, 12194, 15188, 12683, 12239, 16609, 15516, 8527, 7346, 11965, 8739, -638, -2883, 630, -2604, -9368, -12005, -11195, -10900, -12275, -14840, -16531, -12653, -7902, -8920, -11511, -7371, 431, 2056, 336, 2334, 9054, 11918, 10204, 10295, 13220, 14553, 13763, 13654, 10699, 7671, 8345, 9419, 2728, -4034, -1831, 65, -6254, -12915, -11931, -9070, -11127, -14972, -15337, -12020, -8988, -8180, -9651, -7933, -1792, 2738, 1579, -100, 5846, 13149, 12060, 6915, 10030, 17167, 15725, 8250, 8548, 12368, 10077, 4337, 1879, 1186, -566, -2657, -6137, -10607, -10471, -7936, -10844, -15976, -14030, -8782, -8906, -12300, -9594, -3570, -1665, -2196, 388, 4536, 6097, 7636, 10381, 11213, 9469, 11815, 15331, 12221, 7224, 9076, 11241, 6147, 666]
858F66J48K94m237l099j321k383j377J603q77l564O07N493J348k992J641N715
874b335K885k4J804K935J458K453L115j880k970M452M956o145p965M129N348p010
890E206r176J578K829l994m362j200j634K1K134j110n318J730Q553J538o817J118
906h904J0527M150n297n1P030L588j446j37J154p07J467J509m907m473L146R61
922G610o690m209J857j866m617R20O05o054j948P691J426r616j31J2317L175q885
938h415K36J2160L013n966K395O813k057q73O916o84j0338K122J2792n442j7898
953e226K749J5083n329j8818N95J2204k536j1355j005M837J02o17J266k572j152
968a1774P770O632o233m472R865R762m580o824M850Q544N27n544l478K658N928
$$ y = [666, 814, 1108, -3129, -6228, -7549, -9932, -11309, -9706, -10583, -14147, -13540, -8047, -6699, -9691, -8050, -2335, 550, 526, 2330, 5265, 6723, 9176, 12291, 10411, 7441, 11893, 16849, 10704, 2739, 6868, 12216, 5206, -3970, -2392, 437, -3557, -7919, -9119, -10753, -10732, -8598, -9708, -15026, -13296, -4743, -3205, -10022, -8904, 1623, 5773, 476, 425, 7455, 11043, 9597, 9460, 10614, 9907, 11374, 12883, 7976, 3503, 6649, 7610, 920, -3289, -1432, -3298, -7915, -6995, -6390, -12444, -14392, -6701, -5275, -14891, -15022, -2705, 470, -8415, -8179, 3981, 6994, 1028, 3423, 10236, 8179, 7306, 14222, 13538, 3200, 5322, 18114, 12672, -5226, -2477, 12606, 7277, -11541, -10946, 1258, -1278, -12633, -13638, -8801, -8699, -9316, -8050, -10622, -11774, -4004, 2628, -3605, -8077, 1788, 11550, 6970, 146, 4996, 13540, 14067, 8523, 5045, 7703, 13631]
983A3631k335j0316k376Q161j70j2504k881Q367k399j0152K554O909p231o304
997a7046J0534O989j2295l649J6841N892j4296r21J7913K446j3557L623J4369
1010A6843n925j0369J1085P678j5871p404J7373K853k2774n318K0011R05k2107
1023a3020l606J6033J009j4182p91P870o58k444M471O49n062N447J0782l553r236
1038f291P106J3302k474r994J661R232K121o040o202Q75P314P79j2481o550R802
1053B160N037j3653q415R909N419j1048m369R290M84p641M928Q664p013n100J3735
1068B387P539j3645l184J9086M398j7019r6J8025j910j6698M579J3658j0012j2973
1082e865J0330P062j5257p800J3109J831j5725j767J2621k129j1574M260R496
$$ y = [13631, 11296, 980, -1396, 6765, 6595, -5909, -8790, -423, -2822, -12974, -10420, -3511, -10742, -17046, -6512, 477, -11818, -15467, 1374, 7266, -7030, -7951, 9962, 12408, -1149, 2474, 16843, 10918, 549, 11634, 19312, 3441, -3963, 13410, 16263, -6511, -11829, 8182, 9087, -13020, -16626, -593, 416, -13766, -14557, -6687, -7345, -9789, -5318, -4669, -9731, -4284, 6498, 2945, -6291, 815, 14117, 11643, 1649, 3310, 12542, 14663, 8623, 2421, 3296, 10610, 11389, -1092, -7642, 2160, 7197, -6456, -14871, -4962, 457, -10591, -14960, -5670, -5186, -12827, -7899, 765, -6248, -11348, 2387, 9926, -3719, -6903, 12183, 16581, -438, -534, 17491, 15581, -1117, 3462, 17120, 7108, -5865, 4465, 11527, -3730, -11530, 1579, 3410, -12315, -14082, -1461, -3590, -15164, -10904, -1408]
1095a408n351n147R410M648p936J058J2252l77q800M645R974l194o285M005L962
1110A1456m027j332J321m440k143M592j921j0285K79Q497m293j1367L618Q931
1124a114n519p609O489O334o124j284Q791J002o453N517R633n978o297J0659P088
1139A5135j1042l510J1846J530j2867p0R926m412j1419M286O016r060o151P745
1153b047J172j0783M1R909l052r352O291R080o070n706J0103O616p951j449J0792
1168G594J240p242L148P237m244n027O224J776q581p03O765m091q885K397N617
1183C225o704o758N795K799p686j891P158r4o456L685P212l671l698P672M579
1198E167n366m35Q272L94n742L312N698m387m040N805J191q229j611O917l199
$$ y = [-1408, -6759, -11906, -2496, 2152, -5784, -4726, 7526, 7149, -1651, 2994, 12968, 9774, 3489, 7494, 11456, 7429, 6097, 7418, 2978, 835, 5427, 3506, -6779, -6500, 1997, -2296, -13663, -10045, -1114, -6633, -14242, -7753, -1419, -7543, -8827, -36, 966, -5487, 30, 9663, 3685, -2612, 8047, 15135, 4093, 583, 12429, 13959, 1092, 1022, 10948, 6536, -4883, -597, 5419, -3641, -9792, -2047, -875, -11658, -11617, -1708, -4760, -14112, -7821, 1259, -4811, -10517, -414, 6202, -1749, -3198, 7594, 8834, 1592, 4740, 11977, 7733, 2706, 8930, 10706, 2125, 1422, 8187, 4096, -4789, -2392, 3225, -3479, -10237, -4442, -1643, -9329, -11220, -4062, -4156, -10612, -6927, 285, -3386, -7084, 588, 5167, -199, -634, 7638, 8032, 2290, 5602, 11300, 6913, 2873, 8678, 9869, 1640, 29, 6946, 3747]
1213C747r456K478N551o322o557N276L225o746k083P596Q0o385K908Q017k642
1228a313m646O293O519n470j724P776K086o284J335N963k633n487L617K609o832
1243A809k822M755o92p917l8M812l190o186K815L902m395k786N591J904m444J356
1259e526O635p65m050M565N559l276j976N683K061m490J67M609k349m341K415
1274D921J855n538l299M389q22o915n55M453j903n778J632M571l306k612M249
1289d658K586l306J138N411j89k897L944M612l245j317M790K101m823k89M609
1304H467j746n045J120K544m040l952K815J94n009j657L357r17m786J406M240
1319c009k327l061M061L937k850r15N247J934k790J358M350n86k136K622K250
$$ y = [3747, -5709, -3231, 2320, -4002, -10559, -5283, -2058, -8804, -10887, -3291, -3211, -9596, -6688, 1329, -1313, -5959, 334, 6853, 1383, -341, 7435, 9521, 3237, 4572, 10535, 7902, 2415, 6032, 8641, 1809, -1013, 3742, 3050, -4867, -4905, -93, -3283, -9469, -6654, -2752, -7147, -9933, -4342, -2438, -6882, -5526, 1109, 344, -3706, 859, 6418, 3142, 1166, 6849, 8910, 4420, 4587, 9196, 6847, 2506, 4921, 6776, 1238, -2061, 2328, 1506, -5409, -5964, -1511, -3414, -9192, -7560, -2989, -6295, -8907, -4658, -2072, -5378, -4240, 1171, 982, -1915, 2029, 6641, 3396, 2079, 6869, 8970, 4147, 3858, 8467, 6721, 1676, 2796, 5340, 1300, -2652, 163, 357, -4652, -6309, -2952, -3869, -8655, -7249, -3009, -5336, -8397, -4336, -399, -3249, -4164, 1083, 3017, 227, 1585, 5935, 5349, 3213, 5835, 8085]
1334H085l083j260K634n73m146L0J803k738l272P09Q13l280j528J706l77k517
1350f994N45K430o41j355K805K325j496P53L487R81j885J959L380j414j674L096
1366F302J460l775j168K910m21m466r90K640j820m164J02J660k282k539J760R00
1382c891k392l54L048M40j967J821L160K62j340K649K615q23JJ445P95o69K20
1399E020N43j079j025M04n25k264o42Rj444k021j87j80j219r95J213l05j296R60
1417e033K308n94r15K219K818n32n19K744J703r89J91K224Q3j660L45J622j682
1434D333k501O86J136k662l293Q48J152k241k524N75J338j585j236Q54J434J98
1450c488m84J232J110N84R15J414P14L33P40J360P11p04m95J081N68j821j890
$$ y = [8085, 5002, 3742, 6376, 5803, 1657, 1687, 3490, 752, -2520, -1811, -998, -4278, -5806, -4100, -4477, -6994, -6449, -4019, -4660, -6015, -3210, -885, -2381, -1628, 1859, 2840, 955, 2914, 6294, 4880, 3206, 6302, 7762, 3987, 2819, 5729, 5308, 842, -148, 2492, 672, -3492, -3390, -1730, -4012, -6551, -4791, -3891, -6283, -6637, -3589, -3149, -5116, -3295, -135, 127, -1213, 1436, 4051, 3228, 3229, 4674, 5469, 4800, 5020, 5563, 4484, 3459, 3863, 3338, 1074, 432, 441, -1003, -3024, -3211, -3391, -4610, -5605, -4392, -4697, -5993, -5033, -2725, -3319, -4234, -2015, 803, 271, -248, 2496, 4199, 3210, 3401, 5625, 5708, 4048, 4393, 6015, 4333, 1832, 2518, 3654, 992, -2301, -1453, -301, -2542, -5066, -4491, -3153, -4738, -5974, -5120, -3686, -3488, -3972, -2740, -1630, -1046, -131, 1283, 1997, 2330, 3070, 4430, 5141, 4437, 3942, 5023, 5591, 3770, 1880]
1467A880J018L80k554j973K89K26j946j751P12N08k069l99J726M48j634P68K842
1484a529N45j560J599L387j1j702J976K440r23j520J673J521j460j982J088N84
1500D126k655j716J090Q7l386j450J975j04l132o73K560J79j933k49K998M82r78
1517b779Q36K575M92n69J066K160j00j008J449J515j508j574J342J042k381j874
1533F84N75O75k443j944L83N93j753j834R46R68j189j084J962J158j179M02K533
1550e47J022j293R70K951K68j510J012K240m34j751M74J499j511j908J51Q28k085
1567C76j982M87K73j902j279J041N08j866p03J783O07j202M29J794O52l00Q55
1584d29J739N43p6N80J613o9p10M02J067n70j508J20J43r82j894k61K72j239j557
$$ y = [1880, 2898, 3278, 724, -1249, -960, -734, -2680, -4431, -3719, -3211, -5280, -5679, -3953, -3505, -5139, -4371, -1529, -984, -2544, -945, 2442, 2431, 729, 2705, 5145, 4222, 2702, 4375, 5896, 4436, 2454, 3542, 4126, 1471, -245, 845, 932, -2454, -3904, -1929, -2033, -5165, -5838, -3278, -3099, -5032, -5281, -2283, -1801, -2779, -1943, 632, 1124, 555, 1621, 3781, 3681, 2673, 4122, 5637, 4129, 2555, 3897, 4939, 2558, 684, 1259, 1934, -509, -2453, -2070, -1477, -3230, -5064, -4118, -3150, -4339, -5423, -3461, -2303, -3482, -3080, -547, 475, -818, 152, 3103, 3371, 1861, 2873, 5113, 4679, 2928, 3402, 4901, 3390, 1482, 1633, 2461, 376, -1606, -1119, -846, -2748, -4027, -2986, -2478, -4344, -5047, -3264, -2657, -3859, -3430, -1636, -984, -1284, -429, 1310, 1853, 1777, 2357, 3970, 3901, 3191, 3593, 4660, 4090, 2582, 2702, 2845, 1863, -31, -292, -20, -1259, -2816]
1603b816q6Q8n09q95J37R65m30l47J432P76k00M18J746J083k10R4J704R10j047
1622B813M45J153l34j107j22N06r01j411l67P1j084j437j61j96q09r38M18J12
1640c349m71l7P90N82M0N96J031P71M48L94J180M83J60K01M62O38n78m48J79l15
1660B757n07r71j91o67j062p84m06k86n74p24L02J1n49j6R74M11m72R71J217J47
1680d19K71J070P59M37J17Q53J66J92j42%J34r72m16l83o00r38o86j76m89q98
1700b120p85K9j13k63k24O05K03pJ80Q49J072K15L31J107P27n9L42J090K66p38
1720B707K65N10n09o98j18o6o41j362l12P4j094q97o12L18k96p25L48K86L0m5
1740b837Q24O47J4P29J088M78j31P45Q52M25q8j30K34L61l03p33q8k23q16p84
$$ y = [-2816, -2902, -2814, -3323, -4218, -4081, -3116, -3546, -3893, -2461, -1685, -1885, -1467, 279, 1362, 1152, 1246, 2950, 3860, 2813, 3258, 4411, 4077, 2970, 2848, 3354, 2453, 1042, 675, 746, -338, -1775, -1936, -2132, -2941, -3879, -3461, -3349, -3820, -3857, -3067, -2485, -2445, -1849, -818, -47, 401, 795, 1975, 2458, 2618, 2819, 3281, 3919, 3341, 2893, 3072, 2757, 2250, 1279, 1088, 421, -641, -1425, -1831, -2117, -2691, -3415, -3113, -3102, -3651, -3667, -2693, -2282, -2754, -1783, -566, -419, -148, 922, 1681, 2118, 2235, 3088, 3254, 3446, 3304, 3304, 3438, 2466, 2050, 1667, 1067, 129, -557, -733, -1222, -2120, -2905, -2876, -2989, -3252, -3476, -2871, -2668, -2675, -2495, -1646, -574, -359, -28, 1079, 1806, 1747, 2089, 3179, 3445, 2707, 2972, 3482, 2973, 2275, 2157, 2091, 1450, 88, -224, -150, -1244, -2141, -2753, -2435, -2731, -3456, -3108, -2822, -2792, -2837, -2013, -1366, -1352, -623, 465, 943, 812, 1557, 2409, 2834, 2746, 2616, 2850, 3211, 2908, 2175, 2087, 1864, 1048, 264]
1760B64j44o56m74o50l83l92m17j79j8N34k73N9P00N06K25M71J028K28L83M66
1780A278J155Q7k08O5O81p0n51J10j84n05r17k83l32q22p21L9m86q54m07J33K73
1801b519k69L0M57L03J96P08N28K35P65N71L64N89L94J73m8N02k98m2n60K09l94
1822A894q31n50j4n02j221R0l07n94o81J69L83n96l23O01R43j29O8J131M75K93
1842B99L9J310O71o35N33Q84k68p61rP78n90r89n8q0n23j081l2j82r50o75K95
1863b024J01o53k55O09J48pJ33M94N33Q72Q6N18O27M88k05N41M81j16m0j6N33
1884B848q65p48q8K5o64q03k85N1o31j287O32P5q28n51J167K40o82L06J353J66
1904e69o05Q18J376K12n52R88R77m83n72N86O66q20l40J59j69r57n27J19l93q70
$$ y = [264, 120, -536, -1010, -1660, -2043, -2435, -2852, -3031, -3049, -2515, -2788, -2729, -2029, -1523, -1298, -827, 201, 429, 812, 1278, 2433, 2520, 2312, 2377, 3058, 2988, 2437, 2547, 2363, 1858, 941, 658, 326, -496, -1217, -1178, -1664, -2518, -2925, -2792, -2519, -2788, -2758, -2301, -1998, -1802, -1094, -566, -331, 434, 1005, 1369, 1958, 2352, 2525, 2477, 2979, 2681, 2639, 2079, 2288, 1894, 1063, 513, 499, -3, -1224, -1134, -1441, -2035, -2716, -2547, -2164, -2760, -3083, -2482, -1539, -1668, -1600, -469, 6, 299, 338, 1648, 2319, 1684, 2217, 3101, 2833, 2072, 2063, 2841, 2251, 1262, 1204, 1124, 601, -480, -512, -694, -1644, -2319, -2024, -1923, -2576, -2831, -2222, -2074, -2081, -1948, -1454, -921, -49, 37, 555, 1182, 1670, 1465, 2006, 2487, 2371, 2331, 2315, 2848, 1983, 1235, 1147, 1172, 508, -295, -580, -529, -1160, -2447, -1815, -1740, -2568, -3119, -1952, -1712, -2394, -2088, -735, -569, -1174, -356, 1020, 1232, 680, 1668, 2645, 2162, 1590, 2176, 2842, 2022, 1682, 1841, 1672, 715, 188, 307, -86, -956]
1924i56o49L64m11n41j42M00j92o4KN42N16J72L29P36N23j8k4O20O51J94k83M75
1946B244J72n17k37J90O0j110p76M83l11j361l73Q09n74j039J20M84q0r63P50
1965b029Q77l03j21R37R18k57k12J294N82k73j23J020K13q06j7O03j29j045k71
1984H58J39o74n30j03l51p46l87J55N2o88K17M7K14O7N01j09Q34M18n9O61L87
2005I03K01l0K52P42J29m95K1K96j24j009l5K09o83q95J47K30j005q86M43J63
2025a426o73k76O27K09m80J40J131K03k90M11J112j14n5N29R40l40j88M54K21
2044B135l90n71L62j16q73m19N2l65n41n00J01o69j13K08j67J12R6j65O23O9M30
2065g01K04K15O74L39J99J85M52J93o19P01M27l62o16Q9K61q33q69L48k40r59
$$ y = [-956, -1605, -1241, -1652, -2193, -2335, -1935, -2127, -2191, -2189, -1647, -1131, -959, -630, 106, 629, 611, 587, 1207, 1858, 2052, 1769, 2244, 2416, 1899, 1662, 1852, 1912, 802, 26, 509, 198, -1163, -1536, -727, -1301, -2340, -2220, -1736, -1816, -2779, -2029, -1152, -1455, -1576, -639, 279, 22, -190, 1104, 1686, 1413, 1290, 2310, 2523, 1717, 1700, 2303, 2174, 1129, 858, 997, 323, -207, -310, -661, -1407, -1794, -1639, -1587, -2275, -2058, -2011, -1797, -1730, -1229, -1338, -504, -86, -145, 516, 903, 1104, 1074, 1326, 2068, 2197, 1702, 1723, 2019, 1895, 886, 851, 1060, 377, -518, -371, -141, -1146, -2032, -1589, -1426, -2099, -2375, -1748, -1539, -2019, -1879, -748, -545, -835, -424, 688, 574, 519, 1048, 1988, 1648, 1460, 1914, 2135, 1745, 1174, 1536, 1420, 547, 128, 180, -185, -726, -1226, -1125, -1794, -1907, -1699, -1866, -1754, -1658, -1823, -1200, -1131, -701, -497, -282, 392, 731, 930, 1115, 1567, 1760, 1141, 1842, 2269, 1907, 1291, 1380, 1641, 808, -61, 287, 47, -912]
2085i12j30K21k51j037J77Q33o61l50N05P31r7l63Q53O81k59J91J071J08k00K27
2105A338M57j0o42L91L12o37l71K5j31p47j32j47l19m40k16j64j01l48M39N8m45
2126a830Q57LJ06l2O60O50l65M65P16L8m61O81N17o00k71O29l2j041k10N30o73
2147C37o60QK67r33q64O41L33j172J15R05j11m40K52R51n6l56P75P05k69J38P49
2168A315K82p50M01N18l5n31k7J77n78o67O19o91m38k69K89p31n89L42L58p59
2188a764n0Q23j89j85O31R21m92l23J002N86n25K44Q71L02q15K55R38p57q02M25
2208A096M51j085n85O82l59j140p1N54m44q36k7J025p07m28O62M01l12M9Q43L67
2228A36m39P21O38j04k82Q17J1l67k49N52l20l78N78m08m43n95J27j30o22m08
$$ y = [-912, -1042, -821, -1072, -2109, -1932, -1099, -1760, -2110, -1605, -874, -971, -1334, -481, 200, -59, 132, 1203, 1311, 1111, 1338, 1795, 1785, 1143, 1534, 1846, 1209, 838, 863, 732, -15, -147, -294, -613, -1053, -1269, -1433, -1534, -1882, -1443, -1385, -1830, -973, -970, -864, -896, -236, 414, 49, 514, 1230, 1268, 807, 1488, 2005, 1405, 1134, 1763, 1731, 690, 480, 1010, 337, -323, -315, -48, -981, -1845, -1204, -871, -2043, -1928, -1023, -1134, -1574, -1322, -371, -427, -783, -8, 697, 428, 566, 1315, 1597, 847, 1248, 1766, 1731, 1200, 1173, 1350, 772, 105, 724, 33, -405, -674, -385, -1116, -1705, -1363, -1005, -1764, -1814, -991, -1180, -1365, -734, 187, -305, -628, 374, 960, 435, 679, 1550, 1852, 1037, 1292, 2230, 1473, 671, 1096, 1547, 462, -123, 559, 200, -940, -1011, -457, -901, -1737, -1764, -739, -1446, -1874, -1212, -811, -1123, -1074, -231, 136, -303, 418, 1056, 952, 670, 1487, 1498, 1131, 882, 1434, 1114, 736, 1314, 906, 463, -132, -5, -135, -757, -1165]
2248a165N40m08n54N24M7o09L1P01L80l54M1P92R7k57O62P93m43r0O41K82l23
2269A328l82N79m17p73K33L41m50q51L50n1q61j24M5Q7o84J03N77l02j50K83O71
2290d48Q3j81N02L27j68K81N29m6PM26J54m20j50M90l96m92p9qm14m84L67j51
2312b71o51k52M85l29m21J97L45m0n61R78M68k79k14R74K43l52K55Q03m17j40
2332H21J35N76j92l09m27N93q90k11K09m20n33L2rk07m06R3L20o24K64K16k2o3
2354a054M50M71p5J90L92K53k0J69O21m82P3K83J39m69k9J57k48p59K29ql28q69
2376i14N20k41k47o09M89J56o56L78M77J28l59K82O58q5j39N87N56k42j53O34
2396A220K08k57k12M22l78m35R3j5m69J6l50k50l64Q5j72J37k58Pj76K09R3m5
$$ y = [-1165, -625, -1033, -1587, -1063, -1016, -1625, -1594, -893, -513, -867, -826, -34, 63, -194, 468, 1261, 818, 728, 1369, 1651, 1328, 946, 1525, 1108, 335, 568, 909, 459, -392, -42, -93, -954, -1078, -1033, -946, -1630, -1527, -950, -1252, -1402, -1119, -448, -365, -546, -44, 283, 115, 396, 925, 879, 886, 1312, 1466, 1046, 896, 1386, 990, 498, 419, 411, -3, -487, -120, -271, -922, -1174, -689, -1018, -1439, -1242, -897, -937, -1498, -520, -52, -331, -545, 429, 672, 320, 575, 1378, 961, 821, 956, 1532, 1340, 1031, 604, 1197, 307, 96, 305, -115, -648, -616, -625, -832, -1238, -1145, -825, -1449, -1185, -969, -991, -1054, -604, -133, -208, -18, 374, 627, 607, 776, 1397, 915, 988, 1271, 1410, 941, 912, 1069, 821, 62, 291, 283, -45, -914, -394, -635, -882, -1491, -1002, -846, -1502, -1124, -647, -519, -878, -596, 62, -23, -162, 425, 981, 739, 586, 1220, 1428, 1171, 959, 1381, 1003, 568, 661, 646, 177, 193, -157, -407, -771, -686, -858, -721, -979, -972, -1148, -939, -846, -891]
2418h91J76L71L17P3m7L31N88o9k86K99M12l71l91P12k96l60kLj17m60m08M21
2440Em85o38M07Kk34m27M27K84m6l61O33p3p0M55L54K55k73L20M83k68J36J22
$$ y = [-891, -715, -344, -27, 46, -1, 330, 918, 849, 563, 862, 1274, 903, 512, 1224, 928, 568, 566, 569, 452, -8, -416, 5, -480, -1118, -711, -709, -943, -1370, -943, -659, -705, -1066, -433, -506, -576, -121, 233, 488, 215, 535, 1018, 750, 886, 1008]
$$ [...]
8191b2
##END NTUPLES=NMR FID
##END=
