##TITLE=1H_Pr 37-88
 CDCl3
 8 sc, 
 20.2.2023
##JCAMPDX= 6.0         $$ Bruker NMR JCAMP-DX V2.0
##DATA TYPE= NMR FID
##DATA CLASS= NTUPLES
##ORIGIN= UXNMR, Bruker Analytische Messtechnik GmbH
##OWNER= root
$$ XWIN-NMR		Version 3.5
$$ Mon Feb 20 14:21:56 2023 Russian Standard Time (UT+4h)  she@DPX200
##.OBSERVE FREQUENCY= 200.13135
##.OBSERVE NUCLEUS= ^1H
##.DELAY= (6, 6)
##.ACQUISITION MODE= SIMULTANEOUS
##.ACQUISITION SCHEME= undefined
##.AVERAGES= 8
##.DIGITISER RES= 18
##SPECTROMETER/DATA SYSTEM= spect
##.PULSE SEQUENCE= zg30
##.SOLVENT NAME= CDCl3
##.SHIFT REFERENCE= (INTERNAL, CDCl3, 0, 15.7039)
##AUDIT TRAIL= $$ (NUMBER, WHEN, WHO, WHERE, WHAT)
$$ ##TITLE= Audit trail, XWIN-NMR		Version 3.5
$$ ##JCAMPDX= 5.01
$$ ##ORIGIN= Bruker BioSpin GmbH
$$ ##OWNER= she
$$ F:/spectra/data/she/nmr/H-F/1/audita.txt
$$ ##AUDIT TRAIL=  $$ (NUMBER, WHEN, WHO, WHERE, WHAT)
(   1,<2023-02-20 14:20:46.84 +0400>,<she>,<DPX200>,
      <created by zg, POWCHK disabled, PULCHK disabled
       configuration hash MD5:
       00 E9 B6 7A A2 85 ED C7 34 08 36 98 17 FE 4E 26
       data hash MD5: 16K
       90 75 D1 C4 8A 88 3E 70 D9 0D 93 70 C4 3D E4 AA>)
$$ ##END=
$$ 
$$ hash MD5
$$ D5 00 E4 E2 19 0B 4C 64 49 E0 F2 43 29 38 65 63
##$RELAX= 
##$RELAX= 
##$RELAX= 
##$RELAX= 
##$RELAX= 
##$RELAX= 
$$ Bruker specific parameters
$$ --------------------------
##$DU= <F:/spectra>
##$EXPNO= 1
##$NAME= <H-F>
##$PROCNO= 1
##$TYPE= <nmr>
##$USER= <she>
##$AMP= (0..31)
100 100 100 100 100 100 100 100 100 100 100 100 100 100 100 100 100 100 
100 100 100 100 100 100 100 100 100 100 100 100 100 100 
##$AQSEQ= 0
##$AQ_mod= 1
##$AUNM= <au_zg>
##$AUTOPOS= <>
##$BF1= 200.13
##$BF2= 200.13
##$BF3= 200.13
##$BF4= 200.13
##$BF5= 200.13
##$BF6= 200.13
##$BF7= 200.13
##$BF8= 200.13
##$BYTORDA= 1
##$CFDGTYP= 0
##$CFRGTYP= 5
##$CHEMSTR= <none>
##$CNST= (0..31)
1 1 145 1 1 1 1 1 1 1 1 1 1 1 1 1 1 1 1 1 1 1 1 1 1 1 1 1 1 1 1 1 
##$CPDPRG= <>
##$CPDPRG1= <>
##$CPDPRG2= <>
##$CPDPRG3= <>
##$CPDPRG4= <mlev>
##$CPDPRG5= <mlev>
##$CPDPRG6= <mlev>
##$CPDPRG7= <mlev>
##$CPDPRG8= <mlev>
##$CPDPRGB= <>
##$CPDPRGT= <>
##$D= (0..31)
0 1.2 0 0 0 0 0 0 0 0.06 0 0.03 0 0 0 0 0.0002 0 0 0 0 0 0 0 0 0 0 0 0 
0 0 0 
##$DATE= 1676888446
##$DBL= (0..7)
120 120 120 120 120 120 120 120 
##$DBP= (0..7)
150 150 150 150 150 150 150 150 
##$DBP07= 0
##$DBPNAM0= <>
##$DBPNAM1= <>
##$DBPNAM2= <>
##$DBPNAM3= <>
##$DBPNAM4= <>
##$DBPNAM5= <>
##$DBPNAM6= <>
##$DBPNAM7= <>
##$DBPOAL= (0..7)
0.5 0.5 0.5 0.5 0.5 0.5 0.5 0.5 
##$DBPOFFS= (0..7)
0 0 0 0 0 0 0 0 
##$DE= 6
##$DECBNUC= <off>
##$DECIM= 32
##$DECNUC= <off>
##$DECSTAT= 4
##$DIGMOD= 1
##$DIGTYP= 9
##$DL= (0..7)
0 120 120 120 120 120 120 120 
##$DP= (0..7)
150 150 150 150 150 150 150 150 
##$DP07= 0
##$DPNAME0= <>
##$DPNAME1= <>
##$DPNAME2= <>
##$DPNAME3= <>
##$DPNAME4= <>
##$DPNAME5= <>
##$DPNAME6= <>
##$DPNAME7= <>
##$DPOAL= (0..7)
0.5 0.5 0.5 0.5 0.5 0.5 0.5 0.5 
##$DPOFFS= (0..7)
0 0 0 0 0 0 0 0 
##$DQDMODE= 0
##$DR= 18
##$DS= 0
##$DSLIST= <SSSSSSSSSSSSSSS>
$$ [...]
##$SUBNAM2= <"">
##$SUBNAM3= <"">
##$SUBNAM4= <"">
##$SUBNAM5= <"">
##$SUBNAM6= <"">
##$SUBNAM7= <"">
##$SUBNAM8= <"">
##$SUBNAM9= <"">
##$SW= 18.05172834244
##$SWIBOX= (0..15)
0 0 2 0 0 0 0 0 0 0 0 0 0 0 0 0 
##$SW_h= 3612.71676300578
##$TD= 16384
##$TD0= 1
##$TE= 0
##$TE2= 300
##$TE3= 300
##$TEG= 300
##$TL= (0..7)
0 120 120 120 120 120 120 120 
##$TP= (0..7)
150 150 150 150 150 150 150 150 
##$TP07= 0
##$TPNAME0= <>
##$TPNAME1= <>
##$TPNAME2= <>
##$TPNAME3= <>
##$TPNAME4= <>
##$TPNAME5= <>
##$TPNAME6= <>
##$TPNAME7= <>
##$TPOAL= (0..7)
0.5 0.5 0.5 0.5 0.5 0.5 0.5 0.5 
##$TPOFFS= (0..7)
0 0 0 0 0 0 0 0 
##$TUNHIN= 0
##$TUNHOUT= 0
##$TUNXOUT= 0
##$USERA1= <user>
##$USERA2= <user>
##$USERA3= <user>
##$USERA4= <user>
##$USERA5= <user>
##$V9= 5
##$VALIST= <valist>
##$VCLIST= <CCCCCCCCCCCCCCC>
##$VD= 0
##$VDLIST= <DDDDDDDDDDDDDDD>
##$VPLIST= <PPPPPPPPPPPPPPP>
##$VTLIST= <TTTTTTTTTTTTTTT>
##$WBST= 1024
##$WBSW= 4
##$XGAIN= (0..3)
0 0 0 0 
##$XL= 0
##$YL= 0
##$YMAX_a= 835968
##$YMIN_a= -836985
##$ZGOPTNS= <>
##$ZL1= 120
##$ZL2= 120
##$ZL3= 120
##$ZL4= 120
##$ABSF1= 10
##$ABSF2= 0
##$ABSG= 5
##$ABSL= 3
##$ALPHA= 0
##$AQORDER= 0
##$ASSFAC= 0
##$ASSFACI= 0
##$ASSFACX= 0
##$ASSWID= 0
##$AUNMP= <proc_1d>
##$AZFE= 0.1
##$AZFW= 0.1
##$BCFW= 1
##$BC_mod= 2
##$BYTORDP= 1
##$COROFFS= 0
##$CY= 11.3945322036743
##$DATMOD= 1
##$DC= 2
##$DFILT= <>
##$DTYPP= 0
##$F1P= 2.36226072786647
##$F2P= -0.459571619588291
##$FCOR= 0.5
##$FTSIZE= 0
##$FT_mod= 4
##$GAMMA= 1
##$GB= 0.15
##$INTBC= 1
##$INTSCL= 1
##$ISEN= 128
##$LB= 0.24
##$LEV0= 0
##$LPBIN= 0
##$MAXI= 10000
##$MC2= 0
##$MEAN= 0
##$ME_mod= 0
##$MI= 1.114404
##$NCOEF= 0
##$NC_proc= 0
##$NLEV= 6
##$NOISF1= 3.799351
##$NOISF2= 2.8
##$NSP= 1
##$NTH_PI= 0
##$NZP= 0
##$OFFSET= 15.70392
##$PC= 1
##$PHC0= -19110.01
##$PHC1= 9.60078
##$PH_mod= 1
##$PKNL= yes
##$PPARMOD= 0
##$PSCAL= 0
##$PSIGN= 0
##$REVERSE= no
##$SF= 200.130013532006
##$SI= 16384
##$SIGF1= 3
##$SIGF2= 2
##$SINO= 400
##$SIOLD= 16384
##$SREGLST= <1H.CDCl3>
##$SSB= 0
##$STSI= 0
##$STSR= 0
##$SW_p= 3612.71676300578
##$SYMM= 0
##$S_DEV= 0
##$TDeff= 0
##$TDoff= 0
##$TI= <>
##$TILT= no
##$TM1= 0
##$TM2= 0
##$TOPLEV= 0
##$USERP1= <user>
##$USERP2= <user>
##$USERP3= <user>
##$USERP4= <user>
##$USERP5= <user>
##$WDW= 1
##$XDIM= 8192
##$YMAX_p= 0
##$YMIN_p= 0
$$ End of Bruker specific parameters
$$ ---------------------------------
##NTUPLES= NMR FID
##VAR_NAME=  TIME,          FID/REAL,        FID/IMAG
##SYMBOL=    X,             R,               I
##VAR_TYPE=  INDEPENDENT,   DEPENDENT,       DEPENDENT
##VAR_FORM=  AFFN,          ASDF,            ASDF
##VAR_DIM=   8192,          8192,            8192
##UNITS=     SECONDS,       ARBITRARY UNITS, ARBITRARY UNITS
##FACTOR=    0.0002768,     1,               1
##FIRST=     0,             0,               0
##LAST=      2.2672688,     0,               0
##MIN=       0,             -836985,         0
##MAX=       2.2672688,     835968,          0
$$ Real data points
##PAGE= N=1
##DATA TABLE= (X++(R..R)), XYDATA
$$ [...]
$$ plain form
1771 227 30 -10 -2 6 168 59 66 -79 63 -171 -93 168 -118 -154 9 -112 -48 -73 25 -49 -77 -192 -52 -86 42
1796 42 210 -47 -85 167 -112 -61 47 38 -48 54 108 206 106 -3 159 -221 75 55 -5 21 146 -39 -69 8
1820 8 71 -64 -48 134 142 -70 37 116 202 -191 -30 31 4 -275 -115 -4 -240 63 -336 130 -15 27 142 -117
1844 -117 34 -151 -287 -234 227 17 -29 50 170 23 -177 -145 308 323 -178 -58 -23 -35 -55 32 -16 220 -110
1867 -110 52 113 209 102 19 -60 37 153 -109 -19 -42 97 -111 -31 -62 -339 -82 163 -157 74 237 -300 -244
1890 -244 48 191 14 49 -186 -185 163 195 -124 143 146 -67 166 16 185 207 49 152 -22 46 -305 -13 149
1913 149 177 -162 -61 -42 20 140 -202 55 47 108 34 89 -14 133 -232 96 -256 45 116 106 -291 -5 -108
1936 -108 17 -176 56 -281 5 80 97 158 -91 77 -73 155 99 60 83 -111 147 -118 23 -45 226 -105
$$ packed form
1771B27j97m0QQJ62j09Pj45J42k34P8K61k86l6J63j21O4k5R8p4k8j15J40l4J28
1796D2J68k57l8K52k79N1J08rq6J02N4R8j00j09J62l80K96k0o0K6J25j85l0P7
1820HO3j35J6J82Qk12J07P9Q6l93J61O1k7k79J60J11k36L03l99M66j45M2J15k59
1844a17J51j85j36N3M61k10m6P9J20j47k00L2M53J5n01J20L5j2k0Q7m8K36l30
1867a10J62O1R6j07q3p9R7J16k62R0k3J39k08Q0l1k77K57K45l20K31J63n37N6
1890b44K92J43j77L5k35JL48L2l19K67Lk13K33j50J69K2j58J03j74O8l51K92J62
1913A49K8l39J01J9O2J20l42K57qO1p4N5j03J47l65L28l52L01P1j0l97K86j03
1936a08J25j93K32l37K86P5J7O1k49J68j50K28n6l9K3j94K58k65J41o8K71l31
$$ plain form
1958 -105 152 130 -158 52 -4 -103 -307 106 12 89 -25 -36 -156 -239 -210 -335 -171 -97 117 -41 51 -34 65 59 -38
1983 -38 -16 -196 100 41 -37 -107 31 -99 -42 -44 152 -60 76 299 121 -136 53 125 -127 -55 -16 137 -232 148
2007 148 -154 -201 -37 -121 -126 270 -133 -187 176 142 37 -290 -2 -28 -40 57 -80 109 65 205 220 -98 -13 -19 -20
2032 -20 83 186 86 110 220 94 -157 27 -2 139 -91 29 -73 8 130 72 -148 36 -81 224 51 -46
2054 -46 23 -102 160 59 41 35 49 105 -97 -150 -151 -76 -70 -67 -80 -27 -15 -370 -125 -69 -96 84 -114 -139 -4 -108 -31
2081 -31 -222 -17 259 103 126 235 83 -225 17 47 -267 34 332 -46 18 -36 -48 44 -94 19 -210 175
2103 175 -141 -39 202 -125 -33 -67 4 -31 80 175 173 -165 -54 40 235 -144 51 8 45 -207 -113 -187 128 40
2127 40 203 56 273 -177 -60 59 28 -31 9 -91 -17 65 247 -74 -33 -65 100 -107 -9 -50 -152 168 44
$$ packed form
1958a05K57k2k88K10n6r9k04M13r4P7j14j1j20q3K9j25J64P4K14j58R2q5R9or7
1983c8K2j80K96n9p8p0J38j30N7kJ96k12J36K23j78k57J89P2k52P2L9J53l69L80
2007A48l02m7J64q4nL96m03n4L63l4j05l27K88k6j2R7j37J89m4J40J5l18Q5oj
2032b0J03J03j00K4J10j26k51J84k9J41k30J20j02Q1J22n8k20J84j17L05j73r7
2054d6O9j25K62j01j8oJ4N6k02n3jP5OLj3N3J2l55K45N6k7J80j98k5J35j04P7
2081c1j91K05K76j56K3J09j52l08K42L0l14L01K98l78O4n4j2R2j38J13k29L85
2103A75l16J02K41l27R2l4P1l5J11R5kl38J11R4J95l79J95m3L7k52R4p4L15q8
2127D0J63j47K17m50J17J19l1n9M0j00P4Q2J82l21M1l2J65k07R8m1j02L20j24
$$ plain form
2150 44 -30 -77 69 140 4 -64 199 233 170 209 -36 328 88 85 178 12 -58 -306 -42 -237 -94 139 -252 190
2174 190 309 -228 53 100 -39 179 1 440 164 105 48 -179 -75 -316 -303 -70 -50 16 178 -151 -27 -120
2196 -120 145 -123 161 3 -163 58 -120 166 140 -69 -160 5 -14 54 -100 -137 69 217 171 141 -68 125
2218 125 -193 -6 157 -72 -184 163 -131 -95 178 -19 204 3 169 222 -126 117 33 -131 47 -34 54 -138
2240 -138 2 124 -26 94 -58 41 -112 -254 260 91 -111 189 -140 222 -42 -43 173 -179 162 166 134 -329
2262 -329 -175 54 -209 161 -22 -72 131 -77 -38 -90 -55 85 -18 80 -123 -6 -134 -114 -70 -60 -100 -324 -183
2285 -183 62 -69 4 17 -186 -44 151 16 -114 218 16 107 -202 45 -276 -350 -68 -65 156 -66 297 -262
2307 -262 144 -4 -70 -51 -32 303 42 64 -54 108 80 -391 17 120 -8 59 37 51 45 166 10 -32 226 -111
$$ packed form
2150D4p4m7J46P1j36o8K63L4o3L9k45L64k40lR3j66p0k48K64j95J43K33l91M42
2174A90J19n37K81M7j39K18j78M39k76n9n7k27J04k41J3K33K0O6J62l29J24r3
2196a20K65k68K84j58j66K21j78K86k6k09r1J65j9O8j54l7K06J48m6l0k09J93
2218A25l18J87J63k29j12L47k94L6K73j97K23k01J66N3l48K43q4j64J78q1Q8j92
2240a38J40J22j50J20j52R9j53j42N14j69k02L00l29L62k64jK16l52L41Ml2m63
2262c29J54K29k63L70j83n0K03k08L9n2L5J40j03R8k03J17j28K0M4J0m0k24J41
2285a83K45j31P3J3k03J42J95j35j30L32k02R1l09K47l21p4K82LK21k22L63n59
2307b62M06j48o6J9J9L35k61K2j18J62k8m71M08J03j28O7k2J4oJ21j56m2K58l37
$$ plain form
2331 -111 69 240 -105 126 -42 -102 -162 53 30 -152 17 -19 89 -107 84 -74 -260 165 -39 15 68 -38
2353 -38 -80 46 157 -141 -142 -113 -164 37 -239 -230 -263 -187 147 176 162 63 -165 54 -70 103 84 -290 108 33 -48
2378 -48 100 7 -34 109 47 -124 28 -216 115 -114 -162 -9 72 217 -282 61 -227 42 -112 154 -31 108
2400 108 29 15 -67 72 -149 -96 114 280 -296 56 134 66 102 183 -45 143 -180 66 27 -97 -79 113 -152
2423 -152 -79 -116 91 36 168 33 126 -111 10 -33 -171 28 69 190 -106 -76 63 124 30 79 173 -172 -3 -13
2447 -13 -73 80 -44 -73 -23 -1 34 134 -67 155 21 274 -18 96 103 116 -246 -53 45 -125 -31 12 215 138
2471 138 60 -237 40 -119 -85 -32 -14 -32 181 81 69 283 -141 215 -29 -97 60 -111 160 -145 -35 122
2493 122 -151 22 95 131 -66 126 -52 -157 41 37 195 87 42 -97 105 32 -250 -103 -72 -94 -184 -30 -57
$$ packed form
2331a11J80J71l45K31j68o0o0K15k3j82J69l6J08j96J91j58j86M25k04N4N3j06
2353c8m2J26J11k98jK9n1K01k76Rl3P6L34K9j4r9k28K19j24J73j9l74L98p5q1
2378d8J48r3m1J43o2j71J52k44L31k29m8J53Q1J45m99L43k88K69j54K66j85J39
2400A08p9j4q2J39k21N3K10J66n76L52P8o8L6Q1k28J88l23K46l9j24J8J92k65
2423a52P3l7K07n5J32j35R3k37J21m3j38J99M1J21k96L0J39O1r4M9R4l45J69j0
2447a3o0J53j24k9N0K2L5J00k01K22j34K53k92J14PJ3l62J93R8j70R4M3K03p7
2471A38p8k97K77j59L4N3J8j8K13j00j2K14m24L56k44o8J57j71K71l05J10J57
2493A22k73J73P3L6j97J92j78j05J98mJ58j08m5j39K02p3k82J47L1k2r0J54k7
$$ plain form
2516 -57 136 18 11 52 327 -1 4 22 107 85 280 96 -52 226 7 -81 64 126 -159 89 45 -70 14 29 47
2541 47 -3 174 -21 -121 69 55 -75 229 127 -75 -240 85 -96 -211 -88 -292 94 -60 50 223 49
2562 49 -127 -77 298 -143 93 -75 -182 310 101 211 -345 -190 -55 200 -55 164 -49 153 44 -22 -20 88
2584 88 46 51 -10 250 -60 90 -88 -32 -282 132 38 -127 29 -66 7 -21 -288 117 78 -53 -256 21 30 -69 38
2609 38 -259 39 21 -79 115 282 13 137 88 -85 176 92 104 -364 -107 -49 44 93 60 14 98 -45 203 61
2633 61 -84 -10 -211 -46 39 -214 40 -61 -38 287 -144 -100 224 52 117 -113 -37 -84 67 10 147 -253 124
2656 124 119 -113 -389 -334 67 174 -145 -26 53 -21 -73 -84 -247 120 -130 21 -246 21 -52 -177 -2 -239 -2
2679 -2 43 66 256 17 -67 -35 -64 -180 -44 -60 -153 101 -61 -209 -4 20 -113 -10 -89 23 139 -52 86 -23
$$ packed form
2516e7J93j18pM1K75l28NJ8Q5k2J95j84j48K78k19q8J45O2k85K48m4j15Q4J5J8
2541D7n0J77j95j00J90j4j30L04j02k02j65L25j81j15J23k04L86j54J10J73j74
2562D9j76N0L75m41K36j68j07M92k09J10n56J55J35K55k55K19k13K02j09o6KJ08
2584H8m2No1K60l10J50j78N6k50M14r4j65J56r5P3k8k67M05l9j31k03K77Rr9J07
2609C8k97K98j8j00J94J67k69J24m9j73K61q4J2m68K57N8R3M9l3m6Q4j43K48j42
2633F1j45P4k01J65Q5k53K54j01K3L25m31M4L24j72O5k30P6m7J51n7J37m00L77
2656A24nk32k76N5M01J07l19J19P9p4n2j1j63L67k50J51k67K67p3j25J75k37K37
2679bM5K3J90k39q4L2k9j16J36j6r3K54j62j48K05K4j33J03p9J12J16j91J38j09
$$ plain form
2703 -23 260 -210 97 114 -212 -60 15 -108 -6 -180 -44 -15 -58 -89 -176 199 -88 -55 127 -125 -112 -117 -119 41
2727 41 49 -148 -69 2 -140 23 -448 89 110 73 -165 -119 95 4 205 -97 84 18 -73 37 91 -105 282 32
2751 32 17 114 -39 145 -197 86 -90 204 1 25 -93 -8 13 107 -87 -66 -177 -29 122 207 -90 -92 117 -120
2775 -120 93 -3 -113 -38 -118 -308 148 -309 -227 -152 -89 71 185 50 42 55 194 203 -62 -233 67 -70 75 -136
2799 -136 33 -60 -142 -125 -102 63 -134 223 -121 -46 -32 33 36 -31 309 -159 8 129 132 72 12 2 -31 199 62
2824 62 193 -60 126 -15 -206 -38 -134 -102 193 69 170 87 -119 206 -67 -30 -332 -241 -69 97 -184 129
2846 129 -85 -41 -1 -5 98 -152 -1 -16 -163 -158 275 -31 -124 4 211 -132 156 34 90 -59 79 -101 150
2869 150 143 -97 -72 49 -172 -205 -73 -49 -8 180 12 -81 -170 4 -205 -9 -68 -148 111 15 15 -48 -40 157 -88
$$ packed form
2703b3K83m70L07J7l26J52P5j23J02j74J36K9m3l1q7L75k87L3J82k52J3nkJ60
2727D1Qj97P9P1j42J63m71N37K1l7k38M6K14r1K01l02J81o6r1J10N4j96L87k50
2751C2j5R7j53J84l42K83j76K94k03K4j18Q5K1R4j94K1j11J48J51Q5k97kK09k37
2775a20K13r6j10P5q0j90M56m57Q2P5O3J60J14j35qJ3J39Rk65j71L00j37J45k11
2799a36J69r3q2J7K3J65j97L57l44P5J4O5Lo7L40m68J67J21Lo0o0j0l3K30j37
2824F2J31k53J86j41j91J68r6L2K95j24J01q3k06L25k73L7l02R1J72J66k81L13
2846A29k14M4M0mJ03k50J51j5j47NM33l06r3J28K07l43K88j22N6j49J38j80K51
2869A50pk40K5J21k21l3J32K4M1J88j68r3q9J74k09J96n9q0K59r6%o3QJ97k45
$$ plain form
2894 -88 -118 -111 -79 82 41 67 -43 -193 -121 -89 24 -111 1 -292 -63 71 2 65 41 -92 -134 73 3 -135 262
2919 262 6 99 97 -201 77 -52 32 -10 -1 -187 -153 248 -55 -95 31 50 -26 -90 -83 59 11 159 58 209 0
2944 0 -166 -45 1 163 31 -180 -29 -118 183 319 -55 -103 -12 199 -79 -9 72 42 27 88 65 -215 83 -151
2968 -151 -76 -70 -9 28 60 -343 112 11 153 -277 -2 -69 -318 60 96 166 22 56 263 -176 -58 368 -255
2991 -255 -172 -195 -15 -127 84 306 71 166 186 -21 10 152 -89 215 134 -57 101 124 39 -32 184 83 133
3014 133 -5 -193 58 76 51 -54 -9 -83 -95 27 -110 -108 -156 -28 -167 145 -59 -222 5 -148 59 279 13
3037 13 -190 -34 46 -159 259 137 -329 -176 47 -104 -121 157 -39 205 -184 -50 -131 60 -189 158 302
3058 302 36 167 -134 -165 40 -152 182 270 -55 -19 -227 -41 -122 158 162 123 270 88 74 -36 250 -113 10
$$ packed form
2894h8l0PL2J61m1K6j10j50P2L2J13j35J12k93K29J34o9O3k4j33m2K07p0j38L97
2919B62k56R3kk98K78j29Q4m2Rj86L4M01l03m0J26J9p6o4PJ42m8J48j01J51k09
2944@j66J21M6J62j32k11J51q9L01J36l74m8R1K11k78P0Q1l0j5O1k3k80K98k34
2968a51P5OO1L7L2m03M55j01J42m30K75o7k49L78L6P0j44L4K07m39J18M26o23
2991b55Q3k3J80j12K11K22k35R5K0k07L1J42k41L04q1j91J58K3q5p1K16j01N0
3014A33j38j88K51J8k5j05M5p4j2J22j37Km8J28j39L12k04j63K27j53K07K20k66
3037A3k03J56Q0k05M18j22m66J53K23j51j7K78j96K44l89J34q1J91k49L47J44
3058C02k66J31l01l1K05j92L34Q8l25L6k08J86q1K80Ml9J47j82j4j10K86l63J23
$$ plain form
3081 10 227 -102 206 -84 -170 488 122 -185 120 7 170 192 112 87 -18 117 -6 -86 -17 123 -165 140
3103 140 213 -223 34 -43 96 75 245 -277 90 -55 309 -123 -64 -144 -278 68 -206 160 -5 130 -208 21
3125 21 31 261 23 13 -35 -288 144 -30 -257 245 -180 83 4 79 -24 -228 -139 290 30 6 147 126 52
3148 52 -5 -52 30 61 26 118 -67 -68 79 114 -145 -131 434 130 32 161 105 209 312 128 20 -102 64 80 24
3173 24 -65 226 -290 15 -75 23 190 -231 -250 143 -95 -102 -49 161 63 -110 -78 47 134 103 -132 -230 -285 -144 140
3198 140 -68 -9 115 41 192 -128 92 266 81 -90 -24 13 68 -100 -53 -261 -16 -66 -93 63 -284 79 106
3221 106 -105 -54 -219 42 -136 -78 2 150 20 -36 -141 -91 -213 51 108 -80 121 -165 45 -171 183 224
3243 224 -75 -316 21 117 -36 -158 91 26 39 79 261 -177 -18 104 62 267 31 159 -81 35 142 116
$$ packed form
3081A0K17l29L08k90q6O58l66l07L05j13J63K2q0k5j05J35j23q0O9J40k88L05
3103A40P3m36K57p7J39k1J70n22L67j45L64m32N9q0j34L46k74L66j65J35l38K29
3125B1J0K30k38j0m8k53M32j74k27N02m25K63p9P5j03k04Q9M29k60k4J41k1p4
3148E2n7m7Q2L1l5R2j85jJ47L5k59J4N65l04r8J29n6J04J03j84j08j22J66J6n6
3173B4q9K91n16L05r0R8J67m21j9L93k38pN3K10r8j73L2J25Q7l1k35r8n5J41K84
3198A40k08N9J24p4J51l20K20J74j85j71O6L7N5j68M7k08K45n0k7J56l47L63K7
3221A06k11N1j65K61j78N8Q0J48j30n6j05N0j22K64N7j88K01k86K10k16L54M1
3243B24k99k41L37R6j53j22K49o5J3M0J82m38J59J22m2K05k36J28k40J16J07k6
$$ plain form
3265 116 -45 -52 16 172 221 -181 44 15 5 139 306 -379 111 -117 -225 -229 93 -134 -93 110 -52 54 -53
3288 -53 -146 -38 178 -74 -107 -18 272 -101 185 16 65 146 -282 -17 72 196 9 47 -98 10 -183 155 82
3311 82 -9 -13 -40 -70 -131 -244 98 157 -106 -37 -184 182 42 127 -76 270 -58 13 -36 13 85 -6 70 33 15 -60
3337 -60 -153 32 -180 240 39 -73 -126 36 -104 -41 -268 -55 160 -26 21 -79 65 -230 -76 -100 133 -11
3359 -11 -199 -248 2 -13 284 -118 -59 32 -1 -219 93 28 -30 12 180 -30 -1 65 -44 -193 37 125 -100 -37
3383 -37 -197 -155 211 169 -72 -5 48 -51 274 -99 -67 -95 -26 -3 -180 -310 65 -169 -86 -92 -37 -32 -35 45 19 -87 -156
3410 -156 -86 -56 55 -67 168 219 -99 -224 -23 -282 -142 15 55 311 -37 -68 121 -104 124 -192 209 -95
3432 -95 15 36 97 -312 -53 16 8 -128 -24 -214 -218 13 -142 170 -90 -52 -246 -119 -19 70 -136 23 -110
$$ packed form
3265A16j61pO8J56M9m02K25k9j0J34J67o85M90k28j08mL22k27M1K03j62J06j07
3288e3r3J08K16k52l3Q9K90l73K86j69M9Q1m28K65Q9J24j87L8j45J08j93L38p3
3311H2r1mk7l0o1j13L42N9k63O9j47L66j40Q5k03L46l28P1m9M9P2r1P6l7j8p5
3337f0r3J85k12M20k01j12n3J62j40O3k27K13K15j86M7j00J44k95J54k4K33j44
3359a1j88m9K50j5K97m02N9R1l3k18L12o5n8M2J68k10K9O6j09j49K30Q8k25O3
3383c7j60M2L66m2k41O7N3r9L25l73L2k8O9K3j77j30L75k34Q3oN5NlQ0k6j06o9
3410a56P0L0J11j22K35N1l18j25K01k59J40J57M0K56l48l1J89k25K28l16M01l04
3432i5J10K1O1m09K59O9qj36J04j90mK31j55L12k60L8j94J27J00Q9k06J59j33
$$ plain form
3455 -110 99 56 -6 -258 -44 267 197 91 13 -83 13 93 32 -93 -198 -222 -239 110 -41 19 131 -68 -161 -184
3479 -184 -174 -45 -50 -1 161 2 -81 77 83 -94 24 173 45 -28 147 -136 -222 109 190 186 -36 3 -82 -200 205
3504 205 130 211 153 -84 -48 174 103 28 230 92 113 -2 147 166 250 66 -127 26 314 43 -74 -161 -103 -35
3528 -35 14 -99 32 6 -217 -50 -61 -6 216 107 62 10 -88 80 76 26 -225 -99 -11 110 15 13 1 129 154 88
3554 88 -146 -22 -82 -23 91 140 78 -365 -56 68 -207 43 -73 -13 -42 -16 -241 -134 78 -83 -149 1 -252
3577 -252 -1 316 -206 52 -10 -56 198 -430 -108 69 90 322 -151 12 -263 -167 -138 -239 -169 -99 -50 164 108
3600 108 -61 -27 -184 -230 -11 83 144 -141 25 -82 179 -135 -211 121 194 -26 -66 -33 -109 -98 306 230 81 -201
3624 -201 187 -168 -223 -35 -160 89 23 157 -105 -7 179 -124 162 -72 21 172 215 -79 -74 -161 -319 244 -38
$$ packed form
3455a10K09m3o2k52K14L11p0j06p8r6R6Q0o1j25j05k4j7L49j51O0J12j99r3k3
3479a84J0J29nM9J62j59q3J58Oj77J18J49j28p3J75k83q6L31Q1mk22L9q5j18M05
3504B05p5Q1n8k37L6K22p1p5K02j38K1j15J49J9Q4j84j93J53K88k71j17q7N8O8
3528c5M9j13J31k6k23J67j1N5K22j09m5n2r8J68mn0k51J26Q8J21r5kj2J28K5o6
3554H8k34J24o0N9J14M9o2m43L09J24k75K50j16O0k9K6k25J07K12j61o6J50k53
3577b52K51L17n22K58o2m6K54o28L22J77K1K32m73J63k75R6K9j01P0P0M9K14n6
3600A08j69L4j57m6K19R4O1k85J66j07K61l14p6L32P3k20m0L3p6J1M04p6j49k82
3624b01L88l55n5J88j25K49o6J34k62R8J86l03K86k34R3J51M3k94Nq7j58N63k82
$$ plain form
3647 -38 -117 96 -119 188 -3 3 -52 -40 -22 68 124 60 117 253 -111 100 -196 -177 -20 -54 83 131 -116 -27 73
3672 73 132 196 -20 -165 19 -171 102 10 16 -94 145 77 96 -63 -283 178 210 59 -79 44 -211 -189 -27
3695 -27 122 -86 42 -102 -3 -59 -33 165 -125 170 -101 18 -38 -199 181 14 243 76 68 -20 -5 -73 113
3718 113 -9 209 -54 -40 -229 142 88 -87 -77 -96 22 -15 46 56 -54 36 64 294 106 -16 -3 -62 -77 -205
3742 -205 -107 -77 -174 -97 76 302 27 -193 -59 245 47 -268 -70 18 24 -15 7 84 139 77 -101 -13 -26 222 -149
3767 -149 -114 98 66 -34 -40 -43 -245 20 -406 -374 214 29 -94 80 -13 -58 165 61 -79 -51 172 127 178 -25
3791 -25 -70 125 248 -285 7 -101 99 52 -103 190 132 26 152 -80 -174 98 -252 -57 -95 -143 -87 -18 3
3814 3 -57 -42 218 -20 -136 40 266 -252 73 -83 46 35 -51 -152 -50 -119 -38 -328 -79 -222 115 -237 110
$$ packed form
3647c8p9K13k15L07j91On5J2J8R0N6o4N7J36l64K11k96J9J57l4J37M8k47Q9J00
3672G3N9O4k16j45J84j90K73r2Oj10K39o8J9j59k20M61L2j51j38J23k55K2J62
3695b7J49k08J28j44R9n6K6J98k90K95k71J19n6j61L80j67K29j67qq8J5o8J86
3718A13j22K18k63J4j89L71n4j75J0j9J18l7O1J0j10R0K8K30j88j22J3n9j5j28
3742b05R8L0r7P7J73K26k75k20J34L04j98l15J98Q8Ol9K2P7N5o2j78Q8j3K48l71
3767a49L5K12l2j00olk02K65m26L2N88j85j23J74r3m5K23j04j40K8K23m5N1k03
3791b5m5J95J23n33K92j08K00m7j55K93n8j06J26k32r4K72l50J95l8m8N6O9K1
3814Co0J5K60k38j16J76K26n18L25j56J29j1q6j01J02o9Q1k90K49j43L37l52L47
$$ plain form
3837 110 -114 -153 16 -283 77 100 -79 -92 -50 -174 69 -160 86 70 268 40 29 65 -61 -2 -5 139 -130
3860 -130 -124 -65 -92 178 -200 -59 1 61 -14 -288 -119 -145 -126 -162 -86 -133 114 -95 116 106 -195 -322 2 -2 64
3885 64 -139 3 -44 -13 116 126 11 -92 -58 99 -137 -89 199 -173 -226 38 -124 -16 -144 -120 -125 415 152
3908 152 -215 -8 -13 -128 39 -88 17 221 -18 106 0 -54 -253 147 -63 201 165 -10 10 -145 -55 58
3930 58 1 32 125 93 -117 -20 17 71 -78 134 28 86 182 -240 51 235 -217 -220 -83 53 53 -178 -171 77 90 -18
3956 -18 41 149 -147 -37 -81 -18 -56 47 194 -138 -73 99 -189 27 154 -260 -47 -87 93 135 -164 168 192
3979 192 -247 -135 98 -135 41 167 -142 29 134 293 27 -12 -73 271 -210 82 86 -383 -249 72 101 -120
4001 -120 188 -25 13 80 80 5 61 -39 67 102 -261 -171 20 -97 26 -117 24 132 2 19 -260 -110 -284
$$ packed form
3837A10k24l9J69k99L60K3j79j3M2j24K43k29K46j6J98k28j1L6j26N9lJ44k69
3860a30ON9k7K70l78J41O0O0p5k74J69k6J9l6P6m7K47k09K11j0l01j27L24mO6
3885F4k03J42m7L1J29J0j15j03L4J57k36M8K88l72n3K64j62J08j28K4nN40k63
3908A52l67K07nj15J67j27J05K04k39J24j06n4j99M00k10K64l6j75K0j55R0J13
3930E8n7L1R3l2k10R7L7N4j49K12j06N8R6m22K91J84m52lJ37J36%k31PK48J3j08
3956a8N9J08k96J10m4O3l8J03J47l32O5J72k88K16J27m14K13m0J80M2k99L32K4
3979A92m39J12K33k33J76J26l09J71J05J59k66l9o1L44m81K92Mm69J34L21K9k21
4001a20L08k13L8O7%p5N6j00J06L5l63R0J91j17J23j43J41J08j30J7k79J50j74
$$ plain form
4024 -284 58 -33 -86 -61 -294 103 -36 88 -36 32 -143 179 58 -127 105 -40 -95 73 -114 253 28 137
4046 137 167 -118 70 72 -113 -307 99 215 60 -29 -142 -52 229 -92 -48 151 -65 -37 -150 84 194 71
4068 71 -97 -77 321 22 48 216 -36 -183 -38 80 -125 164 17 204 -70 -104 -87 73 53 -323 -248 -60
4090 -60 -84 66 91 184 116 -356 100 51 -161 -140 151 51 10 -139 -64 -140 -117 -68 163 -23 128 -89 -41 105
4114 105 90 -52 -195 66 -177 13 33 -145 -128 264 -391 -189 78 19 -12 -61 16 -38 -4 237 -39 -15 51 148
4138 148 -22 -42 55 -48 198 -56 85 239 -52 -62 -11 290 -105 240 -81 -23 42 170 81 -36 91 82 105
4161 105 229 179 -66 -150 -75 -194 -91 123 10 -155 20 145 -133 129 -83 -19 -119 -175 295 -210 -52 -63
4183 -63 41 -11 105 -35 187 60 195 -20 -205 12 134 -108 5 126 -58 228 82 -81 119 51 73
$$ packed form
4024b84L42r1n3K5k33L97j39J24j24O8j75L22j21j85K32j45n5J68j87L67k25J09
4046A37L0k85J88Kj85j94M06J16j55q9j13R0K81l21M4J99k16K8j13K34J10j23
4068G1j68K0L98k99K6J68k52j47J45J18k05K89j47J87k74l4J7J60k0l76P5J88
4090f0k4J50K5R3o8m72M56m9k12K1K91j00m1j49P5p6K3M9K31j86J51k17M8J46
4114A05j5j42j43K61k43J90K0j78J7L92o55K02K67n9l1m9P7n4L4K41k76K4O6R7
4138A48j70k0R7j03K46k54J41J54k91j0N1L01l95L45l21N8O5J28q9j17J27rK3
4161A05J24n0k45q4P5j19J03K14j13j65J75J25k78K62k12O4j00n6M70n05J58j1
4183f3J04n2J16j40K22j27J35k15j85K17J22k42J13J21j84K86j46j63K00o8K2
$$ plain form
4204 73 -111 143 -176 -134 -240 1 -68 -87 -35 -141 -28 25 -241 143 159 219 -19 -95 23 -73 -88 44 63 -119
4228 -119 127 232 -23 -247 -72 -27 -188 -219 18 116 32 -61 51 -33 198 -14 -41 190 49 -3 -29 -133 -75
4251 -75 39 -221 110 112 43 -121 -15 13 -194 7 -275 -48 -36 -30 -87 -28 -121 113 27 -41 206 180 -11 -170 -124
4276 -124 114 92 165 -109 264 -273 -398 -24 133 -36 188 93 -96 -14 159 210 139 -99 -258 -49 13 38 -241
4299 -241 86 52 202 -196 16 -157 -69 -127 -142 -185 11 27 90 -107 148 176 -54 75 -128 -232 -164 -81 156
4322 156 -53 49 55 19 -52 -8 102 -98 15 -23 135 3 -48 -157 -28 158 -44 182 -6 56 98 47 -51 94
4346 94 -102 -55 -352 24 60 -41 72 -8 -134 106 104 -64 121 105 -66 22 -258 87 -288 190 139 -71 29
4369 29 -87 -30 -86 43 -188 109 -105 200 -54 9 259 150 25 56 81 57 -352 20 -55 83 123 -163 35
$$ packed form
4204G3j84K54l19M2j06K41o9j9N2j06J13N3k66L84J6O0k38p6J18r6j5J32J9j82
4228a19K46J05k55k24J75M5j61l1K37R8q4r3J12q4K31k12k7K31j41n2k6j04N8
4251g5J14k60L31Ko9j64J06K8k07K01k82K27J2On7N9r3K34q6o8K47k6j91j59M6
4276a24K38k2P3k74L73n37j25L74J57j69K24r5j89Q2J73N1p1k38j59K09O2K5k79
4299b41L27l4J50l98K12j73Q8n8j5m3J96J6O3j97K55K8k30J29k03j04O8Q3K37
4322A56k09J02Ol6p1M4J10k00J13l8J58j32n1j09J29J86k02K26j88O2M2n1r8J45
4346I4j96M7k97L76L6j01J13q0j26K40kj68J85j6j71Q8k80L45l75M78n1k10J00
4369B9j16N7n6J29k31K97k14L05k54O3K50j09j25L1K5k4m09L72p5J38M0k86J98
$$ plain form
4392 35 -84 -9 -353 69 -78 -181 -81 230 -180 -83 -101 -149 -287 -51 -237 37 -152 -112 -34 -35 -127 124 -189
4415 -189 -213 145 -130 41 45 -45 -94 -118 96 -93 45 84 5 54 68 98 108 13 -266 -99 186 -143 116 -122
4439 -122 -59 232 9 -168 -42 74 47 -14 -280 -147 135 -45 23 -22 -75 109 35 94 100 243 -136 -2 117
4462 117 -16 232 -114 -66 -121 -17 -139 390 47 -102 72 -87 121 -11 -63 -77 -13 139 224 78 142 -118
4484 -118 44 41 206 -34 22 88 23 92 -190 -263 57 -236 -9 -167 -74 84 -19 -154 172 119 28 -201 87
4507 87 195 -1 38 -200 17 -156 -116 439 117 -24 63 54 -23 91 -54 -78 146 165 -109 -70 238 -70 -101 48
4531 48 -243 -112 63 -87 -240 -20 144 207 -67 205 236 -56 15 8 22 -49 106 175 -84 83 215 42 93
4554 93 116 86 196 -78 -199 5 -94 80 202 79 -318 -7 -244 106 67 33 -136 45 9 -143 -72 56 -56
$$ packed form
4392C5j19P5l44M22j47j03J00L11m10R7j8m8j38K36j86K74j89M0P8jr2K51l13
4415a89k4L58k75J71Mr0m9k4K14j89J38L9p9M9J4L0J0r5k79J67K85l29K59k38
4439a22O3K91k23j77J26J16k7o1k66J33K82j80O8m5n3J84p4N9OJ43l79J34J19
4462A17j33K48l46M8n5J04j22N29l43j49J74j59K08j32n2j4O4J52Q5j46O4k60
4484a18J62lJ65k40N6O6o5O9k82p3L20k93K27j58R3J58j03j35L26n3r1k29K88
4507H7J08j96L9k38K17j73M0N55l22j41Q7rp7J14j45k4K24J9k74L9L08l08l1J49
4531D8k91J31J75j50j53K20J64O3k74K72L1k92P1pJ4p1J55O9k59J67J32j73N1
4554I3K3l0J10k74j21K04r9J74J22j23l97L11k37L50l9l4j69J81l6j52P1J28j12
$$ plain form
4577 -56 72 -171 73 -19 100 69 10 45 187 -4 -56 -58 -197 183 -169 175 78 -41 -205 118 9 -148 -8
4600 -8 284 158 -15 183 -55 204 -133 -21 -31 80 -1 -102 102 -37 120 83 35 -50 -109 -49 -41 -121 -12 87
4624 87 137 157 24 20 -257 -68 -15 -108 -35 25 69 239 -80 -226 3 164 -60 -87 37 -134 134 53 -241 -255
4648 -255 8 115 92 39 -251 3 33 247 -21 -37 55 -124 -101 53 22 4 -47 67 -281 -220 32 14 -14 -65
4672 -65 26 -92 161 -25 47 -150 -47 41 -8 -178 3 0 50 -63 58 -93 150 -176 106 -4 31 -8 -14 -110
4696 -110 -13 72 15 40 11 -30 -163 -105 -237 65 -168 -116 125 -235 63 98 -73 125 45 -10 140 0 172 -34
4720 -34 -7 -82 -41 221 -79 291 -84 -82 -92 -89 22 28 7 24 80 -244 101 191 222 -57 -172 -152 -133 -18 161 26
4746 26 -88 312 15 -187 115 31 -130 -65 69 -97 129 11 107 -121 -8 21 -9 151 -167 196 -231 -22
$$ packed form
4577e6J28k43K44r2J19l1n9L5J42j91n2kj39L80l52L44r7j19j64L23j09j57J40
4600hK92j26j73J98k38K59l37J12j0J11q1j01K04j39J57l7m8q5n9O0Qq0J09R9
4624H7N0K0j33mk77J89N3r3P3O0M4J70l19j46K29J61k24k7J24j71K68q1k94j4
4648b55K63J07k3n3k90K54L0K14k68j6R2j79K3J54l1j8n1J14l48O1K52j8k8n1
4672f5R1j18K53j86P2j97J03Q8m9j70J81lN0j13J21j51K43l26K82j10L5l9or6
4696a10R7Q5n7K5k9m1j33N8j32L02k33N2K41l60K98L5j71J98q0n5J50j40J72k06
4720c4K7p5M1K62l00L70l75Kj0LJ11Ok1J7N6l24L45R0L1k79j15K0J9J15J79j35
4746B6j14M00k97k02L02q4j61O5J34j66K26j18R6k28J13K9l0J60l18L63m27K09
$$ plain form
4768 -22 101 49 152 12 -132 -24 -72 -76 -197 29 320 -64 -116 78 -79 2 12 -241 -37 211 18 -116 -5
4791 -5 -110 -152 -141 -23 -53 14 -30 -1 50 5 125 66 129 -137 -69 -117 141 80 52 57 -48 22 298 -28 -94 33 -284
4818 -284 -8 143 -141 -206 64 152 -74 128 -96 -386 -2 -273 -176 16 -146 70 -175 -70 -83 1 199 59
4840 59 14 -104 -113 -23 2 -151 108 -268 56 67 20 280 -80 134 -115 125 -99 -162 -110 -50 217 -12 -140 -29
4864 -29 14 9 -100 -117 -143 -3 -75 130 250 13 -151 -117 -157 88 -81 -317 -160 21 183 69 -4 -157 172
4887 172 50 -143 -144 -111 110 -35 71 -105 -107 110 190 -74 143 4 -9 -122 -279 198 -82 67 95 96 -38
4910 -38 34 162 185 -59 -77 -104 112 71 -236 -139 -141 242 -98 -69 -14 109 131 64 -265 -21 21 134 66 98 -57
4935 -57 34 -55 -34 -133 -174 -36 -11 62 164 -3 -2 -103 -52 -175 -435 -39 -52 29 -90 -59 -120 83 148 44 258
$$ packed form
4768b2J23n2J03j40j44J08m8mj21K26K91l84n2J94j57Q1J0k53K04K48j93j34J11
4791ej05m2J1J18l0O7m4K9N1m5J20n9O3k66O8m8K58o1k8Nj05P0K76l26o6J27l17
4818b84K76J51k84o5K70Q8k26K02k24k90L84k71R7J92j62K16k45J05j3Q4J98j40
4840E9m5j18rR0K5j53K59l76L24J1m7K60l60K14k49K40k24o3N2O0K67k29j28J11
4864b9M3nj09j7k6J40p2K05J20k37j64L4m0K45j69k36J57J81J62j14p3j53L29
4887A72j22j93jL3K21j45J06j76kK17Q0k64K17j39j3j13j57M77k80J49K8Jj34
4910c8P2J28K3k44j8k7K16m1l07R7kL83l40K9N5J23K2o7l29K44M2J13o8L2j55
4935e7R1q9K1r9m1J38K5P3J02j67Jj01N1j23k60L96j3Q1j19L1o1K03O5j04K14
$$ plain form
4960 258 205 55 140 -68 183 -112 -31 -111 -88 95 -47 30 -80 186 42 0 242 245 185 164 245 21 20 93 34
4985 34 -103 -49 -165 110 -195 82 -12 163 91 72 30 28 181 -146 14 -216 -205 -3 16 -44 -10 35 -99 -108 26
5010 26 183 -268 41 -24 -295 -79 -151 -63 211 -123 74 -284 -128 78 -89 71 -21 320 117 25 -198 -67
5032 -67 352 236 -14 -34 -264 66 -90 -330 -297 145 -85 160 -67 67 -69 64 171 180 135 51 -136 -14
5054 -14 51 112 173 133 98 166 -66 -148 76 58 66 -157 -176 -227 144 -121 -72 -111 -117 60 -96 86 46 39 -64 28 53
5081 53 -7 33 33 45 75 81 185 -181 -144 -68 -209 24 330 18 67 -65 174 159 -30 -56 -37 8 -68 -68 77 -41
5107 -41 25 -58 -141 -4 -68 34 50 -101 -55 148 -87 148 -207 12 -68 -102 187 227 72 -138 -75 19 -229 94
5131 94 59 50 -372 -298 -25 -134 -111 59 208 -110 -103 72 350 196 -193 -87 55 -90 194 -114 118 14 -49
$$ packed form
4960B58n3j50Q5k08K51k95Q1q0K3J83j42P7j10K66j44m2K42Lo0k1Q1k24jP3n9
4985C4j37N4j16K75l05K77r4J75p2j9m2kJ53l27J60k30J1K02J9o0L4M5j34rJ34
5010B6J57m51L09o5k71K16p2Q8K74l34J97l58J56K06j67J60r2L41k03r2k23J31
5032f7M19j16k50k0k30L30j56k40L3M42k30K45k27J34j36J33J07Rm5q4j87J22
5054a4O5O1O1m0l5O8k32q2K24j8Qk23j9n1L71k65M9l9oJ77j56J82m0pj03R2K5
5081E3o0M0%J2L0OJ04l66L7P6j41K33L06l12M9j32K39j5j89k6J9M5p6%J45j18
5107d1O6q3q3J37o4J02J6j51M6K03k35K35l55K19q0l4K89M0j55k10O3R4k48L23
5131I4l5rm22P4K73j09K3J70J49l18PJ75K78j54l89J06J42j45K84l08K32j04o3
$$ plain form
5154 -49 50 -121 25 29 -72 113 74 7 175 -20 97 -48 -110 -84 13 112 -64 -50 -112 0 -41 -173 126 51 -158
5179 -158 -158 -154 160 -66 28 117 187 -42 0 7 -140 -178 35 -66 38 239 20 123 -337 67 -56 28 -177 -246
5203 -246 187 -99 8 -59 158 -228 -93 -19 -81 50 -65 18 50 -130 64 20 35 -13 -166 -77 66 123 25 -29
5227 -29 -6 162 -23 -133 -329 33 7 73 -45 343 250 166 45 46 -26 -121 -149 -260 61 -297 85 55 10 -20 -221
5252 -221 43 -50 279 -151 8 -27 15 -57 -26 -104 -169 118 -44 -132 19 43 59 278 -64 -35 134 132 -309 18
5276 18 62 -153 -23 -223 -298 -63 -80 -76 53 70 30 -17 87 117 16 -127 -106 -244 188 259 59 -15 -89 101 67
5301 67 -103 29 -51 157 142 60 112 -24 13 155 212 -59 353 310 -60 153 -70 22 86 29 -3 -33 50 -19 -59
5326 -59 -124 89 23 -56 -13 -36 -187 -85 -33 86 -162 -100 19 116 -16 133 -99 -80 -112 30 210 157 225 -15
$$ packed form
5154d9R9j71J46Mj01J85l9o7J68j95J17j45o2K6R7R9j76J4o2J12m1j32K99p5k09
5179a58%ML14k26R4Q9P0k29M2Pj47l8K13j01J04K01k19J03m60M04j23Q4k05o9
5203b46M33k86J07o7K17l86J35P4o2J31j15Q3L2j80J94m4J5m8j53Q9J43N7r8n4
5227b9K3J68j85j10j96L62k6O6j18L88r3q4j21Jp2r5k8j11L21l58L82l0m5l0k01
5252b21K64r3L29m30J59l5M2p2L1p8o5K87j62q8J51K4J6K19l42K9J69km41L27
5276A8M4k15J30k00p5K35j7MJ29J7m0m7J04L0j01j43K1j38M32P1k00p4p4J90l4
5301F7j70J32q0K08j5q2N2j36L7J42N7k71M12m3l70K13k23R2O4n7l2l0Q3o9m0
5326e9o5K13o6p9M3k3j51J02N2J19k48O2J19R7j32J49k32J9l2J42J80n3O8k40
$$ plain form
5350 -15 -134 183 -301 238 119 124 51 -50 127 -83 169 138 42 108 -82 -137 -4 106 6 -281 -66 156 167
5373 167 -30 -67 -127 -171 94 13 -231 34 -120 -213 -8 254 -56 -190 -56 -32 -55 81 10 23 33 -160 -83 200
5397 200 109 202 320 -193 -146 38 -23 -95 21 223 -227 40 -153 -81 -91 -218 17 239 26 171 75 -16 105
5420 105 -171 2 -20 -93 -42 107 168 99 16 117 -148 -60 -65 14 67 -79 19 -189 -82 -1 221 92 30 54 30
5445 30 45 66 55 -64 -60 -40 134 134 -10 -86 -1 12 211 25 -222 63 -164 -11 82 29 -32 -72 -13 -29 -208 123
5471 123 265 -83 -63 133 -153 129 -77 120 -126 88 -24 -111 100 -16 38 45 -80 -175 197 -51 21 172
5493 172 -123 -157 -182 -174 245 118 -79 -160 -112 -95 20 146 -296 -174 -27 58 -112 -155 -153 -142 131 52 93 -146 188
5518 188 -183 -109 177 -226 110 157 -136 -108 226 -155 99 -65 111 -126 -69 65 62 256 -184 -173 -62 -211
$$ packed form
5350a5j19L17m84N39j19Np3j01J77k10K52l1r6O6j90n5J33J10j00k87K15K22J1
5373A67j97l7o0m4K65q1k44K65j54r3K05K62l10j34J34K4k3J36p1J3J0j93P7K83
5397B00r1R3J18n13M7J84o1p2J16K02m50K67j93P2j0j27K35K22k13J45r6r1J21
5420A05k76J73k2p3N1J49O1o9q3J01k65Q8nP9N3j46R8k08J07Q1K22j29o2K4k4
5445C0J5K1j1j19MK0J74%j44p6Q5J3J99j86k47K85k27J53R3n3o1m0N9j6j79L31
5471A23J42l48K0J96k86K82k06J97k46K14j12q7K11j16N4Pj25r5L72k48P2J51
5493A72k95l4k5QM19j27j97q1M8J7J15J26m42J22J47Q5j70m3KJ1K73p9M1k39L34
5518A88l71P4K86m03L36M7k93K8L34l81K54j64J76k37N7J34lJ94m40J1J11j49
$$ plain form
5540 -211 -263 125 -158 81 32 165 69 -198 -42 55 155 -85 101 4 -120 10 -47 75 -13 -9 168 -202 93
5563 93 -60 241 -58 -53 -109 -79 26 58 -10 288 -239 135 -118 -42 -176 -325 -138 229 -13 -142 -104 -68 37
5586 37 -82 259 99 119 79 89 127 29 -165 -54 266 -174 -120 123 32 -134 13 113 -48 96 -206 52 -205
5609 -205 62 -81 -10 -65 -138 89 -17 55 -96 276 146 -22 -68 -77 171 23 -58 -128 -176 -52 17 -1 -46 34 -37
5634 -37 66 -20 115 55 -1 -55 67 37 -48 141 -294 -117 22 -166 180 62 177 -25 129 -76 -158 -126 -43
5657 -43 45 -32 2 21 -159 -82 -35 -28 104 54 -59 76 -188 19 -97 30 -107 86 28 35 -194 -121 62 -164 3
5682 3 -45 31 -79 -207 -54 -43 -7 -40 96 -84 164 227 82 -79 -122 -28 -53 103 -287 -127 -20 97 -20 67
5706 67 -179 -83 -67 -40 -60 -57 11 279 -260 203 -40 6 -210 200 -210 99 101 145 -44 -46 -55 3 212 -77 -12 256
$$ packed form
5540b11n2L88k83K39m9J33r6k67J56R7J00k40J86r7j24J30n7J22q8MJ77l70K95
5563I3j53L01k99Nn6L0J05L2o8K98n27L74k53P6j34j49J87L67k42j29L8L6J05
5586C7j19L41j60K0m0J0L8r8j94J11L20m40N4K43r1j66J47J00j61J44l02K58k57
5609b05K67j43P1n5p3K27j06P2j51L72j30j68m6rK48j48q1p0m8J24O9j8m5Q0p1
5634c7J03q6J35o0n6n4J22l0q5J89m35J77J39j88L46j18J15k02J54k05q2L2Q3
5657d3Q8p7L4J9j80P7M7PJ32n0j13J35k64K07j16J27j37J93n8Pk29P3J83k26J67
5682Cm8P6j10j28J53J1L6l3J36j80K48O3j45j61m3R4k5J56l90J60J07J17j17Q7
5706F7k46R6J6K7k0LO8K68n39M63k43M6k16M10m10L09KM4j89krN8K09k89O5K68
$$ plain form
5732 256 9 -302 -40 -11 183 -100 -392 71 -35 97 -3 -65 185 -155 80 294 165 12 -2 184 119
5753 119 18 -180 140 59 97 101 -76 93 53 -52 224 -157 -124 -275 -67 106 -32 -123 -136 23 -131 -18 -18
5776 -18 94 21 -18 -244 121 71 -230 -144 182 -168 171 296 123 -42 -46 122 -68 -357 -9 174 -32 224
5798 224 218 51 65 26 24 143 -52 25 201 -10 -67 -73 176 -83 -161 -103 -152 72 131 -90 -2 16 45 -7 18 138
5824 138 42 149 -64 161 69 -122 8 -73 18 -58 299 242 324 256 -49 143 87 214 92 -31 112 74 -86
5847 -86 -90 -55 -33 -95 -404 -72 161 7 3 -77 114 26 -46 190 -169 10 95 -142 192 -79 27 34 -4 29 105 -49
5873 -49 20 -68 1 -53 128 79 56 228 -67 65 24 176 130 107 -138 5 25 8 -8 -107 214 118 -101 81 -287
5898 -287 36 137 -52 58 -92 45 77 -1 14 -100 54 408 229 -9 -155 148 -41 62 -3 -109 -112 -41
$$ packed form
5732B56k47l11K62K9J94k83k92M63j06J32j00o2K50l40K35K14j29j53j4J86o5
5753A19j01j98L20q1L8Mj77J69m0j05K76l81L3j51K08J73j38r1j3J59j54J13%
5776a8J12p3l9k26L65n0l01Q6L26l50L39J25j73j65mJ68j90k89L48J83k06K56
5798B24oj67J4l9kJ19j95P7J76k11n7oK49k59p8N8m9K24N9k21Q8J8K9n2K5J20
5824A38r6J07k13K25r2j91J30q1R1p6L57n7Q2o8l05J92n6J27j22j23J43l8j60
5847h6mL5K2o2l09L32K33j54mq0J91q8p2K36l59J79Q5k37L34k71J06Pl8L3P6j54
5873d9O9q8O9n4J81m9k3J72k95J32m1J52m6k3k45J43K0j7j6r9L21r6k19J82l68
5898b87L23J01j89J10j50J37L2p8J5j14J54L54j79k38j46L03j89J03o5j06lP1
$$ plain form
5920 -41 -66 104 278 36 12 -129 -48 93 -43 35 178 91 26 -235 -69 47 -365 -233 10 21 10 -163 -72
5943 -72 -238 -89 -55 -125 -222 58 -16 92 137 -84 68 -11 121 88 -109 -155 18 -48 7 -108 -56 -40 -29 184 34
5968 34 -362 -74 -282 -116 -108 -260 -123 -34 33 -244 50 15 -44 -107 83 58 -133 -58 157 -24 187 123 -42 -114
5992 -114 -157 -281 140 3 -81 -44 -9 -249 -59 -88 -223 -181 -98 98 35 -84 -114 41 100 -147 52 118 91 170
6016 170 259 64 -132 166 190 103 10 136 62 110 -33 123 -198 10 -50 -13 -238 -285 -172 179 -12 30 129 -118
6040 -118 58 159 0 69 62 24 3 -191 173 -34 -210 -141 1 141 -29 45 -189 -142 -53 -95 -329 207 90
6063 90 89 -189 -134 44 70 104 89 11 158 -190 -332 -82 -90 -183 -19 -66 -72 160 144 119 18 62 17 -6 -252 12
6089 12 -49 -166 -42 237 2 98 42 -178 -155 -166 71 -100 -104 42 136 2 5 27 -108 -21 -123 -50 72 -206 -169
$$ packed form
5920d1k5J70J74k42k4j41Q1J41j36P8J43q7o5k61J66J16m12J32K43J1j1j73R1
5943g2j66J49L4p0r7K80p4J08M5k21J52p9J32l3j97m6J73o6N5j15N2J6J1K13j50
5968C4l96K88k08J66Qj52J37Q9O7k77K94l5n9o3J90k5j91P5K15j81K11o4j65p2
5992a14m3j24M21j37q4L7L5k40J90k9j35M2Q3J96o3j19l0J55N9k47J99O6k7P9
6016A70Q9j95j96K98K4q7r3J26p4M8j43J56l21K08o0L7k25m7J13L51j91M2R9k47
6040a18J76J01j59O9pl8k1j94L64k07j76O9J42J40j70P4k34M7Q9m2k34N36j17
6063I0jk78N5J78K6L4j5p8J47l48j42K50qr3J64m7oK32j6k5j01M4m5k3k46K64
6089A2o1j17J24K79k35R6n6k20K3j1K37j71mJ46R4j34LK2j35Q7j02P3J22k78L7
$$ plain form
6114 -169 -130 80 39 28 -36 -50 48 161 199 295 -191 -130 -172 40 381 -118 42 29 3 92 16 36 -74 -181 172
6139 172 -14 -228 134 198 -60 -61 325 -75 186 -42 -20 -60 172 199 197 100 -122 -47 -28 -195 7 116 28 -89
6163 -89 -327 -85 -13 -47 -96 31 48 29 -26 -96 -141 -171 20 14 -82 -77 -67 -109 -339 74 36 11 -24 -19 -192 109 -36
6190 -36 -194 -37 77 5 352 -71 49 208 -2 156 304 122 110 355 -120 49 13 73 -209 -142 -141 -18 -213
6213 -213 -128 107 78 12 82 -183 -236 -90 -71 23 266 138 141 -105 28 137 104 -36 75 -127 1 150 -82
6236 -82 127 74 103 63 -192 -23 -207 74 -142 42 -70 -103 -141 52 41 -386 155 125 -180 83 -66 -76 -79 167
6260 167 56 -149 128 200 171 4 -80 -55 149 -196 -94 90 105 -33 -269 -84 27 -118 119 -101 48 164
6282 164 275 34 35 193 114 -28 79 84 235 -68 -145 44 43 -207 -9 70 20 24 161 30 -192 172 -212 63
$$ packed form
6114a69L9K10m1j1o4j4R8J13L8R6m86O1m2K12L41m99J60j3k6Q9p6K0j10j07L53
6139A72j86k14L62O4k58jL86m00K61k28K2m0K32K7kr7k22P5J9j67K02J09q8j17
6163h9k38K42P2l4m9J27J7j9n5p0m5l0J91or6NJ0m2k30M13l8k5l5Nj73L01j45
6190c6j58J57J14p2L47m23J20J59k10J58J48j82j2K45m75J69l6O0k82O7JJ23j95
6213b13Q5K35k9o6P0k65n3J46J9R4K43j28Lk46J33J09l3j40J11k02J28J49k32
6236h2K09n3K9m0k55J69j84K81k16J84j12l3l8J93j1m27N41l0l05K63j49j0lK46
6260A67j11k05K77P2k9j67q4K5K04l45J02J84J5j38k36J85J11j45K37k20J49J16
6282A64J11k41JJ58p9j42J07NJ51l03p7J89jk50J98P9n0MJ37j31k22L64l84K75
$$ plain form
6306 63 147 -229 -15 -22 -191 4 -151 -216 -3 -106 121 54 -63 -100 148 73 -7 52 159 0 -93 14 -164 74
6330 74 -44 39 22 12 83 -17 -27 -104 -36 -184 -84 65 -118 -84 351 7 44 200 -168 -22 71 -45 104 -101
6354 -101 -18 -175 -68 44 332 52 -310 56 -36 -72 -209 -36 -133 17 28 -112 -138 146 127 -60 -19 39 -32
6377 -32 -100 -27 15 -188 -227 -25 -47 -196 138 273 -53 21 156 290 78 -21 -191 106 289 113 15 28 165
6400 165 164 51 -17 149 -25 -66 12 -10 167 106 183 230 -12 -99 2 -47 -159 110 -268 -156 88 -82 -131 8
6424 8 -309 62 -116 -157 15 -67 73 193 -64 91 96 89 12 -38 -68 73 -151 83 -148 19 -23 -140 -12 -175
6448 -175 -34 170 54 202 -89 22 -40 -40 -16 305 36 -104 -65 139 -20 -21 -104 72 -12 -168 69 137 1
6471 1 198 -248 -23 -92 29 84 224 -79 207 67 -227 8 -76 154 73 8 41 93 149 -358 -73 86 49 16
$$ packed form
6306F3Q4l76K14pj69J95j55o5K13j03K27o7j17l7K48p5q0N9J07j59r3J07j78K38
6330G4j18Q3j7j0P1j00j0p7O8j48J00J49j83L4M35l44L7J56l68J46R3j16J49k05
6354a01Q3j57J07J12K88k80l62L66r2l6j37J73r7J50J1j40k6K84j9j87M1N8p1
6377c2o8P3M2k03l9K02k2j49L34J35l26P4J35J34k12r9j70K97J83j76r8J3J37
6400A65jj13o8J66j74m1P8k2J77o1P7M7k42q7J01m9j12K69l78J12K44j70m9J39
6424Hl17L71j78m1J72q2J40J20k57J55Npp7n0l0J41k24K34k31J67m2j17J28j63
6448a75J41K04j16J48k91J11o2%K4L21k69j40L9K04j59jq3J76q4j56K37O8j36
6471AJ97m46K25o9J21N5J40l03K86j40k94K35q4K30q1o5L3N2N6n07K85J59l7l3
$$ plain form
6495 16 99 -81 -163 283 173 175 -66 -393 105 75 31 53 -22 -308 8 131 98 123 137 -239 -99 20 -66 186
6519 186 -34 -80 -53 24 -162 165 -34 24 25 54 252 -120 52 179 -53 10 52 18 4 133 42 -46 140 20
6543 20 54 -84 98 -91 -374 38 69 -25 -39 57 -41 65 0 -86 312 31 173 117 46 -7 -234 -245 147 28
6567 28 48 -72 131 60 -73 25 -90 -100 -127 -96 135 -57 -107 -262 13 203 -36 223 52 34 -67 -36 -1 79
6591 79 25 54 27 -233 255 63 -132 38 -143 253 37 167 -447 64 -38 -177 82 27 -76 127 -99 -41
6613 -41 216 27 -123 -114 26 97 -94 32 157 24 159 -24 196 -209 176 226 -54 104 50 45 -180 30 15
6636 15 6 65 -252 83 56 149 5 -4 102 -125 -6 -1 -239 104 59 -3 -13 -48 -222 -66 -140 -54 444 -25 217
6661 217 -99 308 -246 -162 -271 23 173 0 -30 96 110 -169 40 -143 -80 -281 -26 142 -12 123 -40
$$ packed form
6495A6Q3j80q2M46j10Kk41l27M98l0m4K2p5k86L16J23l3K5J4l76J40J19q6K52
6519A86k20m6K7P7j86L27j99N8JK9J98l72J72J27k32O3M2l4j4J29r1q8J86j20
6543B0L4j38J82j89k83M12L1r4j4R6r8J06o5q6L98k81J42n6p1n3k27j1L92j19
6567B8K0j20K03p1j33R8j15j0k7L1K31j92n0j55K75J90k39K59j71j8j01L1L5Q0
6591G9n4K9k7k60M88j92j95J70j81L96k16J30o14N11j02j39K59n5j03K03k26N8
6613d1K57j89j50RJ40P1j91J26J25j33J35j83K20m05L85N0k80J58n4nk25K10j5
6636A5rN9l17L35k7R3j44rJ06k27J19Nk38L43m5o2j0l5j74J56p4Q6M98m69K42
6661B17l16M07n54Q4j09K94J50j73l0J26J4k79K09j83O3k01K55J68j54J35j63
$$ plain form
6682 -40 -82 -5 95 115 46 -93 48 265 314 37 110 37 41 -74 -163 67 7 -176 247 -27 132 -140 93 46
6706 46 -152 64 -53 17 -202 -39 55 -27 -74 -78 41 181 41 78 -378 -125 -29 124 -60 52 65 -94 48
6729 48 -144 -109 195 4 67 14 -202 134 36 160 277 -172 35 -64 -532 -76 8 35 -43 -216 -19 114 -39
6752 -39 72 -45 -25 60 -180 -158 49 99 -66 51 3 -98 8 150 47 21 -207 -83 258 -92 -100 167 66
6775 66 -6 46 80 2 -4 -21 -47 -187 167 -6 4 -66 198 -85 52 155 -93 -221 51 91 83 -181 -42 -126 33
6800 33 -99 -77 -108 -5 -69 190 101 14 138 -22 26 -170 40 26 -150 173 0 -158 -101 49 -146 109 -77
6823 -77 -126 -40 -67 170 175 82 -132 -50 -59 51 65 -140 -117 49 133 -72 108 -249 213 25 136 39 -144 110 -171
6848 -171 -182 66 -85 -29 21 -123 -119 -76 276 80 138 177 21 109 149 -82 152 -51 -191 68 25 199 -132 54
$$ packed form
6682d0m2P7J00K0o9j39J41K17M9k77P3p3Mj15q9K30o0j83M23k74J59k72K33m7
6706D6j98K16j17P0k19J63R4q2m7mJ19J40j40L7m56K53R6J53j84J12J3j59J42
6729D8j92L5L04j91O3n3k16L36r8J24J17m49K07r9m68M56Q4K7p8j73J97J33j53
6752c9J11j17K0Q5k40K2K07N0j65J17m8j01J06J42j03k6k28J24L41l50qK67j01
6775F6p2N2L4p8oj7k6j40L54j73J0p0K64k83J37J03k48j28K72M0qk64J39q4J59
6800C3j32K2l1J03o4K59q9q7J24j60M8j96K10j4j76L23j73j58N7J50j95K55j86
6823g7m9Q6k7K37Nr3k14Q2rJ10J4k05K3J66Q4k05J80l57M62j88J11r7j83K54k81
6848a71j1K48j51N6N0j44MM3L52j96N8L9j56Q8M0k31K34k03j40K59m3J74l31J86
$$ plain form
6872 54 164 25 -237 41 -35 178 -12 -31 3 -170 -37 66 -161 -45 -162 -208 -61 -36 -137 -108 187 -3
6894 -3 36 -76 -153 73 -221 92 -76 -108 128 -95 100 82 55 116 88 -98 181 -101 -118 177 112 -8 -2 36 31
6919 31 -113 -296 -201 -51 -203 -43 -235 43 -74 96 82 -270 87 -25 -39 -79 -119 319 -29 -216 -14 136
6941 136 67 -10 -48 -90 -70 250 153 -91 54 178 227 -66 -92 32 -140 -123 177 -55 -115 6 -106 -67 224 -3
6965 -3 73 172 27 -56 192 -63 160 -148 -116 29 -161 -231 67 21 -207 10 -270 2 -19 -41 -41 47 78 10 90
6990 90 -105 -95 -21 -54 360 134 68 193 -134 -16 -123 76 -110 -98 17 -28 -53 -155 -25 -146 -95 27 -185
7013 -185 -110 -80 -148 61 -269 -142 -16 -69 136 -207 57 -90 7 -115 -11 -53 11 94 -71 -22 226 60 60 -68
7037 -68 -52 144 46 -3 20 281 87 -144 209 209 -278 -195 -91 -88 -47 67 -261 27 15 -91 -15 -14 44 100 30 106
$$ packed form
6872E4J10j39k62K78p6K13j90j9L4j73J33J03k27J16j17m6J47K5j01K9K95j90
6894cL9j12p7K26k94L13j68l2K36k23J95j8k7O1k8j86K79k82j7K95o5j20OL8n
6919C1j44j83R5J50j52J60j92K78j17J70j4l52L57j12j4m0m0M38l48j87K02J50
6941A36o9p7l8m2K0L20r7k44J45J24M9k93k6J24j72J7L00k32o0J21j12L9K91k27
6965cP6R9j45q3K48k55K23l08L2J45j90p0K98m6k28K17k80K72k1k2%Q8L1o8Q0
6990I0j95J0P4l3M14k26o6J25l27J18j07J99j86J2J15m5k5j02J30j21N1J22k12
7013a85P5L0o8K09l30J27J26n3K05l43K64j47R7j22J04m2O4Q3j65M9K48j66%j28
7037f8J6J96r8m9K3K61j94k31L53%m87Q3J04LM1J14l28K88j2j06P6JN8N6p0P6
$$ plain form
7063 106 -20 139 19 -130 165 35 -209 -139 80 113 -33 -80 1 39 -183 -7 -71 -104 232 274 94 43 56
7086 56 168 54 2 11 367 70 10 109 182 212 -49 5 150 -236 -33 39 -69 -248 -21 402 -80 -357 6
7109 6 -67 -348 -97 125 -60 33 -247 32 -270 -4 149 -149 -77 -13 54 171 35 -46 266 -98 -41 -177 8
7132 8 -148 41 61 -82 -71 -58 -272 -158 -170 -8 104 166 -205 -117 249 233 241 -55 96 238 -44 215 -57 78
7156 78 -88 -53 -13 83 93 -155 208 -34 -23 -227 28 20 106 -198 -463 -179 -18 41 51 227 -16 96 97 -157
7180 -157 91 -51 114 -112 155 30 263 72 165 23 -309 -203 -54 -115 -56 21 -6 44 -85 -327 -245 105
7202 105 218 -131 139 -116 -139 -70 0 184 -102 239 70 -32 102 17 56 47 -58 -63 224 166 -38 69 123 71
7226 71 60 110 -22 -51 6 -92 -68 104 -88 -37 -369 -41 124 -192 0 -125 -81 45 -179 273 -93 185 2
$$ packed form
7063A06j26J59j20j49K95j30k44P0K19L3j46m7Q1L8k22J76o4l3L36M2j80n1J3
7086E6J12j14n2RL56k97o0R9P3L0k61N4J45l86K03P2j08j79K27M23m82k77L63
7109Fp3k81K51K22j85R3k80K79l02K66J53k98P2O4O7J17j36q1L12l64N7j36J85
7132Hj56J89K0j43J1J3k14J14j2J62J12O2l71Q8L66j6Qk96J51J42k82K59k72J35
7156G8j66L5M0R6J0k48L63k42J1k04K55qQ6l04k65K84J61N9J0J76k43J12Jk54
7180a57K48j42J65k26K67j25K33j91R3j42l32J06J49o1N9P7k7N0j29k42Q2L50
7202A05J13l49K70k55k3O9P0J84k86L41j69j02J34q5L9rj05nK87n8k04J07N4n2
7226G1j1N0j32k9N7r8K4J72j92N1l32L28J65l16J92j25M4J26k24M52l66K78j83
$$ plain form
7249 2 0 -175 -202 -286 -175 78 10 -144 66 -9 -184 8 -54 -197 166 26 359 -181 -163 171 -170 -73 -45 159
7273 159 108 36 -184 -102 -35 -185 -34 -111 -80 142 -17 -33 -43 -96 -111 112 -46 -195 -134 -57 64 -294 287 -37
7297 -37 -151 -188 -41 -42 -119 97 -7 -105 -79 -8 -38 -3 -22 54 56 -26 -158 130 -129 26 54 -86 220 -313 -11
7322 -11 144 -63 139 -109 42 57 85 70 185 255 -96 216 362 -266 -48 29 73 -41 17 -32 -63 -50 -3 -79
7346 -79 202 17 -43 0 164 -287 -97 318 332 156 -167 -27 -28 -99 108 -229 69 -136 100 -11 -89 68 79
7369 79 99 -135 240 -238 180 -317 -145 -151 -27 171 -18 -65 -94 -6 -8 -28 34 -1 83 37 11 -116 -30 85 -243
7394 -243 -2 -154 -61 99 89 137 -75 102 -302 62 148 37 -152 150 213 -118 232 94 35 -62 214 -151
7416 -151 -6 206 12 -10 45 -15 169 64 178 154 181 -114 -393 -213 53 8 -207 -27 195 105 -137 44
$$ packed form
7249Bkj75k7q4J11K53o8j54K10p5j75J92o2j43L63j40L33n40J8L34l41R7K8K04
7273A59n1p2k20Q2O7j50J51p7L1K22j59j6j0n3j5K23j58j49O1P7J21l58N81l24
7297c7j14l7J47jp7K16j04r8K6P1l0L5j9P6Kq2j32K88k59J55K8j40L06n33L02
7322a1J55k07K02k48J51J5K8j5J15P0l51L12J46o28K18P7M4j14N8m9l1J3M7p6
7346g9K81j85o0M3J64m51J90M15J4j76l23J40jp1K07l37K98k05K36j11p8J57J1
7369G9K0k34L75m78M18m97J72oJ24J98j89m7k9Q8kk0O2l5Q4m6k6j27Q6J15l28
7394b43K41j52R3J60j0M8k12J77m04L64Q6j11j89L02O3l31L50j38n9r7K76l65
7416a51J45K12j94k2N5o0J84j05J14k4K7k95k79J80K66m5k15J80K22r0k42J81
$$ plain form
7438 44 -69 109 28 -232 -112 -31 28 -18 -201 -51 -117 -85 323 40 234 218 -19 -38 -145 -185 -196 24 -172 23
7462 23 -160 95 108 -120 -36 -98 86 -86 -54 30 159 128 306 -54 243 -105 137 -29 99 -62 -38 61 -32
7485 -32 154 -218 60 -70 157 170 103 -50 -228 -189 -181 28 -98 112 -178 141 132 124 -6 -87 203 166 221 68
7509 68 61 28 -158 -11 -139 -69 -84 -256 -116 -102 88 -4 167 71 92 110 4 405 -68 173 -36 55 167 -125
7533 -125 -10 5 109 169 284 -130 84 42 -58 -28 -206 102 -187 -46 -153 242 -64 -101 107 -64 -124 -86
7555 -86 75 -38 123 154 131 7 55 174 -132 -52 169 -219 -40 -110 -202 -104 -28 -128 -291 -372 16 -57 -250 7
7579 7 -17 -33 -53 -208 90 79 7 -150 -74 -133 -209 155 22 -13 163 -63 37 -2 190 -60 -157 109 -153 48
7603 48 107 -58 240 226 64 48 -46 -264 -24 87 28 80 8 9 71 -398 191 82 -121 -191 140 122 -53 -39 -32
$$ packed form
7438D4j13J78q1k60J20Q1N9m6j83J50o6L2M08k83J94j6k37j9j07m0j1K20j96J95
7462B3j83K55J3k28Q4o2J84j72L2Q4J29l1J78l60K97l48K42j66J28j61K4R9r3
7485c2J86l72K78j30K27J3o7j53j78L9QK09j26K10k90L19rqj30q1K90l7N5j53
7509F8pl3j86J47j28P0j5j72J40J4J90r2J71r6K1J8j06M01m73K41k09R1J12k92
7533a25J15J5J04O0J15m14K14m2j00L0j78L08k89J41j07L95l06l7K08j71o0L8
7555h6J61j13J61L1k3j24M8J19l06Q0K21l88J79p0r2R8P6j00j63q1L88p3j93K57
7579Gk4j6k0j55K98j1p2j57P6n9p6L64j33l5J76k26J00l9J92k50r7K66k62K01
7603D8N9j65K98j4j62j6r4k18K40J11n9N2p2JO2m69N89j09k03p0L31j8j75J4P
$$ plain form
7628 -32 18 6 185 80 -24 -65 156 42 100 -151 262 -61 194 -26 -127 -285 -161 -76 -272 76 149 47
7650 47 176 -147 21 -51 -43 -186 -27 -71 178 -19 -178 208 -81 -107 129 124 62 88 164 -6 116 -125 22 21
7674 21 71 152 -49 214 -197 -14 146 12 49 -18 -127 -75 -101 -6 75 -135 306 89 -131 4 -148 -29 83
7697 83 -110 106 -356 24 -109 -233 34 -75 -215 -175 84 -54 -108 -52 42 309 -311 -273 66 51 401 10
7719 10 151 -188 14 -158 442 -111 -239 176 -26 -63 -12 0 -23 74 103 -35 159 103 153 -43 56 27 -39 140
7743 140 18 -81 -40 5 106 94 -127 182 -46 41 -326 -160 -45 -108 244 -150 41 -130 -118 140 -24 -18 -10 -75
7767 -75 97 40 -110 -5 291 -179 182 152 238 -39 -162 74 5 -75 54 56 120 305 -28 156 -111 20 -180
7790 -180 -171 -33 46 207 -2 190 169 45 -254 -235 -139 97 -91 -3 7 -57 24 75 -52 -25 25 -80 128 387
$$ packed form
7628c2N0j2J79j05j04m1K21j14N8k51M13l23K55k20j01j58J24Q5j96L48P3j02
7650D7J29l23J68p2Qj43J59m4K49j97j59L86k89k6K36no2K6P6j70J22k41J47j
7674B1N0Q1k01K63m11J83J60j34L7o7j09N2k6R5Q1k10M41k17k20J35j52J19J12
7697H3j93K16m62L80j33j24K67j09j40M0K59j38n4N6R4K67o20L8L39j5L50l91
7719A0J41l39K02j72O00n53j28M15k02l7N1J2k3R7K9j38J94n6N0j96R9k9o6J79
7743A40j22r9M1M5J01j2k21L09k28Q7l67J66J15o3L52l94J91j71J2K58j64OQo5
7767g5J72n7j50J05K96m70L61l0Q6k77j23K36o9q0J29KO4J85l33J84k67J31k00
7790a80RJ38P9J61k09J92k1j24k99J9R6K36j88Q8J0o4Q1N1j27K7N0j05K08K59
$$ plain form
7814 387 -133 -126 30 8 -80 -216 168 141 88 -8 55 65 -33 -439 40 -92 -112 220 -15 -57 -87 -32 13 -78 -136 288
7840 288 -2 -339 -232 115 116 -40 23 85 -185 -105 32 -148 -232 82 -58 72 42 9 23 -231 48 -2 -47 61
7864 61 -104 1 112 -85 -7 -48 -1 -6 -96 87 -122 127 75 94 -260 -17 -9 9 127 -17 -249 -48 -74 103
7888 103 -112 -40 66 -140 139 15 -26 -129 -322 -239 -34 142 115 69 -148 220 -222 110 128 159 -88 15
7910 15 15 199 -116 -4 29 -249 -52 -95 -11 -106 -146 269 -49 194 -87 27 16 -335 -166 -56 -69 -21 160 75
7934 75 -21 -82 89 -72 310 49 -25 161 212 -145 183 126 31 142 -131 -63 -172 48 -101 54 30 -87 -207
7957 -207 -125 44 118 102 178 -17 9 289 -96 -18 213 15 -43 -5 79 -110 18 -54 258 13 -2 86 50 -140
7981 -140 -75 88 -34 -125 -19 -41 32 129 -159 -13 58 -73 194 -34 -38 111 -60 22 127 -71 133 80 -195
$$ packed form
7814C87n20PJ56k2q8j36L84k7n3r6O3J0r8m06M79j32k0L32k35m2l0N5M5r1n8M24
7840B88k90l37J07L47Jj56O3O2k70Q0J37j80q4L14j40J30l0l3J4k54K79n0m5J08
7864F1j65J05J11j97P8m1M7nr0J83k09K49n2J9l54K43QJ8J18j44k32K01k6J77
7888A03k15P2J06k06K79j24m1j03j93Q3K05J76k7m6k17L68m42L32J8L1k47J03
7910A5%J84l15J12L3k78J97m3Q4r5m0M15l18K43k81J14j1l51J69J10j3M8J81q5
7934G5r6o1J71j61L82k61p4J86N1l57L28n7r5J11k73O8j09K20j49J55k4j17j20
7957b07Q2J69P4j6P6j95K6K80l85P8K31j98n8L8Q4j89J28p2L12k45j5Q8l6j90
7981a40O5J63j22r1J06k2P3R7k88J46P1j31K67k28mJ49j71Q2J05j98K04n3k75
$$ plain form
8004 -195 115 -21 -114 -129 261 -56 -221 109 -59 193 63 -1 -128 68 310 163 216 65 45 -121 172 -85
8026 -85 67 -78 -326 -25 62 -99 57 94 -231 -152 164 13 -60 69 -49 113 -145 -159 -132 166 -297 -57
8048 -57 -132 122 26 72 -56 -174 101 -41 69 155 -33 92 -246 148 129 -197 -82 116 -22 -171 202 53
8070 53 -232 37 27 2 -57 -131 -279 -31 26 47 -121 -7 108 114 -58 -190 -290 -50 -42 -246 29 77 246 -133
8094 -133 -3 -146 -97 -131 -34 150 -150 -128 -46 -47 -16 -52 27 -29 -241 -137 -74 -7 -133 -174 -28 148 -67 -105 -81
8119 -81 228 -28 75 71 -89 264 127 -124 194 144 -117 -13 71 30 102 79 282 -96 180 -231 82 140 233
8142 233 -177 -10 -65 -225 -48 249 119 84 -101 -343 6 131 -250 29 31 105 -141 78 46 -151 35 -149
8164 -149 -48 -343 249 22 -249 59 -47 -99 7 -59 5 -177 88 271 -38 84 49 -102 -222 -116 -47 -148
$$ packed form
8004a95L10j36r3j5L90l17j65L30j68K52j30o4j27J96K42j47N3j51k0j66K93k57
8026h5J52j45k48L01Q7j61J56L7l25P9L16j51p3J29j18J62k58j4K7K98m63K40
8048e7p5K54r6M6j28j18K75j42J10Q6j88J25l38L94j9l26J15J98j38j49L73j49
8070E3k85K69j0k5n9p4j48K48N7K1j68J14J15Oj72j32j00K40Qk04K75M8J69l79
8094a33J30j43M9l4R7J84l00K2Q2jL1l6P9n6k12J04O3O7j26m1J46J76k15l8K4
8119h1L09k56J03mj60L53j37k51L18n0k61J04Q4m1P2k3K03l78K76m11L13N8R3
8142B33m10J67n5j60J77K97j30l5j85k42L49J25l81K79KP4k46K19l2j97J86j84
8164a49J01k95N92k27k71L08j06n2J06o6O4j82K65J83l09J22l5j51j20J06O9j01
$$ plain form
8186 -148 -16 -239 -241 102 191
$$ packed form
8186a48J32k23kL43Q9
8191A91
$$ Imaginary data points
##PAGE= N=2
##DATA TABLE= (X++(I..I)), XYDATA
$$ plain form
0 0 0 0 0 0 0 0 0 0 0 -8 8 -8 8 -12 16 -16 24 -25 32 -40 48 -56 65 -79 92 -107 124 -143 164 -187 215 -243
32 -243 275 -313 353 -396 444 -496 554 -615 686 -762 844 -931 1030 -1138 1255 -1382 1522
49 1522 -1677 1846 -2036 2246 -2480 2744 -3044 3384 -3780 4246 -4799 5472 -6311 7386 -8827
64 -8827 10856 -13923 19082 -29354 57557 -297165 -836985 221291 835968 260847 -140974
75 -140974 348193 530747 83710 -207540 -129252 -118137 -10158 196767 40421 -322436
85 -322436 -145749 261645 96738 -310246 -157091 170163 20560 -258019 -174956 -184
95 -184 74010 210721 257521 19878 -90485 117691 111662 -236024 -283515 49357 120240 -131785
107 -131785 -162016 34173 91275 90134 169369 103840 -58093 3917 98942 -94847 -219847
$$ packed form
0@%%%%%%%%%qJ6j6J6k0K8l2M0m9N7p2Q8j04J21j44J71j99K31k67L07l51M02m58
32b43N18n88O66p49Q40r40J050j169J301j448J606j775J961k168K393k637K904
49A522l199L523l882M282m726N224n788O428p164Q026r045J0271j1783J3697j6213
64h827J9683k4779L3005m8436Q6911l54722n39820J058276O14677n75121m01821
75a40974M89167J82554m47037k91250P8288J1115J07979K06925j56346l62857
85c22436J76687M07394j64907m06984J53155L27254j49603k78579Q3063J74772
95a84P4194J36711M6800k37643j10363K08176o029l47686m7491L32872P0883k52025
107a31785l0231J96189N7102j141P9235o5529j61933O2010R5025j93789j25000
$$ plain form
118 -219847 40189 222089 31894 -63406 97142 62688 -128618 -27980 115233 -137270
128 -137270 -320717 -8689 155867 -206357 -295622 214425 416647 -13415 -197694 141508
138 141508 237224 -85641 -187461 21006 81999 -8534 -10517 -12561 -43854 72766 184304
149 184304 28564 -127231 15397 115882 -97124 -224478 -22937 101028 -40645 -96753
159 -96753 15878 13055 -62983 1047 59059 -23897 -28901 93404 70213 -65884 -7122 148704
171 148704 93973 -40720 -3414 51635 -41692 -106009 -47843 -26265 -46212 4725 26948 -42241
183 -42241 -18643 103879 71481 -59761 -767 125227 10118 -155095 -49790 97399 -9200
194 -9200 -123459 -2587 91027 -25917 -91971 15987 59316 -11967 -6743 49344 15487 -21936
$$ packed form
118b19847K60036J81900j90195r5300J60548l4454j91306J00638J43213k52503
128a37270j83447L12028J64556l62224q9265N10047K02222m30062j84279L39202
138A41508R5716l22865j01820K08467O0993r0533j983k044l1293J16620J11538
149A84304j55740j55795J42628J00485k13006j27354K01541J23965j41673n6108
159i6753J12631k823p6038O4030N8012q2956n004J22305k3191j36097N8762J55826
171A48704n4731j34693L7306N5049r3327o4317N8166K1578j9947N0937K2223o9189
183d2241K3598J22522l2398j31242N8994J25994j15109j65213J05305J47189j06599
194i200j14259J20872R3614j16944o6054J07958M3329p1283N224N6087l3857l7423
$$ plain form
206 -21936 29237 46379 -8304 2587 55920 12083 -52827 -11786 24440 -34559 -49359 22787
218 22787 14364 -72532 -50479 37165 6073 -62660 -2127 73833 17629 -41259 15745 58819
230 58819 11736 -5409 29868 15327 -24430 -7163 8649 -27913 -28393 25441 21585 -31054 -19180
243 -19180 24220 4226 -21287 11953 24761 -15479 -13381 27035 1382 -44414 -1680 48438
255 48438 -4833 -58743 -7352 40183 -8472 -40276 11953 42724 6091 -10291 9592 7809
267 7809 -1326 11879 7066 -19658 -9095 18646 -3399 -31543 196 31340 1394 -21013 7226
280 7226 13873 -18022 -14434 17075 3182 -25274 -2757 21623 -7965 -27613 10185 31356 -627
293 -627 -15646 10043 15813 -5785 -8128 3061 -1485 -4443 3391 -5507 -17956 2410 22800 2614
$$ packed form
206b1936N1173J7142n4683J0891N3333m3837o4910M1041L6226n8999j4800P2146
218B2787q423q6896K2053Q7644l1092o8733O0533P5960n6204n8888N7004M3074
230E8819m7083j7145L5277j4541l9757J7267J5812l6562m80N3834l856n2639J1874
243a9180M3400j9994k5513L3240J2808m0240K098M0416k5653m5796M2734N0118
255D8438n3271n3910N1391M7535m8655l1804N2229L0771l6633j6382J9883j783
267G809r135J3205m813k6724J0563K7741k2045k8144L1739L1144k9946k2407K8239
280G226O647l1895L588L1509j3893k8456K2517K4380k9588j9648L7798K1171l1983
293f27j5019K5689N770k1598k343J1189m546k958P834q898j2449K0366K0390k0186
$$ plain form
307 2614 -13494 10837 22541 -8207 -21938 3022 9551 -11974 -12031 6989 3825 -7181 4993
320 4993 14789 -75 -7400 4796 483 -19416 -16070 3941 3758 -4122 6630 16829 9191 3930
334 3930 7613 295 -11132 -6966 -3373 -15652 -16888 5363 15393 4331 5804 20832 15518 -5258
348 -5258 -9976 -4006 -11067 -18141 -8677 376 -1672 3063 16029 15628 4526 1798 2062 -8151 -19021
363 -19021 -16245 -10279 -5709 4350 14154 14167 13737 19406 15705 -2780 -12447 -6657 -8021 -19003 -16964
378 -16964 264 10244 9713 12276 14511 9321 144 -7374 -14689 -19689 -15935 -7079 -1586 4255 14257
393 14257 20133 18571 15334 8357 -5280 -16307 -16575 -16073 -22092 -19020 1630 16946 14806 11506
407 11506 18416 22517 12109 -3404 -10526 -8920 -5511 -6651 -10124 -6228 5756 13678 4977 -10392
$$ packed form
307B614j6108K4331J1704l0748j3731K4960O529k1525n7J9020l164j1006J2174
320D993R796j4864p325J2196m313j9899L346K0011j83p880J0752J0199p638n261
334C930L683p318j1427M166L593j2279j236K2251J0030j1062J473J5028n314k0776
348e258m718N970p061p074R464R053k048M735J2966m01j1102k728K64j0213j0870
363a9021K776N966M570J0059R804J3m30N669l701j8485r667N790j364j0982K039
378a6964J7228R980n31K563K235n190r177p518p315n000L754Q856N493N841J0002
393A4257N876j562l237o977j3637j1027k68N02o019L072K0650J5316k140l300
407A1506O910M101j0408j5513p122J606L409j140l473L896J1984P922q701j5369
$$ plain form
421 -10392 -13359 -5771 -8918 -23535 -25472 -4947 15043 15525 10034 20433 34281 30096 10099 -4309
435 -4309 -5674 -7026 -15465 -24109 -22498 -10520 1667 2820 -2550 -2236 6659 8566 -3244 -10971 -2820
450 -2820 7843 6723 3133 10345 19234 15249 6803 4516 -1754 -16637 -24069 -16633 -14112 -23972 -20854
465 -20854 5035 20825 9029 2646 20967 33582 16212 -3083 -772 7537 3323 -7220 -11556
478 -11556 -9255 -1933 3238 -6265 -22098 -16781 4554 4478 -18407 -19475 12748 29530 8638 -7223
492 -7223 12027 31855 15583 -11273 -11096 5122 4076 -10699 -15928 -7647 1506 4497 307 -7124
506 -7124 -5820 7969 11894 -5899 -16170 1361 15668 -1043 -17499 -1885 15732 3609 -11712
519 -11712 100 12598 1668 -7040 5658 11441 -3786 -8882 6576 9040 -11534 -18150 1014
$$ packed form
421a0392k967P588l147j4617j937K0525J9990M82n491J0399J3848m185j9997j4408
435d309j365j352q439q644J611J1978J2187J153n370L14Q895J907j1810p727Q151
450b820J0663j120l590P212Q889l985q446k287o270j4883p432P436K521r860L118
465b0854K5889J5790j1796o383J8321J2615j7370j9295K311Q309m214j0543m336
478a1556K301P322N171r503j5833N317K1335p6k2885j068L2223J6782k0892j5861
492g223J9250J9828j6272k6856J77J6218j046j4775n229Q281R153K991m190p431
506g124J304J3789L925j7793j0271J7531J4307j6711j6456J5614J7617j2123j5321
519a1712J1812J2498j0930q708J2698N783j5227n096J5458K464k0574o616J9164
$$ plain form
532 1014 8232 -8858 -15020 1615 11498 3109 -3013 2121 4819 3462 5976 3188 -6028 -1996 14287
547 14287 12197 -11231 -15514 7310 10406 -18704 -32039 -7150 10675 -4786 -16982 1484 24165
560 24165 21631 8457 6425 12661 13969 6097 -5857 -13485 -8299 1038 -2996 -16892 -16609 1868
574 1868 8546 -9464 -20216 -2386 14256 2123 -11764 4020 25359 18590 3597 10586 19497
587 19497 6916 -8813 -7211 -7363 -19324 -22375 -9749 -4606 -9731 -2816 12742 13914 4405 5371
601 5371 10844 5154 -2303 456 1712 -2761 -767 6591 3915 -5452 -4262 2964 -2387 -15063 -15145
616 -15145 -3988 444 -5013 -4736 6441 15903 13480 5858 4599 8149 6173 -3461 -10412 -9282 -3172
631 -3172 -1158 -4099 -5461 576 8310 6133 -4173 -7327 927 4130 -5928 -11838 -986 10431
$$ packed form
532A014P218j7090o162J6635R883q389o122N134K698j357K514k788r216M032J6283
547A4287k090k3428m283K2824L096k9110j3335K4889J7825j5461j2196J8466K2681
560B4165k534j3174k032O236J308p872j1954p628N186R337m034j3896K83J8477
574A868O678j8010j0752J7830J6642j2133j3887J5784K1339o769j4993O989Q911
587A9497j2581j5729J602j52j1961l051J2626N143n125O915J5558J172r509R66
601E371N473n690p457K759J256m473J994P358k676r367J190P226n351j2676q2
616a5145J1157M432n457K77J1177R462k423p622j259L550j976r634o951J130O110
631c172K014k941j362O037P734k177j0306l154Q254L203j0058n910J0852J1417
$$ plain form
645 10431 5614 -2646 2858 11132 6195 -4127 -5094 -824 -2486 -5743 -3960 -211 1322 3116 5290
660 5290 3212 11 1338 1813 -3316 -6573 -2997 -67 -1911 -1407 3089 4383 2440 2950 3586 55
676 55 -2769 -1383 -1712 -4344 -3674 135 757 -485 1653 3085 689 -429 953 257 -2504 -1465 1665
693 1665 1432 311 1648 3069 1914 975 -27 -1254 -1898 -1143 -1615 -3858 -2153 1414 34 -2001
709 -2001 650 3909 1514 -1767 487 2434 -189 -2205 -473 591 -762 -1216 392 778 175 837
725 837 1113 149 484 1296 207 -785 57 714 -539 -1650 86 686 -1387 -1484 133 261 -1476 -534
743 -534 947 8 -982 593 1837 463 -148 1213 1734 170 -958 -559 -516 -1000 -655 -876 -829 515
761 515 1938 942 427 1606 2173 271 -1419 -823 -405 -1649 -2039 -1022 -435 -367 326 758 -359 -271 932
$$ packed form
645A0431m817q260N504Q274m937j0322r67M270j662l257J783L749J533J794K174
660E290k078l201J327M75n129l257L576K930j844N04M496J294j943N10O36l531
676E5k824J386l29k632O70L809O22j242K138J432k396j118J382o96k761J039L130
693A665k33j121J337J421j155r39j002j227o44P55m72k243J705L567j380k035
709b001K651L259k395l281K254J947k623k016J732J064j353m54J608L86o03O62
725H37K76r64L35Q12j089r92Q42O57j253j111J736O00k073r7J617J28j737R42
743e34J481r39r90J575J244j374o11J361N21j564j128L99M3m84L45k21M7J344
761E15J423r96n15J179N67j902j690N96M18j244l90J017N87O8O93M32j117Q8J203
$$ plain form
780 932 513 -1485 -1157 1217 937 -250 364 1822 2069 1051 512 465 135 -108 -554 -1559 -1130 191
798 191 201 -1429 -1012 1045 544 -1468 -1078 615 486 -762 -437 900 1166 338 71 450 77 37 -10
817 -10 -184 -224 617 1058 26 443 1506 948 -94 -89 238 -476 -723 -389 100 -650 -1020 8 -248 -1216
837 -1216 -1068 -230 -55 -720 118 626 1026 1088 1449 606 -46 388 376 -779 -1536 -279 697 452 320 968
857 968 1303 849 225 -835 -1691 -1804 -1324 -1627 -2050 -476 1723 1425 591 786 1910 1121 -1026 -1582 -1406
876 -1406 -1418 -875 4 183 915 2465 2916 1033 -368 374 -80 -2105 -2521 -1479 -298 111 879 1635
894 1635 1202 1065 1600 -25 -1970 -2233 -1010 -757 -1700 -641 813 2230 2081 1263 -77 -39 287 -1258
912 -1258 -3187 -2233 773 1640 675 1664 3904 3825 1416 320 -876 -2177 -2802 -2687 -3218 -3215 -601 1705
$$ packed form
780I32m19j998L28K374k80j187O14J458K47j018n39m7l30k43m46j005M29J321
798A91J0j630M17K057n01k012L90J693j29j248L25J337K66q28k67L79l73m0m7
817a0j74m0Q41M41j032M17J063n58j042NL27p14k47L34M89p50l70J028k56r68
837a216J48Q38J75o65Q38N08M00O2L61q43o52M34j2j155p57J257R76k45j32O48
857I68L35m54o24j060q56j13M80l03m23J574K199k98q34J95J124p89k147n56J76
876a406j2N43Q79J79P32J550M51j883j401P42m54k025m16J042J181M09P68P56
894A635m33j37N35j625j945k63J223K53r43J059J454J417j49q18j340L8L26j545
912a258j929R54L006Q67r65R89K240p9k409j096j196j301o25J15n31LK614K306
$$ plain form
930 1705 972 137 1618 3002 957 -1414 -700 320 -441 -789 861 1824 1499 1652 2015 104 -2002
947 -2002 -2015 -2076 -3237 -3917 -2498 333 1495 1852 2593 3226 3370 2496 424 -976 -1507 -1473 -1504 -1893 -1814 -479
967 -479 870 1079 -410 -1599 -112 622 -986 -2908 -750 2682 2555 258 2083 4805 3383 -37
983 -37 -881 -70 -1810 -3354 -2499 -2335 -3021 -493 2372 915 -1107 1576 3359 532 -2626 -84 2066
1000 2066 -484 -1517 1110 2333 632 31 1119 18 -2190 -1777 -682 -1904 -2248 -346 1090 1070
1016 1070 731 1754 2416 1750 576 106 -609 -280 -938 -1048 -833 -73 -109 446 1379 299 -637 -216 815
1035 815 -1056 -2877 -1021 1724 257 -2059 291 3081 888 -1342 -54 1458 -19 -1025 388
1050 388 837 -459 539 1740 109 -1475 391 1131 -1686 -3269 -570 931 -1576 -2190 605 1975
$$ packed form
930A705p33q35J481J384k045k371P14J020p61l48J650R63l25J53L63j911k106
947b002j3o1j161o80J419K831J162L57P41O33J44q74k072j400n31L4l1l89P9J335
967d79J349K09j489j189J487P34j608j922K158L432j27k297J825K722j422l420
983c7q44Q11j740j544Q55J64o86K528K865j457k022K683J783k827l158K542K150
1000B066k550j033K627J223j701o01J088j101k208M13J095j222l44J902J436k0
1016A070l39J023O62o66j174m70p15L29o58j10K15P60l6N55R33j080r36M21J031
1035H15j871j821J856K745j467k316K350K790k193k230J288J512j477j006J413
1050C88M49j296R98J201j631j584J866P40k817j583K699J501k507o14K795J370
$$ plain form
1066 1975 365 -285 1326 1367 109 13 541 -618 -1249 3 97 -1022 -392 763 573 -423 -265 715
1084 715 368 1 307 112 110 326 406 53 -376 436 -135 -847 -376 -199 -1363 -1229 184 7 -1458 -608
1104 -608 1093 255 -1140 285 2129 931 -199 1037 1445 -72 -59 809 -129 -989 -130 567 -1302
1121 -1302 -1882 436 696 -1231 -1213 596 574 -745 -11 745 617 -549 -22 325 -735 -207 498 288
1139 288 -860 141 1158 175 -360 756 1044 29 -243 529 11 -800 -587 2 -820 -668 -46 -295
1157 -295 -397 -286 581 -102 -537 398 670 -575 -537 126 450 -620 -100 713 394 -308 638 1002 352 117
1177 117 840 752 -588 -44 412 -468 -1309 -595 -73 -776 -811 227 237 -447 219 681 198 -652 364 642
1197 642 -303 -716 382 357 -373 69 925 383 -224 860 1059 -137 -434 546 542 -569 -402 303 -397 -770
$$ packed form
1066A975j610o50J611M1j258r6N28j159o31J252R4j119O30J155j90r96J58R80
1084G15l47l67L06j95kK16Q0l53m29Q12n71p12M71J77j164J34J413j77j465Q50
1104f08J701q38j395J425J844j198j130J236M08j517J3Q68r38q60Q59O97j869
1121a302n80K318K60j927J8J809k2j319P34P56j28j166N27L47j060N28P05k10
1139B88j148J001J017r83n35J116K88j015k72P72n18q11K13N89q22J52O22k49
1157b95j02J11Q67o83m35R35K72j245L8O63L24j070N20Q13l19p02R46L64o50k35
1177A17P23q8j340N44M56q80q41P14N22p03l5J038J0o84O66M62m83q50J016K78
1197F42r45m13J098k5p30M42Q56n42o07J084J99j196k97R80mj111J67P05p00l73
$$ plain form
1217 -770 -285 -98 -770 -548 361 -144 -792 131 539 -299 -327 669 846 -68 -181 623 293 -64 414 783
1237 783 443 101 744 440 -233 -170 -89 -628 -984 -542 86 -616 -402 242 402 98 495 837 246 -323 60
1258 60 228 -640 -683 187 407 -160 174 677 534 40 335 406 -359 297 250 265 -205 -124 -1 -353 -662 -465
1280 -465 -129 -297 -546 -284 168 -223 -10 640 337 360 542 282 -523 -324 109 40 -147 5 461 254 -286
1301 -286 281 366 27 -331 116 -92 -890 -737 -277 -320 -289 341 242 -243 -41 273 164 -421 -84 171 19
1322 19 -111 259 436 162 126 388 413 30 68 522 -180 -65 135 95 -61 167 61 -103 -522 -392 -76 -171
1344 -171 -451 -12 63 -371 -8 258 368 -184 162 408 -180 -96 219 250 90 -92 486 318 83 297 315
1365 315 137 -312 -147 5 -333 -453 28 -46 -69 9 -110 104 305 192 42 -74 -31 53 223 96 -148 -38
$$ packed form
1217g70M85J87o72K22R09n05o48R23M08q38k8R96J77r14j13Q04l30l57M78L69
1237G83l40l42O43l04o73O3Q1n39l56M42O28p02K14O44J60l04L97L42n91n69L83
1258F0J68q68m3Q70K20n67L34N03j43m94K95P1p65O56m7J5m70Q1J23l52l09J97
1280d65L36j68k49K62M52l91K13O50l03K3J82k60q05J99M33o9j87J52M56k07n40
1301b86N67Q5l39l58M47k08p98J53M60m3L1O30r9m85K02L14j09n85L37K55j52
1322A9j30L70J77k74l6K62K5l83L8M54p02J15K00m0j56K28j06j64m19J30L16r5
1344a71k80M39P5m34L63K66J10n52L46K46n88Q4L15L1j60j82N78j68k35K14J8
1365C15j78m49J65J52l38j20M81p4k3P8j19K14K01j13j50j16M3Q4J70j27k44J10
$$ plain form
1387 -38 -101 8 108 -104 -145 72 85 -172 16 239 161 87 104 66 -5 -417 -339 84 -349 -260 190 -48 -262 -12
1411 -12 150 121 -103 -127 183 -114 61 144 121 -111 52 84 97 27 -281 -129 5 -121 -65 162 -113 -105 -32 65
1435 65 100 222 145 118 73 72 -47 123 147 149 -237 -148 138 4 -127 -14 -75 -106 102 171 145 131 -383 37 298
1460 298 106 -69 42 -151 -278 -27 266 248 -100 9 2 -133 -211 316 216 -115 -101 40 140 -92 -47 138
1482 138 63 43 -305 8 10 -16 -33 -88 52 226 173 -43 -229 -35 -78 64 -35 -155 87 -36 -31 101 215 122
1506 122 206 -18 -273 118 -264 -200 -83 10 12 -62 -88 17 244 -393 68 152 15 62 210 -75 -298 -79 331
1529 331 194 -364 67 396 -117 -253 -31 142 -142 -95 85 116 141 -32 28 119 44 -95 -116 72 317 -37
1551 -37 -88 -32 -140 282 183 139 -80 186 -21 15 -86 120 -66 -19 -224 154 212 -98 -37 -84 202 -199 -21
$$ packed form
1387c8o3J09J00k12m1K17J3k57J88K23p8p4J7l8p1m12P8M23m33Q9M50k38k14K50
1411a2J62k9k24k4L10k97J75Q3k3k32J63L2J3p0l08J52J34j26N6K27k75QP3R7
1435F5L5J22p7k7m5jj19J70K4Kl86Q9K86j34j31J13o1l1K08O9k6j4n14M20K61
1460B98j92j75J11j93j27K51K93j8l48J09pj35p8N27j00l31J4J41J00k32M5J85
1482A38p5k0l48L13Kk6j7n5J40J74n3k16j86J94m3J42r9j20K42j23NJ32J14r3
1506A22Q4k24k55L91l82O4J17R3Kp4k6J05K27o37M61Q4j37M7J48k85k23K19M10
1529C31j37n58M31L29n13j36K22J73k84M7J80L1K5j73O0R1p5j39k1J88K45l54
1551c7n1N6j08M22r9m4k19K66k07L6j01K06j86M7k05L78N8l10O1m7K86m01J78
$$ plain form
1574 -21 232 -14 20 199 135 -9 -203 -23 -104 -61 -79 -138 170 -21 59 4 86 -181 138 34 200 30 78 156
1598 156 -16 -50 -30 114 -42 -466 20 113 -80 -1 83 207 -23 -43 -43 -98 140 183 7 -16 11 15 131 -130 -126
1623 -126 212 -37 -287 -97 -2 110 -37 -287 58 85 42 7 89 -10 -269 78 73 -69 -48 119 -144 138 -154
1646 -154 255 -211 150 -37 -171 -120 110 188 -219 -48 77 110 142 -141 204 -169 -51 -136 149 83 -60 -6
1668 -6 -89 88 168 164 -6 55 -100 -100 165 -26 -188 -58 65 143 -8 135 -60 -70 -61 -13 -85 37 16 236 -277
1693 -277 149 -72 -234 221 -114 155 -57 -304 -6 -11 -54 -46 -246 -23 -23 19 -1 165 35 148 194 82 -46
1716 -46 228 81 -13 114 -79 -135 212 -4 -167 -261 -171 -40 -5 -116 29 -48 -76 2 -20 54 -69 54 -148 62
1740 62 -209 80 26 -29 -114 201 -15 221 161 99 76 51 -162 35 -10 -124 -150 228 94 31 328 228 48 -40
$$ packed form
1574b1K53k46L4J79o4j44j94J80q1M3j8n9L08j91Q0n5Q2k67L19j04J66j70M8P8
1598A56j72l4K0J44j56m24M86R3j93P9Q4J24k30k0%n5K38M3j76k3K7MJ16k61M
1623a26L38k49k50J90R5J12j47k50L45K7m3l5Q2r9k59L47nj42K1J67k63K82k92
1646a54M09m66L61j87j34N1K30P8m07J71J25L3L2k83L45l73J18q5K85o6j43N4
1668fq3J77Q0mj70O1j55%K65j91j62J30J23P8j51J43j95j0RM8p2J22k1K20n13
1693b77M26k21j62M55l35K69k12k47K98nm3Qk00K23%M2k0J66j30J13M6j12j28
1716d6K74j47r4J27j93n6L47k16j63r4R0J31L5j11J45p7k8P8k2P4j23J23k02K10
1740F2k71K89n4n5q5L15k16K36o0o2k3k5k13J97m5j14k6L78j34o3K97j00j80q8
$$ plain form
1764 -40 -45 -162 -204 90 -97 -197 215 -82 69 75 -29 -101 3 -162 -9 -37 -55 -219 126 219 213 -78 -136 -9
1788 -9 -245 305 -129 178 -11 -59 -204 -222 105 131 -72 40 90 1 -42 -135 -186 -77 23 261 -34 31 -279 -75
1812 -75 95 -74 -248 -204 100 213 -13 106 35 -192 167 -203 349 97 49 -72 232 -223 -61 -280 -221 -124
1834 -124 41 -5 -177 -18 -69 -94 -36 192 33 183 155 -41 13 161 147 39 -213 -139 95 -19 16 236 -127
1857 -127 -158 -159 20 207 -140 14 -73 167 45 39 249 -52 -161 74 208 -68 265 -135 -136 -33 -42 -96 153 -94
1881 -94 -165 -92 225 180 -158 -28 52 -147 190 126 62 -106 51 53 11 160 -53 10 83 -207 -19 -16 -38 215 -36
1906 -36 36 214 -197 -250 58 101 233 -43 -205 -26 -392 -76 8 187 226 -207 24 256 -78 -41 -179 37
1928 37 -111 -184 -94 -33 -43 -212 62 -112 293 -12 -17 172 38 129 1 -19 113 181 9 -188 -135 -20 -8 -46
$$ packed form
1764d0nj17m2K94j87j00M12k97J51Oj04p2J04j65J53k8j8j64L45R3ok91n8J27
1788ik36N50m34L07j89m8j45j8L27K6k03J12N0q9m3r3n1J09J00K38k95O5l10K04
1812g5J70j69j74M4L04J13k26J19p1k27L59l70N52k52m8j21L04m55J62k19N9R7
1834a24J65m6j72J59n1k5N8K28j59J50k8j96N4J48j4j08k52P4K34j14L5K20l63
1857a27l1jJ79J87l47J54q7K40j22oK10l01j09K35J34k76L33m00jJ03rn4K49k47
1881i4p1P3L17m5l38J30Q0j99L37o4o4j68J57Km2J49k13O3P3k90J88Lk2K53k51
1906c6P2J78m11n3L08M3J32k76j62J79l66L16Q4J79L9m33K31K32l34L7j38K16
1928C7j48p3R0O1j0j69K74j74M05l05nJ89j34R1j28k0J32O8j72j97N3J15J2l8
$$ plain form
1952 -46 85 -134 147 -88 -124 -181 -33 116 96 -63 130 -65 20 146 -116 -36 -64 -101 -12 -198 92 207 71
1975 71 145 30 47 249 -138 -114 267 -16 -179 -48 -166 109 -199 111 81 -298 -69 -108 35 99 -241 1
1997 1 -125 -90 -35 -157 -117 121 265 150 -67 230 -96 269 45 128 197 -137 -45 -26 66 20 -13 -31 120 123 -85
2022 -85 -31 30 14 -118 -74 -187 -115 -17 -142 -149 13 -188 171 17 121 103 -108 -64 40 -290 -54 40 40 -97 -206
2047 -206 231 -137 -431 -117 -110 257 186 -74 114 -329 54 -162 -290 150 138 10 -74 -4 14 77 -111 -74 -68 -182
2071 -182 -45 -100 -38 182 -262 -145 167 -16 -187 -18 198 -10 61 169 59 -93 243 -114 -113 160 227 -48
2093 -48 143 202 -76 -158 -82 1 15 -22 183 76 23 -132 -249 -104 -218 -85 -82 360 205 66 -128 22 -198
2116 -198 -52 -21 -85 75 -203 -148 67 58 92 -108 59 -39 109 -198 -67 -103 26 -23 6 -33 246 136 -121 -34
$$ packed form
1952d6J31k19K81k35l6n7J48J49k0j59J93j95Q5J26k62Q0k8l7Q9j86K90J15j36
1975G1P4j15J7K02l87K4L81k83j63J31j18K75l08L10l0l79K29l9J43O4l40K42
1997Aj26L5N5j22M0K38J44j15k17K97l26L65k24Q3O9l34R2J9R2m6l3j8J51Lk08
2022h5N4O1j6j32M4j13P2R8j25pJ62k01L59j54J04j8k11M4J04l30K36R4%j37j09
2047b06M37l68k94L14PL67p1k60J88m43L83k16j28M40j2j28q4P0J8O3j88L7Oj14
2071a82J37n5O2K20m44J17L12j83j71J69K16k08P1J08j10j52L36l57JK73O7k75
2093d8J91N9k78q2P6Q3J4l7K05j07n3j55j17J45j14J33LM42j55j39j94J50k20
2116a98J46L1o4J60k78N5K15rL4k00J67r8J48l07J31l6J29m9K9l9K79j10k57Q7
$$ plain form
2140 -34 117 94 194 138 -78 -328 171 36 -119 -35 137 -175 -48 -9 -52 -28 -143 -103 10 87 -28 83 117
2163 117 55 19 -106 144 32 -167 -128 55 27 32 60 -64 76 7 83 49 80 -25 175 264 80 -59 162 101
2187 101 -108 -17 -11 -102 131 -166 -234 -57 26 -98 66 95 30 -85 -79 -14 55 172 -156 6 140 -142 118 -153
2211 -153 54 -255 168 -58 -179 162 17 -144 -3 -135 -134 243 -325 181 23 -197 -44 -229 -103 65 -215
2232 -215 81 221 -6 147 -189 -48 -20 7 251 35 14 -117 107 38 167 -146 109 -41 -72 43 -343 211
2254 211 84 357 -203 -34 73 -122 161 230 -53 129 -38 41 192 -161 63 60 139 98 248 213 103 -35
2276 -35 -83 7 1 -13 -116 81 71 108 289 -187 -149 121 -162 -231 -159 71 -60 186 138 -145 -47 57 -20 64 -229
2301 -229 -151 147 -34 288 -48 24 -327 71 47 -72 -74 -67 -6 76 70 190 31 94 190 95 -286 67 -160 2 -106
$$ packed form
2140c4J51k3J00n6k16k50M99j35j55Q4J72l12J27L9m3K4j15M0J13P7j15J11L4
2163A17o2l6j25K50j12j99L9J83k8NK8j24J40o9P6l4L1j05K00Q9j84j39K21o1
2187A01k09R1Or1K33k97o8J77Q3j24J64K9o5j15OO5O9J17l28J62J34k82K60k71
2211a53K07l09M23k26j21L41j45j61J41j32JL77n68N06j58k20J53j85J26J68k80
2232b15K96J40k27J53l36J41K8K7K44k16k1j31K24o9J29l13K55j50l1J15l86N54
2254B11j27K73n60J69J07j95K83O9k83J82j67P9J51l53K24lP9m1J50l5j10j38
2276c5m8R0oj4j03J97j0L7J81m76L8K70k83o9P2K30j31K46m8k83R8J04p7Q4k93
2301b29P8K98j81L22l36P2l51L98k4j19kPO1Q2oJ20j59O3R6r5l81L53k27J62j08
$$ plain form
2326 -106 79 32 -70 -200 129 97 172 42 -125 21 197 210 167 -19 -164 -140 151 -159 -102 228 21 -54 -10
2349 -10 -36 187 -52 -224 232 176 -2 -149 147 60 -119 23 66 -29 -31 61 -48 79 21 -161 -46 208 -16
2372 -16 22 -161 -94 -121 186 -81 -103 307 94 17 186 34 -152 -28 194 -235 -37 -17 -188 286 74 -68
2394 -68 -187 -30 152 -67 164 -209 -104 234 -273 -29 264 20 26 84 -106 86 70 42 2 8 385 -187 97
2417 97 -192 14 213 84 355 151 -158 -119 -152 -40 -55 -66 -109 -53 -26 -33 -191 67 -22 24 307 -80 -92 390
2441 390 -104 -117 76 -117 -51 -94 178 103 -180 -105 -111 298 32 107 -43 43 1 -31 -53 111 -379 18 12 35 278
2466 278 26 -157 275 31 82 50 21 113 32 14 -26 -73 67 188 180 -4 32 95 -22 -25 51 190 1 163 87
2491 87 -75 201 32 -40 89 -77 -143 -135 167 110 110 234 199 47 50 -66 43 97 120 168 69 243 117 82 -40
$$ packed form
2326a06J85m7j02j30L29l2P5j30j67J46J76J3m3j86j45K4K91l10N7L30k07p5M4
2349a0k6K23k39j72M56n6j78j47K96q7j79J42M3r5kR2j09J27n8j82J15K54k24
2372a6L8j83O7k7L07k67k2M10k13p7J69j52j86J24K22m29J98K0j71M74k12j42
2394f8j19J57J82k19K31l73J05L38n07K44K93k44ON8j90J92j6k8m0OL77n72K84
2417I7k89K06J99j29K71k04l09L9l3J12j5j1m3N6K7pj58K58q9M6K83l87j2M82
2441C90m94j3J93j93O6m3K72p5k83P5oM09k66P5j50Q6m2l2k2J64m90L97oK3K43
2466B78k52j83M32k44N1l2k9R2q1j8m0m7J40J21qj84L6O3j17lP6J39j89J62p6
2491H7j62K76j69p2J29j66o6QL02n7%J24l5j52Lj16J09N4K3M8r9J74j26l5j22
$$ plain form
2516 -40 -66 55 108 172 -130 165 -93 237 12 -72 45 -21 -32 -146 -166 38 215 -39 118 170 113 -92 24
2539 24 6 232 105 217 151 -215 45 96 -25 5 -201 27 52 -80 10 -176 172 75 -40 -193 -76 -63 258
2562 258 -182 -74 -114 127 -34 -140 -13 11 -125 155 223 211 -85 -41 231 193 -2 -129 307 -212 -106 88
2584 88 66 165 -89 42 -48 114 237 -87 -16 -142 75 36 35 47 86 -11 57 46 344 -99 -82 192 -67 -159 92
2609 92 -101 -181 -117 -198 -119 -145 202 193 -2 -181 112 -50 63 -42 14 201 -128 324 196 187 -138 3 242 95
2633 95 28 150 -13 65 -54 -40 -145 -51 165 59 29 -10 120 134 154 206 -61 -129 -48 54 170 195 -6 50 -141
2658 -141 -114 50 -114 -64 -231 26 -89 91 173 111 239 46 170 -74 -193 -58 -147 92 -70 -104 -136 -315
2680 -315 256 -81 -6 -51 -8 70 162 74 83 -94 -108 73 -70 30 124 -155 -214 -243 16 46 -57 254 68 -111
$$ packed form
2516d0k6J21N3O4l02K95k58L30k25q4J17o6j1j14k0K04J77k54J57N2n7k05J16
2539B4j8K26j27J12o6l66K60N1j21L0k06K28K5j32R0j86L48r7j15j53J17J3L21
2562B58m40J08m0K41j61j06J27K4j36K80O8j2k96M4K72l8j95j27M36n19J06J94
2584H8k2R9k54J31r0J62J23l24P1j26K17l9jJ2L9r7O8j1K98m43J7K74k59r2K51
2609I2j93q0O4q1P9k6L47rj95j79K93j62J13j05N6J87l29M52j28rl25J41K39j47
2633I5o7J22j63P8j19J4j05R4K16j06l0l9J30J4K0N2k67o8Q1J02J16K5k01N6j91
2658a41K7J64j64N0j67K57j15J80Q2o2J28j93J24k44j19J35q9K39j62l4l2j79
2680c15N71l37P5m5M3P8R2q8Rj77j4J81j43J00R4k79n9k9K59L0j03L11j86j79
$$ plain form
2704 -111 157 4 -59 143 176 215 103 290 0 -66 21 50 -81 39 -102 -254 -7 29 132 -8 128 66 -38
2727 -38 -68 -81 129 184 -212 -92 -7 125 141 -79 -198 -129 20 231 -11 -146 94 17 66 -104 32 -90 -127
2750 -127 158 -159 422 -227 50 127 -10 147 -157 -171 318 -75 -69 179 -5 -26 -185 -41 -144 123 109 -115
2772 -115 146 74 5 15 119 80 -246 38 -66 44 -39 74 -180 37 348 80 -351 -24 107 -79 434 -20
2794 -20 64 -17 97 232 -35 72 123 3 -31 -8 -175 -36 -36 -44 202 -321 -112 -39 -98 -1 -146 -98 89 -70 135
2819 135 -141 -203 -12 44 168 -121 261 10 80 151 4 53 -59 15 -48 46 184 44 -41 19 65 58 -26 144 39
2844 39 115 98 39 137 -309 109 -51 -112 -8 26 -144 266 -34 99 74 46 111 16 -124 153 44 30 -44 52 117
2869 117 -32 21 361 168 -100 -29 80 -93 -252 16 63 -96 142 63 37 124 101 -81 -81 -117 169 20 5 149
$$ packed form
2704a11K68j53o3K02L3L9j12J87k90o6Q7K9j31J20j41j52K47L6J03j40J36o2j04
2727c8l0j3K10N5l96J20Q5J32J6k20j19O9J49K11k42j35K40p7M9j70J36j22l7
2750a27K85l17N81o49K77P7j37J57l04j4M89l93OK48j84k1j59J44j03K67j4k24
2772a15K61p2o9J0J04l9l26K84j04J10q3J13k54K17L11k68m31L27J31j86N13m54
2794b0Q4q1J14J35k67J07N1j20l4K3j67J39%qK46n23K09P3n9R7j45M8J87j59K05
2819A35k76o2J91N6J24k89L82k51P0P1j47M9j12P4o3R4J38j40q5O0M6pq4J70j05
2844C9P6j7n9R8m46M18j60o1J04L4j70M10l00J33k5k8O5r5j40K77j09j4p4R6O5
2869A17j49N3L40j93k68P1J09j73j59K68M7j59K38p9k6Q7k3j82%l6K86j49j5J44
$$ plain form
2893 149 25 -231 28 6 0 233 36 20 180 -50 53 -100 -61 -88 -59 -50 9 22 -137 -6 106 3 154 63
2917 63 33 371 -160 123 64 76 287 96 179 -257 23 119 -45 -62 -208 -320 -154 -44 28 -11 136 94 -320
2940 -320 102 159 253 150 17 -116 -69 148 -90 -83 106 -131 203 55 -183 -195 -102 -1 -13 -91 32 -10 152
2963 152 13 82 -109 -20 -25 67 72 64 -61 -44 -178 -151 170 275 -34 38 44 12 -154 -96 75 18 -112 -161 173 137
2989 137 -97 53 148 -102 -171 -247 64 -165 -110 197 206 -149 -186 124 -111 -49 29 -253 -73 -59 -115 -131 89 -37
3013 -37 -180 -197 110 230 219 39 -145 -57 -159 6 105 47 64 275 29 37 39 102 23 171 83 44 -63 -91 -136 150
3039 150 144 363 34 50 17 19 -22 376 5 249 -115 -85 -29 -207 57 43 60 -127 -170 215 177 -147 137 278
3063 278 -134 80 -141 -88 -307 -174 -22 -81 191 -168 201 -50 144 -45 164 -69 211 -48 125 158 -271
$$ packed form
2893A49j24k56K59k2oK33j97j6J60k30J03j53L9k7K9RN9J3j59J31J12j03J51r1
2917F3l0L38n31K83n9J2K11j91Q3m36K80R6j64j7j46j12J66J10P2l9J47m2m14
2940c20M22N7R4j03j33j33M7K17k38PJ89k37L34j48k38j2R3J01j2p8J23m2J62
2963A52j39O9j91Q9nR2Nqj25J7j34K7L21J05l09P2Ol2j66N8J71n7j30m9L34l6
2989A37k34J50R5k50o9p6L11k29N5L07Rl55l7L10k35O2P8k82J80J4n6j6K20j26
3013c7j43j7L07J20j1j80j84Q8j02J65R9n8J7K11k46QKO3p9J48q8l9j07k8m5K86
3039A50oK19l29J6l3Km1L98l71K44l64L0N6j78K64j4J7j87m3L85l8l24K84J41
3063B78m12K14k21N3k19J33J52n9K72l59L69k51J94j89K09k33K80k59J73L3m29
$$ plain form
3084 -271 86 264 38 99 -207 -110 -125 -126 -19 -11 19 -172 16 99 2 -156 -198 130 87 105 -75 -23 -189 31 137
3109 137 266 -46 -17 180 180 -155 -56 219 -16 -58 -259 137 -223 -12 3 220 -193 -139 -304 -6 8 -39 132
3132 132 -134 123 98 153 127 -116 -150 77 -38 -72 -81 -69 86 -244 277 -173 17 167 83 -104 -271 -215 194
3155 194 188 77 202 -83 -126 -2 -53 50 198 -52 143 -31 68 15 -8 -30 90 -52 -203 -76 332 137 -7
3178 -7 -206 16 72 -228 -60 46 11 -74 19 72 80 -20 -175 43 -105 14 -207 -46 100 229 71 -35 -31 -135
3202 -135 32 -65 139 -46 128 2 -55 37 -132 212 128 122 -111 -73 15 20 276 81 78 27 78 -191 -164 96 -85
3227 -85 44 -29 -32 -58 117 247 84 -2 26 263 -7 -152 -34 -75 -73 -49 -32 86 -36 -77 90 104 -88 -11 305
3252 305 -187 -155 -53 -85 -123 125 23 95 92 195 97 -67 -8 -119 -279 -19 7 -135 101 86 -89 15 16 -149
$$ packed form
3084b71L57J78k26O1l06R7j5jJ07QL0j91J88Q3r7j58m2L28m3J8j80N2j66K20J06
3109A37J29l12K9J97%l35R9K75k35m2k01L96l60K11J5K17m13N4j65K98J4m7J71
3132A32k66K57k5N5k6k43l4K27j15l4rJ2J55l30N21m50J90J50q4j87j67N6M09
3155A94oj11J25k85m3J24n1J03J48k50J95j74R9n3k3k2J20j42j51J27M08j95j44
3178gj99K22N6l00J68J06l5q5R3N3Qj00j55K18j48J19k21J61J46J29j58j06Mj04
3202a35J67r7K04j85J74j26n7R2j69L44q4ok33L8Q8NK56j95ln1N1k69K7K60j81
3227h5J29p3lk6J75J30j63q6K8K37k70j45J18m1KK4J7J18j22m1J67J4j92P7L16
3252C05m92L2J02l2l8K48j02P2lJ03r8j64N9j11j60K60K6j42K36j5j75J04Jj65
$$ plain form
3276 -149 272 -83 -47 -132 -101 -252 -57 -99 -129 10 -154 127 272 -79 222 -90 -180 -54 28 235 -102 54
3298 54 74 -36 -134 346 246 -43 -205 -53 208 -92 -193 103 -107 -45 -162 5 92 -86 108 -74 190 239
3320 239 86 124 8 155 26 -77 -27 99 -126 -69 -232 -80 -30 70 139 -149 35 -87 107 88 -88 13
3342 13 72 188 12 -195 46 25 26 -20 -7 43 129 66 -5 -92 325 66 -12 46 -204 -58 43 298 -58 136 69
3367 69 129 284 -310 21 89 -98 47 40 163 -99 -114 -85 17 87 274 -177 52 59 -193 191 278 -18 61 -76
3391 -76 -138 135 75 42 73 -167 23 -264 -75 36 -68 -49 75 -56 -40 236 148 -85 -4 115 280 -80 -6
3414 -6 55 133 -49 -59 50 26 -85 -19 42 151 -33 -162 -126 147 -26 36 336 26 -109 139 56 1 -412 -224
3438 -224 -256 -25 277 141 -221 -192 81 3 -29 54 45 -136 77 77 -32 -74 5 -185 26 -56 213 32 -78 24
$$ packed form
3276a49M21l55L6q5L1j51J95m2l0J39j64K81J45l51L01l12r0J26Q2K07l37J56
3298E4K0j10r8M80j00k89j62J52K61l00j01K96k10O2j17J67Q7j78J94j82K64M9
3320B39j53L8j16J47j29j03N0J26k25N7j63J52N0J00O9k88J84j22J94j9j76J01
3342A3N9J16j76k07K41k1Jm6J3N0Q6o3p1q7M17k59p8N8k50J46J01K55l56J94o7
3367F9O0J55n94L31O8j87J45pJ23k62j5K9J02P0J87m51K29Pk52L84Q7k96P9j37
3391g6o2K73o0l3L1k40J90k87J89J11j04J9J24j31J6K76q8k33Q1J19J65l60P4
3414fO1P8j82j0J09k4j11O6O1J09j84j29L6K73j73O2L00l10j35K48q3n5m13J88
3438b24l2K31L02j36l62K9K73p8l2Q3rj81K13%j09m2P9j90K11q2K69j81j10J02
$$ plain form
3462 24 1 74 13 -90 -150 -38 -39 -36 64 -152 -13 -57 -88 66 -104 -127 186 95 16 -149 49 -118 263 -67 80
3487 80 57 37 -58 8 143 -229 -249 104 -105 114 -111 86 -132 -168 -95 -40 229 -128 -18 -7 -69 -241 4 193
3511 193 -130 62 76 -126 -204 69 94 -118 -1 -161 109 248 -18 67 -102 324 -53 146 -16 -26 -151 -141
3533 -141 -288 256 42 -76 68 12 -104 -87 -42 48 -11 -150 -245 110 -91 123 -1 6 71 61 -123 12 -46 -92
3557 -92 -403 -280 63 -50 135 -101 -74 3 52 217 194 102 -40 -38 -12 -92 47 -249 91 -29 58 24 -20 104
3581 104 61 -21 -107 198 8 -100 -8 102 -16 -185 183 -46 -168 29 -10 116 -155 1 69 122 86 55 -51
3604 -51 -1 -121 65 63 203 -179 -20 -91 -76 30 78 42 -92 401 77 18 -174 45 37 128 237 191 -109 88
3628 88 -184 -120 207 88 -238 -105 -179 -49 89 110 49 -23 -139 -125 -80 -43 -32 -82 -180 -48 -160 123 184 275 -73
$$ packed form
3462B4k3P3o1j03o0J12jLJ00k16J39m4l1J54j70k3L13r1p9j65J98j67L81l30J47
3487H0k3k0r5O6J35l72k0L53k09K19k25J97k18l6P3N5K69l57J10J1o2j72K45J89
3511A93l23J92J4k02p8K73K5k12J17j60K70J39k66Q5j69M26l77J99j62j0j25J0
3533a41j47N44k14j18J44n6j16J7M5R0n9j39r5L55k01K14j24PO5j0j84J35n8m6
3557i2l11J23L43j13J85k36K7P7M9J65k3r2j42KK6q0J39k96L40j20Q7l4m4J24
3581A04m3q2q6L05j90j08R2J10j18j69L68k29j22J97l9J26k71J56O8N3l6l1j06
3604e1N0j20J86kJ40l82J59p1J5J06M8l6j34M93l24n9j92K19qR1J09m6l00J97
3628H8k72O4L27j19l26J33p4J30J38K1o1p2j16J4M5L7J1n0r8J32j12K83O1R1l48
$$ plain form
3653 -73 -51 54 -148 -134 -66 86 239 166 143 -121 -88 53 -231 -60 10 -87 -113 42 -415 84 -220 174 -2
3676 -2 -122 -12 26 31 81 -132 -32 47 321 88 59 -257 11 -63 -32 -190 -122 -82 152 116 212 -20 77 -63 39
3701 39 198 47 126 -247 115 -151 -116 -64 361 124 112 235 -46 -208 -122 -20 52 -220 143 -19 269 39
3723 39 68 -223 -53 -104 -53 -129 301 -82 -260 -163 -78 27 117 80 95 74 -203 29 -156 180 171 -49 -104 -32 69
3748 69 334 -144 -58 71 -61 86 68 117 -25 -60 18 -87 -53 -25 -139 -264 -139 -16 -9 18 -238 -226 -190 37
3772 37 15 -238 208 86 51 -24 198 -143 -233 120 -284 -172 118 -153 116 20 -35 49 39 79 31 -166 -288 -57
3796 -57 191 -240 -4 8 45 20 -103 110 190 -160 -121 31 -151 7 83 -41 -74 -235 -339 72 274 178 126
3819 126 -202 337 66 69 20 -67 37 -117 372 4 -16 -23 -81 -336 14 64 -120 6 176 -38 -97 141 167 52
$$ packed form
3653g3K2J05k02J4O8J52J53p3k3k64L3J41k84J71P0r7k6J55m57M99l04L94j76
3676bj20J10L8NN0k13J00P9K74k33k9l16K68p4L1j58O8M0K34l6R6k32R7j40J02
3701C9J59j51P9l73L62k66L5N2M25k37j2J23k81j62Q6J02P2k72L63j62K88k30
3723C9K9k91J70n1N1p6M30l83j78R7Q5J05R0l7J5k1k77K32j85L36rk20n5P2J01
3748F9K65m78Q6J29j32J47j8M9j42l5P8j05L4K8j14j25J25J23PK7k56J2L6K27
3772C7k2k53M46j22l5p5K22l41r0L53m04J12K90k71K69r6n5Q4j0M0m8j97j22K31
3796e7K48m31K36J2L7k5j23K13Q0l50L9J52j82J58P6j24l3j61j04M11K02r6n2
3819A26l28N39k71Lm9q7J04j54M89l68k0pn8k55L50N0j84J26J70k14n9K38K6j15
$$ plain form
3843 52 -202 113 242 64 128 -214 -112 -41 0 8 14 134 -6 -131 110 43 -96 159 8 129 97 88 -98 137
3867 137 144 204 -98 18 -71 -79 181 132 -193 -13 115 200 -103 253 125 -102 126 -14 135 71 303 155 80
3890 80 -98 50 5 91 110 4 41 152 166 162 213 90 -156 -55 -31 78 78 85 66 0 53 159 -301 77 -23 -14
3916 -14 145 -174 50 23 85 -63 138 -183 -105 193 -133 -111 -76 73 -151 55 179 11 121 -125 140 -106
3938 -106 206 189 -34 -32 -181 -70 100 -184 187 -57 -294 -39 -65 144 229 149 9 -97 14 26 -112 49
3960 49 106 30 -102 110 -70 330 -56 -25 -201 253 158 -2 54 11 -122 112 -87 -1 -240 -82 -71 -135 -22
3983 -22 282 -207 124 319 -104 42 -27 61 -84 241 -160 -77 -40 -4 -114 195 0 22 234 -167 126 -123
4005 -123 -22 -10 -39 -28 -40 22 229 -257 -34 -93 -235 202 -28 84 19 122 -60 136 67 17 5 -231 -29
$$ packed form
3843E2k54L15J29j78O4l42J02P1M1QOJ20j40j25K41o7j39K55j51J21l2rj86K35
3867A37PO0l02J16q9qK60m9l25J80J28Q5l03L56j28k27K28j40J49o4K32j48p5
3890H0j78J48m5Q6J9j06L7J11J4mN1j23k46J01K4J09%Pj9o6N3J06m60L78j00R
3916a4J59l19K24k7O2j48K01l21P8K98l26K2L5J49k24K06J24j68J10k46K65k46
3938a06L12j7k23Kj49J11J70k84L71k44k37K55k6K09Q5q0j40j06J11J2j38J61
3960D9N7p6j32K12j80M00l86L1j76M54r5j60N6m3j33K34j99Q6k39J58J1o4J13
3983b2L04m89L31J95m23J46o9Q8j45L25m01Q3L7L6j10L09j95K2K12m01K93k49
4005a23J01J2k9J1j2O2K07m86K23n9j42M37k30J12o5J03j82J96o9n0j2k36K02
$$ plain form
4028 -29 218 -103 -146 -197 166 82 -54 211 -123 -116 -26 -49 50 31 1 44 -15 -107 -154 192 24 123 -152 -49 58
4053 58 -43 -6 -128 -39 109 -152 140 -155 -23 -149 -110 26 45 -57 -169 109 60 -55 -168 181 75 -185
4075 -185 -128 120 -151 -94 167 144 -116 -125 -125 49 172 -106 -440 -199 -30 151 187 -32 198 -26 2 87 -17
4098 -17 68 -40 -37 -200 -28 65 -53 99 73 -146 -118 63 -54 -58 -31 196 194 -127 52 -27 -161 234 137 23 21
4123 21 212 7 -110 -79 -155 -26 74 -25 243 105 -33 -24 74 40 -5 -123 -58 -107 161 -103 66 -54 55 27
4147 27 -115 22 84 -67 -33 -37 -8 116 326 -153 -124 27 -38 -89 4 -50 14 105 139 -12 27 -20 -132 69 -136
4172 -136 -123 -89 -94 -92 -29 14 51 -224 144 125 -19 70 143 37 -58 -188 -1 126 -42 290 46 9 75 67 -105 217
4198 217 -35 45 -26 12 -87 22 4 255 -20 48 -43 56 25 30 -171 -21 -215 -134 105 -145 88 -52 170 117
$$ packed form
4028b9K47l21m3n1L63q4j36K65l34PR0k3R9j9l0M3n9r2m7L46j68R9k75J03J07
4053E8j01L7j22Q9J48k61K92k95J32j26L9J36J9j02j12K78m9j15j13L49j06k60
4075a85N7K48k71N7K61k3k60r%J74J23k78l34K41J69J81L6k19K30k24K8Q5j04
4098a7Q5j08Lj63J72R3j18J52k6k19K8J81j17mK7K27kl21J79p9j34L95r7j14k
4123B1J91k05j17L1p6J29J00r9K68j38j38RR8l4m5j18O5m9K68k64J69j20J09k8
4147B7j42J37O2j51L4mK9J24K10m79K9J51o5n1R3n4O4R1L4j51L9m7j12K01k05
4172a36J3L4nKO3M3L7k75L68j9j44Q9P3j06r5j30J87J27j68L32k44l7O6qj72L22
4198B17k52Q0p1L8r9J09j8K51k75O8r1R9l1Nk01J50j94Q1K39k50K33j40K22n3
$$ plain form
4222 117 259 0 -24 279 1 138 245 148 -79 -297 138 -68 3 98 49 -100 -61 23 21 -141 30 20 -82
4245 -82 143 -51 186 59 39 -114 185 94 -105 176 -16 -62 134 -74 275 12 -26 -98 24 78 -53 -117 151
4268 151 166 -3 -41 131 166 126 178 36 62 -20 39 32 -34 -37 -13 -308 206 65 68 -56 -246 66 381 43 -302
4293 -302 47 65 -60 41 217 3 61 122 256 4 -111 96 -57 191 85 -85 -124 79 33 151 96 214
4315 214 187 -276 226 63 -51 41 39 62 126 149 -29 65 58 -53 -54 139 -38 -10 -53 46 320 -104 -283 3 46
4340 46 193 31 90 220 -96 -68 -182 -185 -364 -120 -153 -55 -15 202 -287 75 -59 51 9 257 9 -252 127
4363 127 -77 -153 230 -39 105 273 102 -59 -61 291 185 83 19 -26 -218 181 14 -47 -142 29 96 29 99
4386 99 33 -27 -86 189 47 -24 161 20 -36 -8 -33 -195 97 -58 -32 -307 -13 -171 -26 -34 -20 25 -65 -59 158
$$ packed form
4222A17J42k59k4L03k78J37J07r7k27k18M35k06P1R5m9j49L9Q4kj62J71j0j02
4245h2K25j94K37j27k0j53K99r1j99K81j92m6J96k08L49k63l8p2J22N4j31o4K68
4268A51J5j69l8J72L5m0N2j42K6q2N9po6lK4k95N14j41Lj24j90L12L15l38l45
4293c02L49J8j25J01J76k14N8O1J34k52j15K07j53K48j06j70l9K03m6J18n5J18
4315B14k7m63N02j63j14R2kK3O4K3j78R4pj11jJ93j77K8m3R9K74m24j79K86M3
4340D6J47j62N9J30l16K8j14lj79K44l3R8M0K17m89L62j34J10m2K48k48k61L79
4363A27k04p6L83k69J44J68j71j61kL52j06j02o4m5j92L99j67o1r5J71O7o7P0
4386I9o6o0n9K75j42p1J85j41n6K8k5j62K92j55K6k75K94j58J45qJ4M5r0OK17
$$ plain form
4411 158 -264 76 103 19 -129 -67 -17 143 45 10 120 21 95 -38 -70 75 -180 6 31 22 -121 -24 -35 -187 -52
4436 -52 -128 -160 -188 340 160 -31 128 63 170 -104 90 -47 206 25 -264 -124 62 53 71 -28 -3 156 -137
4459 -137 128 -98 104 141 1 -82 82 50 180 293 -9 -233 181 -135 191 -55 -123 186 -142 78 205
4480 205 187 64 -84 122 65 166 196 129 -94 -234 -158 96 65 27 186 226 57 184 136 -22 -52 -236 -163 -187
4504 -187 54 133 -297 91 -26 107 102 -193 300 -167 -144 179 56 -8 0 213 10 -32 -22 171 -46 260 -279
4527 -279 40 70 16 9 -198 -43 76 157 81 -173 41 -50 44 252 -50 126 -142 132 62 -94 226 -104 -101 234
4551 234 -113 70 -132 316 -149 61 204 -140 -111 -65 324 80 107 -44 220 -106 131 -70 197 -121 -70
4572 -70 -85 -62 -104 -1 113 -95 104 54 72 87 124 -82 -127 -177 35 160 42 77 157 -99 120 -347 -16 59
$$ packed form
4411A58m22L40K7q4j48O2N0J60r8l5J10r9P4j33l2J45k55J86K5rj43R7j1j52J35
4436e2p6l2k8N28j80j91J59o5J07k74J94j37K53j81k89J40J86rJ8r9K5J59k93
4459a37K65k26K02L7j40q3J64l2J30J13l02k24M14l16L26k46o8L09l28K20J27
4480B05j8j23j48K06n7J01L0o7k23j40P6K54l1l8J59M0j69J27m8j58l0j84P3k4
4504a87K41P9m30L88j17J33nk95M93m67K3L23j23o4QK13k03m2J0J93k17L06n39
4527b79L19L0n4pk07J55J19Q1p6k54K14r1R4K08l02J76k68K74p0j56L20l30LL35
4551B34l47J83k02M48m65K10J43l44K9M6L89k44K7j51K64l26K37k01K67l18N1
4572g0j5K3m2J03J14k08J99n0J8J5L7k06m5n0K12J25j18L5Q0k56K19m67L31P5
$$ plain form
4596 59 -38 -97 -140 -132 50 -84 -72 123 16 -198 97 -5 164 -165 91 134 -25 -21 21 -140 -3 234 -30 126
4620 126 186 63 58 25 -159 -40 54 153 -110 84 -217 -53 -109 -126 -18 -179 -95 -60 42 -76 -45 15 98 81 -151
4645 -151 55 129 -260 110 -41 98 -104 -102 150 182 21 -80 122 -234 -77 -96 -275 -82 -111 54 -36 -165
4667 -165 1 122 -146 -191 -37 -114 158 98 -50 62 -204 -179 157 23 -163 -93 -147 -103 95 320 -42 -37 -219
4690 -219 -34 -75 -46 153 39 -49 36 -107 -114 90 -109 105 24 73 -14 -146 83 -32 187 -119 67 -117 -149
4713 -149 6 245 132 -196 157 119 110 84 -131 38 38 -128 177 -157 61 50 108 -127 -203 43 128 181 -206 -26
4737 -26 -32 165 -46 -260 5 379 -61 107 -46 -56 113 187 83 -68 107 183 -134 -137 110 87 75 116 -20 56
4761 56 -69 93 101 -36 8 -103 68 160 92 -183 -259 97 -110 -108 57 195 -194 -138 65 180 187 133 34 -129 -73
$$ packed form
4596E9r7n9m3QJ82j34J2J95j07k14K95j02J69l29K56M3j59MM2j61J37K37k64J56
4620A26O0j23nl3j84J19R4R9k63J94l01J64n6j7J08j61Q4L5J02j18L1O0Q3j7k32
4645a51K06P4l89L70j51J39k02KK52L2j61j01K02l56J57j9j79J93k9J65r0j29
4667a65J66J21k68m5J54p7K72o0j48J12k66K5L36j34j86P0n4M4J98K25l62Nj82
4690b19J85m1K9J99j14q8Q5j43pK04j99K14q1M9q7j32K29j15K19l06J86j84l2
4713a49J55K39j13l28L53l8rk6k15J69%j66L05l34K18j1N8k35p6K46Q5N3l87J80
4737b6oJ97k11k14K65L74m40J68j53j0J69P4j04j51J75P6l17lK47k3j2M1j36P6
4761E6j25J62Qj37M4j11J71R2o8k75p6L56k07KJ65J38l89N6K03J15Pn4r9j63N6
$$ plain form
4786 -73 -18 -235 -29 30 -396 -173 -172 58 -4 175 -340 114 -276 130 30 -117 39 63 -111 31 113 -163 -104
4809 -104 298 -128 52 3 -38 184 -151 32 -138 -69 -133 29 -4 -363 48 -54 -112 107 29 181 126 -79 358
4832 358 325 -51 3 173 -74 71 -120 16 213 -166 -171 313 -33 340 -27 -108 87 72 45 12 14 -62 -87 -196
4856 -196 186 256 415 126 20 79 -148 120 -132 284 6 -43 -59 -103 15 79 12 273 140 -48 -58 98 -73
4879 -73 66 237 -108 278 -228 -170 -49 -124 7 -125 114 101 216 -7 -1 -15 144 -37 204 54 12 259 83
4902 83 -116 6 11 -247 94 -84 59 -192 27 -135 -90 105 -321 231 101 -83 -35 136 173 -137 -217 137
4924 137 39 106 161 -67 -170 140 33 56 -242 192 -170 -120 -393 -8 166 346 209 -38 44 -137 35 -214
4946 -214 -96 282 79 163 41 142 -159 128 184 126 197 107 254 206 -16 -139 100 52 13 83 29 -46 -44 100
$$ packed form
4786g3N5k17K06N9m26K23JK30o2J79n15M54l90M06j00j47J56K4j74J42Q2k76N9
4809a04M02m26J80m9m1K22l35J83j70O9o4J62l3l59M11j02n8K19p8J52n5k05M37
4832C58l3l76N4J70k47J45j91J36J97l79nM84l46L73l67q1J95j5k7l3Kp6k5j09
4856a96L82P0J59k89j06N9k27K68k52M16k78m9j6m4J18O4o7K61j33j88j0J56j71
4879g3J39J71l45L86n06N8J21p5J31j32K39j3J15k23Oj4J59j81K41j50m2K47j76
4902H3j99J22Nk58L41j78J43k51K19j62M5J95m26N52j30j84M8J71L7l10q0L54
4924A37r8O7N5k28j03L10j07K3k98M34l62N0k73L85J74J80j37k47Q2j81J72k49
4946b14J18L78k03Q4j22J01l01K87N6n8P1r0J47m8k22j23K39m8l9P0n4p5KJ44
$$ plain form
4970 100 200 -132 -171 7 -114 129 -45 70 -102 -48 61 26 -61 189 25 3 -82 -146 -83 -51 6 -303 89
4993 89 -106 -121 32 -76 5 -34 -89 90 29 160 -19 14 34 83 15 -136 39 107 -30 -30 -155 5 21 55 219
5018 219 -8 -103 -121 -230 -19 304 70 -33 179 -304 -46 114 16 144 -117 -124 -57 -33 176 -58 -255 -91
5040 -91 12 -68 62 -20 15 84 -46 124 102 -78 -269 89 37 -113 -34 -91 28 4 95 118 -162 80 -36 51
5064 51 -201 195 239 -91 -204 -54 -150 54 149 -12 -2 -59 -318 41 -25 66 70 118 98 -222 148 -181 -195 0
5088 0 204 -255 -206 15 185 -128 -84 86 -136 68 127 66 14 -13 161 -187 220 -2 48 36 207 309 187
5111 187 255 151 -34 -331 18 235 -11 136 105 328 -260 90 -48 15 73 -138 97 53 -58 -57 -203 141
5133 141 83 -134 -48 105 149 -61 67 279 161 117 -119 91 39 -105 -93 91 88 18 -131 193 62 54 277 -29
$$ packed form
4970A00J00l32l9J78j21K43j74J15j72N4J09l5q7K50j64k2q5o4O3L2N7l09L92
4993H9j95j5J53j08Q1l9n5J79o1J31j79L3K0M9o8j51J75O8j37%j25J60J6L4J64
5018B19k27r5j8j09K11L23k34j03K12m83K58J60r8J28k61pO7K4K09k34j97J64
5040i1J03q0J30q2L5O9j30J70k2j80j91L58n2j50P9n7J19k4R1K3k80K42j16Q7
5064E1k52L96M4l30j13J50r6K04R5j61J0n7k59L59o6R1MM8k0l20L70l29j4J95
5088@K04m59M9K21J70l13M4J70k22K04N9o1n2k7J74l48M07k22N0j2J71J02j22
5111A87O8j04j85k97L49K17k46J47l1K23n88L50j38O3N8k11K35m4j11Jj46L44
5133A41n8k17Q6J53M4k10J28K12j18m4k36K10n2j44J2J84lp0j49L24j31qK23l06
$$ plain form
5157 -29 74 -69 167 -66 17 -76 138 1 22 63 186 13 -18 -74 25 132 -41 51 -201 -59 -45 59 171
5180 171 63 -56 69 21 245 54 -71 -27 70 -36 1 78 104 -35 3 -94 -234 -185 51 -52 183 34 -40
5203 -40 392 -140 48 272 98 -179 82 -40 297 -148 85 194 97 83 222 80 -219 -270 18 13 -101 158
5225 158 -226 -156 -128 55 77 -58 -20 203 -82 -93 -14 -39 12 79 -124 -98 -77 190 -45 16 -46 -64 -130 28 95
5250 95 -60 167 -30 -196 -271 -16 -15 -125 -21 -235 66 117 103 88 -93 -54 -153 189 -153 116 30 38 -161 24
5274 24 121 96 -38 208 -86 73 -266 -227 102 -16 -149 -107 -99 -63 20 35 -23 19 -50 145 -13 2 -67 -13 -13 -153
5300 -153 144 86 188 -173 -94 -29 -12 42 -7 -62 45 7 45 19 -19 -123 122 14 -56 -13 -186 -173 -25 113 -136
5325 -136 60 52 48 -31 66 -23 52 185 136 72 20 -6 -16 -4 263 4 45 271 -99 -21 121 214 118 119 -245 -8 -65
$$ packed form
5157b9J03j43K36k33Q3r3K14j37K1M1J23j73l1n6R9J07j73R2k52J42J4J04J12
5180A71j08j19J25m8K24j91j25M4R7j06L7P7K6j39L8r7j40M9K36j03K35j49p4
5203d0M32n32J88K24j74k77K61j22L37m45K33J09r7j4J39j42k99n1K88nj14K59
5225A58l84P0K8J83K2j35L8K23k85j1P9k5N1O7k03K6K1K67k35O1o2j8o6J58O7
5250I5j55K27j97j66p5K55Jj10J04k14L01N1j4j5j81L9r9L42l42K69q6Qj99J85
5274B4R7k5j34K46k94J59l39L9L29j18j33M2QL6Q3J5n8M2o9J95j58J5o9N4%j40
5300a53K97n8J02l61P9O5J7N4m9n5J07l8L8k6l8j04K45j08p0M3j73J3J48J38k49
5325a36J96qmp9R7q9P5J33m9o4n2k6j0J2K67k59M1K26l70P8J42R3r6Jl64K37n7
$$ plain form
5352 -65 73 114 10 -205 58 -46 23 72 37 359 -19 -71 38 -64 -47 -108 -210 160 -95 -112 -42 -130 -92 88
5376 88 -74 -16 -21 -26 -145 -85 123 172 23 39 -9 -227 -233 -204 307 -75 -72 99 115 -87 86 102 335 -101 -369 -215
5402 -215 142 249 -50 -111 92 161 73 25 -70 -176 -240 -169 253 -27 -4 -137 70 108 166 -28 132 213 94 -275
5426 -275 25 41 -28 89 22 130 67 -212 34 343 50 41 -146 44 206 -73 -92 43 -113 11 14 -38 195
5449 195 80 -13 -72 -70 -196 -220 -59 13 -75 119 66 -151 -72 13 29 -179 -278 18 -30 76 -124 -108 18 -42 183
5474 183 2 -33 127 77 -214 -88 -117 9 -27 -178 206 37 -234 96 -27 191 188 -136 156 -31 -2 31 111
5497 111 -109 173 187 316 42 -7 -238 0 96 -94 -28 8 -40 30 206 -96 -92 -98 330 143 67 -273 -89 -195
5521 -195 78 26 -29 -82 -112 -28 -6 -61 117 -62 -169 -140 -265 119 157 97 254 -220 136 186 -16 38 -159 -52
$$ packed form
5352f5J38M1j04k15K63j04O9M9l5L22l78n2J09j02J7o1j02L70k55j7P0q8L8J80
5376H8j62N8nnj19O0K08M9j49J6m8k18oK9N11l82LJ71J6k02J73J6K33m36k68J54
5402b15L57J07k99o1K03O9q8m8r5j06o4P1M22k80K3j33K07L8N8j94J60Q1j19l69
5426b75L00J6o9J17o7J08o3k79K46L09k93rj87J90J62k79j9J35j56J24Ln2K33
5449A95j15r3n9Kj26k4J61P2q8J94n3k17P9Q5J6k08r9K96m8J06k00J6J26o0K25
5474A83j81l5J60n0k91J26k9J26l6j51L84j69k71L30j23K18ll24K92j87K9L3Q0
5497A11k20K82J4J29k74m9k31K38R6j90O6L6m8P0J76l02MoM28j87p6l40J84j06
5521a95K73n2n5n3l0Q4K2n5J78j79j07K9j25L84L8o0J57m74L56N0k02N4j97J07
$$ plain form
5545 -52 -158 77 -51 -95 -28 -113 87 60 225 78 307 215 -115 155 107 96 -14 -2 117 17 57 -129 174
5568 174 70 14 83 318 -81 -209 -10 65 -90 133 -26 84 -91 -106 -130 -281 -148 -9 154 -75 3 -126
5590 -126 105 55 -187 145 179 200 239 16 278 11 176 -35 76 -294 0 -22 -27 67 16 153 51 -118 78
5613 78 27 29 -49 0 -126 108 201 239 125 0 -93 75 -65 -107 104 140 260 18 144 93 29 105 78 -147 94
5638 94 -159 -113 72 33 58 97 -236 68 44 31 292 -23 176 56 49 26 -388 132 -122 -106 58 -117 113 -129
5662 -129 313 -122 -33 96 30 7 -114 -137 -60 -186 124 -6 121 58 79 18 -99 -127 -21 140 44 -125 125
5685 125 -42 70 10 86 0 70 195 -41 130 111 174 -114 282 -27 -5 -191 -66 -49 210 1 117 55 239
5708 239 209 -71 147 -18 -199 98 -84 -83 -326 -15 -24 220 30 -34 -75 44 -117 82 69 88 -336 -149 33
$$ packed form
5545e2j06K35j28m4O7q5K00k7J65j47K29r2l30K70m8j1j10J2J19j00M0j86L03
5568A74j04n6O9K35l99j28J99P5j55K23j59J10j75j5k4j51J33J39J63k29P8j29
5590a26K31n0k42L32L4K1L9k23K62k67J65k11J11l70K94k2nR4n1J37j02j69J96
5613G8n1Kp8M9j26K34R3L8j14j25r3J68j40m2K11L6J20k42J26n1o4P6k7k25K41
5638I4k53M6J85l9K5L9l33L04k4j3K61l15J99j20pk3m14N20k54J6J64j75K30k42
5662a29M42m35Q9J29o6k3j21k3P7j26L10j30J27o3K1o1j17k8J06J61r6j69K50
5685A25j67J12o0P6q6P0J25k36J71j9O3k88L96l09K2j86J25J7K59k09J16o2J84
5708B39l0k80K18j65j81K97j82Jk43L11rK44j90o4m1J19j61J99j3J9m24J87J82
$$ plain form
5731 33 -183 57 -154 115 48 -176 -48 96 -134 72 323 -186 -90 123 55 66 -262 -87 196 -136 -111 99
5753 99 31 63 -13 -213 150 0 -283 18 -278 -61 -108 82 121 -241 -207 172 -68 16 499 -48 80 -72 38
5776 38 -108 -150 62 234 -135 173 164 18 73 255 -64 49 33 -289 151 -15 -168 -50 156 -69 17 -138
5798 -138 -87 -10 110 173 -229 64 259 12 -22 53 -235 237 113 -80 -50 -10 165 -23 -36 -39 -54 80 78 -171
5822 -171 -9 60 -114 236 -95 130 45 129 -155 -294 101 71 30 108 7 -99 -45 200 -150 -172 -48 -100 -11
5845 -11 -39 31 -61 -71 -100 198 -125 -331 -82 4 -139 4 -31 -142 -19 155 150 60 24 192 -1 -146 36 -17
5869 -17 118 130 52 270 57 83 80 124 41 154 -225 -106 180 -134 -166 -106 -148 -7 191 -139 -4 -236 217 304
5893 304 -85 64 24 109 -69 -396 -111 241 -3 -7 271 -121 22 -119 313 223 -5 64 82 -43 150 32
$$ packed form
5731C3k16K40k11K69o7k24J28J44k30K06K51n09R6K13o8J1l28J75K83l32K5K10
5753I9o8L2p6k00L63j50k83L01k96K17m7J90L9l62L4L79k40Q4M83n47J28j52J10
5776C8j46m2K12J72l69L08rj46N5J82l19J13j6l22M40j66j53J18K06k25Q6j55
5798a38N1P7J20O3m02K93J95k47l4P5k88M72j24j93L0M0J75j88j3lj5J34kk49
5822a71J62O9j74L50l31K25q5Q4k84j39L95l0m1P8j01j06N4K45l50k2J24n2Q9
5845a1k8P0r2j0k9K98l23k06K49Q6j43J43l5j11J23J74nr0l6J68j93j45J82n3
5869a7J35J2p8K18k13K6lM4q3J13l79J19K86l14l2O0m2J41J98l30J35k32M53Q7
5893C04l89J49m0Q5j78l27K85L52k44mK78l92J43j41M32r0k28O9J8j25J93j18
$$ plain form
5915 32 -62 98 -65 45 17 119 173 17 -201 9 -177 19 -293 64 -149 -212 132 -239 -148 -3 216 10
5937 10 66 -273 14 153 97 80 -24 135 -99 -276 -15 211 -16 198 4 -216 -18 -51 3 204 84 78 -187
5960 -187 -154 191 23 2 -56 -110 -7 16 -112 28 -164 30 87 -1 -261 -180 148 -71 -5 -153 76 166 -93
5983 -93 135 159 36 -283 13 140 -7 142 -53 79 252 168 -81 -82 -28 74 55 91 -48 -195 53 194 259
6006 259 -160 135 -171 29 -50 95 -29 -82 127 -275 80 57 26 131 -133 -167 -154 -34 39 -4 -45 162 382
6029 382 65 -70 -9 -5 -109 357 -13 241 128 106 -170 -106 65 36 53 -15 -91 93 22 94 -156 294 332 136
6053 136 99 62 11 -138 141 98 -358 -35 -416 -224 -83 -143 44 -113 76 -128 -91 93 -60 187 -35 82
6075 82 27 -85 57 108 -182 -127 23 -8 -209 -34 -8 114 243 -421 -77 -10 251 -97 98 -179 -258 -139 14
$$ packed form
5915C2r4J60j63J10k8J02N4j56k18K10j86J96l12L57k13o3L44l71R1J45K19k06
5937A0N6l39K87J39n6j7j04J59k34j77K61K26k27K14j94k20J98l3N4K01j20ok65
5960a87L3L45j68k1n8n4J03K3j28J40j92J94N7q8k60Q1L28k19O6j48K29R0k59
5983i3K28K4j23l19K96J27j47J49j95J32J73q4k49jN4J02j9L6j39j47K48J41O5
6006B59m19K95l06K00p9J45j24n3K09m02L55k3l1J05k64l4J3J20P3m3m1K07K20
6029C82l17j35O1Mj04M66l70K54j13k2k76O4J71k9J7o8p6J84p1P2k50M50L8j96
6053A36l7l7n1j49K79m3m56L23l81J92J41o0J87j57J89k04L7J84j53K47k22J17
6075H2n5j12J42N1k90N5J50l1k01J75K6J22J29o64L44O7K61l48J95k77p9J19J53
$$ plain form
6098 14 57 -20 -45 -197 70 66 -64 31 -155 85 143 30 -180 142 88 -122 32 -152 -91 -30 -147 35 -42 23
$$ packed form
6098A4M3p7k5j52K67mj30R5j86K40N8j13k10L22n4k10J54j84O1O1j17J82p7O5
$$ [...]
8191a2
##END NTUPLES=NMR FID
##END=
