##TITLE=1H_Pr 37-88-3
 CDcl3
 8 sc, 
 22.2.2023
##JCAMPDX= 6.0         $$ Bruker NMR JCAMP-DX V2.0
##DATA TYPE= NMR FID
##DATA CLASS= NTUPLES
##ORIGIN= UXNMR, Bruker Analytische Messtechnik GmbH
##OWNER= root
$$ XWIN-NMR		Version 3.5
$$ Wed Feb 22 16:53:55 2023 Russian Standard Time (UT+4h)  she@DPX200
##.OBSERVE FREQUENCY= 200.13135
##.OBSERVE NUCLEUS= ^1H
##.DELAY= (6, 6)
##.ACQUISITION MODE= SIMULTANEOUS
##.ACQUISITION SCHEME= undefined
##.AVERAGES= 8
##.DIGITISER RES= 18
##SPECTROMETER/DATA SYSTEM= spect
##.PULSE SEQUENCE= zg30
##.SOLVENT NAME= DMSO
##.SHIFT REFERENCE= (INTERNAL, DMSO, 0, 15.7039)
##AUDIT TRAIL= $$ (NUMBER, WHEN, WHO, WHERE, WHAT)
$$ ##TITLE= Audit trail, XWIN-NMR		Version 3.5
$$ ##JCAMPDX= 5.01
$$ ##ORIGIN= Bruker BioSpin GmbH
$$ ##OWNER= she
$$ F:/spectra/data/she/nmr/H-F/1/audita.txt
$$ ##AUDIT TRAIL=  $$ (NUMBER, WHEN, WHO, WHERE, WHAT)
(   1,<2023-02-22 16:52:30.29 +0400>,<she>,<DPX200>,
      <created by zg, POWCHK disabled, PULCHK disabled
       configuration hash MD5:
       00 E9 B6 7A A2 85 ED C7 34 08 36 98 17 FE 4E 26
       data hash MD5: 16K
       88 60 9F E9 B5 36 24 20 94 74 FF 31 B0 5D 90 81>)
$$ ##END=
$$ 
$$ hash MD5
$$ 92 C2 62 10 B5 7F 57 0E C1 1D 62 B7 76 E7 97 2E
##$RELAX= 
##$RELAX= 
##$RELAX= 
##$RELAX= 
##$RELAX= 
##$RELAX= 
$$ Bruker specific parameters
$$ --------------------------
##$DU= <F:/spectra>
##$EXPNO= 1
##$NAME= <H-F>
##$PROCNO= 1
##$TYPE= <nmr>
##$USER= <she>
##$AMP= (0..31)
100 100 100 100 100 100 100 100 100 100 100 100 100 100 100 100 100 100 
100 100 100 100 100 100 100 100 100 100 100 100 100 100 
##$AQSEQ= 0
##$AQ_mod= 1
##$AUNM= <au_zg>
##$AUTOPOS= <>
##$BF1= 200.13
##$BF2= 200.13
##$BF3= 200.13
##$BF4= 200.13
##$BF5= 200.13
##$BF6= 200.13
##$BF7= 200.13
##$BF8= 200.13
##$BYTORDA= 1
##$CFDGTYP= 0
##$CFRGTYP= 5
##$CHEMSTR= <none>
##$CNST= (0..31)
1 1 145 1 1 1 1 1 1 1 1 1 1 1 1 1 1 1 1 1 1 1 1 1 1 1 1 1 1 1 1 1 
##$CPDPRG= <>
##$CPDPRG1= <>
##$CPDPRG2= <>
##$CPDPRG3= <>
##$CPDPRG4= <mlev>
##$CPDPRG5= <mlev>
##$CPDPRG6= <mlev>
##$CPDPRG7= <mlev>
##$CPDPRG8= <mlev>
##$CPDPRGB= <>
##$CPDPRGT= <>
##$D= (0..31)
0 1.2 0 0 0 0 0 0 0 0.06 0 0.03 0 0 0 0 0.0002 0 0 0 0 0 0 0 0 0 0 0 0 
0 0 0 
##$DATE= 1677070349
##$DBL= (0..7)
120 120 120 120 120 120 120 120 
##$DBP= (0..7)
150 150 150 150 150 150 150 150 
##$DBP07= 0
##$DBPNAM0= <>
##$DBPNAM1= <>
##$DBPNAM2= <>
##$DBPNAM3= <>
##$DBPNAM4= <>
##$DBPNAM5= <>
##$DBPNAM6= <>
##$DBPNAM7= <>
##$DBPOAL= (0..7)
0.5 0.5 0.5 0.5 0.5 0.5 0.5 0.5 
##$DBPOFFS= (0..7)
0 0 0 0 0 0 0 0 
##$DE= 6
##$DECBNUC= <off>
##$DECIM= 32
##$DECNUC= <off>
##$DECSTAT= 4
##$DIGMOD= 1
##$DIGTYP= 9
##$DL= (0..7)
0 120 120 120 120 120 120 120 
##$DP= (0..7)
150 150 150 150 150 150 150 150 
##$DP07= 0
##$DPNAME0= <>
##$DPNAME1= <>
##$DPNAME2= <>
##$DPNAME3= <>
##$DPNAME4= <>
##$DPNAME5= <>
##$DPNAME6= <>
##$DPNAME7= <>
##$DPOAL= (0..7)
0.5 0.5 0.5 0.5 0.5 0.5 0.5 0.5 
##$DPOFFS= (0..7)
0 0 0 0 0 0 0 0 
##$DQDMODE= 0
##$DR= 18
##$DS= 0
##$DSLIST= <SSSSSSSSSSSSSSS>
$$ [...]
##$SUBNAM2= <"">
##$SUBNAM3= <"">
##$SUBNAM4= <"">
##$SUBNAM5= <"">
##$SUBNAM6= <"">
##$SUBNAM7= <"">
##$SUBNAM8= <"">
##$SUBNAM9= <"">
##$SW= 18.05172834244
##$SWIBOX= (0..15)
0 0 2 0 0 0 0 0 0 0 0 0 0 0 0 0 
##$SW_h= 3612.71676300578
##$TD= 16384
##$TD0= 1
##$TE= 0
##$TE2= 300
##$TE3= 300
##$TEG= 300
##$TL= (0..7)
0 120 120 120 120 120 120 120 
##$TP= (0..7)
150 150 150 150 150 150 150 150 
##$TP07= 0
##$TPNAME0= <>
##$TPNAME1= <>
##$TPNAME2= <>
##$TPNAME3= <>
##$TPNAME4= <>
##$TPNAME5= <>
##$TPNAME6= <>
##$TPNAME7= <>
##$TPOAL= (0..7)
0.5 0.5 0.5 0.5 0.5 0.5 0.5 0.5 
##$TPOFFS= (0..7)
0 0 0 0 0 0 0 0 
##$TUNHIN= 0
##$TUNHOUT= 0
##$TUNXOUT= 0
##$USERA1= <user>
##$USERA2= <user>
##$USERA3= <user>
##$USERA4= <user>
##$USERA5= <user>
##$V9= 5
##$VALIST= <valist>
##$VCLIST= <CCCCCCCCCCCCCCC>
##$VD= 0
##$VDLIST= <DDDDDDDDDDDDDDD>
##$VPLIST= <PPPPPPPPPPPPPPP>
##$VTLIST= <TTTTTTTTTTTTTTT>
##$WBST= 1024
##$WBSW= 4
##$XGAIN= (0..3)
0 0 0 0 
##$XL= 0
##$YL= 0
##$YMAX_a= 582755
##$YMIN_a= -528176
##$ZGOPTNS= <>
##$ZL1= 120
##$ZL2= 120
##$ZL3= 120
##$ZL4= 120
##$ABSF1= 10
##$ABSF2= 0
##$ABSG= 5
##$ABSL= 3
##$ALPHA= 0
##$AQORDER= 0
##$ASSFAC= 0
##$ASSFACI= 0
##$ASSFACX= 0
##$ASSWID= 0
##$AUNMP= <proc_1d>
##$AZFE= 0.1
##$AZFW= 0.1
##$BCFW= 1
##$BC_mod= 2
##$BYTORDP= 1
##$COROFFS= 0
##$CY= 11.3945322036743
##$DATMOD= 1
##$DC= 2
##$DFILT= <>
##$DTYPP= 0
##$F1P= 2.36226072786647
##$F2P= -0.459571619588291
##$FCOR= 0.5
##$FTSIZE= 0
##$FT_mod= 4
##$GAMMA= 1
##$GB= 0.15
##$INTBC= 1
##$INTSCL= 1
##$ISEN= 128
##$LB= 0.24
##$LEV0= 0
##$LPBIN= 0
##$MAXI= 10000
##$MC2= 0
##$MEAN= 0
##$ME_mod= 0
##$MI= 1.114404
##$NCOEF= 0
##$NC_proc= 0
##$NLEV= 6
##$NOISF1= 3.799351
##$NOISF2= 2.8
##$NSP= 1
##$NTH_PI= 0
##$NZP= 0
##$OFFSET= 15.70392
##$PC= 1
##$PHC0= -19107.78
##$PHC1= 12.00074
##$PH_mod= 1
##$PKNL= yes
##$PPARMOD= 0
##$PSCAL= 0
##$PSIGN= 0
##$REVERSE= no
##$SF= 200.130013532006
##$SI= 16384
##$SIGF1= 3
##$SIGF2= 2
##$SINO= 400
##$SIOLD= 16384
##$SREGLST= <1H.CDCl3>
##$SSB= 0
##$STSI= 0
##$STSR= 0
##$SW_p= 3612.71676300578
##$SYMM= 0
##$S_DEV= 0
##$TDeff= 0
##$TDoff= 0
##$TI= <>
##$TILT= no
##$TM1= 0
##$TM2= 0
##$TOPLEV= 0
##$USERP1= <user>
##$USERP2= <user>
##$USERP3= <user>
##$USERP4= <user>
##$USERP5= <user>
##$WDW= 1
##$XDIM= 8192
##$YMAX_p= 0
##$YMIN_p= 0
$$ End of Bruker specific parameters
$$ ---------------------------------
##NTUPLES= NMR FID
##VAR_NAME=  TIME,          FID/REAL,        FID/IMAG
##SYMBOL=    X,             R,               I
##VAR_TYPE=  INDEPENDENT,   DEPENDENT,       DEPENDENT
##VAR_FORM=  AFFN,          ASDF,            ASDF
##VAR_DIM=   8192,          8192,            8192
##UNITS=     SECONDS,       ARBITRARY UNITS, ARBITRARY UNITS
##FACTOR=    0.0002768,     1,               1
##FIRST=     0,             0,               0
##LAST=      2.2672688,     0,               0
##MIN=       0,             -528176,         0
##MAX=       2.2672688,     582755,          0
$$ Real data points
##PAGE= N=1
##DATA TABLE= (X++(R..R)), XYDATA
$$ plain form
0 0 0 0 0 0 0 0 0 0 -8 8 -8 8 -16 16 -24 24 -32 40 -48 62 -72 88 -104 120 -144 167 -192 222 -255 290 -332
31 -332 378 -429 485 -548 617 -692 775 -866 963 -1073 1191 -1322 1462 -1617 1786 -1969
47 -1969 2172 -2391 2634 -2904 3199 -3527 3894 -4305 4771 -5301 5913 -6627 7473 -8494
61 -8494 9755 -11356 13462 -16368 20645 -27554 40542 -73293 341044 288087 -232214 281122
73 281122 523816 135181 -246532 -117174 -46522 -71422 -62929 -123945 -301723 -134054 190605
84 190605 95564 -277103 -201607 139103 114856 -199426 -253707 -89318 -2463 -26912 -58372
95 -58372 -83086 14211 204232 241270 89973 69296 222888 257701 111285 23730 32367 6140
107 6140 -41380 -45195 -89435 -178675 -151766 -9047 15033 -108461 -127147 27702 103688 -17380
$$ packed form
0@%%%%%%%%qJ6j6J6k4L2m0M8n6P2q8J10j34J60j92K24k64L11l59M14m77N45o22
31c32P10q07R14j033J165j309J467j641J829k036K264k513K784l079L403l755
47a969M141m563N025n538O103o726P421q199R076j0072J1214j2540J4100j5967
61h494J8249k1111K4818k9830L7013m8199O8096j13835M14337n2957n20301N13336
73B81122K42694l88635l81713J29358P0652k4900Q493o1016j77778J67669L24659
84A90605r5041l72667P5496L40710k4247l14282n4281J64389Q6855k4449l1460
95e8372k4714R7297J90021L7038j51297k0677J53592L4813j46416q7555Q637k6227
107F140m7520l815m4240q9240K6909J42719K4080j23494j8686J54849P5986j21068
$$ plain form
119 -17380 -128657 -78829 -3557 -33019 -89111 -92215 -65025 11232 120160 117218 19982 74327
131 74327 260370 245616 30773 -17520 119067 100661 -80390 -139088 -79609 -81560 -95552
142 -95552 -57553 -74523 -108721 -7616 95398 -46 -108379 -11032 87302 -16051 -119147
153 -119147 -55796 9318 -16073 -15678 16839 20667 64985 145434 121866 44054 85019 152932
165 152932 70312 -38801 -15969 4664 -76002 -112140 -65131 -75833 -110042 -43629 18690 -33878
177 -33878 -51692 46561 76294 -19774 -44971 34054 33717 -49996 -52130 14815 18058 -12394 19545
190 19545 67298 60806 48947 73395 78449 36819 8350 13350 -2630 -47268 -68239 -55585 -50277
203 -50277 -57189 -49310 -29459 -16019 -209 19440 16727 -1374 8520 32406 10312 -33044 -22148
$$ packed form
119a7380j11277M9828P5272k9462n6092l104K7190P6257J08928k942r7236N4345
131G4327J86043j4754k14843m8293J36587j8406j81051n8698N9479j951j3992
142i5552L7999j6970l4198J01105J03014r5444j08333R7347R8334j03353j03096
153a19147O3351O5114k5391L95L2517L828M4318Q0449k3568p7812M0965O7913
165A52932q2620j09113K2832K0633q0666l6138M7009j0702l4209O6413O2319n2568
177c3878j7814R8253K9733r6068k5197P9025l37q3713k134O6945L243l0452L1939
190A9545M7753o492j1859K4448N054m1630k8469N000j5980m4638k0971J2654N308
203e0277o912P879J9851J3440J5810J9649k713j8101R894K3886k2094m3356J0896
$$ plain form
216 -22148 16357 5054 -24411 -2477 33151 31775 31341 47361 35633 16761 37517 39950 -23043
229 -23043 -57025 -11155 2081 -61800 -81344 -20553 7418 -22955 -22872 11368 20437 19057 27990
242 27990 12579 -11369 9000 29100 -10231 -41511 -2600 28264 -3935 -19801 17739 33813
254 33813 10006 9101 24466 8216 -9463 3296 1085 -29838 -32137 -5886 -10096 -31034 -15829
267 -15829 11220 5200 -3951 14547 25297 9727 3292 14005 10931 -5329 -8599 -2384 -4312
280 -4312 -8034 -5028 -3093 -2744 4117 9551 1799 -5026 4207 11178 -2680 -17222 -7341 6240 -3265
295 -3265 -16266 -6555 9682 7110 283 6083 11957 9983 9845 10295 428 -5301 3924 5120 -13071
310 -13071 -19165 -1743 3907 -13133 -17130 -1017 3523 -5807 -5386 900 -317 1459 7915 2984
$$ packed form
216b2148L8505j1303k9465K1934L5628j376m34J6020j1728j8872K0756K433o2993
229b3043l3982M5870J3236o3881j9544O0791K7971l0373Q3L4240R069j380Q933
242B7990j5411k3948K0369K0100l9331l1280L8911L0864l2199j5866L7540J6074
254C3813k3807r05J5365j6250j7679J2759k211l0923k299K6251m210k0938J5205
267a5829K7049o020r151J8498J0750j5570o435J0713l074j6260l270O215j928
280d312l722L006J935L49O861N434p752o825R233O971j3858j4542R881J3581r505
295c265j3001R711J6237k572o827N800N874j974j38M50r867n729R225J196j8191
310a3071o094J7422N650j7040l997J6113M540r330M21O286j217J776O456m931
$$ plain form
324 2984 -4225 7018 17139 4778 -4444 9122 16044 1481 -4756 5745 5763 -4737 -2876 3685
338 3685 -2166 -6983 -737 -562 -10499 -11750 -5764 -9257 -14906 -8428 -1572 -4705 -3918 7276 11652
353 11652 6246 6975 13920 13659 7650 5575 4814 2174 1860 1876 -3023 -5636 170 4743 -1288 -7769
369 -7769 -4306 441 -3372 -10384 -10980 -6677 -4289 -5485 -7126 -7568 -4782 247 2660 422 -329 7451
385 7451 17149 16151 8260 7527 13284 12458 1899 -7282 -9095 -5752 -4262 -8756 -13808 -8817 3092
400 3092 7006 -43 -3714 2501 7072 1419 -8462 -13389 -11069 -4709 -2848 -7730 -7943 5876 19519
415 19519 15284 4946 7779 16088 12913 1910 -4228 -4764 -2588 372 -2014 -10265 -10071 2171 8151
430 8151 -2569 -11232 -2450 8620 3929 -8606 -10628 -1905 3495 -1211 -8252 -6140 3359 8855
$$ packed form
324B984p209J1243J0121j2361r222J3566O922j4563o237J0501J8j0500J861O561
338C685n851m817O246J75r937j251N986l493n649O478O856l133P87J1194M376
353A1652n406P29O945k61o009k075p61k640l14J6m899k613N806M573o031o481
369g769L463M747l813p012n96M303K388j196j641m42K786N029K413k238p51P780
385G451R698r98p891p33N757q26j0559r181j813L343J490m494n052M991J1909
400C092L914p049l671O215M571n653r881m927K320O360J861m882k13J3819J3643
415A9519m235j0338K833Q309l175j1003o138n36K176K960k386q251J94J2242N980
430H151j0720q663Q782J1070m691j2535k022Q723N400m706p041K112R499N496
$$ plain form
444 8855 6843 3082 4435 10998 16563 12539 1350 -2396 4137 4154 -11015 -22001 -15081 -6296 -9914
459 -9914 -13043 -4496 4923 6976 10083 14604 10229 1774 3967 9000 -1195 -16132 -13267 1288
473 1288 2277 -8874 -8280 6759 14347 6917 1191 3394 3876 289 -1979 -6162 -13942 -12764 -1166
488 -1166 777 -11667 -12211 7128 16451 2506 -5475 7784 17108 6318 -4866 -1694 3442 -312
502 -312 -4642 -3412 -2695 -3267 -488 3912 3481 -928 163 7094 7657 -3320 -11025 -4876 58 -9222
518 -9222 -16822 -7513 3334 -1 -1799 8568 12631 4811 5314 14506 9176 -5339 -1847 10718
532 10718 3742 -12375 -7061 7958 3463 -8595 -2401 9707 5276 -4444 -344 4511 -5670 -14628
546 -14628 -8003 -3248 -13045 -17857 -4861 4895 -883 -2974 9907 18589 12325 9003 15469 15036 3562
$$ packed form
444H855k012l761J353O563N565m024j1189l746O533J7j5169j0986O920Q785l618
459i914l129Q547R419K053L107M521m375q455K193N033j0195j4937K865J4555
473A288R89j1151N94J5039P588p430n726K203M82l587k268m183p780J178J1598
488a166J943j2444n44J9339R323j3945p981J3259R324j0790j1184L172N136l754
502c12m330J230P17n72K779M400m31m409J091O931N63j0977p705O149M934r280
518i222p600R309J0847l335j798J0367M063p820N03R192n330j4515L492J2565
532A0718o976j6117N314J5019m495j2058O194J2108m431r720M100M855j0181q958
546a4628O625M755r797m812J2996R756n778k091J2881Q682o264l322O466m33j1474
$$ plain form
561 3562 -197 4260 -1168 -12371 -10065 326 -1558 -9493 -5128 4713 2927 -5192 -4969 -1346 -4024
576 -4024 -8515 -7057 -3977 -6343 -7776 -1015 5844 2242 -2995 4367 16004 12160 -341 1896 14654
591 14654 13366 -327 -3639 3385 4098 -1283 -4071 -6171 -7822 -2517 2651 -5512 -15183 -6690 6727
606 6727 638 -14939 -12741 2896 5764 -5547 -10472 -252 10811 10328 3528 3124 10856 15063
620 15063 10353 3076 584 1445 2486 1392 -4277 -9841 -5405 3813 1549 -8759 -8821 1626 4136
635 4136 -4473 -9190 -4683 -642 -1007 -2151 -3908 -4069 1002 6997 4777 -2558 -1161 9077 12861
650 12861 3476 -3665 3342 12697 7785 -3799 -5548 2081 4692 -2224 -8703 -7528 -1825 1268 -2205
665 -2205 -8288 -6587 2396 5283 -2706 -8229 -1622 5486 1915 -4973 -4519 1757 5405 3496 -439
$$ packed form
561C562l759M457n428j1203K306J0391j884p935M365R841j786q119K23L623k678
576d024m491J458L080k366j433O761O859l602n237P362J1637l844j2501K237J2758
591A4654j288j3693l312P024P13n381k788k100j651N305N168q163r671Q493J3417
606F727o089j5577K198J5637K868j1311m925J0220J1063m83o800m04P732M207
620A5063m710p277k492Q61J041j094n669n564M436R218k264j0308o2J0447K510
635D136q609m717M507M041l65j144j757j61N071N995k220p335J397J0238L784
650A2861r385p141P007R355m912j1584j749P629K611o916o479J175N703L093l473
665b205o083J701Q983K887p989n523O607P108l571o888M54O276L648j909l935
$$ plain form
680 -439 -131 4804 7485 3340 -1474 324 4608 3973 103 -2035 -1152 807 484 -2773 -5592 -3944
696 -3944 -518 -915 -3674 -3608 -484 1110 787 -119 -887 -281 1545 1697 -1712 -3613 -1041 1879 442
713 442 -1729 -49 3504 4746 3687 2124 2344 3928 3829 465 -2839 -2105 -193 -804 -3590 -4001 -1201
730 -1201 1206 791 -1218 -1399 1423 2364 -964 -4442 -3644 -1435 -2195 -5063 -5130 -1415 1830 1752 1177 2997
748 2997 6096 7051 4788 2994 3199 3654 1880 -1077 -2478 -1386 9 -1092 -2389 -1561 581 1104
764 1104 -568 -1903 -1452 -1694 -3199 -5111 -6169 -5430 -4541 -4183 -3648 -1487 1861 3866 5052 6283 7777
781 7777 7971 7003 5818 4445 2302 261 -636 -1684 -2756 -2917 -1763 -1076 -689 -644 -344 -573 -1388 -3036
799 -3036 -4596 -5744 -6398 -6465 -6445 -5683 -3503 -389 2075 4021 6219 8468 9345 8884 7495 5939 4443
$$ packed form
680d39L08M935K681m145m814J798M284o35l870k138Q83J959l23l257k819J648
696c944L426l97k759O6L124J594l23r06p68O06J826J52l409j901K572K920j437
713D42k171J680L553J242j059j563K20J584r9l364l304P34J912o11k786m11K800
730a201K407m15k009j81K822R41l328l478P98K209p60k868o7L715L245p8n75J820
748B997L099R55k263j794K05M55j774k957j401J092J395j101j297Q28K142N23
764A104j672j335M51k42j505j912j058P39Q89L58N35K161L348K005J186J231J494
781G777J94r68j185j373k143k041q97j048j072j61J154O87L87M5L00k29q15j648
799c036j560j148o54o7K0P62K180L114K464J946K198K249Q77m61j389j556j496
$$ plain form
816 4443 2688 391 -1352 -1742 -1606 -1723 -2384 -1926 -1002 -682 -1678 -2558 -2770 -3460 -4810 -6320 -6917 -6545
834 -6545 -5692 -4659 -2995 -705 2251 5033 6696 7293 8398 8828 7802 5601 3977 3047 1513 -644
850 -644 -1971 -2450 -2594 -2134 -2371 -2243 -2220 -1722 -1689 -3333 -4569 -4707 -4802 -5587 -5835 -4686 -3188 -1713 208
869 208 2486 3761 5036 7057 8473 7397 6226 6246 5442 2593 349 -846 -2042 -3008 -2794 -2768 -2913
886 -2913 -2161 -258 -368 -2505 -2974 -1846 -2080 -4305 -5455 -4030 -2844 -2740 -1808 -256 1771 3506 5491
903 5491 5884 4958 5006 5878 4855 2029 257 749 1166 -119 -1690 -1717 -885 -198 -1218 -2810 -3367 -2123
921 -2123 -1325 -2243 -3415 -3309 -1912 -680 -1002 -2366 -2183 590 2891 1604 -635 1313 5162 4428 803
938 803 631 3431 3327 519 -650 -491 -1334 -696 647 -890 -3213 -438 3982 1678 -3331 -2142 2453
$$ packed form
816D443j755k297j743l90J36j17o61M58R24L20r96q80k12o90j350j510n97L72
834f545Q53J033J664K290K956K782J663N97J105M30j026k201j624r30j534k157
850f44j327m79j44M60k37J28K3M98L3j644j236j38r5p85k48J149J498J475J921
869B08K278J275J275K021J416j076j171K0q04k849k244j195j196r66K14K6j45
886b913P52J903j10k137m69J128k34k225j150J425J186J04R32J552K027J735J985
903E491L93r26M8Q72j023k826j772M92M17j285j571k7Q32O87j020j592n57J244
921b123P98r18j172J06J397J232l22j364J83K773K301j287k239J948L849p34l625
938H03j72K800j04k808j169J59q43O38J343j537k323K775M420k304n009J189M595
$$ plain form
955 2453 856 -4051 -4342 -1585 -1241 -2111 -2039 -1908 -1813 317 2331 424 -1813 105 3691 3247 50
972 50 -200 3193 5366 3148 -105 89 2484 2416 -1549 -3419 -1611 32 -314 -881 -902 -508 636 1928
990 1928 76 -3771 -3782 -746 -928 -5667 -6942 -1990 970 -1208 -2390 1576 5081 4411 3130 4344
1006 4344 4224 2553 3740 4125 642 -2174 1171 4027 -73 -4315 -638 3379 303 -3825 -2490
1021 -2490 -599 -2438 -4420 -4484 -5515 -6328 -4323 -2856 -4226 -3989 651 4620 4540 3824 6026 8571 8523
1038 8523 5724 2809 2367 3255 1376 -2219 -2608 9 158 -1279 -876 433 -997 -1936 -1019 -2796 -7072
1055 -7072 -7371 -4558 -5971 -9712 -7292 -1568 47 -600 2749 7682 8288 7601 8823 8800 5667 3960
1071 3960 4480 2119 -1916 -2295 41 -772 -3232 -2607 441 773 -1198 -1871 -1713 -2873 -4948 -6359 -7497
$$ packed form
955B453j597m907k91K757L44q70P2J31R5K130K014j907k237J918L586m44l197
972E0k50L393K173k218l253J94K395o8l965j870J808J643l46n67k1L94J144J292
990A928j852l847j1L036j82m739j275M952K960k178j182L966L505o70j281J214
1006D344j20j671J187L85l483k816L345K856m100m242L677M017l076m128J335
1021b490J891j839j982o4j031q13K005J467j370K37M640L969q0p16K202K545m8
1038H523k799k915m42Q88j879l595l89K617J49j437M03J309j430r39R17j777m276
1055g072k99K813j413l741K420N724J615o47L349M933O06o87J222k3l133j707
1071C960N20k361m035l79K336q13k460O25L048L32j971o73J58j160k075j411j138
$$ plain form
1088 -7497 -8339 -7609 -5696 -4318 -2651 1092 5039 7299 8701 10048 10869 9993 8275 6038 2787 789
1104 789 -282 -2474 -4632 -3783 -1989 -2342 -3085 -926 252 -1562 -2940 -2688 -4508 -7742 -7831 -6349 -7440
1121 -7440 -7110 -2908 1504 2180 4390 9081 11584 10221 10014 10712 7935 4010 2236 335 -3278 -5657
1137 -5657 -4316 -4160 -5269 -3761 -805 -513 -1518 -1079 -771 -2974 -4917 -5184 -6076 -7063 -6141 -3793 -2565
1154 -2565 -624 3509 7152 8440 9820 11593 11441 8864 6624 4224 718 -2450 -4090 -5687 -6882
1169 -6882 -6440 -4455 -3056 -2905 -1572 272 263 -1202 -1900 -2608 -4152 -5426 -5094 -4687 -4146 -1801 1961
1186 1961 4132 5765 8756 11354 10669 8664 7983 5981 2173 -1390 -3259 -5297 -7729 -7292 -5777 -5457
1202 -5457 -4792 -1718 402 -91 -52 1181 544 -1980 -2953 -2508 -3716 -4308 -2398 -235 910 3341 6795
$$ packed form
1088g497q42P30J913J378J667L743L947K260J402J347Q21q76j718k237l251j998
1104G89j071k192k158Q49J794l53p43K159J178j814j378K52j820l234q9J482j091
1121g440L30M202M412O76K210M691K503j363k07O98k777l925j774j901l613k379
1137e657J341J56j109J508K956K92j005M39L08k203j943k67q92r87R22K348J228
1154b565J941M133L643J288J380J773j52k577k240k400l506l168j640j597j195
1169f882M42J985J399J51J333J844rj465o98p08j544j274L32M07N41K345L762
1186A961K171J633K991K598o85k005o81k002l808l563j869k038k432M37J515L20
1202e457O65L074K120m93L9J233o37k524r73M45j208n92J910K163J145K431L454
$$ plain form
1219 6795 8525 8191 8973 8991 6454 3111 921 -1600 -4977 -7052 -7158 -7523 -7504 -5448 -3190 -1828 -406
1236 -406 1690 2433 1635 944 795 -882 -2333 -2114 -1517 -1587 -375 2272 4213 5280 6476 7856 7393
1253 7393 5578 4023 2134 -1023 -3763 -5282 -6696 -7753 -7796 -6094 -4514 -3141 -879 1517 2476 2463
1269 2463 3196 3118 1397 159 0 -816 -1633 -1101 340 1514 2424 4257 5701 5629 5215 4844 3240 155
1287 155 -2013 -3716 -5802 -7580 -7644 -6587 -6019 -4325 -1695 411 1877 3160 4145 4037 3067 2458 1624
1304 1624 198 -678 -457 -215 -22 1204 2498 3175 3418 3907 3719 2063 550 -603 -2736 -4692 -5817
1321 -5817 -6065 -6507 -6136 -4385 -2524 -1339 663 2735 3881 3945 3991 4242 3406 1843 957 510 -223 -729
1339 -729 18 680 927 1387 2415 2464 1785 935 125 -1382 -3100 -4206 -4997 -5581 -5566 -4407 -3275 -1885
$$ packed form
1219F795J730l34P82J8k537l343k190k521l377k075j06l65J9K056K258J362J422
1236d06K096P43p98o91j49j677j451K19N97p0J212K647J941J067J196J380m63
1253G393j815j555j889l157k740j519j414j057m3J702J580J373K262K396R59j3
1269B463P33p8j721j238j59q16q17N32J441J174R10J833J444p2m14l71j604l085
1287A55k168j703k086j778o4J057N68J694K630K106J466J283R85j08r70o09q34
1304A624j426q76K21K42J93J226J294O77K43M89j88j656j513j153k133j956j125
1321e817k48m42L71J751J861J185K002K072J146O4M6K51q36j563q86m47p33n06
1339g29P47O62K47M60J028M9o79q50q10j507j718j106p91n84J5J159J132J390
$$ plain form
1357 -1885 -140 1758 3025 3734 4379 4221 3812 3094 2295 1251 380 100 21 -147 -205 467 803 875 735
1376 735 526 68 -1019 -2033 -2623 -3436 -4063 -4098 -3742 -3235 -2209 -827 688 1414 2484 3442 4015 3808
1394 3808 3442 2951 2209 1450 374 -36 -220 -498 -437 -272 -208 89 18 -170 -455 -1105 -1570 -2257 -2591 -3000
1414 -3000 -3130 -2548 -1912 -1161 -522 459 1590 2254 2679 2832 2751 2476 2078 1357 1112 438 24 11 -135 -343
1434 -343 -462 -76 -165 -489 -933 -625 -685 -1242 -1835 -1757 -1648 -1713 -1767 -960 -425 -406 324 1154 1309 1326 1674 1985
1456 1985 1739 1149 1238 1273 756 201 51 19 -286 -640 -581 -408 -621 -878 -893 -541 -795 -1170 -819 -442 -436 -716
1478 -716 -447 -11 -18 -396 252 473 223 -60 791 1025 833 482 1035 1206 512 152 366 545 -19 -391 -169
1499 -169 -47 -622 -687 -343 -73 -505 -278 376 448 -333 -328 120 -307 -1284 -1157 -484 -554 -1120 -602 439 86
$$ packed form
1357a885J745J898J267P09O45j58m09p18p99j044q71k80p9j68n8O72L36P2j40
1376G35k09m58j087j014n90q13o27l5L56N07J026J382J515P26J070R58N73k07
1394C808l66m91p42p59j076m10j84k78O1J65O4K97p1j88k85o50m65o87l34m09
1414c000j30N82O36P51O39R81J131O64M25J53q1k75l98p21k45o74m14j3j46k08
1434c43j19L86q9l24m44L08o0n57n93P8J09o5n4Q07N35J9P30Q30J55J7L48L11
1456A985k46n90Q9L5n17n55j50l2l05l54N9J73k13k57j5L52k54l75L51L77Ok80
1478g16K69M36pl78O48K21k50k83Q51K34j92l51N53J71o94l60K14J79n64l72K22
1499a69J22n75o5L44K70m32K27O54P2p81NM48m27r77J27O73p0n66N18J041l53
$$ plain form
1520 86 92 1085 1357 1066 1055 1526 1323 330 280 298 -274 -545 -318 -117 128 162 75 291 598 426 -454 -748 -869
1543 -869 -1442 -2077 -1957 -1565 -1625 -1579 -489 269 229 863 1814 2269 1542 1387 1828 1468 339 88 460 -74
1563 -74 -169 25 691 495 397 607 754 -161 -855 -908 -1153 -2219 -2750 -2403 -2243 -2220 -2099 -909 28 528 1193
1584 1193 2409 2391 2265 2467 2186 1285 783 804 539 30 -56 425 427 314 546 323 -97 -147 -425 -1438 -2105
1605 -2105 -2247 -2750 -3123 -2929 -2327 -1964 -1189 169 1142 1357 2027 3021 2956 2050 2172 2269 1423 315 499 794
1625 794 88 -163 347 489 -113 175 278 -360 -1090 -1404 -1671 -2498 -3171 -2899 -2446 -2322 -1900 -822 257
1644 257 978 1807 2441 2594 2512 2738 2286 1762 1154 959 504 5 -34 321 128 -65 179 113 -304 -439 -984
1665 -984 -1351 -2017 -2278 -2399 -2661 -2688 -1842 -1064 -721 233 1080 1813 1807 2152 2551 2209 1800 1679 1405 307 -39
$$ packed form
1520H6OR93K72k91j1M71k03r93n0J8n72k71K27K01K45L4q7K16L07j72q80k94j21
1543h69n73o35J20L92o0M6J090P58m0O34R51M55p27j55M41l60j129k51L72n34
1563g4r5J94O66j96r8K10J47r15o94n3k45j066n31L47J60K3J21J190R37N00O65
1584A193J216j8j26K02k81r01n02K1k65n09q6M81Kj13K32k23m20n0k78j013o67
1605b105j42n03l73J94O02L63P75J358R73K15O70R94o5r06J22R7q46j108J84K95
1625G94p06k51N10J42o02K88J03o38p30l14k67q27o73K72M53J24M22J078J079
1644B57P21Q29O34J53q2K26m52n24o08j95m55m99l9L55j93j93K44o6m17j35n45
1665i84l67o66k61j21k62k7Q46P78L43R54Q47P33oL45L99l42m09j21k74j098l46
$$ plain form
1686 -39 259 86 -591 -206 331 179 -401 -118 -109 -977 -1335 -1395 -1685 -2382 -2042 -1630 -1432 -1385 -463 516 745 999
1708 999 1887 2024 1746 1835 1903 1074 679 571 510 -156 -350 96 55 -183 -77 255 -179 -548 -556 -678 -1375 -1569
1730 -1569 -1338 -1268 -1705 -1273 -652 -520 -208 444 914 1119 1309 1471 1564 899 669 955 359 28 110 149 -202
1751 -202 -113 246 353 -97 -18 230 -228 -670 -734 -491 -1051 -1180 -744 -607 -1099 -673 -43 125 77 340 805
1772 805 590 429 728 755 388 179 366 382 -15 190 505 219 11 461 451 -14 -193 98 -219 -643 -616
1793 -616 -427 -741 -848 -611 -578 -596 -541 -120 -71 -271 53 494 214 107 372 393 302 355 723 522 198 495
1815 495 804 360 148 357 519 -57 -34 385 -116 -591 -402 -396 -798 -1074 -746 -627 -962 -812 -455 -229 -518
1836 -518 -151 415 297 265 730 803 623 529 733 877 370 492 570 403 224 501 315 -72 -82 -98 -306 -698
$$ packed form
1686c9K98j73o77L85N37j52n80K83Rq68l58o0k90o97L40M12J98M7R22R79K29K54
1708I99Q88J37k78Q9O8q29l95j08o1o66j94M46m1k38J06L32m34l69qj22o97j94
1730a569K31P0m37M32O21J32L12O52M70K05J90J62R3o65k30K86n96l31Q2L9l51
1751b02Q9L59J07m50P9K48m58m42o4K43n60j29M36J37m92M26O30J68m8K63M65
1772H05k15j61K99K7l67k09J87J6l97K05L15k86k08M50j0m65j79K91l17m24K7
1793f16J89l14j07K37L3j8N5M21M9k00L24M41k80j07K65K1r1N3L68k01l24K97
1815D95L09m44k12K09J62n76K3M19n01m75J89Om02k76L28J19l35J50L57K26k89
1836e18L67N66j18l2M65P3j80r4K04J44n07J22P8j67j79K77j86l87j0j6k08l92
$$ plain form
1858 -698 -912 -805 -974 -1270 -1060 -721 -1014 -788 -135 -83 -7 660 720 677 495 907 965 558 580 744 827 455
1880 455 543 711 563 109 347 210 -260 -513 -455 -761 -1251 -1283 -1241 -1233 -1497 -1054 -611 -538 -109 304 645 512
1902 512 923 986 981 667 634 869 656 467 557 478 319 482 358 148 11 112 -185 -751 -799 -838 -1106 -1409 -1130
1925 -1130 -1029 -1047 -816 -281 22 130 220 727 917 734 739 798 704 469 454 405 654 407 299 441 374 210 203
1948 203 230 -186 -446 -585 -789 -1067 -1197 -1107 -994 -901 -690 -354 40 272 398 581 843 833 576 428 744
1969 744 584 247 125 412 164 -13 210 571 294 7 -17 -1 -302 -687 -606 -866 -947 -1012 -853 -519 -436 -374
1991 -374 220 296 231 435 635 701 436 325 292 250 140 -156 -7 224 206 97 271 326 113 39 141 11 -279
2014 -279 -600 -417 -754 -647 -653 -279 -258 -522 -97 221 177 165 294 378 70 92 195 92 67 -129 95 197 119
$$ packed form
1858f98k14J07j69k96K10L39k93K26O53N2P6O67O0m3j82M12N8m07K2J64Q3l72
1880D55Q8J68j48m54K38j37m70k53N8l06m90l2M2Qk64M43M43P3M29M13L41j33
1902E12M11O3nl14l3K35k13j89R0p9j59J63j24k10j37J01k97n66m8l9k68l03K79
1925a130J01j8K31N35L03J08R0N07J90j83NN9r4k35j5m9K49k47j08J42o7j64p
1948B03K7m16k60j39k04k78j30R0J13R3K11L36L94K32J26J83K62j0k57j48L16
1969G44j60l37j22K87k48j77K23L61k77k87k4J6l01l85Q1k60q1o5J59L34Q3O2
1991c74N94P6o5K04K00O6k65j11l3m2j10k96J49K31j8j09J74N5k13p4J02j30k90
2014b79l21J83l37J07oL74K1k64M25L18m4j2J29Q4l08K2J03j03k5j96K24J02p8
$$ plain form
2037 119 43 411 564 577 226 206 228 21 -262 -163 5 -245 -464 -401 -273 -356 -343 -282 34 -169 -133 135 142 -124
2061 -124 -351 -126 -129 -74 -368 124 275 117 515 738 317 327 419 476 396 -79 132 146 -131 -458 -245 -165 -495
2084 -495 -433 -286 -148 -403 -237 -80 -262 -501 -171 -140 -143 -19 270 293 410 287 591 376 422 562 369 370 468
2107 468 399 -73 -81 246 -151 -293 -156 -141 -319 -491 -320 -434 -747 -357 -174 -341 -370 -126 168 13 -40 280
2129 280 374 135 490 415 473 371 538 351 649 419 415 279 180 -269 -290 -369 -435 -636 -831 -591 -730 -752 -617
2152 -617 -293 -228 -99 388 250 322 611 382 292 44 390 234 242 80 253 301 474 349 283 274 274 207 -22 -405
2176 -405 -419 -415 -854 -1055 -755 -688 -729 -305 -16 115 179 507 731 505 436 435 238 192 145 75 -74 -138 26 127
2200 127 153 337 414 156 88 8 -356 -499 -738 -722 -799 -701 -504 -214 -128 97 439 762 792 718 664 467 176 -100
$$ packed form
2037A19p6L68J53J3l51k0K2k07k83R9J68k50k19O3J28q3J3O1L16k03L6K68Pk66
2061a24k27K25lN5k94M92J51j58L98K23m21J0R2N7q0m75K11J4k77l27K13Q0l30
2084d95O2J47J38k55J66J57j82k39L30L1lJ24K89K3J17j23L04k15M6J40j93JR8
2107D68o9m72qL27l97j42J37J5j78j72J71j14l13L90J83j67k9K44K94j55n3L20
2129B80R4k39L55p5N8j02J67j87K98k30mj36r9m49k1p9o6k01j95K40j39k2J35
2152f17L24O5J29M87j38P2K89k29r0k48L46j56Qj62J73M8J73j25o6r%o7k29l83
2176d05j4Mm39k01L00O7m1M24K89J31O4L28K24k26o9jj97m6m7p0j49o4J64J01
2200A27K6J84P7k58o8q0l64j43k39J6p7R8J97K90Q6K25L42L23L0p4n4j97k91k76
$$ plain form
2224 -100 -123 -316 -383 -483 -256 -304 -6 220 406 384 180 280 3 -349 -577 -527 -672 -889 -663 -330 -33 177
2246 177 677 1051 1146 1067 1135 799 459 19 -170 -585 -823 -832 -808 -903 -546 -345 -208 92 358 480 400 277 191
2269 191 -77 -296 -533 -466 -270 -278 103 539 896 933 1256 1131 839 551 246 -93 -709 -946 -1207 -1205 -1238 -1027
2291 -1027 -634 -274 -21 270 534 495 434 547 250 -62 -81 -231 -179 -77 171 321 876 994 1263 1085 1032
2312 1032 993 502 -188 -693 -1189 -1605 -1693 -1950 -1652 -1221 -668 -215 158 471 916 968 826 579 439 398 20
2333 20 -54 49 16 289 519 906 1066 1231 1173 874 561 -111 -523 -881 -1538 -1780 -2108 -2033 -1568 -1346 -839 -408
2355 -408 289 641 1001 1016 1213 1045 942 448 299 366 59 271 362 464 690 991 1105 836 582 217 -167
2376 -167 -627 -1532 -1766 -2174 -2266 -1904 -1858 -1387 -691 22 350 882 1243 1478 1494 1214 871 658 506 272 271 356
$$ packed form
2224a00k3j93o7j00K27m8K98K26J86k2k04J00k77l52k28N0j45k17K26L33K97K10
2246A77N00L74R5p9O8l36l40m40j89m15k38rK4r5L57K01J37L00K66J22q0j23q6
2269A91k68k19k37O7J96qL81M36L57L7L23j25k92k88l05l39o16k37k61Kl3K11
2291a027L93L60K53K91K64l9o1J13k97l12j9j50N2J02K48J50N55J18K69j78n3
2312A032l9m91o90n05m96m16q8k57K98M31N53M53L73L13M45N2j42k47j40m1l78
2333B0p4J03l3K73K30L87J60J65n8k99l13o72m12l58o57k42l28P5M65K22N07M31
2355d08O97L52L60J5J97j68j03m94j49O7l07K12R1J02K26L01J14k69k54l65l84
2376a67m60r05k34m08r2L62M6M71O96P13L28N32L61K35J6k80l43k13j52k34jQ5
$$ plain form
2398 356 418 457 611 784 747 714 409 -98 -444 -939 -1452 -1794 -1939 -1995 -1935 -1596 -1067 -409 47 532 1154 1553
2420 1553 1503 1380 1249 1081 781 323 407 216 -14 199 455 294 510 466 417 96 -276 -593 -1022 -1310 -1533
2441 -1533 -1732 -1779 -1530 -1217 -651 -314 160 714 1141 1295 1415 1346 1167 1040 803 441 400 186 191 202 155 399
2463 399 336 275 105 122 -382 -586 -994 -1239 -1558 -1553 -1398 -1190 -906 -556 -40 474 655 876 1042 1416 1215 1053
2485 1053 768 429 495 105 21 75 67 112 93 289 60 -185 -94 -254 -582 -965 -908 -1201 -1037 -1213 -907 -586 -241
2508 -241 -49 382 605 682 1006 1050 746 635 573 383 402 63 31 161 -60 -114 152 80 182 32 -166 -127 -430
2531 -430 -626 -580 -712 -760 -541 -609 -421 -230 -120 136 271 307 670 463 530 427 434 204 133 67 -126 -24 179
2554 179 49 103 294 155 -6 53 31 -129 -191 -341 -306 -546 -436 -345 -342 -313 -254 15 77 209 76 227 159 130
$$ packed form
2398C56O2L9J54J73l7l3l05n07l46m95n13l42j45n6O0L39N29O58M56M85O22L99
2420A553n0j23j31j68l00m58Q4j91k30K13K56j61K16m4m9l21l72l17m29k88k23
2441a533j99m7K49L13N66L37M74N54M27J54J20o9j79j27k37l62m1k14NJ1m7K44
2463C99o3o1j70J7n04k04m08k45l19NJ55K08K84L50N16N14J81K21J66L74k01j62
2485A053k85l39O6l90q4N4qM5j9J96k29k45R1j60l28l83N7k93J64j76L06L21L45
2508b41J92M31K23P7L24M4l04j11o2j90J9l39l2J30k21n4K66p2J02j50j98L9l03
2531d30j96M6j32m8K19o8J88J91J10K56J35L6L63k07O7j03Pk30p1o6j93J02K03
2554A79j30N4J91j39j61N9k2j60o2j50L5k40J10R1LK9N9K69O2J32j33J51o8k9
$$ plain form
2578 130 211 82 68 -13 167 237 127 212 218 127 176 201 114 130 72 -14 -204 -100 -137 -341 -124 -227 -124 -118 -311 -167
2604 -167 -133 -264 -166 -20 -89 64 8 171 293 175 197 162 501 324 317 422 284 158 260 123 77 56 -17 -123
2628 -123 -120 -311 -258 -452 -703 -492 -415 -592 -272 -252 -164 17 134 298 390 368 308 398 371 242 275 305 123 34 -8
2653 -8 60 13 220 196 86 -4 -30 -27 -227 -370 -260 -375 -748 -602 -432 -465 -443 -162 -127 91 17 502 528 239 352
2678 352 456 432 110 307 270 196 144 111 136 131 49 14 -28 -133 -296 -521 -393 -558 -733 -700 -552 -504 -245 -103
2702 -103 125 174 438 486 676 606 547 361 308 235 96 193 100 144 178 88 281 108 44 -50 -85 -295 -422 -495 -509
2727 -509 -568 -508 -472 -259 -149 29 223 286 330 544 454 414 442 176 302 122 204 107 -95 100 -29 -111 47 114
2751 114 28 116 64 -138 -145 -374 -412 -698 -543 -491 -152 -294 -42 21 150 363 483 379 493 255 23 63 -70
$$ packed form
2578A30Q1j29j4q1J80P0j10Q5Or1M9K5q7J6n8q6j90J04l7k04K17j03J03Oj93J44
2604a67L4j31R8J46o9J53n6J63J22j18K2l5L39j77pJ05j38j26J02j37m6k1p3j06
2628a23Lj91N3j94k51K11P7j77L20K0Q8J81J17J64R2k2o0R0k7j29L3L0j82q9m2
2653hO8m7K07k4j10r0k6Lk00j43J10j15l73J46J70l3K2K81L5K18p4M85K6k89J13
2678C52J04k4l22J97l7p4n2l3K5nq2l5m2j05j63k25J28j65j75L3J48M8K59J42
2702a03K28M9K64M8J90p0n9j86n3p3j39R7r3M4L4r0J93j73o4r4l5k10j27p3j4
2727e09n9O0L6K13J10J78J94O3M4K14r0m0K8k66J26j80Q2r7k02J95j29q2J58O7
2751A14q6Q8n2k02pk29l8k86J55N2L39j42K52O3J29K13J20j04J14k38k32M0j33
$$ plain form
2774 -70 -11 185 -60 86 105 -172 117 67 -14 -61 -98 -169 -259 -347 -269 -322 -325 -286 -146 25 -112 185 87 196 386
2799 386 268 298 136 -8 -12 -111 -108 64 118 -217 -44 80 165 247 153 243 51 80 -147 -247 -258 -219 -154 -198 -213 67
2825 67 117 80 -37 241 224 93 127 150 139 -169 -62 -127 -109 80 -82 97 197 135 193 276 74 75 -37 -93 -127
2850 -127 -126 -119 -199 -143 -160 -77 -63 157 217 99 4 66 47 -8 -25 -143 -282 -158 -178 4 -43 81 45 145 185 261 227
2877 227 140 147 -87 253 -25 -67 -102 -211 -298 -159 -12 75 257 -123 95 54 -94 -117 -10 -275 -228 -82 -44 -30
2901 -30 -97 40 -25 237 135 230 284 235 249 147 116 19 56 -49 -190 -98 27 -184 68 87 28 -55 8 -146 -124
2926 -124 -231 -195 -165 -156 -144 23 -74 -5 -4 157 201 379 259 181 287 249 187 -3 48 3 -90 -17 -203 38 -70 -150
2952 -150 -33 -50 -175 -161 -41 -151 -263 -296 -226 -177 -55 -29 33 18 120 304 262 283 273 288 269 217 199 -71 -41
$$ packed form
2774g0N9J96k45J46J9k77K89n0q1m7l7p1r0q8P8n3lL9J40J71j37K97r8J09J90
2799C86j18L0j62j44mr9LJ72N4l35J73J24Q5Q2r4R0j92K9k27j00j1L9O5m4j5K80
2825F7N0l7j17K78j7j31L4K3j1l08J07o5J8J89j62J79J00o2N8Q3k02Jj12n6l4
2850a27JPq0N6j7Q3J4K20O0j18r5O2j9n5j7j18j39J24k0J82m7J24l6J00M0P6l4
2877B27q7Pk34L40k78m2l5j09q7J39J47Q7J82l80K18m1j48k3J07k65M7J46L8J4
2901c0o7J37o5K62j02R5N4m9J4j02l1r7L7j05j41R2J25k11K52J9n9q3O3j54K2
2926a24j07L6L0RJ2J67r7O9JJ61M4J78j20p8J06l8o2j90N1m5r3P3j86K41j08q0
2952a50J17j7j25J4J20j10j12l3P0M9J22K6O2j5J02J84m2K1j0J5j9n2j8k70L0
$$ plain form
2977 -41 88 -74 -3 -35 -86 -109 -4 -283 -298 -209 -233 7 -142 -313 -52 -198 -74 -64 -146 -18 140 123 267 367
3001 367 237 344 170 225 160 -74 148 83 -24 -91 -96 13 -7 -27 27 83 -114 -71 24 -130 54 -138 -73 -135 -107
3026 -107 -45 126 -53 -14 161 125 19 112 296 233 238 170 167 135 68 -65 -61 -19 24 -170 -36 -134 -60 -69 167 -70 -217
3053 -217 -50 -104 164 57 -93 99 -20 -105 -29 125 20 -30 31 135 198 100 64 -104 95 114 -42 -166 -143
3076 -143 27 -124 -47 69 50 53 -22 -18 45 -53 107 -43 -291 -289 -130 -224 -100 -127 -30 -153 -43 162 236 51 204
3101 204 118 29 37 18 -10 58 -85 61 73 228 131 40 40 89 -122 -192 -103 -201 -302 -207 -168 -151 -245 -101 -7 102 49
3128 49 -51 149 111 264 292 108 97 116 -160 104 -34 -54 -61 -44 -91 53 -95 67 63 -131 -97 -47 -44 -301 -285 -401
3154 -401 -246 -268 -187 -158 15 80 277 218 99 139 113 348 131 104 134 332 102 226 161 121 206 76 -27 -194
$$ packed form
2977d1J29j62P1l2n1k3J05k79j5Q9k4K40j49j71K61j46J24J0q2J28J58j7J44J00
3001C67j30J07j74N5o5k34K22o5j07o7nJ09k0k0N4N6j97M3R5j54J84j92O5o2K8
3026a07O2J71j79L9J75l6j06R3J84o3No8ll2o7j33MM2M3j94J34r8P4rK36k37j47
3053b17J67n4K68j07j50J92j19q5P6J54j05n0O1J04O3r8l6j68J99J9j56j24K3
3076a43J70j51P7J16j9Lp5MO3r8J60j50k48KJ59r4J24k7R7j23J10K05P4j85J53
3101B04q6q9Qj9k8O8j43J46J2J55r7r1%M9k11p0Q9r8j01R5L9J7r4J44R4J09n3
3128D9j00K00l8J53K8j84j1J9k76K64j38k0pJ7m7J44j48J62mj94L4N0Lk57J6j16
3154d01J55k2Q1K9J73O5J97n9j19M0k6K35k17k7L0J98k30J24o5m0Q5j30j03j67
$$ plain form
3178 -194 -126 -75 -188 -146 -414 -243 -256 -188 -277 -148 -91 -13 -3 70 171 172 83 180 136 51 93 217 297 181 181 117 169
3205 169 -131 41 85 8 18 -106 -190 -199 -143 -220 -214 -238 -41 41 48 12 158 16 107 2 54 314 128 271 112 30
3231 30 234 80 96 150 118 -63 -67 44 -98 42 -56 -102 -273 -200 -133 -316 -61 -200 -32 -104 35 121 129 176 127
3256 127 93 202 218 186 57 265 84 -18 -12 40 87 36 -52 60 -141 -164 -14 -286 -116 -179 -96 -267 -249 -29
3280 -29 -60 -143 74 -144 -22 6 -130 133 100 -17 188 3 166 125 48 31 125 53 122 -38 2 21 -291 -57
3304 -57 89 34 21 -118 -106 3 77 -98 -105 -115 -242 43 -143 24 50 -119 5 205 110 57 151 61 -4 -6 260
3329 260 -21 -10 55 117 137 69 -11 -103 -36 32 -162 -81 8 -221 -53 -197 -193 -239 -347 -179 -113 -119 78 244 -93 73
3355 73 59 106 193 151 199 51 261 181 184 139 72 225 153 -50 27 137 -66 -83 -162 -278 -236 -378 -311 -271 -265 -238 -12
$$ packed form
3178a94O8N1j13M2k68J71j3O8q9J29N7P8J0P3J01Jq9R7m4q5M2J24Q0j16%o4N2
3205A69l00J72M4p7J0j24q4rN6p7Ok4J97Q2Pl6J46j42R1j05N2K60j86J43j59q2
3231C0K04j54J6N4l2j81mJ11j42J40r8m6j71P3O7j83K55j39J68p2J39Q6QM7m9
3256A27l4J09J6l2j29K08j81j02ON2M7n1q8J12k01k3J50k72J70o3Q3j71J8K20
3280b9l1q3K17k18J22K8j36K63l3j17K05j85J63m1p7j7R4p2O9j60M0J9l12K34
3304e7J46n5j3j39J2J09P4j75pj0j27K85j86J67K6j69J24K00r5n3R4r0o5kK66
3329B60k81J1O5O2K0o8q0r2O7O8j94Q1Q9k29J68j44Mm6j08J68O6oJ97J66l37J66
3355G3j4M7Q7m2M8j48K10q0Lm5o7J53p2k03P7J10k03j7p9j16M2j42O7M0OK7K26
$$ plain form
3382 -12 139 -16 88 272 189 103 117 147 166 201 117 292 183 176 83 278 270 130 127 -101 37 -157 -307 -179 -244
3407 -244 -322 -362 -239 -337 -393 -10 -25 68 209 138 284 103 184 257 218 199 111 191 106 133 17 271 203 214 152 -80
3433 -80 9 -36 -174 -426 -354 -540 -427 -433 -163 -283 -136 -40 11 259 171 442 183 -67 176 217 125 167 207 198 132
3458 132 95 209 129 216 146 166 -180 -147 -301 -272 -341 -464 -444 -337 -344 -155 -172 -44 103 194 291 309 269 257 447 106
3484 106 -30 56 174 -11 171 253 249 346 45 127 49 -65 -120 -300 -314 -274 -459 -404 -336 -355 -140 -125 -70 244 376
3509 376 203 248 320 338 270 119 193 47 106 287 181 149 202 271 170 156 -33 -27 -76 -364 -193 -363 -614 -616 -429
3534 -429 -269 -62 47 219 284 216 130 333 393 219 109 50 -57 70 33 126 96 133 182 25 110 137 52 -138
3558 -138 -210 -221 -256 -284 -345 -399 -139 -153 43 -74 91 126 274 297 193 237 233 84 121 170 -118 -51 275 128 65
$$ packed form
3382a2J51j55J04J84q3q6J4L0J9L5q4J75j09pr3J95qj40lk28J38j94j50J28o5
3407b44p8m0J23r8n6L83j5R3J41p1J46j81Q1P3l9j9q8Q0q5K7j16K54o8J1o2k32
3433h0Q9m5j38k52P2j86J13oK70j20J47R6N1K48q8K71k59k50K43M1r2M2M0ro6
3458A32l7J14q0Q7p0K0l46L3j54K9o9j23K0J07pJ89j7J28J47R1R7J8m0j2J90l41
3484A06j36Q6J18j85J82Q2mR7l01Q2p8j14n5j80j4M0j85N5O8j9K15J5N5L14J32
3509C76j73M5P2J8o8j51P4j46N9J81j06l2N3O9j01j4j89Om9k88J71j70k51kJ87
3534d29J60K07J09J72O5o8q6K03O0j74j10n9j07J27l7R3l0L7M9j57Q5K7q5j90
3558a38p2j1l5k8o1n4K60j4J96j17J65L5J48K3j04M4mj49L7M9k88O7L26j47o3
$$ plain form
3583 65 20 48 170 -2 33 -28 -23 -223 -298 -167 -340 -260 -320 -14 -30 -87 151 208 46 65 138 211 47 -101 -50 72
3609 72 -16 -62 -52 129 -97 23 273 44 76 5 -1 -290 -69 -47 -102 -105 -155 -133 42 -92 -105 33 132 106 114 192 12
3636 12 78 -66 1 -99 1 -50 -70 87 -44 -167 146 153 155 50 19 -9 12 49 153 -56 44 -290 21 -79
3660 -79 72 34 148 90 -19 -101 36 -46 87 17 58 -66 -75 55 -129 149 64 32 66 270 57 122 183 -14 73
3685 73 24 -60 -168 -97 -77 -12 162 -1 113 -21 120 7 -20 -42 -21 -224 -155 -57 -174 -147 -10 65 -23 -57 1
3710 1 48 162 104 95 -14 3 96 109 -45 -110 169 93 88 8 40 7 -141 -133 48 -75 -72 -232 -267 -104 65 17 168
3737 168 43 48 -7 -6 160 -48 -43 30 79 117 104 -101 98 83 -68 -92 -118 120 23 -96 47 0 -202 -31 -63 25
3763 25 -207 -124 -18 57 158 -28 -91 -39 28 155 170 75 137 41 80 70 8 143 92 47 -66 11 -33 33 -27 -146
$$ packed form
3583F5m5K8J22j72L5o1Nk00p5J31j73Q0o0L06j6n7K38N7j62J9P3P3j64j48N1J22
3609G2q8m6J0J81k26J20K50k29L2p1ok89K21K2n5ln0K2J75j34j3J38R9k6QP8j80
3636A2O6j44O7j00J00n1k0J57j31j23L13PKj05l1k8K1L7J04k09J00l34L11j00
3660g9J51l8J14n8j09q2J37q2J33p0M1j24rJ30j84K78q5l2L4K04k13O5O1j97Q7
3685G3m9q4j08P1K0O5J74j63J14j34J41j13k7k2K1k03O9R8j17K7J37P5q8l4N8
3710AM7J14n8rj09J7R3J3j54o5K79p6nq0L2l3j48QJ81j23Lj60l5J63J69m8J51
3737A68j25Nn5JJ66k08NP3M9L8j3k05J99j5j51k4k6K38r7j19J43m7k02J71l2Q8
3763B5k32Q3J06P5J01j86o3N2O7J27J5r5O2r6L9j0o2J35n1m5j13P7m4O6o0j19
$$ plain form
3789 -146 -253 -4 10 -53 -34 -78 36 151 -22 41 53 99 -46 -109 -77 -1 9 -95 30 67 94 15 194 97 170
3814 170 85 -162 47 -25 -206 -127 -20 25 20 89 -156 -49 -46 94 80 -72 -125 -72 -159 90 -132 16 36 -17 123
3839 123 50 81 -47 -25 131 -70 21 69 -80 27 131 -280 -204 -110 109 49 193 25 79 -57 -173 141 -50
3862 -50 -24 -116 -59 -198 -138 -20 36 82 -95 70 -7 107 5 -91 12 60 52 71 -41 77 -81 56 81 -7 3
3887 3 25 37 147 75 -85 -114 -283 -83 -157 -98 -67 36 0 59 104 134 131 100 61 176 216 -104 50 -36 65 -135
3913 -135 13 22 -3 179 9 52 82 28 -44 -97 -161 -195 -119 -79 -213 -152 -110 -44 -11 72 109 170 175 101 165 84 138 15
3941 15 -16 198 242 5 211 18 56 133 108 33 71 -47 -143 -113 -116 -272 -193 -208 -149 -79 -268 -140 -14 202 96
3966 96 225 78 87 245 46 78 188 -27 129 247 76 150 -27 97 -9 69 132 -142 -170 -168 -295 -355 -146 -331
$$ packed form
3789a46j07K49J4o3J9m4J14J15j73O3J2M6j45o3L2P6J0j04J25L7K7p9J79r7P3
3814A70q5k47K09p2j81P9J07M5nO9k45J07LJ40j4j52n3N3q7K49k22J48K0n3J40
3839A23p3L1j28K2J56k01R1M8j49J07J04m11P6R4K19o0J44j68N4j36j16L14j91
3862e0K6r2N7j39O0J18N6M6j77J65p7J14j02r6J03M8qJ9j12J18j58J37K5q8J0
3887CK2J2J10p2j60k9j69K00p4N9L1J03l6N9M5L0ll1l9J15M0l20J54q6J01k00
3913a35J48Rk5J82j70M3L0n4p2n3o4l4P6M0j34O1M2O6L3Q3L7O1Np4O4q1N4j23
3941A5l1K14M4k37K06j93L8P7k5p5L8j18r6L0lj56P9j5N9P0j89J28J26K16j06
3966I6J29j47RJ58j99L2J10k15J56J18j71P4j77J24j06P8O3k74k8Kj27o0K09j85
$$ plain form
3990 -331 -338 44 -107 -138 -30 -16 130 49 -26 243 178 93 20 29 104 39 207 123 -50 -89 57 22 12 -70 -134 -162 -280
4017 -280 -253 -233 -253 -517 -133 -80 -213 5 172 51 194 159 127 -81 325 148 246 143 128 151 -1 -58 107
4040 107 -7 -1 63 -65 19 -250 -58 -20 -109 -222 -282 -101 -68 -88 -148 -10 182 83 148 171 151 65 247 214 101
4065 101 -28 86 -16 53 -19 171 66 61 59 -107 3 -118 72 -71 -160 -39 -194 -114 44 -300 -155 -141 -62
4088 -62 30 65 134 41 82 -8 124 7 183 85 -6 47 -6 126 128 22 49 -3 107 -115 -133 14 -162 -112 -89 -36
4114 -36 -73 -221 5 46 -237 167 -45 -11 -33 -53 94 134 101 -16 6 -57 37 133 155 105 -46 11 113 97 19 28
4140 28 83 -62 -80 -44 -28 -76 17 -125 -277 -11 -150 -80 -20 -18 71 84 69 -81 -8 35 135 25 -39 84 84 8 273
4167 273 51 79 82 54 114 227 -33 -108 -92 -65 -103 -121 -227 -86 -131 -78 -73 -7 16 -54 31 -9 89 69 -86 171 49
$$ packed form
3990c31pL82j51l1J08J4J46q1p5K69o5q5p3RP5o5J68q4j73l9J46l5j0q2o4k8j18
4017b80K7K0k0k64L84N3j33K18J67j21J43l5l2k08M06j77R8j03j5K3j52n7J65
4040A07j14OO4j28Q4k69J92L8q9j13o0J81L3k0o0J38J92r9O5K3k0q6J82l3j13
4065A01j29J14j02O9p2J90j05nkj66J10j21J90j43q9J21j55Q0J58l44J45J4P9
4088f2R2L5O9r3M1r0J32j17J76r8r1N3n3J32Kj06K7n2J10k22j8J47j76N0K3N3
4114c6l7j48K26M1k83M04k12L4k2k0J47M0l3j17K2o3R4R6K2n0j51N7J02j6p8R
4140B8N5j45j8L6J6m8R3j42j52K66j39P0O0KQ9J3j5j50P3M3J00j10o4J23%p6K65
4167B73k22K8Lk8O0J13k60p5J6K7l8j8j06J41m5N3NO6K3p0Q5m0R8k0j55K57j22
$$ plain form
4194 49 117 42 -47 119 136 5 34 72 239 54 -23 -68 -167 -91 -121 -166 -359 -58 -184 -138 -259 -44 -69 8 47 85
4220 85 19 -89 92 46 87 82 112 56 243 112 164 156 48 103 112 -57 92 -176 66 -140 -224 -54 -150 -27 -225
4245 -225 -88 -77 44 -159 -19 -60 76 -137 -30 159 158 -29 174 96 196 124 171 160 206 108 -13 79 -14 -120
4269 -120 -191 19 -20 -224 -242 -129 -81 -105 -39 -166 -150 -235 -37 -133 75 14 40 -14 16 78 87 89 66 154 -21 119 58
4296 58 120 199 47 -184 75 -179 -113 -191 -90 -96 -142 -184 -104 -40 -28 100 -141 115 -30 -150 67 82 61 66 103 64
4322 64 205 93 132 37 60 -115 -44 23 208 -33 -69 -7 -187 -273 -234 -3 -132 -12 -99 -159 56 -89 14 -92
4346 -92 147 -50 -214 -92 12 112 39 14 67 -77 59 4 -22 1 102 119 -13 6 -52 -38 -181 -25 -122 -27
4370 -27 92 34 -64 -99 -12 -112 1 -93 -64 -59 -169 139 -29 -116 95 68 54 92 161 -15 -63 -26 -38 43 -73 -30
$$ packed form
4194D9O8p5q9J66J7j31K9L8J67j85p7m5r9P6l0m5j93L01j26M6j21K15k5P7L9L8
4220H5o6j08J81m6M1nL0n6J87j31N2qj08N5Rj69J49k68K42k06q4J70r6J23j98
4245b25J37J1J21k03J40m1J36k13J07J89jj87K03p8J00p2M7j1M6r8j21R2r3j06
4269a20p1K10l9k04j8J13M8k4O6j27J6q5J98r6K08o1K6n4L0O2RKk3Q8j75J40o1
4296E8O2P9j52k31K59k54O6p8J01om6m2Q0O4J2J28k41K56j45j20K17J5k1NL7l9
4322F4J41j12L9r5K3j75P1O7J85k41l6O2j80q6L9K31j29J20q7o0K15j45J03j06
4346i2K39j97j64J22J04J00p3k5N3j44J36n5k6K3J01J7j32J9n8J4j43J56r7R5
4370b7J19n8r8l5Q7j00J13r4K9Nj10L08j68q7K11k7j4L8O9j76m8L7j2Q1j16M3
$$ plain form
4396 -30 -6 69 -220 65 -315 17 36 126 -83 -1 -120 -116 -74 17 -65 -69 86 -14 -173 -7 -21 148 128 -196 8
4421 8 -19 32 80 44 61 -9 26 4 107 -84 -117 2 -103 -77 -100 -20 -129 -252 -156 -34 -11 -64 48 38 -3 -103
4447 -103 -32 -20 -18 -16 130 -7 105 -63 -50 222 52 7 22 49 -25 -52 -85 -48 -172 42 -91 -169 -37 -66 -21 -123
4473 -123 -10 -86 -95 96 76 52 -106 -31 52 270 104 75 -86 64 43 67 -36 72 33 -50 118 -32 -19 -80 -151
4498 -151 133 17 -66 -108 -203 -11 90 67 -113 -121 -2 1 141 32 57 -63 -40 -155 119 3 115 85 106 -14
4522 -14 -36 50 94 -75 -136 -135 -238 60 40 -91 -53 -166 -114 -5 85 -86 -95 -90 -96 137 228 38 132 69 140 114 61 97
4550 97 122 29 20 41 -28 9 -32 -148 83 -24 -94 -152 117 -119 -53 -24 -19 74 -96 91 4 9 33 78 71 65 125 47 -155
4579 -155 180 113 140 122 -14 24 2 62 -66 -81 -211 -175 -58 -129 -24 -45 -202 -144 -200 44 0 25 -140 -162 31
$$ packed form
4396c0K4P5k89K85l80L32J9R0k09Q2j19MM2R1q2mJ55j00j59J66j4J69k0l24K04
4421Hk7N1M8l6J7p0L5k2J03j91l3J19j05K6k3Q0j09j23R6J22K3n3J12j0m1j00
4447a03P1J2KKJ46j37J12j68J3K72j70m5J5K7p4k7l3L7j24K14j33p8J32k9M5j02
4473a23J13p6rJ91k0k4j58P5Q3K18j66k9j61J50k1K4j03J08l9q3J68j50J3o1p1
4498a51K84j16q3m2r5J92J01k3j80qJ19LJ40j09K5j20K3j15K74j16J12l0K1j20
4522a4k2Q6M4j69o1Jj03K98k0j31L8j13N2J09R0j71rNoK33R1j90R4o3P1k6n3L6
4550I7K5r3rK1o9L7m1j16K31j07p0n8K69k36O6K9NR3j70J87q7NK4M5poO0p8k02
4579a55L35o7K7j8j36L8k2O0j28j5j30L6J17p1J05k1j57N8n6K44m4K5j65k2J93
$$ plain form
4604 31 -95 -163 237 148 144 151 -31 40 216 43 -167 102 -67 165 -7 -111 11 -118 135 131 -47 -45 -61 100
4628 100 -36 -14 -29 -63 -22 -30 59 -67 -67 1 15 87 -71 -43 21 56 -33 96 49 47 -9 96 -73 -29 -47 -20 -15 -20 64
4657 64 -67 9 -37 -9 -74 -188 -4 -106 -156 -211 -86 -132 -48 -15 121 58 -38 1 -29 69 73 -12 113 -6 -27 64 15
4684 15 57 63 -133 18 51 299 213 -62 94 -99 117 -116 -125 122 -3 -233 97 -21 -122 213 -42 -48 207
4707 207 46 74 -66 31 -80 82 42 -79 18 70 72 76 150 102 24 18 64 -26 8 -61 -77 -296 -174 -132 -201 -89 -37
4734 -37 -120 179 37 211 122 -69 146 112 -40 99 166 59 1 147 179 51 14 -37 68 182 -38 -44 -60 -168
4758 -168 -201 112 -182 -174 -42 -180 -94 76 44 -99 4 -5 35 -16 13 107 100 97 4 171 185 -3 256 98 -44 219
4784 219 -69 78 -179 -151 -55 -61 -114 -119 -211 -147 -34 2 -102 -151 -103 -24 -25 93 107 -4 -7 8 182 141 168 62 -56
$$ packed form
4604C1j26o8M00q9mPj82P1J76j73k10K69j69K32j72j04J22j29K53mj78Kj6J61
4628A00j36K2j5l4M1qQ9j26%O8J4P2j58K8O4L5q9J29m7kn6J05j69M4j8K7NnQ4
4657F4j31P6m6K8o5j14J84j02n0n5J25m6Q4L3J36o3r6L9l0R8Mq5J25j19k1R1m9
4684A5M2Oj96J51L3K48q6k75J56j93K16k33rK47j25k30L30j18j01L35k55oK55
4707B07j61K8j40R7j11J62m0j21R7N2KMP4m8p8oM6r0L4o9j6k19J22M2o9J12N2
4734c7q3K99j42J74q9j91K15l4j52J39O7j07n8J46L2j28l7n1J05J14k20oj6j08
4758a68l3L13k94QJ32j38Q6J70l2j43J03rM0n1K9R4plr3J67J4j88K59j58j42K63
4784B19k88J47k57K8R6on3nr2O4J13L6j04m9M8P9jJ18J4j11lJ5J74m1K7j06j18
$$ plain form
4811 -56 196 -20 164 52 177 103 -38 -18 -107 -53 -73 -129 -61 -46 -244 -146 20 -120 2 9 -44 19 61 -51 -22
4836 -22 41 115 163 165 111 220 92 113 128 60 -39 119 7 -67 -133 -39 -251 -81 -171 -210 -160 40 5 -106 -51 51
4862 51 -155 6 18 26 110 163 76 132 78 44 105 96 177 -55 -26 -9 131 18 -171 -30 53 -78 -147 -19 -52 -100 73
4889 73 -23 -195 36 -137 -131 -112 46 -111 23 87 -123 -15 290 114 -10 324 -80 -32 60 77 57 0 -26 -13
4913 -13 128 1 -83 -71 -193 -61 -172 -101 -22 -71 -102 -4 -153 83 -36 191 -54 -12 164 47 106 81 47 2
4937 2 77 8 92 279 36 61 98 82 52 -123 47 25 -59 -159 -160 -94 -149 -251 -87 -220 20 -14 -184 -12 63 15
4963 15 124 99 146 167 13 99 26 110 1 103 131 234 -24 55 5 163 -105 -26 13 -87 -195 -100 -214 -96
4987 -96 -111 13 -40 -131 -50 1 -60 219 127 108 90 202 -73 -10 -92 34 -12 81 0 -92 217 -55 121 -4 -175
$$ packed form
4811e6K52k16J84j12J25p4j41K0q9N4k0n6O8J5j98R8J66j40J22Pn3O3M2j12K9
4836b2O3P4M8Kn4J09j28K1J5o8r9J58j12p4o6R4k12J70r0l9N0K00l5j11N5J02
4862E1k06J61J2QQ4N3q7N6n4l4O1rQ1k32K9J7J40j13j89J41Q3j31o9J28l3m8J73
4889G3r6j72K31j73OJ9J58j57J34O4k10J08L05j76j24L34m04M8R2J7k0n7k6J3
4913a3J41j27q4J2j22J32j11P1P9m9l1R8j49K36j19K27k45M2J76j17N9k5l4m5
4937BP5o9Q4J87k43K5L7j6l0j75J70k2q4j00jO6n5j02J64j33K40l4j70J72P5m8
4963A5J09k5M7K1j54Q6p3Q4j09J02K8J03k58P9n0J58k68P9L9j00j08R5j14J18
4987i6j5J24n3r1Q1N1o1K79r2j9j8J12k75O3q2J26m6R3q1r2L09k72J76j25j71
$$ plain form
5012 -175 -209 -130 -190 -30 -300 -139 -171 -209 -118 -122 -6 115 127 142 55 50 86 117 137 118 187 169 24 166 56 186
5038 186 136 39 201 -92 32 -37 -236 -246 14 -225 -143 43 -90 -75 39 -36 -16 188 53 -7 44 -120 109
5061 109 107 121 126 -48 266 182 216 141 105 186 48 120 119 39 -188 -175 -259 -198 65 38 -84 -193 64 13 5 14 -5 104
5089 104 -102 -39 40 158 -9 49 -26 68 190 102 143 8 -56 149 -37 48 -6 -35 -80 -345 -216 -112 -116 -62 -74
5114 -74 68 -195 -97 -51 -29 -33 71 -33 42 43 -38 31 -3 179 225 48 94 40 124 30 123 -26 -5 57 -195 -84 -92
5141 -92 39 -49 -81 -64 -191 -117 -53 13 96 108 -82 38 87 27 159 5 251 -16 2 -28 250 16 165 56
5165 56 47 202 -1 -84 24 -6 73 -217 35 85 -35 31 99 6 -113 50 42 -38 26 39 22 54 85 40 201 103 142
5192 142 142 109 28 26 0 89 37 44 -19 -8 83 59 91 64 129 81 -7 35 -24 -191 156 -82 -184 -167 -76 -154 -75 158 77
$$ packed form
5012a75l4P9o0J60k70J61l2l8R1mJ16J21J2J5q7nL6L1K0j9O9j8j45J42j10J30
5038A86n0r7J62k93J24o9j99j0K60k39Q2J86j33J5J14p5K0K04j35o0N1j64K29
5061A09kJ4Nj74L14q4L4p5l6Q1j38P2jq0k27J3q4O1K63k7j22j09K57n1qRj9J09
5089A04k06O3P9J18j67N8p5R4J22q8M1j35o4K05j86Q5n4k9m5k65J29J04mN4j2
5114g4J42k63R8M6K2mJ04j04P5Jq1O9l4J82M6j77M6n4Q4r4R3j49K1O2k52J11q
5141i2J31q8l2J7j27P4O4O6Q3J2j90J20M9o0J32j54K46k67J8l0K78k34J49j09
5165E6rJ55k03q3J08l0P9k90K52N0j20O6O8r3j19J63qq0O4J3j7L2L1m5J61r8L9
5192A42%l3q1kk6Q9n2Po3J1R1k4L2k7O5m8q8M2n9j67L47k38j02J7R1p8P9K33q1
$$ plain form
5221 77 21 33 -63 93 144 81 22 149 48 89 64 -23 87 16 -114 -139 -190 174 -157 -40 110 -223 -182 51 -50
5246 -50 -187 -9 -40 -91 -18 -7 12 72 115 178 6 218 58 38 92 4 -27 120 -20 36 9 11 -66 -121 -71 33 138
5273 138 -24 -166 -50 -35 -93 -70 -83 -30 -104 -165 83 15 34 -50 102 108 207 1 2 -12 168 27 51 127 105 -91
5299 -91 101 12 -72 -143 -90 -64 -26 17 -249 -27 -9 -46 -2 -26 -113 113 43 -7 100 219 100 13 189 97 75 -43
5325 -43 100 108 131 -109 -103 -50 -25 -31 -71 29 -228 -58 -147 -76 -125 -25 -220 -70 146 -31 1 -23 144 -69 80
5350 80 82 64 47 66 -2 42 -25 -109 -17 30 -20 11 -123 -63 93 -41 68 -139 16 -117 16 -115 5 -90 51
5375 51 -52 74 67 49 -146 74 96 203 169 160 155 61 45 139 73 -88 -38 7 -30 -187 158 -43 -72 -130 81 6 -138
5402 -138 -53 -23 43 29 -32 -59 -4 37 -50 -17 15 37 139 82 80 -21 88 41 97 154 -8 3 -118 -137 78 7 17
$$ packed form
5221G7n6J2r6J56N1o3n9J27j01M1k5q7J10p1j30k5n1L64l31J17J50l33M1K33j01
5246e0j37J78l1n1P3J1J9O0M3O3j72K12j60k0N4q8l1J47j40N6k7Kp7n5N0J04J05
5273A38j62j42J16J5n8K3j3N3p4o1K48o8J9q4J52OR9k06Jj4J80j41K4P6k2j96
5299i1J92q9q4p1N3K6L8M3k66K22J8l7M4k4q7K26p0n0J07J19j19q7J76r2k2j18
5325d3J43QK3k40ON3K5om0J00k57J70q9P1m9J00j95J50K16j77L2k4J67k13J49
5350H0Kj8j7J9o8M4o7q4R2M7n0L1j34O0J56j34J09k07J55j33J33j31J20r5J41
5375E1j03J26pj8j95K20K2J07l4rnr4j6R4o6j61N0M5l7j57L45k01k9n8K11p5j44
5402a38Q5L0O6j4o1k7N5M1q7L3L2K2J02n7kj01J09m7N6N7j62J1j21j9K15p1J0
$$ plain form
5429 17 22 39 -63 118 -48 24 -103 -92 109 -99 -145 119 51 11 -40 -13 -19 92 -18 45 -34 229 200 54 -89
5454 -89 -38 98 69 30 253 -98 22 -1 32 -59 -163 -80 1 -18 -198 27 -10 -86 141 -125 -41 221 -6 171
5478 171 71 39 9 64 1 -160 35 153 -64 90 -21 97 72 25 8 -120 110 -56 71 -101 -187 86 -52
5501 -52 -186 -104 -139 51 -27 -64 -19 36 -23 113 142 235 7 38 8 23 33 -18 43 198 131 -8 16 59 -45 64
5527 64 -48 -109 -37 -75 -252 -85 -11 -128 -18 -46 108 106 85 32 59 -37 16 -68 6 -177 74 -73 236 93 114
5552 114 17 119 -56 -23 49 -127 51 -78 -139 -229 -110 -12 96 -102 36 3 -6 117 -62 -58 38 83 -48 142
5576 142 142 123 282 0 64 36 98 -21 -120 49 -62 -23 86 74 -43 33 -129 -81 -31 21 -60 -168 -121 47 -61
5601 -61 5 -107 -51 113 35 203 143 62 121 -20 154 -21 -6 248 41 32 40 8 -34 -26 39 -78 -105 -56 10 -60 -120
$$ packed form
5429A7NJ7j02J81j66P2j27J1K01k08m6K64o8m0n1K7oJ11j10O3p9K63k9j46j43
5454h9N1J36k9l9K23l51J20k3L3r1j04Q3Q1j9j80K25l7p6K27k66Q4K62k27J77
5478A71j00l2l0N5o3j61J95J18k17J54j11J18k5m7j7j28K30j66J27j72q6K73j38
5501e2j34Q2l5J90p8l7M5N5n9J36K9R3k28L1l0J5J0n1O1J55o7j39K4M3j04J09
5527F4j12o1P2l8j77J67P4j17J10k8J54kk1n3K7r6N3q4P4j83K51j47L09j43K1
5552A14r7J02j75L3P2j76J78j29o1r0J19R8J08j98J38l3rJ23j79MR6M5j31J90
5576A42%j9J59k82O4k8O2j19r9J69j11L9J09j2j17P6j62M8N0N2q1j08M7J68j08
5601f1O6j12N6J64p8J68o0q1N9j41J74j75J5K54k07rQl2m2QO5j17k7M9O6p0o0
$$ plain form
5628 -120 -48 9 -103 -74 -24 124 52 -109 80 67 43 142 34 34 -18 77 45 122 191 1 -74 131 190 -109 -123 -123 38
5655 38 96 -78 -7 -60 -240 -18 118 -203 -173 86 -61 105 -64 -6 39 64 -68 -35 57 -90 199 14 -44 73
5679 73 59 -36 133 -46 0 12 27 -121 -101 -70 -81 16 -131 -13 -106 -21 -124 -82 42 -135 122 142 -57 -59 -75 -44
5705 -44 15 109 94 71 73 5 40 93 -6 -58 -193 200 -2 -48 -215 89 -194 47 -38 -109 -123 -304 67 -187 26
5730 26 -51 54 78 82 19 9 113 75 93 61 61 -19 172 117 105 181 -46 39 87 19 -126 -115 -46 -114 -58 -90 -5 -75 -66
5759 -66 -113 -117 -125 -91 -273 45 19 -31 89 -105 -33 194 105 -91 88 46 49 16 199 12 -91 -12 -3 -16 33 -99 -103
5786 -103 -117 32 -225 -192 -120 -139 -233 55 138 -44 132 -33 -72 -191 -87 -7 -90 -13 131 -70 246 99 41 200
5810 200 77 46 -80 -74 -3 -64 19 -194 -278 67 -73 62 -19 1 119 -86 -52 102 -37 24 42 -236 24 158
$$ packed form
5628a20P2N7j12K9N0J48p2j61J89j3k4R9j08%n2R5l2P7O9j90p5K05N9k99j4%J61
5655C8N8j74P1n3j80K22J36l21L0K59j47J66j69N8M5K5j32L3R2j47K89j85n8J17
5679G3j4r5J69j79M6J2J5j48K0L1j1R7j47J18r3Q5j03M2J24j77K57K0j99kj6L1
5705d4N9R4j5k3Ko8L5N3r9n2j35L93k02m6j67L04k83K41q5p1j4j81L71k54K13
5730B6p7J05K4Mo3j0J04l8J8l2%q0J91n5j2P6k27Q5M8o8j45J1O9o8N6l2Q5p0R
5759f6m7mqL4j82L18k6n0J20j94P2K27q9j96J79m2Ll3J83j87j03P9Rj3M9j32m
5786a03j4J49k57L3P2j9r4K88Q3j82J76j65l9j19J04Q0q3P7J44k01L16j47n8J59
5810B00j23l1j26OP1o1Q3k13q4L45j40J35q1K0J18k05L4J54j39O1J8k78K60J34
$$ plain form
5834 158 -6 36 -3 123 -11 190 62 98 81 -112 -46 -47 -154 45 -249 -227 -31 -57 41 -126 -26 -235 12
5857 12 4 -17 -3 75 72 134 -8 54 144 81 140 88 -85 275 69 141 70 -19 22 -115 -53 -183 -138 -121 19 -86 -122
5884 -122 -200 15 -41 -14 -159 -16 36 11 -33 134 -32 123 244 -1 7 -48 226 174 160 -39 109 73 82 7 64
5909 64 -129 -61 5 -242 90 -59 -71 -176 -172 -85 3 -83 -20 22 17 -4 12 -75 122 3 -6 -33 109 -13 280 -18
5935 -18 166 11 -68 -67 54 -89 -9 -172 -103 -173 -103 90 31 163 -88 -24 -37 -10 -77 47 -17 -18 -21 17 13 109 13 -99
5963 -99 -35 -24 96 -10 49 71 97 94 89 153 -51 -28 2 -142 -141 40 72 152 -140 -106 -154 -9 -4 15 57 -7 226 106
5991 106 114 78 29 112 -6 -65 101 22 107 121 64 -93 -42 163 -17 -82 30 -54 152 -9 -40 -10 -153 -30 -179
6016 -179 36 -72 -146 43 -92 -102 -17 99 5 158 0 4 87 15 -17 65 -8 138 -32 -68 88 -101 -141 9
$$ packed form
5834A58j64M2l9J26j34K01j28L6j7j93O6jj07J99k94K2J96k6R8j67J00k09K47
5857A2qk1J4P8lO2j42O2R0o3N9n2j73L60k06P2p1q9M1j37O2j30M5J7J40j05l6
5884a22p8K15n6K7j45J43N2k5m4J67j66J55J21k45Qn5K74n2j4j99J48l6Rp5N7
5909F4j93O8O6k47L32j49j2j05MQ7Q8q6O3M2nk1J6q7J97j19rk7J42j22K93k98
5935a8J84j55p9JJ21j43Q0j63O9p0P0J93n9J32k51O4j3K7o7J24o4jlL8mR6r6j12
5963i9O4J1J20j06N9K2K6lnO4k04K3L0j44JJ81L2Q0k92L4m8J45NJ9M2o4K33j20
5991A06Ql6m9Q3j18n9J66p9Q5J4n7j57N1K05j80o5J12q4K06j61l1L0j43J23j49
6016a79K15j08p4J89j35j0Q5J16r4J53j58MQ3p2l2Q2p3J46j70l6J56j89m0J50
$$ plain form
6040 9 91 -26 -117 -49 127 -109 -107 -52 -12 -158 0 -16 22 15 -21 -11 19 95 -68 78 -15 -19 -69 -30 15 82 21 64 -105
6069 -105 147 39 9 99 -106 56 -58 29 -13 20 -49 -12 -26 104 64 114 134 223 104 89 62 188 113 96 -28
6094 -28 -15 37 -36 -16 69 59 -131 27 -69 -36 63 1 -121 -79 25 -229 -57 105 36 15 176 54 2 55 -99
6119 -99 15 28 -7 121 -13 174 202 185 84 21 82 -101 51 146 35 -113 -33 -68 41 23 24 97 -22 -79 -8
6144 -8 -59 23 90 117 -16 169 97 -71 35 78 40 53 -37 62 93 -78 -72 65 -36 -30 -195 27 -130 -162 25 -4
6170 -4 -58 -211 -88 -9 -40 -101 -8 -31 74 -26 6 -28 -5 -53 62 138 -4 57 3 -74 76 73 27 16 147 -162 44
6197 44 7 -89 -52 48 -65 61 62 68 -152 -60 21 22 -128 -84 -50 -175 -44 52 -127 120 90 29 65 -64 18 -37 -34
6224 -34 -69 -84 174 34 -133 -34 -13 -153 50 -21 57 133 37 -52 -193 67 -140 31 -107 79 -78 -69 -13 -50 -32
$$ packed form
6040IQ2j17r1O8J76k36KN5M0j46J58j6L8pl6J0L0P6j63J46r3mn0L9M5O7o1M3j69
6069a05K52j08l0R0k05J62j14Q7m2L3o9L7j4J30m0N0K0Q9j19j5k7J26p5j7j24
6094b8J3N2p3K0Q5j0j90J58r6L3R9o2j22M2J04k54J72J62o9k1J61j22n2N3j54
6119i9J14J3l5J28j34J87K8j7j01o3O1j83J52R5j11j48Q0l5J09j8JP3j19n7P1
6144hn1Q2O7K7j33J85p2j68J06M3l8J3r0R9L1j71OJ37j01Oj65K22j57l2J87k9
6170dn4j53J23P9l1o1R3k3J05j00L2l4K3m8J15P6j42O1n4p7J50lm6j1J31l09K06
6197D4l7r6L7J00j13J26JOk20R2Q1Jj50M4L4j25J31R6j79K47l0o1L6j29Q2n5L
6224c4l5j5K58j40j67R9K1j40K03p1P8P6r6q9j41K60k07J71j38J86j57RN6l7J8
$$ plain form
6249 -32 198 -147 56 126 -93 86 -17 6 88 -27 36 152 -56 85 -28 100 17 70 126 78 -12 27 -58 -94
6273 -94 -48 161 -43 65 -12 -31 -3 -77 120 -23 104 35 36 -44 16 -15 17 54 -29 64 -12 -16 -60 -135 77 74 114 161
6301 161 0 113 -114 30 -89 -100 -119 -147 -167 -60 -106 121 -92 12 5 -99 115 11 95 33 -33 -121 -41 62
6325 62 -74 86 16 44 117 20 -170 -71 -59 -41 -29 -64 3 -24 -225 6 48 -44 156 107 80 6 47 72 119 -26 -63
6352 -63 90 107 6 118 8 -90 150 53 -107 26 -57 -84 -123 -81 23 7 -105 52 -114 -35 12 94 -73 14
6376 14 -42 -70 -37 139 45 15 83 -117 -79 -125 -67 -56 151 49 -64 17 33 136 -21 -118 -42 -100 -102 -52 -87 30 -48
6403 -48 -43 48 -121 137 -33 -14 -11 138 -33 -8 28 87 -33 158 36 -144 53 128 -2 -31 -4 70 84 -54 -168
6428 -168 73 74 -52 -41 46 -40 -26 151 -43 -48 89 -192 110 -21 -169 61 106 52 208 -16 35 16 -2 150
$$ packed form
6249c2K30l45K03P0k19J79j03K3Q2j15O3J16k08J41j13J28q3N3N6m8r0L9q5l6
6273i4M6K09k04J08p7j9K8p4J97j43J27o9Jq0O0l1L2L7q3R3p6mm4p5K12lM0M7
6301A61j61J13k27J44j19j1j9k8k0J07m6K27k13J04pj04K14j04Q4o2o6q8Q0J03
6325F2j36J60p0K8P3r7j90R9J2J8J2l5O7k7k01K31M2r2K00m9k7p4M1K5M7j45l7
6352f3J53J7j01J12j10r8K40r7j60J33q3k7l9M2J04j6j12J57j66P9M7Q2j67Q7
6376A4n6k8L3J76r4l0O8k00L8m6N8J1K07j02j13Q1J6J03j57r7P6n8kN0l5J17p8
6403d8NR1j69K58j70J9LJ49j71K5L6N9j20J91j22j80J97P5j30k9K7P4J4j38j14
6428a68K41Jj26J1Q7q6J4J77j94nJ37k81L02j31j48K30M5n4J56k24N1j9j8J52
$$ plain form
6452 150 -24 -33 10 233 -71 -80 36 122 -23 -35 -2 19 -88 -186 -140 59 -248 -25 50 71 -47 -6 -170 -84 75
6477 75 124 120 136 80 160 9 128 87 38 -127 -124 44 -6 70 -73 146 98 -170 -106 -79 -50 93 60 26 96 -72 3
6504 3 71 -82 -127 -24 72 78 -31 117 71 42 17 6 158 62 63 -133 -11 41 -128 118 22 57 154 -123 -74 -69 -63 -214
6532 -214 96 -83 7 73 -42 10 49 -98 26 12 -127 108 118 146 146 137 -88 20 -108 -36 18 -122 -6 1 -100
6557 -100 61 103 -68 86 -32 -117 -95 -147 62 -30 -114 -128 34 -1 -31 -71 -23 207 -54 85 99 112 74 47 28
6582 28 93 152 70 -239 -215 -41 27 36 -15 11 -128 16 -245 -99 23 -132 38 33 75 -76 75 -86 -62 -59 130
6607 130 29 105 142 47 8 -44 74 219 -100 -39 -12 -33 -16 62 -5 65 -63 121 -14 -77 -26 30 77 -69 -62 -80
6633 -80 -1 56 0 -10 80 -54 12 -4 -34 -8 65 4 110 -56 -31 72 -33 -15 -38 -88 -103 128 -61 -53 -32 -70 -51
$$ packed form
6452A50j74rM3K23l04rJ16Q6j45j2L3K1j07r8M6J99l07K23P5K1j18M1j64Q6J59
6477G5M9mJ6n6Q0j51J19m1m9j65LJ68n0P6j43K19m8k68O4K7K9J43l3l4P0j68P5
6504CO8j53m5J03R6Oj09J48m6k9k5j1J52r6Jj96J22N2j69K46r6L5R7k77M9NOj51
6532b14L10j79R0O6j15N2L9j47J24j4j39K35J0K8%rk25J08j28P2N4j40J16Pj01
6557a00J61M2j71J54j18q5K2n2K09r2q4j4J62l5l0m0M8K30k61J39J4J3l8k7j9
6582B8O5N9q2l09K4J74O8Rn1K6j39J44k61J46J22j55J70nM2j51J51j61K4LJ89
6607A30j01P6L7r5l9n2J18J45l19O1K7k1J7P8o7P0j28J84j35o3N1N6M7j46Pj8
6633h0P9N7n6j0R0j34O6j6l0K6P3o1J06j66K5J03j05J8k3n0j5K31j89QK1l8J9
$$ plain form
6660 -51 -138 141 -216 38 -123 34 72 149 225 29 73 34 -107 83 140 82 88 52 -225 54 -5 -153 115 -68
6684 -68 -52 -194 -32 -114 -59 118 -96 -126 -147 -234 9 -25 89 36 -64 -21 -44 23 -61 28 23 30 -12 24 59 131 -123
6711 -123 -110 -44 1 -57 -172 -89 -47 -53 -66 -6 64 66 17 -12 35 -92 -140 -27 -36 84 -78 -18 109 -26 80 -111 30
6738 30 -46 -7 24 175 -96 58 20 -52 -36 3 -1 -121 -143 25 -168 -42 -192 -34 -159 137 -105 -145 -15 -31
6762 -31 99 0 -7 -53 73 -96 -60 -81 -23 0 56 8 69 23 80 -47 -1 -174 56 23 142 46 72 -109 -7 -95
6788 -95 -12 23 -67 -24 -26 58 39 -91 4 110 -44 6 78 205 -38 -17 49 38 -41 -52 -102 -94 -36 5 -30 -11 -94 -96 -185
6817 -185 -115 34 -46 -16 35 49 168 -42 109 -90 30 0 64 5 78 -67 20 61 -14 15 98 -84 -15 -23 45 -108
6843 -108 -60 66 -60 136 -131 73 86 7 -23 -115 -64 -33 -3 -56 -93 -102 -132 -57 -45 7 -98 113 -47 -16 117 106
$$ packed form
6660e1q7K79l57K54j61J57L8P7P6j96M4l9j41J90N7n8Ol6k77K79n9j48K68j83
6684f8J6j42J62q2N5J77k14l0k1q7K43l4J14n3j00M3k3O7q4Q9nPm2L6L5P2k54
6711a23J3O6M5n8j15Q3M2oj3O0P0Km9k9M7j27m8J13rJ20j62O0J27j35J06j91J41
6738C0p6L9L1J51k71J54l8p2J6L9mj20k2J68j93J26j50J58j25K96k42m0J30j6
6762c1J30r9pm6J26j69L6k1N8K3N6m8O1m6N7j27M6j73K30l3J19r6K6j81J02q8
6788i5Q3L5r0M3kQ4j9j30R5J06j54N0P2J27k43K1O6j1p9j1n0QN8M1l5J9q3kq9
6817a85P0J49q0L0N1J4J19k10J51j99J20l0O4n9P3j45Q7M1p5K9Q3j82O9qO8j53
6843a08M8J26j26J96k67K04J3p9l0r2N1L1L0n3l7rl0P5J2N2j05K11j60L1J33j1
$$ plain form
6869 106 -16 54 -47 -83 85 -33 -43 -115 -49 -124 -210 13 -20 57 104 -59 24 60 48 29 5 -27 65 -7 -135 -141 -67
6896 -67 66 -165 57 -61 130 -17 -67 167 -10 -160 -209 25 -62 -34 -17 -161 59 147 -87 36 -82 -92 113
6919 113 28 -13 -24 -68 52 127 -11 125 -154 57 -134 -111 42 -11 -118 86 25 -110 17 -54 -52 -107 9 -25
6943 -25 -46 13 -47 -92 -100 62 51 -136 -95 -43 -116 86 -45 -40 27 -33 95 85 25 31 -173 29 -85 22 53 -117 97
6970 97 32 118 103 204 -3 -61 2 -89 -39 1 56 82 -28 -62 -28 -140 10 -7 86 135 67 69 53 54 66 -20 -15 -35 13
6999 13 -60 -12 -54 -69 17 -94 100 6 136 35 94 -64 -116 127 48 125 84 -27 104 160 192 -103 -40 12 131
7024 131 -38 -136 20 26 -111 63 93 -48 -51 49 13 -132 110 -31 47 95 21 -1 31 -81 -82 -98 -170 -49 -80 66
7050 66 43 107 56 -119 23 -130 44 81 156 -86 133 111 -5 29 -46 50 52 -11 78 -33 -180 -85 -52 -127 27 -203
$$ packed form
6869A06j22P0j01l6J68j18j0p2O6p5q6K23l3P7M7j63Q3L6j2j9k4l2R2p2j28oP4
6896f7J33k31K22j18J91j47n0K34j77j50m9K34q7K8J7j44K20Q8k34J23j18j0K05
6919A13q5m1j1m4J20P5j38J36k79K11j91K3J53n3j07K04o1j35J27p1Kn5J16l4
6943b5k1N9o0m5qJ62j1j87M1N2p3K02j31NO7o0J28j0o0Ok04K02j14J07L1j70K14
6970I7o5Q6j5J01k07n8O3r1N0M0N5K6j10l4L4j12J50j7R3M9o8Kj6JJ2q6Nk0M8
6999A3p3M8m2j5Q6j11J94r4J30j01N9j58n2K43p9P7m1j11J31N6L2k95O3N2J19
7024A31j69r8J56Oj37J74L0j41lJ00l6j45K42j41P8M8p4k2L2j12jj6p2J21l1J46
7050F6k3O4n1j75J42j53J74L7P5k42K19k2j16L4p5R6Ko3Q9j11j47R5L3p5J54k30
$$ plain form
7076 -203 102 98 -173 15 -106 -28 -86 -40 -6 219 58 60 37 81 149 -70 86 32 34 78 -45 181 317 -21 211
7101 211 -15 74 -65 17 37 -186 189 -51 2 69 95 33 -44 -91 21 -111 109 43 -134 99 -162 -8 71 -33
7125 -33 -150 77 153 26 205 49 -122 28 48 26 52 72 -52 -154 52 51 -10 -67 -71 -4 -151 -48 -14 -50 -132
7150 -132 35 88 4 32 -73 93 -40 126 60 -99 4 -27 -42 -132 -16 -111 51 21 -172 39 -183 33 -6
7173 -6 46 38 -68 108 4 35 8 -30 50 246 8 -94 35 109 194 18 -89 -3 6 14 -257 31 -42 116 96 27
7199 27 -128 55 60 -64 18 -168 -133 -64 -139 -127 148 -60 1 15 -42 -17 -60 15 33 28 -86 48 46 45 -17 197 -67
7226 -67 36 -30 -21 -61 43 84 -7 -13 -4 -118 -112 62 58 -102 -124 -27 -165 -92 17 -16 109 -148 6 87 38 89 46 66
7254 66 143 -9 -150 135 -3 18 20 87 79 -48 -196 153 146 206 118 -91 33 -138 3 -113 39 96 -114 37
$$ packed form
7076b03L05mk71J88j21P8n8M6L4K25j61Kk3M4O8k19J56n4KM4j23K26J36l38K32
7101B11k26Q9j39Q2K0k23L75k40N3O7K6o2p7m7J12j32K20o6j77K33k61J54P9j04
7125c3j17K27P6j27J79j56j71J50K0k2K6K0j24j02K06jo1n7mO7j47J03L4l6q2
7150a32J67N3q4K8j05J66j33J66o6j59J03l1j5r0J16r5J62l0j93K11k22K16l9
7173fN2qj06J76j04L1k7l8Q0J96k38j02J29P4Q5j76j07Q6RQk71K88p3J58k0o9
7199B7j55J83Nj24Q2j86L5O9p5J2K75k08O1J4n7K5m3P5J8nj14J34kjo2K14k64
7226f7J03o6Rm0J04M1r1oRj14OJ74mj60k2R7j38P3J09l3J25k57J54Q1m9N1m3K0
7254F6P7j52j41K85j38K1KO7qj27j48L49pO0q8k09J24j71J41j16J52N7k10J51
$$ plain form
7278 37 -88 3 -12 -115 -141 18 41 -116 73 -23 117 -60 50 206 -142 -68 -51 66 -15 -19 6 -134 78 6
7302 6 -88 -101 -123 -1 52 58 -61 62 59 82 -71 -73 71 91 33 185 50 4 49 1 -283 -105 139 -6 60 144 91
7329 91 -193 -211 20 -20 -82 -152 -163 -100 -7 -53 -87 -68 27 -33 -109 61 -46 7 72 -23 197 -75 4 28 1 54 94
7356 94 65 14 -143 131 -115 -7 4 -58 -59 -83 -229 65 -107 102 -64 11 -28 -97 140 10 31 67 -46 -129 120
7381 120 -69 10 207 -46 183 114 -93 30 -45 -113 57 121 114 -144 -27 -72 70 -23 59 -134 -28 -57 107 -6
7405 -6 95 -139 61 69 -43 3 206 60 -115 21 80 91 114 -13 33 50 -143 146 -43 -81 41 77 -144 -63
7429 -63 -34 -30 -118 -48 64 -32 -81 -59 74 -81 96 38 14 147 129 166 25 1 -199 -24 15 35 100 -152 -115 -38
7455 -38 -36 56 -52 -149 -135 39 149 115 97 -79 -103 -82 152 13 13 -11 9 73 65 52 -97 7 -15 171 -2 82 126
$$ packed form
7278C7j25R1j5j03k6J59K3j57J89r6J40j77J10J56l48P4J7J17q1mK5j40K12p2
7302Fr4j3k2J22N3Oj19J23lK3j53kJ44K0n8J52j35m6M5m8k84J78K44j45O6Q4n3
7329I1k84j8K31m0o2p0j1O3R3m6l4J9R5o0p6J70j07N3O5r5K20k72P9K4k7N3M0
7356I4k9n1j57K74k46J08J1o2jk4j46K94j72K09j66P5l9o9K37j30K1L6j13q3K49
7381A20j89P9J97k53K29o9k07J23p5o8J70O4pk58J17m5J42r3Q2j93J06k9J64j13
7405fJ01k34K00Qj12M6K03j46j75J36N9J1K3j27M6J7j93K89j89l8J22L6k21Q1
7429f3K9Mq8P0J12r6m9K2J33j55J77n8k4J33j8L7j41k4k00J75L9K0O5k52L7P7
7455c8KR2j08r7J4J74J10l4j8j76k4K1K34j39%k4K0O4qj3j49J04k2J86j73Q4M4
$$ plain form
7482 126 74 -1 138 9 -109 -90 -64 -4 -137 -79 -106 14 -10 -31 -99 -89 34 -69 -74 -119 82 39 27 -6 15 -55
7508 -55 96 66 -14 127 -25 20 -9 -9 84 -37 30 104 -92 33 -110 131 61 -144 -74 8 -20 -236 2 -21 -61
7533 -61 -95 -71 -180 39 -132 48 120 -13 166 40 28 -49 55 158 18 15 -88 -67 -14 -30 -179 -21 137 103
7557 103 -99 -18 62 -24 9 147 41 -46 -60 57 146 1 -38 39 -22 97 75 103 -92 -50 -3 52 14 -15 -105 -179
7583 -179 -139 62 14 -22 61 -135 -159 -132 -184 -69 98 -109 30 64 -24 -75 19 78 104 5 2 89 22 53 172 100 61
7610 61 64 -68 79 147 72 18 -62 -59 -58 26 2 -42 37 17 -13 4 28 176 -117 25 -54 105 -72 46 87 -11 104
7637 104 -88 44 33 -16 38 73 115 -19 -41 61 104 81 -106 14 80 -131 -126 121 25 23 -91 56 37 -125 -166
7662 -166 28 -13 -140 -146 69 152 52 16 20 102 -56 114 10 10 69 8 -81 -159 -129 -10 19 96 42 109 -35 80
$$ packed form
7482A26n2p5J39j29j18J9K6O0j33N8k7J20k4k1o8J0J23j03nm5K01m3j2l3K1p0
7508e5J51l0q0J41j52M5k9%R3j21O7P4j96J25j43K41p0k05P0Q2k8k16K38k3m0
7533f1l4K4j09K19j71J80P2j33J79j26j2p7J04J03j40lj03K1N3j6j49J58J58l4
7557A03k02Q1Q0q6L3J38j06q7j4J17Q9j45l9P7o1J19k2K8j95M2M7N5l8k9r0p4
7583a79M0K01m8l6Q3j96k4K7n2J15J67k07J39L4q8n1R4N9K6r9lQ7o7L1J19p2l9
7610F1Lj32J47O8p5n4q0LJQ4k4m4P9k0l0J7K4J48k93J42p9J59j77J18M1r8J15
7637A04j92J32j1m9N4L5M2j34k2J02M3k3j87J20O6k11NK47r6kj14J47j9j62m1
7662a66J94m1j27oK15Q3j00l6MQ2j58J70j04%N9o1q9p8L0J19K9P7n4O7j44J15
$$ plain form
7688 80 -39 -35 -15 132 192 57 76 105 130 -7 108 -73 -174 -71 67 1 -124 3 47 8 -3 186 -82 -17
7712 -17 -65 -124 3 43 33 -43 67 111 -119 21 36 -24 -85 -33 -103 -203 -16 15 72 123 40 22 -23 -101 -188 -52 108
7739 108 -96 103 3 49 -75 -82 -31 96 -54 85 -210 -9 62 -36 30 -10 18 -102 -3 -10 1 -53 16 -41 -74 52
7765 52 -42 61 -40 -73 176 21 -65 -165 -71 -35 72 -25 85 32 21 -36 103 24 70 132 -36 15 -22 -145 -31
7790 -31 -36 78 74 36 -35 -46 13 67 -7 25 -74 126 15 40 58 -206 -109 -34 6 -29 82 -110 -149 -75 -156 -137 -178 81
7818 81 -57 31 -4 -151 -59 35 -8 96 -19 -15 -110 105 71 4 65 23 -55 143 8 19 45 145 103 -133 -127 -86 72
7845 72 -12 43 -78 -31 -56 -62 -46 -85 80 158 39 -162 -33 -37 -37 17 3 -63 -66 93 86 62 64 -165 -37 -14 17 -58 -106
7874 -106 44 15 -12 -245 -27 -63 -98 -73 126 -12 -2 -3 45 98 76 -77 -13 137 169 -15 -76 18 24 56 -23 -39 -193
$$ packed form
7688H0j19MK0J47O0j35J9K9K5j37J15j81j01J03J38o6j25J27M4l9j1J89k68O5
7712a7m8n9J27M0j0p6J10M4k30J40J5o0o1N2p0j00J87L1N7N1q3j8m5p8q7J36J60
7739A08k04J99j00M6j24pN1J27j50J39k95K01P1r8O6m0K8j20R9pJ1n4O9n7l3J26
7765E2r4J03j01l3K49j55q6j00R4L6J07r7J10n3j1n7J39p9M6O2j68N1l7j23J14
7790c1nJ14ml8p1j1N9N4p4L2r9K00j11K5J8k64R7P5M0l5J11j92l9P4q1J9m1K59
7818H1j38Q8l5j47R2R4m3J04j15Mr5K15l4o7O1m2p8J98j35J1K6J00m2k36OM1J58
7845G2q4N5j21M7k5oJ6l9J65P8j19k01J29m%N4j4o6lJ59pk4Kk29J28K3L1p5m8
7874a06J50k9k7k33K18l6l5K5J99j38J0jM8N3k2j53O4J50L2j84o1R4OL2p9j6j54
$$ plain form
7901 -193 -23 10 -122 30 -66 20 -109 13 17 26 -246 71 -105 113 -62 -36 82 320 50 -32 88 -75 -17
7924 -17 89 34 84 -14 -28 128 121 143 35 34 -34 98 25 -60 -12 92 17 -100 -7 11 45 39 -5 113 -72 14 -134
7951 -134 63 22 48 59 0 159 80 15 161 99 3 -40 113 170 -136 -14 -39 141 -17 -34 149 -12 -80 -108 -182
7976 -182 20 -105 138 54 -5 24 -51 82 131 48 61 52 4 -47 65 -20 20 151 28 27 -14 -14 129 77 -68 -131 -80
8003 -80 -40 34 -75 24 0 142 -21 141 97 82 -17 -18 41 -57 26 -69 -9 -6 -54 81 -108 -41 228 -69 -84 -84 17
8030 17 -183 -2 -70 23 -13 -180 -36 -127 48 -124 -27 -77 -64 -22 50 21 99 -104 26 19 -116 -47 -28 -43 135 46
8056 46 65 -113 107 -11 132 -2 182 -53 -49 12 12 65 -36 95 3 -89 19 14 22 50 -101 -112 39 15 -122 -19
8082 -19 -43 -111 -29 3 -1 43 103 4 89 -114 -140 22 14 72 -132 58 60 166 4 -13 21 -52 -44 -41 -140 -215 -102 -12 -51
$$ packed form
7901a93J70L3j32J52r6Q6j29J22MRk72L17j76K18j75K6J18K38k70q2J20j63N8
7924a7J06n5N0r8j4J56pK2j08jo8J32p3q5M8J04p5j17R3J8L4om4J18j85Q6j48
7951a34J97m1K6J1n9J59p9o5J46o2r6m3J53N7l06J22k5J80j58j7J83j61o8k8p4
7976a82K02j25K43q4n9K9p5J33M9q3J3rm8n1J12q5M0J31j23jm1%J43n2j45o3N1
8003h0M0P4j09R9k4J42j63J62m4j5r9jN9r8Q3r5O0Lm8J35j89O7K69k97j5%J01
8030A7k00J81o8R3l6j67J44r1J75j72R7n0J3M2P2k9P8k03J30pj35O9J9j5J78q9
8056D6J9j78K20j18J43j34J84k35MO1%N3j01J31r2r2J08nQK8j51j1J51k4j37J03
8082a9k4o8Q2L2mM4O0r9Q5k03k6J62qN8k04J90KJ06j62j7L4p3QLr9p5J13R0l9
$$ plain form
8111 -51 -5 -42 -105 10 198 87 -19 88 -61 -33 -6 -59 -77 -12 -164 -12 27 107 -158 0 26 -7 -97 20 -30
8136 -30 31 -186 -75 -70 6 57 -49 4 -98 50 7 -16 -71 126 -34 29 -6 46 -59 89 -34 -62 48 1 -43
8161 -43 19 41 -24 -120 -157 -35 12 -33 -78 31 -70 -41 -58 -90 100 42 -18 -95 24 -41 -278 -7 -70 48 39 -165
8187 -165 8 55 -37 32
$$ packed form
8111e1M6l7o3J15J88j11j06J07j49K8K7n3j8O5j52J52L9Q0k65J58K6l3r0J17n0
8136c0O1k17J11NP6N1j06N3j02J48m3k3n5J97j60O3l5N2j05J48j23k8J10m7m4
8161d3O2K2o5r6l7J22M7m5m5J09j01K9j7l2J90n8o0p7J19o5k37K71o3J18rk04
8187a65J73M7r2O9
8191C2
$$ Imaginary data points
##PAGE= N=2
##DATA TABLE= (X++(I..I)), XYDATA
$$ plain form
0 0 0 0 0 0 0 0 0 0 0 0 0 0 0 -8 8 -8 8 -8 8 -16 16 -20 24 -30 32 -39 46 -52 60 -68 78 -87 101 -114 130 -145
36 -145 163 -183 203 -227 252 -282 313 -347 382 -425 467 -516 570 -628 693 -764 845 -932 1032
55 1032 -1146 1277 -1428 1606 -1818 2079 -2406 2834 -3412 4250 -5554 7845 -12674 26915 -159674
70 -159674 -528176 142938 582755 220052 -92074 166778 341982 211547 96934 8820
80 8820 -146433 -53035 189579 63958 -274651 -155313 233628 202747 -131954 -162798 46044
91 46044 77639 -67618 -176104 -216858 -168040 -54474 -60704 -195362 -167864 53473 149501
102 149501 55289 39236 148619 196303 163865 149902 108926 18083 6001 77700 38268 -117937
114 -117937 -141289 14287 85461 -29057 -103935 -6820 86275 28406 -72697 -100887 -97098
$$ packed form
0@%%%%%%%%%%%%%qJ6j6J6j6J6k4L2l6M4n4O2p1Q5r8J12j28J46j65J88k15K44k75
36a45L08l46L86m30M79n34N95o60P29q07Q92r83J086j198J321j457J609j777J964
55A032k178K423k705L034l424L897m485N240o246P662r804J3399k0519L9589j86589
70a59674l68502O71114M39817l62703l12126K58852J75204j30435j14613q8114
80H820j55253R3398K42614j25621l38609J19338L88941l0881l34701l0844K08842
91D6044L1595j45257j08486m0754M8818J13566o230j34658K7498K21337R6028
102A49501r4212j6053J09383M7684l2438j3963m0976r0843j2082P1699l9432j56205
114a17937k3352J55576P1174j14518p4878R7115R3095n7869j01103k8190L789
$$ plain form
125 -97098 -88580 -68177 -112386 -199907 -133455 62661 88248 -52546 -12873 210159 250723 91161
137 91161 49937 135745 119496 32700 5932 -32092 -89197 -33815 42503 -42217 -129804 -12299
149 -12299 107293 10710 -96929 -27215 36320 -34133 -92510 -83934 -93404 -85424 -29893 -35323
161 -35323 -77079 1329 120912 97098 34707 101311 165652 96902 38908 66420 40049 -37492
173 -37492 -28182 503 -68662 -106460 -17428 24597 -53447 -63478 36711 52677 -34564 -48323
185 -48323 9979 -6148 -69933 -64344 -24925 -33234 -42883 -1022 36440 31683 38937 78470 90075
198 90075 59727 42393 49070 36049 -645 -23781 -28338 -35393 -39484 -31224 -29700 -34589 -13769
211 -13769 19130 10398 -21630 -8612 24862 2443 -43803 -36439 -8476 -19117 -31117 -10245
$$ packed form
125i7098Q518K0403m4209q7521O6452J96116K5587j40794L9673K23032M0564j59562
137I1161m1224Q5808j6249q6796k6768l8024n7105N5382P6318q4720q7587J17505
149a2299J19592r6583j07639O9714O3535p0453n8377Q576r470P980N5531n430
161c5323m1756P8408J19583k3814o2391O6604O4341o8750n7994K7512k6371p7541
173c7492R310K8685o9165l7798Q9032M2025p8044j0031J00189J5966q7241j3759
185d8323N8302j6127o3785N589L9419q309r649M1861L7462m757P254L9533J1605
198I0075l0348j7334O677j3021l6694k3136m557p055m091Q260J524m889K0820
211a3769L2899q732l2028J3018L3474k2419m6246P364K7963j0641j2000K0872
$$ plain form
223 -10245 1438 3306 37648 62772 29250 12724 62667 74198 1786 -33899 10627 18626
235 18626 -38889 -58352 -25027 -14067 -21875 -9928 -5401 -12298 12406 36684 4169 -27660 4640
248 4640 28875 -13612 -41271 -6316 12977 -11373 -11696 16863 17343 7179 25485 33624 7985
261 7985 1163 21574 10780 -22681 -20611 -1744 -14796 -31582 -14809 1412 -7899 -8747 10842
274 10842 16744 4717 4234 12871 9383 -411 -2481 -2829 -5807 -3539 263 -4443 -7011 4666 14182
289 14182 3766 -7130 3290 14316 1240 -15919 -9446 2907 -4580 -15957 -10152 -171 -60
302 -60 1214 6311 4918 4391 15037 18069 2295 -3784 11408 14309 -5876 -13059 1886 5050 -8724
317 -8724 -11632 -3940 -4718 -6867 -2843 -5704 -11971 -3099 6837 -3952 -12273 2926 13236 1066
$$ packed form
223a0245J1683J868L4342K5124l3522j6526M9943J1531p2412l5685M4526P999
235A8626n7515j9463L3325J0960p808J1947M527o897K4704K4278l2515l1829L2300
248D640K4235m2487k7659L4955J9293k4350l23K8559M80j0164J8306Q139k5639
261G985o822K0411j0794l3461K070J8867j3052j6786J6773J6221r311q48J9589
274A0842N902j2027m83Q637l488r794k070l48k978K268L802m706k568J1677R516
289A4182j0416j0896J0420J1026j3076j7159O473J2353p487j1377N805R981J11
302f0J274N097j393n27J0646L032j5774o079J5192K901k0185p183J4945L164j3774
317h724k908P692p78k149M024k861o267Q872R936j0789q321J5199J0310j2170
$$ plain form
331 1066 -4390 9137 12467 1492 1862 9718 5222 -245 6540 9869 2091 814 7080 3371 -6633
346 -6633 -6143 -3856 -12047 -17257 -10524 -7444 -13401 -11989 -1515 1986 -481 1717 6693 7605 7765 8041
362 8041 4093 1049 5404 8573 2752 -2073 3864 10559 6516 -527 -907 2922 2125 -2487 -6209 -7184
378 -7184 -6052 -4798 -6595 -12055 -14779 -9582 -3019 -4415 -8534 -2772 9996 15174 10358 7741 11183
393 11183 15040 12004 2671 -5501 -4765 1196 -36 -8683 -9476 1079 9904 7187 1280 1019 4138
408 4138 4991 -1777 -13604 -19055 -11141 -3403 -8896 -15398 -5334 10554 12244 5107 4682 9352 11509
423 11509 10499 4856 -3814 -4256 5073 7300 -4681 -11317 -310 10847 4809 -6908 -6076 3716
437 3716 6277 -2556 -11151 -9203 -2425 -1556 -7485 -11901 -8663 -830 4849 3622 -333 4646 17715
$$ packed form
331A066n456J3527L330j0975L70P856m496n467O785L329p778j277O266l709j0004
346f633M90K287q191n210O733L080n957J412J0474L501k467K198M976R12J60K76
362H041l948l044M355L169n821m825N937O695m043p043l80L829p97m612l722r75
378g184J132J254j797n460k724N197O563j396m119N762J2768N178m816k617L442
393A1183L857l036r333q172P36N961j232q647p93J0555Q825k717n907k61L119
408D138Q53o768j1827n451P914P738n493o502J0064J5888J690p137m25M670K157
423A1509j010n643q670m42R329K227j1981o636J1007J1157o038j1717Q32R792
437C716K561q833q595J948O778Q69n929m416L238P833N679j227l955M979J3069
$$ plain form
452 17715 21085 9378 928 6896 9980 -2379 -15428 -14110 -9870 -12221 -11814 -5404 -2817 -2517 6197
467 6197 16181 10421 -1253 1225 11162 5105 -12379 -15539 -2513 2431 -5142 -7263 2350 9767
481 9767 9342 8568 6999 1640 700 6164 2088 -13414 -16723 -1377 4152 -11390 -17567 -469 11602
496 11602 2582 -5603 2834 11653 7762 1541 1705 1764 -1193 -1822 -161 -2020 -4885 -1817 6383 9146
512 9146 2437 -301 7979 12528 1377 -9263 -4634 660 -8394 -15956 -8593 -3242 -8735 -6499 5946
527 5946 6189 -3446 2457 16339 9999 -6130 -1958 11555 4869 -9823 -4992 8215 4375 -4015
541 -4015 3076 12236 6286 -496 5952 9629 -2702 -12078 -5605 -2379 -14841 -22374 -12359 -4600
555 -4600 -10023 -10741 1779 9542 5727 7422 16284 14278 3403 3616 9769 3962 -7372 -4957 5133
$$ packed form
452A7715L370j1707q450N968L084j2359j3049J318M240k351M07O410K587L00Q714
467F197R984n760j1674K478R937o057j7484l160J3026M944p573k121R613P417
481I767m25p74j569n359r40N464m076j5502l309J5346N529j5542o177J7098J2071
496A1602r020q185Q437Q819l891o221J64N9k957o29J661j859k865L068Q200K763
512I146o709k738Q280M549j1151j0640M629N294r054p562P363N351n493K236J2445
527E946K43r635N903J3882o340j6129M172J3513o686j4692M831J3207l840q390
541d015P091R160n950o782O448L677j2331r376O473L226j2462p533J0015P759
555d600n423p18J2520P763l815J695Q862k006j0875K13O153n807j1334K415J0090
$$ plain form
570 5133 3619 -3506 -877 5388 4095 -1206 -941 198 -3969 -8333 -5703 -3292 -9218 -15223 -8838
585 -8838 1538 -1686 -10799 -4867 10691 10950 -1140 -1260 9887 12253 5808 3643 4865 4387 7049
600 7049 8651 -71 -8607 -1049 10348 2696 -11888 -7946 6815 5638 -10290 -16683 -7609 -512
614 -512 -5567 -13032 -10410 171 6344 3438 224 3432 8742 10637 9357 4316 395 3944 9829
629 9829 4637 -6189 -5457 5354 7185 -2054 -5822 175 3967 14 -4365 -6637 -6920 -3701 -385
644 -385 -3804 -10052 -7288 2547 4431 -4702 -8851 815 10538 6387 -3035 -401 9956 12150 4014
659 4014 -2039 796 5454 5195 -980 -6515 -4543 3243 4086 -4579 -8570 -1108 5269 109 -7437 -6177
675 -6177 69 1645 -2803 -6342 -4560 1019 3353 -528 -3714 456 5599 4684 838 114 2806 5019
$$ packed form
570E133j514p125K629O265j293n301K65J139m167m364K630K411n926o005O385
585h838J0376l224r113N932J5558K59j2090j20J1147K366o445k165J222m78K662
600G049J602q722q536P558J1397p652j4584L942J4761j177j5928o393R074P097
614e12n055p465K622J0581O173k906l214L208N310J895j280n041l921L549N885
629I829n192j0826P32J0811J831r239l768N997L792l953m379k272k83L219L316
644c85l419o248K764R835J884r133m149R666R723m151r422K634J0357K194q136
659D014o053K835M658k59o175n535J972P786Q43q665l991P462O377n160p546J260
675f177O246J576m448l539J782N579K334l881l186M170N143r15l846p24K692K213
$$ plain form
691 5019 4320 1476 -152 1196 3780 1681 -2753 -3483 -879 -342 -1816 -2806 -2038 -459 1533 1661 -1258
708 -1258 -2375 -94 1474 -1657 -4843 -3727 -816 -415 -2044 -2336 -16 3013 4278 2705 1321 3280
724 3280 5296 3501 -342 -1477 421 1302 -753 -2813 -1769 1501 3240 987 -707 1260 3465
739 3465 1395 -2752 -4194 -2566 -2509 -5371 -7220 -5391 -2239 -989 -1487 -631 2437 4828 4835 3053 2632
756 2632 3903 4012 1750 -445 -84 1717 1677 525 703 2453 3687 3032 1490 564 319 -936 -3356
773 -3356 -5886 -6853 -6728 -6910 -7337 -6403 -3847 -1661 158 2260 4358 5359 5768 6027 5524 3940 2595
790 2595 2063 1388 349 202 1094 2221 2950 2994 2864 2447 1979 176 -2322 -4824 -6357 -7655 -8698 -9444
808 -9444 -8639 -6479 -4055 -1988 333 3036 5219 6248 6114 5499 5125 4592 3316 1805 1335 1760 2162
$$ packed form
691E019o99k844j628J348K584k099m434p30K604N37j474r90P68J579J992J28k919
708a258j117K281J568l131l186J116K911M01j629k92K320L029J265j573j384J959
724C280K016j795l843j135J898Q81k055k060J044L270J739k253j694J967K205
739C465k070m147j442J628N7k862j849J829L152J250m98Q56L068K391Pj782m21
756B632J271J09k262k195L61J801m0j152J78J750J234o55j542r26k45j255k420
773c356k530r67J25j82m27R34K556K186J819K102K098J001M09K59n03j584j345
790B595n32o75j039j47Q92J127P29M4j30m17m68j803k498k502j533j298j043p46
808i444Q05K160K424K067K321K703K183J029j34o15l74n33j276j511m70M25M02
$$ plain form
825 2162 1693 1631 2485 3265 2609 1414 438 -834 -2716 -5109 -7060 -8325 -8759 -8368 -7817 -6482 -3905 -989
843 -989 1140 2309 4069 6143 6626 6011 5166 4988 4154 2969 2031 1296 1020 1904 2284 1808 1356 2096 1617
862 1617 -107 -2108 -3304 -4398 -5966 -7076 -7222 -7161 -6839 -5149 -3072 -2007 -375 2673 5092 5607
878 5607 5424 6186 6104 4768 3627 2323 680 486 1447 1265 -127 388 2222 2445 352 -1246 -761 -1242
896 -1242 -3413 -5400 -5999 -6017 -5562 -4770 -4019 -3334 -1311 1830 3221 2364 2397 3936 4831 3268 1452 1867
914 1867 2884 2918 1869 834 811 1696 1622 312 -1171 -1336 -523 -464 -1655 -3537 -3663 -2112 -1131 -3406
932 -3406 -5320 -2825 901 150 -2763 -1587 2651 3422 957 878 2502 2265 1815 2299 257 -2357 -441
949 -441 3141 1079 -2955 -341 5217 4100 -634 -784 2178 1639 -1232 -2045 -1978 -2345 -1481 -378 -2375
$$ packed form
825B162m69o2Q54P80o56j195r76j272j882k393j951j265m34L91N51J335K577K916
843i89K129J169J760K074M83o15q45j78q34j185r38p35k76Q84L80m76m52P40m79
862A617j724k001j196j094j568j110j46O1L22J690K077J065J632L048K419N15
878E607j83P62q2j336j141j304j643j94R61j82j392N15J834K23k093j598M85m81
896a242k171j987n99j8M55P92P51O85K023L141J391q57L3J539Q95j563j816M15
914A867J017L4j049j035k3Q85p4j310j483j65Q13N9j191j882j26J551R81k275
932c406j914K495L726p51k913J176M238P71k465p9J624k37m50M84k042k614J916
949d41L582k062m034K614N558j117m734j50K962n39k871q13O7l67Q64J103j997
$$ plain form
966 -2375 -4278 -2129 636 -422 -3551 -3145 505 2490 477 -1226 613 4266 4604 1323 244 2339
982 2339 3424 1277 -760 -932 -292 872 2039 1521 -182 1132 4406 3495 -1782 -3640 -623 -213
998 -213 -5024 -8009 -4893 -1801 -3332 -4389 -2012 -76 36 1765 3479 1714 78 3561 6009 2103
1014 2103 -1942 1801 5914 2746 -1193 1339 4645 3306 1431 1698 1229 -625 -764 -1762 -5441 -8015
1030 -8015 -6206 -4875 -7235 -8249 -5370 -1541 371 126 906 3932 6746 6058 3122 2736 4557 3376
1046 3376 557 498 2211 2120 2250 4436 4690 2097 2218 3841 995 -4871 -6054 -3953 -6385 -11048 -10471
1063 -10471 -6706 -6254 -6261 -2767 874 1664 3553 6865 7141 4504 4419 6110 4472 330 325 2763 2800 885
1081 885 1531 3807 4320 3303 2626 2012 -67 -1741 -3569 -6731 -9548 -10237 -9689 -9729 -9058 -6145 -2630
$$ packed form
966b375j903K149K765j058l129M06L650J985k013j703J839L653L38l281j079K095
982B339J085k147k037j72O40J164J167n18j703J314L274r11n277j858L017M10
998b13m811k985L116L092j531j057K377J936J12J729J714j765j636L483K448l906
1014B103m045L743M113l168l939K532L306j339j875K67m69j854j39r98l679k574
1030h015J809J331k360j014K879L829J912k45P80L026K814o88k936l86J821j181
1046C376k819n9J713r1J30K186K54k593J21J623k846n866j183K101k432m663N77
1063a0471L765M52pL494L641P90J889L312K76k637q5J691j638m142nK438L7j915
1081H85O46K276N13j017o77o14k079j674j828l162k817o89N48m0O71K913L515
$$ plain form
1098 -2630 419 3172 5472 6820 8013 8552 7213 4752 3825 3671 1781 -497 669 2211 1514 1444
1114 1444 3460 3486 1461 913 538 -2889 -6878 -7468 -7687 -11066 -12368 -9230 -6111 -5486 -2464 2889 5599
1131 5599 6164 8400 10116 8290 6207 6201 4445 691 -456 712 -15 -1648 -13 2084 2073 1462 2106
1148 2106 1484 -959 -3075 -4454 -7397 -10097 -10108 -8988 -8858 -7442 -3320 318 2792 5438 8411 9653
1164 9653 9358 8976 7747 4927 2517 1304 -593 -2729 -2912 -1337 -579 -608 612 2009 1515 168 -685
1181 -685 -2492 -5311 -7017 -7496 -8701 -9387 -7161 -4038 -1908 210 4288 7728 8649 9264 10024 9077 6132
1198 6132 4176 2595 -617 -3278 -3033 -2654 -3772 -3292 -493 796 -54 580 1321 -152 -2884 -3710 -4573
1215 -4573 -6705 -7661 -6074 -5198 -4316 -1248 2649 4919 6610 9112 10041 8923 7198 6185 3367 -151
$$ packed form
1098b630L049K753K300J348J193N39j339k461r27j54j890k278J166J542o97p0
1114A444K016K6k025n48l75l427l989n90k19l379j302L138L119O25L022N353K710
1131E599N65K236J716j826k083oj756l754j147J168p27j633J635K097j1o11O44
1148B106o22k443k116j379k943k700j1J120J30J416M122L638K474K646K973J242
1164I653k95l82j229k820k410j213j897k136j83J575P58k9J220J397m94j347q53
1181f85j807k819j706m79j205o86K226L123K130K118M078L440R21O15P60r47k945
1198F132j956j581l212k661K45L79j118M80K799J289q50O34P41j473k732q26q63
1215d573k132r56J587Q76Q82L068L897K270J691K502R29j118j725j013k818l518
$$ plain form
1231 -151 -1982 -3143 -4674 -5207 -4036 -2844 -2412 -1091 526 873 34 2 -813 -2699 -4320 -4537 -4614 -5125
1249 -5125 -3830 -1301 781 2467 5132 7802 8274 7752 7734 6554 3739 1239 -664 -2756 -5016 -5845
1265 -5845 -5185 -4948 -4391 -2573 -457 113 480 1490 1434 -136 -1279 -1769 -2831 -3707 -3123 -1852 -966 438
1283 438 3256 5368 6104 6977 7558 6785 4313 2665 698 -2192 -4586 -5520 -5939 -6372 -5449 -3682 -2274
1300 -2274 -1206 325 1709 1476 1234 1202 200 -1044 -1577 -1338 -1384 -991 650 2250 3069 4269 5624
1317 5624 5846 5041 4264 3072 967 -1399 -2757 -4235 -5538 -6146 -5644 -4602 -4178 -2640 -495 708
1333 708 1251 1901 2329 1754 952 760 154 -451 -632 147 909 1494 2723 3594 4267 4330 4006 3161 1575 -212
1353 -212 -1733 -3454 -4792 -5517 -5352 -5189 -4440 -3120 -1667 -358 736 1637 2199 2202 2100 1722 1002 591
$$ packed form
1231a51j831j161j531n33J171J192M32J321J617L47q39l2q15j886j621k17p7n11
1249e125J295K529K082J686K665K670M72n22j8j180k815k500j903k092k260q29
1265e845O60K37N57J818K116N70L67J010n6j570j143m90j062q76N84J271Q86J404
1283D38K818K112P36Q73N81p73k472j648j967k890k394r34m19m33R23J767J408
1300b274J068J531J384k33k42l2j002j244n33K39m6L93J641J600Q19J200J355
1317E624K22q05p77j192k105k366j358j478j303o08N02J042M24J538K145J203
1333G08N43O50M28n75q02j92o06o05j81P79P62N85J229Q71O73O3l24q45j586j787
1353b12j521j721j338p25J65J63P49J320J453J309J094R01N62Lj02l78p20m11
$$ plain form
1371 591 676 547 493 912 1648 2338 2595 2821 2822 2272 1491 555 -716 -2201 -3181 -3758 -4308 -4580 -4347 -3268
1391 -3268 -2485 -1496 -255 738 1655 2232 2325 2056 1912 1712 1134 614 567 687 888 1114 1280 1487 1492 1550 1152
1412 1152 537 -308 -989 -1625 -2533 -3282 -3579 -3250 -2890 -2479 -1712 -692 -26 649 1460 1657 1509 1665 1604 1358
1432 1358 996 785 1125 994 837 627 942 1225 776 335 380 327 -390 -972 -1151 -1469 -2002 -2025 -1919 -1602 -2061
1453 -2061 -1339 -301 -42 67 559 1142 1061 795 1002 1437 1005 616 913 1016 658 436 469 518 504 -297 -271
1474 -271 -147 -290 -772 -634 -338 -525 -930 -799 -355 -663 -1026 -571 -236 -595 -663 -25 500 -35 -4 779 1169
1495 1169 782 515 882 842 229 -89 203 327 -256 -349 274 382 -258 70 830 665 -130 -8 682 -17
1515 -17 -896 -1042 -683 -1187 -1664 -1136 -748 -1016 -513 423 602 363 608 959 786 404 274 490 235 31
$$ packed form
1371E91Q5j29n4M19P36O90K57K26Jn50p81r36j271j485r80n77n50k72K33J079
1391c268P83R89J241R93R17N77R3k69j44k00n78n20m7J20K01K26J66K07NN8l98
1412A152o15q45o81o36r08p49k97L29L60M11P67J020O66O75Q11J97j48J56o1k46
1432A358l62k11L40j31j57k10L15K83m49m41M5n3p17n82j79l18n33k3J06L17m59
1453b061P22J038K59J09M92N83q1k66K07M35m32l89K97J03l58k22L3M9j4q01K6
1474b71J24j43m82J38K96j87m05J31M44l08l63M55L35l59o8O38N25n35L1P83L90
1495A169l87k67L67m0o13l18K92J24n83r3O23J08o40L28P60j65p95J22O90o99
1515a7q79j46L59n04m77N28L88k68N03R36J79k39K45L51j73l82j30K16k55k04
$$ plain form
1535 31 -50 161 468 935 934 1003 1367 1251 658 538 246 -824 -1707 -1685 -1819 -2422 -2568 -1491 -931 -1237 -628
1556 -628 483 977 654 755 1327 892 292 337 718 228 135 482 1236 1034 1137 1873 2113 1584 831 581
1576 581 166 -1074 -2236 -2250 -2543 -3050 -3117 -2123 -1824 -1315 -627 310 548 421 1373 1583 1106 955 995 850
1596 850 287 659 828 968 1643 2005 1845 1718 1900 1459 101 -689 -1103 -2098 -2990 -2911 -2920 -3151 -2834 -1702
1616 -1702 -1060 -982 48 1147 1272 1024 1293 1715 1005 468 962 999 571 933 1676 1549 1447 1705 1982 1335
1636 1335 470 207 -199 -1672 -2370 -2587 -2912 -3168 -3057 -2467 -1943 -1293 -376 354 903 1152 1485 1623 1113
1655 1113 1131 970 1031 611 794 1113 1195 1310 1618 1762 1355 1139 747 161 -1043 -1482 -2015 -2636 -3116 -2830
1675 -2830 -2603 -2524 -1762 -802 -265 -25 1000 1509 1374 1026 1591 1331 732 761 1060 797 567 996 1387 987
$$ packed form
1535C1q1K11L07M67jO9L64j16n93j20k92j070q83K2j34o03j46J077N60l06O09
1556f28J111M94l23J01N72m35o00M5L81m90r3L47P54k02J03P36K40n29p53k50
1576E81m15j240j162j4k93n07o7R94K99N09O88R37K38j27R52K10m77j51M0j45
1596H50n63L72J69J40O75L62j60j27J82m41j358p90m14r95q92P9rk31L17J132
1616a702O42P8J030J099J25k48K69M22p10n37M94L7m28L62P43j27j02K58K77o47
1636A335q65k63m06j473o98k17l25k56J11N90N24O50R17P30N49K49L33J38n10
1655A113J8j61O1m20J83L19Q2J15L08J44m07k16l92n86j204m39n33o21m80K86
1675b830K27P9P62R60N37K40J025N09j35l48N65k60n99K9K99k63k30M29L91m00
$$ plain form
1695 987 895 1301 1011 135 -43 -415 -1024 -2128 -2145 -2081 -2427 -2480 -1624 -1110 -954 -331 455 719 661 1077 1287
1716 1287 972 648 1095 868 468 511 731 766 604 1037 1072 711 490 726 289 -516 -943 -874 -1258 -1945 -1699
1737 -1699 -1377 -1503 -1155 -460 -131 -85 317 920 724 352 719 849 378 224 369 454 223 382 713 671 516
1758 516 786 752 313 24 177 113 -742 -919 -637 -952 -1131 -891 -305 -451 -657 -43 184 -91 -36 334 375
1779 375 -96 -14 323 123 -251 195 522 272 253 849 813 391 514 642 178 40 94 -15 -583 -571 -160 -533
1801 -533 -623 -665 -406 -477 -574 -322 15 -490 -261 161 -24 -265 78 524 55 23 404 701 418 411 915 790
1823 790 432 557 1036 459 -7 261 381 -272 -544 -315 -600 -1141 -1035 -666 -874 -1152 -591 -275 -493 -370
1843 -370 97 304 23 66 473 453 284 551 781 710 705 1115 974 700 800 779 428 116 48 -141 -724 -1036
$$ packed form
1695I87r2M06k90q76j78l72o09j104j7O4l46n3Q56N14J56O23P86K64n8M16K10
1716A287l15l24M47k27m00M3K20L5j62M33L5l61k21K36m37q05m27O9l84o87K46
1737a699L22j26L48O95L29M6M02O03j96l72L67J30m71j54J45Q5k31J59L31m2j55
1758E16K70l4m39k89J53o4q55j77K82l15j79K40N86j46k06O14K27k75N5L70M1
1779C75m71Q2L37k00l74M46L27k50j9N96l6m22J23J28m64j38N4j09n68J2M11l73
1801e33r0m2K59p1r7K52L37n05K29M22j85k41L43M46m69l2L81K97k83pN04j25
1823G90l58J25M79n77m66K68J20o53k72K29k85n41J06L69k08k78N61L16k18J23
1843c70M67K07k81M3M07k0j69K67K30p1nM10j41k74J00k1l51l12o8j89n83l12
$$ plain form
1865 -1036 -804 -990 -1315 -1120 -567 -996 -864 -473 16 -412 -122 166 299 -43 318 691 426 338 930 1163
1885 1163 946 826 1087 1279 772 493 463 173 -427 -571 -797 -1127 -1405 -1325 -1011 -1063 -1112 -523 -463 -312 -23
1906 -23 147 343 356 498 350 281 287 586 527 760 963 959 898 912 938 753 301 34 -205 -593 -965 -950 -1166 -1300
1930 -1300 -1285 -884 -731 -609 -530 6 244 -86 231 251 502 278 211 525 319 440 639 839 912 696 938
1951 938 830 578 331 54 -136 -477 -775 -908 -1000 -908 -1009 -1017 -603 -467 -407 -260 308 341 0 208 130 260
1973 260 3 55 368 647 286 554 830 832 662 573 684 287 156 -231 -305 -822 -1044 -768 -946 -880 -968 -431
1995 -431 -153 -140 128 409 319 184 61 189 278 -111 2 22 308 28 173 677 579 409 309 599 468 87
2017 87 -87 214 -324 -745 -424 -440 -389 -505 -190 21 77 5 135 93 -105 -139 9 -128 -133 -165 -219 12 18 -133
$$ packed form
1865a036K32j86l25J95N53m29J32L91M89m28K90K88J33l42L61L73k65q8N92K33
1885A163k17j20K61J92n07k79l0k90o00j44k26l30k78Q0L14n2m9N89O0J51K89
1906b3J70J96J3J42j48o9OK99n9K33K03mo1J4K6j85m52k67k39l88l72J5k16j34
1930a300J5M01J53J22P9N36K38l30L17K0K51k24o7L14k06J21J99K00P3k16K42
1951I38j08k52k47k77j90l41k98j33r2R2j01qM14J36O0J47N68L3l41K08p8J30
1973B60k57N2L13K79l61K68K76Kj70q9J11l97j31l87p4n17k22K76j78O6q8N37
1995d31K78J3K68K81r0j35j23J28Q9l89J13K0K86k80J45N04r8j70j00K90j31l81
2017H7j74L01n38m21L21j6N1j16L15K11N6p2J30m2j98l4J48j37nl2n4K31Oj51
$$ plain form
2041 -133 315 319 300 273 681 436 240 89 136 147 -265 -256 -83 -135 -232 -84 72 -3 -263 -111 94 -69 -223 -264
2065 -264 -175 -317 -414 -474 -69 -77 -46 -54 319 295 160 458 636 586 279 430 467 120 -61 245 27 -62 -254 -84
2089 -84 -92 -327 -289 -220 -503 -428 -495 -200 -305 -459 -272 -323 -58 119 -21 128 347 241 272 380 519 533 207
2112 207 632 419 290 14 335 196 -289 -270 -120 -232 -640 -465 -261 -344 -687 -431 -389 -353 -554 -316 -207
2133 -207 -293 -72 143 332 151 190 536 548 464 652 700 744 580 422 259 83 -208 -511 -503 -624 -633 -832 -662
2156 -662 -518 -547 -185 -104 -54 158 114 -49 -52 63 82 -1 187 213 -20 309 532 537 610 812 735 494 60 276
2180 276 -201 -693 -543 -618 -911 -760 -651 -471 -507 -279 182 322 268 260 274 147 44 -6 83 -58 -126 321 195
2203 195 473 476 676 488 508 508 251 -269 -465 -619 -904 -1094 -776 -747 -568 -375 -59 405 465 641 754 652
$$ packed form
2041a33M48Mj9k7M08k45j96j51M7J1m12RJ73n2r7J48J56p5k60J52K05j63j54m1
2065b64Q9j42r7o0M05qL1qL73k4j35K98J78n0l07J51L7l47j81L06k18q9j92J70
2089h4qk35L8O9k83P5o7K95j05j54J87n1K65J77j40J49K19j06L1J08J39J4l26
2112B07M25k13j29k76L21j39m85J9J50j12m08J75K04q3l43K56M2L6k01K38J09
2133b07q6K21K15J89j81L9L46J2q4J88M8M4j64j58j63j76k91l03Qj21rj99J70
2156f62J44k9L62Q1N0K12m4j63lJ15J9q3J88K6k33L29K23NP3K02p7k41m34K16
2180B76m77m92J50p5k93J51J09J80l6K28M61J40n4qJ4j27j03n0Q9j41o8M47j26
2203A95K78LK00j88K0%k57n20j96j54k85j90L18K9J79J93L16M64O0J76J13j02
$$ plain form
2225 652 466 238 -12 -179 -342 -428 -339 -87 -16 311 507 587 350 355 152 -131 -270 -507 -736 -897 -997 -743
2247 -743 -548 -480 313 756 783 941 1202 890 944 529 337 -157 -463 -548 -784 -804 -450 -377 -170 103 286 479
2269 479 344 165 145 -362 -694 -681 -654 -1021 -865 -245 104 387 839 1242 1519 1424 1037 1008 604 -99 -448 -726
2291 -726 -863 -1071 -835 -810 -751 -258 -196 106 102 404 59 125 -107 -377 -852 -698 -479 -282 -73 456 927 1345
2313 1345 1506 1594 1862 1454 936 419 3 -753 -1042 -1471 -1416 -1431 -1172 -969 -440 -317 51 358 382 226 -12
2334 -12 155 -346 -427 -572 -267 -76 257 691 1128 1355 1486 1745 1740 1245 755 202 -393 -1005 -1320 -1674 -1698 -1651
2356 -1651 -1422 -1065 -672 -163 193 238 338 391 83 177 72 -129 -181 -111 321 634 850 1214 1761 1796 1813 1523
2378 1523 1041 529 -135 -740 -1145 -1620 -1984 -1878 -1875 -1531 -1254 -706 -135 97 331 633 591 306 210 124 179 120
$$ packed form
2225F52j86k28k50j67j63q6Q9K52P1L27J96Q0k37Nk03k83j39k37k29j61j00K54
2247g43J95O8P93M43K7J58K61l12N4m15j92m94l06q5k36k0L54P3K07K73J83J93
2269D79j35j79k0n07l32J3K7l67J56O20L49K83M52M03K77r5l87k9m04p03l49k78
2291g26j37k08K36K5N9M93O2L02mL02l45O6k32k70m75J54K19J97K09N29M71M18
2313A345J61Q8K68m08n18n17m16p56k89m29N5j5K59K03N29J23L68L07K4j56k38
2334a2J67n01q1j45L05J91L33M34M37K27J31K59nm95m90n53n95o12l15l54k4M7
2356a651K29L57L93N09L56M5J00N3l08R4j05k01n2P0M32L13K16L64N47L5J7k90
2378A523m82n12o64o05m05m75l64J06LL44K77N48N71K32K34L02m2k85r6q6N5n9
$$ plain form
2400 120 375 527 809 1015 1367 1486 1665 1399 1125 680 274 -332 -725 -1360 -1667 -1842 -2123 -1827 -1342 -1002
2420 -1002 -664 -214 257 534 538 647 604 274 133 286 217 370 390 811 1010 1072 1444 1299 1287 831 760 35
2442 35 -689 -1034 -1330 -1595 -1830 -1809 -1502 -1199 -792 -482 -120 235 342 657 609 652 513 295 261 541 466 459 650
2465 650 871 1021 867 1060 860 588 172 -105 -604 -981 -1248 -1379 -1518 -1579 -1169 -996 -594 -156 -9 282
2485 282 605 451 624 454 490 400 222 333 428 468 541 559 852 517 583 696 376 7 -259 -379 -902 -1206
2507 -1206 -1211 -1030 -1200 -922 -799 -495 -211 39 301 471 524 473 291 502 192 180 133 171 312 357 450 539 507
2530 507 494 319 397 84 -113 -362 -453 -528 -803 -640 -661 -591 -543 -225 -85 -52 153 39 241 303 211 361 239
2553 239 -57 -112 174 242 174 354 464 346 298 128 185 67 -59 -267 -180 -204 -459 -217 -187 -234 -385 -204 -214
$$ packed form
2400A20K55J52K82K06L52J19J79k66k74m45m06o06l93o35l07j75k81K96M85L40
2420a002L38M50M71K77MJ09m3l30j41J53o9J53K0M21J99O2L72j45j2m56p1p25
2442C5p24l45k96k65k35K1L07L03M07L10L62L55J07L15m8M3j39k18l4K80p5pJ91
2465F50K21J50j54J93k00k72m16k77m99l77k67j31j39o1M10J73M02M38J47K91
2485B82L23j54J73j70L6r0j78J11R5M0P3J8K93l35O6J13l20l69k66j20n23l04
2507a206nJ81j70K78J23L04K84K50K62J70N3n1j82K11l10j2m7L8J41M5R3Q9l2
2530E07j3j75P8l13j97k49r1p5k75J63k1P0M8L18J40L3K05j14K02O2r2J50j22
2553B39k96n5K86O8o8J80J10j18m8j70N7j18j26k08Q7k4k55K42L0m7j51J81j0
$$ plain form
2576 -214 -202 -132 -34 -4 -46 -142 -158 -95 -120 -76 164 150 111 191 285 233 296 243 274 225 102 27 123 35 18 -323 -210 -83
2604 -83 -275 -169 -320 -221 -247 -391 -326 -219 -258 -252 -177 -83 -203 19 239 -42 282 296 187 400 243 278 571 416
2628 416 391 267 242 186 47 33 -94 -129 -305 -540 -511 -558 -655 -357 -356 -270 -180 -134 61 -32 241 265 137 106 268
2653 268 232 222 246 98 127 386 441 244 265 220 340 177 141 -43 -138 -535 -461 -546 -457 -528 -395 -338 -356 -196 77
2678 77 196 24 68 273 192 61 242 153 353 221 379 406 469 305 527 461 246 129 -20 -155 -336 -497
2700 -497 -591 -550 -663 -525 -464 -322 -208 -4 -8 92 210 97 158 164 148 99 282 284 1 219 414 467 480 342 333
2725 333 366 -57 -102 -217 -274 -496 -545 -475 -756 -562 -575 -104 -186 128 106 187 211 199 152 281 137 138 83 132 140 160
2751 160 94 141 275 260 417 178 121 63 -232 -358 -478 -457 -510 -497 -261 -417 -222 16 186 15 85 200 259
$$ packed form
2576b14J2P0R8L0m2r6j6O3k5M4K40j4l9Q0R4n2O3n3L1m9j23p5R6q8j7l41J13J27
2604h3j92J06j51R9k6j44O5J07l9OP5R4j20K22K20k81L24J4j09K13j57L5K93j55
2628D16k5j24k5n6j39j4j27l5j76k35K9m7r7K98JQ6R0M6J95r3K73K4j28l1J62
2653B68l6j0K4j48K9K59N5j97K1m5J20j63l6j84r5l97P4q5Q9p1J33N7j8J60K73
2678G7J19j72M4K05q1j31J81q9K00j32J58K7O3j64K22o6k15j17j49j35j81j61
2700d97r4M1j13J38O1J42J14K04mJ00J18j13O1Oj6m9J83Kk83K18J95N3J3j38r
2725C33L3m23m5j15n7k22m9P0k81J94j3M71q2L14k2Q1K4j2m7J29j44Jn5M9QK0
2751A60o6M7J34j5J57k39n7n8k95j26j20K1n3J3K36j56J95K38J70j71P0J15N9
$$ plain form
2774 259 2 -31 125 143 10 -72 229 214 186 273 166 283 295 110 292 -22 -247 -148 -281 -479 -270 -134 -270
2797 -270 -226 -44 135 13 153 265 232 179 172 9 -59 -225 -164 -249 17 -35 62 -67 151 344 363 192 90 80
2821 80 -8 -176 -284 -240 -188 -167 -185 51 -56 -24 184 76 272 278 51 -33 -16 -134 -155 -234 -215 -60 38 -117 57
2846 57 254 160 267 53 234 61 119 -119 -68 -145 -121 -250 -158 -87 40 48 271 -16 203 313 164 52 -31 -73
2870 -73 -252 -175 -112 -201 -69 149 -14 31 113 380 144 235 87 117 132 -97 76 84 -150 -8 57 -88 -162 146
2894 146 53 -85 14 -65 149 -162 -63 -274 -335 -353 -195 65 -62 78 221 81 148 144 424 155 163 131 3 94
2918 94 0 61 185 105 -13 218 114 84 -11 -68 -212 -104 -202 -190 -263 -222 -170 -217 -347 -103 36 163 109 111 206 220
2944 220 256 241 113 153 221 207 176 75 34 172 64 66 52 48 -26 0 -143 -105 -334 -337 -191 -273 -79 -195 -19 -121
$$ packed form
2774B59k57l3J56J8j33q2L01j5k8Q7j07J17J2j85J82l14k25R9j33j98K09J36j36
2797b70M4J82J79j22J40J12l3n3pj63o8j66O1q5K66n2R7j29K18J93J9j71j02j0
2821H0q8j68j08M4N2K1j8K36j07L2K08j08J96Ok27q4J7j18k1p9J9J55R8j55J74
2846E7J97r4J07k14J81j73N8k38N1p7K4j29R2P1J27QK23k87K19J10j49j12q3m2
2870g3j79P7O3q9J32K18j63M5Q2K67k36R1j48L0J5k29J73Qk34J42O5j45p4L08
2894A46r3j38R9p9K14l11R9k11o1j8J58K60j27J40J43j40O7mK80k69Ql2j28R1
2918I4r4O1J24q0j18K31j04l0r5n7j44J08r8J2p3M1N2m7j30K44J39J27n4KR5J4
2944B20L6j5j28M0O8j4l1j01m1J38j08Kj4mp4K6j43L8k29lJ46q2J94j16J76j02
$$ plain form
2970 -121 109 132 124 -22 73 180 109 71 182 131 170 143 63 225 149 69 -9 -18 -21 18 73 -152 -136 -169 -195 -257 -352 -119
2998 -119 -258 -94 -35 -54 -3 51 156 337 28 168 132 42 207 143 -12 -110 183 21 -39 30 89 30 -52 -34 77
3023 77 25 -241 -254 47 -196 -205 -70 -39 -186 -150 -204 -38 10 108 120 79 214 155 270 260 99 140 40 -30 21 -110
3049 -110 -41 -31 48 -18 56 -74 -5 -29 -40 -36 -129 -92 -88 -76 3 -241 -45 -32 62 32 105 136 14 126 -42 201 95
3076 95 -132 -14 101 -117 -62 6 -50 102 15 281 219 168 71 93 -72 -154 -186 -195 -209 -264 -174 -69 -77 -53 -13 119 53
3103 53 78 -70 62 30 42 80 49 100 -20 210 169 167 100 50 56 70 59 135 -117 -196 -94 -136 -186 -208 -171 -121 -17 -38
3131 -38 -80 -66 -85 45 115 33 5 122 -13 -88 39 -190 -65 53 11 210 65 113 342 134 135 15 -51 -165
3155 -165 -22 -296 -220 -233 -198 -41 -241 -15 -18 44 3 -28 2 -34 -35 29 52 105 40 70 93 261 213 202 158 62 32 -76
$$ packed form
2970a21K30K3qj46R5J07p1l8J11n1L9k7q0J62p6q0p8rlL9N5k25J6l3k6o2r5K33
2998a19j39J64N9j9N1N4J05J81l09J40l6r0J65o4j55r8K93j62o0O9N9n9q2J8J11
3023G7n2k66j3L01k43rJ35L1j47L6n4J66M8R8J2m1J35n9J15j0j61M1j00p0N1j31
3049a10O9J0P9o6P4j30O9k4j1Mr3L7MJ2P9k44J96J3R4l0P3L1j22J12j68K43j06
3076I5k27J18J15k18N5O8n6J52q7K66o2n1r7K2j65q2l2rj4n5R0J05qK4M0J32o6
3103E3K5j48J32l2J2L8l1N1j20K30m1ko7n0OJ4j1P6k52p9J02m2n0k2L7N0J04k1
3131c8m2J4j9J30P0q2k8J17j35p5J27k29J25J18m2J99j45M8K29k08Jj20o6j14
3155a65J43k74P6j3L5J57k00K26lO2m1l1L0l6jO4K3N3o5L0K3J68m8j1m4r6l0j08
$$ plain form
3183 -76 -105 -207 -208 -263 -196 -354 -291 -344 -80 -128 -74 -140 -35 -142 151 41 204 38 176 -21 227 128 4 196
3207 196 148 267 301 307 117 -56 -123 144 -148 -235 -310 -240 -174 -360 -5 -335 -183 -223 -226 50 26 25 21 -6 -19 -30 96
3234 96 -25 107 148 192 237 270 194 148 -13 -63 -33 -32 -14 -137 -194 -49 -183 -268 -119 -210 -287 -159 -154 93 -14 -100
3260 -100 79 131 65 52 25 -87 195 202 5 171 249 65 28 180 5 75 -77 -96 -47 -48 -145 -120 -162 -163 -195 -177 -158
3287 -158 -137 -218 -100 5 56 32 -138 18 144 79 87 77 -132 133 260 15 193 10 202 -45 -64 -13 96
3310 96 -97 8 7 -2 -33 -23 -57 -210 5 -159 -89 -104 65 2 -165 82 216 93 151 53 190 75 181 194 98
3335 98 236 96 95 88 72 91 17 114 159 -98 21 -210 -156 -209 -32 -275 -276 -191 -173 61 -6 -18 -134 -14 26 7 12
3362 12 -38 17 74 69 -71 -15 165 93 215 109 342 193 236 51 -86 -48 -21 -245 -251 -260 -318 -107 -345 -208 -232 -117
$$ packed form
3183g6k9j02jn5O7j58O3n3K64m8N4o6J05j07K93j10J63j66J38j97K48r9j24J92
3207A96m8J19L4Oj90j73o7K67k92q7p5P0O6j86L55l30J52m0lK76k4jmk7j3j1J26
3234I6j21J32M1M4M5L3p6m6j61n0L0JJ8j23n7J45j34q5J49r1p7J28NK47j07q6
3260a00J79N2o6j3k7j12K82Pj97J66P8j84l7J52j75P0j52j9M9jr7K5m2jl2J8J9
3287a58K1q1J18J05N1k4j70J56J26o5Qj0k09K65J27k45J78j83J92k47j9N1J09
3310I6j93J05jrl1J0l4j53K15j64P0j5J69o3j67K47J34j23N8r8J37j15J06J3r6
3335I8J38j40jpj6J9p4R7M5k57J19k31N4n3J77k43jQ5J8K34o7j2j16J20M0j9N
3362A2n0N5N7nj40N6J80p2J22j06K33j49M3j85j37L8K7k24orn8K11k38J37k4J15
$$ plain form
3388 -117 35 -34 -36 -8 -84 -25 60 43 220 152 -22 223 299 269 219 266 173 238 216 106 -85 -236 -148 -334 -404 -297
3414 -297 -93 -242 -279 -16 -11 -23 41 -150 3 46 28 101 -110 -16 183 69 159 201 381 367 383 335 219 183 35
3439 35 -28 -187 -300 -318 -422 -553 -340 -230 -123 -87 -158 -31 210 -80 27 100 34 193 259 42 97 233 237 340
3463 340 283 307 421 413 113 89 -148 -144 -256 -336 -411 -369 -508 -299 -142 -170 -139 -139 -57 22 -3 -69 187 104 32 -9 110
3490 110 177 82 271 237 401 351 322 328 145 71 -93 -116 -217 -257 -438 -452 -296 -312 -160 -134 32 -82 -126 78 -46
3515 -46 -20 102 25 75 86 30 91 165 219 234 420 393 313 311 158 -18 72 -125 -174 -308 -383 -260 -321 -373 -297 -170 88
3542 88 112 166 123 -28 99 -4 131 -10 155 -36 106 31 118 260 76 203 334 197 68 8 -24 -43 -168
3565 -168 -181 -207 -249 -232 -283 -95 -146 24 55 30 -101 -15 -3 6 0 -52 -108 88 1 24 15 259 133 109 229 89 34
$$ packed form
3388a17J52o9kK8p6N9Q5j7J77o8j74K45P6l0n0M7r3O5k2j10j91j51Q8j86p0J07
3414b97K04j49l7K63Nj2O4j91J53M3j8P3k11R4J99j14R0M2J80j4J6m8j16l6j48
3439C5o3j59j13j8j04j31K13J10J07L6p1J27K41k90J07P3o6J59O6k17N5J36MJ03
3463C40n7K4J14ql00k4k37Mj12q0p5M2j39K09J57k8L1%Q2P9k5o6K56q3p2m1J19
3490A10O7r5J89l4J64n0k9Oj83p4j64k3j01m0j81j4J56j6J52K6J66j14m4K04j24
3515d6K6J22p7N0J1n6O1P4N4J5J86k7q0kj53j76R0j97m9j34p5J23o1n2P6J27K58
3542H8K4N4m3j51J27j03J35j41J65j91J42p5Q7J42j84J27J31j37j29o0l2j9j25
3565a68j3k6m2J7n1J88n1J70L1k5j31Q6J2Ron2n6J96q7K3rK44j26k4J20j40n5
$$ plain form
3592 34 42 -81 -100 14 -158 -229 -406 -186 -253 -51 34 -40 177 174 -110 62 -17 6 0 146 -81 -129 -33 -52 57 134
$$ packed form
3592C4Qj23j9J14j72p1j77K20o7K02Q5p4K17lk84J72p9K3oJ46k27m8R6j9J09P7
$$ [...]
8191I4
##END NTUPLES=NMR FID
##END=
