##TITLE=1H_Pr 37-88-2
 CDCl3
 8 sc, 
 21.2.2023
##JCAMPDX= 6.0         $$ Bruker NMR JCAMP-DX V2.0
##DATA TYPE= NMR FID
##DATA CLASS= NTUPLES
##ORIGIN= UXNMR, Bruker Analytische Messtechnik GmbH
##OWNER= root
$$ XWIN-NMR		Version 3.5
$$ Tue Feb 21 18:43:28 2023 Russian Standard Time (UT+4h)  she@DPX200
##.OBSERVE FREQUENCY= 200.13135
##.OBSERVE NUCLEUS= ^1H
##.DELAY= (6, 6)
##.ACQUISITION MODE= SIMULTANEOUS
##.ACQUISITION SCHEME= undefined
##.AVERAGES= 8
##.DIGITISER RES= 18
##SPECTROMETER/DATA SYSTEM= spect
##.PULSE SEQUENCE= zg30
##.SOLVENT NAME= DMSO
##.SHIFT REFERENCE= (INTERNAL, DMSO, 0, 15.7039)
##AUDIT TRAIL= $$ (NUMBER, WHEN, WHO, WHERE, WHAT)
$$ ##TITLE= Audit trail, XWIN-NMR		Version 3.5
$$ ##JCAMPDX= 5.01
$$ ##ORIGIN= Bruker BioSpin GmbH
$$ ##OWNER= she
$$ F:/spectra/data/she/nmr/H-F/1/audita.txt
$$ ##AUDIT TRAIL=  $$ (NUMBER, WHEN, WHO, WHERE, WHAT)
(   1,<2023-02-21 18:42:24.64 +0400>,<she>,<DPX200>,
      <created by zg, POWCHK disabled, PULCHK disabled
       configuration hash MD5:
       00 E9 B6 7A A2 85 ED C7 34 08 36 98 17 FE 4E 26
       data hash MD5: 16K
       66 2A A9 00 77 95 8C E1 89 25 84 6E E6 B9 9E 72>)
$$ ##END=
$$ 
$$ hash MD5
$$ 2F 01 F8 58 85 06 A6 BA 55 8F 00 D8 C3 D2 9A 64
##$RELAX= 
##$RELAX= 
##$RELAX= 
##$RELAX= 
##$RELAX= 
##$RELAX= 
$$ Bruker specific parameters
$$ --------------------------
##$DU= <F:/spectra>
##$EXPNO= 1
##$NAME= <H-F>
##$PROCNO= 1
##$TYPE= <nmr>
##$USER= <she>
##$AMP= (0..31)
100 100 100 100 100 100 100 100 100 100 100 100 100 100 100 100 100 100 
100 100 100 100 100 100 100 100 100 100 100 100 100 100 
##$AQSEQ= 0
##$AQ_mod= 1
##$AUNM= <au_zg>
##$AUTOPOS= <>
##$BF1= 200.13
##$BF2= 200.13
##$BF3= 200.13
##$BF4= 200.13
##$BF5= 200.13
##$BF6= 200.13
##$BF7= 200.13
##$BF8= 200.13
##$BYTORDA= 1
##$CFDGTYP= 0
##$CFRGTYP= 5
##$CHEMSTR= <none>
##$CNST= (0..31)
1 1 145 1 1 1 1 1 1 1 1 1 1 1 1 1 1 1 1 1 1 1 1 1 1 1 1 1 1 1 1 1 
##$CPDPRG= <>
##$CPDPRG1= <>
##$CPDPRG2= <>
##$CPDPRG3= <>
##$CPDPRG4= <mlev>
##$CPDPRG5= <mlev>
##$CPDPRG6= <mlev>
##$CPDPRG7= <mlev>
##$CPDPRG8= <mlev>
##$CPDPRGB= <>
##$CPDPRGT= <>
##$D= (0..31)
0 1.2 0 0 0 0 0 0 0 0.06 0 0.03 0 0 0 0 0.0002 0 0 0 0 0 0 0 0 0 0 0 0 
0 0 0 
##$DATE= 1676990544
##$DBL= (0..7)
120 120 120 120 120 120 120 120 
##$DBP= (0..7)
150 150 150 150 150 150 150 150 
##$DBP07= 0
##$DBPNAM0= <>
##$DBPNAM1= <>
##$DBPNAM2= <>
##$DBPNAM3= <>
##$DBPNAM4= <>
##$DBPNAM5= <>
##$DBPNAM6= <>
##$DBPNAM7= <>
##$DBPOAL= (0..7)
0.5 0.5 0.5 0.5 0.5 0.5 0.5 0.5 
##$DBPOFFS= (0..7)
0 0 0 0 0 0 0 0 
##$DE= 6
##$DECBNUC= <off>
##$DECIM= 32
##$DECNUC= <off>
##$DECSTAT= 4
##$DIGMOD= 1
##$DIGTYP= 9
##$DL= (0..7)
0 120 120 120 120 120 120 120 
##$DP= (0..7)
150 150 150 150 150 150 150 150 
##$DP07= 0
##$DPNAME0= <>
##$DPNAME1= <>
##$DPNAME2= <>
##$DPNAME3= <>
##$DPNAME4= <>
##$DPNAME5= <>
##$DPNAME6= <>
##$DPNAME7= <>
##$DPOAL= (0..7)
0.5 0.5 0.5 0.5 0.5 0.5 0.5 0.5 
##$DPOFFS= (0..7)
0 0 0 0 0 0 0 0 
##$DQDMODE= 0
##$DR= 18
##$DS= 0
##$DSLIST= <SSSSSSSSSSSSSSS>
$$ [...]
##$SUBNAM2= <"">
##$SUBNAM3= <"">
##$SUBNAM4= <"">
##$SUBNAM5= <"">
##$SUBNAM6= <"">
##$SUBNAM7= <"">
##$SUBNAM8= <"">
##$SUBNAM9= <"">
##$SW= 18.05172834244
##$SWIBOX= (0..15)
0 0 2 0 0 0 0 0 0 0 0 0 0 0 0 0 
##$SW_h= 3612.71676300578
##$TD= 16384
##$TD0= 1
##$TE= 0
##$TE2= 300
##$TE3= 300
##$TEG= 300
##$TL= (0..7)
0 120 120 120 120 120 120 120 
##$TP= (0..7)
150 150 150 150 150 150 150 150 
##$TP07= 0
##$TPNAME0= <>
##$TPNAME1= <>
##$TPNAME2= <>
##$TPNAME3= <>
##$TPNAME4= <>
##$TPNAME5= <>
##$TPNAME6= <>
##$TPNAME7= <>
##$TPOAL= (0..7)
0.5 0.5 0.5 0.5 0.5 0.5 0.5 0.5 
##$TPOFFS= (0..7)
0 0 0 0 0 0 0 0 
##$TUNHIN= 0
##$TUNHOUT= 0
##$TUNXOUT= 0
##$USERA1= <user>
##$USERA2= <user>
##$USERA3= <user>
##$USERA4= <user>
##$USERA5= <user>
##$V9= 5
##$VALIST= <valist>
##$VCLIST= <CCCCCCCCCCCCCCC>
##$VD= 0
##$VDLIST= <DDDDDDDDDDDDDDD>
##$VPLIST= <PPPPPPPPPPPPPPP>
##$VTLIST= <TTTTTTTTTTTTTTT>
##$WBST= 1024
##$WBSW= 4
##$XGAIN= (0..3)
0 0 0 0 
##$XL= 0
##$YL= 0
##$YMAX_a= 860116
##$YMIN_a= -813818
##$ZGOPTNS= <>
##$ZL1= 120
##$ZL2= 120
##$ZL3= 120
##$ZL4= 120
##$ABSF1= 10
##$ABSF2= 0
##$ABSG= 5
##$ABSL= 3
##$ALPHA= 0
##$AQORDER= 0
##$ASSFAC= 0
##$ASSFACI= 0
##$ASSFACX= 0
##$ASSWID= 0
##$AUNMP= <proc_1d>
##$AZFE= 0.1
##$AZFW= 0.1
##$BCFW= 1
##$BC_mod= 2
##$BYTORDP= 1
##$COROFFS= 0
##$CY= 11.3945322036743
##$DATMOD= 1
##$DC= 2
##$DFILT= <>
##$DTYPP= 0
##$F1P= 2.36226072786647
##$F2P= -0.459571619588291
##$FCOR= 0.5
##$FTSIZE= 0
##$FT_mod= 4
##$GAMMA= 1
##$GB= 0.15
##$INTBC= 1
##$INTSCL= 1
##$ISEN= 128
##$LB= 0.24
##$LEV0= 0
##$LPBIN= 0
##$MAXI= 10000
##$MC2= 0
##$MEAN= 0
##$ME_mod= 0
##$MI= 1.114404
##$NCOEF= 0
##$NC_proc= 0
##$NLEV= 6
##$NOISF1= 3.799351
##$NOISF2= 2.8
##$NSP= 1
##$NTH_PI= 0
##$NZP= 0
##$OFFSET= 15.70392
##$PC= 1
##$PHC0= -19109.93
##$PHC1= 12.60074
##$PH_mod= 1
##$PKNL= yes
##$PPARMOD= 0
##$PSCAL= 0
##$PSIGN= 0
##$REVERSE= no
##$SF= 200.130013532006
##$SI= 16384
##$SIGF1= 3
##$SIGF2= 2
##$SINO= 400
##$SIOLD= 16384
##$SREGLST= <1H.CDCl3>
##$SSB= 0
##$STSI= 0
##$STSR= 0
##$SW_p= 3612.71676300578
##$SYMM= 0
##$S_DEV= 0
##$TDeff= 0
##$TDoff= 0
##$TI= <>
##$TILT= no
##$TM1= 0
##$TM2= 0
##$TOPLEV= 0
##$USERP1= <user>
##$USERP2= <user>
##$USERP3= <user>
##$USERP4= <user>
##$USERP5= <user>
##$WDW= 1
##$XDIM= 8192
##$YMAX_p= 0
##$YMIN_p= 0
$$ End of Bruker specific parameters
$$ ---------------------------------
##NTUPLES= NMR FID
##VAR_NAME=  TIME,          FID/REAL,        FID/IMAG
##SYMBOL=    X,             R,               I
##VAR_TYPE=  INDEPENDENT,   DEPENDENT,       DEPENDENT
##VAR_FORM=  AFFN,          ASDF,            ASDF
##VAR_DIM=   8192,          8192,            8192
##UNITS=     SECONDS,       ARBITRARY UNITS, ARBITRARY UNITS
##FACTOR=    0.0002768,     1,               1
##FIRST=     0,             0,               0
##LAST=      2.2672688,     0,               0
##MIN=       0,             -813818,         0
##MAX=       2.2672688,     860116,          0
$$ Real data points
##PAGE= N=1
##DATA TABLE= (X++(R..R)), XYDATA
$$ [...]
$$ plain form
1959 -1917 -1378 -985 146 337 430 1038 1417 1464 1323 1227 1503 1171 1029 1042 937 572 586 473 763 302 -4
1980 -4 -175 -232 -964 -1411 -1337 -1717 -1784 -2136 -1765 -1188 -1190 -612 79 323 258 750 1165 1047 884 889 978 806 547 921
2004 921 990 988 563 432 896 463 -66 164 -83 -347 -1289 -1355 -1197 -1690 -2142 -1610 -905 -1354 -1061 -33 150
2025 150 41 475 606 1028 824 970 1165 901 798 820 835 861 404 383 685 865 530 164 176 -311 -1126 -1529
2047 -1529 -1172 -1148 -1271 -1416 -777 -823 -683 -447 61 -13 108 477 802 529 342 296 796 439 339 512 810
2068 810 748 458 546 663 554 341 132 -92 -678 -734 -514 -708 -757 -1093 -595 -751 -1213 -582 -114 -192 -235 156
2090 156 611 201 -100 412 465 428 296 205 699 492 554 662 351 396 482 176 255 336 -18 10 -91 -120 -295
2113 -295 -744 -387 -487 -955 -802 -296 -825 -805 -737 -187 -128 -460 77 522 392 476 1021 944 423 583 714 437
$$ packed form
1959a917N39L93J131J91R3O08L79M7j41r6K76l32j42J3j05l65J4j13K90m61l06
1980dj71n7p32m47P4l80o7l52L71N77kN78O91K44o5M92M15j18j63NQ9j72k59L74
2004I21O9km25j31M64m33n29K30k47k64r42o6J58m93m52N32P05m49K93J028J83
2025A50j09M34J31M22k04J46J95k64j03K2J5K6m57k1L02J80l35l66J2m87q15m03
2047a529L57K4j23j45O39m6J40K36N08p4J21L69L25k73j87m6N00l57j00J73K98
2068H10o2k90Q8J17j09k13k09k24n86n6K20j94m9l36M98j56m62O31M68p8m3L91
2090A56M55m10l01N12N3l7j32r1M94k07O2J08l11M5Q6l06P9Q1l54K8j01k9j75
2113b95m49L57j00m68J53N06n29K0O8N50N9l32N37M45j30Q4N45p7n21J60J31k77
$$ plain form
2135 437 488 317 655 245 452 352 42 21 -45 -292 -473 -928 -820 -1091 -967 -1027 -1044 -845 -520 -138 136 119
2157 119 491 382 588 423 640 402 554 904 578 919 864 353 724 996 800 296 643 293 -836 -622
2177 -622 -833 -1022 -1561 -1814 -1388 -1594 -1457 -966 -170 -245 143 699 992 904 799 1238 903 679 621 877 229
2198 229 294 802 845 676 1328 858 504 211 19 -483 -1102 -1313 -1991 -2038 -2009 -2025 -1651 -1309 -586 176 1037 843
2220 843 1337 1760 1497 1280 1117 728 527 450 365 706 360 583 828 1027 669 790 387 24 -835 -1058 -1595
2241 -1595 -1677 -2438 -2292 -1866 -1532 -859 -133 450 857 1545 1570 1627 1449 1298 984 315 345 184 193 241 549 518
2263 518 806 1183 850 699 227 -191 -988 -1448 -2230 -2279 -2685 -2656 -2134 -1290 -785 33 756 1258 1807 2019 1911
2284 1911 1797 1462 735 507 42 -397 -311 -92 -190 83 224 455 615 138 379 -112 -718 -1437 -1717 -2370
$$ packed form
2135D37N1j71L38m10K07j00l10k1o6k47j81m55J08k71J24o0j7J99L25L82K74j7
2157A19L72j09K06j65K17k38J52L50l26L41n5n11L71K72j96n04L47l50j129K14
2177f22k11j89n39k53M26k06J37M91P96p5L88N56K93q8j05M39l35k24n8K56o48
2198B29O5N08M3j69O52m70l54k93j92n02o19k11o78m7K9j6L74L42P23P62Q61j94
2220H43M94M23k63k17j63l89k01p7q5L41l46K23K45J99l58J21m03l63q59k23n37
2241a595q2p61J46M26L34O73P26N83M07O88K5N7j78j51l14o69L0j61RM8L08l1
2263E18K88L77l33j51m72m18p97m60p82m9m06K9N22Q44N05Q18P23N02N49K12j08
2284A911j14l35p27k28m65m39Q6K19r8K73J41K31J60m77K41m91o06p19k80o53
$$ plain form
2304 -2370 -2300 -2202 -1673 -1082 -409 543 943 1656 2358 2297 1820 1766 1263 662 267 -512 -413 -861 -876 -736 -137 265
2326 265 444 504 493 213 -369 -617 -1083 -1693 -1986 -1905 -1658 -1464 -735 278 703 1404 2018 2327 2433 2336 1708
2347 1708 1229 139 -500 -995 -1200 -1323 -1516 -1130 -647 -414 120 503 505 453 373 -366 -471 -782 -1304 -1693 -1222
2368 -1222 -852 -415 493 1222 1755 2480 2179 2390 1932 1234 768 -176 -732 -1261 -1727 -1611 -1541 -1427 -1028 -155
2388 -155 157 470 565 329 184 -208 -190 -514 -985 -1040 -815 -347 -109 832 1353 1923 2058 2538 2116 1748 1104
2409 1104 115 -484 -1267 -1572 -2216 -1845 -1591 -1573 -884 -477 58 317 301 665 547 185 -263 -158 -300 -461
2429 -461 -405 22 413 1152 1304 1676 2019 1718 1521 1106 521 -171 -890 -1562 -1765 -2364 -2018 -1907 -1548 -885
2449 -885 -709 279 542 664 686 579 539 172 138 -114 -104 51 -22 465 894 1288 1208 1520 1493 914 641 340
$$ packed form
2304b370P0R8N29N91O73R52M00P13P02o1m77n4n03o01l95p79R9m48j5J40N99M02
2326B65J79O0j1k80n82k48m66o10k93Q1K47J94P29J013M25P01O14L09J06r7o28
2347A708m79j090o39m95k05j23j93L86M83K33N34L83Kn2q0p39j05l11n22l89M71
2368a222L70M37R08P29N33P25l01K11m58o98m66r44n56n29m66J16P0J14L99Q73
2388a55L12L13R5k36j45l92J8l24m71n5K25M68K38R41N21N70J35M80m22l68o44
2409A104r89n99p83l05o44L71K54J8O89M07N35K59j6L64j18l62m48J05j42j61
2429d61N6M27L91P39J52L72L43l01j97m15n85o92p19o72k03n99L46J11L59O63
2449h85J76R88K63J22K2j07m0l67l4k52J0J55p3M87M29L94q0L12k7n79k73l01
$$ plain form
2471 340 -401 -1068 -1581 -1668 -1816 -1806 -1499 -1087 -862 -677 -6 444 644 773 943 1008 488 458 304 87 504
2492 504 42 431 821 934 1254 957 983 540 124 -175 -174 -760 -1243 -1283 -1540 -1602 -1481 -1013 -821 -675 -59 228
2514 228 526 440 737 760 627 364 302 507 291 373 727 904 667 862 781 781 548 166 -154 -556 -772 -1336
2536 -1336 -1332 -1408 -960 -1073 -872 -437 -34 -129 335 385 463 469 428 569 539 314 337 368 306 674 586 755 532 319
2560 319 26 320 101 -209 -529 -412 -897 -1109 -968 -697 -669 -714 -362 60 -259 78 660 255 37 570 583
2581 583 456 481 463 593 530 316 407 304 -10 167 115 63 157 -41 -23 -153 -506 -188 -491 -362 -403 -548 -414
2604 -414 -257 -427 -418 -255 -170 -226 53 202 278 163 375 377 401 337 173 485 482 221 14 228 124 -66 -96 -121
2628 -121 -226 -123 -4 -104 62 -115 -194 -363 -246 -531 -380 -492 -110 -335 -7 -35 0 -21 237 135 338
$$ packed form
2471C40p41o67n13q7j48J0L07M12K25J85O71M50K00J29J70O5n20l0j54k17M17
2492E04m62L89L90J13L20k97K6m43m16k99Jn86m83m0k57o2J21M68J92J46O16K87
2514B28K98q6K97K3j33k63o2K05k16Q2L54J77k37J95q1%k33l82l20m02k16n64
2536a336Mp6M48j13K01M35M03r5M64N0P8Om1J41l0k25K3L1o2L68q8J69k23k13
2560C19k93K94k19l10l20J17m85k12J41K71K8m5L52M22l19L37N82m05k18N33J3
2581E83j27K5j8J30o3k14R1j03l14J77n2n2R4j98J8j30l53L18l03J29m1j45J34
2604d14J57j70RJ63Q5n6K79J49P6j15K12KK4o4j64L12lk61k07K14j04j90l0k5
2628a21j05J03J19j00J66j77p9j69J17k85J51j12L82k25L28k8L5k1K58j02K03
$$ plain form
2649 338 374 93 295 436 363 181 160 376 308 625 424 367 219 10 -142 -264 -546 -681 -636 -628 -994 -678 -166
2672 -166 -437 56 -4 485 139 485 403 379 195 255 218 84 -126 179 412 197 281 563 405 270 34 332
2694 332 129 -326 -496 -240 -708 -783 -817 -724 -973 -644 -398 -437 -55 375 557 502 583 577 401 234 288 92 124
2717 124 278 223 559 195 426 493 370 292 202 -158 -337 -623 -869 -833 -916 -836 -776 -786 -315 -121 56 349 145
2740 145 40 283 443 281 124 466 436 369 494 622 629 738 491 598 374 243 -18 -666 -755 -686 -1008 -1043
2762 -1043 -1020 -1097 -980 -370 -283 -10 -112 418 566 658 655 499 386 459 249 213 45 180 635 584 538 385 418
2785 418 761 423 -178 -200 -407 -634 -891 -994 -1113 -925 -762 -363 -461 -402 -5 335 271 373 212 377 316 77
2807 77 326 318 156 316 364 544 518 602 137 225 428 132 13 -325 -537 -522 -915 -803 -757 -607 -756 -369 -36
$$ packed form
2649C38L6k81K02J41p3j82k1K16o8L17k01n7j48k09j52j22k82j35M5Ql66L16N12
2672a66k71M93o0M89l46L46q2k4j84O0l7j34k10L05K33k15Q4K82j58j35k36K98
2694C32k03m55j70K56m68p5l4R3k49L29K46l9L82M30J82n5Q1oj76j67N4j96L2
2717A24J54n5L36l64K31O7j23p8r0l60j79k86k46L6q3Q0O0j0M71J94J77K93k04
2740A45j05K43J60j62j57L42l0o7J25J28PJ09k47J07k24j31k61o48q9O9l22l5
2762a043K3p7J17O10Q7K73j02N30J48R2lj56j13P3k10l6j68J35M55n1m6j53L3
2785D18L43l38o01k2k07k27k57j03j19J88J63L99r8N9L97L40o4J02j61J65o1k39
2807G7K49qj62J60M8J80k6Q4m65Q8K03k96j19l38k12J5l93J12M6J50j49L87L33
$$ plain form
2830 -36 130 232 169 169 242 297 260 264 81 157 210 383 219 174 561 513 470 381 369 -21 -278 81 -389 -648 -590 -684
2856 -684 -639 -591 -580 -373 -19 203 339 72 69 144 97 235 -73 191 140 342 235 273 394 123 384 373 373 299
2880 299 143 75 -155 -201 -187 -161 -613 -547 -258 -416 -107 106 -127 -48 1 -38 338 -208 -145 -60 9 -80 -41 126
2904 126 259 359 284 313 369 365 351 158 161 75 -129 -65 -411 -213 -354 -251 -68 -16 -202 103 285 77 136 -101
2928 -101 59 103 -362 -150 183 14 -163 176 222 133 272 280 378 451 -2 109 48 -322 74 1 -50 20 -525 -166
2952 -166 -54 -389 209 -84 -51 -91 -155 -238 -231 -140 7 -186 -343 33 77 12 262 161 201 536 299 562 139
2975 139 313 161 285 132 -231 -47 -188 -273 -170 -100 -149 -182 -83 -233 -423 -387 -102 -301 -113 -82 -37 -50 -156
2998 -156 -9 46 36 -17 235 513 242 184 313 311 322 119 179 42 -100 111 -214 -235 -98 -317 -314 -350 -356 -316 -461
$$ packed form
2830c6J66J02o3%P3N5l7Mj83P6N3J73j64m5L87m8m3q9j2l90k57L59m70k59N8r4
2856f84M5M8J1K07L54K22J36k67lP5m7J38l08K64n1K02j07L8J21k71K61j1%p4
2880B99j56o8k30m6J4K6m52O6K89j58L09K13k33P9M9l9L76n46O3Q5O9q9L9J67
2904A26J33J00p5K9N6mj4j93Lq6k04O4l46J98j41J03J83N2j86L05J82k08N9k37
2928a01J60M4m65K12L33j69j77L39M6q9J39QR8P3m53J11o1l70L96p3n1P0n45L59
2952a66J12l35N98k93L3m0o4q3PR1J47j93j57L76M4o5K50j01M0L35k37K63m23
2975A39J74j52J24j53l63J84j41q5J03P0m9l3R9j50j90L6K85j99J88L1M5j3j06
2998a56J47N5j0n3K52K78k71n8J29kJ1k03O0j37j42K11l25k1J37k19Ll6oM0j45
$$ plain form
3023 -461 -329 -226 -369 -398 -91 79 73 159 180 169 129 374 401 551 30 262 357 -38 23 34 209 -293 -150 -321
3047 -321 53 -52 -331 -365 -189 -99 -113 -337 -331 -16 -228 -272 -25 -248 -91 -90 159 13 181 209 516 493 391
3070 391 610 236 309 -51 -37 -180 -328 -262 -242 -350 -427 -233 -396 -521 -431 -331 -291 36 -40 -8 -21 -104 124 23
3094 23 332 173 133 286 550 186 556 320 425 280 40 276 132 -138 -328 3 -290 -213 -257 -440 -242
3115 -242 -122 -335 -20 176 129 -139 -1 49 2 163 -108 3 133 292 315 563 264 289 68 246 217 -22
3137 -22 -2 -151 -49 -77 -92 -202 -87 -49 -106 -7 94 -153 -41 -140 -311 -343 -103 -319 -9 35 -76 210 66
3160 66 50 396 -27 327 287 82 236 203 -176 39 -101 -324 -393 -295 -299 -133 -120 -236 -165 -49 20 -73 126 -219
3184 -219 -49 -179 -395 246 -139 164 -36 -31 150 226 331 169 -171 171 -94 -12 170 -118 121 23 -153 -135
$$ packed form
3023d61J32J03j43k9L07J70oQ6K1j1m0K45K7J50n21K32R5l95O1J1J75n02J43j71
3047c21L74j05k79l4J76R0j4k24OL15k12m4K47k23J57JK49j46J68K8L07k3j02
3070C91K19l74P3l60J4j43j48O6K0j08p7J94j63j25R0J00M0L27p6L2j3q3K28j01
3094B3L09j59m0J53K64l64L70k36J05j45k40K36j44k70j90L31k93P7m4j83J98
3115b42J20k13L15J96m7k68J38N0m7J61k71J11J30J59K3K48k99K5k21J78k9k39
3137b2K0j49J02k8j5j10J15L8n7R9J01k47J12r9j71l2K40k16L10M4j11K86j44
3160F6j6L46m23L54m0k05J54l3l79K15j40k23o9R8mJ66J3j16P1J16O9r3J99l45
3184b19J70j30k16O41l85L03k00NJ81P6J05j62l40L42k65Q2J82k88K39r8j76J8
$$ plain form
3206 -135 -114 -82 381 -125 -75 222 37 -241 129 -259 -199 -312 -59 -560 -96 -87 -152 -249 -55 68 4 231 7
3229 7 65 -7 46 300 -6 123 0 73 -38 -71 0 73 205 -30 -110 -127 15 -209 -143 -164 -283 -220 -164 33 154
3254 154 225 211 -32 194 -40 81 -40 134 -68 125 215 0 22 50 352 138 88 148 224 -129 -57 -286 -21
3277 -21 -316 -177 -90 -47 -19 -241 -315 -278 -26 -304 62 -32 -71 126 32 402 277 413 371 52 185 7 156
3300 156 322 -38 -117 85 -311 -147 -334 18 -123 148 -87 -36 -123 67 -29 -94 -84 -131 -71 -49 293 150 103
3323 103 120 384 36 118 140 342 190 4 198 -174 -152 91 -138 -285 -299 150 -149 193 -137 113 -180 -173
3345 -173 14 -429 -277 -151 -117 -113 -106 154 180 48 219 235 584 190 245 112 10 -82 -264 -151 -135 -339 -370 -210
3369 -210 -435 -23 -72 1 156 41 -2 -11 67 -71 -14 -327 -151 -181 -140 -202 266 67 222 270 262 466 154 29
$$ packed form
3206a35K1L2M63n06N0K97j85k78L70l88O0j13K53n01M64Ro5r7J94J23o4K27k24
3229GN8p2N3K54l06J29j23P3j11l3P1P3J32k35q0j7J42k24O6k1j19O3N6J97J21
3254A54P1j4k43K26k34J21j21J74k02J93R0k15K2K8L02k14n0O0P6l53P2k29K65
3277b1k95J39Q7M3K8k22p4L7K52k78L66r4l9J97r4L70j25J36m2l19J33j78J49
3300A56J66l60p9K02l96J64j87L52j41K71k35N1q7J90r6o5J0m7O0K2L42j43m7
3323A03J7K64l48Q2K2K02j52j86J94l72K2K43k29j47j4M49k99L42l30K50k93P
3345a73J87m43J52J26L4MPK60K6j32J71J6L49l94N5j33j02r2j82J13J6k04l1J60
3369b10k25M12m9P3J55j15m3rP8j38N7l13J76l0M1o2M68j99J55M8qK04l12j25
$$ plain form
3393 29 -260 -19 -376 -38 -440 29 37 82 -36 -3 107 385 279 -34 216 -56 -31 -271 -213 -150 -139 -90 -104 -374
3417 -374 100 18 -6 154 -54 -199 -256 -135 -100 -456 -19 55 -284 154 -96 140 219 284 400 399 203 165 27
3440 27 -237 -160 -220 -266 -601 -104 -515 23 99 -126 248 190 -78 -138 -182 -186 -216 -427 -139 -45 -240 45 332 379
3464 379 470 337 591 270 194 109 -122 24 -337 -307 -356 -359 -345 -251 -183 -27 8 -91 -105 2 8 -190 -301 -26 -495
3489 -495 -101 59 156 100 261 402 416 506 427 421 419 248 -447 -56 -350 -546 -659 -478 -380 -425 -275 -214 -10 -395
3513 -395 84 -98 -28 -35 -139 151 -175 -137 51 137 142 386 519 413 482 489 480 359 -128 -21 -158 -356 -520 -515 -430
3538 -430 -419 -206 -484 -465 -219 -145 97 -54 63 -249 -152 -350 -141 -7 518 580 314 522 281 753 495 287
3560 287 414 115 59 -228 -408 -475 -522 -623 -582 -356 -516 -35 -224 -209 -310 -60 -74 -184 -42 -202 126 -28
$$ packed form
3393B9k89K41l57L38m02M69QM5j18L3J10K78j06l13K50k72K5k40N8O3J1M9j4k70
3417c74M74q2k4J60k08j45n7J21L5l56M37P4l39M38k50K36P9O5J16jj96l8j38
3440B7k64P7o0m6l35M97m11N38P6k25L74n8k68o0m4ml0k11K88R4j95K85K87M7
3464C79R1j33K54l21p6q5k31J46l61L0m9lJ4R4O8J56L5r9j4J07Oj98j11K75m69
3489d95L94J60R7n6J61J41J4R0p9okj71o95L91k94j96j13J81R8m5J50O1K04l85
3513c95M79j82P0pj04K90l26L8J88Q6NK44J33j06O9Prj21m87J07j37j98j64NQ5
3538d30J1K13k78J9K46P4K42j51J17l12R7j98K09J34N25O2k66K08k41M72k58k08
3560B87J27k99n6k87j80o7m7j01M1K26j60M81j89J5j01K50j4j10J42j60L28j54
$$ plain form
3582 -28 106 -115 118 228 517 475 770 647 428 310 438 156 -139 -410 -303 -405 -708 -684 -662 -406 -196
3603 -196 -348 -348 100 -87 -5 -254 212 -110 11 -111 0 73 306 519 540 567 374 445 551 -28 479 106
3625 106 -336 -228 -269 -414 -470 -247 -241 -510 -365 -165 -264 -60 -59 31 -351 -79 -52 113 201 84 -6 355 334 421
3649 421 452 458 492 205 215 13 134 -144 -226 -398 -375 -294 -314 -285 -255 -343 -341 -94 -3 164 -95 -294 -37 -40 -37 96
3675 96 48 37 95 325 91 304 146 163 183 166 374 -124 96 6 -17 -98 -227 -89 -217 -219 -427 -115 -351 -216
3699 -216 -195 -235 -289 -301 114 80 121 -227 37 -74 -5 89 335 290 121 113 328 3 76 221 78 -6 -38 -254 -37
3724 -37 -336 -192 -98 82 -282 -41 127 -37 -270 -252 -177 122 -11 -28 174 311 72 160 171 42 -91 39
3746 39 280 169 -51 176 245 144 90 -18 -79 1 -182 -286 -206 -33 -118 -24 -255 -60 -331 -184 -113 -148 -144 -231
$$ packed form
3582b8J34k21K33J10K89m2K95j23k19j18J28k82k95k71J07j02l03K4K2K56K10
3603a96j52%M48j87Q2k49M66l22J21j22J11P3K33K13K1K7j93P1J06n79N07l73
3625A06m42J08m1j45n6K23Ok69J45K00r9K04JR0l82K72K7J65Q8j17r0L61k1Q7
3649D21L1OL4k87J0k02J21k78q2j72K3Q1k0K9L0q8KK47R1J67k59j99K57lLJ33
3675I6m8j1N8K30k34K13j58J7K0j7K08m98K20r0k3q1j29J38j28kk08L12k36J35
3699b16K1m0n4j2M15l4M1l48K64j11O9R4K46m5j69qK15l25P3J45j43q4l2k16K17
3724c7k99J44R4J80l64K41J68j64k33J8P5K99j33j7K02J37k39Q8J1j29j33J30
3746C9K41j11k20K27O9j01n4j08o1Q0j83j04Q0J73q5R4k31J95k71J47P1l5Mq7
$$ plain form
3770 -231 -134 -165 -124 132 88 226 156 110 125 -145 249 348 199 409 242 76 -39 5 -37 -328 -5 -93 57 -151
3794 -151 -67 -269 -226 24 -254 -147 -42 -57 -37 -4 312 -116 -176 121 165 -58 463 386 559 445 310 369 209
3817 209 220 -141 -18 -137 -158 -155 -160 -156 -317 -364 -131 -131 -45 -11 -188 -70 -146 -50 -34 66 186 -68 -16 22 263 23
3843 23 220 464 248 291 400 53 -197 -7 98 -149 -156 -184 -388 -293 -124 -50 -204 2 67 -85 -198 86 -203
3866 -203 -64 -58 49 7 -209 409 362 86 161 396 316 126 434 260 -40 -12 -52 -465 -271 -388 -318 -290 -463
3889 -463 -481 -116 -63 -98 -309 -172 -270 -23 86 -27 -109 -99 72 192 384 -129 116 110 72 148 173 238 37 219
3913 219 -31 -168 -22 -350 -149 -319 -157 -316 -109 -221 180 -10 -25 -55 -151 -104 -537 -35 -5 -23 174 -12
3935 -12 206 92 72 453 383 81 33 -180 -81 184 -206 -184 -182 -298 -94 -52 107 -111 -40 157 -90 -111 10 -130
$$ packed form
3770b31R7l1M1K56m4J38p0m6J5k70L94R9j49K10j67j66j15M4m2k91L23q8J50k08
3794a51Q4k02M3K50k78J07J05j5K0L3L16m28o0K97M4k23N21p7J73j14j35N9j60
3817B09J1l61J23j19k1LnMj61m7K33%Q6L4j77J18p6R6J6J00J20k54N2L8K41k40
3843B3J97K44k16M3J09l47k50J90J05k47pk8k04R5J69P4j54K06O5j52j13K84k89
3866b03J39OJ07m2k16O18m7k76P5K35q0j90L08j74l00K8m0m13J94j17P0K8j73
3889d63j8L65N3l5k11J37r8K47J09j13q2J0J71J20J92n13K45ol8P6K5O5k01J82
3913B19k50j37J46l28K01j70J62j59K07j12M01j90j5l0r6M7m33N02L0j8J97j86
3935a2K18j14k0L81p0l02m8k13R9K65l90K2Kj16K04M2J59k18P1J97k47k1J21j40
$$ plain form
3959 -130 36 -376 -16 122 -69 131 169 -5 183 -82 227 465 210 178 -95 52 41 10 28 -52 -343 -189
3981 -189 -273 -112 -9 -59 172 247 -30 -3 36 -44 -305 -324 -1 -55 108 -111 341 11 365 432 -10 14 -37 83
4005 83 -54 -124 49 -180 52 141 106 151 228 -62 302 89 177 -82 24 -119 -70 -118 -226 -266 5 -60 9 -12
4029 -12 -206 94 269 133 187 97 189 123 -169 -19 -11 51 -40 89 132 55 56 247 142 226 4 -124 -249 -157 -323
4054 -323 -128 -138 -68 -385 -254 29 18 142 331 296 63 113 -96 5 111 37 105 138 137 -111 252 316 4 24
4078 24 94 -183 -24 47 -339 -217 -191 -128 -218 -247 -249 -176 -297 102 -91 -225 139 -120 70 22 220 223 87 225
4102 225 174 145 221 108 154 211 287 -69 3 52 -301 -64 -286 -304 -282 -192 -215 -261 68 -179 -269 -78 -102 84 85 31
4128 31 264 215 176 180 184 157 117 94 134 179 116 -36 -112 -177 101 18 65 50 31 103 -199 -82 -251 -271 -242 55 72 -420
$$ packed form
3959a30J66m12L60J38j91K00L8j74J88k65L09K38k55l2k73J47j1l1J8q0k91J54
3981a89q4J61J03n0K31P5k77K7L9q0k61j9L23n4J63k19M52l30L54O7m42K4n1J20
4005H3j37p0J73k29K32Q9l5M5P7k90L64k13Q8k59J06j43M9m8j08m0K71o5O9k1
4029a2j94L00J75j36N4r0R2o6k92J50QO2r1J29M3p7JJ91j05Q4k22j28j25R2j66
4054c23J95j0P0l17J31K83j1J24J89l5k33N0k09J01J06p4O8L3jk48L63O4l12K0
4078B4P0k77J59P1l86J22K6O3r0k9kP3j21L99j93j34L64k59J90m8J98Lj36J38
4102B25n1k9P6j13M6N7P6l56P2M9l53K37k22j8K2R0k3m6L29k47r0J91k4J86Jn4
4128C1K33m9l9MMk7m0k3M0M5o3j52p6o5K78q3M7j5j9P2l02J17j69k0K9K97J7m92
$$ plain form
4156 -420 -146 263 -248 59 121 124 224 79 186 -103 217 -228 204 31 257 48 262 137 59 -47 -5 189
4178 189 -109 -238 -42 -392 -245 -206 -133 -122 -55 -97 253 42 252 102 -9 90 -48 223 79 121 -56 88
4200 88 134 -190 55 -52 68 111 54 -2 -113 -68 -200 -295 135 -339 30 -90 -174 -119 -145 50 80 108 -115 39
4224 39 146 139 -25 -63 -142 40 133 -36 64 47 -79 -304 -188 -76 -2 237 185 -378 -314 -77 -131 -120 -80 84
4248 84 -61 -304 -43 9 -199 124 148 214 113 4 104 -66 -13 119 -22 119 116 -78 196 220 314 248 49
4271 49 162 -103 -52 127 20 -52 -156 -294 -2 -68 -223 -18 -126 -145 7 54 79 -53 -19 -266 -104 150 95
4294 95 5 -6 112 275 14 50 185 89 48 -44 203 -97 -129 -58 -211 -237 -16 -227 145 78 -247 151 -182 -50
4318 -50 -163 -112 57 -114 -143 -178 -167 -27 -50 11 -32 166 19 353 76 174 48 186 67 32 -38 -370 -33 -230
$$ packed form
4156d20K74M09n11L07O2LJ00j45J07k89L20m45M32j73K26k09K14j25p8j06M2J94
4178A89k98j29J96l50J47L9P3J1O7m2L50k11K10j50j11R9j38K71j44M2j77J44
4200H8M6l24K45j07J20M3n7n6j11M5j32r5M30m74L69j20q4N5k6J95L0K8k23J54
4224C9J07pj64l8p9J82R3j69J00j7j26k25J16J12P4K39n2n63O4K37n4J1M0J64
4248H4j45k43K61N2k08L23K4O6j01j09J00j70N3J32j41J41lj94K74K4R4o6j99
4271D9J13k65N1J79j07p2j04j38K92o6j55K05j08j9J52M7K5j32L4k47J62K54n5
4294I5r0j1J18J63k61L6J35r6m1r2K47l00l2P1j53k6K21k11L72o7l25L98l33J32
4318e0j13N1J69j71k9l5J1J40k3O1m3J98j47L34k77R8j26J38j19l5p0l32L37j97
$$ plain form
4342 -230 -284 -191 -20 160 -64 -197 -111 -161 -273 -41 -3 39 310 10 93 90 28 229 307 67 278 237 71 189
4366 189 112 -31 128 -247 -136 -194 77 -402 -39 -291 -163 -186 -323 177 -240 -272 -12 -56 167 162 95 58 160
4389 160 295 119 578 208 312 218 232 315 119 39 -41 -88 44 -220 2 -38 -24 -320 -170 -74 -189 -265 -279 69
4413 69 -24 61 24 -122 -17 -28 160 -29 181 160 143 233 117 283 190 127 37 -71 69 -81 -2 -180 -300 -66
4437 -66 -138 -230 -365 -116 -15 -364 -164 -51 107 -113 -18 106 132 177 -71 16 -26 9 143 340 198 207 -40 206
4461 206 73 174 -255 93 -190 218 -245 -229 -26 -160 -337 -201 187 -126 -86 -79 65 20 -57 196 138 90 124
4484 124 44 61 120 54 208 44 13 -181 162 133 -162 192 192 -29 -56 -116 -53 -219 -194 -324 -107 -180 -223 -5 5
4509 5 -313 -143 -91 85 194 55 -199 -41 -61 -20 -177 169 163 112 262 367 -6 288 132 -73 35 -162 -295
$$ packed form
4342b30n4R3J71J80k24j33Q6n0j12K32L8M2K71l00Q3lo2K01P8k40K11m1j66J18
4366A89p7j43J59l75J11n8K71m79L63k52J28k3j37N00m17l2K60m4K23no7l7J02
4389A60J35j76M59l70J04r4J4Q3j96q0q0m7J32k64K22m0J4k96J50R6j15p6j4L48
4413F9r3Q5l7j46J05j1J88j89K10k1j7R0j16J66r3o3r0j08J40j50P9j78j20K34
4437f6p2r2j35K49J01l49K00J13J58k20R5J24K6M5k48Q7m2L5J34J97j42Rk47K46
4461B06j33J01m29L48k83M08m63J6K03j34j77J36L88l13M0PJ44m5p7K53n8m8L4
4484A24q0J7N9o6J54j64l1j94L43k9k95L54%k21k7o0O3j66K5j30K17p3m3K18J0
4509El18J70N2J76J09j39k54J58k0M1j57L46on1J50J05l73K94j56k05J08j97j33
$$ plain form
4532 -295 -9 -82 62 -179 -66 -57 -169 48 -268 -76 -203 54 -383 78 -54 -82 115 6 -47 18 84 -38
4554 -38 69 172 198 296 125 -22 -125 6 -94 -183 -61 -275 54 -134 -127 -189 -146 -47 -188 -48 -158 -140 -20
4577 -20 -175 7 9 -52 194 156 164 174 125 185 462 172 105 311 132 228 -6 36 -80 -229 -85 -298 -218 -117 -21
4602 -21 -265 -240 65 -75 -89 94 52 69 -145 6 -31 26 142 605 241 457 306 257 115 105 -43 245 -11
4625 -11 43 -62 17 -155 -330 -196 -157 89 41 -233 -155 -76 -159 -309 69 -297 -212 188 111 179 268 125 446 103
4649 103 152 503 149 249 151 231 79 -23 -332 -300 -285 -191 -26 -121 -440 -278 -288 -107 -258 -121 -125 -360 -378 -11
4673 -11 40 168 62 173 256 233 404 307 205 93 193 -8 260 -47 -36 107 -293 137 -310 53 103 51 -409
4696 -409 -77 -26 -180 -79 -257 -167 -67 -82 101 -142 -139 222 162 345 494 383 279 356 119 67 160 51 -258
$$ packed form
4532b95K86p3J44k41J13Rj12K17l16J92j27K57m37M61j32k8J97j09n3O5O6j22
4554c8J07J03K6R8j71j47j03J31j00q9J22k14L29j88Po2M3R9j41J40j10J8J20
4577b0j55J82Ko1K46l8QJ0m9O0K77k90o7K06j79R6k34M2j16j49J44k13Q0J01R6
4602b1k44K5L05j40j4J83m2J7k14J51l7N7J16M63l64K16j51m9j42j0j48K88k56
4625a1N4j05P9j72j75J34L9K46m8k74P8P9q3j50L78l66Q5M00p7O8Q9j43L21l43
4649A03M9L51l54J00r8Q0j52j02l09L2J5R4J65r5l19J62j0J81j51J37mk35j8L67
4673a1N1J28j06J11Q3k3J71r7j02j12J00k01K68l07J1J43m00M30m47L63N0n2m60
4696d09L32N1j54J01j78R0J00j5J83k43LL61o0J83J49j11j04P7k37n2R3j09l09
$$ plain form
4719 -258 -45 -137 -40 -354 -302 -55 -228 -49 -7 -201 -75 -275 -428 -178 -261 -48 -137 161 30 -247 271 315
4741 315 431 260 198 358 -6 315 111 -79 -7 -191 -145 -210 -182 -75 -318 -314 218 8 108 -103 -175 -220 -412
4764 -412 -283 -95 -334 119 143 -72 423 190 66 344 114 248 -5 158 27 -82 -112 -215 61 -76 -221
4785 -221 -215 77 -126 -274 -152 -96 -39 -81 -111 -209 -291 -94 -93 -131 269 -40 42 136 67 -41 306 98 -77 197 86
4810 86 89 -60 -158 -96 178 35 43 -100 -176 -27 -101 -134 110 -182 -204 -323 -60 111 -93 -77 24 66 108 -106 45
4835 45 -47 101 164 -83 -69 26 -256 -15 -281 -99 108 -231 409 81 10 26 86 7 177 -82 -178 -96 -123 -176
4859 -176 -179 -102 -75 -182 -300 -89 60 -57 128 -44 51 95 -160 269 81 232 110 107 65 -68 114 -115 105
4882 105 -9 -9 -134 -219 -230 3 -329 -384 153 -149 -185 -274 -89 -177 -42 -143 10 -62 73 -166 286 187 139 231
$$ packed form
4719b58K13r2R7l14N2K47j73J79M2j94J26k00j53K50q3K13q9K98j31k77N18M4
4741C15J16j71o2J60l64L21k04j90P2j84M6o5K8J07k43MN32k10J00k11p2m5j92
4764d12J29J88k39M53K4k15M95k33j24K78k30J34k53J63j31j09l0j03K76j37j45
4785b21OK92k03j48J22N6N7m2l0r8q2J97Jl8M00l09Q2R4o9j08L47k08j75K74j11
4810H6Lj49r8O2K74j43Qj43p6J49p4l3K44k92k2j19K63J71k04J6J01M2M2k14J51
4835D5r2J48O3k47J4R5k82K41k66J82K07l39O40l28p1J6O0p9J70k59r6Q2k7n3
4859a76lP7K7j07j18K11J49j17J85j72R5M4k55M29j88J51j22lm2j33J82k29K20
4882A05j14%j25q5j1K33l32n5N37l02l6q9J85q8J35j01J53p2J35k39M52r9m8R2
$$ plain form
4906 231 -11 263 41 15 -51 -74 -139 180 243 -131 45 -159 -3 34 -47 -67 -77 -118 -280 -212 -47 -250 119 -96
4930 -96 206 -29 33 155 -58 223 227 217 -19 66 124 -274 199 35 163 41 -217 -100 61 238 -114 119
4952 119 59 -86 -303 -169 -101 -394 -300 -130 -276 -113 179 -7 -351 266 -23 312 206 284 367 -27 91 -4
4974 -4 -49 17 -175 14 -128 -42 10 -10 11 -146 248 59 -314 -32 165 -39 -116 -47 -60 -101 -71 160 286 131
4998 131 142 218 65 31 40 -5 -73 170 -28 -15 -49 50 -214 282 202 229 155 -360 92 -157 -38 -211 -73 -219
5022 -219 -96 -152 -151 -72 158 -77 221 87 72 219 134 223 -41 89 33 -22 35 -65 163 150 -62 207 49 -181
5046 -181 -77 -221 24 57 -329 -159 -19 -159 39 133 20 -56 -192 -140 103 -45 111 -30 -141 -18 -46 -30
5068 -30 60 -57 143 6 123 95 71 77 15 456 73 -107 -109 -119 -123 -220 -123 -154 19 68 -73 87 17 145 85 37
$$ packed form
4906B31k42K74k22k6o6k3o5L19O3l74J76k04J56L7q1k0j0m1j62O8J65k03L69k15
4930i6L02k35O2J22k13K81Mj0k36Q5N8l98M73j64J28j22k58J17J61J77l52K33
4952A19o0j45k17J34O8k93R4J70j46J63K92j86l44O17k89L35j06P8Q3l94J18r5
4974dm5O6j92J89j42Q6N2k0K1j57L94j89l73K82J97k04p7O9j3m1L0K31J26j55
4998A31J1P6j53l4Rm5o8K43j98J3l4R9k64M96q0K7p4n15M52k49J19j73J38j46
5022b19J23n6JP9K30k35K98j34j5J47q5Q9k64J30n6n5N7j00K28j3k12K69j58k30
5046a81J04j44K45L3l86J70J40j40J98R4j13p6j36N2K43j48J56j41j11J23k8J6
5068c0R0j17K00j37J17k8k4Oo2M41l83j80kj0mr7R7l1J73M9j41J60p0J28o0m8
$$ plain form
5094 37 -206 119 173 -116 -7 161 52 287 61 161 58 276 -137 178 153 187 -93 -243 -117 -229 -187 -26
5116 -26 -40 -306 -56 -160 -204 -24 -53 12 77 -99 -112 -184 -33 129 27 176 93 273 230 75 65 -11 264 97
5140 97 160 -51 -31 -133 -38 -49 -10 -145 -46 -384 -32 10 -100 -108 -98 -142 -88 202 -50 25 -249 5 -126 80 -27
5165 -27 92 419 414 30 13 -71 -32 178 -213 -228 -154 -4 -162 -149 -281 159 -65 -227 -134 84 -270 21 11 -293
5189 -293 9 -23 113 -174 16 5 170 -85 595 -9 125 295 107 125 108 -13 -195 -48 -252 -255 -131 -104
5211 -104 -37 -89 -205 -56 -194 -105 -187 -6 -160 -39 116 25 183 145 24 -18 34 238 -180 137 171 80 -33
5234 -33 -82 -346 72 -31 -280 41 -353 -115 -119 -91 -157 -300 -143 16 -89 22 71 28 93 159 -85 48 -35 352
5258 352 51 368 121 360 296 71 -43 -120 72 1 -191 -250 62 -42 36 104 -94 -141 -39 -148 -178 -90 -132
$$ packed form
5094C7k43L25N4k89J09J68j09K35k26J00j03K18m13L15k5L4k80j50J26j12M2J61
5116b6j4k66K50j04m4J80k9O5O5j76j3p2J51J62j02J49q3J80m3j55j0p6K75j67
5140I7O3k11K0j02R5j1L9j35R9l38L52M2j10qJ0m4N4K90k52P5k74K54j31K06j07
5165b7J19L27nl84j7q4L9K10l91j5P4J50j58J3j32M40k24j62R3K18l54K91j0l04
5189b93L02l2J36k87J90j1J65k55O80o04J34J70j88J8j7j21j82J47k04lJ24K7
5211a04O7n2j16J49j38Q9q2J81j54J21J55r1J58l8j21m2N2K04m18L17L4r1j13
5234c3m9k64M18j03k49L21l94K38mK8o6j43J57J59j05J11M9m3O5O6k44J33q3L87
5258C52l01L17k47K39o4k25j14p7J92p1j92n9L12j04P8O8j98m7J02j09l0Q8m2
$$ plain form
5281 -132 -8 152 32 -189 -10 -115 121 -17 190 68 100 113 -32 234 34 206 -34 62 202 49 38
5302 38 -302 -199 -152 -281 28 -299 -334 93 -259 -377 -201 15 -188 19 62 180 59 139 68 12 314 65
5324 65 203 173 104 24 9 12 -27 417 40 -146 -281 -261 429 26 -65 -144 -126 -78 -124 -55 -113 87 34 -210 23 -205
5350 -205 -52 -19 115 -138 175 107 148 188 -8 30 166 65 217 46 -16 -75 -56 157 -135 -166 -211 -260 -312 120
5374 120 -92 -252 -99 -103 -151 -12 -233 60 33 -105 -91 -22 254 108 -98 404 35 341 196 353 230 84
5396 84 190 -119 123 -70 37 -109 185 -153 -11 -99 11 -237 -50 164 61 114 -146 -123 -3 244 58
5417 58 254 229 -15 87 231 64 35 86 70 313 91 82 -103 26 56 104 -44 -88 -258 49 -262 -172 -219 -148
5441 -148 -283 31 -120 -262 -362 -172 -16 192 115 154 251 406 242 370 218 14 241 262 46 32 49 -172
$$ packed form
5281a32J24J60j20k21J79j05K36j38K07j22L2J3j45K66k00J72k40R6J40j53j1
5302C8l40J03M7j29L09l27l5M27l52j18J76K16k03K07M3J18j21Q0p1n6L02k49
5324F5J38l0o9q0j5Ll9M44l77j86j35K0O90m03r1p9J8M8m6O9n8K00n3k44K33k28
5350b05J53L3J34k53L13o8M1M0j96L8J36j01J52j71o2n9J9K13k92l1m5m9n2M32
5374A20k12j60J53mm8J39k21K93k7j38J4O9K76j46k06N02l69L06j45J57j23j46
5396H4J06l09K42j93J07j46K94l38J42q8J10k48J87K14j03N3k60K3J20K47j86
5417E8J96k5k44J02J44j67k9N1j6K43k22rj85J29L0M8j48m4j70L07l11R0m7P1
5441a48j35L14j51j42j00J90J56K08p7L9R7J55j64J28j52k04K27K1k16j4J7k21
$$ plain form
5463 -172 -168 -63 108 -160 -167 -252 -295 -30 -169 -155 33 -433 -336 -145 78 -47 152 60 -56 229 0 126 487
5486 487 305 -44 178 38 153 208 77 14 -20 -99 -167 29 30 37 -71 -16 -273 -161 -35 -131 -196 -181 -27 -61 -240
5511 -240 -287 107 318 302 207 321 300 -1 113 70 105 119 -57 115 -28 -103 -164 -35 -197 -92 -158 -197 -240 -233 -47
5536 -47 -190 -279 -165 -41 19 56 -17 77 50 72 181 54 47 271 23 102 133 342 159 82 33 108 -34 -22 104
5561 104 -110 -114 -173 -149 -215 -98 -10 57 -202 -145 -8 -192 231 93 -59 70 -106 36 -55 101 278 140 -46
5584 -46 -85 -32 -24 -122 102 76 33 111 -99 -113 -24 -39 -105 -192 53 -262 -232 -116 -218 228 -259 -50 -118 143 -35
5609 -35 170 28 347 -143 -33 190 42 -114 249 108 212 53 105 1 49 195 -120 -217 17 -35 -214 -51
5631 -51 -109 -102 118 57 -152 -37 -186 -18 8 -180 248 -36 -105 35 137 124 108 412 225 66 -21 145 -126
$$ packed form
5463a72MJ05J71k68pq5m3K65j39J4J88m66R7J91K23j25J99r2j16K85k29J26L61
5486D87j82l49K22j40J15N5j31o3l4p9o8J96JPj08N5k57J12J26r6o5J5J54l4j79
5511b40m7L94K11j6r5J14k1l01J14m3L5J4j76J72j43p5o1J29j62J05o6l9m3PJ86
5536d7j43q9J14J24O0L7p3R4k7K2J09j27pK24k48P9L1K09j83p7m9P5j42J2J26
5561A04k14mn9K4o6J17Q8O7k59N7J37j84M23j38j52J29j76J42r1J56J77j38j86
5584d6l9N3Qr8K24k6m3P8k10j4Q9j5o6q7K45l15L0J16j02M46m87K09o8K61j78
5609c5K05j42L19m90J10K23j48j56L63j41J04j59N2j04M8J46l15r7K34n2j79J63
5631e1n8PK20o1k09J15j49J68K6j88M28k84o9J40J02j3j6L04j87j59q7J66k71
$$ plain form
5654 -126 40 177 -129 26 -28 -283 -337 -217 -30 -182 -109 -233 -46 -245 -291 84 11 36 112 89 385 27 101
5677 101 166 -185 27 170 270 -49 127 -65 96 175 -33 -56 128 -37 -70 -184 -248 -200 -176 -238 176 -154 -340
5700 -340 -133 -223 79 -37 -63 403 205 352 82 276 209 -50 177 371 -93 201 166 77 -113 -63 10 36 -153
5723 -153 131 26 -105 -297 -185 -44 -66 -52 -62 -45 112 -12 -202 151 79 -10 104 179 -76 227 161 375 56
5746 56 17 -50 156 6 -114 156 339 155 -135 -228 -184 -1 -183 -223 -1 -141 -127 -180 57 -30 -38 63 5 134
5770 134 135 115 -4 250 200 306 -90 -77 63 129 -66 -19 147 -45 -139 72 -28 -23 -310 -69 -98 25 -30 -87
5794 -87 71 -88 -220 -160 -107 2 33 217 78 -122 208 -1 -129 -63 -22 133 21 -122 78 151 25 -70 -258
5817 -258 -140 -3 -14 -96 -179 -2 -52 -289 -176 -292 -83 5 -271 84 -13 106 195 16 119 -52 89 56 111
$$ packed form
5654a26J66J37l06J55n4k55n4J20J87j52P3j24J87j99m6L75p3K5P6k3K96l58P4
5677A01O5l51K12J43J00l19J76j92J61P9k08k3J84j65l3j14o4M8K4o2M14l30j86
5700c40K07r0L02j16k6M66j98J47k70J94o7k59K27J94m64K94l5q9j90N0P3K6j89
5723a53K84j05j31j92J12J41k2J4j0J7J57j24j90L53p2q9J14P5k55L03o6K14l19
5746E6l9o7K06j50j20K70J83j84k90r3M4J83j82m0K22j40J4n3K37q7qJ01n8J29
5770A34Jk0j19K54n0J06l96J3J40O6j95M7J66j92r4K11j00Nk87K41k9J23n5n7
5794h7J58j59j32O0N3J09L1J84j39k00L30k09j28O6M1J55j12j43K00P3j26r5j88
5817b58J18J37j1q2q3J77n0k37J13j16K09Q8k76L55r7J19Q9j79J03j71J41l3N5
$$ plain form
5840 111 81 128 -7 -98 -74 -2 28 207 -54 141 -193 -131 -115 -14 130 -99 -155 -240 44 -59 -13 99 -393 102
5864 102 -133 -134 101 17 -90 -195 -31 7 48 62 139 189 -118 16 85 55 137 52 254 -97 -270 -78 -129 17
5888 17 179 -169 143 89 133 -39 133 -26 144 242 -117 -63 -110 -15 121 -30 102 88 -85 -63 115 -4 -128
5911 -128 163 48 38 -57 -189 -29 143 -89 -13 -276 -211 -138 -115 -83 248 -38 173 -85 67 -22 242 284 -82
5934 -82 25 -14 67 240 227 115 -40 43 145 228 128 -68 214 -97 -1 -155 149 50 -113 -227 -109 -152 -345
5957 -345 60 -174 -239 -54 -127 179 -9 231 47 236 121 -11 24 3 118 39 256 201 -94 114 -267 -160
5979 -160 -283 -116 -8 -113 -160 -93 -368 -31 -156 -47 0 -146 92 -87 -37 -8 -159 -75 -89 -37 102 53 4
6002 4 -21 103 -106 206 139 184 -55 169 -206 -149 -102 52 -393 -45 -228 -193 89 -288 -142 -177 -95 -127 262 -105
$$ packed form
5840A11l0M7j35r1K4P2L0J79k61J95l34O2J6J01J44k29n6q5K84j03M6J12m92M95
5864A02k35jK35q4j07j05J64L8M1J4P7N0l07J34O9l0Q2q5K02l51j73J92n1J46
5888A7J62l48L12n4M4j72J72j59J70R8l59N4m7R5J36j51J32j4j73K2J78j19j24
5911a28K91j15j0r5j32J60J72k32P6k63O5P3K3L2L31k86K11k58J52q9K64M2l66
5934h2J07l9Q1J73j3j12j55Q3J02Q3j00j96K82l11R6j54L04r9j63j14J18m3j93
5957c45M05k34o5J85p3L06j88K40j84J89j15j32L5k1J15p9K17n5k95K08l81J07
5979a60j23J67J08j05m7O7k75L37j25J09M7j46K38j79N0K9j51Q4j4N2J39m9m9
6002Dk5J24k09L12o7M5k39K24l75N7M7J54m45L48j83L5K82l77J46l5Q2l2L89l67
$$ plain form
6026 -105 98 -55 51 151 442 233 1 187 25 8 292 -41 26 121 230 -47 32 88 -6 -201 -94 -284
6048 -284 -276 -60 -328 -235 -159 -98 77 -87 -265 130 51 72 -80 149 2 267 336 239 191 -36 218 -14 144
6071 144 -43 -144 -27 -40 -165 -35 -256 77 -282 -267 -147 -138 -109 -22 105 -112 -37 10 89 163 166 -156 74 65 17
6096 17 104 19 321 -55 7 227 67 272 59 69 71 71 141 -214 -67 -281 -17 -195 -97 63 -208 -174 10 279
6120 279 277 253 143 -170 159 114 62 51 104 211 -34 305 56 370 280 42 -44 95 76 133 -198 101 59 39
6144 39 89 -46 133 6 -192 -307 -35 4 -72 -93 -62 -433 132 158 -249 198 189 270 69 8 464 406 95 160
6168 160 46 31 -120 -7 -132 -171 99 -142 -43 -43 131 4 -14 -36 -34 -66 -80 -15 -9 -232 131 -278 -59 137 130
6193 130 226 9 64 223 318 -55 181 -26 -103 11 -255 -63 -172 203 -149 232 -260 21 -100 13 -157
$$ packed form
6026a05K03j53J06J00K91k09k32J86j62j7K84l33O7R5J09k77P9N6r4j95J07j90
6048b84QK16k68R3P6O1J75j64j78L95p9K1j52K29j47K65O9r7m8k27K54k32J58
6071A44j87j01J17j3j25J30k21L33l59J5J20RK9Q7J27k17P5M7P9P4Ll22K30rm8
6096A7Q7q5L02l76O2K20j60K05k13J0K%P0l55J47k14K64j78R8J60k71L4J84K69
6120B79kk4j10l13L29m5n2j1N3J07k45L39k49L14r0k38q6J39j9N7l31K99m2k0
6144C9N0j35J79j27j98j15K72L9p6k1L1l71N65K6m07M47rQ1k01o1M56n8l11O5
6168A60j14j5j51J13j25l9K70k41R9%J74j27j8k2Kl2j4O5Ok23L63m09K19J96p
6193A30R6k17N5J59R5l73K36k07p7J14k66J92j09L75l52L81m92K81j21J13j70
$$ plain form
6214 -157 -3 -10 -39 -231 -113 -54 -36 34 120 159 54 270 80 245 8 100 197 40 7 76 -167 25 -62 -173
6238 -173 69 -246 -3 -93 100 30 -260 -269 -142 -222 -195 218 -146 27 -210 30 83 300 -12 131 192 139 229
6261 229 142 84 -89 65 -38 -145 -102 -8 -68 -88 -37 -93 -6 -174 -68 -201 108 -246 -339 -286 203 4 -190 337
6285 337 -23 226 -114 -21 249 280 -55 21 148 144 240 -186 -73 117 -80 255 53 172 139 117 -271 -109 -162
6308 -162 -268 -45 -157 -14 -9 -21 -41 128 -68 37 72 223 374 -63 199 84 -115 285 216 210 -354 77 148
6331 148 -85 -71 -99 221 -279 115 -51 -100 174 -118 -109 -105 -51 -80 87 -11 -212 -20 -35 295 262 145 44 142
6355 142 85 -68 10 58 -106 -54 -4 -58 47 -195 -20 -239 -86 -268 -221 -301 -232 -154 88 -85 -159 65 153 -127
6379 -127 4 -99 56 -27 27 158 31 142 127 187 228 262 163 133 -133 84 13 1 154 168 62 -20 191 -123
$$ packed form
6214a57J54pk9j92J18N9J8P0Q6L9j05K16j90J65k37R2R7j57l3O9k43J92q7j11
6238a73K42l15K43r0J93p0k90rJ27q0K7M13l64J73k37K40N3K17l12J43O1n3R0
6261B29q7n8j73J54j03j07M3R4o0k0N1n6Q7j68J06j33L09l54r3N3M89j99j94N27
6285C37l60K49l40R3K70L1l35P6J27mR6m26J13J90j97L35k02J19l3k2l88J62n3
6308a62j06K23j12J43Nj2k0J69j96J05L5J51J51m37K62j15j99M00o9on64M31P1
6331A48k33J4k8L20n00L94j66m9K74k92RMN4k9J67r8k01J92j5L30l3j17j01R8
6355A42n7j53P8M8j64N2N0n4J05k42J75k19J53j82M7q0O9P8K42j73p4K24Q8k80
6379a27J31j03J55q3N4J31j27J11j5O0M1L4r9l0k66K17p1j2J53J4j06q2K11l14
$$ plain form
6403 -123 -223 -51 -218 -389 70 -303 77 -35 -11 -124 274 101 205 190 -14 192 155 171 -104 -6 227 84
6425 84 45 25 -46 53 -180 148 -102 94 -27 -44 -190 -186 -79 -355 -128 23 -141 215 320 -74 -121 -307 162
6448 162 9 457 8 -296 -8 218 142 -161 326 245 185 -183 -79 108 -274 -30 23 -160 99 48 -23 -309
6470 -309 -2 -95 -154 -187 -138 -7 155 77 42 -72 -39 163 62 59 25 -72 45 75 -120 23 -108 159 -12 -70
6494 -70 188 -56 -98 -144 -154 -199 -204 36 -302 -315 -242 -149 -212 -273 -148 -13 -4 85 70 76 56 128 248 213 99 504 -153
6521 -153 -53 271 -131 26 138 102 0 -16 -151 -124 -292 -129 1 -63 -127 66 -14 35 45 -180 127 -113 128
6544 128 167 267 237 213 -114 18 -106 113 93 4 -49 58 -332 -334 -205 -272 -249 49 -146 -119 -324 -124 -179 -213
6568 -213 131 -123 -220 210 -39 26 50 115 283 62 339 11 54 -54 68 33 205 219 -2 -30 47 -53 48
$$ packed form
6403a23j00J72j67j71M59l73L80j12K4j13L98j73J04j5k04K06l7J6k75R8K33j43
6425H4l9k0p1R9k33L28k50J96j21j7j46MJ07k76K27J51j64L56J05l94m7j86M69
6448A62j53M48m49l04K88K26p6l03M87q1o0l68J04J87l82K44N3j83K59n1p1k86
6470c09L07r3n9l3M9J31J62p8l5j14L3K02j01ll4r7J17L0j95J43j31K67j71n8
6494g0K58k44m2m6j0m5nK40l38j3P3R3o3o1J25J35RQ9j5Ok0P2J20l5j14M05o57
6521a53J00L24m02J57J12l6j02j6j35K7j68J63J30o4o4J93q0M9J0k25L07k40K41
6544A28L9J00l0k4l27J32j24K19k0q9n3J07l90kJ29o7K3K98j95K7k05K00n5l4
6568b13L44k54r7M30k49O5K4O5J68k21K77l28M3j08J22l5J72J4k21k8P7j00J01
$$ plain form
6591 48 -173 -158 -263 79 -179 -248 -244 -141 190 -219 -385 29 290 50 135 115 137 26 330 31 -25 -95 109
6614 109 -9 -10 111 88 120 376 -44 -86 204 80 -14 -97 -8 -503 38 -22 -81 78 -13 -59 -195 345 -29 19
6638 19 236 119 126 -160 97 349 52 -8 78 133 65 36 -42 -96 -215 -68 20 -79 -172 5 -178 -103 -177 31 -88
6663 -88 -111 88 56 -124 -106 -90 -12 29 136 209 -158 158 -164 8 -10 44 123 35 31 221 38 -265 -54 109 55
6688 55 7 -149 -38 85 84 131 -73 -265 24 -165 109 58 -172 -102 9 -2 -25 -8 170 -9 78 325 152 164
6712 164 -95 -95 -55 -13 -71 -90 233 -11 -13 -143 -131 -196 -69 95 -35 -30 -23 0 -417 62 -206 81 25 7 85 166
6738 166 77 -20 66 -75 -17 18 80 22 133 59 -10 -112 64 -59 -111 -126 -47 -96 -105 -275 -106 -260 -189 -142 -53 -2
6764 -2 -299 -141 138 54 -21 122 129 -47 102 233 121 287 -119 109 97 -7 -2 28 -115 70 225 2 -212
$$ packed form
6591D8k21J5j05L42k58o9MJ03L31m09j66M14K61k40Q5k0K2j11L04k99n6p0K04
6614A09j18jJ21k3L2K56m20m2K90j24r4q3Q9m95N41o0n9J59r1m6j36N40l74M8
6638A9K17j17Pk86K57K52k97o0Q6N5o8k9p8n4j19J47Q8r9r3J77j83P5p4K08j19
6663h8k3J99l2j80J8J6P8M1J07P3l67L16l22J72j8N4P9q8mJ90j83l03K11J63n4
6688E5m8j56J11J23jM7k04j92K89j89K74n1k30P0J11j1k3J7J78j79Q7K47j73J2
6712A64k59%M0M2n8j9L23k44kj30J2o5J27J64j30NPK3m17M79k68K87n6j8P8Q1
6738A66q9r7Q6j41N8L5O2n8J11p4o9j02J76j23n2j5P9m9rj70J69j54P1M7Q9N1
6764bk97J58K79q4p5J43Pj76J49J31j12J66m06K28j2j04NL0j43J85J55k23k14
$$ plain form
6787 -212 -257 51 -185 58 -109 -181 -80 -64 90 -193 -74 55 18 36 -200 115 -223 44 -101 -118 87 278
6809 278 4 -47 -26 -15 89 -189 4 -339 116 -101 -178 -55 77 -191 -201 82 -82 64 -196 -323 -54 -68
6831 -68 137 66 -32 -119 136 55 230 86 -60 -34 9 161 213 41 57 -101 -286 -138 -143 -37 -76 15 -291 -6
6855 -6 -28 -357 -19 -162 -71 -81 12 -12 8 -15 -17 93 129 187 144 27 108 57 300 -157 -117 28 249 122 -88 -97
6881 -97 -129 -70 -197 -159 88 84 -54 -68 -113 -117 136 86 141 -65 43 43 -42 -64 173 62 49 217 5 146 -48 115
6907 115 49 104 46 44 -33 -131 -155 -49 -95 4 -181 -70 56 -117 15 -91 88 -90 -33 -155 -89 117 -91 71
6931 71 262 -40 293 126 -152 104 138 277 107 -41 -30 39 -4 255 -424 -54 3 -75 155 -163 -13 6 -288
6954 -288 -40 86 -121 -41 238 6 -165 -139 -42 29 76 237 59 225 81 -9 33 -173 152 245 -27 -14 22
$$ packed form
6787b12m5L08k36K43j67p2J01J6J54k83J19J29l7J8k36L15l38K67j45j7K05J91
6809B78k74n1K1J1J04k78J93l43M55k17p7J23J32k68j0K83j64J46k60j27K69j4
6831f8K05p1r8q7K55q1J75j44j46K6M3J52N2j72J6j58j85J48nJ06l9R1l06K85
6855fk2l29L38j43R1j0R3k4K0k3kJ10L6N8m3j17Q1n1K43m57M0J45K21j27k10r
6881i7l2N9j27L8K47mj38j4m5mK53n0N5k06J08%q5k2K37j11j3J68k12J41j94J63
6907A15o6N5n8kp7r8k4J06m6R9j85J11J26j73J32j06J79j78N7j22O6K06k08J62
6931G1J91l02L33j67k78K56L4J39j70j48J1O9m3K59o79L70N7p8K30l18J50J9k94
6954b88K48J26k07Q0K79k32j71K6R7P1M7J61j78J66j44r0M2k06L25R3k72J3L6
$$ plain form
6977 22 -113 -55 -76 -262 180 56 -167 -155 131 104 -176 42 -167 -213 189 251 -55 168 -40 54 -237 -37 338
7000 338 86 -73 -52 -193 -91 52 -108 64 222 -129 158 38 -176 -97 -43 372 -152 -75 38 209 -136
7021 -136 -213 158 97 -42 -78 142 -108 32 469 265 272 73 6 312 58 -88 10 53 131 38 45 80 -39 -150
7045 -150 -57 78 15 -228 25 -195 -76 -227 -122 105 102 -20 -70 110 149 177 55 -279 -54 131 148 -45 -80
7068 -80 -60 -160 9 3 146 196 27 -172 -79 3 26 42 5 -127 -50 -124 88 -77 -39 162 -10 -86 36 -55 33
7093 33 148 8 68 3 315 -76 216 -152 118 -410 50 0 -129 -140 147 109 -22 -124 -46 71 -99 -57 -206
7116 -206 -145 -183 53 27 24 -275 223 -100 -108 133 72 -182 85 -77 76 117 49 211 -224 -118 -84 77 -91 -261
7140 -261 81 -157 33 -9 -144 -34 -181 -110 -212 26 -10 -67 -39 -9 -120 -147 -68 -28 -211 -5 39 -129 5
$$ packed form
6977B2j35N8k1j86M42j24k23J2K86k7k80K18k09m6M02O2l06K23k08R4k91K00L75
7000C38k52j59K1j41J02J43j60J72J58l51K87j20k14P9N4M15n24P7J13J71l45
7021a36p7L71o1j39l6K20k50J40M37k04Pj99o7L06k54j46R8M3P8r3PL5j19j11
7045a50R3J35o3k43K53k20J19j51J05K27lj22n0J80L9K8j22l34K25J85J7j93l5
7068h0K0j00J69oJ43N0j69j99R3Q2K3J6l7j32P7p4K12j65L8K01j72p6J22r1Q8
7093C3J15j40O0o5L12l91K92l68K70n28M60n0j29j1K87l8j31j02P8J17j70M2j49
7116b06O1l8K36k6lk99M98l23qK41o1k54K67j62J53M1o8J62m35J06L4J61j68j70
7140b61L42k38J90m2j35J10j47P1j02K38l6n7K8L0j11k7P9M0j83K06M4j68J34
$$ plain form
7163 5 172 -170 -202 -88 89 184 6 -23 19 27 89 -177 -321 -23 51 -62 -61 -28 -62 -34 -272 -166 -222 55 140 206
7189 206 208 -229 -33 192 28 128 317 201 206 -37 -2 -29 76 60 -130 -122 -30 75 55 -84 -236 -18 -47 -292
7213 -292 -59 -63 -31 -15 37 -119 47 151 69 159 -83 -73 128 77 13 -49 56 -82 232 -91 -283 -144 31 18
7237 18 -8 -51 -240 -2 33 -24 -303 -106 64 -37 -8 -139 -146 111 -405 -90 82 -33 199 -43 227 -16 115
7260 115 50 -27 -134 -43 -11 -65 -176 251 -38 10 172 -55 -133 -60 -4 2 144 -183 -7 -179 18 -44 26 -297
7284 -297 -96 -90 -46 85 -31 -64 85 118 -148 6 -54 -14 -103 8 -197 -27 -240 197 -76 -189 -230 47 -27
7307 -27 -235 -296 -196 95 277 6 -168 199 45 -147 47 180 221 236 215 -157 -49 201 -146 -9 -107 -256
7329 -256 251 -101 -118 126 -86 62 -397 261 -129 -75 -48 -254 11 -63 44 -257 31 78 72 118 -128 98 23
$$ packed form
7163EJ67l42l2J14J77R5j78k9M2QO2k66j44K98P4j13JL3l4K8k38J06n6K77Q5O6
7189B06Km37J96K25j64J00J89j16Nk43L5k7J05j6j90QR2J05k0j39j52K18k9k45
7213b92K33mL2J6N2j56J66J04q2R0k42J0K01n1o4o2J05j38L14l23j92J39J75j3
7237A8k6m3j89K38L5n7k79J97J70j01K9j31pK57n16L15J72j15K32k42K70k43J31
7260A15o5p7j07R1L2n4j11M27k89M8J62k27p8P3N6OJ42l27J76j72J97o2P0l23
7284b97K01OM4J31j16l3J49L3k66J54o0M0q9J11k05J70k13M37k73j13m1K77p4
7307b7k08o1J00K91J82k71j74L67j54j92J94J33M1J5k1l72J08K50l47J37r8j49
7329b56N07l52j7K44k12J48m59O58l90N4K7k06K65p4J07l01K88M7oM6k46K26p5
$$ plain form
7352 23 -150 -184 9 183 72 95 -444 108 78 48 -162 312 132 -70 -79 -94 -84 43 -43 89 15 188 -293 -112
7376 -112 -221 -298 167 9 -67 -32 267 -40 176 139 20 -100 27 -54 -47 149 -14 -133 -206 -96 -30 -88 -153 -68
7400 -68 -64 -81 -17 -136 -92 -28 0 19 27 41 25 263 173 29 39 35 26 74 -35 -64 -49 -3 -18 84 34 315 -72 22 -44
7429 -44 -181 210 -134 -137 121 -249 -292 -259 -13 187 96 -52 206 -89 -150 -36 -92 -124 28 203 130 -76 80
7452 80 -33 111 -74 241 459 6 -158 -218 -98 46 -207 -248 -83 18 -43 -209 -109 164 -183 -187 196 73
7474 73 94 145 39 167 -259 190 -118 -3 -31 -69 180 -210 151 95 200 -32 198 -109 191 -286 -229 -37
7496 -37 12 109 -88 -58 -1 256 83 -36 -30 166 -24 -153 9 108 -178 11 -60 -86 -56 -238 181 -55 -29 105
7520 105 -16 -154 274 123 19 -28 138 96 385 51 -49 55 -242 -285 100 182 -244 -194 123 91 -83 207
$$ packed form
7352B3j73l4J93J74j11K3n39N52l0l0k10M74j80k02rj5J0J27q6J32p4J73m81J81
7376a12j09p7M65j58p6L5K99l07K16l7j19j20J27q1PJ96j63j19p3J10O6n8o5Q5
7400f8Mj7O4j19M4O4K8J9QJ4j6K38r0j44J0mrM8j09k9J5M6j5J02n0K81l87R4o6
7429d4j37L91l44lK58l70m3L3K46K00r1j48K58k95o1J14n6l2J52J75p3k06J56
7452H0j13J44j85L15K18m53j64o0J20J44k53m1J65J01o1j66J00K73l47mL83j23
7474G3K1N1j06J28m26M49l08J15k8l8K49l90L61n6J05k32K30l07L00m77N7J92
7496c7M9R7j97L0N7K57j73j19OJ96j90j29J62R9k86J89p1k6L0j82M19k36K6J34
7520A05j21j38M28j51j04m7J66m2K89l34j00J04k97m3L85Q2m26N0L17l2j74K90
$$ plain form
7542 207 15 -44 64 43 -137 -23 97 18 147 -130 -191 -21 7 389 -3 43 -64 -260 11 -16 -93 -20 -40
7565 -40 5 -7 -254 -69 -15 -27 9 -4 97 -40 -33 233 -3 63 -299 16 74 -34 -50 -105 -74 -141 163 -114 -77
7590 -77 135 -36 -70 -135 100 -104 71 -94 70 -31 -258 -45 -2 -7 63 -157 -25 -14 -16 214 242 49 -153 83
7614 83 -126 78 -177 171 -52 227 -115 -8 -222 -27 -178 -148 -227 -23 -95 108 54 -169 229 81 204 83
7636 83 123 -61 -41 161 118 117 -51 24 10 -57 45 274 93 -22 157 16 -99 -61 28 60 191 -14 -128 -111
7660 -111 36 -34 -236 -266 256 182 102 13 101 -152 21 251 84 -103 -38 -169 128 12 23 205 -76 184 38
7683 38 6 66 -70 -229 -60 235 64 -103 19 29 -138 -56 -154 -18 28 59 -101 -43 -48 -92 171 278 -10 58
7707 58 13 17 -118 118 68 -23 -174 39 16 -10 -310 -49 -152 -29 -45 -67 -8 -351 24 -2 -76 46 -79 112
$$ packed form
7542B07j92n9J08k1j80J14J20p9J29k77o1J70K8L82l92M6j07j96K71k7p7P3k0
7565d0M5j2k47J85N4j2L6j3J01j37PK66k36O6l62L15N8j08j6n5L1o7L04k77L7
7590g7K12j71l4o5K35k04J75j65J64j01k27K13M3nP0k20J32J1kK30K8j93k02K36
7614H3k09K04k55L48k23K79l42J07k14J95j51L0p9K04p2K03n4k23L98j48J23j21
7636H3M0j84K0K02m3jj68P5j4o7J02K29j81j15J79j41j15L8Q9L2J31k05j14J7
7660a11J47p0k02l0N22p4q0q9Q8k53J73K30j67j87O5j31K97j16J1J82k81K60j46
7683C8l2O0j36j59J69K95j71j67J22J0j67Q2r8J36M6L1j60N8nm4K63J07k88O8
7707E8m5Mj35K36n0r1j51K13k3k6l00K61j03J23j6k2N9l43L75k6p4J22j25J91
$$ plain form
7731 112 93 -293 96 61 -239 60 33 -282 -275 -139 176 -100 168 -68 -201 -57 140 -86 269 -81 -203 -45
7753 -45 -41 -39 -169 -99 -249 -54 71 83 -52 -136 -110 74 124 242 128 43 72 -15 116 -81 -159 57 48 167 -197
7778 -197 13 -113 -176 147 -292 -30 -52 -140 175 -70 -73 105 -77 -4 8 -138 -88 -128 32 433 337 121 55 -22
7802 -22 -118 50 -12 -64 4 -36 170 114 47 -7 -36 -70 159 -94 -14 25 59 -154 147 107 -246 202 -53 -63 27 -94
7828 -94 41 -6 41 118 19 -200 -210 8 191 29 -16 286 -200 13 -156 -75 -85 65 -88 -134 61 152 -329 3
7852 3 -42 -87 -144 123 -131 -122 173 -301 9 71 -32 69 -110 168 -72 -220 150 -51 -71 258 -98 -87 -52 -41
7876 -41 -3 133 -14 53 -76 70 44 -68 217 -125 196 -31 -5 -125 -209 5 75 108 -19 16 39 200 151 -212
7900 -212 -7 6 -138 132 225 9 -5 181 60 25 139 -51 -203 215 -210 18 -82 -51 235 -197 -109 105
$$ packed form
7731A12j9l86L89l5l00K99k7l15PJ36L15k76K68k36j33J44J97k26L55l50j22J58
7753d5MKj30P0j50J95J25J2j35q4K6J84N0J18j14q5K9q7J31j97p8K16rJ19l64
7778a97K10j26o3L23m39K62k2q8L15k45lJ78j82P3J2j46N0m0J60M01r6k16o6p7
7802b2r6J68o2n2O8m0K06n6o7n4k9l4K29k53Q0L9L4k13L01m0l53M48k55j0R0j21
7828i4J35m7M7P7r9k19j0K18J83j62m5L02m86K13j69Q1j0J50j53m6J95R1m81L32
7852Cm5m5n7K67k54RK95m74L10O2j03J01j79K78k40j48L70k01k0L29l56J1L5J1
7876d1L8J36j47O7j29J46k6j12K85l42L21k27K6j20q4K14P0L3j27L5K3J61m9l63
7900b12K05J3j44K70R3k16j4J86j21l5J14j90j52M18m25K28j00L1K86m32Q8K14
$$ plain form
7922 105 151 -72 24 155 -96 -85 -137 142 -44 82 25 -27 -56 -21 227 132 130 -43 -33 -126 -119 39 -86 -8 114
7947 114 31 -257 -66 96 -118 30 -99 105 -100 77 174 -81 77 -25 -35 -133 -17 221 76 65 -259 -126
7969 -126 9 49 -94 47 79 229 7 83 -308 -271 -45 95 114 71 77 -99 -33 45 -12 2 -29 -180 -153 20 234
7994 234 27 8 48 -31 -2 -58 123 11 -98 93 -48 38 -82 17 -83 -61 89 -61 -136 -104 63 130 -291 -81
8018 -81 85 -34 -79 -10 17 43 -14 295 -221 11 -194 162 -192 -247 -67 44 -215 -63 -205 -9 73 -122 43
8041 43 -242 41 -205 -42 -132 123 -159 15 -191 -184 107 96 -64 129 -200 87 59 46 79 -94 286 92 -197
8064 -197 49 282 69 -162 -193 164 317 49 205 96 7 -147 -170 -113 -77 -298 -94 -7 180 -123 127 -70
8086 -70 2 92 133 -38 -157 52 -193 84 192 33 34 -24 -92 113 123 26 204 -173 33 -77 90 8 22 219
$$ packed form
7922A05M6k23R6J31k51J1n2K79j86J26n7n2k9L5K48r5kj73J0r3PJ58j25P8J22
7947A14q3k88J91J62k14J48j29K04k05J77R7k55J58j02j0r8J16K38j45j1l24J33
7969a26J35M0j43J41L2J50k22P6l91L7K26J40J9m3Oj76O6P8n7J4l1j51K7J73K14
7994B34k07j9M0p9K9n6J81j12j09J91j41Q6j20R9j00K2J50j50p5L2J67O7m21K10
8018h1J66j19m5O9K7K6n7L09n16K32k05L56l54n5J80J11k59J52j42J96Q2j95J65
8041D3k85K83k46J63r0K55k82J74k06PK91j1j60J93l29K87k8j3L3j73L80j94k89
8064a97K46K33k13k31l1L57J53k68J56j09q9j54k3N7L6k21K04Q7J87l03K50j97
8086g0P2R0M1j71j19K09k45K77J08j59Jn8o8K05J0r7J78l77K06j10J67q2J4J97
$$ plain form
8110 219 -82 -18 -55 -191 -43 73 -31 -34 52 -16 49 12 53 224 -8 173 286 79 263 -215 35 173 -137
8133 -137 72 -178 -1 275 -148 146 87 -8 61 -63 86 -160 42 99 -54 24 21 20 -54 30 97 -96 143 80
8157 80 57 -169 19 118 -193 177 51 -144 138 -83 71 66 -34 -1 -131 114 44 144 -65 140 -227 -80
8179 -80 6 0 44 -100 86 -218 92 -75 -55 262 9 74
$$ packed form
8110B19l01O4l7j36J48J16j04lQ6o8O5l7M1J71k32J81J13k07J84m78K50J38l10
8133a37K09k50J77K76m23K94n9r5O9j24J49k46K02N7j53P8ljp4Q4O7j93K39o3
8157H0k3k26J88R9l11L70j26j95K82k21J54nj00L3j30K45p0J00k09K05l67J47
8179h0Q6oM4j44J86l04L10j67K0L17k53O5
8191G4
$$ Imaginary data points
##PAGE= N=2
##DATA TABLE= (X++(I..I)), XYDATA
$$ plain form
0 0 0 0 0 0 0 0 0 0 0 0 0 -8 6 -8 8 -8 16 -16 21 -24 32 -34 40 -50 58 -67 78 -93 105 -119 139 -156 178 -200
34 -200 229 -255 286 -323 360 -400 445 -496 548 -609 674 -744 822 -908 1001 -1104 1217 -1343
52 -1343 1482 -1638 1813 -2014 2240 -2506 2815 -3187 3643 -4211 4951 -5951 7387 -9611 13480
67 13480 -21538 44969 -261363 -813818 230879 860116 290329 -153091 268863 522018
77 522018 313404 142690 13282 -209047 -49027 299690 76136 -418867 -192221 382462
87 382462 287772 -213565 -216460 105791 130052 -96424 -252236 -307783 -226486 -64898 -109657
98 -109657 -329902 -267636 69132 176854 14986 13741 199413 271656 229683 219930 163997
109 163997 46575 54616 151911 57177 -172691 -174613 50753 117505 -58099 -141001 18268
$$ packed form
0@%%%%%%%%%%%qJ4j4J6j6K4l2L7m5N6o6P4r0J08j25J45j71J98k24K58k95L34l78
34b00M29m84N41o09O83p60Q45r41J044j157J283j418J566j730J909k105K321k560
52a343K825l120L451l827M254m746N321o002O830p854R162j0902J3338j6998K3091
67A3480l5018O6507l06332n52455J044697O29237n69787m43420M21954K53155
77E22018k08614j70714j29408k22329J60020L48717k23554m95003K26646N74683
87C82462r4690n01337k895L22251K4261k26476j55812n5547Q1297J61588m4759
98a09657k20245O2266L36768J07722j61868j245J85672P2243m1973r753n5933
109A63997j17422Q041R7295r4734k29868j922K25366O6752j75604q2902J59269
$$ plain form
120 18268 151029 60349 -93012 -133315 -114082 -101742 -111069 -210603 -322788 -200008 60444
131 60444 55548 -136608 -28391 308236 341530 107923 83697 234086 201889 59837 20973
142 20973 -24353 -101326 -28364 65665 -67017 -181043 4957 166804 5613 -142611 -16487
153 -16487 74094 -51460 -142328 -119579 -134794 -137710 -70515 -85700 -145190 -23944 148756 105748
165 105748 26048 151126 253496 144603 72509 135705 92362 -38013 -19290 27593 -94274
176 -94274 -162790 -21815 38784 -93317 -102757 64107 83908 -56416 -63451 33569 -6108 -112345
188 -112345 -95745 -41768 -73643 -89647 -18724 29445 16518 43695 113343 125174 86832 81232
200 81232 94700 67234 19143 -7789 -25077 -43536 -45578 -39097 -50114 -55354 -16442 25136 3644
$$ packed form
120A8268J32761r0680j53361m0303J9233J2340r327r9534j12185J22780K60452
131F0444m896j92156J08217L36627L3294k33607k4226J50389l2197j42052l8864
142B0973m5326p6973P2962R4029j32682j14026J86000J61847j61191j48224J26124
153a6487R0581j25554r0868K2749j5215k916O7195j5185n9490J21246J72700m3008
165A05748p9700J25078J02370j08893p2094O3196m3343j30375J8723M6883j21867
176i4274o8516J40975O0599j32101r440J66864J9801j40324p035R7020l9677j06237
188a12345J6600N3977l1875j6004P0923M8169j2927K7177O9648J1831l8342n600
200H1232J3468k7466m8091k6932j7288j8459k042O481j1017n240L8912M1578k1492
$$ plain form
213 3644 -34655 -6802 37378 -1288 -67852 -55920 -15663 -34597 -59434 -33349 -9408 -413
225 -413 44566 78305 41095 28597 102349 118304 14463 -34963 32815 44154 -49607 -87034
237 -87034 -34710 -13670 -33505 -26794 -17569 -19111 19678 51504 -1296 -45566 12207 50747 -25109
250 -25109 -74321 -11717 24914 -23682 -34479 16343 27132 9933 35070 50996 15456 10423
262 10423 46951 26988 -31954 -25017 11335 -15935 -54246 -27290 3079 -14461 -20172 10348
274 10348 19285 3311 9080 22028 8230 -4157 4121 490 -16329 -10856 4863 -5601 -16607
287 -16607 4910 23702 5854 -9321 10278 24736 2298 -18558 -7176 4244 -9036 -22561
299 -22561 -14830 -4352 -4162 -567 5217 4215 7191 21291 23537 4790 -1099 17504 20126 -5846
$$ packed form
213C644l8299K7853M4180l8666o6564J1932M0257j8934k4837K6085K3941Q995
225d13M4979L3739l7210j2498P3752J5955j03841m9426O7778J1339r3761l7427
237h7034N2324K1040j9835O711R225j542L8789L1826n2800m4270N7773L8540p5856
250b5109m9212O2604L6631m8596j0797N0822J0789j7199K5137J5926l5540n033
262A0423L6528j9963n8942O937L6352k7270l8311K6956L0369j7540n711L0520
274A0348Q937j5974N769J2948j3798j2387Q278l631j6819N473J5719j0464j1006
287a6607K1517J8792j7848j5175J9599J4458k2438k0856J1382J1420j3280j3525
299b2561P731J0478J90L595N784j002K976J4100K246j8747n889J8603K622k5972
$$ plain form
313 -5846 -15972 3128 8562 -10169 -16021 -5704 -5229 -9204 -5433 -10118 -19128 -6530 7832 -7576
327 -7576 -21264 1813 20390 1949 -9271 11535 20413 2936 -444 12659 8272 -507 9782
340 9782 17705 5993 3070 16073 11728 -6952 -8419 -2754 -15561 -27438 -18503 -13239 -23445 -21357
354 -21357 -4166 -258 -6522 25 9755 7925 6056 10925 7922 1464 8294 16402 7858 -101 10404
369 10404 20169 11193 144 1742 6209 3060 -2878 -6338 -8435 -6889 -4271 -8727 -19358 -24369
383 -24369 -17944 -11568 -15240 -20274 -11083 9457 20306 16327 12194 19315 28766 24741 6841 -6888
397 -6888 -4136 5268 916 -13837 -15240 3700 19680 14973 2335 2696 12159 12562 -3605 -25028
411 -25028 -30754 -17263 -8308 -20736 -31913 -14371 12509 14503 443 -491 12663 21344 18658
$$ packed form
313e846j0126J9100N434j8731n852J0317M75l975L771m685r010J2598J4362j5408
327g576j3688K3077J8577j8441j1220K0806Q878j7477l380J3103m387q779J0289
340I782P923j1712k923J3003m345j8680j467N665j2807j1877Q935N264j0206K088
354b1357J7191L908o264O547R730j830j869M869l003o458O830Q108q544p959J0505
369A0404R765q976j1049J598M467l149n938l460k097J546K618m456j0631n011
383b4369O425O376l672n034R191K0540J0849l979m133P121R451m025j7900j3729
397f888K752R404m352j4753j403J8940J5980m707j2638L61R463M03j6167k1423
411b5028n726J3491Q955j2428j1177J7542K6880J994j4060r34J3154Q681k686
$$ plain form
424 18658 8119 -1917 3437 19532 19335 -4480 -14956 5034 20614 4225 -18199 -13639 6289
437 6289 10205 -6586 -20965 -14787 831 1366 -15419 -27039 -18199 -1180 3123 -6416 -10613 6739
451 6739 32517 35542 13928 3811 20999 28749 1524 -27408 -22427 -7919 -14186 -24120 -15264
464 -15264 -2828 1693 11159 22591 14609 -755 5759 19360 3687 -26727 -27102 -3034 246
477 246 -19106 -20414 2266 15863 11621 9602 12183 8615 8682 17023 10024 -15448 -18499 8637 13558
492 13558 -19734 -33094 137 21498 -2585 -22014 -1002 21444 12402 -3427 -2000 3206 459
505 459 -2244 -4720 -11427 -12069 357 11148 6681 -1646 6427 22208 21545 2883 -7386 3147
519 3147 8565 -8168 -22628 -13957 -5137 -12323 -13549 -96 1706 -6819 2526 20240 9569 -12030
$$ packed form
424A8658j0539j0036N354J6095j97k3815j0476J9990J5580j6389k2424M560J9928
437F289L916j6791j4379O178J5618N35j6785j1620Q840J7019M303r539m197J7352
451F739K5778L025k1614j0117J7188P750k7225k8932M981J4508o267r934Q856
464a5264J2436M521R466J1432p982j5364O514J3601j5673l0414l75K4068L280
477B46j9352j308K2680J3597m242k019K581l568O7Q341o999k5472l051K7136M921
492A3558l3292j3360L3231K1361k4083j9429K1012K2446r042j5829J427N206k747
505D59k703k476o707o42J2426J0791m467q327Q073J5781o63j8662j0269J0533
519C147N418j6733j4460Q671Q820p186j226J3453J802q525R345J7714j0671k1599
$$ plain form
533 -12030 -1506 20393 7340 -18624 -9787 14760 10040 -7718 -720 17024 14970 5176 9815
546 9815 13478 1102 -6908 -1623 -5529 -24634 -30809 -15483 -8986 -22445 -23030 1927 16793 6578
560 6578 3819 21411 25831 7730 161 10081 6471 -11000 -9963 6334 4615 -8899 -2331 14166
574 14166 9779 -4039 787 12187 4276 -9834 -6219 2975 -7479 -22600 -16815 -3085 -8918
587 -8918 -22785 -13006 7327 6293 -7146 20 17216 15425 6571 11464 16090 8134 6168 14086
601 14086 6734 -11392 -5333 15177 8746 -14538 -9321 13655 10853 -14525 -22682 -9524 -3804
614 -3804 -13559 -21326 -16555 -3627 5550 3642 -991 2927 12375 15102 10468 4162 1723 6576 12469
629 12469 6897 -6209 -5493 10020 13594 -676 -7242 2798 8930 1018 -7003 -8833 -8285 -5104
$$ packed form
533a2030J0524K1899j3053k5964Q837K4547m720j7758O998J7744k054r794M639
546I815L663j2376q010N285l906j9105o175J5326O497j3459n85K4957J4866j0215
560F578k759J7592M420j8101p569R920l610j7471J037J6297j719j3514O568J6497
574A4166m387j3818M826J1400p911j4110L615R194j0454j5121N785J3730n833
587h918j3867R779K0333j034j3439P166J7196j791q854M893M626p956j966P918
601A4086p352j8126O059K0510o431k3284N217K2976k802k5378q157J3158N720
614c804r755p767M771J2928R177j908m633L918R448K727m634o306k439M853N893
629A2469n572j3106P16J5513L574j4270o566J0040O132p912q021j830N48L181
$$ plain form
643 -5104 -1008 -6230 -15791 -12650 1908 4011 -11512 -17536 -1453 13773 7353 -6298 -1064 16938
657 16938 21822 8167 -3272 1722 11778 10488 -2164 -11546 -5231 8687 8838 -7356 -14224 460
671 460 12235 243 -16873 -12914 2440 3278 -8839 -14703 -6858 3828 4663 -3361 -7533 1056
685 1056 10973 7775 -1509 -1777 6986 11720 7267 795 903 6639 8966 1390 -6619 -5303 517 -1309
701 -1309 -7575 -7628 -2683 316 582 440 -542 -893 1783 2953 -2339 -6773 -4380 69 -1545 -5539 -4228
718 -4228 827 4308 4479 2974 2471 6754 8806 4926 -772 -1399 1195 309 -3733 -5990 -3820 811
734 811 2780 777 -302 3419 7562 5319 -1121 -3108 -13 -235 -6163 -11025 -8657 -3796 -2971 -5832
750 -5832 -4871 1237 6115 5237 2163 3033 6366 6537 1786 -1978 -303 2284 1571 -1523 -941 3526 6512
$$ packed form
643e104M096n222r561L141J4558K103j5523o024J6083J5226o420j3651N234J8002
657A6938M884j3655j1439M994J0056j290j2652r382O315J3918J51j6194o868J4684
671D60J1775j1992j7116L959J5354Q38j2117n864P845J0686Q35q024m172Q589
685A056R917l198r284k68Q763M734m453o472J08N736K327p576q009J316N820j826
701a309o266n3M945K999K66j42r82l51K676J170n292m434K393M449j614l994J311
718d228N055L481J71j505n03M283K052l880n698o27K594q86m042k257K170M631
734H11J969k003j079L721M143k243o440j987L095k22n928m862K368M861Q25k861
750e832R61O108M878q78l074Q70L333J71m751l764J675K587p13l094N82M467K986
$$ plain form
767 6512 5956 3974 4585 5943 5265 367 -5013 -7013 -7159 -9466 -13526 -14230 -9740 -5577 -4395 -2134
783 -2134 2404 6759 8137 8078 7225 5599 4219 2940 913 -1495 -1073 1318 3240 4459 5634 7784
799 7784 8633 8166 5937 1906 -2077 -4829 -8309 -12735 -15405 -14737 -12929 -11712 -9819 -5878 -301 3189
815 3189 4935 6098 7465 8193 7476 5278 3311 2822 3071 2818 1871 2848 5282 7559 7445 6393 6332 5882
833 5882 2802 -2804 -7021 -10065 -12533 -15017 -16494 -15825 -12124 -7992 -5439 -2830 1751 6592 8125
848 8125 7296 7446 8304 8130 5872 3887 3674 3975 4842 4965 4705 5259 7229 7452 4435 1106 -208 -1270
866 -1270 -5608 -10509 -12553 -12841 -13704 -14007 -12592 -10181 -6364 -850 3464 4724 7031 10812 11028 7969
882 7969 6124 5640 4279 2362 2821 3613 2941 3835 6944 6772 3193 1923 3003 627 -5123 -8416 -8466
$$ packed form
767F512n56j982O11J358o78m898n380k000j46k307m060p04M490M163J182K261
783b134M538M355J378n9q53j626j380j279k027k408M22K391J922J219J175K150
799G784Q49m67k229m031l983k752l480m426k670O68J808J217J893L941N577L490
815C189J746J163J367P28p17k198j967m89K49k53r47R77K434K277j14j052o1m50
833E882l080n606m217l044k468k484j477O69L701M132K553K609M581M841J533
848H125q29J50Q58j74k258j985k13L01Q67J23k60N54J970K23l017l329j314j062
866a270m338m901k044k88q63l03J415K411L817N514M314J260K307L781K16l059
882G969j845m84j361j917M59P92o72Q94L109j72l579j270J080k376n750l293n0
$$ plain form
899 -8466 -9989 -12413 -12154 -10562 -8967 -6339 -2636 -714 61 2072 5757 7117 5489 5093 7398 8953
915 8953 7049 4758 4096 4063 3225 720 -696 -646 80 -500 -681 -790 -2135 -3935 -3641 -3498 -6303 -9624
933 -9624 -7502 -3302 -2881 -6462 -4080 3181 4844 1427 2003 5728 4748 1845 2711 2188 -2508 -838
949 -838 5487 4723 -1582 883 9992 8691 -1291 -2926 3236 1683 -5652 -6540 -3371 -3459 -3623 -966 -1625
966 -1625 -5300 -3789 1070 -9 -6478 -6242 1065 4611 1284 -1564 2545 8376 8023 2176 -857 1824
982 1824 3299 -596 -4227 -3907 -1855 429 3614 3956 818 3232 10204 9350 -991 -5304 1854 4600
998 4600 -6328 -13230 -7013 -1214 -5558 -10005 -6475 -2685 -2442 -95 2787 464 -1137 5948 10626
1013 10626 2930 -4252 2005 9854 3440 -5254 -885 8446 7640 3283 5178 7849 6574 5608 3501
$$ packed form
899h466j523k424K59J592J595K628L703J922P75K011L685J360j628l96K305J555
915H953j904k291o62l3q38k505j416N0P26n80j81j09j345j800K94J43k805l321
933i624K122M200M21l581K382P261J663l417N76L725r80k903Q66n23m696J670
949h38O325p64o305K465R109j301r982j635O162j553p335q88L169q8j64K657o59
966a625l675J511M859j079o469K36P307L546l327k848M109N831l53n847l033K681
982A824J475l895l631L20K052K284L185L42l138K414O972q54j0341m313P158K746
998D600j0928o902O217N799m344m447L530L790K43K347K882k323j601P085M678
1013A0626p696p182O257P849o414q694M369R331q06m357J895K671j275r66k107
$$ plain form
1028 3501 -3817 -10041 -8631 -7464 -13895 -19255 -14257 -5656 -3442 -5404 -3748 3246 9842 8557 2375
1043 2375 1166 6682 6914 400 -2534 2268 5520 5246 7737 10261 8403 8897 13435 10123 -1691
1058 -1691 -4881 510 -3759 -17207 -19938 -11910 -11764 -17712 -14804 -6407 -3983 -2851 4547 8167 4043
1073 4043 4326 11050 9177 510 -543 6156 7209 2486 3396 10076 13185 12375 12270 11479 8548 5619
1089 5619 1821 -6296 -14559 -17673 -18416 -21936 -24641 -21775 -14585 -8772 -4046 548 5326 10823 14005
1104 14005 12352 8114 7866 8871 5819 781 2083 6313 7160 6806 10251 12625 10774 9407 9419 4005
1120 4005 -5042 -8591 -10583 -18841 -26285 -24241 -19701 -19963 -18081 -8276 -154 2674 7529 14087 14314
1135 14314 11440 12186 12666 6561 2181 4749 5684 2193 2913 8696 10475 9214 10603 10963 6501 1082
$$ packed form
1028C501p318o224J410J167o431n360M998Q601K214j962J656O994O596j285o182
1043B375j209N516K32o514k934M802L252k74K491K524j858M94M538l312j1814
1058a691l190N391m269j3448k731Q028J46n948K908Q397K424J132P398L620m124
1073D043K83O724j873q667j053O699J053m723R10O680L109q10j05p91k931k929
1089E619l798q117q263l114p43l520k705K866P190N813M726M594M778N497L182
1104A4005j653m238k48J005l052n038J302M230Q47l54L445K374j851j367J2n414
1120D005r047l549j992q258p444K044M540k62J882R805Q122K828M855O558K27
1135A4314k874P46M80o105m380K568R35l491P20N783J779j261J389L60m462n419
$$ plain form
1151 1082 -2199 -8438 -17955 -21614 -21859 -24171 -25595 -19905 -11827 -6962 -1754 6686 12127 14046 16338
1166 16338 17297 13628 9329 8661 6580 1497 -300 2582 4612 4162 5877 9474 9816 7161 4767 1433
1182 1433 -5749 -11390 -14760 -19766 -24736 -24383 -19125 -16376 -13260 -5377 3892 8848 12140 16774 18737
1197 18737 16098 13488 12115 7245 1722 899 1432 -560 -1744 2851 7009 5826 5245 6846 4787
1212 4787 -1383 -5984 -9201 -15343 -20419 -20389 -19496 -19630 -15833 -7086 -228 3968 10431 16736 18743 17117
1228 17117 16717 14575 8519 4385 2180 -1026 -4563 -3106 -456 -166 181 3712 5666 3188 852
1243 852 -348 -4142 -10169 -13050 -14280 -16892 -17659 -13078 -8643 -5655 -220 7700 12579 14001 16313
1258 16313 17892 15035 10111 7573 4011 -1449 -4676 -4546 -4613 -5548 -2951 1068 2121 1661 2943 3188
$$ packed form
1151A082l281o239r517l659k45k312j424N690Q078M865N208Q440N441J919K292
1166A6338R59l669m299o68k081n083j797K882K030m50J715L597L42k655k394l334
1182A433p182n641l370n006m970L53N258K749L116P883R269M956L292M634J963
1197A8737k639k610j373m870n523q23N33j992j184M595M158j183n81J601k059
1212D787o170m601l217o142n076L0Q93j34L797Q747O858M196O463O305K007j626
1228A7117m00k142o056m134k205l206l537J457K650K90L47L531J954k478k336
1243H52j200l794o027k881j230k612p67M581M435K988N435P920M879J422K312
1258A6313J579k857m924k538l562n460l227J30o7r35K597M019J053m60J282K45
$$ plain form
1274 3188 -685 -4900 -7344 -9661 -13277 -14256 -12011 -10095 -7630 -1669 4867 8333 11499 15219 16313
1289 16313 13940 11344 8606 4378 -771 -3759 -5341 -7148 -6937 -5225 -3065 -1818 80 2022 2073
1304 2073 299 -536 -1617 -4875 -7231 -7927 -8247 -8429 -6424 -2869 337 3422 7779 11161 12005 11995 12003
1321 12003 9640 5503 1871 -976 -4660 -7622 -8033 -7337 -6868 -5371 -2023 591 1265 1832 2399 1596
1337 1596 -873 -2722 -3754 -5486 -5923 -4767 -3046 -1148 1972 5375 8014 9088 9600 9557 8062 5283
1353 5283 2452 -912 -3791 -6078 -6914 -7434 -7319 -5915 -3949 -2237 -526 1063 1819 1884 1853 1143 -152
1370 -152 -1447 -1764 -1796 -1816 -1382 644 2733 3894 5298 6551 6986 5964 4764 3083 347 -2283 -4264
1387 -4264 -5854 -7366 -7685 -6471 -4982 -3884 -2230 91 1844 2313 2687 2366 2183 1499 608 -328 -661
$$ packed form
1274C188l873m215k444k317l616r79K245J916K465N961O536L466L166L720J094
1289A6313k373k596k738m228n149k988j582j807K11J712K160J247J898J942N1
1304B073j774q35j081l258k356o96l20j82K005L555L206L085M357L382Q44j0Q
1321A2003k363m137l632k847l684k962m11O96M69J497L348K614O74N67N67q03
1337A596k469j849j032j732m37J156J721J898L120L403K639J074N12m3j495k779
1353E283k831l364k879k287q36n20J15J404J966J712J711J589P56O5l1p10j295
1370a52j295l17l2k0M34K026K089J161J404J253M35j022j200j681k736k630j981
1387d264j590j512l19J214J489J098J654K321J753M69L74l21j83o84q91r36l33
$$ plain form
1404 -661 -61 432 1347 1949 2951 3758 4273 3993 3307 1769 481 -907 -2578 -4462 -5350 -4998 -4947 -5250
1422 -5250 -4491 -2541 -926 85 747 1961 2470 2439 2323 2356 1924 1318 1319 1608 1234 925 1546 2230 2198 1195
1442 1195 1143 1476 495 -1512 -2030 -2185 -3230 -4285 -3712 -3262 -3360 -2600 -941 -128 -367 762 2350 2657
1460 2657 1897 1618 2779 2789 1563 1163 1876 1606 748 343 561 277 -377 -614 -607 -865 -1952 -1572 -826 -1070
1480 -1070 -2244 -1674 -689 -895 -1769 -1134 170 255 -445 401 1477 1351 1008 1421 2297 1718 1482 1683 1598
1499 1598 823 -424 -521 -163 -1355 -2298 -1676 -153 -947 -1375 -34 997 281 -562 556 1202 -410 -1231
1517 -1231 -56 -310 -1623 -1762 50 159 -539 550 2520 2010 1147 1582 1636 418 -584 -780 -1038 -1675
1535 -1675 -1800 -1489 -1127 -92 294 554 1653 2347 2129 1213 1319 994 -797 -1455 -1162 -2172 -3413 -2145
$$ packed form
1404f61O00M93R15O02J002Q07N15k80o86j538j288j388j671j884q88L52N1l03
1422e250P59J950J615J011O62J214N09l1j16L3m32o06JK89l74l09O21O84l2j003
1442A195n2L33r81k007n18j55j045j055N73M50r8P60J659Q13k39J129J588L07
1460B657p60k79J161J0j226m00P13k70q58m05K18k84o54k37Pk58j087L80P46k44
1480a070j174N70R85k06q74O35J304Q5p00Q46J076j26l43M13Q76n79k36K01q5
1499A598p75j247r7L58j192r43O22J523p94m28J341J031p16q43J118O46j612q21
1517a231J175k54j313j39J812J09o98J089J970n10q63M35N4j218j002j96k58o37
1535a675j25L11L62J035L86K60J099O94k18r16J06l25j791o58K93j010j241J268
$$ plain form
1553 -2145 -650 -644 -1091 917 2140 1247 301 1187 1063 -854 -1579 -816 -844 -1783 -1104 591 1210 827 2336
1572 2336 3268 3574 2511 2223 2075 725 -1504 -2446 -2361 -3471 -4210 -3543 -2338 -1858 -1221 485 1176 468
1590 468 918 1432 1167 -457 -486 9 -593 -729 -340 550 1331 2621 3411 3431 3834 3851 3084 855 -112 -1147
1610 -1147 -3083 -4175 -3988 -4240 -4813 -3674 -1685 -1638 -1477 517 1537 1049 778 1715 1396 -110 -651 792
1628 792 -99 -156 1331 2860 2630 2907 4259 4429 2479 1809 1536 -269 -2424 -3363 -3492 -4842 -5169 -4505
1646 -4505 -3811 -3112 -1952 -507 526 744 1642 2040 1755 1213 1093 1098 512 977 1244 1846 2275 3081 3787
1665 3787 3407 2940 2696 1929 212 -1439 -2123 -3165 -4405 -5066 -4592 -4265 -4001 -2896 -1441 -663 287 1470
1683 1470 2046 1209 1763 2243 1511 537 1147 1926 1380 1071 2246 2865 2105 2352 3018 1790 306 105 -311
$$ packed form
1553b145J495Om47K008J223q93r46Q86j24j917p25P63k8r39O79J695O19l83J509
1572B336R32L06j063k88j48j350k229r42Q5j110p39O67J205M80O37J706O91p08
1590D68M50N14k65j624k9M95o02j36L89Q90P81J290P90K0M03J7p67k229r67j035
1610a147j936j092J87k52n73J139J989M7J61J994J020m88k71R37l19j506n41J443
1628G92q91n7J487J529k30K77J352J70j950o70k73j805k155r39j29j350l27O64
1646d505O94O99J160J445J033K18Q98L98k85n42j20Nn86M65K67O02M29Q06P06
1665C787l80m67k44p67j717j651o84j042j240o61M74L27K64J105J455P78R50J183
1683A470N76q37N54M80p32r74O10P79n46l09J175O19p60K47O66j228j484k01m16
$$ plain form
1702 -311 -2360 -3701 -3675 -3764 -4650 -4081 -2776 -2411 -2081 -76 809 620 852 1939 2059 1008 1207 1987 1550
1721 1550 629 1503 2145 1559 1670 2777 2214 1280 1455 1075 -166 -1346 -1502 -2158 -3212 -3714 -3074 -2803
1739 -2803 -2825 -2398 -1161 -609 -505 593 1439 956 1147 1604 1537 1106 863 1677 1694 748 1313 1958 1392 1078
1759 1078 1394 1243 58 -340 -254 -1030 -2192 -2142 -1734 -2528 -2856 -1864 -1134 -1544 -886 190 90 -192 742
1778 742 1282 655 202 992 1515 674 515 1059 1264 609 968 1579 947 396 479 428 -644 -910 -315 -653
1798 -653 -1530 -1279 -1028 -1376 -1740 -1110 -466 -904 -654 119 -5 -423 723 1023 478 538 1178 1084 428 466 1184
1819 1184 555 122 675 1084 441 34 926 982 -346 -135 353 -292 -1389 -963 -571 -904 -1599 -1044 -673
1838 -673 -806 -912 -283 73 -380 1 499 235 30 541 933 281 11 994 840 510 844 1227 847 964
$$ packed form
1702c11k049j341K6q9q86N69J305L65L30K005Q85j89K32J087J20j051J99P80m37
1721A550r21Q74O42n86J11J107n63r34J75l80j241j180j56o56j054n02O40K71
1739b803k2M27J237N52J04J098Q46m83J91M57o7m31k43Q14J7r46N65O45n66l14
1759A078L16j51j185l98Q6p76j162N0M08p94l28R92P30m10O58J076j00k82R34
1778G42N40o27m53P90N23q41j59N44K05o55L59O11o32n51Q3n1j072k66N95l38
1798f53q77K51K51l48l64O30O44m38K50P73j24m18J146L00n45O0O40r4o56L8P18
1819A184o29m33N53M09o43m07Q92N6j328K11M88o45j097M26L92l33o95N55L71
1838f73j33j06O29L56m53L81M98k64k05N11L92o52k70R83j54l30L34L83l80J17
$$ plain form
1858 964 1092 931 434 106 -63 -201 -1334 -1594 -1094 -1705 -1849 -1428 -1056 -1194 -1137 -171 219 -127 101 813
1878 813 401 89 752 1194 630 773 1576 1437 965 1392 1864 1462 667 872 499 -21 -543 -684 -1238 -1955
1898 -1955 -1886 -1669 -1952 -1706 -1376 -672 -626 -475 150 325 258 295 608 384 613 864 921 1193 1137 1450 1638 1495
1920 1495 1703 1674 976 493 285 -38 -1269 -1383 -1550 -1895 -2168 -2219 -1656 -1246 -1099 -739 -152 -84 -163 191 863
1941 863 422 370 748 861 677 875 1565 1320 1710 1664 1925 1749 1030 575 217 -296 -875 -1364 -1983 -2162 -2276
1962 -2276 -2411 -1814 -1572 -1173 -849 -565 26 306 276 443 745 636 395 779 1097 744 1071 1510 1742 1464
1982 1464 995 1366 1037 455 39 -144 -1001 -1281 -1359 -1566 -1580 -1784 -1439 -972 -739 -773 -573 -90 155 107 127
2003 127 317 417 162 166 1062 883 765 1435 1629 1623 1246 1488 1441 463 -25 -84 -318 -1230 -1437 -1342 -1254 -1994 -1596
$$ packed form
1858I64J28j61m97l28j69j38j133k60N00o11j44M21L72j38N7R66L90l46K28P12
1878H13m12l12O63M42n64J43Q03j39m72M27M72m02p95K05l73n20n22j41n54p17
1898a955O9K17k83K46L30P04M6J51O25J75o7L7L13k24K29K51N7K72n6L13J88j43
1920A495K08k9o98m83k08l23j231j14j67l45k73n1N63M10J47L60N87O8p9L54O72
1941H63m41n2L78J13j84J98O90k45L90m6K61j76p19m55l58n13n79m89o19j79j14
1962b276j35N97K42L99L24K84N91K80l0J67L02j09k41L84L18l53L27M39K32k78
1982A464m69L71l29n82m16j83q57k80p8k07j4k04L45M67K33l4K00M83K45m8K0
2003A27J90J00k55MQ96j79j18O70J94ol77K42m7r78m88n9k34r12k07R5Q8p40L98
$$ plain form
2026 -1596 -1080 -652 -889 -268 -43 -79 146 -60 62 189 -195 302 728 1197 690 870 1221 1443 936 1032
2046 1032 959 801 255 -221 -255 -402 -943 -1047 -918 -1019 -1421 -575 -542 -608 -439 -515 -105 -425 -385 -114 2 175
2068 175 69 485 727 733 386 619 1088 894 459 744 888 217 189 152 -36 -573 -484 -257 -506 -1020 -658 -297
2090 -297 -679 -712 -285 -268 -734 -542 -112 7 17 214 249 -37 110 374 589 129 532 389 576 808 653
2111 653 516 -28 497 643 58 41 150 -26 -669 -701 -275 -960 -1284 -893 -646 -1004 -1146 -133 -29 -572
2131 -572 -100 422 -16 260 261 753 479 511 735 985 554 615 817 988 906 549 397 265 -234 -85 -361 -797
2153 -797 -938 -1200 -952 -798 -684 -925 -828 -666 -311 -178 -83 -169 -308 1 -26 114 512 1123 558 1313 1251 1368
2175 1368 1647 1448 1534 792 648 202 -251 -993 -1106 -1251 -1618 -1739 -1247 -1043 -1099 -744 -347 -154 -141 -80 677
$$ packed form
2026a596N16M28k37O21K25l6K25k06J22J27l84M97M26M69n07J80L51K22n07R6
2046A032p3j58n46m76l4j47n41j04J29j01m02Q46L3o6J69p6M10l20M0K71J16J73
2068A75j06M16K42Ol47K33M69j94m35K85J44o71k8l7j88n37Q9K27k49n14L62L61
2090b97l82l3M27J7m66J92M30J19J0J97L5k86J47K64K15m60M03j43J87K32j55
2111F53j37n44N25J46n85j7J09j76o43l2M26o85l24L91K47l58j42J013J04n43
2131e72M72N22m38K76JM92k74L2K24K50m31O1K02J71q2l57j52j32m99J49k76m36
2153g97j41k62K48J54J14k41R7J62L55J33R5q6j39L09k7J40L98O11n65P55o2J17
2175A368K79j99Q6p42j44m46m53p42j13j45l67j21M92K04n6L55L97J93J3O1P57
$$ plain form
2196 677 217 -94 65 277 -20 323 926 890 1216 1770 1816 1890 1503 1404 873 -14 -598 -1024 -1505 -1660 -1807
2217 -1807 -2108 -2207 -1380 -815 -884 -310 -216 399 314 215 407 291 -68 148 365 238 717 875 1178 1498 1416 1827
2239 1827 1800 1171 621 222 -392 -1284 -1765 -1846 -2191 -2182 -1803 -1232 -691 -435 137 470 716 334 532 483 0
2260 0 20 125 -19 27 677 971 988 1694 1776 1640 1323 1211 889 -192 -1053 -1448 -2229 -2624 -2764 -2130 -1820 -1452
2282 -1452 -681 95 665 909 1086 1476 1012 835 430 149 99 -152 209 248 470 862 1407 1504 1575 1348 903
2303 903 440 -389 -1054 -1912 -2393 -2489 -2510 -2441 -1769 -1212 -207 442 917 1514 1582 1442 1480 1186 464 193 17
2324 17 -486 -463 -148 323 597 679 1242 1360 1008 481 -24 -519 -1405 -1913 -2117 -2401 -2321 -1881 -1102 -433 81
2345 81 1171 1408 1953 2255 1886 1700 1345 550 -132 -509 -875 -866 -878 -274 333 524 511 679 945 541 -88
$$ packed form
2196F77m60l11J59K12k97L43O03l6L26N54M6P4l87r9n31q87n84m26m81j55j47
2217a807l01r9Q27N65o9N74R4O15q5r9J92j16l59K16K17j27M79J58L03L20q2M11
2239A827k7o29n50l99o14q92m81q1l45RL79N71N41K56N72L33K46l82J98m9m83
2260@K0J05j44M6O50K94J7P06Q2j36l17j12l22j081q61l95p81l95j40O34L10L68
2282a452P71P76N70K44J77L90m64j77m05k81n0k51L61L9K22L92N45R7P1k27m45
2303I03m63q29o65q58m81r6k1O9O72N57J005O49M75N97O8j40L8k94p22k71j76
2324A7n03K3L15M71K74Q2N63J18l52n27n05m95q86n08k04k84Q0M40P79O69N14
2345H1J090K37N45L02l69j86l55p95o82l77l66Rj2O04O07J91j3J68K66m04o29
$$ plain form
2366 -88 -668 -1274 -1684 -1950 -2207 -1878 -1398 -1001 145 749 1049 1818 2187 2409 1912 1571 1177 436 -353 -944
2386 -944 -585 -1001 -737 -620 -416 -55 285 484 423 86 -432 -662 -1069 -1433 -1509 -1863 -1470 -714 -697 456 859
2407 859 1929 2391 2231 2205 2092 1458 793 465 -581 -898 -1364 -1096 -1269 -1322 -926 -228 -141 -64 82 290 -255
2428 -255 -512 -834 -896 -1200 -1319 -897 -238 273 403 1470 1607 2057 1898 2214 1766 1231 463 -11 -702 -1040
2448 -1040 -1397 -1758 -1386 -1208 -930 -305 -283 -217 174 47 -442 -353 -339 -894 -764 -757 -510 -181 526 879 1279 1651
2470 1651 1839 1824 1556 1401 801 208 -513 -737 -1082 -1545 -1563 -1349 -1137 -940 -630 -205 -341 166 -273 110
2490 110 -138 11 -222 -277 -110 -125 125 403 1117 1207 1480 1801 1717 1152 1064 759 214 -391 -629 -914 -1283 -1483
2512 -1483 -1010 -884 -958 -582 -392 -69 -333 37 -122 -185 -165 -417 123 -66 163 391 505 750 835 1223 1048
$$ packed form
2366h8n80o06m10k66k57L29M80L97J146O04L00P69L69K22m97l41l94p41p89n91
2386i44L59m16K64J17K04L61L40J99o1l37n18k30m07l64p6l54L93P56J7J153M03
2407H59J070M62j60k6j13o34o65l28j046l17m66K68j73n3L96O98Q7P7J46K08n45
2428b55k57l22o2l04j19M22O59N11J30J067J37M50j59L16m48n35p68m74o91l38
2448a040l57l61L72J78K78O25K2O6L91j27m89Q9J4n55J30PK47L29P07L53M00L72
2470A651J88j5k68j55o00n93p21k24l45m63j8K14K12J97L10M25j36N07m39L83
2490A10k48J49k33n5J67j5K50K78P14R0K73L21q4n65q8l05n45o05k38k85l69k00
2512a483M73J26p4L76J90L23k64L70j59o3K0k52N40j89K29K28J14K45Q5L88j75
$$ plain form
2533 1048 1337 840 579 384 146 -578 -735 -833 -1127 -1087 -1022 -1106 -764 -622 -422 -237 -183 -123 113 57 24 95 -25
2556 -25 279 151 333 325 692 798 525 739 560 689 642 256 134 92 -599 -669 -606 -514 -600 -595 -487 -481 -401 -213 -362
2581 -362 -119 -169 -13 118 -32 94 351 -36 368 368 612 424 459 322 529 217 264 345 82 194 239 -244
2603 -244 -103 -32 -364 -373 -478 -438 -535 -319 -454 -262 -384 -533 27 -221 -105 80 200 8 274 447 161 443
2625 443 150 193 216 249 259 181 284 143 429 417 139 231 225 177 -15 -264 -334 -432 -517 -456 -408 -79 -98 -224 -205 -283
2651 -283 25 -107 136 -352 -296 -154 -139 132 584 524 625 762 443 315 438 294 384 23 -386 -329 -610 -840
2673 -840 -734 -423 -698 -537 -358 31 -199 -152 163 217 -230 65 5 50 5 332 272 -31 363 736 451 674
2695 674 1004 1115 406 560 424 59 -371 -513 -693 -582 -744 -797 -681 -508 -329 -53 -295 -91 0 32 -188
$$ packed form
2533A048K89m97k61j95k38p24j57r8k94M0O5q4L42J42K00J85N4O0K36n6l3P1j20
2556b5L04j28J82qL67J06k73K14j79J29m7l86j22m2o91p0O3R2q6NJ08OQ0J88j49
2581c62K43n0J56J31j50J26K57l87M04%K44j88L5j37K07l12M7Q1k63J12M5m83
2603b44J41P1l32rj05M0r7K16j35J92j22j49N60k48J16J85J20j92K66J73k86K82
2625D43k93M3K3L3J0p8J03j41K86j2k78R2om8j92k49p0r8q5O1M8L29j9j26J9p8
2651b83L08j32K43m88N6J42J5K71M52o0J01J37l19j28J23j44R0l61m09N7k81k30
2673h40J06L11k75J61J79L89k30M7L15N4m47K95o0M5m5L27o0l03L94L73k85K23
2695F74L30J11p09J54j36l65m30j42j80J11j62n3J16J73J79K76k42K04R1L2k20
$$ plain form
2716 -188 -174 9 -159 -31 29 355 259 542 749 976 595 571 646 481 274 -217 -314 -378 -652 -698 -752 -588 -817
2739 -817 -382 -326 -414 -310 -228 -245 -426 -205 -208 50 -176 -172 355 458 404 864 1083 1043 934 924 652 150 142 -104
2763 -104 -355 -787 -786 -937 -825 -871 -419 -429 -514 -311 -71 -128 -220 -51 107 -172 -138 101 -81 -115 138 564 628
2786 628 574 955 1096 774 664 569 308 -118 -420 -569 -551 -765 -818 -732 -527 -712 -225 -119 -279 -108 -34 -130
2808 -130 -264 -185 196 129 95 257 583 403 456 817 837 500 788 895 519 244 245 -365 -382 -605 -304 -603 -911
2831 -911 -695 -353 -437 -260 -161 -24 17 -329 -33 -174 -67 -174 -77 100 142 243 660 690 830 776 813 388 470
2854 470 84 -104 -75 -480 -354 -746 -686 -278 -541 -294 -385 -179 -186 -154 88 25 -33 -381 -236 -155 -196 244 98
2877 98 111 536 596 193 455 346 536 407 -122 74 -58 -228 -201 -743 -440 -169 -200 -322 -98 -123 45 -168
$$ packed form
2716a88J4J83j68J28O0L26r6K83K07K27l81k4P5j65k07m91r7o4k74m6n4J64k29
2739h17M35N6q8J04Q2j7j81K21lK58k26MN27J03n4M60K19m0j09j0k72n02qk46
2763a04k51m32Jj51J12m6M52j0q5K03K40n7r2J69J58k79L4K39j82l4K53M26O4
2786F28n4L81J41l22j10r5k61m26l02j49J8k14n3Q6K05j85M87J06j60J71P4r6
2808a30j34P9L81o7l4J62L26j80N3L61K0l37K88J07l76k75Jo10j7k23L01k99l08
2831i11K16L42q4J77R9J37M1l46K96j41J07j07R7J77M2J01M17L0J40n4L7m25Q2
2854D70l86j88K9m05J26l92O0M08k63K47r1K06pL2K42o3n8l48J45Q1m1M40j46
2877I8J3M25O0m03K62j09J90j29n29J96j32j70K7n42L03K71l1j22K24k5J68k13
$$ plain form
2899 -168 -18 49 -178 -245 -224 -74 -204 85 -191 99 59 141 286 197 498 530 336 386 -31 -232 190 -287 -233
2922 -233 -238 -413 -100 -140 -113 -5 -68 -8 -394 134 -441 -325 -279 -325 -318 -288 -236 -97 28 209 286 479 193 467
2946 467 426 296 350 -113 273 4 18 -10 -107 70 207 100 -156 -119 -247 -137 131 -83 -292 -156 -477 -261
2968 -261 -224 -340 -307 -143 -34 94 189 370 226 410 234 329 134 -91 318 28 341 56 69 105 -76 -129
2990 -129 159 217 -86 -298 135 -120 -323 -266 -229 -140 -446 -340 -98 55 -97 173 -73 -55 147 315 205 188
3012 188 168 429 187 67 235 199 7 -104 -52 -275 138 34 -261 -200 -410 -455 -431 -238 -386 -206 -16 -82
3034 -82 208 -78 91 35 329 -2 -78 273 200 250 170 114 417 46 -10 18 -6 -236 32 -205 -89 45 -155
3057 -155 -209 -76 -194 -610 -329 -337 -337 -420 -397 -285 -9 -67 111 320 91 365 728 167 430 366 90 88 -87 199
$$ packed form
2899a68J50O7k27o7K1J50j30K89k76K90m0Q2J45q9L01L2j94N0m17k01M22m77N4
2922b33nj75L13m0K7J08o3O0l86N28n75J16M6m6PL0N2J39J25J81P7J93k86K74
2946D67m1j30N4m63L86k69J4k8r7J77J37j07k56L7j28J10K68k14k09J36l21K16
2968b61L7j16L3J64J09J28R5J81j44J84j76R5j95k25M09k90L13k85J3L6j81n3
2990a29K88N8l03k12M33k55k03N7L7Q9l06J06K42J53j52K70k46J8K02J68j10j7
3012A88k0K61k42j20J68l6j92j11N2k23M13j04k95O1k10m5K4J93j48J80J90o6
3034h2K90k86J69n6K94l31p6L51p3N0q0n6L03l71n6K8k4k30K68k37J16J34k00
3057a55n4J33j18m16K81q%q3K3J12K76n8J78K09k29K74L63n61K63o4k76kj75K86
$$ plain form
3081 199 243 40 -105 -161 10 -137 -222 -162 -76 -74 -385 -554 -420 -66 -338 -154 -127 -228 -285 133 522 373 206
3104 206 536 395 465 644 100 364 193 -81 -92 -132 -156 -375 -169 -352 44 -345 -307 -101 71 -259 -183 -96
3126 -96 -206 -280 -137 23 -55 58 34 230 384 169 115 319 256 18 -41 249 -62 4 164 173 -343 -7 72 94
3150 94 -97 109 -133 -90 61 -261 -284 -381 -205 -273 -355 -282 -43 -179 107 134 144 20 416 228 292 228 -129 -83
3174 -83 -421 79 -208 -58 -49 -105 -5 80 148 158 -100 3 156 164 0 -83 -199 -69 -77 -85 -458 -116 5 -68 10
3199 10 184 231 107 35 -3 212 110 -47 -184 -6 15 131 403 141 192 126 117 182 153 2 18 -165 -109 -52 -149
3224 -149 6 -192 -18 -202 181 -124 -80 95 68 217 -241 250 -38 -226 286 228 -68 222 225 162 166 452 163
3247 163 -164 -176 37 -225 -181 -192 -275 -100 -169 -357 -250 -335 -10 -200 -410 -178 76 85 101 -201 40 172 -22
$$ packed form
3081A99M4k03j45n6J71j47q5O0Q6Kl11j69J34L54k72J84K7j01n7M18L89j49j67
3104B06L30j41P0J79n44K64j71k74j1m0k4k19K06j83L96l89L8K06J72l30P6Q7
3126i6j10p4J43J60p8J13k4J96J54k15n4K04o3k38n9K90l11O6J60Rn16L36P9K2
3150I4j91K06k42M3J51l22k3r7J76o8q2P3K39j36K86K7J0j24L96j88O4o4l57M6
3174h3l38N00k87J50Rn6J00Q5O8J0k58J03J53Qj64q3j16J30qql73L42J21p3P8
3199A0J74M7j24p2l8K15j02j57j37J78K1J16K72k62N1o6rO5k9j51J6j83N6N7r7
3224a49J55j98J74j84L83l05M4J75k7J49m58M91k88j88N12n8k96K90Lo3MK86k89
3247A63l27j2K13k62M4j1q3J75o9j88J07q5L25j90k10K32K54RJ6l02K41J32j94
$$ plain form
3270 -22 210 137 122 196 118 336 149 211 -43 -248 -37 -140 -204 -280 -305 -283 -281 -231 -128 -265 -288 -130 -142 -15 -85
3295 -85 226 162 256 -30 345 195 58 277 56 340 0 -33 237 30 23 -213 180 80 36 -63 70 -253 -255
3318 -255 74 -373 -296 -331 -211 7 -5 -303 -20 81 -12 421 310 76 121 117 364 121 117 -32 -149 -19 128
3341 128 -58 -112 -19 -83 -71 -74 80 -116 -490 -201 -262 -54 -16 -153 -107 -115 -417 82 363 392 166 171 69 456 337
3366 337 96 -120 -328 -176 -10 -290 -208 56 61 -141 3 86 66 -166 125 -158 9 -71 -348 -15 -122 106
3388 106 112 116 313 266 325 263 15 -19 5 -19 -236 -418 -544 -78 127 18 -85 -277 54 93 245 191 7 -114
3412 -114 82 -142 -244 -188 -157 -45 152 126 35 98 363 249 -98 317 31 -193 -246 -347 -514 -152 -296 -402
3434 -402 -168 91 31 261 205 494 353 130 144 -107 186 -142 -163 -290 -269 62 -91 72 -78 28 92 96 -34
$$ packed form
3270b2K32p3j5P4p8K18j87O2k54k05K11j03o4p6k5K2KN0J03j37k3J58j2J27p0
3295h5L11o4R4k86L75j50j37K19k21K84l40l3K70k07pk36L93j00m4r9J33l23k
3318b55L29m47P7l5J20K18j2k98K83J01r3M33j11k34M5mK47k43mj49j17J30J47
3341A28j86n4R3o4J2lJ54j96l74K89o1K08L8j37M6ql02M99K81K9k26Nj02L87j19
3366C37k41k16k08J52J66k80Q2K64Nk02J44Q3k0k32K91k83J67q0k77L33j07K28
3388A06OMJ97m7N9o2k48l4K4k4k17j82j26M66K05j09j03j92L31L9J52n4j84j21
3412a14J96k24j02N6L1J12J97k6r1O3K65j14l47M15k86k24n3j01j67L62j44j06
3434d02K34K59o0K30n6K89j41k23J4k51K93l28k1j27K1L31j53J63j50J06O4Mj30
$$ plain form
3457 -34 -270 -147 -443 -139 -239 -362 -331 82 125 239 489 305 484 391 360 507 160 251 30 -49 -59 -160 -225
3480 -225 -135 -157 -220 150 -139 137 -296 -369 -197 -242 -221 -418 -386 -529 -48 67 117 512 314 305 787 780 278 556
3504 556 607 201 -159 145 -69 -320 -200 -250 -208 -281 -89 -254 -9 -123 -80 -409 -190 -475 -86 -370 -497 -204
3526 -204 37 229 370 480 690 795 660 729 486 296 358 159 -131 -18 -435 17 -185 -274 -227 -43 -311
3547 -311 -252 -403 -164 -217 -395 -323 -420 -321 -53 -108 -31 314 387 581 501 426 485 504 651 443 204 -215 10 -238
3571 -238 -305 -247 -640 -147 -316 -314 -112 -275 -143 15 -232 -462 -436 -177 -433 -222 97 70 258 433 595 670
3593 670 731 719 764 406 452 234 203 -129 -203 12 -401 -255 -436 -420 -141 -281 -186 -319 -351 -400 -150 -674 -218
3616 -218 -239 -176 -297 -314 128 230 508 573 461 395 543 446 601 208 208 -161 -73 -151 -157 -22 -110 -314 -110 -254
$$ packed form
3457c4k36J23k96L04j00j23L1M13M3J14K50j84J79r3l1J47l47R1k21p9j0j01o5
3480b25R0k2o3L70k89K76m33p3J72m5K1j97L2j43M81J15N0L95j98rM82pn02K78
3504E56N1m06l60L04k14k51J20n0M2p3J92j65K45j14M3l29K19k85L89k84j27K93
3526b04K41J92J41J10K10J05j35O9k43j90O2j99k90J13m17M52k02q9M7J84k68
3547c11N9j51K39n3j78P2r7R9K68n5P7L45P3J94q0p5N9J9J47k08k39m19K25k48
3571b38o7N8l93M93j69KK02j63J32J58k47k30K6K59k56K11L19k7J88J75J62P5
3593F70O1j2M5l58M6k18l1l32p4K15m13J46j81J6K79j40R5j33l2m9K50n24M56
3616b18k1O3j21j7M42J02K78O5j12o6J48r7J55l93%l69Q8p8oJ35q8k04K04j44
$$ plain form
3640 -254 -388 -241 -278 -568 -338 -353 -360 103 29 -210 -15 178 229 312 410 684 452 382 172 226 -69 -71 128 -234
3664 -234 20 -237 -176 -213 -76 -184 -27 93 141 -186 -173 56 -189 -163 -164 -107 -115 137 215 298 240 493 272 363 398
3689 398 280 443 32 278 289 -81 -110 193 66 -54 -105 -199 6 -174 -159 -104 -157 -374 74 -94 -225 -61
3711 -61 39 46 -32 231 258 105 277 301 397 93 246 234 -8 294 92 156 -156 165 19 69 30 -73 -39 72
3735 72 -67 -245 -217 -77 -325 -75 -13 -49 -150 -101 146 -329 -145 219 76 55 -19 136 115 154 31 448 235
3758 235 162 99 83 42 99 146 -24 -127 96 -176 -45 -354 -80 -240 -40 87 -113 -218 -48 139 21 -168
3780 -168 192 168 154 181 437 48 105 309 199 -24 43 391 44 72 132 5 -359 -326 -280 -174 -176 -170 -72 62 3
3805 3 -173 -161 -323 -131 -222 -315 -169 -139 -59 27 178 513 404 286 302 111 262 183 268 -68 -139 299 58 -58
$$ packed form
3640b54j34J47l7k90K30j5pM63p4k39J95J93N1Q3R8K74k32p0k10N4k95kJ99l62
3664b34K54k57O1l7J37j08J57J20M8l27J3K29k45K6jN7qK52P8Q3n8K53k21R1L5
3689C98j18J63m11K46J1l70k9L03j27j20n1r4K05j80J5N5n3k17M48j68j31J64
3711f1J00Pp8K63K7j53J72K4R6l04J53j2k42L02k02O4l12L21j46N0l9j03L4J11
3735G2j39j78K8J40k48K50O2l6j01M9K47m75J84L64j43k1p4J55k1L9j23M17k13
3758B35p3o3j6m1N7M7j70j03K23k72J31l09K74j60K00J27k00j05J70J87j18j89
3780a68L60k4j4K7K56l89N7K04j10k23O7L48l47K8O0j27l64L3M6J06kOR8J34n9
3805Cj76J2j62J92r1r3J46L0Q0Q6J51L35j09j18J6j91J51p9Q5l36p1M38k41j16
$$ plain form
3829 -58 -468 -187 -206 -279 -77 -74 -221 -124 10 -165 -69 -244 -46 -207 -84 62 -22 120 44 96 427 431 69 422
3853 422 -7 322 -135 -128 -310 -127 -53 -297 -62 -191 -28 -211 -262 -105 -467 -150 -282 -174 -248 -91 -34 -201
3875 -201 -8 76 267 182 331 302 272 313 90 180 158 -15 -119 83 -165 160 172 76 -92 -38 -103 -178 68 -11
3899 -11 -75 -145 -223 -330 -21 62 280 133 -7 163 279 494 276 232 215 138 67 57 266 -87 129 -18 -47 35
3923 35 -203 -3 -110 -124 101 92 -104 -101 60 -234 -40 -333 -217 -8 61 162 99 229 429 291 23 -147 92
3946 92 -124 -55 54 -300 -271 -48 22 -189 -138 -32 290 48 72 -39 -260 -180 -294 -240 -186 -196 -242 91 49 -2
3970 -2 70 337 232 135 112 121 -6 165 48 -106 -25 -179 33 -129 67 -57 90 -94 -119 437 -98 -204 -184
3993 -184 -137 -73 -183 -155 -248 -144 92 66 113 168 170 124 101 381 124 -86 114 -207 285 -23 283 81 335 275
$$ packed form
3829e8m10K81j9p3K02Lj47R7J34j75R6j75J98j61J23J46q4J42p6N2L31Ml62L53
3853D22m29L29m57Pj82J83P4k44K35j29J63j83n1J57l62L17j32J08p4J57N7j67
3875b01J93Q4J91q5J49k9l0M1k23R0k2j73j04K02k48L25J2r6j68N4o5p5K46p9
3899a1o4p0p8j07L09Q3K18j47j40J70J16K15k18m4j7p7p1j0K09l53K16j47k9Q2
3923C5k38K00j07j4K25rj96LJ61k94J94k93J16K09O9J01o3J30K00j38k68j70K39
3946I2k16O9J09l54K9K23P0k11N1J06L22k42K4j11k21Q0j14N4N4j0m6L33m2n1
3970bP2K67j05r7k3Rj27J71j17j54Q1j54K12j62J96j24J47j84k5N56n35j06K0
3993a84M7O4j10K8r3J04K36k6M7N5Km6k3K80k57k10K00l21M92l08L06k02K54o0
$$ plain form
4017 275 -12 269 269 -41 151 119 25 -135 -199 25 -169 -434 -187 -157 -146 121 -71 217 -54 61 16 50 44 40
4041 40 -15 -87 116 164 -51 137 -118 130 325 210 294 218 123 -9 12 -23 78 -144 -135 -256 -368 -71 -17 -203
4065 -203 -204 -171 21 -180 -15 -20 128 138 34 -230 -9 71 178 154 91 75 6 82 139 -10 -37 -59 -194 -5 -160
4090 -160 21 -296 -418 -162 -160 -222 -214 155 -129 -68 -213 -279 -23 -19 -39 104 31 33 122 63 95 259 391 129 244
4115 244 316 216 -115 -178 -55 -267 -172 -455 -105 -92 22 -197 -9 -55 -104 81 -4 -260 -129 -46 245 5 133
4138 133 -186 -189 48 -9 221 209 270 142 63 150 -66 8 -288 -273 -101 -207 -150 -526 -73 -218 -182 -43 109 40
4162 40 -176 58 215 143 96 7 -136 234 -41 156 11 281 108 90 -4 -99 167 -24 19 -253 142 -178 103
4185 103 -76 -319 77 52 50 35 -302 143 129 -128 12 -144 43 128 16 -211 -74 -150 141 60 -38 -133 118
$$ packed form
4017B75k87K81%l10J92l2r4j60o4K24j94k65K47L0J1K67j92K88k71J15m5L4om
4041D0n5p2K03M8k15J88k55K48J95j15Q4p6r5j32K1l5J01k22Rj21j12K97N4j86
4065b03jL3J92k01J65nJ48J0j04k64K21Q0J07k4o3j6o9P6N7j49k7k2j35J89j55
4090a60J81l17j22K56Ko2QL69k84O1j45o6K56Mk0J43p3KQ9n9L2J64J32k62J15
4115B44P2j00l31o3J23k12R5k83L50J3J14k19J88m6m9J85q5k56J31Q3K91k40J28
4138A33l19lK37n7K30j2O1j28p9Q7k16P4k96J5J72j06N7l76M53j45L6J39J52o9
4162D0k16K34J57p2m7q9j43L70k75J97j45K70j73j8r4r5K66j91M3k72L95l20K81
4185A03j79k43L96k5kj5l37M45j4k57J40j56J87Q5j12k27J37p6K91q1r8r5K51
$$ plain form
4208 118 186 208 42 -12 -57 -20 7 -41 -163 -242 216 -106 -54 -376 -77 -234 56 38 2 -40 -142 51 -27 61 1
4233 1 -37 108 36 -11 -17 59 -10 166 -80 110 349 -40 159 -133 102 143 -75 37 -284 61 -275 -150 -105 -68
4257 -68 191 -189 210 72 -46 18 -48 13 215 -79 113 159 126 -63 282 176 0 -22 -41 149 -53 100 -227
4280 -227 110 -169 -186 -81 170 89 -117 -104 -214 -105 103 -55 83 -199 -105 -85 16 -85 -128 126 -183 -158
4302 -158 70 296 388 -28 -29 80 -65 130 -95 43 -189 -274 -63 125 254 159 -25 -162 -221 -24 -45 -296
4324 -296 -190 -218 -100 -343 24 80 -1 20 249 -94 112 109 254 189 64 146 233 231 -197 -97 -276 -138 25 130
4348 130 -304 -280 -122 -470 -284 -143 -265 -209 -23 -143 -140 -20 -55 28 -108 82 104 136 143 347 320 258 69 147
4372 147 -3 81 -110 84 184 -85 60 -250 -32 -351 -485 -304 -31 -337 120 -123 -151 -81 -307 -54 9
$$ packed form
4208A18O8K2j66n4m5L7K7m8j22p9M58l22N2l22K99j57K90j8l6m2j02J93p8Q8o0
4233Al8J45p2m7oP6o9J76k46J90K39l89J99k92K35M1k18J12l21L45l36J25M5L7
4257f8K59l80L99j38j18O4o6O1K02k94J92M6l3j89L45j06j76k2j9J90k02J53l27
4280b27L37k79j7J05K51q1k06J3j10J09K08j58J38k82R4K0J01j01m3K54l09K5
4302a58K28K26R2m16jJ09j45J95k25J38k32q5K11J88J29r5j84j37n9J97k1k51
4324b96J06k8J18k43L67N6q1K1K29l43K06lJ45o5j25Q2Q7km28J00j79J38J63J05
4348A30m34K4J58l48J86J41j22N6J86j20LJ20l5Q3j36J90K2L2PK04k7o2j89P8
4372A47j50Q4j91J94J00k69J45l10K18l19j34J81K73l06M57k43k8P0k26K53O3
$$ plain form
4393 9 -11 29 262 518 264 190 64 138 473 382 13 77 276 171 -86 -102 -109 -103 -198 14 -243 -227 -139 -136 -150 -285
4419 -285 -89 81 -352 51 -23 -65 246 18 224 36 217 182 -99 347 233 4 241 54 256 -55 76
4440 76 47 -56 -16 -168 -90 -101 -203 -129 -168 -188 -293 -257 32 -66 13 -73 42 142 203 67 -5 84 63 27 519 99
4466 99 -59 -13 56 -32 -147 58 57 -206 -125 -106 -46 -133 -92 -151 -166 -173 43 -19 -297 -115 58 85 21 -65 105 31 -40
4493 -40 177 66 39 -42 32 166 -38 -190 -130 493 -46 -60 201 -63 -53 -16 99 -65 -259 -159 52 -283 -177
4516 -177 -123 -9 -205 -84 49 -323 -41 -66 -150 75 87 234 394 95 104 299 -43 289 291 101 293 -106 -1
4539 -1 -35 23 -69 -36 -139 -13 -33 -202 178 36 -432 -173 -92 -294 -136 -27 107 163 318 -5 133 100 126 301
4563 301 161 25 198 51 162 -116 -189 25 3 146 237 -267 -32 -147 -304 -132 -23 -225 88 -74 -196
$$ packed form
4393Ik0M0K33K56k54p4j26P4L35r1l69O4J99j05k57j6pOr5K12k57J6Q8Lj4j35
4419b85J96J70m33M03p4m2L11k28K06j88J81l5k81M46j14k29K37j87K02l11J31
4440G6k9j03M0j52P8j1j02P4l9k0j05L6K89r8P9q6J15J00O1j36p2Q9k1l6M92m20
4466I9j58M6O9q8j15K05jk63Q1J9O0q7M1n9j5pK16o2k78J82J73K7o4q6J70p4p1
4493d0K17j11k7q1P4J34k04j52O0O23n39j4K61k64J0L7J15j64j94J00K11l35J06
4516a77N4J14j96J21J33l72K82k5q4K25J2J47J60k99RJ95l42L32Kj90J92l99J05
4539al4N8r2L3j03J26k0j69L80j42m68K59Q1k02J58J09J34N6J55l23J38l3K6J75
4563C01j40j36J73j47J11k78p3K14k2J43R1n04K35j15j57J72J09k02L13j62j22
$$ plain form
4584 -196 -260 -116 -76 84 267 -4 362 243 128 325 297 193 121 78 46 38 -177 61 102 -416 -107 -137 -23
4607 -23 -205 -80 -369 -164 -145 -229 -184 -352 -133 -183 -161 172 -12 179 376 171 147 125 177 148 -21 -82 -134 163
4631 163 127 200 245 92 147 228 -66 -187 -156 -141 -24 -575 -416 -379 -105 -103 -448 148 -57 -31 -65 383 242 521
4655 521 213 49 378 54 228 133 -64 -89 64 38 141 -14 -210 -41 -200 -224 -132 -271 -434 -396 -169 -410
4677 -410 -247 89 -182 -57 142 285 317 112 421 158 319 331 147 195 183 166 -71 -7 193 -101 -172 93
4699 93 -247 -122 78 -231 -354 -375 -782 -454 -311 -364 -112 -204 168 80 190 202 197 193 318 227 313 118 0 256
4723 256 -167 24 -149 -125 136 -13 -42 37 -276 -240 -288 -313 -104 -252 -411 -136 -239 -353 -308 77 -134 -39 288
4746 288 274 437 -32 380 40 45 383 -47 -164 139 -121 -36 -79 -81 35 -203 -159 -387 -115 -280 -383 -107 -228
$$ packed form
4584a96o4J44M0J60J83k71L66j19j15J97k8j04p2m3l2qk15K38M1n18L09l0J14
4607b3j82J25k89K05J9q4M5j68K19n0K2L33j84J91J97k05k4k2N2k9j69o1n2K97
4631A63l6P3M5j53N5Q1k94j21L1J5J17n51J59L7K74Kl45N96k05K6l4M48j41K79
4655E21l08j64L29l24J74r5j97k5J53k6J03j55j96J69j59k4R2j39j63L8K27k41
4677d10J63L36k71J25J99J43L2k05L09k63J61J2j84M8j2j7k37O4K00k94p1K65
4699I3l40J25K00l09j23k1m07L28J43n3K52r2L72q8J10J2nmJ25r1Q6j95j18K56
4723B56m23J91j73K4K61j49k9P9l13L6m8k5K09j48j59K75j03j14M5L85k11R5L27
4746B88j4J63m69M12l40NL38m30j17L03k60Q5m3kJ16k38M4k28K72j65j03K76j21
$$ plain form
4769 -228 -111 -137 -237 65 175 -21 -41 -46 25 -45 199 147 -108 31 80 -52 -29 -227 -133 90 29 69 301 170
4793 170 247 199 191 130 -130 -115 -278 -322 -30 18 24 67 143 151 -183 60 214 86 63 219 154 37 209 11 273
4818 273 245 -107 -20 -55 -123 -84 11 -2 -12 21 24 -271 -157 -122 -251 -350 36 -34 -2 46 -111 -156 -109 129 110 10
4844 10 -85 -40 -191 -1 106 55 143 47 -99 58 28 81 87 19 -100 55 -116 -291 -3 -100 181 -101 -104 -95 -206
4869 -206 -52 115 96 -112 -4 215 -235 -12 -58 254 113 -120 131 -81 290 156 -119 321 13 -97 -203
4890 -203 229 -179 -139 -235 -197 30 50 -267 -58 -242 -207 -37 -239 12 -85 72 -10 -104 163 402 -175 236 61
4913 61 227 77 351 154 -49 163 87 211 -67 -216 -116 -114 -149 88 -304 -122 75 -28 78 -98 -500 -116
4935 -116 187 -125 -211 197 106 68 139 272 267 -53 64 101 -99 12 374 -43 245 163 -14 37 -46 326 40
$$ packed form
4769b28J17k6j00L02J10j96k0nP1p0K44n2k55J39M9j32K3j98R4K23o1M0K32j31
4793A70P7m8qo1k60J5j63m4K92M8OM3P6Ql34K43J54j28k3J56o5j17J72j98K62
4818B73k8l52Q7l5o8L9R5j3j0L3Lk95J14L5j29r9L86p0L2M8j57m5M7K38j9j00
4844A0r5M5j51J90J07n1Q8r6j46J57l0N3Oo8j19J55j71j75K88r7K81k82lRj11
4869b06J54J67j9k08J08K19m50K23m6L12j41k33K51k12L71j34k75M40l08j10j06
4890b03M32m08M0r6L8K27K0l17K09j84L5J70k02K51r7J57q2r4K67K39n77M11j75
4913F1J66j50K74j97k03K12p6J24k78j49J00Kl5K37l92J82J97j03J06j76m02L84
4935a16L03l12q6M08r1l8P1J33nl20J17L7k00J11L62m17K88q2j77N1q3L72k86
$$ plain form
4958 40 -259 -113 -288 -333 -58 -31 -198 34 -230 -6 119 309 46 381 50 177 158 2 6 -119 -135 505
4980 505 257 141 -75 9 180 -200 102 -71 -77 -234 -55 -7 -142 -119 127 -82 -79 -299 -87 -68 197 62 230
5003 230 -15 31 117 -159 179 -43 79 20 -10 18 -43 32 241 13 119 201 -194 -184 -8 -165 -286 3 -225
5026 -225 -92 109 -275 189 -31 -87 -64 94 112 -104 38 183 54 -193 -27 -54 -154 82 150 88 -16 84
5048 84 227 -4 -1 -73 -282 -258 -41 -326 -348 30 -21 -89 6 75 -2 5 66 -8 -95 101 -213 -148 -3 -27 -330 -17
5074 -17 -28 111 -4 115 373 197 129 20 3 296 -221 -84 -168 -159 -135 -57 -141 100 -171 -89 81 66 -132 -98
5098 -98 66 52 -275 -144 -226 -167 -7 24 310 -70 -28 371 -94 269 366 130 254 2 -127 199 -264 -89
5120 -89 155 -23 -234 35 5 -287 7 -13 -156 -36 -10 -135 -183 -336 -192 -51 158 212 80 102 280 17
$$ packed form
4958D0k99J46j75m5K75K7j67K32k64K24J25J90k63L35l31J27j9j56Mj25j6O40
4980E05k48j16k16Q4J71l80L02j73oj57J79M8j35K3K46k09Lk20K12J9K65j35J68
5003B30k45M6Q6k76L38k22J22n9l0K8o1P5K09k28J06Q2l95J0J76j57j21K89k28
5026b25J33K01l84M64k20n6K3J58J8k16J42J45j29k47J66k7j00K36O8o2j04J00
5048H4J43k31Lp2k09K4K17k85k2L78n1o8R5O9p7PO1p4q7J96l14O5J45k4l03L13
5074a7j1J39j15J19K58j76o8j09j7K93n17J37q4RK4P8q4K41k71Q2J70j5j98L4
5098i8J64j4l27J31q2N9J60L1K86l80M2L99m65L63R7k36J24k52j29L26m63J75
5120h9K44j78k11K69l0k92K94k0j43J20K6j25m8j53J44J41K09N4j32K2J78k63
$$ plain form
5142 17 59 256 -170 114 -35 -91 -134 14 119 174 -187 -262 -104 -296 -64 -71 43 113 -432 -87 -333 -101 -23
5165 -23 -12 -389 -77 313 315 31 421 119 392 284 -38 -131 55 -224 72 -51 -24 182 -467 -90 50 -5
5187 -5 -25 -208 29 -174 9 43 -248 -284 -255 -293 57 215 -8 180 435 75 129 279 226 222 282 -73 88 95 117
5212 117 89 -103 113 -60 130 -252 -120 -99 -1 -352 -2 -305 -111 5 -404 -72 -15 -96 142 -64 396 194
5234 194 80 227 109 114 24 74 122 106 -41 -14 -70 20 -69 127 -157 -43 -182 81 -127 35 -23 -69 -247 -238 -163
5259 -163 49 92 199 98 -64 227 118 311 71 299 210 109 332 30 180 -86 -3 -21 1 -35 -85 -2 -10
5282 -10 -225 26 -113 -63 -357 68 -74 -211 32 36 -137 30 115 -144 119 191 143 269 109 103 216 13 -22
5305 -22 73 -3 -211 163 -2 -282 -54 34 65 -200 2 -147 -290 -87 -108 -122 135 -26 96 -322 -113 39
$$ packed form
5142A7M2J97m26K84j49n6m3J48J05N5l61p5J58j92K32pJ14P0n45L45k46K32P8
5165b3J1l77L12L90Kk84L90l02K73j08l22r3J86k79K96j23K7K06o49L77J40n5
5187ek0j83K37k03J83L4k91l6K9l8L50J58k23J88K55l60N4J50n3mO0l55J61PK2
5212A17k8j92K16j73J90l82J32K1R8l51L50l03J94J16m09L32N7q1K38k06M60k02
5234A94j14J47j18Nr0N0M8j6j47K7n6R0q9J96k84J14j39K63k08J62n8m6j78RP5
5259a63K12M3J07j01j62K91j09J93k40K28q9j01K23l02J50k66Q3j8K2l6n0Q3q
5282a0k15K51j39N0k94M25j42j37K43Mj73J67Q5k59K63P2m8J26j60oJ13k03l5
5305b2R5p6k08L74j65k80K28Q8L1k65K02j49j43K03k1j4K57j61J22m18K09J52
$$ plain form
5327 39 125 90 104 270 275 361 297 50 -48 257 370 253 21 52 -61 63 -27 -111 102 -172 -244 -88 -213 -97
5351 -97 19 -114 54 -48 -94 -174 -16 8 216 90 -35 178 147 126 253 226 211 219 149 240 10 -19 73 -155 119
5376 119 -220 -238 -76 -40 99 -67 -76 59 -145 -230 -43 -25 -318 -210 46 46 283 10 -24 54 188 47 -57
5399 -57 272 167 264 -139 -16 247 -263 104 -19 -136 -45 -59 39 -220 -71 -136 -206 -310 -59 -155 -124 -74 -49 34
5423 34 217 325 -44 149 170 380 -58 -17 30 35 16 -139 85 168 3 64 -117 33 17 45 23 49 52 -332 -290
5448 -290 -329 -114 -284 -292 -201 137 166 -166 3 129 213 317 -74 192 193 64 305 -127 202 37 79 -35 259
5471 259 -199 -192 -316 144 -127 -190 -51 -381 -170 -115 -295 -125 -66 26 -228 -84 -181 -50 48 217 228 62 101
5494 101 135 198 69 0 59 230 50 104 171 -36 -57 17 31 -116 -125 -188 -369 -310 -293 171 -223 9 -235 118 132
$$ packed form
5327C9Q6l5J4J66NQ6o4k47r8L05J13j17k32L1j13J24r0q4K13k74p2J56j25J16
5351i7J16j33J68j02m6q0J58K4K08j26j25K13l1k1J27k7j5Qp0R1k30k9R2k28K74
5376A19l39j8J62L6J39j66rJ35k04q5J87J8k93J08K56%K37k73l4P8J34j41j04
5399e7L29j05R7m03J23K63n10L67j23j17R1j4R8k59J49o5p0j04K51r6L1N0K5Q3
5423C4J83J08l69J93K1K10m38M1M7Nj9j55K24Q3j65O1j81J50j6K8k2K6Ll84M2
5448b90l9K15j70qR1L38K9l32J69J26Q4J04l91K66Jj29K41m32L29j65M2j14K94
5471B59m58Pj24M60k71o3J39l30K11N5j80J70N9R2k54J44r7J31R8J69J1j66L9
5494A01L4O3j29o9N9J71j80N4O7k07k1P4J4j47ro3j81N9J7M64l94K32k44L53J4
$$ plain form
5519 132 201 106 70 287 275 252 136 58 249 140 -13 54 115 12 -133 0 88 -104 -6 -175 -27 -235 -162 -111
$$ packed form
5519A32O9r5l6K17j2k3j16p8J91j09j53O7O1j03j45J33Q8j92R8j69J48k08P3N1
$$ [...]
8191H2
##END NTUPLES=NMR FID
##END=
