##TITLE=1H_Pr 37-38-F
 200.13MHz, CDCl3,
 8 sc
 
 20.10.2025
##JCAMPDX= 6.0         $$ Bruker NMR JCAMP-DX V2.0
##DATA TYPE= NMR FID
##DATA CLASS= NTUPLES
##ORIGIN= UXNMR, Bruker Analytische Messtechnik GmbH
##OWNER= pz
$$ XWIN-NMR		Version 3.5
$$ Mon Oct 20 16:13:46 2025 Russian Standard Time (UT+4h)  she@DPX200
##.OBSERVE FREQUENCY= 200.1308
##.OBSERVE NUCLEUS= ^1H
##.DELAY= (6, 6)
##.ACQUISITION MODE= SIMULTANEOUS
##.ACQUISITION SCHEME= undefined
##.AVERAGES= 8
##.DIGITISER RES= 18
##SPECTROMETER/DATA SYSTEM= spect
##.PULSE SEQUENCE= zg30
##.SOLVENT NAME= CDCl3
##.SHIFT REFERENCE= (INTERNAL, CDCl3, 0, 14.3821)
##AUDIT TRAIL= $$ (NUMBER, WHEN, WHO, WHERE, WHAT)
$$ ##TITLE= Audit trail, XWIN-NMR		Version 3.5
$$ ##JCAMPDX= 5.01
$$ ##ORIGIN= Bruker BioSpin GmbH
$$ ##OWNER= she
$$ F:/spectra/data/she/nmr/H-C/1/audita.txt
$$ ##AUDIT TRAIL=  $$ (NUMBER, WHEN, WHO, WHERE, WHAT)
(   1,<2025-10-20 16:12:27.25 +0400>,<she>,<DPX200>,
      <created by zg, POWCHK disabled, PULCHK disabled
       configuration hash MD5:
       00 E9 B6 7A A2 85 ED C7 34 08 36 98 17 FE 4E 26
       data hash MD5: 16K
       60 22 65 E8 49 1A FE 3E 4A 9E 8F 7D 33 89 D1 CD>)
$$ ##END=
$$ 
$$ hash MD5
$$ 9C 9F 36 1E B3 82 7C 6C AA E7 54 94 7A A0 90 C3
##$RELAX= 
##$RELAX= 
##$RELAX= 
##$RELAX= 
##$RELAX= 
##$RELAX= 
$$ Bruker specific parameters
$$ --------------------------
##$DU= <F:/spectra>
##$EXPNO= 1
##$NAME= <H-C>
##$PROCNO= 1
##$TYPE= <nmr>
##$USER= <she>
##$AMP= (0..31)
100 100 100 100 100 100 100 100 100 100 100 100 100 100 100 100 100 100 
100 100 100 100 100 100 100 100 100 100 100 100 100 100 
##$AQSEQ= 0
##$AQ_mod= 1
##$AUNM= <au_zg>
##$AUTOPOS= <>
##$BF1= 200.13
##$BF2= 200.13
##$BF3= 200.13
##$BF4= 200.13
##$BF5= 200.13
##$BF6= 200.13
##$BF7= 200.13
##$BF8= 200.13
##$BYTORDA= 1
##$CFDGTYP= 0
##$CFRGTYP= 5
##$CHEMSTR= <none>
##$CNST= (0..31)
1 1 145 1 1 1 1 1 1 1 1 1 1 1 1 1 1 1 1 1 1 1 1 1 1 1 1 1 1 1 1 1 
##$CPDPRG= <>
##$CPDPRG1= <>
##$CPDPRG2= <>
##$CPDPRG3= <>
##$CPDPRG4= <mlev>
##$CPDPRG5= <mlev>
##$CPDPRG6= <mlev>
##$CPDPRG7= <mlev>
##$CPDPRG8= <mlev>
##$CPDPRGB= <>
##$CPDPRGT= <>
##$D= (0..31)
0 0.7 0 0 0 0 0 0 0 0 0 0.03 0 0 0 0 0 0 0 0 0 0 0 0 0 0 0 0 0 0 0 0 
##$DATE= 1760962346
##$DBL= (0..7)
120 120 120 120 120 120 120 120 
##$DBP= (0..7)
150 150 150 150 150 150 150 150 
##$DBP07= 0
##$DBPNAM0= <>
##$DBPNAM1= <>
##$DBPNAM2= <>
##$DBPNAM3= <>
##$DBPNAM4= <>
##$DBPNAM5= <>
##$DBPNAM6= <>
##$DBPNAM7= <>
##$DBPOAL= (0..7)
0.5 0.5 0.5 0.5 0.5 0.5 0.5 0.5 
##$DBPOFFS= (0..7)
0 0 0 0 0 0 0 0 
##$DE= 6
##$DECBNUC= <off>
##$DECIM= 32
##$DECNUC= <off>
##$DECSTAT= 4
##$DIGMOD= 1
##$DIGTYP= 9
##$DL= (0..7)
0 120 120 120 120 120 120 120 
##$DP= (0..7)
150 150 150 150 150 150 150 150 
##$DP07= 0
##$DPNAME0= <>
##$DPNAME1= <>
##$DPNAME2= <>
##$DPNAME3= <>
##$DPNAME4= <>
##$DPNAME5= <>
##$DPNAME6= <>
##$DPNAME7= <>
##$DPOAL= (0..7)
0.5 0.5 0.5 0.5 0.5 0.5 0.5 0.5 
##$DPOFFS= (0..7)
0 0 0 0 0 0 0 0 
##$DQDMODE= 0
##$DR= 18
##$DS= 0
##$DSLIST= <SSSSSSSSSSSSSSS>
$$ [...]
##$SUBNAM0= <"">
##$SUBNAM1= <"">
##$SUBNAM2= <"">
##$SUBNAM3= <"">
##$SUBNAM4= <"">
##$SUBNAM5= <"">
##$SUBNAM6= <"">
##$SUBNAM7= <"">
##$SUBNAM8= <"">
##$SUBNAM9= <"">
##$SW= 18.0517779522481
##$SWIBOX= (0..15)
0 0 2 0 0 0 0 0 0 0 0 0 0 0 0 0 
##$SW_h= 3612.71676300578
##$TD= 16384
##$TD0= 1
##$TE= 0
##$TE2= 300
##$TE3= 300
##$TEG= 300
##$TL= (0..7)
0 120 120 120 120 120 120 120 
##$TP= (0..7)
150 150 150 150 150 150 150 150 
##$TP07= 0
##$TPNAME0= <>
##$TPNAME1= <>
##$TPNAME2= <>
##$TPNAME3= <>
##$TPNAME4= <>
##$TPNAME5= <>
##$TPNAME6= <>
##$TPNAME7= <>
##$TPOAL= (0..7)
0.5 0.5 0.5 0.5 0.5 0.5 0.5 0.5 
##$TPOFFS= (0..7)
0 0 0 0 0 0 0 0 
##$TUNHIN= 0
##$TUNHOUT= 0
##$TUNXOUT= 0
##$USERA1= <user>
##$USERA2= <user>
##$USERA3= <user>
##$USERA4= <user>
##$USERA5= <user>
##$V9= 5
##$VALIST= <valist>
##$VCLIST= <CCCCCCCCCCCCCCC>
##$VD= 0
##$VDLIST= <DDDDDDDDDDDDDDD>
##$VPLIST= <PPPPPPPPPPPPPPP>
##$VTLIST= <TTTTTTTTTTTTTTT>
##$WBST= 1024
##$WBSW= 4
##$XGAIN= (0..3)
0 0 0 0 
##$XL= 0
##$YL= 0
##$YMAX_a= 58849
##$YMIN_a= -75367
##$ZGOPTNS= <>
##$ZL1= 120
##$ZL2= 120
##$ZL3= 120
##$ZL4= 120
##$ABSF1= 10
##$ABSF2= 0
##$ABSG= 5
##$ABSL= 3
##$ALPHA= 0
##$AQORDER= 0
##$ASSFAC= 0
##$ASSFACI= 0
##$ASSFACX= 0
##$ASSWID= 0
##$AUNMP= <proc_1d>
##$AZFE= 0.1
##$AZFW= 0.1
##$BCFW= 1
##$BC_mod= 2
##$BYTORDP= 1
##$COROFFS= 0
##$CY= -3
##$DATMOD= 1
##$DC= 2
##$DFILT= <>
##$DTYPP= 0
##$F1P= 0
##$F2P= 0
##$FCOR= 0.5
##$FTSIZE= 0
##$FT_mod= 4
##$GAMMA= 1
##$GB= 0.15
##$INTBC= 1
##$INTSCL= 1
##$ISEN= 128
##$LB= 0.25
##$LEV0= 0
##$LPBIN= 0
##$MAXI= 10000
##$MC2= 0
##$MEAN= 0
##$ME_mod= 0
##$MI= 1.114404
##$NCOEF= 0
##$NC_proc= 0
##$NLEV= 6
##$NOISF1= 3.799351
##$NOISF2= 2.8
##$NSP= 1
##$NTH_PI= 0
##$NZP= 0
##$OFFSET= 14.38212
##$PC= 1
##$PHC0= -2281.531
##$PHC1= 15.79225
##$PH_mod= 1
##$PKNL= yes
##$PPARMOD= 0
##$PSCAL= 0
##$PSIGN= 0
##$REVERSE= no
##$SF= 200.129724274929
##$SI= 16384
##$SIGF1= 3
##$SIGF2= 2
##$SINO= 400
##$SIOLD= 16384
##$SREGLST= <1H.CDCl3>
##$SSB= 0
##$STSI= 0
##$STSR= 0
##$SW_p= 3205.1282051282
##$SYMM= 0
##$S_DEV= 0
##$TDeff= 0
##$TDoff= 0
##$TI= <>
##$TILT= no
##$TM1= 0
##$TM2= 0
##$TOPLEV= 0
##$USERP1= <user>
##$USERP2= <user>
##$USERP3= <user>
##$USERP4= <user>
##$USERP5= <user>
##$WDW= 1
##$XDIM= 8192
##$YMAX_p= 0
##$YMIN_p= 0
$$ End of Bruker specific parameters
$$ ---------------------------------
##NTUPLES= NMR FID
##VAR_NAME=  TIME,          FID/REAL,        FID/IMAG
##SYMBOL=    X,             R,               I
##VAR_TYPE=  INDEPENDENT,   DEPENDENT,       DEPENDENT
##VAR_FORM=  AFFN,          ASDF,            ASDF
##VAR_DIM=   8192,          8192,            8192
##UNITS=     SECONDS,       ARBITRARY UNITS, ARBITRARY UNITS
##FACTOR=    0.0002768,     1,               1
##FIRST=     0,             0,               0
##LAST=      2.2672688,     0,               0
##MIN=       0,             -75367,          0
##MAX=       2.2672688,     58849,           0
$$ Real data points
##PAGE= N=1
##DATA TABLE= (X++(R..R)), XYDATA
$$ [...]
1781B69k26j03k16K50K31k38j1K0J7O7J6j77J83n29J40M15n5M5j07qJ6oK10o2
$$ 269 43 -60 -276 -26 205 -33 -44 -24 -7 60 76 -101 82 -447 -307 108 53 98 -9 -17 -1 -7 203 141
1805A41j68o5l8O1J11J77k71O0j22N8K3J6O3j04L70l22Q0j9MR3kJ1j58J42o3L5
$$ 141 -27 -92 -130 -69 42 219 -52 8 -114 -56 -33 -17 46 -58 312 -10 70 51 55 148 146 157 -1 141 78 113
1831A13n6O7J87j64j42M3n4j21K08R5M0n34L28j40P9J85k12N8j64L09j0j39J00
$$ 113 57 124 311 147 5 48 -6 -127 81 176 216 -318 10 -130 -51 134 -78 -20 -184 125 115 -24 76
1854G6k28J88L8k55J10J71j04j04L31m36M17k47P7k7l8K63k47q2k59L95j66N0
$$ 76 -152 36 74 -181 -71 100 -4 -108 223 -213 204 -43 34 7 -31 232 -15 -97 -356 39 -127 -77
1876g7J74k66m5L33j93r3L99k25L4rj20K10j92l2J92m26M48m56K11J43n2o0m1
$$ -77 97 -169 -214 119 -74 -167 232 7 41 32 -88 122 -70 -102 90 -336 112 -344 -133 10 -42 -102 -143
1899a43N6J01J94m79oK71k08K42K12m35L87r1o9j16K20m96K40Q2L13k92k2J91
$$ -143 -87 14 208 -271 -277 -6 -214 28 240 -195 192 101 32 -84 136 -360 -120 -38 275 -17 -39 152
1921A52j49r2J89k36K17j72L14l33Q3k6pK66l0j73j1j15L04j74r0Q4j84J06J69
$$ 152 3 -89 100 -136 81 -91 223 -110 -27 -53 -60 206 176 3 -8 -123 181 7 -83 1 -183 -77 92
1944I2j13j05J91J23j31o1R0k24J8K93m02L13k8J20j07J06k03j29K96m57M30j66
$$ 92 -21 -126 65 188 57 -4 86 -138 -120 173 -229 84 56 176 69 175 -28 -157 139 -318 112 -54
1966e4N3q6M13m52K63k0j61l24K90M6K01j96K36k26J39J2k8Qk18Q6O1k36L83l04
$$ -54 -1 -87 326 -126 137 117 -44 -368 -78 -32 169 -27 209 -17 122 134 106 114 -104 -18 43 -193 190 -114
1990a14J13j54J26p6NJ70k85L42j44r1o7j15K44K78m44K92p7ll4j14R4K69k66
$$ -114 -1 -155 -29 -105 -100 70 -215 127 -17 -108 -175 -290 -46 232 -212 80 3 0 -34 -148 -54 215 -51
2013e1M65m81q2J65Q3K8j06J37j79M5k05J27J74k17L20k32m7L11j90j3j76J38
$$ -51 414 -67 -149 16 99 127 21 158 -21 24 -181 -54 120 -97 223 -9 -56 255 65 52 -124 14
2035A4o4n5N8j2K35n3j48K58l59K71J57k31k10K36j01l6r6L14k43M5L3k4q7r2
$$ 14 -50 -105 -47 -59 176 123 -25 233 -126 145 302 71 -139 97 -4 -40 -136 178 -65 -20 13 -11 -98 -190
2059a90J29q0P1J94p6q6J8J08k74P5K13p5k13J15R8q7l3J26K58j81p3J33l59R0
$$ -190 -61 -141 -70 124 48 -38 -20 88 -186 -111 102 27 -186 -71 27 -60 -93 33 291 110 37 170 -189 -99
2083i9K87m04K05M7K7j00k7J7p6J33k62J49J20n2R1k05J91l26L16j0J82l42J50
$$ -99 188 -216 -11 36 63 -37 -64 -47 -123 10 -252 -103 17 -35 56 -149 42 -284 32 22 204 -138 12
2106A2p6l3p5L1J31K82m56K62j60J83m76M28k3o1K4j10k08K16O7L21n81K47K93
$$ 12 -64 -97 -172 -141 -10 272 -184 78 -82 101 -375 53 30 -31 -7 -117 -325 -109 -42 279 -302 -55 238
2129B38k99nK26l25K15j79K55l30M41N4k68p6J32k98o1K38n4J09l54M90j36k19
$$ 238 -61 -66 160 -165 50 -129 126 -204 237 291 23 -53 79 -219 -280 -42 -96 13 -341 149 13 -206
2151b06L44L4o5J98l56j4j16j29N68l32K66Jj29P4l77L89K6l84K6J21o8K30r7
$$ -206 138 172 107 305 -51 -65 -181 -310 258 -74 192 193 64 138 -239 150 176 -208 -182 -61 -129 101 4
2174Dk63R2J31J64j68LK81k97QK3o3Pj14P0j4O5j49K58j11J51m7n3l3l2j38L38
$$ 4 -259 -167 -36 128 -40 -37 244 -53 -45 -22 -85 -78 -192 -122 -136 -71 -220 38 -73 78 31 -22 -55 -87 -225 113
2200A13m2p5L3l1o7J34l15K17n3k7Q0n0k2K14q6O8J93k93p2K27j21J86j60j42
$$ 113 71 -4 29 -2 -69 65 -250 -33 -86 -113 -33 -83 -105 109 23 91 284 -9 -81 146 25 211 51 -91
2224i1K9p5J09Q0k25O6K15R7q8j13j77J66N2l67N19k68J70J13j61L5r0L6M1n8
$$ -91 -62 -137 -28 52 -173 -107 108 205 117 4 -173 -7 45 -322 197 -71 99 212 51 86 -4 32 73 15
2248A5l5pj25M89j43j93L0N1k54K26P0Q7k75J65J4r5j08N7j05J19k61K22J40J
$$ 15 -20 -27 -152 337 194 1 31 82 -172 54 124 211 -64 101 115 20 -88 -31 -136 -17 -278 -56 84 85
2272H5o8l19L15M8K2p9pJ5j48j6J03K09k97J7J60k83L67q8J2L15m41J78k88K03
$$ 85 17 -302 13 61 83 4 -3 12 -136 -152 -49 160 -137 -120 40 -243 124 36 48 363 -78 100 -188 15
2296A5l5l27L66L1o3LK51N7m41K76J3L3j58j6J50k94K45pm95L95N3k8M4j26J23
$$ 15 -20 -347 19 50 -13 -10 241 298 -143 133 146 179 21 5 155 -139 106 99 -396 -1 52 24 68 -58 65
2321F5j25m6o2J95q8L8L91j10l13L27m42j10K08m3k57J7L52k88J46p5J43k1K1
$$ 65 -60 -106 -168 27 -61 -23 368 258 -55 272 -170 -280 -72 -115 -372 -355 -3 -291 -145 -220 -77 -98 -77
2344g7p2L67k49oJ68l70J05J07K08k33J34Q0k58qJ92j43j17pK41o6Q8q3J92j11
$$ -77 -149 218 -31 -37 131 -239 -134 -27 181 -52 82 162 -96 -104 88 -55 -172 -179 62 -4 84 1 193 82
2368H2j10L3l4k24M76j17o0l84L51o1j41L60p8J2N3J88m42k9L98k37j08J77KJ3
$$ 82 -28 5 -29 -253 223 106 46 -338 13 -48 -189 171 93 105 158 346 -96 -125 273 36 -72 105 107 120
2392A20J87j65p8n2k60K74k87K33m4l7l6R3j97k52L02L57m0p6K0o7M4l6R4j10
$$ 120 307 142 64 12 -248 26 -261 -28 -72 -109 -145 -52 -249 -501 -199 158 118 42 62 -5 39 3 97 -13
2416a3Oj07J90n8m3L4m9Q0P3p7k63L14j25K7n2M5L0l39L68j77Q2j82K47j80J98
$$ -13 -7 -114 76 18 -25 9 -40 40 113 36 -227 87 -38 -11 -63 -18 12 -327 41 -136 -54 -236 11 -169 29
2441B9jJ04l4k3j68L51k57J36J33k03j4k23K32l59O81l90k22J95Q5l16m0R2L19
$$ 29 28 132 98 75 -93 258 1 137 270 67 53 -170 62 -297 384 -6 -228 -33 52 -264 -304 -212 107
2464A07k66J41J68R5m25L35P4l35J89k94K64l27K65J18L9j41J0j76J81k09L50
$$ 107 -159 -18 150 245 -180 155 229 -106 83 -211 53 -274 -9 109 148 7 17 -159 22 -187 163
2485A63k18K14m75J59J46R3r0L3l8o8J86l41L67m12K39R0j56M2K11j59j46J06
$$ 163 -55 159 -316 -157 -11 82 -8 25 -13 -81 105 -236 131 -281 -42 48 -108 -66 145 -14 -160 -54
2507e4R2r2j18J00Q7J86l31K41j62j16K44p6J26j13J31k97J72j62J76l02M8R4
$$ -54 38 -54 -172 -72 15 201 -130 111 -51 -167 77 1 127 14 145 -152 20 -142 34 -268 -220 -126
2529a26J89L2n6k17K16J66k14K55j20l00K96p4n0Q0K5k29J40j64L12j19J21j36
$$ -126 63 95 39 -178 38 204 -10 245 125 -175 121 47 -3 77 102 -127 13 -151 161 42 163 27
2551B7l06L49n2j21K06K2j10N1j84n2J78p0k5n7o8L11O4o1m1r9q2j44K55n6J43
$$ 27 -279 70 18 -103 103 125 15 66 -118 -170 8 -62 -87 -144 -212 99 163 102 61 -38 -120 -264 -9 -65 78
2576G8L5k3L7k69J76N9j39K9O4j36r1J72J96j03l06J71n4j93M07o1o5q0L75l16
$$ 78 113 90 127 -142 34 93 -46 -17 47 -89 -180 -8 188 85 -221 -50 -104 -297 110 49 -16 -96 279 -37
2600c7K42l71K06pm0O6l4OO7o2O1o4m55M53Qm7q1j41K26n1K41j51O7j22%j15J87
$$ -37 205 -166 40 33 -7 59 25 31 98 36 97 33 -422 31 39 -8 -89 -230 -4 -55 186 35 102 -20 -20 -135 52
2627E2l6j45l4J68r9j90J07k52N17M2k64J79o3K72l00J61k63Q2K57j33l1J8k70
$$ 52 16 -129 -163 5 -94 -284 -177 -429 88 130 -134 45 -18 254 -46 115 -148 -66 191 58 27 45 -225
2650b25N4K60J94k23l83L63J48q3p9j23K19q2r8J80j10R9l19K93j01J89j94J31
$$ -225 -171 89 283 60 -323 40 188 105 26 -97 122 40 -58 122 12 111 -208 85 -16 173 -21 110
2672A10koN2k81m2J83J14K6r6j64R8MK18k82O7n8o3j39L38q0K57l96Q1J01p1J30
$$ 110 108 102 154 -127 -169 14 128 154 58 -106 -8 -4 214 -68 -1 -59 -122 -261 77 -3 254 -142 -61 40 -31 99
2698I9j14R6j21O8j55K45j0k2j09P9k0k03K31o0P1k64J02J53M1L5m93M35j95J43
$$ 99 -15 81 -40 28 -127 118 108 86 -23 56 36 -167 64 4 75 -189 -87 66 107 142 -351 84 -111 32
2722C2o2J44JJ32l71K31R1l89Q9J42J9J7p4j02J21N3L2l3J13j24M4j36L47k36
$$ 32 -30 114 115 247 -124 107 198 -191 -102 40 59 76 2 -100 21 74 106 73 186 62 106 -30 317 81
2746H1j14j4K91l30r7Q3J38Rj16p4M2Q2j48K98n21M55J63k69j9m8K00J6ln9k52
$$ 81 -33 -47 244 -86 -183 -100 38 47 -69 -143 -101 -19 -167 131 -390 65 228 -41 -60 -108 92 108 105 46 -206
2771b06J73J02J50l22J81n2P1l09L22l06J15%k17M33l5j76J47k21K8K46p3R7m34
$$ -206 -33 69 219 -103 78 26 97 -212 110 -196 -81 -81 -298 135 100 -76 71 -150 -122 124 51 148 -286
2794b86N82%l77j08l4J05J34J74q1o4l84L47l1j41P5K5K58p0j39K55j65k08k9
$$ -286 296 296 -81 -189 -223 -118 16 190 109 45 -339 8 -23 -164 -89 -64 194 124 -15 240 75 -133 -162
2817a62M7l7K06j78j9O2j12K14l12L00p6J33K8l0L5O9l54K23N8q1N2M6k33l1J27
$$ -162 -115 -152 54 -124 -143 -81 -193 21 -291 9 -67 66 94 64 99 168 -186 37 95 14 66 112 -121 -152 -25
2842b5j12Q0k02O6K75m36J79L37j75n7L6L21l85J42qr2k6j05K04k40L9L93l65
$$ -25 -137 -57 -259 -193 82 -354 -175 162 -13 -70 -34 287 -98 44 36 -56 -82 -187 17 -223 -184 209 -156
2865a56K8l2N22l24O5O4l12N5J37O8j11K1K14j89j49K99j78j39j04J77J41k10
$$ -156 -128 -160 362 38 103 167 -145 -90 47 115 4 25 239 50 -99 200 22 -117 -221 -44 97 -113
2887a13K32j13j54K30K45m71nL39m9j56j5J32j13J13P2k58J65j37M6P2k58J97
$$ -113 119 6 -148 82 327 -144 -149 190 141 -15 -30 102 -11 102 174 -84 81 -56 -10 62 -196 1
2909An5j77M42M5m35J34o4J23j98K96j8J01k92L07j26n0j44J06k5l03K78K38J05
$$ 1 -54 -231 211 256 -179 -45 -109 14 -184 112 94 195 -97 210 84 34 -110 -4 -29 -332 -54 184 289
2932B89k57K09l53N3k13J47j5L20M9j18J31j31j4j69J91n6j17RL2J34k06J91P7
$$ 289 32 241 -112 -59 -272 -125 -140 180 229 111 242 111 97 -72 119 63 -54 -45 -13 121 -85 106 183
2955A83k75J51J19k34o4J85j13j06K98oj35n7K38j70j9k17p5P4M08m75K36J6j3
$$ 183 -92 59 178 -56 -120 65 -48 -154 144 138 3 -54 184 14 -5 -222 -297 -223 185 -290 -54 -38 -51
2978e1J12j60J97J76m91M18j98J16l09M8O4J49q2R6j35r3J75K80k57j74J14j07
$$ -51 61 -99 98 274 -217 201 3 119 -190 -142 -78 71 -11 85 -50 -143 32 312 55 -119 -5 -112
3000a12Q3n0L7j05J5p2N09j84p0l3K32l19J73J5l37L30K46j74l26J78l05O2o9
$$ -112 -29 -79 -42 -147 -132 -204 305 121 51 18 250 -69 104 119 -218 112 358 184 -142 36 -269 -207 -276
3023b76K15m2J84L5j1k77K12j79J66r5J76N7l85l2L01k25K2R4l29N32n00O61l31
$$ -276 -61 -103 81 116 105 -172 40 -139 27 -68 108 165 -220 -252 49 -176 -154 -60 -389 143 -357 304 -27
3046b7M96j59l37k2j20L45l05J78j14J13j31J85k17q5J81L4j01M8Q8J82k1J19
$$ -27 469 310 -27 -49 -169 176 -129 49 -65 48 -83 102 -115 -200 -19 15 -86 -38 50 232 211 330
3068C30n06M02k04J42J25k79p1J9p3m3J48MK5l35L75Q3m50R6J09J90k01J60p1
$$ 330 -176 226 22 164 289 10 -61 -42 -115 -158 -10 -6 19 -316 59 142 -308 -212 -103 87 -114 46 -25
3091b5LJ44m56L63q2o0K28j39N3M1j54Q0k0O2j00j52L73j43J16j04Q5j36k9ko7
$$ -25 -22 122 -334 29 -53 -113 115 -24 29 70 -84 -4 -24 38 -62 -214 159 16 132 28 113 -23 -52 -54 -121
3116a21K0K23k58l9K17O8k02J8J09q7m9K39j87P0K19j69k0P0l22J21J19oQ2n9
$$ -121 -101 122 -136 -175 42 110 -92 -74 35 -52 -101 138 -49 21 240 71 51 121 -201 -80 39 33 115 56
3140E6O4rl03J06j1l5K55k4m7k08J56j65P9P1J44k10qk6j68J79N7J03j04O0K4
$$ 56 120 111 -192 -86 -97 -132 123 99 52 -156 0 -165 -86 -15 129 -81 -89 -115 -283 -104 -47 56 -48 12 36
3165C6Q9n7k42J65k8N8N6L0lj42J8K09k27k87J77kk5K42j06m3J39J25l07K04q5
$$ 36 125 68 -174 -9 -37 21 77 107 104 -38 -20 189 -38 -325 -148 -150 -175 67 -39 -82 57 182 -125 79 -6
3190fL2j15M73k84j77r6L48m8j81Q7j12J39O1j59L9r3L22l06j07K59j03o3K14
$$ -6 26 -89 384 100 -77 -173 175 127 -54 33 -79 60 121 -38 1 -92 230 -76 -183 76 -27 -90 124
3213A24n4j43k96N20m4K11k05j13R4k36K73j58n5j78M57J50l62o5o6l36M34J54
$$ 124 70 -73 -369 151 107 318 113 0 94 -142 131 -27 -82 -260 197 347 -15 -80 -146 -482 -48 106
3235A06J62k68k54K16Rk2m0O7j34N8K9o5L61r4J34l71K84j34k91J51N7L04m12
$$ 106 268 0 -254 -38 -29 -51 -91 -24 -158 -100 -71 -136 225 131 265 -106 178 44 -247 -96 -39 265 -147
3258a47L54k41J69Mk98j69K88j53K39j91L7l7J60r5K76k92O3q6l3R0l7K57l01
$$ -147 207 -34 135 139 -159 -328 -40 -193 46 -145 -108 -145 15 -80 196 -96 -33 -119 -152 -62 -99 158 -143
3281a43Q2L55l29J0J7o7K19j47j07j65K50M6Q0O3r2j32j43J64K31j01j57m9K06
$$ -143 -61 294 -35 -25 -8 -75 144 -3 -110 -275 -25 21 101 164 72 -60 -203 -39 192 91 -66 -115 91
3304I1M2J55k25j33J79j82K4o5J18J94j42k28J77j75J69J94J49k72J2j32J37J42
$$ 91 133 288 63 -70 109 -73 -49 -114 4 198 56 -172 5 -170 -1 193 342 70 82 -50 87 229
3326B29k1j38k5n7j55L14n9J45n27N39k27R3k22j79M00M7k62K64ol6l67J78J43
$$ 229 208 70 45 -12 -167 147 88 233 -294 245 18 111 -111 -290 110 157 -105 159 153 117 -250 -72 71
3349G1J34j42K07m61J88m9k36N27q7k85l8J2L80q4r7j78J20R8O3j02j46oJ40K
$$ 71 205 63 270 -191 -3 -52 -288 239 152 -133 -171 -159 221 137 40 -138 -18 80 143 41 -105 -111 29 31
3373C1r1L25l69n0n6K62r9k53L42o6Op4J86L1l32J89m3n1M2m8J49o6K21nj11l87
$$ 31 -60 265 -104 -154 -210 52 -47 -300 42 -24 -18 -92 94 125 -207 -18 -61 -112 -70 -118 31 -35 186 181 70 -317
3399c17P08l81l6J10J2k50O2J30R0q7l11N66m33K43j75%m3K85j75J0j07J59r0
$$ -317 391 10 -26 84 96 -154 -92 38 128 41 -270 296 -137 106 -69 -69 -112 173 -2 8 -99 60 -30
3422c0J3N8M8J22j73k3r0N9J63j21j6k50L89j94q4L05k38J06L6L7j98jpL12j90
$$ -30 -17 41 89 211 38 15 -75 -16 147 26 10 -240 149 -45 -129 176 -62 44 80 117 -81 -82 -89 223 33
3447C3l14M02k12nJ03N5J7k0nq0j1J27l5O5Po02M60k04J67q0O1j32jJ38P2J64
$$ 33 -281 121 -91 -96 7 62 79 59 54 -26 -37 90 55 120 127 -475 -15 -219 -52 -132 -71 -203 -204 -66 6 170
3473A70j86K1o5m1K30p1n6o1k63J02K72j21J66j22M2q6p3N5Q8J12j54J72j25N4
$$ 170 -16 5 -60 -101 129 58 2 -59 -322 -220 52 -69 97 -25 17 -69 -142 -87 1 113 -41 131 6 60
3497F0k9p6j35J78M8k07K64P5l65OL2o8J63J46l39M06J94k68J21k26R8j42j24
$$ 60 31 -45 -180 -2 46 -161 103 178 -187 -181 -149 -217 -54 92 -247 159 353 85 206 -20 78 -64 -188
3520a88kK85q5r9p2J63j18K61k1k42j62J47J06J81O7J03k88l8M3r9m9L10k17j31
$$ -188 -190 95 10 -89 -161 2 -116 145 124 -118 -280 -133 -27 154 221 324 36 -2 41 -58 -107 203 -14 -145
3544a45J44P3l58J69M8j35K00o6M8j07K19r6J4r7J94J02j09j92KM4l0K8O7p1j16
$$ -145 -1 72 -286 -117 -69 -204 -4 -70 -22 -129 90 -6 8 -89 105 207 98 -94 -92 -48 -78 -50 17 -54 -170
3569a70J58l8k88J43M11k88L2J50O6m22J54J57l49M31l3n4j07m0M73m73o1j47
$$ -170 -12 -50 -338 -195 216 -72 -40 110 176 -246 -92 65 -284 147 114 60 -47 -87 386 -87 -148 -295
3591b95J13L2L68j79j2l1o2j31J99K53j91j3j13K59j88k7J05n1q0j84L67n7m93
$$ -295 -182 -150 218 39 27 -4 -66 -197 2 255 64 51 -62 197 9 -18 87 36 -44 -228 139 82 -411
3614d11M99k13J48j91K35k21N04m42P1k7K29J11q5j53j38J67j68j27NM56k35K13
$$ -411 88 -125 23 -168 67 -154 350 -92 -21 -48 181 292 207 54 -84 83 -85 -212 -207 249 14 227
3636B27n52R5J33K60k77J65Q0j23k4lK60k35P1j6K04j43l90J89o8j38L19n2l16
$$ 227 -325 -230 -97 163 -114 51 131 8 -16 -19 241 6 77 61 265 122 -268 -79 -147 -285 34 -18 -334
3659c34K66P6J17l74J86J87p2k12K08k13J12k3q4P6J15q7J69k11J65j3j93L03
$$ -334 -68 8 125 -249 -63 124 52 -160 48 -165 -53 -76 -160 -84 31 -56 113 -98 67 54 -139 164
3681A64n9j03jJ00l82M40O8j20O4k88Q4j66J46k45M9R5J57O5r8J26J8j04O5PK9
$$ 164 105 2 1 101 -281 159 227 107 171 -117 -33 -199 -53 -298 -249 -154 3 68 -30 96 114 10 75 82 111
3706A11j37Q3n7j36j40K27R9j54J85r5j67K32rnk9j29L35l76L51l6l15L00n5J3
$$ 111 -26 57 0 -136 -276 -49 50 -104 81 -14 -181 51 42 37 8 -121 214 -162 189 153 -162 138 83 96
3730I6k46J22J87j27K61l23m2j22j15L81j1k75L17L8l08M0K05m4k28J59k09M25
$$ 96 -150 -28 159 32 293 -30 -72 -194 -309 72 61 -214 103 141 -167 -127 78 34 -194 -35 -244 181
3752A81k17J66k05K08n7k21K28m3J11j84K73l18J56k55L40n4j7j8j54J13J95l68
$$ 181 -36 130 -75 133 76 -145 83 40 151 -33 240 -78 78 -177 163 109 92 74 -80 33 228 -140
3774a40K14q7l08L75r0J70j27q5J68k03Q6N9j41L57k98K39k26J49Q1m69K74J79
$$ -140 74 -13 -321 54 -36 134 7 -78 90 -113 -27 32 -109 248 -50 189 -37 112 193 -276 -2 177
3796A77j15L1p5J2j07J46m7qq8k1J32o6j01J08K4q9M36k15m50K28M47k41RJ38
$$ 177 62 93 18 30 -77 69 22 14 -74 -95 37 -29 -130 -22 2 -87 349 134 -316 -88 359 118 127 265
3820B65m90p6M13o3k17O6J04O4l03M08l46j01K50j95K68J14Q1r2j74l0j2K00J7
$$ 265 -225 -301 112 49 -168 -102 2 66 -237 171 -175 -276 -26 -221 47 161 242 150 -24 -54 -66 134 151
3843A51k1o9o6Rj3j00J46k19RQ6L0Qk0o8M08l08q9O6N5O4J6j27p2K08l55J82J97
$$ 151 130 61 -5 4 -9 -109 37 -182 -173 -87 -57 -49 -69 -137 271 -37 -126 -60 -5 59 75 -52 -124 84 -271 -89 108
3870A08l67rK19J49M8j48j31N0J03K1R5k72j17K88j55J45J14k26l7j41K62r9J70
$$ 108 -259 -268 -49 100 148 0 -131 -81 22 43 138 -134 -251 37 -118 27 141 -85 -122 -263 -1 -100 70
3893G0J34j08K40J5k79K8j50N0J13k82K09k35O6j05N3JN5K75k30L3k75L37K00
$$ 70 204 96 336 351 72 100 -50 0 113 -169 40 -195 -129 -234 -181 -180 -125 150 -80 -47 -322 15 215
3916B15k4k70O1l9R8J54j74P5l40Q3N3J03RN1j93J96k27j07M14r1r0L75n09L61
$$ 215 191 -79 -18 -57 41 195 21 96 -244 -161 -108 -5 4 55 -138 58 -169 -276 138 47 -43 332 -177 184
3940A84j58J74L3k88O8k34J07qM15l62R7J03j62j6r1K87n1j40J86k82J03L4k67
$$ 184 26 200 233 -55 13 -221 -114 -122 293 -69 28 131 -31 -47 -138 149 98 -42 144 -138 -35 -1 -268
3963b68K66p9N9q1J93j72K83j14j54m0j93J27J24o9J58J6n9n9J65r5Q2k94K40
$$ -268 -2 -81 -22 -103 90 -82 201 87 -67 -107 -300 -173 -49 -118 40 56 -3 -62 103 8 90 -204 36
3986C6o1O4J95n3m78L05k20L61m29M52k00J01m15J87L56K4k94O3j12L24j43k39
$$ 36 -25 39 234 181 -297 8 -212 149 -280 172 -28 73 -342 -155 201 225 -69 -6 -118 206 63 -176
4008a76K67Q3j09J18r6j1J65p8j40j86L09k45J92J8J3l49L21k22L92q8l42J84
$$ -176 91 174 65 183 87 76 241 163 23 -163 146 -99 93 111 124 -225 96 -126 266 178 -164 20
4030B0j75N1L60k98J95k2k11k98Q4J38L82k81O8J9L3M9q7l0k33L65P8j2j17q8
$$ 20 -155 -104 256 -42 153 131 -80 -378 -294 -156 226 -55 13 32 65 114 27 -3 -236 129 207 195 78 -10
4054a0j23M1J36n9J22P0l14J98j82M4m9q7M00k04K9lj02L38m15J53J28j05J1J6
$$ -10 -133 -92 44 -15 107 177 -137 61 -121 -77 -126 -213 187 -17 12 9 -93 245 -170 -17 111 6 17 33
4078C3j01M6j22m4K26j21lJ99l39K06R8j04M9o7N9L1R9l64J26K05j92L7k32K53
$$ 33 -68 -22 -144 -188 38 -83 -86 113 -226 -20 78 -26 23 -44 15 46 145 -219 -93 112 -80 -43 -275 -22
4102b2J33k24P4p8RL70k99J80j09j0m0k36K24O6J53m27L15L4J9j11j32J04q4K55
$$ -22 111 -113 -39 -117 -108 262 -37 143 34 24 -16 -252 -28 38 191 -236 79 113 132 21 -111 -7 -91 164
4126A64l10J00j13J72J01j50K02j39j10J93k4j13N7J34m60K29r9K34j50m0J67
$$ 164 -146 -46 -159 13 114 -36 166 27 -83 110 86 -27 30 164 -296 -67 -166 68 -82 -122 45
4147D5j51K38j75J29j6N2j34K93j73m5k8k96J63K36r3J50m7k69J68j38lk99M01
$$ 45 -106 132 -43 86 70 122 -12 281 108 63 35 -261 -98 138 45 195 148 -121 47 -91 -94 -393 8
4170Hj19K26p9k76K43j51M10o7L7l31K31j22rK9l61J21J87o2K26k19m0L39L21
$$ 8 -111 115 36 -240 3 -148 262 195 232 -99 132 10 1 30 -331 -210 -23 -85 141 -78 -118 221 542
4193E42o17L90k23r2L6j74J78K81j34j61J10P8k62K9k41K67K55l60J68j62J18
$$ 542 -75 315 92 0 36 -138 40 321 187 26 136 214 -48 -19 -260 7 262 -98 70 -92 26
4214B6k91K95n1r3J01L66j00o0k17L38k02j80j37L92k18j3L10m14K33k1p7L19
$$ 26 -265 30 -21 -114 -13 353 253 193 -24 314 112 -68 -205 187 -31 -44 266 -148 85 64 -13 306
4236C06o34N3N60m18L69j54j18K22m34J52J43P0k29K9R4Q8j06J12j11N5k21L59
$$ 306 -328 -275 285 -133 236 82 -36 186 -248 -96 47 117 -112 -83 11 99 -7 105 -6 49 -172 187
4258A87Pk54O4P6m21L37O0K7j52L8N3L8m5R9K5m2j15J10l07K74nQk15m4M39j16
$$ 187 194 -60 4 80 -341 -4 56 83 -69 -31 22 60 15 114 139 97 -18 92 -215 59 54 62 -153 -197 242 126
4284A26l43L94l36J66Q7R0P3l49m9J33J1R3q9j47jN2J14r2K91j36q2L21l57J08
$$ 126 -217 177 -159 7 94 184 257 -92 -141 -8 3 96 7 -140 -141 -89 25 -67 224 88 6 327 -30 78
4308G8J11n31M51K1j2k81R3J18M0m6po9K10m60j0K51J09R7l00J93l08M56L5j83
$$ 78 189 -342 109 130 118 -163 -70 48 88 42 35 -34 176 -284 -294 -43 66 163 -137 56 -252 204 239 56
4332E6k43J08q1J08K10%j53k9K09k0k36P7m5J00p4K11Lj37j24j64N1n7L63j9k85
$$ 56 -187 -79 -160 -52 158 158 5 -24 185 165 -71 6 -39 61 -13 198 201 64 -60 -224 -173 -230 133 114 -171
4357a71j24J31M9J32J18k48K28j37J8Ql9O7K25j47l4q7K2m8R7n6j37J94J30q0
$$ -171 -295 -164 -115 17 135 -113 115 -22 -4 4 -35 32 257 110 76 -11 11 -37 60 4 -133 61 191 111
4381A11k88o9J51J63j58K70j68LJ43l84L39l6l02K07M3j35J01nr2L25k85l5K1
$$ 111 -177 -246 -95 68 -90 180 12 15 158 -226 113 77 -225 -18 25 -110 -9 -14 -106 219 -66 -101 -80
4404h0M68j89P6k79j55K28Q8l03J98K5j14j91K51R8K0k89M4J03o5J20p7J27N8
$$ -80 388 199 275 -4 -159 69 157 -146 52 77 -37 -228 23 121 141 -148 -104 -1 -66 54 -23 104 162
4427A62j33j4J32k06J33r4P7j03J06j51K20k37J91q2l8K66j85K46L9m74K06j0
$$ 162 29 15 147 -59 74 -20 57 -46 60 -91 129 -108 83 1 -37 229 44 290 329 -145 61 51
4449E1O6M3m0j50O7j15J65n9P4K54j91n15M35J56P5l85K18N6l27O2K08o6p6j4
$$ 51 117 160 120 -30 37 -78 87 28 102 356 165 -350 85 241 316 -69 149 205 -122 -60 148 82 6 -8
4473hj94K94k16pK47M6n8j31N2L22l00l2jk26l8O5K46k9P1l46J37J52l8J02K7
$$ -8 -202 92 -124 -131 116 162 104 -27 25 347 47 15 14 -212 -250 -185 61 32 103 -243 -106 46 8 110 137
4498A37m14L11k6n2m3O9P4n6j73J94O8J12pj09k7j62J00J9J12k17N2J55j7n4k74
$$ 137 -277 34 8 -44 -87 -18 56 0 -173 21 89 201 194 85 58 -104 -4 15 127 -90 -38 117 100 46 -228
4523b28L25Q0k71O4P5l04K29JR3j82J73j99K97k18j12M3J25Q7l4j75J92j45k2
$$ -228 97 177 -94 -30 45 -259 -30 -29 64 -118 55 -144 153 -65 -177 -134 -9 78 44 -131 61 -84 -106
4546a06J85m80N55%j08j63J48k15J85R0j06n1J28Pj3k06K62j71K40l14M5P0J82
$$ -106 79 -401 154 154 46 -117 31 -184 1 91 -15 -66 62 69 56 -150 112 -59 181 -133 -88 -18 164
4569A64j32j08J5L34k14o0Kj86L73j77pj43M62j98j22p5K96n7m1k00r2M02j73
$$ 164 32 -76 -61 273 59 -1 1 -185 188 11 4 -139 323 125 3 -72 224 167 126 -74 -166 236 63
4592F3k9P1J38k48j08J47L6kl07L74j87kO7K7R3l85L86o5r4K87k85j7r7L36k63
$$ 63 34 105 243 -5 -113 34 70 68 -239 135 -52 -54 13 40 133 -252 134 69 -25 262 -23 -40 -137 199 -64
4617f4j07M97m90K57pl70L73J11q2j37J17m19L70o8J71j94p6J5J42j88L09j16
$$ -64 -171 326 -164 93 86 -284 89 200 118 -19 98 -321 49 -19 152 -42 -118 -103 39 -149 160 44
4639D4p6P6L27n58K42r7N2k6O2o6J75j95oj36J58L9o4P6k2K21m70L25l02K43q3
$$ 44 -32 44 371 -187 55 -42 10 -16 46 -20 155 -40 -46 -182 -24 15 -49 27 5 226 -244 81 -221 22 -61
4664f1r9KJ69P8j49n7K23j67K14k57L82j61k06J75k06J31j61Q3J22j31J81p4n
$$ -61 -160 -158 11 89 -60 -117 106 -61 153 -104 278 117 -89 86 -120 11 -150 -67 55 -76 105 31 26
4687B6p3r6J76k66J25L0R0m5j50J41j43J42J11p4q5J82l32K33m7J99k42J73m15
$$ 26 -47 -143 33 -233 -108 -78 12 -33 -183 -42 -185 -43 68 -6 -91 91 -241 -8 -55 144 -98 75 -340
4710c40L84p5j53K95j15J97j28J37j18kL4j21J61P3j21j98J20n7j8L33j43n3J79
$$ -340 44 -31 -184 111 -4 193 65 202 84 82 116 -5 156 229 108 -90 30 -27 -45 288 145 92 271
4733B71l29j7KQ3k93J32L8K32J92l44J94j25o5p9J71j85j34M05J3L6k51j30l0
$$ 271 -58 -75 -73 10 -283 -151 -113 119 311 -33 161 36 -29 -108 63 -122 -256 149 162 198 -53 -183 -213
4756b13K27l7q2NJ48m0k9k45J24K77j21J38n9k14K17M5R2o5N0m35K80J99k37N1
$$ -213 14 -23 -105 -100 48 8 -21 -266 -142 135 14 152 93 -121 96 141 233 168 218 -217 63 262 25 76
4780G6j63J98l46J99J22j07j40L34p5r4m28O54l25J8L75k49j78J44L27q2o5q9
$$ 76 -87 111 -235 -36 86 -21 -161 173 98 4 -424 230 -95 -77 298 49 -129 15 342 260 195 106
4802A06r9J11j85j01L18j57j16M78k50k49m8L75k00q8R9O0j59K62k41p7K46k55
$$ 106 7 118 -67 -168 150 -7 -123 355 105 -144 -192 183 -17 -105 -6 54 -105 157 -84 -161 85 -170
4824a70M12j64k41J51j04n6qK56j86n3Q5K31k58K87O9l91J88J36j50Q9J03m28
$$ -170 242 78 -163 -12 -116 -172 -180 76 -110 -163 -78 153 -105 182 251 -140 48 184 34 123 226 -202
4846b02J06Q5k5j07p8J02K35j99N4J34j91N5K3r1ko2M72l13N8j29K63j19l3m7
$$ -202 -96 -11 -36 -143 -221 -119 116 -83 -29 105 -86 -31 -8 -99 -101 -163 309 -4 54 -75 188 69 36 -11
4870a1M3K6J92n59K24OL8Q3k05O9o1K3N0L34k08J28j28o9P1J58k42J70k88J7K21
$$ -11 32 58 250 -309 -85 -79 -41 42 -163 -94 -155 -132 -82 252 44 172 44 -25 46 204 -38 132 -156 -139 82
4895H2j42M9K4r6O7l2J62k44K47j43pK15k09Q2k0q3J65l09J08j22l1L7K05Q7k0
$$ 82 -60 -11 13 -83 -16 -48 114 -130 117 -26 -33 182 -27 55 35 -48 117 -192 -84 -206 -237 -200 5 92 72
4920G2K76l52k51n3L20l34J92J52k1j7Q9k40J30J82O1l90ok2M36k88K43l15lK29
$$ 72 348 -4 -255 -308 12 -322 -130 22 1 -16 73 -167 -37 145 206 -184 -190 -212 224 -64 179 -136 -139 90
4944I0J1p4J4j26J78k35K33n1n1J02j92J24k53N41l34j2R8k9l77K70K21j99P5
$$ 90 101 27 41 -85 93 -142 91 40 -11 91 -101 23 -230 311 -23 -35 63 34 -343 -73 148 -51 24
4967B4jJ09k18Q0k35K11J5l2j86J87k3K9p2P3j84J76L5p9o4L04q3j57j35Q5K54
$$ 24 23 132 -86 -6 -241 -30 -15 -47 -233 -46 -69 -40 -112 -39 -223 -47 -12 -91 -155 149 66 -91 -226 -141 113
4992A13k93K06j20L9K38j71J22j92O4k9N7J65k66J78j43J76K6l85K24j38J2M09
$$ 113 -180 26 -94 -55 183 12 134 -58 6 -23 34 199 -67 111 -32 144 170 -215 9 -129 -117 292
5014B92k56q7Mj08J62K21j98R6j31K16%k85k6J17j05P3j00J29l6J53j56J85k57
$$ 292 36 -51 -47 -155 7 228 30 126 -5 211 211 -74 -100 17 -88 -15 -115 14 -22 131 -25 160 -97
5037i7o1M04k82O5k19K82r6m3N7j88K60m1K45l52k01J85k5L01l35J6n2L32K21
$$ -97 -158 246 -36 29 -190 92 -4 -47 10 -178 82 41 286 -66 -267 -82 -107 194 -141 -125 -177 155 376
5060C76l75Q6Q5j85o7N5m2K0k9RmJ00O4j6k14K07N9j45o6J73j56L21k11q4j6M9
$$ 376 1 87 172 -13 -80 -25 -67 -47 -76 -67 -71 29 93 77 -137 70 129 -16 -82 91 -65 256 45 -39 -55 -6
5086fjL9m77N02j34j35J55j03J65k10J84j21J97j59k0K22p1j49K74k28o8J71J05
$$ -6 -7 32 -445 57 -77 -212 -57 -160 5 -205 -21 -142 55 -104 -124 98 27 -122 152 -76 -144 27 132
5109A32k8K6l36J83J85p6R5j69p8M9J46jQj44K7k66L22R6j30k08K77j26r1Q0J60
$$ 132 104 130 -206 -23 162 86 181 12 -66 -17 129 128 136 -8 19 -247 75 171 41 -167 110 -16 -107 -27 133
5134A33k44K0q5L70k22n2J20k71L81p0j72K28k5O3l78J68k3q9L4K5j3J05j19o2
$$ 133 -111 -91 -176 194 -28 -80 40 -231 150 80 -92 136 111 174 -204 -36 -59 -148 -114 -89 -102 3 -116 -178
5158a78M3r8K49k73K62k52L11J2K46o22L44J39j82n8J56j89K16k57L45j94j85
$$ -178 -135 -233 16 -257 5 -247 64 76 322 -300 44 183 1 -57 99 -90 126 -131 214 20 -165
5179a65K06m0L2k53K64j57L07k1l41R6J53n1n28M78j6K17k9j04L6k53J57R1k40
$$ -165 41 1 33 -220 44 -113 194 173 -168 -72 81 30 -498 -20 -36 181 152 48 84 -169 -12 79 -161
5202a61L84k66r7K68o5k06l8K53j36L28k2q3j04j79MJ96l36j27K92K40l0j76l1
$$ -161 223 -43 -140 128 63 -143 -181 72 -64 264 242 159 55 -124 -120 76 -260 -387 -95 145 115 -61 -92
5225i2J33k63J63J59j84J32o2j72Q0P4j72K35k78O65l36O7q7o2O3O7q4j62m4O6
$$ -92 41 -222 -59 100 -84 48 -14 -186 -106 -32 -204 31 -247 418 82 149 62 0 63 130 46 -116 -160 -94
5249i4j36K32k59J63K31l3p1J05J32j78j41Q7j67L67j86n2K21k56k74K37K72k84
$$ -94 -230 2 -257 -94 137 104 33 138 270 92 -49 38 -129 238 52 0 221 -35 -309 -72 200 -84
5271h4K82k33l67M33J14P4l03k7J16j32K31J23m70J90O8k37K74J78j29J1J08l39
$$ -84 198 -35 -402 31 145 219 -84 -111 5 -127 104 227 -243 -53 15 -222 52 230 101 112 220 -119
5293a19M06l90P8J24J54k64n0O4J16k29N2rJ9R5jJ02q0Rl98K21j32J86J01j90
$$ -119 287 -103 -25 99 253 -11 -61 3 119 -110 -58 -67 -48 47 46 148 68 77 -321 -100 -232 -46 55 -135
5317a35J76j57K15j05J63l18J24o8r5j27O66j20%k94Q5K04k39j24N1j47L45M5
$$ -135 41 -116 99 -6 157 -161 -37 -105 -200 -327 339 219 219 -75 10 214 -25 -149 -98 -245 100 145
5339A45J80j25j24J9m3J7j82mj12J44P7K1j4p7k07L57Lj11j86K35J9O1N0k61J36
$$ 145 325 200 76 95 52 69 -113 -117 -229 -85 -8 13 -1 -78 -285 72 75 -36 -222 13 32 93 143 -118 18
5364A8qM8K1o8J44l29J95M0k88L58j37k05K02j06J56q5l2j42J09n8J92M2j85p6
$$ 18 10 58 79 11 155 -174 21 61 -227 131 -6 -211 -9 -115 41 -44 -76 -218 -109 -167 25 67 -118 -194
5388a94K58j22O1Q7j83N8m5K04k10K97k12k76N09l09n2K41J67k4m02J16M5j11
$$ -194 64 -58 3 90 -93 -35 -80 124 -86 211 -1 -277 232 -77 -129 112 279 255 -147 -31 14 -97
5410i7R9K14k99K03j80L77o74K72k02M38k09K40K8n0k93K5K27J13j87K59n2K6
$$ -97 2 216 -83 120 -60 317 -357 -85 -287 151 -58 182 210 160 -133 -108 119 232 45 304 252 278
5432B78l27J77O5m11K09OJ90l8k44j29M79l22J28J4K76k20q9N2J03j42k6k38K92
$$ 278 -49 128 193 -218 -9 -3 187 149 -95 -224 255 -67 61 75 351 131 42 94 197 55 29 -209 83
5455H3k67n8J33K63p5k62P9J66j59K15j70O1j0r8O2J01Rj4k61J09r8K8J71M3j9
$$ 83 -184 -242 -109 154 79 -183 -104 62 -97 118 -52 9 -1 -99 -37 64 73 59 -202 -93 -191 -163 8 51 32
5480C2j6n6j57J70K27O3k66J38K5k69K56j3j87J18k72K70l55O09m14n3N2K19k6
$$ 32 16 -40 -197 -27 200 263 -3 135 160 -109 147 134 -53 65 -207 63 -292 317 -97 -150 -98 121 95
5503I5J32k69J37j96P7m5JJ52p1M3ml6L5k8J12k43r6L09n0M8l10J09N3J99p6o2
$$ 95 227 -42 95 -101 -24 -69 -68 84 13 56 52 16 51 23 135 -108 -204 105 55 103 -207 -98 -45 154 78 16
5529A6j17L41j61k42L56j77J8j15K41k96L8J79k14m0L50k12o5K06J28k03k36Q1
$$ 16 -101 240 79 -163 193 16 34 -81 160 -136 -98 81 -133 -173 177 -35 -100 106 234 31 -205 -124
5551a24l1R2K87j43j23P1j56k3J32J51l6k3k00M0O2p6Q9J36k37J89j52J88q1J96
$$ -124 -155 -63 224 81 -42 29 -127 -150 -18 133 97 74 -126 -86 -24 -100 -11 125 -112 77 -75 113 32 228
5575B28l92M2L78k9j08n20L57J0p5R8M2p1Q7p9m2j01J88j35L04j81k28J55K05
$$ 228 -164 -122 256 227 119 -401 -44 -34 -109 -11 31 -40 47 -32 -74 -175 13 -122 182 1 -227 -72 133
5598A33NJ86l14kj09J41k73J07L52j10k48K36O0l12L72j83j7j35l5K46k01J84
$$ 133 138 324 10 8 -101 40 -233 -126 226 116 -132 104 164 -148 224 41 24 -111 -146 100 -101 83
5620H3K3Op3j54M93n41J37%p3J13j38J56J4j09J10k03L05R0j45K35l90M3m5jJ28
$$ 83 106 112 39 -115 378 -163 -26 -26 -99 14 -124 32 46 -63 47 -156 149 239 94 329 -61 -18 -63 -64 64
5645F4N7j41J90J4k39K86j94k84L37j72K4p1Nj70J65J77Q7j45N9m1l4J16k30K38
$$ 64 121 -20 170 184 -55 231 37 -247 90 -82 -58 -129 -124 -294 -129 48 135 -10 49 8 -26 90 -140 98
5669I8k45J30l6K0j5m3R2p2K52j51R7k07n6K10ok31K48j54J20j55P4o0Q2J04j23
$$ 98 -147 -17 -53 -33 -48 -91 1 -71 181 30 127 -80 -136 74 68 -163 85 -69 51 -104 -30 -90 -8 96 -27
5694b7L8j0N5J74k33j53p0P4Q8O1K45j98l50J01K54J70j75m2l10L45j3j05o1L25
$$ -27 11 1 56 230 -3 -156 -226 -152 -64 -3 242 44 -306 -205 49 219 44 2 -308 37 24 -81 -142 183
5718A83K69k15k38j84N54l53K50j17j37k34Q3J4rll9J05j17J79K87m43L25p4J66
$$ 183 452 237 -1 -185 369 16 266 149 12 -222 -139 -125 -134 -137 -176 -71 -188 -9 278 -165 160 86 252
5741B52k94r9J47Q0j31L08k67p7J46l04L31k40J71P7j32K49l90L5J92j23K12q8
$$ 252 -42 -141 6 86 -45 263 -4 -81 65 -239 92 -148 23 100 -32 217 -173 -138 54 -69 143 55
5763E5l9Kk18J81l5r7M1K42j94Jj01J83l8k1j53K26Pm7j67L01j32q1K46j21Q3
$$ 55 16 18 -200 -19 -54 -151 -110 132 -62 -61 -162 21 -17 -38 -191 35 42 -5 -172 129 -3 -84 162 41 124
5788A24pk45K33o6k13K57l23J50K03Q7k0j67l6k5l9j32J0P9P0J58Q5l18M38n1
$$ 124 117 -128 105 39 -174 83 -240 -90 113 200 180 13 -23 -48 -87 -219 -209 -130 -60 98 183 -135 303 252
5812B52k20m6Q1k07J16J51j92J07q2r2R4O1N7M5k08J21k06J17r2J77J9o4Q7o9
$$ 252 32 -14 67 -140 -24 127 -65 42 -40 -132 -38 23 80 125 -83 38 -168 -51 -143 34 53 -11 76 7
5836Gn3K2J48j44J3l7J21l64M05l6M0j00Q9J50j38q5J85j67N9r8j9o8j3J28r0
$$ 7 -46 -24 124 -20 -7 -44 77 -287 118 82 122 22 111 261 123 38 223 56 115 17 -2 -70 -83 45 -45
5861d5J36l26K15K75k07r2O6qk14K48j9j98K92L3j42q2j9J00K27j9j26l34J15
$$ -45 91 -235 -20 255 48 -44 22 14 -200 48 29 -169 123 156 14 -68 -87 13 240 221 95 -239 -124
5884a24J2K89j53o7J85j47m2J52O6R1l25R5j5J84j22Ll6J33j84j50J23Q8k92L03
$$ -124 -112 177 24 -43 142 -5 -47 105 171 262 -63 32 17 201 79 82 46 179 -5 -155 -32 56 -236 67
5908F7q0R2l37K96n2p3K55NQ7j30k25Q1J73j76J64K01l52K53j80k58M90j90J05
$$ 67 -13 79 -258 38 -14 -87 168 173 260 130 -95 -14 159 -17 147 348 -4 249 69 -189 301 111 216
5931B16m2j52k53K35j98J17K85k53L8j42J81K14j26n3J07j8j29J42m3j63j54L29
$$ 216 174 22 -231 4 -194 -77 208 -45 -7 -149 32 246 120 67 174 156 27 169 126 -37 -191 138
5953A38j80k70M99k73K62l34M0K25j95K14r9p9J44j42J37K9j70r8K4O8O2k1j92
$$ 138 -42 -312 187 -86 176 -158 -118 107 -88 126 27 -52 92 -50 87 116 -54 -152 -128 -60 2 -19 -211
5976b11K76k28K11j38k07P7N7Q6j94J7J96J11J16l30mJ71j70j39K97j88K61L4
$$ -211 65 -163 48 -90 -297 -220 -163 -77 -271 -254 -58 53 169 -161 -165 6 -164 -303 -6 -194 67 101
5998A01l22K72l32J25K23k10L3k9j17K32J19j56O4Q8j08o0K37k77J64L4J6j28
$$ 101 -221 51 -281 -156 67 -143 -110 -139 -256 -24 95 -61 3 91 -17 -77 160 -117 47 81 97 -31
6020c1K8L0P3M8o2o7m5J4l35L08J00n2J44k48J0q0O1l4M1k07N22r3l24J05K8O7
$$ -31 -3 27 100 148 86 19 -26 -12 -347 -39 61 9 153 -95 -85 -165 -104 -138 -97 -304 218 125 -199 -94 -66 1
6046An0K01m28L43K40k49k52J44l9K66m3J81m53J10%j79L59M8q1l5r4Pk41R8j5
$$ 1 -49 152 -276 67 307 58 -194 -50 -89 177 134 315 -138 -28 -28 -207 152 200 119 84 -10 -3 -244 -146 -161
6071a61J29M7n1j9J58q0N0l1NJ07k08N9J5j22r3mL37k64J15M9Jj07qO4q7j08r
$$ -161 -32 15 -36 -55 103 23 73 42 47 154 -54 5 20 -102 -195 -199 138 -126 -11 38 39 -68 -76 -12 -99 -207 -216
6098b16K96j9j01J21NPj59j9J0L72j11k36n0J47R6k42K38k16J10j11K45k56J75
$$ -216 80 61 -40 81 86 93 -66 -85 -75 297 186 -50 -100 47 143 -99 139 -77 33 -78 167 -89 86
6121H6k48k34L93m3J0K45j76P2n9j93r6K47N6qj32m9L01R4k16n8J40o5l1OK0R
$$ 86 -162 -396 -3 -46 -36 209 33 105 46 -147 -243 4 60 52 -80 -129 172 266 50 -8 132 67 36 42 62 71
6147G1J50m43K54Q9q4P9n1N5k04J27k3j3M29o95R1K78j32K89j27k41J28L71l68
$$ 71 221 -222 32 121 37 116 65 120 -84 43 20 7 436 -259 -168 110 -22 267 140 -101 27 398 30
6170C0j84J71k41M14k66R7k38K68r2q4P7k8j46K69j23k33M66j08N3LJ19l50J60
$$ 30 -154 17 -224 190 -76 21 -217 51 -41 -125 -48 -76 -222 47 -76 -309 157 49 102 105 224 -126 34
6193C4j34J38n5K31j55l11K4J69J44l48J78K36j77K36k28J37j25j44L08j93o3
$$ 34 -100 38 -17 214 59 -252 -228 -59 85 -263 -85 151 -26 210 -18 119 -6 -150 158 -35 -98
6214i8Rj13K53L5N8o2k28J46J54l88N59k46j68J60j61j7M14m35K39l62L27m27
$$ -98 -89 -202 51 86 144 82 -146 0 154 -234 325 79 -89 71 -90 -107 307 -128 111 -251 76 -351
6236c51L81J51k27K55K8k69j59m8K35j74J1J53J36j25L7J25j81M6k56M02Qk28
$$ -351 30 181 -46 209 237 -32 -191 -239 -4 -178 -167 -14 122 -3 34 159 -22 24 -232 170 178 -50
6258e0k18N05p2n16K67K47j0j21j5k7j3rJ21j47j21K96j00J0j43K69j74nJ27j62
$$ -50 -268 237 165 -351 -84 163 153 32 17 -10 -23 -32 89 -58 -179 117 17 27 -116 153 -21 -26 101 -61
6282f1N8o0lN2K8L1m1M2O4J5p6K34l05j31L23l00L0J28q6o6M61m25k1j06J94J16
$$ -61 -3 -63 -66 -14 14 45 4 46 110 125 49 283 -22 -153 170 -130 -100 28 -58 -124 337 -88 -109 -215 -21 95
6308I5p1k98J90K11n3K66m12n4J3m7L03j51k5O0j7k04L50j90P7ml7J67k28j6j68
$$ 95 24 -274 -84 127 74 340 -72 -126 -113 -160 143 -8 -33 27 10 -194 156 -34 43 39 2 169 -59 -75 -243
6333b43J45k07L02n0l16L34L1J43o8j00J82o5o2n0k20K33j40L9K48j88k34Q7J60
$$ -243 -98 -305 -3 -53 -369 -35 -4 139 71 -29 153 88 26 -24 -244 -11 -151 -112 136 -52 -286 -199 -39
6356c9l7J05r1J32q7q2m2M8J67ol06K68K11j91j34J50j25J25Q0r8j87K99k10K9
$$ -39 -76 29 -62 70 -17 -99 -141 -93 74 68 -238 30 241 50 -84 66 -59 66 146 48 -139 160 -50 -21
6380b1K4K79j28j58j12K36k67J83p1l1O3O0J76q5k44M09l92n4p7NJ80n8n3J66
$$ -21 3 282 154 -4 -116 120 -147 36 -35 -66 -3 57 233 148 -96 313 -79 -133 -210 -205 -25 -83 -136 30
6404C0k30J18p5L68j93j38J12J10r3K62k59r7j17L18j06Q7l12J65nJ13P0j90K7
$$ 30 -200 -82 -157 211 18 -120 -8 102 9 271 12 -85 -202 116 10 97 -215 -50 -55 58 128 -62 -35
6427c5K14Jr4o1J54k36P9Q9k61K92k6p2k0J89m76K65j50J77JnJ54p5j03O8r7O
$$ -35 179 180 86 25 179 -57 22 111 -150 142 116 44 24 213 -263 2 -148 29 30 25 179 104 1 69 -28 -22
6453b2j67P4K27j19M8J66k17j28J19J91k38k29M85l77J69N1j1k87L57jj92K95
$$ -22 -189 -115 112 -7 41 207 -10 -138 -19 172 -66 -295 190 -187 -18 33 22 -265 92 91 -101 194
6475A94k00n5L05l39M6m4m6K71l41K09j10J1%J24J6m1l6L10j85l53M85j72j97
$$ 194 -6 -61 244 -95 -49 -93 -139 132 -209 0 -110 -99 -99 25 41 0 -36 274 89 -264 221 49 -148
6498a48J20k64L93J19j23j8k06M6J44j33L4j57L6J12j03K41L7j61J34j86J19J01
$$ -148 -28 -292 101 220 97 79 -127 -81 63 -70 -36 -193 -157 -45 -148 93 130 -31 103 -83 36 137
6520A37k1o1p7J25k71J60J38l2j97q6J13m9K8j57K57q9L34j01j08j71K71k37Q5
$$ 137 116 55 -22 103 -168 -8 130 98 -99 -185 -72 -121 -93 -250 7 -82 252 151 43 -128 143 -94 -9
6543in8r1J79n8m8N8m7N8n9J61j12j33J33K1k24N18m05K26L2j63K7Rpq0J57j80
$$ -9 -67 -158 21 -37 -85 -27 -74 -16 -75 86 -26 -159 -26 -5 -229 289 -116 110 142 -21 6 15 8 -72 85 -95
6569i5J66j52J47L9k44Mk34L92p0N2J1k54K57J69m01N7K64l20L88j03j75K0J57
$$ -95 71 -81 66 105 -139 -135 -369 23 -47 5 16 -238 19 188 -213 -156 108 -212 176 73 -102 -82 75
6592G5J5j71J9J60k4K19j85j70R7Qr1N9j23R0oR9k45O5J97R7rk98J16j3j35k02
$$ 75 90 -81 -62 98 74 293 108 -62 35 43 -48 11 -112 -22 -28 71 -174 -109 88 185 176 -122 -6 -19 -154 -356
6618c56N73l16M14p7q9j32J43q8J30k90j09K45j01J54l21M55n59L16j25K45j20
$$ -356 217 -99 315 238 149 17 160 72 202 -88 -197 48 -53 101 -220 235 -324 -8 -133 112 -8
6639hk25L56J48j11o6q8J2K09m34j0K65K39l32J14J16O5k5k36R8q4k98M69k29
$$ -8 -233 123 271 160 94 6 18 227 -207 -217 48 287 -45 69 185 250 225 -11 87 3 -295 174 -55
6662e5L9J60k27J09k04K27j03j07J16j7K45Kj78k65K53P0j02q8N0k20R9J12m1
$$ -55 -16 144 -83 26 -178 49 -54 -161 -45 -62 183 185 7 -258 -5 65 -37 -125 -75 -295 -196 -84 -125
6685a25J49o9Kj01L17Q5j59k57m4J89J18k30L99k71L2M5k61K32j46L24k43Q5j31
$$ -125 24 -45 -43 -144 173 258 99 -158 -202 -13 105 -125 274 3 35 80 -181 51 -95 229 -14 71 -60
6708f0n8J85j36J5J51p7l5j07L28k69J03N8n9k04J00P5M7L8O1k81L87k84K8m26
$$ -60 -118 67 -69 -54 97 20 -15 -122 206 -63 40 98 39 -165 -65 10 57 95 156 -125 262 -22 6 -420
6732d20K69J37Rk17J08l7j83K68N6J1pj1R8k11j3J20p8R8l2P7k6j00K7j05K05
$$ -420 -151 -14 -5 -222 -114 -151 -334 -66 -10 1 -6 -17 81 -130 -143 -23 -101 -3 -35 42 16 -84 -57 -162 43
6757D3J59j03k83J68K25j59j61J23jK88l61k2K60l4j45R9r0j97K53l97M70j52
$$ 43 202 99 -184 -16 209 50 -111 12 11 299 -62 -84 176 142 -3 96 6 -191 62 -335 135 -17
6779a7J42J4O8j03Jk67P0J25j80K83j9l83K30J38k53J44J8k8k2J83k65J28k6L1
$$ -17 125 139 207 104 105 -162 -92 33 -147 136 117 -266 -36 102 -151 -7 11 -17 -39 144 -121 7 -19 12
6803A2K38j89j18J74nj3k51L61j83k6L4lO6q1K16k31k30N33l23N8k75K04r5J41
$$ 12 250 61 -57 117 112 99 -152 209 26 0 34 31 97 16 232 1 -229 304 -19 39 -236 -32 -127 14
6827A4K90k85R5KN1p2j43Q4k32J73P6OK5J46m22J28j0O2p6Q5J36k73K51k04J15
$$ 14 304 19 114 116 167 95 -48 36 -196 -23 53 59 84 230 -192 -64 -74 -12 -88 -3 133 -140 111 -93 22
6852B2J57l35K15k9q1L74k43k01KK86p6j76o6R7J24k74R1r6K8J40J21k7o7J00
$$ 22 179 -156 59 30 -51 323 80 -121 -119 167 91 -85 -151 -54 70 -204 -113 -209 -181 -41 80 53 -14 86
6876H6k79QK76k30J18j32N5Q8P6K03k26k0K5n3K66k89L1%pj20J28j55L04J08k59
$$ 86 -193 -185 91 -139 -21 -153 -98 -10 66 269 43 23 48 -5 261 -28 3 3 -4 -124 4 -151 153 261 2
6901BJ42j01K29j52j44J12k72J52l3k8k44N03J06l99N4J67J95k56k47K07r3j56
$$ 2 144 43 272 120 -24 88 -184 -32 -65 -93 -337 166 272 -127 -73 94 289 33 -214 -7 -100 -256
6923b56K31Q9P6k28oK42k43j10K99j43j37O0L76l49k02J41R9J08k41K5K6j70J90
$$ -256 -25 64 140 -88 -94 148 -95 -205 94 -49 -186 -126 250 -99 -301 -160 -61 47 -194 -169 -143 -313 -123
6946a23K24j70J64k28J00J03r5K35K67m90j46J41j8j93J79O9J10p6q8j56j20L70
$$ -123 101 -69 95 -133 -33 70 -25 210 477 -13 -159 -18 -36 -229 -50 19 129 53 -35 -191 -311 59
6968E9l80L27k09K20k66J49j34K73k44L19k15K21R5m90L74k10R7j51M6J29p7J34
$$ 59 -321 6 -203 17 -249 -100 -234 39 -205 114 -101 120 215 -275 99 -111 -14 -165 -119 10 -67 67
6990F7k67K70j4N0j11k14P4K50n2J89n36M36o5k21o2J97J27m3j97J60n9N1K2l82
$$ 67 -200 70 56 106 -5 -219 -145 105 53 242 -294 142 77 -144 -206 -9 118 75 -122 38 -21 30 52 -330
7014c30K64J66N7j32n5Q5Q9J82j59j24J75j98j22j65K90k2j72l8n4P7L73k50M1
$$ -330 -66 100 157 25 -30 55 144 326 167 43 218 20 -102 -267 23 1 -171 -209 -263 -186 187 -63 -22
7037b2L8j72K54l47K41K33j54k17J84j28L8r6K3J41l28K28L28m48J04J53j89J87
$$ -22 16 -156 98 -249 -8 225 71 -146 38 -90 -52 -148 -125 16 -312 -84 244 -204 -100 53 -136 51
7059E1k00J17R2k73K14J56j64j03N5K46j08j78J15j56J78n3J73m3k7j32J61l01
$$ 51 -149 -32 60 -213 1 157 -7 -110 -55 191 83 -95 20 -136 42 -11 162 119 92 -40 121 -180
7081a80n9K70j50P4k00J82J19q4pO5l4l3m0J3j82K63k42J02J08P3k22J25K92k13
$$ -180 -239 31 -119 -45 -245 -63 56 -28 -35 30 -4 -37 -77 -64 -246 17 -225 -123 -15 58 -164 -39 253 40
7105D0j34N9J37r4J40m53M7K45M2M0m20L34j65K13N1P0K53m99J76j70k1K91j33
$$ 40 -94 -35 102 8 148 -305 -258 -13 29 69 -351 -17 -182 31 82 152 405 -94 82 -88 -109 182 49
7128D9m16M85k48L18l06N0N4L22l79n5M4j01K32n3j01M23m46L37K24m75K28k68
$$ 49 -367 118 -130 188 -118 -68 -14 308 -71 -126 -82 -183 49 -4 -105 318 -128 209 433 -42 186 -82
7150h2O9J39k15J80r8J81k42j85J63m6L22j71J4j98J21p3P5m7L64k33J23m5Jj44
$$ -82 -13 126 -89 91 -7 174 -68 -253 -90 -136 186 15 29 -169 -48 -121 -46 -93 271 38 161 116 117 -27
7174b7J58k53mK19N8Ok82k8K93k3k42N9l5O4K3k6J28P5L7j53o3J89l75l2K33K86
$$ -27 131 -122 -126 93 151 157 -125 -153 140 117 -125 -66 -101 -37 -14 -40 88 163 200 47 -16 173 -202 -234 -1 285
7200B85k39O0N8j99P0n0K41l79K97l45Q6Q0J40R4m53J52J26J6K91k77k5j0j23
$$ 285 46 106 164 -35 35 -15 226 -153 144 -201 -115 -35 105 199 -254 -102 24 40 331 54 29 19 -104
7223a04j00J71J61k61j23L57jk02P1M4q8K41N8p5j5j76K51m48M68p18O00k06R5
$$ -104 -204 -33 128 -133 -256 101 100 -102 -31 13 -75 166 224 149 134 -42 209 -239 229 -489 111 -95 0
7246@n20O63l76J52Q5k83K09J1J50r5J29j30J35j30K48k00J89J21l25q5J78o1
$$ 0 -520 143 -233 -81 4 -279 -70 -59 91 -4 125 -5 130 0 248 48 237 358 33 -52 126 65
7268F5m8p8K70j64p4R1l58M53K7l55K33p8j96J35K43j62Q6k09L7om4J14n8K29
$$ 65 17 -61 209 45 -29 62 -296 157 184 -171 62 -16 -212 -77 166 4 90 -119 -82 -88 -132 -18 -76 153
7292A53j40Q5j84L77p0o6Jk35j29K99k64K88R3k30k22L10J91k17J15k0Lq1j29
$$ 153 13 98 -86 291 221 155 156 -79 -208 91 -173 115 208 -22 -244 66 257 40 155 135 138 57 -72
7315g2O6k2k68M99l67M0M4r0q2K73M2J3L3j57J07N2j26JK25j54l1o2o7j07Q4k4
$$ -72 -6 -28 -296 203 -164 -124 -80 -170 -252 21 63 76 109 -48 59 111 -15 -14 211 57 26 -36 -103 -210 -126 -150
7341a50N9K68j86jM2j16L41l86rJ17J18k18N4J42j25J02l70L56k45M15l57J13
$$ -150 -91 177 -9 -10 32 -84 257 -129 -138 -21 97 -121 -67 75 -50 52 -318 38 -207 208 -149 -36
7363c6L7K56n2j49J16l60Q7J40k4k48L43k44Q1m7kQ7K3n9K9J30j38K35m11M54
$$ -36 1 257 205 56 172 -188 -101 39 15 -233 110 -134 -53 -100 -102 -15 8 -51 -22 108 -30 205 -206 248
7387B48l88l9J17L1L2j92M5L07j43k46J62o3l2j6N1K5J79o1m3L72l06MQ1l21K50
$$ 248 -140 -179 -62 -31 1 -191 -146 161 18 -228 -66 -129 -161 -177 -126 -101 78 17 -26 346 40 44 125 -196 54
7412E4k63j59J36M7K57k39L78p2m8Rk61L80j53N6o6j06O9J56k59Nj8j5J62Q1R4
$$ 54 -209 -368 -232 -185 72 -167 211 139 91 100 -161 219 66 122 56 -50 19 175 -84 -79 -97 -112 50 131 225
7437B25m56L74L5k48j41L62k0j14J43NJ44l01J22m9MK5k26K38k05j03L13j61j42
$$ 225 -231 143 178 -70 -211 151 131 17 160 165 309 8 130 81 85 110 -116 122 -83 -186 127 -34 -176
7460a76L78j38M6j76M0J14k88K42R0J43l90o4L58j67k21J80M3j68J61J5M0l57
$$ -176 202 64 110 -66 -26 88 -200 42 132 275 -115 -179 179 12 -209 -29 14 -154 7 22 62 -295
7482b95M08L62o46K06mj26K1J32p1R1k6j64J49q1j44k9K31q7R5J21k14L5J52k25
$$ -295 113 475 -171 35 31 -95 -74 58 -13 78 52 -112 37 -44 -188 -217 14 -73 22 143 -71 -36 116 -109
7506a09Q1L3k96o5N63L5l03L05l09K70K8j32k58J53N4l5J21j64J00ol40L08J53
$$ -109 -28 5 -291 -356 207 242 -61 244 -65 205 233 101 -157 -4 50 15 136 -28 72 66 -274 34 187
7529A87j08p1P8Q2j18k58Q5J72N6l58M42n0K62m18m3J13l26K93N4j82O6R9m1j41
$$ 187 79 8 86 168 50 -208 -123 49 105 -253 189 139 401 -17 -60 53 -273 20 74 -108 -42 57 16 -125
7553a25L13J1k88K34q7k76L99k69R7R6l50K85l2q2J97l54K12O6K7J16k05l4Q3
$$ -125 188 199 -89 145 58 -218 181 -88 9 105 -245 40 8 -74 123 -231 -19 47 74 190 -15 -49 34
7576C4k25K34K9l47L80j53K64k28k39K47J27o5k0j30J79n6P3J15k62J84l43K04
$$ 34 -191 43 72 -275 105 -48 216 -12 -251 -4 123 58 38 -92 87 31 104 219 -43 141 -202 2
7598Bk6n8M4J91k7J40l98j17K30J75q0l69J51J85j09J34J25k00QM4j94K72k2j53
$$ 2 -24 -82 -38 153 126 266 -132 -249 -19 156 76 -293 -142 43 -66 68 193 -7 1 45 -149 123 101 -52
7622e2K4p2J2J89j03O6Q5k52J18J51m70P1J59J92l10L16j36K03K4k73J78o7k71
$$ -52 -28 -100 -88 101 -2 64 149 -103 15 166 -304 -233 -74 118 -192 124 -12 191 215 -58 120 53 -218
7645b18K33m6L3j14J91Q6r3j09J10Q8j80lJ59j77Q9m09M86j7p4J08j2j06p0j50
$$ -218 15 -31 2 -112 79 165 72 -37 73 161 -19 -22 137 -40 49 -360 126 109 35 143 131 25 -45 -195
7669a95J46J76j56L37m41K54k2p9J24J61j93K04m46L40j03j75L22r6r1k10J07
$$ -195 -49 127 -29 308 -133 121 99 20 144 305 112 316 -130 210 107 -68 254 158 67 -143 -36
7690c6j72q1L64k17o5M38m57J54N8m92M56KL3n6J43n2k62M14j09J02n3j47J14
$$ -36 -208 -289 75 -142 -207 231 -226 -72 -14 -506 -50 -48 -15 -71 72 20 -242 172 63 165 112 -35 79
7713G9k22J14o0L76l14J30K74k54k85n1J10J34J56P9j93R8l52J39J54j74m2J75
$$ 79 -143 -29 -89 287 -27 103 377 123 -162 -213 -103 31 187 266 73 171 -181 -42 112 -62 -104 71
7735G1Km15J40k44O57k47L00k18J01M1k48m2P9L3m4j20J14j07P6L82k89j08l5
$$ 71 73 -342 -202 -446 211 -36 264 46 147 188 -60 -102 -23 10 -34 -154 -40 -147 -71 311 22 -86 -121
7758a21L38k91j31K6K07k07K31k18M22j67J38k80M6p1j03M79k36j01L8j08OJ93
$$ -121 217 -74 -205 -179 28 -179 52 -166 256 89 227 -53 -7 -78 -181 298 62 -39 -1 -109 -103 90
7780I0j22k1J72j65K6J12l40L54l85L35n6J08j79J60k00J16J13k07J15nP0O9k71
$$ 90 -32 -53 119 -46 -20 92 -248 106 -279 56 0 108 -71 89 -111 5 118 -89 26 21 91 160 -111
7803a11N9N3k9K15l19M4P0k22K47J4J7o1R8j02K7j01oK42k15M1mJ5K18m0M9k97
$$ -111 -52 1 -28 187 -132 -88 -18 -240 7 21 38 -23 75 -27 0 -101 -107 135 -80 -39 -43 -28 190 150 199 -98
7829i8j0R0L37j56j66J35j3k6j98J24k2n6Q4k26J72L23k66J31p5k93ok6L69l28
$$ -98 -108 -18 319 163 -3 132 119 93 -105 19 -3 -59 25 -201 -29 294 28 159 84 -209 -215 -241 128 -200
7853b00N1M10k87k0L40l19J83j06j15M0j35J30J44l81K84l2R8k53O4K86l57K66
$$ -200 -149 261 -26 -46 294 -25 158 52 -63 -23 -158 -28 116 -265 19 -13 85 -168 -104 182 -175 91
7875I1k7n5M9m5n0k82N39j14O0M5Q5l51j51L33J0l9j63N6J84j04O8j46k80K54
$$ 91 64 9 58 13 -37 -319 220 106 166 211 296 -55 -206 127 137 98 -65 -9 175 71 139 -7 -287 -33
7899c3K54k28r8l6K51j95J83j41O5o6J09P4j10j29Q2n3J61q6J49j65J37L32m94
$$ -33 221 -7 -105 -141 110 -85 98 -43 22 -44 65 139 29 -100 -18 -71 90 4 153 -12 125 457 -37
7922c7J58q1k61P7K78Q0k70j5J03j37L32j99K29m50J62J16N0j34j48O5J80O2l58
$$ -37 121 40 -221 -144 134 214 -56 -71 32 -105 227 28 257 -193 -31 85 135 1 -147 -82 98 160 -198
7945a98M20m40L63o1k68J88j67K51Q0j00k7j69K28j54k31L99j91L5L04j15k17
$$ -198 222 -218 145 84 -184 4 -163 88 168 68 41 -128 100 -54 -285 114 -77 -42 262 147 -70
7966g0q4J35J83j22r9j36J71J28k05L06k90K40k75R9k6R9l5R8p9k82K76m8m9K13
$$ -70 -154 -19 164 42 -57 -193 -22 106 -99 207 -83 157 -118 -19 -45 54 19 117 38 -244 32 -16 -65 148
7990A48m0l10N25m42R6J15k53Q8K45j22j00O4J07p3J47R8m77RJ33N0M6j66K73
$$ 148 108 -202 323 -119 -23 92 -161 -73 172 50 -50 14 121 48 195 293 -184 -175 -42 8 54 -112 161
8013A61l02k7R5J80M8m81J2J90K16l49o5N14l40J83j24K41J11k39Nj28L25j24
$$ 161 -141 -168 -73 107 155 -326 -314 -124 92 -257 -322 192 -148 35 -89 152 263 24 29 -99 226 102
8035A02r6pJ20j29J72j04k39L4j0J22n5J69O9l19n3JR8QO5P1L10j30j23l02K87
$$ 102 6 -1 119 -10 162 58 -181 -147 -157 -35 -90 79 148 -171 -224 -223 -125 -117 -52 19 329 199 76 -226 61
8060F1m6J7K06j47k31K94j74r5O0J49n16O33m80M15l89K94p6n3J84l57M11j32
$$ 61 15 32 238 91 -140 154 -20 -115 -55 94 -422 211 -269 146 -243 51 -25 -78 106 -251 160 28
8082B8Q4O9q6j02r9K16J02k27P5M5m4l27J07J00J50J24n50J73j20K87P4l08L67
$$ 28 112 181 95 -7 -106 110 212 -15 60 105 61 -266 -159 -59 91 215 -335 -162 -282 5 79 -229 138
8105A38L2k06R5nP0m7j74J60k58K74j30j94M5K00K1J46j56O%O4R5j89o5J61k43
$$ 138 170 -36 59 54 124 77 -97 63 -195 79 -51 -245 -200 0 21 167 11 17 17 81 176 -13 -78 83 -160
8130a60J79kr5J60j60l5J80K00l55j30J63M8jK82j2j36n3M9J8m0j92K63k14J73
$$ -160 19 17 -78 82 -78 -113 67 267 -88 -218 -55 -7 -8 274 262 126 73 122 140 100 -92 171 -43 130
8154A30l25L58l27o4L89n9l15M77l76K55Ol23K76k05O8r0K21k09q7J44lp0l0K32
$$ 130 -195 163 -164 -228 161 102 -213 264 -112 143 149 -174 102 -103 -35 -125 96 -113 -200 -56 -59 -129 -159 73
8178G3K1M7o8p3k4j73J46J76k33K44j09L18j02
$$ 73 94 141 73 0 -24 -197 -51 125 -108 136 27 345 243
8191B43
$$ Imaginary data points
##PAGE= N=2
##DATA TABLE= (X++(I..I)), XYDATA
0@%%%%%%%%%%%%%%%qJ6j6J6j6K4l2L2m0M8n6O8p6Q8j04J20j36J52j72J96k21K49
$$ 0 0 0 0 0 0 0 0 0 0 0 0 0 0 0 0 -8 8 -8 8 -8 16 -16 16 -24 24 -32 36 -40 48 -56 64 -72 80 -92 104 -117 132
37A32k80L12l47L87m32M80n29N85o47P15p89Q71r61J059j167J284j417J566j732
$$ 132 -148 164 -183 204 -228 252 -277 308 -339 376 -413 458 -503 556 -611 673 -744 822 -910
56i10J918k131K380k671L015l435L959m630N529o802Q760j2196K0021p5327K714
$$ -910 1008 -1123 1257 -1414 1601 -1834 2125 -2505 3024 -3778 4982 -7214 12807 -62520 -59806
71e9806P9377m4839K097L0290K356k4574K6759J7030j0919k101J7895j2356r403
$$ -59806 19571 -25268 -23171 7119 9475 -15099 11660 28690 17771 15670 33565 21209 11806
84A1806M743q826j9495J1946P535k1383r705J4029j0983j6262J9858K2311j0818
$$ 11806 16549 7723 -11772 174 7709 -13674 -23379 -9350 -20333 -36595 -16737 5574 -5244
97e244J104K4018K715j6116L502L160j6877o222J2614J063l653Q578J265j1672
$$ -5244 -4140 19878 22593 6477 9979 13139 -3738 -9960 2654 3717 64 8642 9907 -1765
111a765J476M838j3011p621J4096L228j1662N961J2334r129o229J2707K569j2042
$$ -1765 -289 4549 -8462 -16083 -1987 1241 -10421 -4460 7874 -1255 -7484 5223 7792 -4250
125d250J665P398p012l319J0367J217o657O448L960j0110l697N876n879p270R475
$$ -4250 -2585 4813 -2199 -5518 4849 6066 -591 5857 9817 -293 -3990 1886 -3993 -11263 -1788
140a788N795q964R99J1194l535p959O664N086q680k756P308k214m616N526J781
$$ -1788 4007 -4957 -3958 7236 3701 -4258 2406 7492 -1188 -3944 3364 1150 -3466 2060 3841
155C841o271J092L525o182l980P987J141o093N477P383o648m425Q274L79q410
$$ 3841 -2430 -1338 2187 -3995 -7975 12 1153 -4940 537 7920 1272 -3153 5121 5500 -2910
170b910K027O305m789m326M565J30n427J931K788m140k05N008j960k683O088K523
$$ -2910 -883 5422 633 -3693 872 1002 -4425 -2494 294 -3846 -4051 957 -1003 -3686 2402 4925
186D925o342J143O698l210n885N051L403o949k198N739j345n443J803K421l113
$$ 4925 -1417 -274 6424 3214 -2671 2380 5783 -1166 -3364 2375 1030 -4413 -2610 -189 -3302
201c302L8L305j488n94M036J51l214K477K608l820j172M808r55n201K104L792
$$ -3302 -3264 41 -1447 -2041 1995 2146 -1068 1409 4017 197 -975 3833 2878 -2323 -219 3573
217C573l957l453M057J026m269q4L159j542j032K605Q48j204J811J093k799M43
$$ 3573 -384 -3837 220 1246 -3023 -3107 52 -1490 -2522 83 931 -273 1538 2631 -168 275
233B75K404k126k178L343J196m358j97L272j542l669J579K101k176m84K912K8
$$ 275 2679 553 -1625 1718 2914 -1444 -1641 1631 89 -3580 -2001 100 -2076 -2560 352 380
249C80j224J429J219r99M83Q50j458p99J898r90k692J426J634k404j312K088L61
$$ 380 -844 585 1804 805 1288 2138 680 -119 1779 789 -1903 -477 1157 -1247 -2559 -471 -110
266a10k653N94K647m59r05J606J023p46K14O16q46j34L05j002j106R07L61k423
$$ -110 -2763 -2169 478 19 -886 720 1743 997 1211 1827 981 847 1152 150 -956 -49 312 -2111
284b111OJ852l60j516J070J594j198p4J923M58p77J79P34m15q26r3n01k63M48
$$ -2111 -2105 -253 -613 -2129 -1059 535 -663 -737 1186 1644 867 1046 1780 1365 539 446 -55 -318 130
303A30q52j097O92O70j186j9J422N51j031O72J437j77p79K33P53n03k89Q4J70
$$ 130 -722 -1819 -1127 -457 -1643 -1662 -240 311 -720 -48 1389 1212 433 666 1419 916 627 711 881
322H81n50r08m59j1N25o26m25P39O56k54j53J022R04p21k77J105qq11j09K46k11
$$ 881 331 -577 -1036 -1047 -522 -1148 -1573 -834 -178 -432 -585 437 1341 620 343 1448 1440 629 520 766 555
343E55o14l32n13L33q50j35M35P88j23l94J028Q10m37l21P37M69p01k48K53j26
$$ 555 -59 -391 -904 -571 -1421 -1556 -1121 -333 -456 -850 178 988 551 230 967 1436 735 487 740 614
363F14l30n99k55L39k11q56K96M07O7m06N89Q89L9m01K94N14n83m31L92J85k42
$$ 614 284 -315 -570 -231 -442 -1298 -1002 -595 -528 -934 -345 544 583 182 476 990 407 -24 368 553 311
384C11p4kJ00k86m11m42R2M28q40m8Q36Q43q97K94Q15K48p01J96P65n84r53O05
$$ 311 237 235 335 49 -362 -804 -712 -284 -1124 -1172 -336 507 -390 -96 719 967 266 462 1227 643 -310 295
406B95J90o07q0OJ64o19J02n75k97J045J20k78O05J073l44m74J028l20j078j97
$$ 295 485 -122 -202 -196 -32 -651 -549 -1124 -1421 -376 -256 -534 71 1144 800 326 1354 1034 -44 -241
426b41P92k29q69L39N02q26pJ37l49k00O73l12k67R81O03q15L78J268m66j247
$$ -241 551 322 -547 -208 294 -532 -539 -402 -751 -951 -278 -590 -857 124 727 -88 290 1558 1092 -155
446a55O47J075j588p61J147l9j196P6P12p24j31O88m80j37Q49M59o29O07J388
$$ -155 492 1567 -21 -782 365 326 -870 -794 -82 -806 -937 -249 -729 -866 -17 442 -187 420 1808
465A808q48n88J190J9j962n63J507r21j226J098P50j153l9P27l41m88J136L45
$$ 1808 960 372 1562 1581 -381 -944 563 -358 -1584 -486 264 -889 -928 -201 -542 -1030 106 451
483D51j60O67O50j312K0J322r35j531J021O79k022l24J406m6j589R90J153r78
$$ 451 291 958 1608 296 316 1638 703 -828 193 872 -1150 -1474 -68 -114 -1703 -713 440 -538
501e38l31J599P2p67N43M82j195Q25O46q72j038J448k47j855L23J342q71j358
$$ -538 -869 730 802 35 578 1060 -135 690 1336 464 -574 874 627 -1228 -905 437 -434 -1792
519a792J463Q08k038Q64J567n30p58J366N08j274K78J066j030q90J553q61j790
$$ -1792 -329 479 -1559 -695 872 342 -416 950 1458 184 462 1528 498 -392 1161 300 -1490
536a490Q21O59j600k27K146l74j623J464J335r62p38K167J84j685Q84P77j668
$$ -1490 -669 -10 -1610 -1837 309 -65 -1688 -224 1111 149 -589 1578 1762 77 961 1738 70
553G0p09J201r09j082J354J66k028M78J792j312q33K438P34k379N15K358j110
$$ 70 -639 562 -347 -1429 -75 91 -1937 -1459 333 -979 -1812 626 1360 -1019 -504 1854 744
570G44j262J854N61j986j83J340j541q78J489M5j379P51J044j775k73J964j76
$$ 744 -518 1336 1897 -89 -272 1068 -473 -1351 138 183 -1196 -445 599 -1176 -1449 515 339
587C39k068J438K012j521j031K569O9k236R51J327j969o06J050n01j316J087N80
$$ 339 -1729 -291 1721 200 -831 1738 1807 -429 522 1849 -120 -726 324 -177 -1493 -406 174
604A74j956M32J930j134j110K202R76k363L76K682j342j486K118P28k208o79J557
$$ 174 -1782 -1350 580 -554 -1664 538 1514 -849 -473 2209 867 -619 1499 2227 19 -660 897
621H97j307j324J217P77j830N84J237j086m22K223Q3j797J547J113j965p04K427
$$ 897 -410 -1734 -517 260 -1570 -986 251 -835 -1257 966 1049 -748 799 1912 -53 -757 1670
638A670n78j946J233J288k329j121K078j56k065J241J380j312o60K045m98j244
$$ 1670 1092 -854 379 1667 -662 -1783 295 139 -1926 -685 695 -617 -1277 768 270 -974
654i74J977O95j992PK128j609j407K082O99k298l65J830j314j695J928Q48j753
$$ -974 1003 1698 -294 -287 1841 232 -1175 907 1606 -692 -1057 773 -541 -2236 -308 540 -1213
671a213L42J651j122m82J592M62j373M14J452k069o20K114l12j988Q38J679j828
$$ -1213 -871 780 -342 -824 768 1230 -143 271 1723 -346 -966 1148 836 -1152 -314 1365 -463
688d63j444K112j28j834J323J555j622m46J799j31j167J315Q02j550j08J491j510
$$ -463 -1907 205 77 -1757 -434 1121 -501 -947 852 721 -446 869 1671 121 13 1504 -6
705fr80J461O39k335J24J756j116j328J773P35j540J27J857q44q24J388L58j212
$$ -6 -986 475 1114 -1221 -1097 659 -457 -1785 -12 723 -817 -690 1167 323 -501 887 1245 33
723C3K74R82j230r40J303L37j974O74J294j986k40J469L27j369Q18J354j297m50
$$ 33 307 1289 59 -881 422 759 -1215 -541 753 -1233 -1473 -4 323 -1046 -228 1126 -171 -621
741f21J455K37j524O66J198j235n01J103p86j186J104M03j280j27J511q19r10
$$ -621 834 1071 -453 213 1411 176 -325 778 -8 -1194 -90 313 -967 -1094 417 -402 -1312
758a312J666P05j821L79J655n02j435J068O23r94j89R38p20j067Q49J07j128L23
$$ -1312 354 1059 -762 -383 1272 770 -665 403 1026 32 -157 781 61 -1006 -157 -50 -1178 -855
776h55J148j010j46J206Q4j298P78J449j088n16J209L8j103o9P92p82k67O73m19
$$ -855 293 -717 -863 343 427 -871 -93 1356 268 -248 961 999 -104 -173 619 -163 -430 243 -176
795a76p61J75O89n53N9R13k45p79J148L45q38k37J236m70r33Q20N03r27p24J200
$$ -176 -937 -762 -73 -626 -567 346 101 -678 470 815 -23 -260 976 506 -427 393 896 -31 -755 445
815D45p04p68N38O36q45N6O97o4m02N36L73n86L57M20o18l94O59L60j104K55O46
$$ 445 -259 -1027 -489 147 -698 -642 55 -9 -411 125 498 -88 269 689 71 -323 336 696 -408 -153 493
836D93q82j49L37l28oqQ45p21QO66j06l72L35L54l39l01P65l49m85L73Q5m41n3
$$ 493 -389 -538 -201 -529 -535 -543 302 -419 -411 255 149 -223 112 466 127 -174 591 242 -243 130 215 -226 -279
859b79M22l31l25K23K67k35ML62K57r2m0L72n37K33L86l84k90L97k95l45K2N5
$$ -279 143 -188 -513 -290 -23 -258 -254 108 365 273 233 605 68 301 687 303 13 410 115 -230 -208 -153
881a53K5m08J48L65k79K10K88L9j25m6J84K00k94K71k06k7n2l61j0L63o6l75k54
$$ -153 -128 -536 -388 -23 -302 -92 196 235 110 64 248 448 154 425 219 192 140 -221 -231 132 66 -309 -563
904e63N79k9m31J86N17j82l22M64q9M0j68P46n32k8j71p4N5M0k40j31K23K12k37
$$ -563 16 -13 -444 -258 259 77 -245 219 130 170 2 748 216 188 17 -57 -2 38 -202 -333 -110 102 -135
927a35j53J76R4J00k58N93k73l9Q4K2o7q2R4k4m8k84j63K44P4k41jm7J09L91l3
$$ -135 -288 -112 -18 82 -176 417 144 105 189 211 144 62 156 132 84 -200 -363 -119 -45 -286 -287 -334 -225 166 133
952A33J89RP8k12p0O1J17l03J5K43l19n72K98M67k73k62J47M5r2K34J25J30P1
$$ 133 322 331 409 197 127 188 305 2 17 260 -59 -631 -333 134 -139 -401 -254 -209 -301 -67 58 188 259
975B59j3j16j29J47j75N6j30K82l47k90J40L29l23n8M67m5n24K23M82j59n9J22
$$ 259 246 130 1 148 -27 29 -101 181 -166 -456 -316 13 -310 -368 99 54 -470 -247 235 76 17 139
997A39l0m8L23j54k86j6J21J6n89L64K95l23j57L59j73j96K49L50m17L1O24l98
$$ 139 109 61 384 230 -56 -72 49 65 -524 -160 135 -188 -345 14 -159 -355 -106 244 -173 -142 482 84
1019H4j0J60J73k21j43j2R2m36K25q0j81N0J52k46KM99K17o35M85M86o68J01J13
$$ 84 74 234 407 186 43 31 123 -313 -88 -168 -349 -299 -147 -393 -391 108 325 -310 175 661 -7 94 207
1042B07K32n63J30M22j58m67L49p3m96K19J76n10J66N21p9m08N22J56o37M41K96
$$ 207 439 -124 6 428 270 -197 152 79 -417 -198 -22 -532 -366 155 76 -332 190 346 -291 150 446
1063D46k71Mn0M75l93n28N95m19l90N38k66l1J68J58j32j93N12M05q63L81L21
$$ 446 175 179 129 604 211 -317 278 -141 -531 7 -259 -290 -122 36 -96 -289 223 628 -235 146 467
1084D67k09o23Q88L9p47J27K64l54k06J66o9L0L8K44l07L0M63j30j95M11K36n85
$$ 467 258 -365 523 562 -185 -58 206 -148 -354 -188 -257 -227 -189 55 -252 -222 241 111 -84 327 563 -22
1106b2O5L19J31m81L12J91r32L58L80n45m52L49K06l60P8N42j32j13L26j52m02
$$ -22 43 362 493 12 324 515 -417 -59 321 -224 -676 -327 -121 -481 -403 139 7 -106 220 68 -334
1127c34M27K65l73j32O95l40p87M39M15p41M1P41j46o99M48N01l86j32N10j02
$$ -334 93 358 -15 -147 548 208 -579 -140 275 -466 -425 316 170 -529 -81 420 34 -98 412 310
1147C10k09K03j13l88M77K61k84p20P10O0o78k77P41l28k45L85L26m77J70L52
$$ 310 101 304 191 -197 280 541 257 -463 247 307 -371 -648 93 -235 -480 -95 231 -246 -76 276
1167B76M6k94J94kl53L04K95l21k68L80j61n95N72R5n50l25O72K72l79j0N96n23
$$ 276 322 28 222 220 -133 171 466 145 -123 257 96 -499 73 168 -382 -707 -35 237 -142 -152 444 -79
1189g9OO83J6n07O4N0o17K60O32n02k00J68J40n32J6O84l50l68Q14j01n64R5O48
$$ -79 -73 610 626 119 183 233 -384 -124 508 6 -194 -26 114 -418 -402 282 -68 -436 378 277 -287 -192 456
1212D56l65l15L54J51m74L8L16lk46R5M1k63k1L54r2m58N71k27o3K50L29n32j71
$$ 456 91 -224 130 281 -193 -155 161 158 -88 7 48 -215 -236 118 26 -432 139 -88 -151 99 428 -104 -275
1235b75M71M7m90K26M06o57M0J98l5l64L98K27m80L13L6j62q5K57K38n36N7N15
$$ -275 196 243 -247 -21 385 -272 -232 -34 -69 -433 -35 192 -288 25 61 -101 -186 71 309 -227 -170 345
1257C45m79J4L56j41m91M3M38o7m9l67L70l30K24l0m2j50M57O4k72K85k2k15O5
$$ 345 -134 -120 236 95 -396 -353 85 18 -31 -398 -28 -358 -134 -164 -206 -356 101 165 -107 178 156 -59 6
1280FRk20J84N3K23m07l8J60J43n31M68j96Q6J1M08j98l42M39M0j61k82K04n0
$$ 6 15 -205 -21 32 255 -152 -190 -30 113 -418 50 -146 -60 -49 359 161 -181 258 298 137 -145 59 9
1303Ik77K33L69m00p4L44k12m81M56r8J37k60J31J60j96K43J13j19K14j19l65
$$ 9 -268 -35 334 -66 -140 204 -8 -489 -33 -131 6 -254 -123 37 -159 84 197 78 292 173 -192
1324a92k5L63K2l84K14q3m3q6R9M7q7Q1Q6R9j77K61j99j69R6M51p63K56J72j09
$$ -192 -217 146 168 -216 -2 -85 -128 -214 -115 -68 -155 -74 12 111 -66 195 -4 -173 -77 374 -389 -133 39 -70
1348g0l04J41J21R7j37K52j33k12L10r5N6r1P0m3j13J28J35J1q8L7j77j89J41
$$ -70 -374 -233 -112 -15 -152 100 -33 -245 65 -30 26 -65 5 -38 -151 -23 112 123 35 72 -105 -294 -153
1371a53L83l56J95J96k46l27J16J96R5j2K17m75R5J86j12j34K95j43j64K0J08
$$ -153 230 -126 69 265 19 -308 -192 4 99 87 304 -171 -76 110 -2 -136 159 16 -148 -128 -20
1392b0o0k29K50N7k98L4M03J10l47K37j04j81K01m9J68m24K46j04M42n19M09k52
$$ -20 -80 -309 -59 -2 -300 -266 137 247 -100 137 33 -148 53 4 172 -252 -6 -110 332 -187 222 -30
1414c0k92K84k3j17J71k9m6Om8p4J40J21m1kl7O9L9k05l7L01j51q6P9J5O7j17
$$ -30 -322 -38 -61 -178 -7 -36 -82 -76 -124 -198 -58 63 22 20 -17 52 91 -114 -151 150 -1 -87 -8 7 74 -43
1440d3J47Q9m41K51J70k7k65P8J59j36J0J23n52O01j75m0o0P8j32j29M61q8k33
$$ -43 104 193 -248 3 173 146 -119 -41 118 -18 -8 115 -437 164 -11 -51 -111 -33 -165 -294 167 79 -154
1463a54M05j0j80k24Q1J25r2J89q3o7m8Q0K8kJ14m3l08j22K93j85M03j92M5j42
$$ -154 251 241 61 -163 -82 43 -49 140 57 -10 -58 22 50 48 162 119 -189 -311 -18 -203 200 8 53 -89
1487h9J80n5j63K43j67R0M3q7j54M21l52j24K05K64r4m0j90J09n1k08J37N5J84
$$ -89 91 36 -127 116 -51 39 82 -5 -159 262 -90 -214 -9 255 161 121 -69 40 -11 -219 -82 -27 157
1510A57k08J13m7J87l6K1l15p3J36N2k06K34j83J16L93m37j76P0J99q3J14J29
$$ 157 -51 62 15 202 166 187 -128 -201 -65 -13 -219 15 -168 -52 341 -96 -272 -202 -3 -86 28 157
1532A57q3j07J06N9N2p3j45J38k49jQ5J13j83J88J29j60K32j00o1j95J05P5j02
$$ 157 74 -33 73 132 184 111 -34 104 -145 -146 -61 52 -131 57 186 26 258 158 97 -98 7 82 -20
1555b0J38j20l5J08n5j88J37K53o92J95J67L0J57l8m1J65k38RK52k79o1Q4j8J75
$$ -20 118 -2 -37 71 16 -172 -35 218 -474 -279 -112 -82 75 37 -4 161 -77 -68 184 -95 -156 -72 -90 85
1579H5m9K16l42R5J17k00J63n9L07k20j17j81L13J57q2k60K5J00P7l13J78jQ8
$$ 85 36 252 -90 5 122 -78 85 26 333 113 -4 -185 128 285 203 -57 -32 68 145 -168 10 9 97
1602I7m31K61O8r1k77K49L14j74k33K87N8k19K39j78j8l2J71l1p7j20L2K5K20
$$ 97 -334 -73 -5 -96 -373 -124 190 16 -217 70 128 -91 148 -30 -48 -80 91 60 -17 -137 -105 -80 140
1625A40j18r2J55j12O7K12l08J58k4k45M0J11J40j21k3J31k3l94M34k83N2J49
$$ 140 22 -70 85 -27 40 252 -56 102 78 -167 -127 -16 124 3 -20 111 88 -306 128 -155 -103 46
1647D6K2j80r8J37K2O1M6P1k44jL11l11o4K51m8J10K4r7j34J1k30M38j64J47l45
$$ 46 68 -112 -210 -73 -51 10 56 127 -117 -118 193 -118 -182 69 21 131 155 58 -76 -65 -295 143 -21 126 -219
1672b19K46N9k08j03K59R6j87k36J47m2J10J90l9r0j05m8K10K4j45r9J75N7m6
$$ -219 27 86 -122 -225 34 130 -57 -293 -146 -188 -78 112 73 -17 -122 -170 40 64 -81 -180 -5 52 6
1695FK9j28J56K1k25mJ20Qj09K02J0l8J18l7k46J58p5j42M6K52L7r9k65J16K06
$$ 6 35 -93 63 84 -141 -145 -25 -17 -126 76 86 48 166 129 -117 41 -34 -176 -130 122 159 60 -205 -89 117
1720A17k9q2r0J42o1K40j45l7k62q7K93K4l7K38j19k60J62m9j85M27K8k27K68
$$ 117 88 6 -84 58 -3 237 92 55 -207 -294 -1 23 -14 224 105 -155 7 -42 -227 200 228 1 269
1743B69k45R7j04JJ07j13N9n9j31P9Q2k42R6J75k74J7k5J20K6k40K91j37j6k9
$$ 269 24 121 17 18 125 12 71 12 -119 -40 42 -200 -104 71 -203 -186 -211 -91 -65 -305 -14 -151 -167 -196
1767a96J12Q4J83k18L81k43K6k17J59k22L60k36J2r1J15j2j07J48J7j73Q7Rm9
$$ -196 -84 0 183 -35 346 103 129 -88 71 -151 209 -27 -15 -106 9 -3 -110 38 55 -118 -31 -22 -71
1790g1K2R3j58J40MJ3q6Q8J15k11j60K7K61J37l50J05O0j84K87j11L10l76K42
$$ -71 -49 44 -114 26 30 43 -43 45 160 -51 -211 -184 77 214 -136 -31 29 -155 132 21 331 -45 197
1813A97l98O44o52Q8l7L01J6k01L7J64k74L61m56J79K46m41N10j97k21J07N0j15
$$ 197 -201 443 -209 -121 -158 143 159 -42 -5 159 -115 246 -210 -31 215 -226 284 87 -134 -27 23 -92
1835i2J69j68j33N18k08km9r9j42O3J57j33K25q5K4J03k12l8o5L11k59k18N14
$$ -92 77 -91 -224 294 86 84 35 -64 -206 -143 14 -119 106 21 45 148 -64 -102 -167 144 -115 -333 181
1858A81j29j31J10m7K6j07j5L8K83j76r2o5QJ65p8j38J53O3o9O1lj01j3J46j25
$$ 181 52 -79 31 -16 10 -97 -112 -74 209 33 -59 -124 -116 49 -29 -167 -14 49 -20 41 38 -63 -76 70 -55
1883e5P5J6j34J43k57M85l37r8N9J31k38N06n17J06M37j10l29J09Q7nL8n9j47
$$ -55 20 36 -98 45 -212 273 -64 -162 -103 28 -210 296 -221 -115 322 212 -117 -8 79 74 112 53 -94
1906i4L2j9l0K51j49k7L49l02q9J36%l03L4Q3J65q4K60k47J6L35k97j44J51J09
$$ -94 -62 -81 -111 140 -9 -36 313 11 -78 58 58 -245 -211 -128 37 -47 213 -34 -18 317 20 -124 27 136
1930A36q9m3r6Q7J0p5M1J32q9j94M20l32K95j55j42m9K3K54k97L12r0k65K32o7
$$ 136 47 4 -92 -5 5 -70 -29 103 14 -180 240 -92 203 48 -94 -143 -120 134 -163 149 59 -206 26 -41
1954d1q0J29r3K18J6l7L1p8k40k2J73k30L35R6J63l21J07o7R9l54K78l1l61K01
$$ -41 -121 8 -85 133 149 112 143 65 -175 -197 -24 -254 81 177 340 19 126 59 158 -196 82 51 -310 -109
1978a09m0K69m06J68l4J94R9L9r2J50k17o9n8K16K81j98k23J30J2j99M02l83J06
$$ -109 -149 120 -286 -118 -152 42 141 180 88 238 21 -48 -106 110 391 193 -30 100 112 -87 315 -68 38
2001C8r0pM45m26PK13k63l4L15j60M1p3k43M04j06O7j07j98K24n7m6n6N5m2j4
$$ 38 -52 -59 386 -40 -33 180 -83 -117 198 38 79 6 -237 167 61 128 21 -177 47 -10 -56 -112 -57 -99 -113
2026a13mQN6J82l6j20J28k55j42K73R7k72L78q6K25o9k37K04j01q5p4k4L03j7
$$ -113 -117 -109 -53 129 93 -27 101 -154 -296 -23 74 -198 180 94 319 250 13 217 116 31 -43 -67 236 219
2050B19l08K43j59L6P5j3Q4m31K86k35K90j66Q9j50o6L90j10K05l57J58n8K33
$$ 219 -89 154 -5 31 106 93 177 -254 32 -203 87 -79 10 -140 -206 184 74 279 -78 80 22 255
2072B55n69L71j35J93l12J94k4k26K07j2P6p9K4K07J13q9j85L1j58K86k8m72M19
$$ 255 -314 57 -78 115 -197 -3 -27 -253 -46 -58 18 -61 -37 170 283 194 9 40 -118 168 140 -332 87
2095H7k62O2Q5L1J99j25j41r0J41j22jl6J16N7K9R2J9j88J96j29j54n7K62J47
$$ 87 -175 -113 -28 3 202 77 -64 -154 -13 -135 -136 -172 -56 1 30 122 141 -47 149 20 -134 -191 71 218
2119B18j99R5N4o3k09J16R3K76m36j79L91j33J85l6m4l18L40j31j42J22J68j10
$$ 218 19 114 168 105 -104 12 105 381 -55 -234 157 24 209 173 129 -189 151 20 -122 0 168 58
2141E8k08J25k87L31K9k71M4J74o6Q8Q8J22k12J12j53P9Mj0J2J6k2k93K09J68
$$ 58 -150 -25 -312 19 48 -223 -179 -5 -71 17 105 227 15 127 -26 53 57 47 59 75 53 -240 -31 137
2165A37J2o0j8j22K98l74j8N6R9m4J14j7K02n53J20L3K23k11K64q1l65J30J58
$$ 137 149 89 71 -51 247 -127 -145 -89 10 -34 80 63 265 -288 -168 -135 88 -123 141 60 -305 -175 -17
2188a7Q7m26K29Q8R1j3KR2j34j2K31p2k73N3p8J05J47j04P9j03j93K07j24k0L50
$$ -17 70 -356 -127 -39 52 39 41 133 -1 -13 218 146 -127 -74 -152 -47 100 -4 75 -28 -221 -14 -138 -158 192
2213A92j00j3j07j17J58MJ22Q5r7j95K22r1j2n1K11k03l5L48k19l56K96k31Q6
$$ 192 92 79 -28 -145 13 17 139 224 127 -68 154 63 51 0 211 8 -27 321 102 -254 42 -189 -103
2236a03K4J55k05K49j72O4J0J08j54K8R4p7k38O0K15j67K12o6Ok62J51K0K7Lk51
$$ -103 -79 76 -129 120 -52 12 22 130 -24 4 98 21 -217 -157 58 -109 103 37 43 -219 -68 -48 -21 -18 -269
2261b69O26n53L62n4q6J35N8j69m1j91L19l57K74O5j80k06R5j7P9p2N54m57q1
$$ -269 357 -196 166 112 26 161 219 50 9 -182 137 -220 54 119 -61 -267 -172 -189 -110 -182 372 -85 -166
2284a66P7m5M6LL04o5l59Q8o5J86k79J92k16M0p4M19K0q9P6j21k57O8L30j27J11
$$ -166 -89 -134 -88 -85 219 154 -205 -117 -182 4 -275 -83 -299 -259 -333 86 106 17 93 -28 -285 -217 113 -14 97
2309I7L78m67j01J81k0l4J72L4j05k01K97j18j80J38N0j81j64N65k84k8j64R2
$$ 97 475 8 -93 88 68 34 206 240 135 -66 231 113 -67 71 121 -60 -224 341 57 29 -135 -43
2331d3o7J70k19K78m21J82M25o86N32k95M7k4L02k24J33k60K43n3k43L86M5k89
$$ -43 -110 60 -159 119 -302 -120 305 -381 151 -144 -97 -121 181 -43 90 -170 73 20 -223 163 208 -81
2353h1K48K6j72l1j21K94m09R5R8P9m4k3O1o3J25L02l68j27n1L08q5m8K85j47
$$ -81 167 193 21 -10 -131 163 -246 -151 -53 26 -18 -41 20 -43 82 384 16 -111 -162 146 61 13 298 151
2377A51k84Q9j71Q5n3N5J71j30k3N9k05L03oj78J39Mj85R3P6J15j06J55k1L0j40
$$ 151 -133 -44 -215 -130 -183 -128 43 -87 -110 -51 -256 47 41 -137 2 6 -179 -86 -10 105 -1 154 133 163 23
2402B3O3k57J3O5j0l26K42J51K8k72M72pj54k14L45pk01J32Kj6m88N29k84l0P
$$ 23 86 -171 -158 -93 -103 -429 -187 -36 -8 -280 192 185 31 -183 162 155 -46 86 88 72 -416 113 -171 -201 -194
2427a94J19K05r0K29l55m4P0J34j05k10O27k55j43L8p3j26K7L44k62k4r7J30j05
$$ -194 -75 130 40 269 -86 -130 -60 74 -31 -241 386 131 -12 26 -47 -173 -146 198 -64 -88 -185 -55 -160
2450a60k8Pl7L18M73m11K2k44K13j9K7O9k47o1J39J04j41J14J39l42j28J46N7
$$ -160 -188 -181 -218 100 573 162 184 -60 153 134 161 230 -17 -78 61 165 24 138 277 -65 -193 -47 10
2473A0j3OJ20Q6p2J00k62J42k52Q4k1K31j56J65k99K12j81r8N6K06J81m17J1M94
$$ 10 -3 3 123 209 137 237 -25 117 -135 -51 -72 159 3 168 -131 81 -100 -198 -142 64 245 -172 -161 333
2497C33j32n9q0J05J12l11K78n18N02l94J05L0k14M53O5k83J69q5J7k38J33j4
$$ 333 201 142 62 167 279 -32 246 -272 230 -164 -59 -29 -243 210 275 -8 161 76 93 -145 -12 -26
2519b6M5O4L9k55L99j84L9J9j33Oo3J05Q9k2q0J98j60j98r4K32k07K09J78k77
$$ -26 19 83 122 -133 266 82 121 140 7 13 -50 55 144 122 42 240 80 -118 -212 20 -187 22 200 -77
2543g7K46O8m3j21j49K0j20K00j16j26M0J25J13r6J48j56J91j97l15L46L3j64
$$ -77 169 237 194 73 -76 -56 -176 24 -92 -218 -178 -53 60 -36 112 -44 147 -50 -365 -19 14 -150
2565a50K68m7l43J23j37M87k44O6N1J80m4j45k33K88k71K56J2k01J78J63J25l58
$$ -150 118 71 -272 -149 -286 201 -43 23 74 254 210 65 -168 120 -151 105 117 -84 94 257 382 24
2587B4l2Jk70J4N21k55k52J94K14l10J36j34p8L43J08l11j12J98K63nk95L6k09
$$ 24 -8 -7 -277 -263 258 3 -249 -55 159 -151 -15 -149 -227 116 224 -87 -199 -1 262 257 -38 -2 -211
2610b11J39K73l21L78m20J89j17P8K97l93P3j27J48P3l43L88q0j08o4L87j41n6
$$ -211 -72 201 -120 258 -162 27 -90 -12 285 -108 -35 -162 -14 59 -284 104 24 -84 -148 239 98 42
2632D2M1R8l17K90j57j24N9K81l87n8P7PJ19K18R5q7m8l09J79p0Lm1M6J00r4O8
$$ 42 83 181 -136 154 -3 -127 -68 213 -174 -232 -155 -148 -29 189 284 197 149 -160 19 -51 -48 -89 -43 57 -37 31
2658C1j34J7J98k18J72j02J02j33K40l95K05m4M6j37N4J49j27o2K33k66L11k58
$$ 31 -103 -86 112 -106 66 -36 66 -67 173 -222 -17 -61 -15 -152 -98 51 -76 -138 95 -171 140 -118
2680a18RJ68k8l6J26j34K0m7p3R4q2J20q2L5J23k14l7N4j24k15L69K54k55J61
$$ -118 -109 59 31 -5 121 -13 7 -40 -113 -19 -101 19 -63 -28 95 -119 -156 -102 -226 -441 -72 182 -73 88
2704H8j59K83m3n54L98l6Q1k6k45K24K86l69J22R2l33K47j07L7o0J8K26l01kj53
$$ 88 -71 212 169 -385 13 -23 58 32 -213 11 297 -72 50 142 -191 56 -51 -14 -74 -56 170 -131 -133 -286
2728b86L92M0r0J20m1j91J40J36l84M17j83j19J0K6m0j08L26o8M1k1j70o6M41
$$ -286 106 146 56 176 135 -56 84 220 -164 253 70 -49 -39 -13 -53 -161 165 97 138 117 -53 -119 322
2751C22m59J73J11l33J37p8K29p6M0L3k0k44J8j1O9R1M9O9r7OQ8N1j28k34K54
$$ 322 -137 36 147 -186 -49 -127 102 26 66 99 79 -165 -147 -158 -89 2 51 120 23 29 117 168 40 -194 60
2776F0P2o1k23J50K8j35k9M4Q6R2K57l31k70M68m22J84R0L01l30L64n0m67K24
$$ 60 132 71 -152 -2 26 -109 -138 -94 -8 84 341 10 -260 208 -214 -30 60 361 31 395 345 -122 102
2799A02L7o9N7m46K34K31k7m7n26K71L07j59J42k82K12k6L1j57J36J14J99k99
$$ 102 139 70 127 -319 -85 146 119 72 -454 -183 124 -35 107 -175 37 11 42 -115 21 135 334 35
2821C5M0K35m51J20K03k89l6n7n3J34R3j75L7J55M8k01O9J00j98pJ81K23J6O2
$$ 35 75 310 -141 -21 182 -107 -143 -200 -253 -119 -26 -201 -164 -9 39 -162 -93 7 -191 -198 -17 206 222 284
2845B84l70NR1j44J10j57J34J10kk45L48J12m26K04k93L96k49K61J58n47K36O8
$$ 284 -86 -81 10 -134 -24 -181 -47 63 61 -184 164 276 -150 54 -239 157 -92 169 327 -220 16 84
2867H4l75L12K59j64j54j43J75Q1M4j28k6P3L29l97J01O2j24j02K2jJ63l43J45
$$ 84 -291 21 280 116 -38 -181 -6 75 119 -9 -35 38 367 -30 71 133 9 -93 -71 -72 91 -252 -107
2890a07J50P2j39K23l14K50m07J7J02N3J61o5L18o45L87J56l45l2K44q8o9L97
$$ -107 43 115 -24 199 -115 135 -272 -255 -153 -100 61 -4 314 -331 56 212 -133 -165 79 -9 -78 319
2912C19m79K27k42J41j17K15P8ok05nJ27J40k90J80K27n40J57N2R4k85K68j56
$$ 319 -160 67 -175 -34 -151 64 142 136 -69 -74 53 193 -97 83 310 -230 -73 -21 73 -212 56 -100
2934a00J00N3k14J84j73M59m38M6L95l03j72K86p7n1j23L76j92j25p4N9O2J81
$$ -100 0 53 -161 23 -150 309 -129 -83 312 9 -163 123 46 -5 -128 248 56 -69 -143 -84 -22 159
2956A59k53r1K2Q3M64l26r5m1m8j12K80R7l9k88K12j60LL20L6o21L71K7j47J53
$$ 159 -94 -185 -163 -80 384 58 -37 -78 -126 -238 42 139 100 -188 24 -136 -133 187 223 -398 -27 0 -147 6
2980Fk04J53JR8j03QpJ02P2O1l10P8J33r8L2r2N0NJ76j24l71K12j66P1K73r4J27
$$ 6 -198 -45 -44 54 -49 -41 -48 54 126 187 -123 -45 88 -10 22 -70 -20 -15 161 37 -334 -122 -288 -217 56 -38 89
3007H9l07K98m2Q6k34K41m56K98L87l19j51J86M6l55L32j89J1N6q1J74k14K68
$$ 89 -218 80 38 124 -110 131 -325 -27 360 41 -110 76 122 -233 99 -90 -79 -23 -104 70 -144 124
3029A24r9k3J42k33K17k97K58J2k76R8K37n6k13J87k6k75j15L87R3k15J82l6k51
$$ 124 25 2 144 -89 128 -169 89 101 -175 -77 160 104 -109 78 52 -223 -338 49 142 -73 109 73 -178
3052a78K55j1k05J62l32M51l63L03j13j7j98L24K6k33K07k08L35k53J87k28J33
$$ -178 77 66 -139 23 -309 142 -221 82 -31 -48 -246 78 104 -129 78 -130 205 -48 139 -89 44
3073D4J8l1p9O3Lk05K44j35K88k97R8J69j41k7l39K97J00k3q1J48j73K56q2k12
$$ 44 62 31 -48 15 18 -187 57 -78 210 -87 11 180 39 12 -327 -30 70 47 -34 114 -59 197 115 -97
3097i7N7K39k9m20L17Lk19P3J45k83o3J12P7o1k5J96o0J20M1J89n10K89j01q8
$$ -97 -40 199 170 -250 67 70 -149 -76 69 -214 -277 -165 -88 -149 -174 22 -38 82 123 312 -198 91 -10 -98
3121i8O6j38R8K54k67J44P3j89K4K51m25L06m1L2j64J7M44l55o9J9l00M68j30
$$ -98 -32 -170 -72 182 -85 59 132 -57 -33 218 -207 99 58 90 -74 -57 387 32 -37 -18 -318 150 20
3144B0j19J84j54k6p5J8j42J7J55m2J83R3k83J77M2k3O7p2R8M2j69j4k44M39n08
$$ 20 -99 85 -69 -95 -170 -152 -294 -277 -122 -164 19 112 -171 6 48 25 92 20 118 160 -9 -23 -267 172 -336
3169c36M67J35l46P4p4J65k58O3R2j78K16o6N3k4l8m1K29k62Q0j1N9j41L00k50
$$ -336 131 266 -80 -6 -80 85 -173 -110 -18 -196 20 -46 7 -17 -55 -96 133 -129 -49 -60 -1 -142 158 -92
3193i2l7J48J59k17r6k0Nl9L85k89J54K62n83N31l9j67k13K22q6k9n3k1M3M11
$$ -92 -129 19 178 -39 -135 -155 -150 -189 196 -93 61 323 -260 271 232 65 -148 74 -12 -41 -94 -115 -72 339
3217C39k28j2j87J43o9n3j41J81k0j32L24k10J88k31J50N5n5N8l73M25l8k19L25
$$ 339 111 99 -88 55 -14 -67 -208 -27 -47 -179 145 -65 123 -108 42 97 42 100 -273 152 114 -105 220
3240B20q7k09r9J70K05k83L29l08l53K51J66R0k18MmR8l82L81p3N5j45K93O9p3
$$ 220 133 -76 -175 -5 200 -83 246 -62 -415 -164 2 92 -126 -122 -126 -28 -410 -29 -102 -47 -192 101 170 97
3264I7lp3k08K25M0q4p4O5k08J66J9l3J30j83J64L5j63K1J84j96R9L9j6r0M9k0
$$ 97 94 21 -187 38 78 -6 -80 -15 -223 -57 -38 -71 59 -124 40 75 -88 -67 117 -79 20 59 43 -47 2 -18
3290a8J63j41p0r6K1K64j05k3O8K3m1j88K9J77k11L04L5k92N4j69K17J1O5k97
$$ -18 145 4 -66 -162 -141 123 18 -5 63 86 45 -143 -114 63 -148 156 191 -101 -47 -216 1 12 77 -220
3314b20J65J11n4N9l6q7Ko8R0L51m89R8K18m9J11j02J6k44J37J02p5k04J18k1
$$ -220 -55 56 2 61 25 -62 -60 -128 -38 313 -176 -78 140 91 202 100 116 -128 9 111 36 -168 -50 -71
3338g1J04J54l90K21J87k31k3j72L50L2j15j21l9r6J93k0J31l82M43L55o65L07
$$ -71 33 187 -203 18 205 -26 -49 -221 129 161 46 -75 -114 -210 -17 -37 94 -288 155 510 -155 152
3360A52k73J03K49k82K06k18%L38l80N2J60r4j06J05r0J31k46N2R3J0J77k1L7
$$ 152 -121 -18 231 -51 155 -63 -63 275 -105 -53 107 13 -93 12 -78 53 -193 -141 -48 -38 139 118 155
3383A55m1M9N9l72P1J57J54l04q7K62n4m4j72K11j89K42j6j71j69L32k68K24J0
$$ 155 114 163 222 -150 -79 78 232 -72 -159 103 49 5 -167 44 -145 97 81 -90 -259 73 -195 29 39
3406C9j90M8j37L72k17k5L77j92r9K43k37Q3K87n35p8L59q3K1M6l1j28j1j50K87
$$ 39 -151 -103 -240 132 -85 -110 267 75 -24 219 -18 65 352 -183 -261 98 15 36 82 51 -77 -88 -238 49
3430D9J71m79J07L20k61J31J06j1o5m7j75L32l78j37L37R0J5j28l25K48L3K05
$$ 49 220 -259 -152 168 -93 38 144 133 68 21 -154 178 -200 -337 0 90 105 -23 -348 -100 -67 138
3452A38k40L85j4j78k23J98j10K04oQ4j03l40J51J86p1j60K23j92k23L62j25J7
$$ 138 -102 283 269 91 -132 66 -44 160 154 238 135 -205 -54 132 61 -99 124 -68 -291 71 -54 -37
3474c7Pj33K27M4k59K87q5l4j18R2j04J33o8j55L8k13L08O7j2j52O5K67k68m5
$$ -37 -30 -163 64 108 -151 136 51 17 -101 -9 -113 20 -48 -203 -165 -378 -70 -3 -15 -167 -102 165 -103 -148
3498a48M07k80R3mM4j49K76l36J75k60L82j04j83K90l15K19q5k34L69j49n8q0
$$ -148 259 -21 72 68 112 -37 239 -97 78 -182 200 96 -87 203 -112 107 22 -212 157 8 -50 -130
3520a30L05n00K44K39k29L9J58rN9l77J23j66J49J84O4k99P7P5r6l39N05J1k80
$$ -130 175 -325 -81 158 -71 -32 126 117 176 -201 -78 -244 -95 89 153 -146 -69 6 -90 -429 76 87 -193
3543a93K77k90k25M39j22J22j32J11J91K5l71L42o9j98m6K34r9j37L33k9k50q
$$ -193 84 -206 -431 8 -114 8 -124 -13 178 203 -168 174 105 -93 -139 95 -4 -141 192 163 -87 -95
3565i5K14p9Q4j95R8K1Mj64J60J49k68m7K1J54Q2l53K03N6r1J35m29J95J96l10
$$ -95 119 40 124 -71 27 48 52 -112 48 197 -71 -118 -97 57 139 -214 -11 45 -46 89 -340 -145 51 -259
3589b59M49k84O7j17K16k24K30J87m49K59%P4k47j1j4J85j63K21qn4P4k31nJ47
$$ -259 190 -94 -27 -144 72 -152 78 265 -184 75 75 149 -98 -109 -123 62 -101 120 112 58 132 -99 -104 43
3613D3q0l46L26N6Pj93L14k0Q3m40L49m7l64J59K94j9j21L50l80O5n6K71k21J11
$$ 43 -37 -383 -57 -1 6 -187 127 107 190 -250 99 52 -312 -153 141 122 1 351 -29 36 -20 251 30 141
3637A41o5j34J17j68j4Q6j97M4J78l5R0K0j93J29L0p2O4K06l96J48K1l14K58l49
$$ 141 76 -58 59 -109 -123 -37 -234 -190 -12 -47 43 63 -130 -1 29 -43 21 227 -169 -21 0 -314 -56 -405
3661d05L89J48j16k58M03l18P7jJ66o9m8J95j38l07K80M49o52J69M6K34m84l7
$$ -405 -16 132 16 -242 161 -157 -80 -81 85 16 -32 163 25 -282 -2 447 -205 -36 10 244 -240 -277
3683b77M71l13L1K64k67K46j2k28k54M56K48k81O9nN4k44K88m6o2l50J96j41J09
$$ -277 194 -119 -88 176 -91 155 143 -85 -339 117 365 84 153 148 202 -42 246 200 138 -212 -16 -157 -48
3706d8Nj78M12l78rK66L3K03m54L09M2l4J87l47R6n5j58j19K83k38K86k59K19
$$ -48 -43 -221 191 -187 -196 70 103 306 -148 161 203 169 356 9 105 50 -108 -227 56 -182 104 -155 64
3729F4l52J48L9K02M1q7j63K04j10O8R1j13N5k14j2K08K76ol64J48l22K72M3j07
$$ 64 -288 -140 -101 101 142 55 -108 96 -14 54 145 32 87 -127 -139 69 345 339 -25 123 -199 73 116 9
3753Io9j2p0J85J83k51m1J29M1l1Ok26R9L04j55j75N6q4L84p7J01l62J04j0k80
$$ 9 -60 -72 -142 43 226 -25 -66 63 104 73 79 -147 -48 256 101 -74 -18 -102 282 205 306 -56 48 38 -242
3778b42M28n4pk90J64k09J70j06R6p3J42M8M6J27Q8k75J16l96J43m0J37P7J57
$$ -242 186 132 125 -165 -1 -210 -40 -146 -50 -123 19 67 113 240 328 53 169 -227 -84 -124 13 90 247
3801B47k51j89L50l11O1o6O4K43k22K3K46j63j03J73R0j94r4P4l7L41m4k62R5
$$ 247 -4 -193 157 -154 -93 -159 -95 148 -74 -51 195 32 -71 102 192 -2 -96 -22 -59 282 238 -24 71
3824G1o9r3QK8Q0L9L4j1n2N7K6l66L11l09L29J54n18J72K03n2J24k08J07NJ09
$$ 71 2 -91 -83 -55 25 64 98 87 35 92 118 -248 63 -246 83 237 -281 -109 94 42 166 -42 65 70 179
3849A79J7r8kk76K7J59m36P42m93q3L31N1r0j2M2j01l9Q6q9K37j52J48k04M7L3
$$ 179 196 98 96 -180 -153 6 -430 312 -181 -264 67 118 28 16 58 -43 -82 4 -85 152 0 148 -56 -9 24
3874B4L2k40mQ3l0K87m9k05M8M8j77k01L57J11o0j33K10J37l29J67P2k86K50O2
$$ 24 56 -184 -188 -105 -135 152 103 -102 -54 -6 -183 -384 -27 84 24 -109 101 238 -91 76 148 -138 112 174
3898A74l71L39k67Q8J8j25J78m7J95j85J28k99K46j06J8o7K3J05k88L12J38k82
$$ 174 -197 142 -125 -37 -19 -144 34 -13 182 -3 125 -174 72 -34 -16 -83 -60 45 -243 69 207 -75
3920g5J66j04r6J59r7J31J42k28J00k18K04J07k08pp3j67L34q6k0J17J21l20J40
$$ -75 91 -13 -109 50 -47 84 226 -2 98 -120 84 191 -17 -24 -97 -264 70 -16 -36 81 202 -118 22
3943B2p5j77L18l85K19J42J65O8j15j61j29R7L9j37K04Nj32R6j06J8J8j13L16
$$ 22 -53 -230 88 -297 -78 64 229 297 182 21 -108 -11 28 -109 95 100 -32 64 -42 -24 -6 -119 197
3966A97j86q6K71J75k97q7J07M7k24K99k42N3j57P8K6r3K93k60M9l2J44k03K51
$$ 197 11 -75 196 371 74 -13 94 141 -83 216 -26 27 -130 -52 -26 -119 174 -86 -37 -69 75 -128 123
3989A23Q2k53J38O7k20j5L92l61P8J49j1k20j1j9K07j03J15m39L47rJ42j65L4
$$ 123 205 -48 90 157 -63 -78 314 -47 31 180 169 -51 -62 -81 126 23 138 -301 46 37 179 14 48
4012D8l47M95l07RL11j19P7k87J88o0l53K99J05j43o6J52J08O7M7k08j17j16J15
$$ 48 -299 196 -111 -102 209 90 167 -120 68 8 -345 -46 59 -84 -150 2 110 177 224 16 -101 -217 -102
4035a02J14l23L52J82K13o31J03K19j12J75P7o13O59r1j41j69K01K0J40m16M8
$$ -102 12 -311 41 223 436 -195 -92 127 15 190 267 -346 313 222 81 -88 113 133 273 -143 -95
4056i5K85l60J1O5J95l9k38j51L27o2j46Q8L27o2k28R8R5J79m38l0L14q1k40K70
$$ -95 190 -170 -159 -94 101 62 -176 -327 0 -62 -208 -120 207 145 -83 15 110 289 -149 -179 135 54 -186 84
4080H4m2J83jl21K10j26k38K56P8l10M26j07k2l01J23L08k7l35O3J22J22m15J30
$$ 84 42 225 224 -97 113 -13 -251 5 83 -227 199 92 70 -231 -108 200 173 -162 -99 23 145 -270 -140
4103a40l3k1L53Kj29P5l0o4M9O7q7R4M4l77K53R2J00k65n6n5L62k85mK7o0K48
$$ -140 -173 -194 159 161 32 107 77 13 62 129 42 136 180 -197 56 148 248 -17 -73 -128 234 -51 -55 -28 -88 160
4129A60k68K92k9j61j73R2K65l96K19l74N65%o4P4k99Q6L53o6n29M98k43p9j06
$$ 160 -108 184 155 -6 -179 -87 178 -218 1 -373 192 192 128 202 -97 -11 342 276 -253 245 2 -77 -183
4152a83M00k84k0K23p2o2j45M02j55k66QN2J31L5N8r2%K4Nk71K91l64M83n4J38
$$ -183 217 -67 -87 136 64 2 -143 259 104 -162 -154 -102 29 64 122 30 30 54 59 -212 79 -285 198 144 282
4177B82l85J1K13J08j06j66J41j93Jj52L17l0j43P7rJ19j49p6M8n8K60k54P8O9
$$ 282 -103 -92 121 229 123 -43 98 -95 -94 -246 71 41 -102 -25 -34 85 -64 -140 -92 -150 110 -144 -66 3
4201CpO3K3k9k2j6k05K71j52J41q7m2J33p7k61K20Q9j20N3K6o8M3mR0j92K65N
$$ 3 -4 59 82 53 31 15 -190 81 -71 70 -17 -59 74 -3 -264 -44 45 -75 -22 4 -64 -21 -25 65 -127 138 143
4228A43P4k73j49M46j36R5k60j40J99k06K0K44j93L50l8P3j53k69J92j15J7J23
$$ 143 217 -56 -205 241 105 200 -60 -200 -1 -207 -187 57 -136 214 176 249 96 -173 19 -96 -79 44
4250D4j74L2L05j37l53J96K77k76q2K18k74J41p9L2K09j40P2RR4l86L76k5K2j73
$$ 44 -130 -98 207 70 -283 -87 190 -86 -168 50 -224 -83 -162 -130 79 -61 11 20 114 -272 104 79 101 -72
4274g2k3k6K57L1j94J65k20K31o2j42J79k67K38j15K02j68L33k67k2rR9pL4j03
$$ -72 -95 -121 136 167 -27 138 -82 149 87 -55 124 -143 95 -20 182 14 347 80 58 49 148 141 175 72
4298G2l6J40l26K26j02k87L27k3j43N9p8J40l38K88j03J32N9J48k67n6K64j84
$$ 72 36 176 -150 76 -26 -313 14 -9 -152 -93 -171 -31 -369 -81 -184 -52 7 155 -112 -168 96 -88
4320h8J80l60L9L8J88k8L8j12O5K05j66j24Q0L61m4o55M71j95K32j52l26N67N8
$$ -88 92 -268 -229 -191 -3 -31 7 -105 -40 165 -1 -125 -45 316 272 -383 88 -107 125 -27 -353 214 272
4343B72o96M05Jj34P2l4J29J4J16j24K1J7j27j99J35L68q6l79J72J36o4q4K56
$$ 272 -424 -19 -18 -152 -80 -114 15 29 145 21 42 59 -68 -267 -132 236 150 -229 -57 79 15 -69 187
4366A87j83K75k54P8r4K7l5J9o1L93l44q9%J65j17j74K92k86K74J38k95J79j6
$$ 187 4 279 25 103 9 36 1 20 -41 352 8 -81 -81 84 -33 -207 85 -201 73 211 -84 95 79
4389G9l59K53L85n36K90j65j65K47k16L83j78J7q2J22K44k61j15PJ36p0J08k13
$$ 79 -280 -27 358 -178 112 -53 -218 29 -187 196 18 35 -47 75 319 58 -57 -50 86 16 124 -89
4411h9P1m1N27m52j00P3k0o2Q9j4L19k25o8j54K82l43Q2L44k85j75M82l52M3j12
$$ -89 -18 -59 468 16 -84 -11 -31 -93 -4 -18 301 76 8 -146 136 -207 -125 219 -66 -241 241 -111 -68 -180
4435a80J90l9j55J39J6K06n39O18Ok75j12PJ52j38K59l7m34P17n90K44L4k28L3
$$ -180 10 -29 -184 -45 -29 177 -362 256 262 -13 -125 -118 34 -104 155 118 -316 401 -189 55 89 -139 -106
4458a06j70L83n1KM4J56k00j30K80k56M1k5j70L52m19K11K9j0K8J53Rm28J97m6
$$ -106 -276 107 56 58 102 258 58 -72 208 -48 -7 -32 -202 150 -269 -58 -29 -39 -11 142 151 -277 -80 -126
4482a26RJ41j00N8j52J8L27p3m13M19j05N0n6p4p3K79L9j40N0k11K87l49L52k84
$$ -126 -117 24 -76 -18 -170 -152 175 102 -311 108 3 53 -3 -77 -150 129 168 28 78 -133 154 -195 157 -127
4506a27L45j63l7r7Mj22J44o2P6R7r4k25K19J85j09O6j65K46k52J49Q4j76J65
$$ -127 218 55 18 -79 -75 -197 -53 -115 -39 58 -36 -261 -42 143 34 100 -65 181 -71 78 162 -14 151
4529A51j38r8j87K02N1j34K72m6K6r2r4K18J22m72K22K1R5j03M0J00k19J30J34
$$ 151 13 -85 -272 -70 -19 -153 119 73 99 7 -87 131 253 -219 3 24 119 16 56 156 -63 67 201
4552B01m35J83J34j79L18j39l4k8oN5j19J69k15P7j42K74J10nm38L16n3k52K90
$$ 201 -234 -51 83 -96 222 83 49 21 15 70 -49 120 -95 -18 -160 114 224 219 -219 97 44 -208 82
4575H2L1q9l5m7J39j07q5K11k46N2O4M8r6L65j60k2j9k11K76l03L3J39j55K66
$$ 82 113 24 -11 -58 81 -26 -111 100 -146 -94 -30 18 -78 287 127 105 86 -125 151 -152 -119 20 -135 131
4599A31J20m07L72n3k03L0j48K16J69o0l65R1M99n76J95RN0j85J55O5k58K45m53
$$ 131 251 -156 216 163 -40 -10 -158 58 227 167 -198 -107 392 -184 11 20 70 -115 40 105 -153 92 -361
4622c61O18l88O3m5J19m9J35Nn0j4k97j01M7J07K56j61NM5K30j86k0K5n1J77k22
$$ -361 257 -131 -68 -113 6 -43 92 97 47 33 -264 -365 -318 -211 45 -116 -111 -66 164 -22 -42 -17 -68 109 -113
4647a13n9K07q6J14j13R2j44N0Q9l5N1j33R5q3k9M7K4m0l05K17K24o6P5q5o1L25
$$ -113 -172 35 -51 63 -50 42 -102 -52 37 2 53 -80 15 -68 -97 -50 -26 -66 -371 -154 70 4 79 -6 -67 258
4673B58J09m04R6R3j75pJ34k%j61R8j78J87j07PJ65l85J13K17J76j77k19r1K46
$$ 258 367 -37 59 152 -23 -30 104 102 102 -59 39 -139 48 -59 -52 113 -272 -159 58 234 57 -162 -253 -7
4697gL07j72j50K7K55j23j40k00L14P5k24j26J71J74k15m2k35J67l0K47q1J95
$$ -7 300 128 -22 5 260 137 -3 -203 111 186 -38 -164 7 181 -34 -76 -311 -144 -174 73 -8 187
4719A87j82J23o0J04q8J82j5j7m4j59k6K94n5j07k18L5J95j27l6j19P3p6J45k1
$$ 187 5 128 68 172 84 266 251 234 190 31 5 299 244 137 -81 -46 149 22 -14 -133 -60 -136 9 -12
4743a2J57n30L48n8R5j19J54n1L9j51M31j76J03k45j0J28m1Mj6p9P1q6J64k48
$$ -12 145 -385 -37 -95 0 -119 35 -16 23 -128 303 127 230 -15 -25 103 62 66 50 -29 42 -44 120 -128
4767a28J2N5J02KQ5k38P3oK93o5j06j36Or1K34n9n9k8m3M1M7J08l9J54k15L03
$$ -128 -116 -61 41 43 128 -110 -37 -43 250 185 79 -57 -51 -142 92 33 -26 -54 -97 -56 -9 99 60 214 -1 302
4793C02m36K76j37mJ52k43J08J10j31K99k58J39j99Kj79J84K44k55M9J21k20J60
$$ 302 -134 142 5 1 153 -90 18 128 -3 296 38 177 -22 -20 -199 -15 229 -26 23 144 -76 84
4815H4r8O9J58k51J74j99M9R4K05k71J6N9L7J1k49q7L37j09n0R5J03n6L1n3j7
$$ 84 -14 55 213 -38 136 -63 -14 80 285 14 30 89 126 137 -112 -199 138 29 -21 74 177 121 152 99 82
4840H2k93M2L84k56Q1P6k05M9j26Q8L00j14j79K78j97p7R7j19J68K1M7j21l47
$$ 82 -211 -169 215 -41 40 116 -89 -40 -166 -78 222 108 -71 207 10 -67 30 -89 79 100 147 26 -321
4863c21L91k44q8K40k96L38j41o7J28j35R3j80M24k70J5K08R7j59K21l79j10K66
$$ -321 70 -174 -262 -22 -318 20 -121 -188 -60 -195 -102 -282 142 -128 -113 95 192 33 254 -125 -235 31
4885C1n6j7J99j57N8r3j8K10k24P6K42l2l40R7L30n09N3K9J29k14J42J84j55j19
$$ 31 -25 -42 157 0 58 -35 -53 157 -67 9 251 219 -121 -24 306 -203 -150 -121 8 -206 -64 120 -35 -154
4909a54K89l48J61J33j54no1M0K47l15J37n8J28j19M11n89K98J66j16k3p4j32
$$ -154 135 -213 -52 81 -73 -78 -139 -99 148 -167 -30 -88 40 -79 332 -257 41 207 91 68 -6 -138
4931a38N6J79k00l4K73m9R7l30K33J09l17K63j0l28Q1J25O1o3j42O2k1K58j81
$$ -138 -82 97 -103 -137 136 87 184 -146 87 196 -121 142 132 -196 -115 10 71 8 -134 -72 -93 165 -16
4954a6j40K15n3J16j67K68m81R5K61r1p4J60P2j17l8q5Q8j15J80K45o24L84J62
$$ -16 -156 59 6 122 -45 223 -258 -163 98 7 -67 93 165 48 10 -75 13 -102 78 323 -301 83 245
4977B45j27l5O9j30k61J09K94j49j50K22J2j23j26J72J60m47L07j51K11m5Q6l31
$$ 245 118 83 152 22 -239 -130 164 15 -135 87 99 -24 -150 22 182 -265 42 -109 102 57 143 -188
4999a88j5j11L70k4j96K39k21J86l35J17J36j03K37M2k42K01k6K9J0k99K44k50
$$ -188 -203 -314 56 32 -164 75 -146 40 -295 -178 -42 -145 92 134 -108 93 67 96 106 -193 51 -199
5021a99k28K53K82j26k15J60M5j51L98n12K98p4J32k39J7J65j65L69O6m46J88
$$ -199 -427 -174 108 -18 -233 -73 -28 -179 219 -293 5 -69 63 -176 -159 6 -159 210 276 -170 18
5042A8R8k12R3j88K72j05PPO5l07K74P8k08J33n5k79N51n12M23l87K94j42J90
$$ 18 116 -96 -3 -191 81 -24 -17 -10 55 -252 22 100 -108 25 -30 -309 242 -270 153 -234 60 -82 108
5065A08P1j36j61L57j42j09l4K5o7Q7j80O5or5K22q8J95j58J23J70l47k0K09l4
$$ 108 179 43 -118 239 97 -12 -46 -21 -88 -1 -181 -116 -122 -217 5 -83 112 -46 77 247 -100 -120 89 55
5089E5k16N21n19L0k8K33L25m46n5J38J65l55J50j21K16j17j91J47J61J22k03
$$ 55 -161 360 -159 -129 -157 76 401 -45 -100 38 203 -152 -2 -123 93 -24 -215 -68 93 215 12
5110A2j74K26q0O2Lj68K50Qk93J18l96L10L21j10J44k67J7KR5k28J60J27m29N50
$$ 12 -162 64 -16 46 49 -119 131 139 -154 -36 -432 -122 199 89 233 -34 -17 -15 80 -148 12 139 -290 260
5134B60l53r7J19J27j69M6M55k81N2j06p7j00N4j8J32J24n2n7n3k34mJ32J8J25
$$ 260 -93 -190 -71 56 -113 -67 388 107 159 53 -24 -124 -70 -88 44 168 116 59 6 -228 -232 -100 -82 43
5158D3l2p2J24k05K06O8R1J19k10j60p7Q0j63J09k28K77j8J53k68J4L92j30k58
$$ 43 11 -61 63 -142 64 132 223 342 132 -28 -105 -25 -188 -79 -307 -30 -48 105 -163 -149 243 113 -145
5181a45J53j80J93j2J98l44n1K42j17J07O4j82PJ62l64J95J37L5l94L29Q0k6L9
$$ -145 8 -172 21 9 207 -137 -188 54 -63 44 108 -74 -67 95 -269 -74 63 98 -296 33 113 87 126
5204A26k22L22l92K26Kj4J52j26q2m4m7n6K30j78K64j94J8j85J39j14K03m3L2
$$ 126 -96 226 -166 60 62 48 200 74 -8 -52 -99 -155 75 -103 161 -33 -15 -200 -61 -175 28 -15 17
5227A7k26M62l48K44J00j48p7j38P4J09r4J37k14K13j26k57L79k96Q0J92l6N5
$$ 17 -209 253 -95 149 249 101 24 -114 -40 69 -25 112 -102 111 -15 -272 107 -189 -109 83 47 102
5249A02Rk57j80J67RL12q5l19L20N3l2m9k17L40k93j36K34k8R7l51K00R2j4k7
$$ 102 111 -146 -326 -159 -150 162 77 -242 78 131 99 50 -167 173 -120 -256 -22 -50 47 -304 -104 -12 -26 -53
5273e3O7N8n0M7j35M3j21J64p2j1M2j07k1K83m7l60N78n24K54J47j23j97M48m44
$$ -53 14 72 22 69 -66 -23 -144 20 -52 -63 -21 -128 -149 134 87 -273 305 -219 35 182 59 -138 310 -134
5297a34o4K03M1P6L9m8l98M95q9j10p8N15n01M9j8P0k7j37O7K01k20j96J85K81
$$ -134 -198 5 46 122 161 113 -285 210 121 11 -67 448 -53 -4 -22 48 21 -116 -49 152 -68 -264 -79 202
5321B02k14l11O47l08j42K34l14K07L32m80R7%J3J02j39j6M25k31k27q0J84J92
$$ 202 -12 -323 324 16 -126 108 -206 1 333 -147 -50 -50 -37 65 -74 -90 335 104 -123 -203 -19 173
5343A73O2j60k45K33o6J86k18J7M4k95K83j82k8J11J54k59J22K41j88O7mL9q3
$$ 173 235 75 -170 63 -3 183 -35 -18 26 -269 14 -168 -196 -85 69 -190 -68 173 -15 52 48 87 4
5366Dk76L42k03M0J89Q0k6m15L35l33L31p1K6k53Q2l1M22r8j26J99p6L6k14J29
$$ 4 -272 70 -133 -93 96 176 150 -265 70 -263 68 -3 23 -230 -148 -179 243 145 19 218 142 178 -36 93
5390I3k60P1K15q1j14j48J08M0J96j49L6P6p3j65O5K00k22oL76l45K40M5n81K62
$$ 93 -167 -96 119 38 -76 -224 -116 -76 120 -29 7 83 10 -155 -90 110 -112 -118 258 -87 153 198 -383 -121
5414a21n9J94N6p1j05M33l27q6m1K15P0o1j29r6K23k0J15l53K03q0J55l2k09K71
$$ -121 -180 14 70 -1 -106 327 0 -86 -127 88 158 97 -32 -128 95 75 190 -163 40 -40 115 83 -126 145
5438A45k24j98L47k78K01k28M8J87K70l72J63k20K23ol55J83J08R0r9J75n2k48
$$ 145 -79 -277 70 -208 -7 -235 -187 0 270 -102 61 -159 64 58 -297 -114 -6 84 -15 160 108 -140
5460a40K15j37K99k54K61m02m6K8K19O8j71J04m4K59j06j58j72j29J28K76r6j56
$$ -140 75 -62 237 -17 244 -158 -204 -176 43 111 -60 44 0 259 153 -5 -177 -306 -178 98 2 -154
5482a54L78k78r1J87j60K58m35K23J18l89M73j84J05J27j35M7j61Q3r1K02k2k3
$$ -154 224 -54 -145 42 -118 140 -295 -72 46 -343 130 -54 51 178 43 90 -71 12 -79 123 101 78
5504G8j60J5rJ0n6j79P7M3l1J33K11j21K92j80k5j14m37M99j12J10j5j41J42j50
$$ 78 -82 -67 -76 -66 -122 -301 -224 -181 -212 -79 132 11 303 123 98 -16 -453 46 -66 44 29 -112 30 -120
5528a20p3R7M6p4r7RJ14K26j99l6P9r4J77k44J21J84j02J39k60K24j7K08k52n1
$$ -120 -193 -96 -50 -124 -221 -212 -98 128 -71 -107 -28 -122 55 -189 -68 116 14 153 -107 117 100 308 56 5
5552Ej62J08j10M9L54l97J29j31K51j09r9j97K66J40O4l32J57rJ16J32q2L2L57
$$ 5 -157 -49 -159 -110 244 -153 -24 -155 96 -13 -112 -309 -43 97 161 -171 -14 -23 93 225 143 175 532
5575E32k93l83R8P8J10R1k63M1K05k08l9P7k11J87P2o1K7k03l2L60l61M0J05j27
$$ 532 239 -144 -46 32 142 233 -30 11 216 8 -31 46 -165 22 94 33 60 -143 -175 185 -176 -136 -31 -158
5599a58K92j38L3M9J29l8j69l9J09p4J7q6L53k45n1k37L62q3J7l5j04K50o3j92
$$ -158 134 -4 29 78 207 169 0 -39 70 -4 13 -73 280 35 -16 -253 109 26 43 8 -96 154 91 -101
5623a01n8J71j5K5M2j86o7ML14j38l5J32q8P7j90L3J20m6j4K93j80l71J44L10
$$ -101 -159 12 -3 22 64 -122 -189 -185 129 -9 -44 88 0 77 -113 -80 40 -6 -20 273 93 -278 -134 176
5647A76j26j47M5k13M41l17J24r8M6K16P4L7k87%j0Q3j43k6K05j7J03l63K41j44
$$ 176 50 -97 -52 -265 176 -141 -17 -115 -69 147 221 258 -29 -29 -39 44 -99 -125 80 63 166 -197 44 -100
5671a00L58j46K1j39j4r3K25P1l16L00k05l5K20J3n15N15j22Pn7r7o4Q2m4J75
$$ -100 258 112 133 -6 -20 -113 112 183 -133 167 -38 -73 147 160 -355 160 38 45 -12 -109 -173 -91 -135 40
5695D0R3k89L26n5k69K95k38J51k44J1J83M03l12N6k00k0J59l6Ll5l3M6j71M1
$$ 40 133 -156 170 115 -154 141 -97 54 -190 -179 4 407 95 151 -49 -69 90 54 57 22 -11 35 -136 -95
5719i5K08q0k03L90n31M44J16j75o4K74K9m91J21j54L79k41L78n28K28j03K28
$$ -95 113 33 -170 220 -311 133 249 74 10 284 313 -178 -57 -211 168 -73 305 -223 5 -98 130
5740A30N8Pj14q2k3r1J80j1L8l00K48J11j4k25N9Qk2l01K87R9l38M20J9m19L76
$$ 130 188 195 81 -1 -24 -115 65 54 92 -208 40 151 137 -88 -29 -21 -43 -344 -57 42 -296 124 143 -276 100
5765A00J88k06k1j04J7j35Q0L72q9k66j05L59k35mR2j03N8j76j03L42j05j98J81
$$ 100 288 82 61 -43 -26 -161 -81 291 202 -64 -169 190 -45 -49 43 -60 -2 -178 -281 61 -44 -242 -61
5788f1k73pJ02N69j83m83L81J95m50K94j70L4J31J3k61M26l23J05K4k69J95nL97
$$ -61 -334 -341 -239 330 147 -336 45 240 -210 84 -86 -52 79 92 -169 257 -66 39 63 -206 -11 -16 381
5811C81m23K59j62J28j52qn5r3J33O2j31R7P7j52J60j14k15L34j6l45Q5q3O25
$$ 381 -42 217 55 183 31 23 -32 -125 8 70 -61 36 113 -39 121 7 -208 126 110 -235 -150 -233 392
5834C92l24j36J87k23J74J1J1k94J83q9K01j72K36j83J0P4J3J1p8Q4k43M0K09
$$ 392 68 -68 119 -104 70 81 92 -202 -19 -108 93 -79 157 -26 -16 58 71 82 4 88 -155 -115 94
5857I4P7k19J66j65l56M76k52N7N4l7O6Oj5%J63j71L88l94R6j05L32j00r7o4j51
$$ 94 171 -48 118 -47 -403 73 -179 -122 -68 -105 -39 -33 -48 -48 115 -56 332 -62 34 -71 261 161 64 0 -151
5882a51J92Q9j99j92P0O6J55O3j52J12j49O9J6J02P0m34J28J08k21J85J97r0K3
$$ -151 41 130 -69 -261 -191 -125 30 93 -59 53 -96 -27 -11 91 161 -273 -145 -37 -258 -73 124 34 57
5905E7pn9L6J69r0j97o1K95l11J99n3j24K58l08L09k24K75qR5l7l97R1%j7L0k4
$$ 57 50 -9 27 196 106 -91 -152 143 -168 31 -22 -146 112 -196 113 -111 164 156 251 214 -183 -92 -92 -109 -79 -103
5931a03J93L9o6q2j91L50o2R8l01j59K14pJ60k83Kj4J00R7n3%K7J35l25L15j05
$$ -103 90 129 63 -19 -210 140 78 176 -125 -284 -70 -77 83 -200 -198 -212 -112 -15 -68 -68 -41 94 -231 84 -21
5956b1n9j19O9M6k9J42m2P3k6l17J38L09j55m8r2J49j32K15p2j50J07J6r2J2L33
$$ -21 -80 -199 -130 -84 -113 29 -13 60 34 -283 -145 164 9 -39 -131 18 -114 101 29 -121 -14 2 -90 -78 255
5981B55j28J17l53Q4m8NK05j79J28k27J22P7O0k53K78k86j55M70k84L08j30j73
$$ 255 127 244 -109 -25 -73 -68 137 -42 86 -141 -19 58 118 -135 143 -143 -298 172 -112 196 66 -107
6003a07K33j01R8l33K76J01l95O18l43J03j58J55M1r5p2k54J62j3rJ32K7k42J98
$$ -107 126 25 123 -210 66 167 -228 390 47 150 -8 147 188 93 21 -233 -71 -84 -93 39 66 -176 22
6026B2k3k47J06K76l9q0M9j04K5J09k23q7K01n9J57m73L87Q1l90O8L52r1O2q2
$$ 22 -1 -248 -142 134 95 15 64 -40 -15 94 -129 -216 -15 -74 83 -390 -3 78 -312 -244 108 17 79 -3
6050cL0R5M4k16J15J52l43J32l6lm3J65j04r2k4L48k86JJ81QJ03l24J33o1q7M9
$$ -3 27 122 166 -50 65 217 -126 6 -30 -33 -76 89 -15 -107 -131 217 -69 -68 113 121 224 -100 33 -28 -115 -66
6076f6m2K37J2j47L04l06k17J72p7K12m1j7k7Q0l19K01J89J12k74K45k47j99R2
$$ -66 -108 129 141 -6 298 -8 -225 -53 -130 82 41 24 -3 77 -242 -41 148 260 -14 231 -16 -215 -123
6099a23R0K70k11K51j74J47l53jM05j67n4j15J7j29K63qj84k07J89P6N5O7k56
$$ -123 -33 237 26 277 103 250 -103 -104 301 134 80 -35 -18 -147 116 108 -76 -283 -94 -18 37 104 -152
6122a52J50R6J73j36l51L32j86l7L27j84m4J72m25K82k25L12p5j38j95L92j23
$$ -152 -2 94 267 131 -220 112 -74 -111 216 32 -12 160 -265 17 -208 104 29 -109 -304 88 -35
6143c5j62J96l21L46K94m03K47J29k81K9j61m3J71k97M65k38K60k51N1N1j39J47
$$ -35 -197 -1 -322 24 318 -85 162 291 10 39 -122 -165 6 -291 174 -64 196 -55 -4 47 -92 55
6165E5n6J24j04r7P9L9R2j28j83J47J4k40K64p7J08l09K15k42K87j37j20M82j02
$$ 55 -1 123 19 -78 1 40 132 4 -179 -32 -18 -258 6 -71 37 -272 -57 -299 -12 -149 -269 213 111
6188A11K18l50j06L7R3J73J6l87J02P4J9j34O9J70j35K43n23L84k41L62J6j63
$$ 111 329 -21 -127 -90 3 176 192 -195 -93 -19 0 -134 -65 105 -30 213 -310 74 -167 195 211 48
6210D8pm20M37k35L16l47J23m9m6R0r5L68l47l5J64R1R1J4k21M8j40R3QN0j24
$$ 48 41 -379 58 -177 139 -208 -85 -134 -180 -90 -185 183 -164 -199 -35 56 147 161 -60 -12 -152 -59 -51 -1 -125
6235a25M63l02l2m7N5o7J10J5l5j24L17k81J40n4k09J0J96R7j56K5O7l20K35R1
$$ -125 338 36 4 -43 12 -55 55 70 35 -89 228 -53 87 33 -176 -166 30 127 -29 -4 63 -257 -22 69
6259F9P6l5j41P7m2n6P5K5J3P5j72K99k24O7p6k7P2k23J97j70K32k80J84J77l60
$$ 69 145 110 -31 46 4 -52 23 48 61 136 -36 263 39 106 30 3 75 -148 49 -121 111 -169 15 192 -168
6284a68K38j20L6o1m1J47k62R5K52j88K97k68J07J48k59J38j87ML1Qo0K10j45
$$ -168 70 -50 -14 -75 -116 31 -231 -136 116 -72 225 -43 64 212 -47 91 -96 -92 -61 -53 -113 97 -48
6307d8J11L4j42j45K89Q9k22q1J28Q2r4j35K85j25J31k48J32N8j40L6k3l9j37
$$ -48 63 97 -45 -190 99 188 -34 -115 13 95 1 -134 151 26 157 -91 41 99 -41 -5 -28 -67 -204
6330b04J1L37j9n2j08%O7O3j2lP9o6j99L41k56J64N3k47J66l07Q4K80k06J26l02
$$ -204 -193 144 125 73 -35 -35 32 95 83 80 159 93 -106 235 -21 143 196 -51 115 -192 -108 172 -34 92 -210
6355b10J26J36k83L26j57K61k39j11K1K55l71K55k3J23k43J97J44k56M8j90K67
$$ -210 -84 52 -231 95 -62 199 -40 -151 -130 125 -246 9 -14 109 -134 63 207 -49 -1 -191 76
$$ [...]
8191B3
##END NTUPLES=NMR FID
##END=
