##TITLE=1H_Pr 37-3
 CDCl3
 8 sc, 
 19.4.2023
##JCAMPDX= 6.0         $$ Bruker NMR JCAMP-DX V2.0
##DATA TYPE= NMR FID
##DATA CLASS= NTUPLES
##ORIGIN= UXNMR, Bruker Analytische Messtechnik GmbH
##OWNER= root
$$ XWIN-NMR		Version 3.5
$$ Wed Apr 19 14:00:54 2023 Russian Standard Time (UT+4h)  she@DPX200
##.OBSERVE FREQUENCY= 200.13135
##.OBSERVE NUCLEUS= ^1H
##.DELAY= (6, 6)
##.ACQUISITION MODE= SIMULTANEOUS
##.ACQUISITION SCHEME= undefined
##.AVERAGES= 8
##.DIGITISER RES= 18
##SPECTROMETER/DATA SYSTEM= spect
##.PULSE SEQUENCE= zg30
##.SOLVENT NAME= CDCl3
##.SHIFT REFERENCE= (INTERNAL, CDCl3, 0, 15.7039)
##AUDIT TRAIL= $$ (NUMBER, WHEN, WHO, WHERE, WHAT)
$$ ##TITLE= Audit trail, XWIN-NMR		Version 3.5
$$ ##JCAMPDX= 5.01
$$ ##ORIGIN= Bruker BioSpin GmbH
$$ ##OWNER= she
$$ F:/spectra/data/she/nmr/H-F/1/audita.txt
$$ ##AUDIT TRAIL=  $$ (NUMBER, WHEN, WHO, WHERE, WHAT)
(   1,<2023-04-19 13:59:43.25 +0400>,<she>,<DPX200>,
      <created by zg, POWCHK disabled, PULCHK disabled
       configuration hash MD5:
       00 E9 B6 7A A2 85 ED C7 34 08 36 98 17 FE 4E 26
       data hash MD5: 16K
       50 A9 95 1F CE 6F 7B 5D 5C 5E B9 34 1B 69 16 8B>)
$$ ##END=
$$ 
$$ hash MD5
$$ 21 15 DE 27 A3 7A 12 1A 31 46 4B EC 0F 0A 16 F2
##$RELAX= 
##$RELAX= 
##$RELAX= 
##$RELAX= 
##$RELAX= 
##$RELAX= 
$$ Bruker specific parameters
$$ --------------------------
##$DU= <F:/spectra>
##$EXPNO= 1
##$NAME= <H-F>
##$PROCNO= 1
##$TYPE= <nmr>
##$USER= <she>
##$AMP= (0..31)
100 100 100 100 100 100 100 100 100 100 100 100 100 100 100 100 100 100 
100 100 100 100 100 100 100 100 100 100 100 100 100 100 
##$AQSEQ= 0
##$AQ_mod= 1
##$AUNM= <au_zg>
##$AUTOPOS= <>
##$BF1= 200.13
##$BF2= 200.13
##$BF3= 200.13
##$BF4= 200.13
##$BF5= 200.13
##$BF6= 200.13
##$BF7= 200.13
##$BF8= 200.13
##$BYTORDA= 1
##$CFDGTYP= 0
##$CFRGTYP= 5
##$CHEMSTR= <none>
##$CNST= (0..31)
1 1 145 1 1 1 1 1 1 1 1 1 1 1 1 1 1 1 1 1 1 1 1 1 1 1 1 1 1 1 1 1 
##$CPDPRG= <>
##$CPDPRG1= <>
##$CPDPRG2= <>
##$CPDPRG3= <>
##$CPDPRG4= <mlev>
##$CPDPRG5= <mlev>
##$CPDPRG6= <mlev>
##$CPDPRG7= <mlev>
##$CPDPRG8= <mlev>
##$CPDPRGB= <>
##$CPDPRGT= <>
##$D= (0..31)
0 1.2 0 0 0 0 0 0 0 0.06 0 0.03 0 0 0 0 0.0002 0 0 0 0 0 0 0 0 0 0 0 0 
0 0 0 
##$DATE= 1681898382
##$DBL= (0..7)
120 120 120 120 120 120 120 120 
##$DBP= (0..7)
150 150 150 150 150 150 150 150 
##$DBP07= 0
##$DBPNAM0= <>
##$DBPNAM1= <>
##$DBPNAM2= <>
##$DBPNAM3= <>
##$DBPNAM4= <>
##$DBPNAM5= <>
##$DBPNAM6= <>
##$DBPNAM7= <>
##$DBPOAL= (0..7)
0.5 0.5 0.5 0.5 0.5 0.5 0.5 0.5 
##$DBPOFFS= (0..7)
0 0 0 0 0 0 0 0 
##$DE= 6
##$DECBNUC= <off>
##$DECIM= 32
##$DECNUC= <off>
##$DECSTAT= 4
##$DIGMOD= 1
##$DIGTYP= 9
##$DL= (0..7)
0 120 120 120 120 120 120 120 
##$DP= (0..7)
150 150 150 150 150 150 150 150 
##$DP07= 0
##$DPNAME0= <>
##$DPNAME1= <>
##$DPNAME2= <>
##$DPNAME3= <>
##$DPNAME4= <>
##$DPNAME5= <>
##$DPNAME6= <>
##$DPNAME7= <>
##$DPOAL= (0..7)
0.5 0.5 0.5 0.5 0.5 0.5 0.5 0.5 
##$DPOFFS= (0..7)
0 0 0 0 0 0 0 0 
##$DQDMODE= 0
##$DR= 18
##$DS= 0
##$DSLIST= <SSSSSSSSSSSSSSS>
$$ [...]
##$SUBNAM2= <"">
##$SUBNAM3= <"">
##$SUBNAM4= <"">
##$SUBNAM5= <"">
##$SUBNAM6= <"">
##$SUBNAM7= <"">
##$SUBNAM8= <"">
##$SUBNAM9= <"">
##$SW= 18.05172834244
##$SWIBOX= (0..15)
0 0 2 0 0 0 0 0 0 0 0 0 0 0 0 0 
##$SW_h= 3612.71676300578
##$TD= 16384
##$TD0= 1
##$TE= 0
##$TE2= 300
##$TE3= 300
##$TEG= 300
##$TL= (0..7)
0 120 120 120 120 120 120 120 
##$TP= (0..7)
150 150 150 150 150 150 150 150 
##$TP07= 0
##$TPNAME0= <>
##$TPNAME1= <>
##$TPNAME2= <>
##$TPNAME3= <>
##$TPNAME4= <>
##$TPNAME5= <>
##$TPNAME6= <>
##$TPNAME7= <>
##$TPOAL= (0..7)
0.5 0.5 0.5 0.5 0.5 0.5 0.5 0.5 
##$TPOFFS= (0..7)
0 0 0 0 0 0 0 0 
##$TUNHIN= 0
##$TUNHOUT= 0
##$TUNXOUT= 0
##$USERA1= <user>
##$USERA2= <user>
##$USERA3= <user>
##$USERA4= <user>
##$USERA5= <user>
##$V9= 5
##$VALIST= <valist>
##$VCLIST= <CCCCCCCCCCCCCCC>
##$VD= 0
##$VDLIST= <DDDDDDDDDDDDDDD>
##$VPLIST= <PPPPPPPPPPPPPPP>
##$VTLIST= <TTTTTTTTTTTTTTT>
##$WBST= 1024
##$WBSW= 4
##$XGAIN= (0..3)
0 0 0 0 
##$XL= 0
##$YL= 0
##$YMAX_a= 241624
##$YMIN_a= -303792
##$ZGOPTNS= <>
##$ZL1= 120
##$ZL2= 120
##$ZL3= 120
##$ZL4= 120
##$ABSF1= 10
##$ABSF2= 0
##$ABSG= 5
##$ABSL= 3
##$ALPHA= 0
##$AQORDER= 0
##$ASSFAC= 0
##$ASSFACI= 0
##$ASSFACX= 0
##$ASSWID= 0
##$AUNMP= <proc_1d>
##$AZFE= 0.1
##$AZFW= 0.1
##$BCFW= 1
##$BC_mod= 2
##$BYTORDP= 1
##$COROFFS= 0
##$CY= 11.3945322036743
##$DATMOD= 1
##$DC= 2
##$DFILT= <>
##$DTYPP= 0
##$F1P= 15.7292609196834
##$F2P= 12.9074282941183
##$FCOR= 0.5
##$FTSIZE= 0
##$FT_mod= 4
##$GAMMA= 1
##$GB= 0.15
##$INTBC= 1
##$INTSCL= 1
##$ISEN= 128
##$LB= 0.24
##$LEV0= 0
##$LPBIN= 0
##$MAXI= 10000
##$MC2= 0
##$MEAN= 0
##$ME_mod= 0
##$MI= 1.114404
##$NCOEF= 0
##$NC_proc= 0
##$NLEV= 6
##$NOISF1= 3.799351
##$NOISF2= 2.8
##$NSP= 1
##$NTH_PI= 0
##$NZP= 0
##$OFFSET= 15.70392
##$PC= 1
##$PHC0= -19833.8
##$PHC1= 15.20081
##$PH_mod= 1
##$PKNL= yes
##$PPARMOD= 0
##$PSCAL= 0
##$PSIGN= 0
##$REVERSE= no
##$SF= 200.130013532006
##$SI= 16384
##$SIGF1= 3
##$SIGF2= 2
##$SINO= 400
##$SIOLD= 16384
##$SREGLST= <1H.CDCl3>
##$SSB= 0
##$STSI= 0
##$STSR= 0
##$SW_p= 3612.71676300578
##$SYMM= 0
##$S_DEV= 0
##$TDeff= 0
##$TDoff= 0
##$TI= <>
##$TILT= no
##$TM1= 0
##$TM2= 0
##$TOPLEV= 0
##$USERP1= <user>
##$USERP2= <user>
##$USERP3= <user>
##$USERP4= <user>
##$USERP5= <user>
##$WDW= 1
##$XDIM= 8192
##$YMAX_p= 0
##$YMIN_p= 0
$$ End of Bruker specific parameters
$$ ---------------------------------
##NTUPLES= NMR FID
##VAR_NAME=  TIME,          FID/REAL,        FID/IMAG
##SYMBOL=    X,             R,               I
##VAR_TYPE=  INDEPENDENT,   DEPENDENT,       DEPENDENT
##VAR_FORM=  AFFN,          ASDF,            ASDF
##VAR_DIM=   8192,          8192,            8192
##UNITS=     SECONDS,       ARBITRARY UNITS, ARBITRARY UNITS
##FACTOR=    0.0002768,     1,               1
##FIRST=     0,             0,               0
##LAST=      2.2672688,     0,               0
##MIN=       0,             -303792,         0
##MAX=       2.2672688,     241624,          0
$$ Real data points
##PAGE= N=1
##DATA TABLE= (X++(R..R)), XYDATA
$$ [...]
1729a69J04j25q6K32j26j30O4R6p3K95j15L87j80l75L77R4k36K44M9j94J6J61
1751C10n2j34p8K47l57j21J62K28o85L33K1j03r7K5J80J2k15J86J89Q6j27L3L7
1774H0m6J35K87n5j6l5k02K38j12j45j35J44q5m0L11m33j1j90M04o8k48l5p2J19
1798b10j26r2J71J56j27K36k48J51J76k31J50K64pj22m22J91O86m60j05J77j54
1819E4J70j75Mj5k26j26K57k45nM9K42j58j21J47K03m11K35Q5L81j92j65l0L03
1842B61j43k08O76l01n8j07Qj83J41j72N00n96J19j05pj80j1J22J33R7n1J04O9
1865A08l31L25l23K32J9n4M0K0L98j31m35K22J56j7L2J21j59m3k24J90P2m23j31
1888c36K00J55k10r1K9L15l66n1L75j34j66N8J21M31n58N5K83JQ6k07K85L8l63
$$ plain form
1729 -169 -65 -190 -276 -44 -170 -300 -236 -140 -213 82 -33 354 174 -201 176 270 34 278 327 133 149 310
1751 310 258 124 46 293 -64 -185 -23 205 -480 -147 -126 -229 -326 -301 -121 -109 -324 -138 51 137 10 43 80
1774 80 34 169 456 401 385 350 148 386 274 129 -6 138 53 13 324 -109 -120 -310 94 26 -222 -257 -329 -210
1798 -210 -336 -428 -257 -101 -228 8 -240 -89 87 -144 6 270 263 141 -281 -90 596 136 31 208 54
1819 54 224 49 53 38 -188 -314 -57 -302 -307 -258 -16 -174 -295 -148 55 -356 -121 -36 345 153 -12 -42 261
1842 261 118 -90 586 285 227 120 128 -55 86 -86 414 -182 -63 -168 -175 -355 -366 -244 -111 -14 -65 39 108
1865 108 -223 102 -221 11 30 -24 16 36 434 303 -132 90 246 229 261 382 223 180 -44 146 218 -205 -336
1888 -336 -136 19 -191 -282 -253 62 -304 -355 20 -114 -280 -222 -101 330 -228 -173 110 111 197 -10 275 313 -50
1911e0nJ59M2j20Q3m44L21j96O0L58l94R6l13K81M7l22qM06j01j39L63j31m9J18
1935F2R2j55J69L2J44j42l1j6J17J29l91k71K64J76k15j59K22n8o0j52J30j06
1957b19j36J91J20o3j73o0N91p5k76K92J29l10J63l07N36k69o2J67J51l53km9
1979a4L35r1k35j43q4K65l58m5O9j87R2kL91k59K04l69J59K63L7k2J20P8k76M35
2003C63j88K24l33r1K37k65L3K16K63o75K55j20K31k65J10mQ4%l39J68J1l20J02
2026c03J84M0k09J09K59P9km6J31J44m72O6k7L38l10K04j06O6j84L02q9k53L2
2049d7j7j8j62L2l9J19J07J7q9j13L48j08K44k74J02j75J9K02j4J16J81l26k02
2072i7J12p1K75k87K30k18k1j58K17j0Q7j67N0J6n4j82J8N2K16K38k13N9K75l87
$$ plain form
1911 -50 -55 104 146 26 109 -335 -14 -210 -150 208 -186 -90 -403 -122 -75 -397 -405 1 -100 -239 124 -7 -56 62
1935 62 154 -1 168 200 344 202 171 155 272 401 10 -261 3 179 -36 -195 27 -31 -91 -243 -113 -219
1957 -219 -355 -164 -44 -107 -280 -340 251 176 -100 192 321 11 174 -133 403 134 72 239 390 37 35 -14
1979 -14 321 230 -5 -148 -232 33 -325 -370 -301 -488 -396 -398 -7 -266 -62 -431 -272 -9 28 6 126 204 -72 363
2003 363 175 399 66 -25 212 -53 -20 196 459 -216 39 -81 150 -115 -5 -9 75 75 -264 -96 -85 -405 -303
2026 -303 -119 -79 -288 -179 80 159 157 111 242 386 -86 -20 -47 291 -19 185 79 145 -39 263 174 -79 -47
2049 -47 -64 -82 -244 -212 -251 -132 -25 -8 -97 -210 138 30 274 0 102 -73 -54 148 134 250 431 105 -97
2072 -97 15 -56 219 -68 162 -56 -77 -235 -18 -28 59 -108 -58 -42 -96 -278 -260 -208 8 246 33 92 367 -20
2096b0l5M46k94k8J86k69K40j39k7q6J25n5R9k21j69L15j62K95n66J28P8j83P1
2119b71K22K7j73J1N2j54M47j96J74l87K98K58j43J18n3o2k08K66o0j83j53M31
2141B61P0j87k60J53p9L1k36L45k09L16l90J2J36K2k05J30J02k9J26O5oJ08R9
2164C75k70K43l04J58q0nR5m6k96L07k86K54j05k13k3m7L1L63k56Q8j47m%j71
2188c39L01n5J19j38J47L18l54J83k1J04jj59r2J38j29O4J54k08j95M7J02j5j32
2211a61R2M1o6P1qo9k0J3r3K29j54K56l9k09P5K31k3q6k22M24n63L40m2M1kJ74
2237B30j35r6K18l17n7k92J23M31k83K25l24n5K45J66j75q8J08K04j10j05j3K58
2259A58o6J24l11M03r7k15L35k39O6j47l1k0P6p5n3L7o8J76l87K39pq9N3K36k18
$$ plain form
2096 -20 -55 391 97 69 255 -14 226 87 60 -26 99 44 143 -78 -247 68 -94 201 -365 -237 -159 -342 -271
2119 -271 -49 -22 -195 -184 -132 -286 161 -35 139 -248 50 308 165 283 230 168 -40 226 166 -17 -170 261
2141 261 331 144 -116 37 -42 -11 -247 98 -111 205 -185 -173 -37 -15 -220 -90 12 -17 109 174 168 276 375
2164 375 105 348 44 202 122 117 212 166 -130 177 -109 145 40 -173 -196 -243 -212 151 -105 -17 -164 -168 -168 -339
2188 -339 -38 -93 26 -112 35 353 -1 182 161 265 264 105 13 151 22 86 240 32 -163 -116 -14 -29 -161
2211 -161 -69 -28 -94 -23 -31 -100 -120 -107 -200 29 -125 131 92 -117 -42 189 166 80 -142 282 -281 59 17 58 56 230
2237 230 95 -1 217 -100 -157 -449 -326 105 -178 47 -277 -332 -87 79 -96 -184 -76 128 18 -87 -100 158
2259 158 92 216 -95 308 211 -4 331 92 158 11 -20 -40 36 -39 -92 -55 -123 53 -334 -95 -102 -191 -138 98 -120
2284a20k42M03j06P6k6j02J60j67J30K56k26J64k81J7K91N0l53J74k90K59N3n11
2306c91N90l53J66K34m93J54N3m1pm1J22J3j22J24j21O2JJ7J77P9k31O1n9K1O1
2331G6J97l18L9J4K14m66J03L35k20k05J38J17k74J58j09J3L1J63K00n05P4K98
2353G3P5r9RQ5J54k58N3J72l60J89N9J19k66l50M75k04rj79K22J56r1m2l68L56
2377b9j58J42K8l0K13r6j66J89j23J37j18L8K58j30j82J67J02j38L17k35k36K49
2399A99m18K07j1k00K25J50l67L52o1j31k56K04p6J59q0nJ26K57m84J68L80k18
2421A20j38j53J76J1KJ89Q4j68k18O7k3k1q0j51K78L0j00J53j96J31k6k74K93
2444a4k35J08Q5j17K14k27K57k49K78K01j30k00j0K40L0j30J07o3J3j94l1M3p3
$$ plain form
2284 -120 -362 41 -65 11 -15 -117 43 -124 6 262 36 200 -81 -64 227 277 -76 98 -192 67 120 -391
2306 -391 199 -154 12 246 -247 -93 -40 -81 -88 -129 -7 6 -116 8 -113 -51 -50 -33 144 223 -8 53 -6 15 76
2331 76 273 -45 -6 8 222 -244 -141 194 -26 -231 -93 24 -250 -92 -201 -188 -157 6 206 -299 -225 73
2353 73 148 49 58 143 297 39 92 264 -96 93 152 271 5 -345 130 -74 -83 -262 -40 116 25 -17 -385 -29
2377 -29 -187 -45 -17 -47 166 70 -96 93 -30 107 -11 27 285 155 -27 140 242 104 421 186 -50 199
2399 199 -219 -12 -23 -223 2 152 -215 137 76 -55 -311 -107 -183 -24 -104 -109 17 274 -210 -42 338 120
2421 120 -18 -171 5 16 18 207 291 123 -95 -28 -51 -72 -152 -303 -25 5 -95 58 -138 -7 -33 -307 -14
2444 -14 -249 -141 -56 -173 41 -186 71 -178 100 301 171 -29 -39 201 231 101 208 145 158 -36 -67 -24 -97
2467i7J42k80J49J09k37O6J78p0o6j53J7L59k12L76k42PL22k68K71k81J0J22O0
2490B82N4m38n6K95lO5k62Q0jK5k14J08L8j12J05j78J72L40k18n4k7O7J15m25
2514b42L12q6J71J57l72P7L4K16j01J51Pj95j06J69j48J0l34K06J03j88m4J07
2536i6R4j57J22P7o3r3R1L06l32q8K87j82N1N5k29J2K61R0n0j9m1j80l3L32k15
2561@LJ11P8k59P4j90M4J4j10K34j96O0M0k8k98N87l40K82M4Nq4j8M4o8p1M69
2587D27l28l7R8k6j78O2j68J70J13k34L8k7j39O8K63k16J4j48j80K59K80k69M2
2610a16J97q7J85l25L30k43MJ95J07J52l21l11M38k39J00j75M00n10K7R6j14q5
2632b95L53j5k18K5k5l7j51K95L26k11J29k07n0K80m3j26Q0q9N0r6K48k04O0j83
$$ plain form
2467 -97 45 -235 -86 23 -214 -148 30 -40 -106 -259 -242 117 -95 281 39 46 368 100 371 90 100 222 282
2490 282 336 -102 -158 137 134 199 -63 17 16 41 -173 -65 -27 -139 -34 -212 -40 300 82 28 1 68 183 -242
2514 -242 70 -16 155 312 -60 17 51 267 166 317 324 129 23 192 44 54 -280 -74 29 -159 -203 -96
2536 -96 -2 -159 -37 40 -23 -116 -25 281 -51 -139 148 -34 17 72 -157 -145 116 206 156 137 96 -84 -117 215 0
2561 0 3 114 192 -67 7 -183 -139 -125 -235 -1 -197 -137 -97 -125 -423 164 -176 106 150 155 71 53 97 29 -42 427
2587 427 99 62 160 134 -44 18 -150 20 133 -101 -63 -90 -229 -161 102 -114 -100 -248 -428 -169 111 -158 -116
2610 -116 81 -6 179 -146 184 -59 -55 140 247 399 78 -233 205 -34 66 -109 291 -219 -192 -96 -210 -295
2632 -295 58 43 -175 -150 -175 -212 -363 -68 258 47 176 -31 -81 199 156 30 110 21 71 -25 223 19 79 -104
2656a04J76O6j45j20N3J68k11n5L1O2p6j07K4J22Q3n6o3L38k06J75j58J11Q6r7
2680I7j62J99n0r4j1K19o8j56J42k90j02K87o9k34K93J59l78j21J60J25J97l5
2702A08k66n7p7R7L69R1n06J91J56N3m2j34j3L4J59p3K14m5l68l7Ok0J07mj9R8
2728B2K27k26j47oJ55k58J33kK51k58K64q5J64l51L19k50K23j17K27j66j60l7
2750g8J60Q0r4O5l60K72Q2j20P7j46k76L20K2L7m31L98l48K05J07ol5J08L1j63
2774i3rR2J30j07r2L03k31j5L9ln1J20j63j9K26k38R1pk05q6K82J01j72K26j25
2799fM9q3J22K28k97J0mp7k1K33n7N7q7K06n6n1n3j63j01L02l20j51K68o9j43
2824b64K00M5O5k46J87K73m98L96m22K32k9RJ16l8rJ53J8j09%j34J59m4k7j45
$$ plain form
2656 -104 72 138 -7 -127 -74 94 -117 -172 -141 -79 -155 -262 -238 -116 -33 -89 -152 186 -20 155 -3 108 194 97
2680 97 -65 134 84 -10 -21 198 130 -26 116 -174 -276 11 -58 -292 1 160 -218 -339 -179 -54 143 108
2702 108 -158 -215 -292 -195 174 265 -241 -50 106 159 117 -17 -30 4 163 90 304 259 -109 -146 -140 -160 -53 -57 -76 22
2728 22 249 23 -124 -130 25 -233 -100 -102 149 -109 155 70 234 -117 202 -48 175 58 285 119 -41 -78
2750 -78 82 162 68 133 -227 45 127 7 84 -62 -338 -18 4 41 -390 8 -340 -135 -28 -34 -69 39 70 -93
2774 -93 -102 -10 120 13 -79 224 -7 -22 17 14 -37 83 -80 -99 127 -111 -20 -27 -232 -318 -36 65 -107 119 -6
2799 -6 43 -40 82 310 13 23 19 -58 -79 154 97 154 67 273 217 166 113 -50 -151 151 -169 -320 -52 -121 -264
2824 -264 -64 -19 46 -200 -13 260 -238 158 -264 -32 -61 -52 64 26 17 170 188 79 79 -55 104 60 33 -112
2848a12J82O5k58P7K05k68J21q5O7j7j28q6J60O0k16K15J09j33L9r8K21j65j83
2871b28K6J68K12k98J04J99o0l69L29O4q0J46m10O5K0K96n70L66j2j40l8J96J64
2894A50m18K80J95p6l4L6n5j39R5O9J09j12m8j76j02M9J51J78j59R5k44J02J36
2917H2j18m6n3J53m48M10r8K36p4k80L94J97k26l67k2P19m21K68l81K26k2j79
2939e0K25J68j21k09K09k01N4k57K87J16l27m8J20j87K11k5J11k59J91j86L49
2960A71k25j0L9O6j0pKR6j42j42J63Oj04P9n6k17J88J28qj33K67j88K8k0r6l72
2986d97J91L09j03R4k24J99j7j53J43J98k08K64k0j12p6J21N3N1j85L41k76oj50
3009f3O7k0J72j43j30L31k16j84N4r3Q8L23n87L31j91M06l32J43K02j10K25j29
$$ plain form
2848 -112 70 135 -123 -46 159 -109 12 -73 -6 -23 -151 -237 -77 -17 -233 -18 91 -42 -3 -101 120 -45 -228
2871 -228 -202 -34 178 -120 -16 183 123 -246 83 147 67 213 -197 -132 -112 184 -386 -20 -32 -172 -210 -14 150
2894 150 -268 12 207 131 97 133 78 -61 34 103 212 100 52 -124 -226 -177 -26 152 -7 88 -156 -54 82
2917 82 -36 -82 -135 18 -430 -20 -118 118 44 -236 158 355 129 -238 -260 459 38 306 -75 151 129 -50
2939 -50 175 343 222 13 222 21 75 -182 105 221 -106 -154 -34 -221 -10 -35 76 -183 8 -178 171
2960 171 -54 -64 -25 41 31 24 26 122 -20 -162 1 7 -97 -18 -74 -291 -103 25 17 -116 151 -37 -9 -29 -125 -497
2986 -497 -306 3 -100 -6 -230 -31 -48 -201 -58 140 -68 196 176 64 -12 109 162 213 28 369 93 87 -63
3009 -63 4 -16 156 13 -117 214 -2 -186 -132 -225 -137 186 -401 -70 -261 145 -187 -44 158 48 273 144
3031A44j34PK84p3l59K38jk34J36M4l3k6P1m42L79j16j39K95l92L34k4J13k84
3054b12R7P6j73L28k34Q7J47j8k49R8J35n8n5K53m3j62M4po7j60J83r9k11K86
3078a4j8o4J5J5j0O2K4P6k36R3N7L8l0J65J14l64J46j01M5j3j00L82r2j88lK09
3104B08j33j00j96K45J99j40r8O4j61P5J00j74O3m7L41j06m34K5p5N56m97L85
3126A00mj76K06j28K35k37m6J97n7j77J2J21P7n7k88L62j65j60K62k82K74j8l48
3149b97P5K52Jk36K90P7qj95J9j1q2L48k35n2J41N1J9Ro3J5l78L86p8m5j47J93
3175D9j93K71l59K80n7m23K18M00k32Q1j8r8LK4M44j95J4q9j73K09k08J33P0j93
3199d2J86k43J88K25l28pK02l70J53J44q3J9k15m8N7K41o5K96l66M4J6j3J50r1
$$ plain form
3031 144 10 17 301 228 -131 107 106 -128 8 52 19 -7 64 -378 1 -115 -254 41 -351 -17 -41 72 -212
3054 -212 -115 -39 -212 116 -118 -31 116 98 -151 -53 82 24 -31 222 179 17 61 54 -13 -173 10 -89 -300 -14
3078 -14 -32 -96 -81 -66 -76 -14 10 86 -150 -57 0 38 8 173 287 -77 69 -32 13 0 -100 282 190 2 -1 208
3104 208 75 -25 -221 24 223 83 -15 49 -112 -37 63 -111 -48 -95 246 140 -294 -269 -344 212 -285 100
3126 100 96 -80 126 -2 233 -4 -50 147 90 -87 -75 46 123 66 -222 140 -25 -185 77 -205 69 51 -297
3149 -297 -222 30 31 -205 85 162 154 -41 -22 -33 -115 233 -2 -54 87 138 157 166 103 118 -260 126 48 3 -144 49
3175 49 -144 127 -232 48 -9 -432 -214 186 -46 35 17 -81 -78 -54 390 195 209 120 -53 156 -52 81 151 -42
3199 -42 144 -99 89 314 -14 -21 181 -189 -36 108 25 44 -171 -219 -162 79 14 310 -56 -12 4 -9 141 50
3223E0j27j3K32M3p8k16K18k15L09j72L2r3p4R5K59r1j89k21J66J56k35OK48m63
3247c73M12J54P3k09k22J90J6M9J16j95J76j95j0J82j4q1k23M40n08J17K6L12
3269B33j32o0k17N9n9J90k6j63R9P0k2j27K35o9n5P4l74L82n1J9m9J00P4r4J20
3294A57K1l13K55k00PR6O5j94j3K10K43j54l33J77J84k71j97K48l9J28j43R2K00
3317B26l55L1J73J11l41K86J11k05nL26j76l36L21j88J29k12J96n9p8k5J8j12
3339a64K42k83L36Q1p00M60J02j26P2L8r6j82K48J29k28k0K10J96l08J13R6j46
3361G0R4j89Ol6k49K00j28J01o8j1L6J73k4k4K59o19J25N66j86j08J71j15J33
3384A77j00J41k05k17L97p6q9j92J33j8J01l28K75r2J40j16j9K02o7j03j61K87
$$ plain form
3223 50 -77 -90 142 185 107 -109 109 -106 203 31 63 -30 -104 -9 250 159 -30 -251 -85 71 -164 -158 90 -373
3247 -373 39 193 266 57 -165 25 41 90 206 11 187 -8 -18 164 150 69 -154 286 -222 -105 -79 233
3269 233 101 41 -176 -117 -176 14 -12 -175 -76 -6 -28 -155 80 11 -44 30 -344 38 -13 6 -43 57 131 37 157
3294 157 178 -135 120 -80 -73 23 88 -106 -119 91 334 180 -153 24 208 -63 -260 -12 -51 77 -66 26 226
3317 226 -129 -98 75 186 -155 131 242 37 32 358 182 -154 167 -21 108 -104 92 33 -45 -70 -52 -164
3339 -164 78 -205 131 212 -488 -28 74 -52 20 58 -38 -220 28 157 -71 -91 119 315 7 120 216 70
3361 70 164 -25 -19 -55 -304 -104 -232 -131 -199 -210 -174 -1 -25 -49 210 -409 -284 282 96 -12 159 44 177
3384 177 77 218 13 -204 193 117 28 -164 -31 -49 52 -276 -1 -93 47 -69 -88 114 47 -56 -217 70
3406G0M3k15j60M17k71J42j0N7K4O3q8j79K47J27l13n8K83r1k16J58J92k3j53
3429D6j1l6Q2Q9k13N6j16o4J4K23k7l1Oqk15K15J58m4l78J07L52j87P3M7r5P8
3455A21K7j94J26j08l8J28j21L16k47J9j29L0j9J14k3J1o7K40k8q4K7nn1J03q7
3480F1M6p0n4L1Q4J13L0k80J09K7k27J55j44L44m79J89R9O8p6l6N13l46l67m2
3504b52J30J26l23N06P4j98k31J5N74m56J25J47j84N4j30L79m14m5K95k77nK80
3526A90k82K76k10O1J28k78R6k91J70J75Kl43J21K02j6K29k41R1RRP3m7l8l6J00
3551A50k44J25J25l01L78j08k37J37j01J88k70j2J39q2J93m8k88J27l3K40j55
3572g7R2P8k65K87m44L44R5J00J8j61Q0k46Q2k27J69L6Jj96J16r1J91j00mN7m9
$$ plain form
3406 70 113 -102 -262 155 -116 26 16 73 97 160 72 -107 140 267 -46 -104 179 88 -128 30 222 199 46
3429 46 35 -1 81 170 -43 13 -103 -167 -153 70 43 12 18 10 -205 10 168 124 -254 -147 205 18 91 138 43 121
3455 121 148 -46 80 -28 -66 62 -59 257 10 29 -100 -70 -89 25 2 13 -54 186 158 74 101 96 45 148 61
3480 61 107 37 -17 14 98 211 241 -39 70 97 -130 25 -119 225 -254 -65 34 102 26 -10 503 157 -210 -252
3504 -252 -122 4 -319 187 261 63 -168 -153 421 -35 90 237 53 107 -23 356 -58 -103 192 -85 -90 190
3526 190 -92 184 -26 35 163 -115 -19 -310 -140 35 37 -306 -185 17 1 230 -11 80 89 98 171 124 86 50 150
3551 150 -94 31 156 -145 233 125 -112 25 -76 112 -158 -170 -31 -113 80 32 -256 -129 -162 78 -77
3572 -77 15 93 -172 115 -329 15 110 210 228 67 147 -99 -17 -244 -75 -39 -38 -234 -118 -209 -18 -118 -122 -65 -114
3597a14J26k52L91l74J24J25k05J23N3J37l01l4K8K77j48P8j62K22j95J37k3M
3619A7l8J65k17J29r1j32j8N9j06J07K71j46l08K45J27r9m0l5K12j01J19J41n22
3642b61L79m8j24J70JO1r1m6P9j4r0JJ03k42J56m1j82L61k43J63j96j79J22J26
3666c5l0O2O2l0m7k5R5K46k26J34j21K9l20J68q7n2L64r1J19l66J59j07J54p0
3690a5j0K2Q5q8p9j08K27r7j85K04J28j54q6K91k06K71k90J5J75m1qJ26j87j3
3714b3J49j36K78k53l30L86l3k15J92N3l24L4n4N2J89o9j49L16k61K14J07j14
3736IQ4L9J34j48q3q3K10m02J56J55r4J56l28L41j7j93j0J11p1o4Pn4L24r1m53
3761c65L72j01K41j1l54L02j72L16k10r6O6j20K13K0l4L4k87R4P9O0j12l8pQ4
$$ plain form
3597 -114 12 -240 151 -223 -99 26 -179 -56 -3 134 -167 -201 -173 104 -44 34 -128 94 -101 36 13 17
3619 17 -21 144 -73 56 -35 -167 -185 -126 -232 -125 146 0 -308 -63 64 -35 -75 -110 102 1 120 261 -261
3642 -261 118 70 -54 116 117 178 87 41 120 106 16 17 120 -122 34 -7 -189 172 -71 92 -104 -283 -161 -35
3666 -35 -65 -3 59 29 -18 -43 52 298 72 206 85 114 -206 -38 -125 -177 187 96 215 -151 8 -99 55 -15
3690 -15 -25 -3 82 -6 -85 -193 34 -63 -248 -44 84 -70 -156 135 -71 200 -90 -75 100 59 51 177 -10 -23
3714 -23 126 -10 268 15 -315 71 38 -177 15 68 -256 -222 -276 -224 -35 -104 -253 63 -198 16 123 9
3736 9 93 132 266 118 35 -48 162 -240 -84 71 -23 133 -195 146 129 -64 -74 37 -34 -98 -91 -145 179 88 -365
3761 -365 7 -94 147 136 -218 84 -88 228 18 -78 -12 -132 81 101 67 101 -186 -92 -13 47 -65 -103 -110 -26
3785b6j6L26m41R8j75p2K75l5L11k27j30J3K19j22l9KJ9L26m08L05k77L21k38
3808IM9n0Q7j25OJ43k10o8K12K09kj20k13J37o0j33R1j07j78K17O2K8J36J9l5
3833A04p1m8O9j47K86j24J49r0j43k24K93m5L8k85J49J89l86J25K48q8L9k34R3
3856a03J98j49KK3l5Q8K0QK07k14o6K07k03O1j33m5L62k01l4J36K97m68j63K01
3880dK00m0l78J80l6l0j49%J82p1J6R6j52J26j5O0J06j84M8K23l37K5K40N8j80
3905a6K16j84J62k58n0K18o5j97R0j21L39j37j47J53o8O8L0k6j59Q7R9k14Q9L65
3929B74k89J06j4O3j14m2J04O8j59k3K50k51K31j36J72l39N2J4K9R5K39k04k16
3952i0p7J41M0j39oJ79Q1j54j16K31m8j87J10KR6N8k88J92M4N4J1l2j68p5J57
$$ plain form
3785 -26 -42 284 -157 -59 -234 -306 -31 -66 245 18 -112 -99 120 -2 -41 -39 -20 306 -102 203 -74 247 9
3808 9 58 8 95 -30 -24 119 -91 -159 53 262 260 140 -73 64 4 -129 -38 -145 -323 -106 -44 -16 120 139 104
3833 104 33 -15 54 -93 193 69 218 128 -15 -239 54 9 47 -238 -89 100 -286 -161 87 -1 38 -196 -103
3856 -103 95 -54 -52 -29 -64 24 44 52 259 45 -21 186 -17 44 -89 -134 228 27 -7 129 426 -42 -205 -4
3880 -4 196 156 -222 -42 -78 -108 -257 -257 -75 -146 -130 -34 -186 -60 -75 -15 91 -93 -45 178 -159 -134 106 164 -16
3905 -16 200 16 178 -80 -130 88 23 -174 -84 -205 134 -3 -150 3 -65 3 33 7 -152 -65 34 -180 -91 274
3929 274 -15 91 77 140 26 -16 88 156 -3 -26 224 -27 204 68 240 -99 -47 -33 -4 91 330 126 -90
3952 -90 -167 -26 14 -125 -131 48 129 -25 -141 90 42 -145 -35 -33 63 121 -167 25 69 123 134 102 -66 -141 16
3977A6j47R8K18m0k28lJ70j38k82N49p7L1j13l09L97k74J04J4J93j87M0J9J53
4000B04l72J22L36l10J80Pj82k65J89Q3K71l12JP3j92O4J13O6j33k6P8m5K88j63
4024G5m51L28J84j47Jp3K52j78J30NLr6J57j40O1M8j35J85j11k25J40k05K13M7
4048F8R0j9j50k44J65N5J50j82l3O9N5L47m07L14j59n6k4q3J70q4k5O9k57K22
4072E1J89O5m51l4J86j52J00M6J02k28M85l77J30j53L59k74p0K0LK65j11K2o1
4095A12k6O4r1J32j57J65n2j44j71K53p1K9p9M9J07j61j00J97j38N6l6j64J28
4118i8J75K2j49N5j10L41k72J13J28k76K37j86j2P0l8j24P2p5K67j84P5oj79L37
4142A83o4O6l35R1j62L76j35j1k2j12j42M81k31O8j2J8p2j13K58n6l05l4J85j23
$$ plain form
3977 16 -131 -33 185 145 -83 -86 84 -54 -336 213 136 167 54 -255 142 -132 -28 -14 179 -8 32 51 204
4000 204 -168 -46 290 -20 160 167 -15 -280 -91 -8 263 -49 -48 25 -167 -103 10 76 -57 -83 -5 -50 238 75
4024 75 -376 -48 136 -11 -10 -83 169 -9 121 126 129 33 190 50 111 159 24 209 98 -127 13 -192 21 68
4048 68 158 139 -11 -255 -90 -35 115 -67 -100 -31 24 371 -36 278 119 63 39 -44 126 42 17 86 -171 51
4072 51 240 305 -146 -180 6 -146 -46 0 102 -126 359 -18 112 -41 318 44 -26 -6 -3 262 151 173 112
4095 112 86 150 59 191 34 199 147 3 -168 85 14 43 -36 13 120 -41 -141 56 -82 -26 -62 -226 -98
4118 -98 77 99 -50 5 -105 236 -36 77 205 -71 166 -20 -32 38 0 -124 -52 -127 140 -44 31 25 -154 183
4142 183 119 185 -150 -59 -221 155 20 9 -13 -125 -267 214 -17 51 39 57 -15 -128 130 74 -231 -265 -80 -203
4166b03K70n2J02n3J39m32L42j04N0r5J42k9J19k14J66k83M7J36j89K89P9j12
4188A15m1j47R3M7J59k24L7k4O9O3j97J00p2J42k41q6L51K0r7k7P6j80M1k45K76
4213HJ96k63OK14j92R3J1J3J96k16K9j47j5J79j81J99J7k40J20m8K79k26J83n5
4237A60l34J63n1j81M55r9j07k38L16N6j21j66K55%K85l09j70L24j41k8k59K31
4259D1K25j50k00j4N9O9k34L86m71K91n0k18Q0K22N0q9l20L10L18k35K23l02j52
4282a61R2J10j14L31j08O0q2L7k17K93j08j33J67l29L03m5n9p0k0K28N6l38K7
4305h0L6J9J01N0j52j64J78%j04K23j00K10l1j20Q7o9L9j74k0J85L8p3O2k47J16
4330A0J2J8J18k11M5Q3k81J69k17L51l24K00PrJ67j32K6k16K18r8l7K35J2Qj08
$$ plain form
4166 -203 67 15 117 64 203 -229 113 9 59 -36 106 77 196 -18 148 -135 -88 48 -141 148 227 115
4188 115 74 -73 20 67 226 2 39 15 84 147 -50 50 -22 120 -121 -207 144 164 67 40 116 -64 -23 -268 8
4213 8 204 -59 -53 161 -31 62 73 86 282 66 95 -52 -67 112 -69 130 147 -93 27 -21 258 32 215 160
4237 160 -174 -11 -62 -243 212 113 6 -232 84 140 19 -147 108 108 393 84 -86 238 97 69 -190 41
4259 41 266 116 -84 -98 -39 30 -204 182 -289 2 -48 -266 -186 36 86 -3 -323 -13 305 70 293 -9 -161
4282 -161 -69 41 -73 258 150 210 128 165 -52 241 133 0 167 -162 141 96 37 -33 -53 175 231 -107 -80
4305 -80 -44 -25 76 126 -26 -190 -12 -12 -116 107 7 217 186 66 153 84 123 -51 -71 114 152 79 141 -106 10
4330 10 22 40 158 -53 -8 75 -206 -37 -254 97 -227 -27 -20 -29 138 6 32 -184 34 -64 -101 134 146 154 46
4355D6m1k1J08p1K47m12J40J91j35o0k59J31P3M9N8j38L8P9J3k15J78J46k84M33
4379B94m79J74J85j93j37L05k99M09k21J37p9j92Q4N8j87J31k89J39m7J7L11r3
4401B8j33J75p5k7j45J36P4j4k33k49M49j87M29o60N42P4q8r6K76m18J87l63J47
4424a71K45j60O6j23J14Q1p7n4L2J47k33J52j1j67r0J21J71j26j9o4L12k5k17
4447i6J91K03m40Q7N3j0J46j48j6Jj2J84J69j95l75L35r8j4rJ99l88R4L74k65
4471c0Q4K11k13K6j68P9j34K21K1Q9j1J4j59K73k15k83M61l46j18J95p4j17K6
4494a68J43j1J29j93l6J98mJ49k95P6J28j55J06k34J48N5p3L50m05jK29l0p7m1
4518a2O6k01j37j48N1M83j16P4r3N3Q0j43k3n7L41o3l77L26J18j39j07k2j29L71
$$ plain form
4355 46 5 -16 92 21 268 -144 -4 187 52 -8 -267 -136 -63 -14 44 -94 -56 23 36 -179 -1 145 -139 294
4379 294 -185 -11 174 -19 -156 149 -150 259 38 175 96 -96 -12 46 -141 -10 -299 -160 -207 -190 121 28
4401 28 -105 70 -5 -32 -177 -41 33 19 -214 -463 -14 -201 228 -432 110 184 96 0 276 -142 45 -318 -171
4424 -171 74 -86 -20 -143 -29 52 -25 -79 -47 100 -133 19 8 -159 -249 -128 43 -83 -102 -166 146 121 -96
4447 -96 95 298 -142 -55 -2 -12 134 -14 -30 -29 -41 143 312 117 -258 77 -21 -35 -44 155 -233 -139 235 -30
4471 -30 54 265 52 78 -90 -11 -145 76 97 186 175 189 30 303 88 -195 266 -80 -198 -3 -77 -194 -168
4494 -168 -25 -36 93 -100 -136 62 58 207 -88 -12 116 -39 67 -167 -19 36 -37 313 -92 -93 136 106 29 -12
4518 -12 54 -147 -284 -432 -381 102 -14 60 -33 20 100 -43 -66 -123 218 155 -222 104 222 83 -24 -46 -175 196
4542A96l11M7j76L12K5j53p1L17j2k46pQ7q0J25j2k05J05k6j20K21P1j30r8K71
4566A30o3j0j12j51L21k4j96N70l90m3J81j52R4o0k3k95J64J96k45J04q4P9k6
4589c5MJ21j07n1j5p8K39J1m8P7j48r5Pm7J50o0Q2K13m15J70L27l55k75J99J90
4614F1M4k13j37K55l4OL5j47J83jl86K56K12l78L71j77qj39L05l08L91l06J03
4637a2j02K34l7j77J54j62J36j08K88J07l29J09J49j62j30QQ6l18K31j57L1J38
4659b3K7J11l04L06k19po4k7R0K27k04J73n3j01P1j09L15l7j04J42k69J15Q8k37
4683i3%J01K0j12J35k37NJ28j33J01O3j16o7K42j72N9n3%J28Q9j9mj3m9N0Q5o
4710A32j91q3K67k19R8J92J06l54n8J14l5k70M20j82o1P5k22O8J98j28K9J21K25
$$ plain form
4542 196 -115 -68 -244 68 93 -60 -131 186 174 -72 -79 8 -72 53 41 -164 -59 -85 -205 16 87 -43 -141 130
4566 130 67 57 -55 -206 115 91 -105 465 75 32 213 61 155 95 72 -223 -59 137 -108 -4 -88 -9 -35
4589 -35 -31 90 -17 -68 -83 -161 78 89 41 118 -30 -125 -118 -165 -15 -75 7 220 -195 -25 302 -53 -328 -129 61
4614 61 105 -108 -245 10 -24 -18 17 -130 53 52 -334 -78 134 -244 127 -50 -58 -197 108 -200 191 -115 -12
4637 -12 -114 120 83 -94 60 -102 34 -74 214 321 -8 101 250 88 -42 -34 52 -266 -35 -192 -161 -23
4659 -23 4 115 -189 117 -102 -109 -173 -200 -110 117 -87 86 33 -68 3 -106 209 172 68 210 -59 56 144 -93
4683 -93 -93 8 28 -84 51 -186 -181 -53 -186 -85 -22 -138 -205 37 -135 -76 -129 -129 -1 88 69 65 52 3 53 138 132
4710 132 -59 -142 125 -94 4 196 302 -52 -110 4 -31 -301 119 -63 -124 -49 -271 -203 -5 -133 -104 17 242
4733B42j89r8j80O5J43J93k51nJ44k6nR6q3J55j55j86J27l1J59J8k85K95l67K63
4757C9j86K35k11J01o4L1J38k10Q4K71m05J72J04KN8n3j9j02R1mK4j52k1K46J66
4782C35k81l40J07L6P6J12j11P9j38M2P8k03K57K42l43J60pl08K82L7j86n4L28
4805B00k52K5J48j34N1j31L91n10K68P4k11n7J23J92l63L67k17O4K5J88n37M48
4827A52J32m51K93l7n0M4J33k42K59p5j54J16l45R6L66j25Km18N04k21oK1J66
4850A60k06r1j5m2J30q5o9K91q4N6o0NLk54N57j63q0J22Q0L5j18K0J26l98J44
4875F4M6k20J26M2m6m0j64L02j89j5K3j87K35j20J31k12K07j20k63K13K85k13
4897a15m3K16RK51k45J7J82j10k66K65j55J4P5k50J54L8m8J20m53K99J5J14M7
$$ plain form
4733 242 53 -45 -225 -160 -17 176 -75 -80 64 38 33 129 46 201 46 -140 -13 -44 115 133 -152 143 -224 39
4757 39 -147 88 -123 -22 -86 -55 83 -127 -43 228 -177 -5 99 101 159 106 87 -15 76 72 96 -56 -77 169 335
4782 335 54 -286 -179 -143 -67 45 -66 13 -125 -83 -5 -208 49 291 -52 108 101 -207 75 112 -74 -128 200
4805 200 -52 -27 121 -13 38 -93 298 -212 56 130 -81 -138 -15 177 -186 181 -36 28 53 241 -296 152
4827 152 284 -167 126 89 39 83 216 -26 233 158 4 120 -225 -129 237 112 114 -304 200 -21 -27 -6 160
4850 160 -46 -137 -152 -194 -64 -149 -218 73 -11 45 -15 -10 -7 -261 296 133 53 175 255 290 172 192 318 -80 64
4875 64 110 -110 16 58 12 -28 -192 110 -79 -94 -71 -258 -23 -143 -12 -224 -17 -137 -400 -187 98 -115
4897 -115 -158 58 67 318 73 90 272 162 -104 161 6 20 95 -155 -1 37 -11 109 -344 -45 -30 84 131
4920A31k10Q7N0k17J05J54k05K94m26J67J42o1k17K00k22K91j21K89j77M9k20
4941a17j27K04n3j2O7J76j37m8L1j01R4Rl35K69j10J14J24j24O5PL3R2m1J50p5
4966A55l61N56k80j88J8L48k75O4r8j15L15m82K92k0k03K39J45k53J22j29J99
4987D9j00n3L5J96O3l15K83j04K10m53J44n3J28K55Pm64P2J55r9l3m1Q6j90K68
5011D6j64M2J43Ol6ko0k46K12K0j85J11j90L98m0J63m17K41Q7Q2l15J38p3J14
5035G5l6L21m91j68M5J1L48j92J30r4o8J85j3K4q8Nq8O3J13M5j67ml23L54J00
5060H7l8J73j05j11k12L14j17K16j87J01j11n3J62k68K08O1o8r4J76j81K4j83
5082b06k2J42l8J99pJ28Jj58N5K66m20K91p7N0j23m4J34k17K82l37p9Q9k1O2J80
$$ plain form
4920 131 -79 8 58 -159 -54 100 -105 189 -237 -70 72 11 -206 -6 -228 63 -58 231 54 103 -117
4941 -117 -244 -40 -93 -105 -38 138 1 -47 -16 -117 -23 -14 -349 -80 -190 -76 48 -76 -11 -4 29 121 80 230 155
4966 155 -206 350 70 -118 -100 248 -27 37 -61 -176 139 -343 -51 -71 -274 -35 110 -143 -21 -150 49
4987 49 -51 -104 -69 127 190 -125 158 54 264 -189 -45 -98 30 285 292 -172 -100 55 -44 -77 -118 -32 -222 46
5011 46 -118 -76 67 73 37 35 -25 -271 -59 -39 -224 -113 -303 95 55 218 -199 42 129 211 -104 34 -39 75
5035 75 39 360 -131 -299 -254 -243 105 -87 43 -51 -119 66 53 77 -11 -6 -94 -31 82 127 -40 -44 -367 -13 87
5060 87 49 222 117 6 -206 108 -9 207 20 121 10 -43 119 -149 59 120 52 -42 134 -47 -23 -206
5082 -206 -228 -86 -124 75 68 196 197 39 94 360 -60 231 154 204 81 37 171 -46 236 -101 -180 -91 -112 -50 130
5107A30j6o9j37q8J75j81K06mj16n9J58K9j3n6J20p5k5J56j81J97j49J05k97J66
5131b4K38j90p7P3r7J05j35M3N2K85l06Q5j56M4PJ24l33M35m14J47N8L6j48K14
5155F6p9JJ15q2J07mk11j58L17j26J31j48j7j58K87Pk83K10O4k79K27J03n9k16
5179a85J91K18nl96L42j21J5l36RM19j44l0J61k50K34N9j15Q0j69o3r5J76j12
5202a17j3J0J18k1J21l37P9Q6j14mJ86Qrj43K42k45R7k0K46M3k61lJ21k25J9K79
5228A43L5p5p6j71R5N5j30R7K9k52L90k79J56n3J58j08k22n6R4J7P7M7j18J9N1
5253g7lK89n05N13j06J8K7l78J33m0K61j50j4J75k86L21j08k19M02l45J61l3L9
5276G5k4k29J00J25k7N4m79L51L47k81j15n8J3k9J13R5j72j9OK65K6k99M4P2j04
$$ plain form
5107 130 114 45 -92 -180 -5 -186 20 16 -100 -159 -1 28 15 -41 79 4 -21 135 -46 151 2 107 -190 -24
5131 -24 214 24 -53 20 -77 28 -107 -64 -12 273 -33 52 -104 -60 -53 71 -262 173 -241 -94 -36 0 -148 66
5155 66 -13 -12 103 21 128 124 -87 -245 72 -54 77 -71 -88 -246 41 48 -235 -25 39 -240 -13 90 31 -185
5179 -185 6 224 219 -177 165 44 59 -277 -268 151 7 -23 138 -112 122 181 66 146 -23 -86 -181 -5 -117
5202 -117 -130 -120 -2 -23 98 -239 -160 -74 -188 -192 -6 2 -7 -150 92 -153 -56 -76 170 213 -48 -51 70 -155 -136 143
5228 143 178 103 27 -144 -49 6 -124 -27 2 -250 140 -139 17 -36 122 14 -208 -264 -170 -153 -76 -29 -147 -128 -77
5253 -77 -80 209 -296 217 111 129 156 -222 -89 -129 132 -18 -32 143 -143 178 70 -149 253 -92 69 36 75
5276 75 51 -178 -78 47 20 74 -405 -54 293 12 -103 -161 -148 -177 -64 31 -141 -160 -154 111 137 -162 -118 -46 -150
5301a50J04K6P2j87K2J57j08J05k4j57J10O0j65M31k77R1o8M2P7m63J64J75j30
5324i3KJ06K95j52m7k10p8J73j78L86m5l11J76j67r1L82N8r5j92o1L89l18j5P6
5348a0M8k40M36m34L69k12J34j13K19k59k94K09j32K89j7j21J22q8J90k11Q6N2
5370B3M4P2j68L3Q1J33j35l0j04J19o2J03k8J4k85L1K09Q7j42J56j38l20J45Q8
5394g4K00j77J4p9R6PJ4j3Q3J1l78K61j7J84k15j34J62N8j20K7R8L3P7k38LM18
5420C01m13J13J62j0J13l61K0L33m30L31m34N8r6L67j46o7J54P8n4r5L3q2L96
5443B71k81j0Q1nP9j37j4nj33K1J79j42J54Q5j57j82J35J22J42j38k7j34P8l8
5467e6j10M0P4R8K43l45K00m49N12k08J93m43L15J27j27J86j75J35j31j24nP2
$$ plain form
5301 -150 -46 -20 52 -135 -113 44 -64 41 17 -140 -30 30 -135 296 19 110 42 84 161 -302 -138 37 -93
5324 -93 -91 15 310 158 111 -99 -177 -4 -182 204 159 -152 24 -143 -234 148 206 111 -81 -142 247 -71 -86 -10
5348 -10 38 -202 234 -200 169 -43 91 -22 197 -62 -356 -147 -279 10 -7 -128 -6 -94 96 -115 -29 23
5370 23 67 139 -29 4 85 218 83 53 -51 68 6 109 81 95 -190 -159 50 137 -5 151 13 -307 -162 -74
5394 -74 126 -51 -37 -116 -20 -13 1 -12 71 82 -296 -35 -52 132 -83 -217 -55 3 -117 -90 8 41 118 -120 -117 301
5420 301 -112 1 163 153 266 -95 -75 258 -172 159 -275 -217 -313 54 -92 -159 -5 73 19 -76 -43 -125 271
5443 271 -10 -20 61 56 135 -2 -16 -21 -154 -133 46 -96 58 143 -14 -196 -61 61 203 65 38 -96 -18 -56
5467 -56 -166 -126 -52 46 289 -56 144 -305 207 -1 192 -251 64 191 64 250 75 210 79 -45 -50 22
5489B2j06J68m1M2l5p9k84K63n5j29Q8K19J15k03j09K31j30N6n8J34l1j52J58
5512H4Jo8Q4m9k19K18K5m7O0N8k46n9J90%j28J79N2j54m82M51J23j55J53l5M9
5537H5J57k46M8K54k14j95J1L6J60k25J59J5j1K8r9J82j25k1R9m09J27J93j11
5560a02j5K61jj38l59L48oJ19K3p2J09j64q8J99J67k32j83P8j95rm7K65L2Q2j84
5585a12KP0J02l2p7J5K8k31o1N7K11k07M31k77lJ30K42l78N2J7J98j68J07j65
5609d9m4J89l8k9m3O6m8j32o0N6Q2J99j42r0l8k3J13J39j27J19k05O2KJ40j0J50
5635B39l34L44k89O4M2j01nJ88k04J50j1n2j01N2J17j28O1N3m10M72k33Ro5k7
5659a69J15P2L16l22J8p7Q4j28J90n8J43l67R4L14j64j72o0J86K03k00K2J25l38
$$ plain form
5489 22 -84 84 43 85 50 -29 -313 -50 -105 -234 -146 73 188 -15 -124 107 -23 33 -25 109 78 -74 84
5512 84 85 17 101 52 -167 51 76 29 89 147 -99 -158 32 32 -96 83 135 -19 -501 -50 73 -82 71 36 85
5537 85 242 -4 44 298 84 -111 -100 -64 96 -129 30 45 34 62 -37 145 20 -1 98 -311 -184 9 -102
5560 -102 -117 144 143 5 -354 -6 -12 107 130 58 167 3 -85 114 281 49 -134 -56 -251 -260 -307 -42 -10 72 -112
5585 -112 -110 -40 62 30 -47 -32 -4 -235 -296 -239 -28 -235 196 -81 -84 46 288 -90 -38 -21 177 9 116 -49
5609 -49 -93 96 58 29 -14 52 4 -128 -188 -132 -50 149 7 -83 -121 -144 -31 108 -19 100 -105 -43 -41 99 89 239
5635 239 -95 249 -40 24 66 -35 -40 148 -56 94 83 31 -70 -18 99 -29 32 85 -325 147 -86 -77 -142 -169
5659 -169 -54 18 334 12 30 -47 37 -91 99 41 184 -183 -89 225 61 -111 -171 15 218 18 40 165 -173
5682a73J05n2J52p8J1K78l45O5J14J68l84J41J5J05r5Q3j64j85K75Q0N2j34J39
5705A73l00K00n7n5o7L10j84j43o7K13o3J10K18m69l0L35k23J67j00J92k26j9
5727h5n8J18K28k33k15K98k25J10K57l90Q3K24ol20L49j64PR6m5L8p4j99J74J12
5751H0Q3l00J39r2M1J50k81M76j29k25J68j05R0k31N2L96k15j35j41K38n9K64
5773B64l72J68K6q2O8j83P7o2j2j11J89M4l7P4j38J96j05j05R4lj22N3j16J95
5797@O3O3mj78K68j47PO8r2O5m4J8n6N3P3j27j10L25k95P5L4l27K46j25J5j9O9
5824h2pJ8R6p8jJ42j2j13o7j0J56N8O3J80j47l19J50Jo4J17J60l72K36j34k88
5849c17M83j77r0N5jJ00L4j36o0M25l23J0q9pK28j60N9J3o3n4J67J6q1K41k76
$$ plain form
5682 -173 -68 -120 32 -46 -35 243 -102 -37 77 245 -139 2 17 122 27 110 -54 -239 36 116 168 34 173
5705 173 -127 73 16 -39 -106 204 20 -123 -190 23 -40 70 288 -181 -211 124 -99 68 -32 160 -66 -85
5727 -85 -143 -25 203 -30 -245 53 -172 -62 195 -195 -112 112 106 -214 135 -29 -22 74 29 67 -7 -206 -32 80
5751 80 163 -137 2 -90 -49 101 -180 296 167 -58 110 5 95 -136 -84 312 97 -38 -179 59 0 264
5773 264 -108 60 86 4 72 -111 -34 -96 -108 -219 -30 14 -23 51 -87 109 4 -101 -7 -10 -132 -79 -195 0
5797 0 63 126 122 -56 212 65 72 140 48 113 69 87 31 84 157 30 -80 245 -50 25 59 -268 -22 -147 -132 -151 -82
5824 -82 -89 -71 25 -53 -54 88 76 -37 -104 -114 42 100 163 343 196 -123 27 28 -36 81 241 -131 105 -29 -317
5849 -317 166 -11 -101 -46 -47 53 87 -49 -109 316 -7 3 -86 -93 135 -25 34 47 -16 -70 97 113 32 273 -3
5874ck81J56L28k39J03k2J24p5k71m9K92j64r5J32K00kj33l2J44K4m6k64K46j08
5898c5l2J00j60K71j02j65j6L3K1R2j10r5K71k73m8L01k9N1P6j96j6J18k0q5j25
5923a73L8J19j48K86m5o1Q8j7O3k1k45L73k47r8j3K92k35N0J96m70M74l0k91J63
5947D8j28J30j69J31k5M4r8K4J32L6q9k81O9JN5K85j87rJ99j63J79n15L86L8k55
5972a62M09l97J71m4j37K67j71l1J38m3J44k24J83j67R0l08J28K38M1o5K58k89
5994B9J32k58J01J07l67M62j78J2K36k60l67L75k25J50Kj49L21j42%J8k09K04
6016fJ13j66Q3M6p7J7l5J68k38n8J39P2J73k29M1mj34J2j04J92j05Q6N7j9j73
6041a49R9m9K89Kk13j26N3kJ32M8Pm4N8k57J59R7%k71J80j00R8n7pRJ89j28q0
$$ plain form
5874 -3 -284 -128 200 -39 64 42 166 91 -180 -229 63 -101 -196 -64 136 134 1 -31 113 137 91 -173 73 -35
5898 -35 -67 33 -127 144 42 -123 -139 -106 -85 7 -103 -198 73 -200 -248 53 24 75 151 -45 -61 57 37 -48 -173
5923 -173 -135 -16 -164 122 77 16 104 87 150 129 -116 257 10 -88 -101 191 -44 6 202 -268 206 176 -115 48
5947 48 -80 50 -119 12 -13 31 -67 -43 89 125 36 -245 -176 -175 -120 165 -22 -31 168 5 184 -331 55 93 -162
5972 -162 247 -150 21 -23 -160 107 -64 -95 43 0 144 -80 103 -64 26 -282 -154 84 125 60 318 29
5994 29 161 -97 4 111 -256 206 28 40 276 16 -351 24 -201 -51 -49 -198 123 -19 -19 -1 -210 -6
6016 -6 107 -59 24 70 -7 10 -25 143 -95 -153 -14 58 231 2 43 39 -95 -83 -187 5 -100 -14 43 24 -149
6041 -149 -50 -99 190 192 -21 -147 -94 -96 36 84 91 47 105 -152 7 104 104 -167 13 -87 11 -46 -53 -44 145 17 -63
6068f3r0M01n1n37J43O3J24k92M34l45L96k78j52K34N5Q0j08N9j20J0J81j84J07
6091F7l17J56M2n7J34P2P8l09M7J56N4j84J30j19J11L5K95m87J71j46M1J40j08
6114Bp8J62j23k15K39R9N4j48r8j21L62j20J57l1j68j03J07R9Rj45r9K26P0k5
6138A12j24K7rk7j16K15j91P5K3N4m6N6Lk63J71J5K7J43r2M3M2k42K50j73J28
6163A01R5k47J0L7J26J89r8j5j20j16L1j57K35j29J25j3p9J46k22J39M3k42J72
6186A1j3J1L3L0l27K50K91l53M34l44r8J78J73l94J62k6k26K4K4J97j39K71J13
6209B82M8k45j6K7j96K2K3N3p0K21No7j6j43J5N6J2q9J74nKpK3m1R6j58jn9J74
6238A20k25J45J37k76n7J37O0K8r1K41m05L03Kk27J48k64K41j02K6Q5k06L26k31
$$ plain form
6068 -63 -153 248 197 -340 -197 -134 -10 -302 132 -213 183 -95 -247 -13 42 122 14 73 -47 -37 144 -40 67
6091 67 -250 -94 -52 -109 25 97 175 -134 -87 69 123 -61 69 -50 61 96 391 -96 75 -71 -30 110 2
6114 2 -76 86 -37 -252 -13 86 140 -8 -106 -227 135 15 172 141 -27 -130 -23 76 85 -60 -159 67 137 112
6138 112 -12 15 6 -21 -137 78 -113 -38 -15 39 -7 49 52 -211 -40 -25 2 145 53 96 138 -104 146 -27 101
6163 101 196 -51 -41 -4 122 311 213 198 78 -38 -7 -164 71 -58 67 54 -25 121 -101 38 81 -161 11
6186 11 -2 9 42 72 -255 -5 286 -67 367 23 -75 103 276 -118 44 18 -208 -184 -160 37 -102 169 282
6209 282 330 85 69 96 -100 -78 -55 -2 -72 149 154 87 71 -72 -57 -1 11 -78 96 91 93 86 109 68 164 6 5 -54 120
6238 120 -105 40 177 -99 -156 -19 41 69 -22 219 -186 117 119 -108 40 -224 17 -85 -59 26 -180 146 -85
6261h5J85k36J05O5O2q5m9K56l70K08O0J3j63ok23K63j09K51J84m53O0O9j59J52
6285eK74j92j25M37n40J50k0K97l24j10L18j9l26O8n7J47j56J66j92kJ26M6l7
6308g6K17k01J23NJ32j83P9J67m17J10n6Q6j72L42k71K15k74K38N1J9j94j95L75
6331A20j3k20K33k82J7NN0MJ41j1R6j49l4r6J15R3j4o2Q5M7j49Q5J01k18J52j79
6357h3Q2j42J70p2j0rK17j09j1j7r3N7j8o6K8J05j5j86L06q8lj59N2K81j09r5
6383A3j35KJ72J05l07K3R9j03K72j45K01l02K48k65O1J24o1J54l13J75j67J88
6405C9j50p5K60k07J71r0K17k79P9j54J78m0L4K54l40J40k91L66k62L20m19M13
6427A64k55Q4N0j09M8P9j64R5n3j11K96l69L74k01L9J12j08K87j59j1j2Ok10J96
$$ plain form
6261 -85 100 -136 -31 34 96 11 -38 218 -152 56 116 129 -34 -40 -263 0 -109 142 326 -127 -67 2 -157 -5
6285 -5 269 77 -48 389 -151 -1 -21 276 -48 -158 160 141 -185 -117 -174 -27 -183 -17 -209 -211 -85 -39 -76
6308 -76 141 -60 63 68 200 17 96 263 -154 -44 -100 -14 -186 156 -115 100 -174 64 115 134 -60 -255 120
6331 120 107 -113 120 -162 -145 -140 -90 -86 55 44 140 -9 -43 -139 -24 69 55 -7 78 125 -24 61 162 -56 96 -83
6357 -83 -1 -143 27 -45 -55 -64 153 44 33 16 -77 -20 -38 -104 -76 29 14 -172 134 46 43 -116 -64 217 108 13
6383 13 -122 -120 52 157 -150 -127 -28 -131 141 -4 197 -105 143 -122 -61 63 2 156 -157 18 -149 39
6405 39 -111 -186 74 -133 38 -52 165 -114 -35 -189 -11 -51 -17 237 -103 37 -254 112 -150 170 -249 164
6427 164 -91 -7 43 -66 -18 61 -103 -8 -61 -172 124 -245 129 -72 -33 79 -29 258 99 88 76 82 -128 68
6451F8m2K10l60J32k43K73L7Rk03K5K30n2q0nj61N4k9L38n6n3J28j94J33o5j06
6476a2L2N1l55M20j95J31k27K0J97j20R4j28j6J50j67J32N8r6P2J0m9l2K34m63
6500b59L65j16J3r6l8J65k56J53M13m72n4J10K80k61j71M64j93j06j31K05N3l21
6522b53K61Q8k14L36p9k80n7K40J07j75J49k41K62p7j87J88j29O0j1J88m14M26
6544A88l58J82n9q3J96Q1k27K75l11K84k12J22K6m18M15l07K25j21J7M8K37k3
6566A77k76P1Q4j20J78n4q9K04j65j37J57k75K57J1j23j43K64j7K36j52j84P6
6588b0M1j44L6k0K17j37J18k3J84k59j26J04j70N3J66O2N9j49K19k98J62J2k03
6611a16K77l36K03m5N1k49J35k85J80K94k26R3K12k46KJ52l76K82q3J74k32j60
$$ plain form
6451 68 26 236 -124 8 -235 38 75 84 -119 -94 136 84 4 -1 -162 -108 -137 201 145 92 220 26 159 94 -12
6476 -12 20 71 -284 136 -59 72 -155 -135 62 -58 36 -92 -108 42 -125 7 65 -31 41 51 2 -30 204 -259
6500 -259 106 -10 3 -93 -131 34 -222 -69 344 -128 -182 -72 208 -53 -224 240 47 -59 -190 15 68 -253
6522 -253 8 96 -118 218 139 -141 -198 42 149 -26 123 -118 144 67 -120 68 -61 -1 -12 176 -238 188
6544 188 -170 12 -47 -130 66 147 -80 195 -116 168 -44 78 104 -314 101 -206 19 -102 -85 -37 200 177
6566 177 -99 -28 56 -64 114 60 -29 175 10 -127 30 -245 12 23 -100 -243 21 4 240 88 -96 -20
6588 -20 21 -123 -87 -107 110 -27 91 68 252 -7 -133 -29 -199 -146 20 82 141 -8 211 -87 75 87 -116
6611 -116 161 -175 28 -17 34 -215 -80 -365 -185 109 -117 -24 188 -58 -56 96 -280 2 -81 93 -139 -299
6633b99L32p5o2L54j02l1j25pp3j70K9N2J47P1k51J13J7kl7K1J40N0k08K1L3l4
6659i6L5J52o5L14m32q8K08J91k03l02K3L51j04o4N6J08k15J45J78l48K31q8Q8
6682G5j22j99K98j33p0K01lj38p1K02j06J51j80j35K45K1k86N00m17jN02l10k40
6705b16K91J93j26j05l26L41R6r4j7O0j03L4J51k01L1m3M4R2j47j76K09p7J07
6728A8J76j64k3l98L29L3K41k77P2K5j2%l2J01q9J00J39k04k01K67j12l1J51j73
6752f4j26J26K31k68J3K58m1j64k6J64q8L6k29K58K13k51K49k23q0L3Nk02K34
6775E8m8P6j35j06Q2Q4R0j13J01j04J68L3l38J2J11l9J34JL8j25N4o3J59m8p2
6800A0J40p1j92J25K5J46n37N24J31l35J17p9K37l15j06R7L5J39j66K13j57J0
$$ plain form
6633 -299 33 -42 -104 250 148 117 -8 -15 -88 -258 -229 -177 -30 41 -210 -97 -80 -82 -119 -98 42 92 -116 -95 -62 -96
6659 -96 -61 91 26 340 -92 -180 28 219 16 -286 -263 88 -16 -80 -24 84 -131 14 192 -156 75 -13 75
6682 75 -47 -246 52 -81 -151 50 47 -91 -162 40 -66 85 -95 -230 15 36 -250 250 -167 -168 334 24 -216
6705 -216 75 268 142 37 -289 52 148 54 37 97 -6 28 179 -22 9 -34 10 102 -45 -221 -12 -89 18
6728 18 194 30 7 -391 -62 -29 212 -65 7 32 20 20 -12 89 0 100 239 35 -166 101 -11 -42 109 -64
6752 -64 -190 -64 167 -101 -88 170 129 -35 -61 103 15 51 -178 80 293 42 291 68 -12 21 26 -176 58
6775 58 10 86 -49 -155 -73 11 101 -12 89 -15 153 186 -152 -140 -29 -68 66 67 105 -20 34 -29 130 82 10
6800 10 150 79 -113 12 37 183 -354 170 301 -34 83 4 241 -74 -180 -83 -48 91 -75 138 -19 -9
6822iJ81k76j32L01j12L64m53Q5Q2j83K46L6Oj19K37j67k96L46k74O1Q2J46q2
6845G0k3l27K03j35P7K19r4j42L31P1n44M19p3j1n7K54k48j97J82r3J99m3N1j61
6869g2J88qj8k87K35k00J90m7P3L7p5j96k1K86l02K82l55R0L12l04k6L63k21M38
6893C62k93j61L36k23j31K08J02K2l25oO6mJ7K54l04K84l01K79k7k29J3pK83k08
6917Gl01K85r0j1p0K59L3j04j84J8n3K70P1q8l3j19J57j3q7M2J15j45M0J9q2j69
6943b33L36J00k24q0J49r9N5j84L30n5K7P1k91J67l64L84J26k48J99m34L39j46
6965g5n9K35n8p3J77k49J39l3K4K7k28O2J49Kr7j9K74l53O7j6K08o8R5l04J05
6990f8N1K81j93q6j87J21n4K36n7j93N11o54L22P7r2N2j05J35k96K28j36L46k36
$$ plain form
6822 -9 172 -104 -236 65 -47 317 -136 -51 31 -152 94 130 136 17 254 87 -209 137 -137 -76 6 152 70
6845 70 47 -280 -77 -212 -135 84 -10 -152 179 250 -294 125 52 41 -16 238 -10 -207 -25 -118 81 38 89 -72
6869 -72 116 108 90 -197 38 -162 28 -19 54 91 16 -180 -201 85 -217 65 -290 -200 112 -192 -218 145 -76 362
6893 362 69 -92 244 21 -110 98 200 222 -103 -109 -43 -47 -30 224 -80 204 -97 182 155 -74 -61 -68 215 7
6917 7 -294 -9 -99 -110 -180 79 112 8 -176 -158 -211 59 130 42 9 -110 47 34 -53 -11 104 -41 -1 18 -64 -233
6943 -233 103 203 -21 -101 48 -51 4 -180 150 95 122 193 -98 69 -295 89 215 -33 166 -268 71 -75
6965 -75 -134 101 43 -30 147 -102 37 4 28 55 -173 -111 38 40 -57 -76 198 -155 -88 -104 104 36 131 -173 -68
6990 -68 -17 264 71 -15 -202 -81 -135 101 44 -149 362 -292 30 107 15 67 -38 97 -199 29 -107 239 3
7013CM3j94J34k4n7N9q7K1O4J07j65K04k79J65J82j07K31m42k8J84k02L16k80
7036a52L16j30j93L78k60Q3NK0N5j58Oj54J87P7k0N9k06J06M9j82J69J23q2L1
7060A27n7j68J62M8k6r0pk01M94j80k8J1l17K84j4J0j01p8j1O9J90j1K2J5n5K7
7086A15k43J88o7q4O9k21M4L60j2P3m15L02l05M8J88O1P4l05N4K4j84K71rj40
7110a14k3J75n24N84l3P8K1k19J61j09n5L72k67K0Pj94o2J64Q1kM2n2j21p3K43
7135A00j15N5j47J85j4J65J18k43n7j00j00pJ36j1J73j08OO2J07k35L07m91L24
7158A10m03M30j0j83m1K0J00j04rR4q2L6j98L48k19j88J95Q9j05j22M42k77J98
7181A21k24K8M8J15j72m4j45J41J52j68N9M9j65K42k9J5l44L60l7l93L40o3L88
$$ plain form
7013 3 46 -148 -14 -38 -95 -36 -123 -102 -38 69 -96 108 -171 -6 176 69 300 -142 -170 14 -188 128 -152
7036 -152 164 34 -159 219 -41 42 47 67 122 -36 -30 -184 3 80 60 119 -87 19 68 -114 55 178 96 127
7060 127 70 -98 64 112 86 -4 -11 -212 282 102 74 85 -232 52 38 48 -53 -131 -142 -73 117 106 128 143 88 115
7086 115 -128 60 -7 -91 -22 -243 -199 161 149 222 -193 109 -196 -148 40 101 175 -130 -76 -52 -236 35 26 -114
7110 -114 -137 38 -486 98 65 143 164 -55 106 -3 -58 314 47 67 74 -120 -182 -18 63 61 103 51 -70 -143 100
7135 100 -15 40 -107 78 64 229 347 104 47 -53 -153 -160 -24 -35 138 30 36 98 205 -30 277 -214 110
7158 110 -293 137 127 -56 -97 -77 23 -81 -90 4 -78 -42 -240 108 -111 -299 -104 -15 -120 -242 200 -77 121
7181 121 -103 -75 -27 88 -84 -128 -273 -132 20 -148 -89 -40 -205 37 8 23 -321 39 2 -391 -51 -114 274
7204B74l35R7M7j16K53k70R1k20J37O6N7p2M8p9j31O6j6K11o5J44j80J42k61J72
7228F0j10M8j03j3J87K2k69K11k31J66pl73O24j75K2M0k01RK03j13n9O5k56L98
7252A45k28Pl9J82q7k10J81J7Q7k67L12j37nJ56P7k72J64j46K4n8r1K01j08M0
7276e5k83L21l3j2J5J72k4J29k08j38K55j71o2K46l32Q3K09j18kr2J36K7k30J92
7300B5RJ35j82R7j35L80k05k21J05r6J36l23K94k3K6j17O3K48j90K18k77K68k40
7323eO2j94K21J10j75o6J50k46M91l86r2K61p1j22QK14k27L33l46l6Q9r3K05j32
7347d7K05k12P0J63j63N1J41k81J5j07L11j34q5k60L06M4J37R6j89O9k70K9J23
7370A2J44j97k3O6J7J60j78J47k86J45k09K29J23j65Q0j22Q3Q1q1o8K3M8j38N7
$$ plain form
7204 274 -61 36 83 -33 220 -50 41 -179 -42 24 81 9 57 -22 -153 -87 -103 108 43 187 7 149 -112 60
7228 60 -50 -2 -105 -118 69 91 -178 33 -198 -32 -39 -412 212 37 59 99 -102 -93 110 -3 -62 3 -253 145
7252 145 -83 -76 -115 67 -20 -230 -49 -32 55 -212 100 -37 -42 114 191 -81 83 -63 -39 -97 -188 13 -95 -55
7276 -55 -338 -17 -50 -62 -47 125 101 230 22 -116 139 -32 -94 152 -180 -97 112 -6 -8 -100 36 63 -167 25
7300 25 34 169 -13 84 -51 329 124 -97 8 -88 48 -275 19 -4 22 -95 -32 216 26 244 -33 235 -5
7323 -5 57 -137 84 194 19 -47 103 -143 348 -38 -130 131 60 -62 -54 160 -67 266 -80 -116 -27 -120 85 -47
7347 -47 158 -54 16 179 16 67 208 -73 -58 -165 146 12 -73 -333 -27 17 154 250 61 130 -140 -111 12
7370 12 156 -41 -64 2 19 179 1 148 -138 7 -202 27 150 -15 65 -57 26 107 26 -42 -19 29 -109 -52
7394e2J11Nj68J11j21J62L3P6l65PJ38j9J10L90n13j6K03j06R2k41J79J63r1l1
7418E7j12O9lk84J57K33k5j59k5R2m8J83n19L39k64K64P7j09J65j71L08k49j18
7441a42J22LJ12J62m61J18l2N8M3P4J96k96PJ17k37K15j82L32k76J72l3QP1j84
7465c3j92J40J96r6J66k05j29K75j34J43k58J32M2q9K9q9o3J98o6K9J18j34O1
7488D1m9P4j91j5J00k19K92k8kK7j68J07n3K52%q9k96K84m73M13N3K64k10k02
7512h8K23k88J05q7P1J37l65M50j46k1j83M37k76k1J21J07j27m11L78n0q0K2J24
7535C2M4k35M8J05K5J2M3k62M16j93j16J29j59K53k20q5J71j28K35Jj64J40k15
7558a23J27n2P8oJ67L6m33J01J11J54j07j05nQ3k5R3j53L8jK21j11r3q7K75m39
$$ plain form
7394 -52 59 64 -104 7 -114 48 81 157 -208 -201 -63 -82 28 418 -95 -111 92 -14 78 -163 16 179 88 57
7418 57 -55 14 11 -273 -116 117 92 -67 -92 0 -48 135 -384 -45 -309 -45 32 -77 88 -83 225 -24 -142
7441 -142 -20 -17 95 257 -204 -86 -118 -60 -17 57 253 -43 -36 81 -156 59 -123 209 -67 105 72 80 151 -33
7465 -33 -225 -85 111 15 181 -24 -153 122 -12 131 -127 5 47 -42 -13 -102 -165 33 -33 -4 114 -20 41
7488 41 -8 66 -125 -140 -40 -259 33 5 3 30 -138 -31 -84 168 168 79 -217 67 -406 7 60 324 114 -88
7512 -88 135 -153 -48 -135 -64 73 -292 158 12 -9 -192 245 -31 -52 69 176 49 -362 16 -34 -114 -92 32
7535 32 76 -159 -111 -6 19 31 74 -188 228 35 -81 48 -111 142 -78 -163 8 -120 115 116 -48 92 -123
7558 -123 4 -48 30 24 191 227 -206 -105 6 160 53 -52 -57 26 1 94 -59 -21 -22 199 88 -5 -92 183 -256
7583b56J38J26j61p3K30J3K2J49r7M3k39J48N6p6O0j58J6M8o7K13j69m9n2J67
7607C2o9j72K16j54J00j97J92J0J08k59K57k59J64j24J91j35L0K86n68J89K80
7628A18k54J37j68R5N2oj08P2L1R6k5n1j70L65l44J48J25j8k11p3L74j93L21l70
7652e7J35j86Oj1J61j28r9p4L49m4j11K10p6j08K77l23k3J18K5Q9j39o2K00J8
7676A47j07J92j44l44L5J16J44K26l39l2j08L32j54J32q2j05Ol1k8J73n3J8j66
7699a72M71n10P9j23K45l1K3L3P2j36L98l57K52m20K96m61K53j06K90l1O0n2O5
7722A38p6j0j88L53k24j95K78k39L83j98J67k51K25n29M85m54M53k37K8M22j04
7743B27l32j70M00j36R9j01n5Q0K15k24K63n61M79l89J94J28j25J4M6j18J54o1
$$ plain form
7583 -256 -118 8 -153 -226 4 17 39 188 91 134 -105 43 99 23 83 -75 -59 -11 -78 135 -34 -83 -135 32
7607 32 -37 -209 7 -147 -47 -244 -52 -42 66 -193 64 -195 -31 -155 36 -99 -69 217 -351 -162 118
7628 118 -136 1 -167 -72 -20 -26 -134 -62 -31 65 40 -11 -181 184 -160 -12 113 95 -116 -189 185 -8 313 -57
7652 -57 78 -108 -102 -113 48 -80 -179 -253 96 52 -59 151 75 -33 244 -79 -102 16 41 130 -9 -71 129 147
7676 147 40 232 88 -256 -221 -105 39 265 -74 -106 -214 118 -36 96 14 -91 -85 -116 -144 29 -24 -6 -172
7699 -172 299 -211 -132 -255 -10 -41 -18 15 87 -49 349 -8 244 -176 120 -341 -88 -194 96 65 125 73 138
7722 138 62 52 -136 217 -7 -202 76 -163 220 22 189 -62 163 -366 119 -335 118 -119 -91 331 227
7743 227 -105 -275 125 -11 88 -13 -68 12 227 3 266 -295 184 -205 -11 117 -8 6 52 -66 88 27
7765B7m6j53J42K49j73k60K34o2J96k77K07p8k00P4N5J86m3j57K02o0j68N0J09
7788E4j38r8J04j72L54k08L36j28R9k33j01J36R3j26M8j01O5Q5%k7q5J09k52L74
7812A88l8k18J86Q2l87p8Q9L31j93P7r2K1M9L2k16J2O6O8O5k95J17K73j02P3j44
7837c4L7J57j78k2j04K14q2J9J70q8k68RK30l9J8k11m1M25j52Q8j91oK60m67J96
7862f0K0P3J9j04j42L20Q5j49K9K0j5J23l62J36j32J47l9N2R4j00k51K20P9O5
7886A28j55J47n64N15J02l49k5J91j22P3J89n64K98K10K51n46R8K64k76J08K5
7907bL8n4Q9M0p4j54J04P8k13J67m7L27l74J76k43K10Nj1K6q0r0jj08R9J30j67
7933a29J87N1j91L13P7l69n6K66l57K3J53J50o5N0j54K46l21j30M88m84J37K01
$$ plain form
7765 27 -19 -172 -30 219 46 -214 20 -42 154 -123 84 6 -194 -120 -65 121 78 -79 123 63 -105 -55 54
7788 54 -84 -182 -78 -250 104 -104 232 104 203 -30 -131 5 98 -28 20 -81 -16 69 69 42 -43 66 -186 188
7812 188 150 -68 118 200 -187 -265 -176 155 -38 39 -53 -32 17 49 -167 -155 -89 -21 44 -251 -134 139 37 110 -34
7837 -34 3 160 -18 -40 -144 70 -12 7 177 89 -179 -170 60 21 39 -172 -213 212 60 148 -43 -49 211 -256 -60
7862 -60 -40 33 52 -52 -194 126 211 62 91 111 96 219 -143 -7 -139 8 -31 21 115 15 -236 -16 63 128
7886 128 -27 120 -444 71 173 -176 -201 -10 -132 -59 130 -434 -136 74 325 -221 -123 141 -135 -27 -2
7907 -2 36 -18 71 111 37 -117 -13 65 -148 19 -28 299 -75 101 -142 68 73 62 88 8 -82 -83 -191 -92 38 -129
7933 -129 58 109 -82 231 308 -61 -117 149 -208 -185 -32 118 53 103 -51 195 -126 -256 232 -252 -115 86
7955H6l2j12l8l4j6J26K50k58K11j65l4J56k34J07m4J43K1p1j54Q9k8N9p0K01
7979A59l30J4J62n5O8J89j59m1Q7o9j61L03j81m4k2K72o6l1J05j90J46K7j91J8
8003A0J12j11qL5j3p7O2N1k11j12L66k63Q4M6M16m14r1PK92j79m3K99k35N8J91
8028B72J03m84L31k86L8L6M6j63K3j21P3J45n8L01l04j9M2J49j64O7M6o6K13l19
8052i9j5J60O8k30K07J33k42N9r1j9l5J09j33M92j39k17K4N1K30n52J60J04J72
8075A97j13l8k43K29J10j55m5N4QJ37n5k74LK47o4K37r7m1r7O5L5Lm3K1l70L17
8101B8j12J19j6k83L11K9J0l95N85k19r5L02m19mo0L10p1l9J80n8j07O7M6j01
8125Ho9NJ13j91L43J7k00p5K89j94l51K51j50K60j67K05j52Op4P8J58j73j20K73
$$ plain form
7955 86 54 -58 -96 -130 -146 -20 230 -28 183 18 -16 140 -94 13 -31 112 133 62 -92 -3 -31 28 -42 159
7979 159 -171 -157 5 -50 18 207 48 7 94 25 -136 167 -14 -58 -80 192 126 95 200 10 156 183 -8 10
8003 10 122 11 3 38 25 -52 10 61 -150 -262 104 -159 -75 -29 387 -27 -118 -111 181 2 -41 258 23 81 272
8028 272 375 -109 222 -64 -26 10 56 -107 -84 -205 -132 13 -45 256 -48 -67 -25 124 -40 27 73 7 220 -99
8052 -99 -114 46 114 -116 91 224 -18 41 -50 -69 -104 5 -128 364 225 8 32 83 313 -239 -79 25 197
8075 197 84 46 -197 32 142 -13 -58 -4 4 141 86 -188 -185 62 -2 235 138 97 0 65 100 103 60 81 -289 28
8101 28 -84 35 19 -264 47 76 86 -309 276 57 -38 264 -155 -159 -219 91 20 -19 161 103 -4 63 109 8
8125 8 -61 -56 57 -134 209 226 26 -49 240 46 -305 -54 -204 56 -111 94 -58 -52 -126 -48 110 -63 -183 90
8149I0j26m0J42L5j9l49K60k7o5J45j1k02J82K7o2j5p7J46OJ03l33J90pj89RJ04
8175h3P5K61l31K02k03j46J31J57r4k45N14k90J65k63K2L11
$$ plain form
8149 90 -36 -76 66 101 82 -267 -7 -34 -99 46 35 -167 15 42 -20 -35 -112 34 40 143 -190 0 -7 -196 -187 -83
8175 -83 -8 253 -78 124 -79 -225 -94 63 -31 -276 238 -52 113 -150 -128 183
8191A83
$$ Imaginary data points
##PAGE= N=2
##DATA TABLE= (X++(I..I)), XYDATA
0@%%%%%%%%%%%%%%Qj6J6j6J6j6K4l2L2m0M8n6O4p2Q8r9J10j26J42j61J83k05K31
37A23k61K91l23L57l96M39m85N36n92O54p20P93q73R60j058J167j287J424j580
56h31J755j959K199k482K825l251L793m511N508o990R417j4047K5840j08518k12540
71c03792L23390K22026k15435j91356J56975J23029j16674q2226Q2986M3712j2098
82C0537O530m8774r1064O3679J60553k7211j84587r281J46582J2175r6930J0335
94b7456O3747k3793m5467K0076N760j5311N6978L7127j05662p4424J09585J02478
106A03638p7672r1773N0998N5015m4929j9902M2526M773k1244O212j6379l7441
118d6178M2824Q1603m9159j09800M2957R9253m9208p3266P6166N8132j09878o1022
$$ plain form
0 0 0 0 0 0 0 0 0 0 0 0 0 0 0 0 8 -8 8 -8 8 -8 16 -16 16 -24 24 -32 32 -40 48 -51 59 -67 75 -86 97 -108 123
37 123 -138 153 -170 187 -209 230 -255 281 -311 343 -377 416 -457 503 -555 612 -675 749 -831
56 -831 924 -1035 1164 -1318 1507 -1744 2049 -2462 3046 -3944 5473 -8574 17266 -91252 -303792
71 -303792 19598 241624 26189 -165167 -8192 114837 -1837 -84063 -1077 42635 30537
82 30537 37067 -11707 -102771 -39092 121461 94250 -90337 -99618 46964 59139 -37791 -27456
94 -27456 36291 12498 -32969 -12893 -7133 -22444 34534 71661 -34001 -108425 1160 103638
106 103638 25966 -65807 -14809 40206 -4723 -24625 17901 22674 1430 7642 -8737 -46178
118 -46178 -3354 78249 29090 -80710 -37753 61500 12292 -60974 15192 73324 -36554 -97576
130i7576J29041N9946j27767l8288J23985J2702j30655Q4J40937P033j27934j4257
142f2749Q8437Q272m2803J0900J4344k8891j647L3669j8417l0025M7860K9501
154D8451p4406m0733P7806N0136o5919m2346N4019J7098n1399N895N3157j2315
166A9444m5629J2331K9090j9481q670L6850j102m6035K332L8219l285k1265J3914
179F713J0034l1197p479L8042J988l0907J1029J8852l1991j7816M9381K2798n9074
192a9627k2386O2135J0936o5190O88P3219j82p7617p217P0917J2981m9296q874
205a9513K6503K139j0724J690n6j893J6162L252l9090r790N3733J9455n4668k8130
219d0930M4962K5721l8249j5975L5111M808k9491m6J9545l796p433J5991L93l0829
$$ plain form
130 -97576 31465 91411 -36356 -74644 49341 62043 -68612 -68528 72409 79442 -48492 -62749
142 -62749 25688 33960 -8843 2057 16401 -12490 -14137 19532 1115 -28910 18950 48451
154 48451 -25955 -66688 11118 61254 -4665 -47011 7008 24106 -27293 -21398 31759 19444
166 19444 -26185 -13854 15236 -4245 -12915 23935 22833 -23202 -20870 17349 14064 -7201 6713
179 6713 16747 -14450 -21929 16113 18101 -12806 -1777 17075 -14916 -32732 16649 39447 -19627
192 -19627 -42013 20122 31058 -34132 -33444 39775 39593 -38024 -45241 25676 38657 -10639 -19513
205 -19513 6990 9129 -1595 95 39 -1854 14308 17560 -21530 -31320 22413 41868 -12800 -40930
219 -40930 4032 29753 -8496 -24471 10640 15448 -14043 -14089 5456 1660 -5773 10218 10611 -20218
233b0218Q77L9376L270l3686m707K3227K460j6056L198J1452o524l158N459j1683
247f713o142K3785J2737l1125k3105L0401K6209k8284k0624K6020J3219k5024
259h646j0853K3458J0078j7044l618R294n824k711J4253L250j5611m654J3784
272E156K287j2079N080J0531j0436r153R669N004r056M88J1988p668j9710J1690
286f209K2359j1611k0267R336J6903j0026j4685J2825J4412j1731j0482N859N448
299B131P13J534q31o860j197J1184N7j1827L991J1629p281j3536N375J5555m583
314F054j3693L881P219o850k036Q657L08q964j045Q736j385p171O531O617q131
329a272n625O034O367k654l425K975j407l785N248L588n671j694M094K0o658K57
$$ plain form
233 -20218 -19341 20035 23305 -10381 -15088 8139 10599 -5457 -2259 9193 2669 -489 4970 -6713
247 -6713 -12855 10930 23667 -7458 -30563 -162 26047 -2237 -22861 3159 16378 -8646
259 -8646 -19499 3959 14037 -3007 -6625 2669 -3155 -5866 8387 11637 -3974 -8628 5156
272 5156 7443 -4636 444 10975 539 -8614 1055 6059 -2997 -2509 9479 1811 -17899 -6209
286 -6209 16150 4539 -15728 -6392 10511 485 -14200 -1375 13037 1306 -9176 -3317 2131
299 2131 2844 4378 3547 -3313 -4510 6674 6731 -5096 -1105 10524 3243 -10293 -4918 10637 6054
314 6054 -7639 -3758 3461 -3389 -5425 3232 3540 -5424 -6469 2267 882 -6289 242 6859 -1272
329 -1272 -6897 -863 5504 2850 -575 2400 993 -2792 2456 6044 373 -1321 2773 2793 -3865 -3608
345c608J0072k018j0575R89P458j255m796J748M560m054m716M804L214k501N51
360a27P57j712j387L572L505l189l318L800J000l581N91L344M81l457k038K281
376E22m46k07L282k604n323J564N164J26n998r43O654j73n551p32M728M249j725
393B587o774p81O040N602k478q850P90R806P45q564l788Q211O801q154q706M780
409b733P876l33o336m559L326M594P03l912m477L338O149k252o405k14P410M049
425F224p023n814N385O408p19n526j614M256J778j818k16r84m93J552R10k034
441B72l224Q22N846l25p392k475N627N553l472o766J144M942J403j227l020j562
457c854L173N079Nr407k899J3877P699j4286j3121J0963J9317p017k2063J380
$$ plain form
345 -3608 6464 4446 -6129 -5140 2318 1063 -3733 -1985 2575 -1479 -6195 -1391 1823 -678 -127
360 -127 630 -1082 -2469 1103 4608 1419 -1899 1901 2901 -680 -89 3255 3736 279 -1759 522
376 522 76 -131 3151 547 -4776 -3212 1952 2078 -3920 -4863 1791 1618 -3933 -4665 63 4312 2587
393 2587 -4187 -4968 1072 6674 4196 -4654 -3864 5942 6687 -1877 -5665 2546 9347 1193 -7513 -2733
409 -2733 5143 4810 -1526 -6085 -2759 1835 2538 -1374 -5851 -2513 3636 1384 -5021 -5235 2175 6224
425 6224 -799 -6613 -1228 5180 4461 -1065 -2679 1577 3355 1537 1321 337 -156 1396 2306 272
441 272 -2952 -2130 3716 3391 -4001 -6476 -849 4704 1232 -5534 -4390 552 1955 728 -2292 -3854
457 -3854 -681 4398 4403 -5004 -7903 5974 13673 -613 -13734 -2771 16546 9529 -12534 -11154
471a1154K1549L172j8026q932J3269J1438q284j1281L11P855O911l162j1045l237
485a0616J0803J1796q609j7562N638K0647j41k0228n837J9478J1497j6471j3254
498a2859J0534J3138l842j1289r20P219J827k202j943l235J034N435J532p373
512b944n973Q003R737q416j0979O391J1676m220j0896M075J0923n769q730P959
526H37Q354r404q955J1208J1511j3361j3404J4076J4941j2456j7488R065J7339
539A2263n455j5916K226J0075L90m168k099j459P66O868L179j1904p641J5236
553B361J2505j3932j7192J0730K1858o436k1742J485J9349L903j4950p853R801
566a13R105m504p613k402M660N923n12p360m943N181J0039k364j4000o21J4089
$$ plain form
471 -11154 10395 13567 -4459 -13391 -122 11316 3032 -8249 -7938 -83 6828 3666 -7379 -10616
485 -10616 187 11983 3374 -14188 -8550 12097 11956 -8272 -14109 5369 16866 395 -12859
498 -12859 -2325 10813 6971 -4318 -5238 1981 3808 1606 -337 -3572 -2538 2897 4429 -2944
512 -2944 -8917 -914 8823 407 -10572 -4181 7495 3275 -7621 -3546 7377 1608 -7122 837
526 837 9191 -213 -9168 2040 13551 190 -13214 862 15803 3347 -14141 -5076 12263
539 12263 6808 -9108 -6882 3193 3583 -585 -2684 -4143 -3377 3491 6670 -5234 -12875 2361
553 2361 14866 934 -16258 -5528 16330 9894 -11848 -10363 8986 12889 -2061 -9914 -113
566 -113 8992 4488 -3125 -5527 -867 5056 4544 -2816 -7759 -2578 7461 5097 -8903 -9524 4565
581D565N270j3441r878J3761J1976j1047j1998Q409J2331o028j1235O378R119
594H182p146o826P873N313q280n559R310M930j0412m298Q750L185o536l323M025
609h12J788k580J900Q72n865N61Q885Nj0471j950J2329M787j2567o056J0942P679
625I447o646q912K931Q693J58n558m088J539O578J086o749m437L831P164j093
640C944q823k381Q010N479n056r122J833J1226K324j1282n019R275R404p895j0477
655h560O354J0225l225q434Q9O692J102m354p55O44J34J797m3l268j413L317K356
672B658l794l697M329K795l320j735J949J159r01l3J605j338j844L711R83k903
688c76j291L339J698l250j669K758J403k463l96O11N04o99n00L31o00q4O86n08
$$ plain form
581 4565 9835 -3606 -13484 277 12253 1206 -10792 -2383 9948 3920 -7315 -937 8182
594 8182 1036 -5790 2083 7396 -884 -6443 2867 7797 -2615 -6913 1837 5022 -1514 -4837 -812
609 -812 976 -1604 296 1168 -4697 -4136 4749 4754 -5717 -7667 4662 9449 -3118 -9174 1768 9447
625 9447 2801 -6111 -3180 5513 5671 113 -3975 -2436 4142 5228 -1521 -5958 -2127 5037 3944
640 3944 -4879 -7260 750 6229 1173 -7949 -6116 5110 7434 -3848 -8867 408 9812 1917 -8560
655 -8560 -2206 8019 4794 -3640 -3551 3141 4243 -111 -866 -222 -88 1709 1666 -1602 -3015 302 2658
672 2658 -1136 -4833 -504 2291 -1029 -2764 -815 344 -557 -590 1015 -323 -2167 1544 2527 -376
688 -376 -1667 1672 3370 120 -1549 1209 2612 149 -247 364 868 169 -331 0 -600 -684 2 -506
706e06r53R15p0n69K51N32J77j033Q18K082j985j348K629J152j960j221K038K087
724C036k545j686K598R13j948j252Q06J425r11j575N12L49K26l0j947J99K201
741C71mj926j031K222K493l063j304K767J028j274j189J297J676j303o32J189
757A317l47m93J87L27o33p89M05P59r81l85K18j73L29k18r43M5Q57P32o00j393
777a779J143J757q20j267N59J462K86j420J21J087m29K84J82p49K31K22Mp35j314
796a175J329R63j551q13M32L97K82j069R0L67J38R68p32j515J527J604p95j335
814h88J38K472K14k682L34K290k09j550l86Q47J067j164m64m07J10J338q25k098
832a863R87J180J68k255o21K483P43k347o3J914K99o08j072J128L04k50J053p01
$$ plain form
706 -506 -1459 -544 -614 -1183 -932 -400 -223 -1256 -438 1644 -341 -1689 940 2092 132 -1089 949 3036
724 3036 491 -1195 1403 2316 368 -884 -78 1347 436 -1139 -627 -278 -52 -82 -2029 -1830 371
741 371 367 -1559 -2590 -368 2125 -938 -2242 525 1553 279 -910 387 2063 760 128 1317
757 1317 970 477 664 991 358 -431 -26 733 -248 -633 -415 -588 -259 -477 -1420 -1375 -518 214 -386 -1779
777 -1779 -636 1121 301 -966 -407 1055 1341 -79 42 1129 700 984 1166 417 648 870 874 139 -1175
796 -1175 154 1117 -434 -1247 -815 -418 -136 -1205 -1115 -748 -610 358 -374 -1889 -362 1242 447 -888
814 -888 -750 1722 1936 -746 -412 1878 1669 119 -267 580 1647 483 19 -388 -278 1060 235 -1863
832 -1863 -876 304 472 -1783 -2404 79 822 -1525 -1588 326 625 17 -1055 73 377 127 1180 479
850D79q41J270R37j000j107J55J879n48k077P68L96j21k59o38J33j23R4J113j736
869a226m39J735N62j516m28R40J145r09l07R71o31N0J467l09j418j62K270M54
887B249k680o60K597L32k246l23Q03M08l53l95j27j016Q50J735j695k188J439
904a270K745q44k871P35L018l81j865J78N06J024L46o52j023l9J937N36k779m33
922a132K781m35j997k92J514j38j620J389N57k789rL547m76l395k15M259K46m319
940b524O77L676j134j673J460J025j872l06L223j62m710Q93N573j393n324K43
956b328M776Q91n331o87L232M71j597n30m17M85J312N54j745j970K661K929k498
973B08k863J386L118M23k280j903J703K837J46l774j939M522K508m359l387L470
$$ plain form
850 479 -362 908 1845 845 -262 -107 1772 1224 -853 -85 311 190 -69 -707 -574 -697 -603 510 -1226
869 -1226 -1665 70 632 -884 -1312 -372 773 -136 -443 528 -103 -53 1414 1105 -313 -475 1795 2249
887 2249 -431 -1091 1506 1838 -408 -731 72 480 127 -268 -395 -1411 -561 1174 -521 -2709 -1270
904 -1270 1475 631 -2240 -1505 1513 1132 -733 -555 -49 975 1321 669 -354 -393 1544 2080 -699 -1132
922 -1132 1649 1214 -783 -1075 439 301 -1319 70 627 -2162 -2171 1376 900 -2495 -2710 1549 1795 -2524
940 -2524 -1847 1829 695 -978 482 1507 -365 -671 2552 2390 -2320 -1427 4146 2753 -2571 -2328
956 -2328 2448 3339 -1992 -2679 553 1024 -573 -1103 -1520 -1035 277 831 -914 -2884 -223 2706 208
973 208 -2655 -1269 1849 2272 -8 -1911 -208 2629 2775 -999 -2938 1584 4092 -267 -3654 -184
989a84L723l366l739L429K067l096m27K535j144k869K340L944m143m220N643L838
1005D331n423l363N244L841n339k548N711R41n488Q85M586j575m907K171N332
1020D399l072n584L267M785l269l946K109K993j773j837J421K34j042J230R50
1035H65j713q84K297J651k207j697J792J588j61j433j720J314L350j040m103q
1051b109M581J297n749j884N834J162m877j408M155L89l416J125K566l036j715
1066c085M834N85n248j7O243M05p206M94P325r77o355J404N548j593m903K428
1082a18L490l818j992M082O19m072l47M040n55m004J015L636k267k555K404J585
1098A143j965j059K350Q78k630M12K230j072j055J337M29r70K60J259j255j599
$$ plain form
989 -184 3539 173 -3566 -137 1930 -1166 -1593 942 -202 -3071 -731 3213 -930 -5150 493 4331
1005 4331 -1092 -4455 789 4630 -709 -3257 2454 3395 -2093 -1208 3378 1803 -3104 -933 4399
1020 4399 1327 -4257 -990 3795 526 -3420 -1311 1682 -91 -1928 -507 -273 -1315 -85 865
1035 865 -848 -1732 565 2216 9 -1688 104 1692 1531 98 -1622 -308 3042 2002 -2101 -2109
1051 -2109 2472 3769 -1980 -3864 1970 3132 -1745 -3153 1002 1391 -2025 -900 1666 -1370 -3085
1066 -3085 1749 2334 -2914 -2931 3312 3717 -3489 -2995 4330 3353 -3002 -1598 3950 2357 -2546 -118
1082 -118 3372 -446 -2438 1644 2263 -1809 -2156 1884 1329 -2675 -1660 1976 -291 -2846 -442 1143
1098 1143 -822 -1881 469 1347 -1283 -871 1359 287 -768 569 998 28 288 1547 292 -1307
1114a307K193J256l101p21L161L50l607n95L852j21l803J145K612k059j276K231
1130B10Q19k531k73L806p70l816J798L788k058l253K371L257k962k725L525J456
1146B642l640m34L358q10k899Q91K933k051k846L237J651l463r32L013O07l173
1162a916pL461p93k898J859K154j993j052K241P29k437K18K555j322k525K302
1178E76J886k691j309K390J208l174n63K908k47k770J021J609j363j393J978P55
1194H21k140l20K818p64k154J236K187j437j561J684J883k562q49K592Qk583Q66
1211b75K335j096k540J471K263k449j731K534O82k475j02J911k78k189J004K102
1227A167j702j240K270P97k017n46K348J56j880j74K603j079j741J643J087j805
$$ plain form
1114 -1307 886 2142 -959 -1680 1481 1831 -1776 -2371 1481 1360 -2443 -1298 1314 -745 -2021 210
1130 210 1029 -1502 -1775 2031 1261 -2555 -757 3031 973 -2280 91 3348 386 -2339 1186 2642
1146 2642 -998 -1432 1926 1116 -1783 -892 2041 -10 -2856 381 2032 -1431 -2363 650 1257 -1916
1162 -1916 -1923 1538 745 -2153 -294 1860 -133 -1185 1056 1785 -652 -434 2121 799 -1726 576
1178 576 2462 -229 -1538 852 2060 -1114 -1677 1231 984 -1786 -765 844 -519 -1912 66 821
1194 821 -1319 -1639 1179 415 -1739 -503 1684 247 -1314 370 2253 -309 -1158 1434 1442 -1141 -275
1211 -275 2060 964 -1576 -105 2158 -291 -2022 512 1194 -1281 -1383 528 250 -1939 -935 1167
1227 1167 -535 -1775 495 1292 -725 -1271 1077 1233 -647 -821 1782 703 -1038 605 1692 -113
1243a13p04J995J64k334K36K187r33j948J127J112j128j321J670P20j851J9K119
1260A017j101j308R97J569j199j060J487R04j811J46J337j07j405O56J404p02
1276H24j964J258J566k104q93J901l1j596MJ435k25j653J010J170j728j53J540
1293C61j57j258J39J968k70k156J299J568j279q78J277P26j120q10J477L27k013
1310g99M06J534j050j189Q81Q22j190p15J767L1j514m3J364m11p80L03J178o03
1328hr01J252M54q53j00R15k32m23j19J181n42j106R83N28j236P7L46K4p59J86
1348c33P30p57m31O61L85j043K29P04k0r95K35J366p43r07J241L51o15n27Q85
1367D16P55j148l45J164p6j232K76Q36k72p03P7P63o35n84P13r7o40J10N48j21
$$ plain form
1243 -113 -817 1178 1342 -992 -756 1431 498 -1450 -323 789 -339 -1660 10 730 -1121 -1102 1017
1260 1017 -84 -1392 -395 1174 -25 -1085 402 1306 -505 -359 978 871 -534 122 1526 824
1276 824 -1140 118 1684 -420 -1313 588 557 -1039 -1035 400 175 -1478 -468 702 -1026 -1179 361
1293 361 204 -1054 -915 1053 783 -1373 -74 1494 215 -663 614 1340 220 -590 887 1214 -799
1310 -799 -393 1141 91 -1098 -217 605 -585 -1300 467 498 -1016 -1059 305 -106 -886 -583 595 -8
1328 -8 -909 343 797 -56 -156 759 527 104 -15 1166 624 -482 501 1029 -207 -130 216 240 -519 -333
1348 -333 397 -360 -791 -130 255 -788 -559 145 125 -870 -635 731 -12 -919 322 673 58 -469 416
1367 416 1171 23 -322 842 766 -466 -190 646 374 -329 -252 511 -124 -708 5 -92 -732 -622 -74 -195
1387a95m92K05R76o64m79N40K04N6l8K8J92j65R4J93m27J86L27j80l82J44J19
1408B42r3p02M99K28l98p7L68l27l21q6O83m1q37O47M92m20l13K32O57O5q45M10
1430F3Q40m32l58K96J99m49m90Q20J04o71n0M90Jo34k39Q0O31m28m52J64K03j50
1452d62r4k5O31p4l48M69J15j39J67J65O4k87l43R10j04p92pP38r1n03m75O81
1474A96K39p47k26M10K42o09j78M60J7n62N44N24m74m11M66M97q5q38N49P28m61
1495B81n72M04O30m77n60M48O81q29k99L70M72o56n45R42Mp42k87Q67J03p94k40
1516g99R66K7p43j44P39J26n44K94N02j02l87M1R05l70p17P25K07q7n20j34L85
1537C70k40n42K81N1K89p46J28M53l41j07O4J79J46m25J47N38o45o9O49L65l20
$$ plain form
1387 -195 -687 -482 494 -170 -649 -109 95 151 113 141 333 168 262 455 28 214 541 361 -21 123 242
1408 242 149 -553 -54 174 -224 -301 67 -260 -581 -667 16 -25 -862 -215 277 -143 -456 -224 433 498 -347 63
1430 63 903 471 113 409 608 159 -331 489 593 -78 -128 362 363 -271 -510 -430 201 -227 -679 -515 -312 -462
1452 -462 -556 -581 50 -24 -372 97 212 73 240 405 469 182 -161 749 645 -147 -154 584 493 -10 -485 196
1474 196 435 -312 -538 -128 114 -495 -673 -213 -196 -758 -214 310 -164 -575 -109 388 303 -535 14 742 281
1495 281 -291 113 743 266 -294 154 835 6 -293 77 549 -107 -652 290 294 -448 -735 132 235 -559 -799
1516 -799 167 194 -549 -693 46 172 -372 -78 424 322 -65 -24 881 511 -206 519 726 639 119 -15 370
1537 370 130 -412 -131 -80 209 -537 -409 44 -297 -404 -340 -161 -15 -440 -293 245 -400 -469 180 545 225
1558B25l88L25P27o76j49R00m72l79k76M80J13k70n71K00L12o84J82M45K18p35
1578d73j48P38J5p97N28K59m54Q0K08M76l33k72O70K25n68j86M69%l07j19K71
1599B82J92o93K21L1p9o1l95M38J9m47O3K04p6J00k83K74N2k2J15p9L74k08J87
1622B09j38M43n59J06M95q3m20J78L02m7o11O6L34l85j05q8M64j29n04K78R2k64
1644c66p2J82L09k52m8j58N56k5j44M77k5j81j14p9L29n4m1K10l13j73J62l1p7
1667G2q1j33K32m69J86MJM8J01j32j41k1k08N22J91l80k4nM69K2k72J00K6K76
1691C84l1l32L37j4l18J9K60j19l07o0j05J57p1Q4N8k23l7R8N7L25p13M96K63
1714B08k56j06K17J00N6l17K23O7j78K29J22ok05j44J33Q5l6k17R8m1k99J78q0
$$ plain form
1558 225 -163 162 889 213 64 964 492 113 -163 317 430 160 -411 -211 101 -583 -401 44 262 -473
1578 -473 -621 117 132 -665 -137 122 -332 -252 -44 432 99 -173 497 722 154 -32 437 437 130 11 282
1599 282 474 -219 2 33 -46 -107 -502 -64 -45 -492 -429 -225 -301 -201 -484 -210 -158 -180 -65 -144 230 22 209
1622 209 71 514 -45 61 556 473 53 231 533 486 -125 -59 275 -110 -215 -303 161 32 -472 -194 -102 -366
1644 -366 -438 -256 53 -199 -247 -405 151 126 -18 459 434 253 139 60 389 335 294 504 191 18 180 149 72
1667 72 -9 -142 90 -379 -193 -189 -188 -140 -39 -171 -312 -333 -541 -19 172 -208 -232 -237 232 254 -18 82 108 384
1691 384 353 21 358 344 26 45 305 186 -121 -181 -286 -129 -200 -116 -58 -281 -318 -220 -163 162 -551 -55 208
1714 208 -48 -154 63 163 219 -98 125 192 14 243 365 359 154 10 143 228 192 -25 73 32 -267 -89 -169
1737a69L9p1r0J10j12J15m0n4J67k6L5K38l1OL00k23RO0j83M30l03N0j2j22N3
1762A76j80j28L6J36m22L19pk29l17J48J99k0M9J69o0j37K35J25j12J09p8J77
1784A88qK14j57k85K90j34N2K73k73n8K17k07m46J61L17k75j1r5K17Ol45L05k69
1807c23R6K59k13L04j19j41N06k49j3J34l16L47p6j67M1J07o0J16M3l21j8J44
1829H1j07k21J93O9j65m19L42J0r1J31r7K18L1k52M18j89KJ48q4m2L39l99L95
1852C11N9j50J72k69L8o6j94M10n09J92l00Q7O5L2pj96L39m2k94J97Q3N0k77L56
1876H7J28k19M7j06P7J39l5k2L03m35P3K50n2j20J39k5j94n6J83j80j90k52J80
1899b80J30q0m7M07j89L1k15K07Q1j32q1L40K03m92K95JJ34K6k63N5J53j58Ko1
$$ plain form
1737 -169 -130 -201 -291 -181 -293 -178 -218 -272 -105 -131 -96 142 111 117 417 194 203 263 80 510 207 257 245 123 176
1762 176 -4 -132 -96 40 -382 -63 -70 -299 -616 -468 -269 -289 -240 -71 -131 -268 -33 92 -20 89 11 188
1784 188 180 394 237 -48 242 108 160 433 160 102 319 112 -334 -173 144 -131 -142 -237 -20 -14 -359 -54 -323
1807 -323 -227 32 -181 123 4 -137 369 120 107 241 -75 272 196 29 70 177 117 233 276 -45 -63 81
1829 81 -26 -247 -54 15 -150 -569 -227 -217 -308 -177 -274 -56 -25 -277 141 -48 -46 102 18 -24 315 -84 311
1852 311 370 220 392 123 161 95 -99 311 -198 -6 -306 -219 -154 -122 -129 -325 14 -28 -322 -125 -42 8 -269 87
1876 87 215 -4 43 -63 14 153 118 96 399 -36 37 287 235 115 254 229 35 -21 162 -18 -208 -460 -280
1899 -280 -150 -230 -277 130 -59 -28 -243 -36 45 -87 -168 172 375 -117 178 179 313 339 76 131 284 126 128 67
1923F7r9J60m63M40k64Q4k34K66j36k64J65J37oj0j81K43K89m63P2j4N85j59l9
1946A76O2P9k85Q7K77l45L3j40J44R7l89K53k36L25j97j53L8J28l60J11n7K48
1968a04j76J84K55k26j35K76j9o6K02j81K30L2j08J3NJ79l29R1k3JL9k10J3J5
1992d2k68K99k41J44o3j0Q8N2k37J29J4kj77K55K22m9Nj07J38K60j52j93J05n
2016A65j05K42P0m05M3q8J89j29N0k79J80j62k7NJ13j28K60j52j7K0Q1J53m15
2039c36L80p0J35O6j65K50l01J36K71k61P6q5NM9J10l31R8k87K99Q0j96L5l8k95
2063c75K91j39l8J41J34p1n5J69L0l09K13K37q9Q2l9k31R0n5K39M2k35K00p6n5
2087A01l90L19p8n5j00K97j02m32M01q5N8J25K9k74J67j87Q3N0J99j73P6K79j21
$$ plain form
1923 67 -32 128 -335 105 -159 -75 -309 -43 -179 -443 -278 -141 -147 -157 -338 -95 194 -269 -197 -211 374 215 176
1946 176 238 317 32 119 396 51 84 -56 88 185 -204 49 -187 138 -59 -212 -174 -46 -406 -295 -352 -104
1968 -104 -280 -96 159 -67 -202 74 55 -11 191 10 240 272 164 177 182 361 32 123 100 101 140 -70 -57 -42
1992 -42 -310 -11 -252 -108 -171 -181 -93 -41 -278 -149 -135 -137 -314 -59 163 114 119 12 150 410 258 65 170 165
2016 165 60 302 372 -33 10 -78 111 -18 32 -247 -67 -229 -256 -251 -138 -266 -6 -158 -175 -155 -74 79 -336
2039 -336 44 -26 109 175 10 260 -41 95 366 105 181 96 101 150 260 -71 27 -260 39 119 -77 -42 -80 -375
2063 -375 -84 -223 -261 -120 14 -57 -112 57 87 -222 -9 228 139 221 182 -49 41 -14 225 267 32 232 156 101
2087 101 -289 30 -48 -103 -203 94 -8 -440 -39 -124 -66 59 88 -186 -19 -206 -123 -73 126 -47 29 308 187
2110A87j43K14p6l14L40J10j33j96N4l14n3R4K11o6j56J46R7k05j49M36l21K77
2132D0l00K51q4j29L89m5j00K4K78j81r0J5Q1K64m07K04k75N8J13j17R9j10Jk10
2156b31N5k64L41n3N9o6o2jK30k05J82J05l5rl00M53K36l84M1q9J65L40m46q2
2180b0P7J38l44J86j63r8J40k3p4j54O3M2J64M6j79N8K89j17j36M10k50Mj1K9
2204G7Q3j76J53J00j86j43J34Mk5Q8l47K95k9j82K70k80qK37r9l4o5J03j05o8
2228b03M8K93k78j06L38J66j56r3K15j24j78K07Np7K67k73MJ20l23OM77m20j43
2251b28J85j31K33k05J66k74K26j72M26k37jO1K94k95L9j71L39n8k63J1K55p8
2273A22N8j91M6J80k73J60J21l18j02R3L63k33R8J3k90N0L8l6p3K85r5K5n5n1
$$ plain form
2110 187 44 258 182 -132 208 318 185 -11 43 -271 -324 -230 -19 -85 -241 -95 2 -203 -352 84 -237 40
2132 40 -260 -9 -93 -222 167 122 22 46 324 143 53 68 149 413 6 210 -65 -7 106 -11 88 -22 -21 -231
2156 -231 -176 -440 -99 -152 -93 -159 -221 -222 8 -197 -15 90 55 46 -254 199 435 51 92 3 168 508 62 -20
2180 -20 57 195 -149 37 -126 -224 -84 -107 -181 -335 -272 -230 -66 -20 -199 -141 148 31 -105 305 55 59 48 77
2204 77 160 -16 137 237 51 -92 42 46 21 109 -238 57 28 -154 116 -164 -172 65 -34 -68 -133 -30 -135 -203
2228 -203 -155 138 -140 -246 92 258 102 9 224 100 -78 129 134 57 324 51 55 175 -148 -142 335 -85 -228
2251 -228 -43 -174 59 -146 20 -254 -28 -200 226 -11 -12 49 343 48 87 -84 255 197 -66 -55 200 122
2273 122 180 -11 35 215 -58 102 223 -95 -197 -104 259 26 124 137 -153 -103 -65 -101 -174 111 16 41 -14 -65
2297f5J22k0k89L35k63L37R9j31j45J7r1K78j58r0M4o4Q6l8l4Q1j40J27k63J23
2321a42K07j88k46M56o2k51N72k31J31j94O3q4J37N7j67O0K08m00J36Q2M7j52
2343C9j63p8J62J95l37J23q2j19O7K18j76J20J52J47l43J48j10n1K46k8K5j5r
2366A31j23J41r6k33M54K6k71K5j23M30k73j38k3P4k15J70l4j41K10j43J04j53
2388b01k06L24J14j51K63J74l94K67j52RL90k75j46L05m72M60j14j16j91J93P0
2409A51j58j07J19q9Pl5k45J22J04k19L74l51M40j89Q9jJ14Q3j68q4j9L05j49
2432I4j34P9j30K3NL06k85J7j85K67K58m33L61m99J50o1K78l46r0K60J10k04q
2455a67J62L0J80Ok1p2O0k00O4J20M9k48J44j0k72N4K18P8l19k63L09k7j45L8
$$ plain form
2297 -65 57 37 -252 83 -180 157 256 125 -20 -3 -94 184 26 -64 -20 -84 2 -36 -70 11 -129 -2 -265 -142
2321 -142 65 -123 -369 87 25 -226 346 115 246 52 115 31 168 225 58 118 326 -74 62 144 191 39
2343 39 -124 -202 -40 155 -182 -59 -141 -260 -193 25 -151 -31 121 268 -75 73 -37 -88 158 130 155 140 131
2366 131 8 149 53 -180 274 300 29 54 -69 361 88 -50 -73 1 -214 -44 -78 -219 -9 -152 -48 -201
2388 -201 -407 -83 31 -120 143 317 -77 190 38 47 437 162 16 321 -151 309 195 79 -112 81 151
2409 151 -7 -114 5 -84 -77 -112 -357 -235 -131 -350 24 -327 113 -76 13 12 126 209 41 -43 -62 243 94
2432 94 -40 39 -91 -68 -63 243 -42 -25 -210 57 315 -118 243 -256 -106 -167 111 -235 -325 -65 45 -159 -167
2455 -167 -5 25 205 211 190 118 178 -22 42 162 211 -37 107 97 -175 -121 97 175 -144 -407 -98 -125 -270 -232
2479b32j11J11L40k10k6J58j04p1K10q3K4J02J71k76L49j22K9j15J44j49p6J92
2501B55l20J40n1K6J9n0J3j04j54J51Rj72J0O1lj42K24n1k21J54L27o2kM6K12
2526C15j67l18L43qk08Q8p3j00L05K8l15P2pK11o1k63J63J7n8k10K36N8K12m48
2550a88J49J70m62M57l39K47J00r7J90j72pJ16p6j67K40j05j19R2K57j39j83O5
2572B9l3j31n9J17p8J97o8K52k66l7K18n3K30l83P0q2K20j48P2K94k46K3m2j58
2596f2Q8Q9j36Oo7L05l50l0q2K10o3k1j44K40M3r2J8O2p4J39p3K23m32J53K13
2621A63L63o26K18J18j47m8J10k1M9k7m1n0J3j10Rj95K55k26K45k62J00L21k80
2644f9J70m05K93j50L02k03K4J15j2K1r2K5J67j14j38ok9l31M29K82M0l47j62
$$ plain form
2479 -232 -343 -232 108 -102 -128 30 -74 -145 65 -18 6 108 279 3 352 230 259 144 288 139 63 255
2501 255 -65 75 24 50 69 19 32 -72 -226 -75 -66 -238 -228 -167 -170 -312 -88 -139 -360 -206 121 59 57 103 315
2526 315 148 -170 173 165 -43 45 -28 -128 177 205 -110 -38 -45 166 105 -158 5 22 -36 -246 -10 48 260 -188
2550 -188 -39 131 -331 126 -213 34 134 37 227 55 48 164 88 -79 161 56 -63 29 286 147 -36 29
2572 29 -4 -135 -194 -77 -155 42 -26 226 -40 -77 141 88 318 -65 5 -77 143 -5 67 361 115 138 96 -62
2596 -62 26 115 -21 -15 -82 223 -127 -157 -239 -29 -92 -113 -257 -17 26 -66 -48 14 -60 79 6 229 -203 -50 163
2621 163 526 -100 118 236 89 41 151 130 179 152 111 61 74 -36 -27 -222 33 -193 52 -210 -110 211 -69
2644 -69 101 -304 -11 -161 141 -62 -38 77 65 86 -6 19 186 72 -66 -72 -101 -432 -3 279 319 -28 -190
2667a90J84k28L20j48J2j32P9j89J90L0j56J94J34j2k87J51K09k55j0K08J27j33
2689I8j23L87j77j46N9l33L84N2l18P9J54j45l5j78L1J93L4l19L24j03m0J02J6
2712dj36O5N2K13k36j11M8K41n1m2K55l05Q2O4p0J37j82l32K9M46l60J59J40j53
2736e1j72K46j93J79p5o7j0LK1M4J96p2n7k31M05k25K6K48k7l20K61o5m0l63L31
2761hj38M24l70J41j51j28J06j07K33j7k54K88J18l00J25J84k34J46K6O6K8j14
2783F4j47K38j9p0n0J91j89rO6j07L34j20j69O7k12O9r9OL24n47K77k18O15l52
2807e7L6J16m6j30K32k77L73j38J6J07j76J37j51J67l58R1N1J29M8k93K01n3j08
2830h3L3N7Rj25K27j20K66k46j61JJ74l3O8J44o0j40j46L27j10J62n6j07l65K29
$$ plain form
2667 -190 -6 -234 86 -62 -50 -182 -103 -292 -102 -72 -228 -34 100 88 -199 -48 161 -94 -104 104 231 98
2689 98 -25 362 185 39 98 -235 149 201 -117 -38 116 -29 -64 -242 -211 -18 16 -303 21 -82 -122 -20 -4
2712 -4 -140 -75 -23 190 -46 -157 -109 132 81 39 294 -11 71 135 65 202 20 -312 -283 163 -197 -38 102 -51
2736 -51 -223 23 -170 9 -66 -133 -143 -140 -119 -75 121 49 -8 -239 166 -59 -33 215 188 -132 129 64 24 -339 -8
2761 -8 -146 278 -92 49 -102 -230 -124 -231 2 -15 -269 19 137 -163 -38 146 -88 58 84 150 178 64
2783 64 -83 155 136 66 16 207 18 9 75 -32 302 182 13 80 -132 -63 -162 -156 168 -379 -102 -320 295 -57
2807 -57 -21 95 49 -81 151 -126 247 109 125 232 56 193 42 209 -149 -58 -7 122 170 -123 78 25 -83
2830 -83 -50 7 16 -109 118 -2 264 18 -143 -142 32 -1 67 211 151 11 -135 192 82 244 188 81 -284 -55
2854e5k47J95K90j21N7j20J31k94m9M27j19j90k1Q9L0M2J56l63K85lo7k47K89
2877I5m5k02N54k34k74J16j04J98q7R9R6N0j92j05K09k28j39k05L18j73J05P2
2899g6M2k7k4P7j3j00J77j47J12K92k79R1j4M4j34r0K04j61k5j51K53j52k8J27
2923bl6r5P0j29k3L16m39L07j10o0J17Q0j49N3L03l04O7Q7j74K77J3k72R4K16
2947B07k27J91j30l5O5j04q7K29j79l22K53j19L17j80L02k5q7l08J47K68l67J82
2969iR9q0j68J96l60N67J8k30K43k17m2nK9J91l05qK90Q3l57n7m4PK02l70K54
2994g3J16j67N1o1J3J33l48J38K18k30n5J59K22k97L8K54J9k19O9J98k21k6n6
3017a25K30J63k80J33l41L10j08P8k13K26j26M1J6j20N6K33k01j68l8K71K01j89
$$ plain form
2854 -55 -302 -107 183 62 119 -1 130 -164 -213 214 95 -95 -116 -27 3 45 201 -162 123 120 53 -194 95
2877 95 50 -152 402 168 -106 10 -94 104 17 116 212 262 70 -35 174 -54 -193 -398 -80 -253 -148 -76
2899 -76 -34 -61 -85 -8 -21 -121 56 -91 21 313 34 125 111 155 21 -69 135 -26 -51 -202 51 -101 -129 -2
2923 -2 -38 -133 -63 -192 -215 101 -338 -31 -141 -201 -84 -4 -153 -100 203 -101 -34 53 -121 156 169 -103 -9 207
2947 207 -20 171 41 6 71 -33 -120 109 -70 -392 -139 -258 59 -121 181 156 69 -239 -92 176 -191 -9
2969 -9 90 10 -158 38 -322 245 263 33 276 59 17 12 41 232 -73 -81 209 292 -65 -122 -166 -159 43 -327 -73
2994 -73 43 -124 -73 -134 -121 12 -336 -198 20 -210 -265 -106 116 -181 -143 111 130 -89 -20 178 -43 -69 -125
3017 -125 105 268 -12 121 -220 90 -18 60 -153 73 -53 -12 4 -116 -60 173 -28 -196 -234 37 238 49
3039D9J90j11k15k2K06n4p3kK87l1o7l01LJ33k2l91K19N4j71K56K0n2L5P7k39
3064b22J69l3P1J25Qj86n4O2j5k9N6j35K43Ok27K53j47P8j6J06O7l79K82r9j06
3089a22J19l32J73Q2l0N1J51m7P3j72J74L0k41K23J55k30J63j71k8oj61J57K64
3112B75m20j8J69r9J16K43k25n5j19o6K02k98J82J96J14o7j24j30J80j39J31J47
3134A95P3j14R4l0j90P0J88k41M8j4k12J15K80o09L69J4j48K65j66l54J04K95
3156C2j82l6J94j05j07J08q5R9K83k33J19L7n8j84Q6M0K8j14J80j50O2P8k7l73
3180c08L15M9M6j16J52J05n06J05K46j5L6k53K75j14P0J75o2j44q6n6M9K34j8
3203A79j44l1J35j23J72l44J28j08K23j41J61p6j25j08N17m16K61m36P2N6K53
$$ plain form
3039 49 239 128 -87 -109 97 43 -30 -32 255 224 157 -144 -141 -8 -30 -421 -202 -148 -319 -63 -43 -95 -60 17 -222
3064 -222 -53 -86 -15 110 118 -68 -122 -60 -75 -104 -48 -183 60 66 -161 92 -55 23 7 113 180 -199 83 -16 -122
3089 -122 -3 -335 -162 -80 -110 -59 92 45 118 -54 120 150 -91 132 287 57 220 49 21 15 -146 11 275
3112 275 -145 -163 6 -93 23 266 41 -14 -133 -199 3 -295 -113 83 197 130 6 -124 56 -83 48 195
3134 195 268 154 248 218 28 98 286 45 93 79 -133 -18 262 -347 22 36 -112 153 -13 -367 -263 32
3156 32 -150 -186 8 -97 -204 -96 -181 -82 201 -32 87 124 66 -118 -32 8 36 -78 102 -48 14 92 65 -308
3180 -308 7 56 102 -14 138 243 -263 -158 88 73 109 -144 131 17 87 262 200 56 -30 -86 -37 197 179
3203 179 35 4 139 16 188 -156 -28 -136 87 -54 107 31 -94 -202 315 -101 160 -276 -204 -148 105
3224A05N5l55K18O4l1n3J31j99q2J85j01J37j12J04J28q8j7j35J17o1J81k04r6
3247a09M3L4o7J8R8L3j05j87K23J92k73k9R4k3jK97j56j01J79qMJ32k77k0k14
3272b23J57J43j00k11K14m9J00O2l38L84l64Q8Q6K33l37J17L9K27j95j34J76n6
3294A9J1j53L8Q7J67m8N9k74L9Kr2J93M3j38J41k4PK71m09Q5J93k22M7k34O3J74
3320D5k60M2K35K4j13J64K04m60j17L86L0j74J76j09J14l93K78P8k40j65L20L
3342F8l24K20J50k56r6J86J93k36j05K00j5m0L9o0n1K7J95p3J58k17L5K1L2k63
3366b12L68j20O9J36l87J70j4J13k88j0j25M37m3l74N5L10j41m6j00J81o4j92
3388b77R3L23j75q6M70j24k40J09MK12m72P8K97j86n9k31K21j42J54j59K78k69
$$ plain form
3224 105 160 -195 23 87 56 3 134 -65 -147 38 -63 74 -38 66 194 106 89 -46 71 10 191 -13 -109
3247 -109 -66 -32 -99 -81 17 50 -55 -242 -19 173 -100 -129 -35 -58 -59 238 82 -19 160 152 156 288 11 -9 -223
3272 -223 -66 77 -23 -234 -20 -69 31 93 -245 139 -225 -137 -51 182 -155 -38 1 228 33 -101 75 19
3294 19 30 -123 -85 2 169 121 180 -94 -55 -53 -145 48 91 -47 94 70 77 348 -61 24 217 -5 42 -192 -129 45
3320 45 -215 -173 62 86 -27 137 341 -119 -236 150 180 6 182 73 187 -206 72 150 -90 -255 65 68
3342 68 -256 -36 114 -142 -238 -52 141 -95 -200 0 -15 -55 -16 -76 -127 -100 95 22 180 -37 -2 19 51 -212
3366 -212 156 36 105 241 -146 24 10 123 -165 -175 -300 137 94 -280 -225 85 -56 -102 -202 -21 -85 -277
3388 -277 -184 139 -36 -122 348 224 -16 93 97 309 -163 -85 212 26 -33 -264 -43 -185 -31 -190 88 -181
3410a81K25k39K16j71L1L35k29j20J06k10J46J48o6J1L6j04J59J2nK49m92K12
3432F9J2J84Q8m90J61PL8j83K65l18K20k59M85l14J1K15k08K3J5j9N0j36jK36
3456A51j96j33L42M1jj12m3J90j89p2J14l07M50k42k35L08L07n07M3j44P0O4j60
3479b61K97Q1Jk19Q5R1J09j27J1M6l1o1k2j68K49o1R1Q6l40%J76K27k98j3J85
3504A34j8j74k02K72J35m5nq4k87L20j11L2R2j52J66L5j91K46o0J7J50l89J10
3527il4N5l6R5n8L2j05J91j27l7J09j39k4o4n4L14j10q7P5l8kJ67j96R6K1m6J00
3554H9j21K65j52j41J97j09L5j12K07o5k74j4K71o8j03J87Qk01J66pj41J6N5j31
3578a43L3J18k7R2p7j19K87k47J58J16k81j33L89j88o3R2r0K21Oj15R6k50J74
$$ plain form
3410 -181 44 -195 21 -150 -119 216 -13 -133 -27 -237 -91 57 -9 2 38 -66 93 105 100 349 -143 69
3432 69 81 265 353 -137 24 31 69 -114 151 -167 53 -206 279 -35 -24 191 -17 6 21 2 52 -84 -85 151
3456 151 -45 -178 164 205 204 92 49 239 50 -22 92 -215 235 -7 -242 66 373 -134 -91 -235 -165 -101 -261
3479 -261 36 117 118 -101 -16 75 184 57 68 114 83 22 0 -168 81 20 111 197 -143 -143 33 260 -38 -51 134
3504 134 116 -58 -260 12 147 102 97 13 -274 46 -65 -33 59 -93 73 108 -83 163 103 120 270 -119 -9
3527 -9 -43 12 -24 71 13 45 -60 131 4 -33 76 -63 -87 -151 -205 109 -1 -88 -13 -51 -53 114 -82 14 35 -11 89
3554 89 -32 233 81 -60 137 28 63 -49 158 93 -181 -195 76 8 -95 92 100 -101 65 58 -83 -67 -12 -143
3578 -143 -110 8 -19 73 -4 -123 164 -83 75 191 -90 -223 166 -22 -85 7 -83 138 144 29 125 -125 49
3601D9%no4Q1k27P2r8J18Q2P4j00J88j63j21J53%j9p8K52j15N5k03K17K8k44J9
3627d9r7J7J83k50L45Pk63k32L02J82r7Q8j57m0j03Q7K0m1J08k2j15L35l03L77
3651B82l16JJ77j09J91l77N18n33J44J36j89n5O9l8R3O7n8K9j36P7K5r2K35j62
3675b1j6P6j75M01l51j38M26j67N2L06n73M36j36j44rP3k3N4k86K46p5R5j13R
3699e3k13L68K1j42r1j29J50j34L28j6p1j36K04KL32m84J65j77L0J35M1j59J33
3722A04N6N2k53J11p4j0J77l65J76j66O1J12p5J05m3j04N3J47L4m32M04j53o9
3745a52L50m5m16M03j39J07K1LL2l28K58J7j34n9k0J3J14p5P0k96K24J31k53O7
3769a07K51l73K07J62j88J86j12M1O6K6k46J28L1o0K46k84j3J14Pp1L7J04l46
$$ plain form
3601 49 49 44 -20 61 -166 -94 -192 -74 8 82 -18 170 7 -114 39 39 20 -58 194 79 134 -69 148 176 -68 -49
3627 -49 -146 -129 54 -196 149 156 -107 -339 -37 145 48 136 -21 -61 -164 -77 -57 -98 10 -12 -127 208 -95 282
3651 282 -34 -33 144 35 226 -151 367 -166 -22 114 -75 -130 -61 -99 -6 61 3 32 -104 -27 -2 -94 141 -21
3675 -21 -37 39 -136 265 -86 -224 202 35 87 393 -180 256 120 -24 -33 40 17 71 -215 31 -44 51 -62 -53
3699 -53 -266 102 123 -19 -110 -239 -89 -223 105 89 18 -118 86 88 420 -64 101 -76 -46 89 130 -29 104
3722 104 160 212 -41 70 -4 -14 163 -202 -26 -192 -131 -19 -94 11 -32 -136 -83 64 98 -334 70 -83 -152
3745 -152 198 153 -263 140 1 108 129 132 164 -164 94 111 -23 -82 -102 -89 25 -50 20 -276 -52 79 -174 -107
3769 -107 144 -229 -22 140 -48 138 26 67 133 159 -87 41 72 12 258 -26 -39 75 82 11 48 152 -194
3792a94n6K02pL2l3j90K04R7r1Q9j00P4Rk02L35j64L36m63K40j4J20j24K22l50
3816b8M7L5J29j71m9o1K8N1K56m42M21l22J24j35J41J25k16R9j58J10Q0n6L3q3
3840d2P2Q5j30M8j3L7K43k97q6L42j09l10L34k42J11l2k17L29j16O6k05L8J13
3863A9l1Q1j66K65k01m6l0q3L71j52R1k8j83L4J66j83J42J37k07J37j26nPL12
3887C21m50J12P5R4k73L0J85l5J64l51J52q0mp9K24l31J20O6J44j03J65k71L60
3910B35k35O3J09j00K6kr9K77l33p9J12k71J60p3K9K58l9j34L2R5mp2p3J92R4
3935A68k50J27Oj33J85P4n5J10k02l13M24k7j42J11J80o0n53J41J51j3J26L6k8
3958F3j02L17l63J36K4l51J37L56o0l48j9K31J23j97K8J99k54J05J82k79K94m23
$$ plain form
3792 -194 -250 -48 -55 -23 -56 -246 -42 55 -36 53 -47 27 36 -166 169 5 341 -122 118 104 224 100 322 -28
3816 -28 19 54 183 12 -37 -98 -70 -19 237 -205 216 -106 18 -117 24 149 -67 32 -126 -16 64 8 41 -42
3840 -42 30 115 -15 33 20 57 300 3 -83 259 150 -160 174 -68 43 11 -206 123 7 73 -132 -94 19
3863 19 -12 69 -97 168 -33 -79 -109 -192 179 27 118 90 -93 -59 107 -76 66 203 -4 133 7 2 9 321
3887 321 -129 -17 58 152 -121 -91 94 59 223 -128 24 -56 -60 -139 85 -246 -126 -60 84 -19 146 -125 235
3910 235 0 63 172 72 98 96 -3 274 -59 -138 -26 -297 -137 -210 -181 77 38 -96 -64 31 27 -45 -118 74 168
3935 168 -82 45 51 -82 103 177 122 232 30 -283 141 114 -28 83 263 203 -350 -209 -58 -71 55 91 63
3958 63 -39 278 -85 51 75 -276 -139 217 157 -191 -210 21 144 -53 -25 174 -80 25 207 -72 222 -201
3980b01L85N8k55j90J57M8P5j14k61K82N3k03K10j16n5J29k54J39J75L0j74J83
4002A01m9j06J77k58J18J26J2p1l7K3J16j69J21j38P0k91K16M3O5m79L78R0j01
4025d3k55L58O9p8N8O0k80L2K30k14R4j98L44k58J60j68r7K52J21m7k62QJ78J07
4049A71o4m07N4M5K65j94M2J9RQ8k70L21n8qp2j5J16o8M4J62j15Mk09J98P5k75
4075a42J95j14k65M12k68L15L4j96p9j19J59K26qj96K93l00K01k72K00p4j42n2
4097a92N51m73M8K01j09l8j8L08j77j38P1k07K80k9K2j83K50O2l66K01J03j6k46
4120i5K41k61M3j19N05m55J72j77Q1NL3K49J01j70N8P7k85k4j4J95r9J98k38R4
4144A15j30j96J79K34k32P7l16J15J76pp6J48J80k48k3k20L48J3l37L21J86l24
$$ plain form
3980 -201 184 242 -13 -203 -46 2 77 -37 -298 -16 37 -166 44 -72 -127 2 -252 -113 62 92 -82 101
4002 101 52 -54 123 -135 -17 109 121 50 13 36 152 -17 104 -34 36 -255 -39 4 69 -410 -32 58 -43
4025 -43 -298 60 129 51 109 169 -111 -79 151 -63 31 -167 177 -81 79 -89 -186 66 187 140 -122 -114 64 171
4049 171 107 -300 -246 -201 64 -130 -88 -69 -60 28 -242 79 21 13 -59 -74 42 -26 18 180 65 69 -140 58 133 -142
4075 -142 53 -61 -326 86 -182 133 167 -29 -108 -227 -68 158 150 -46 247 -53 148 -124 76 2 -140 -192
4097 -192 359 -114 -66 135 26 -12 -30 278 101 -37 34 -173 107 78 100 -83 167 229 -137 64 167 151 -95
4120 -95 146 -115 -72 -191 314 -141 31 -146 -65 -60 -27 222 323 153 211 288 3 -21 -35 160 61 259 21 115
4144 115 -15 -211 -32 202 -30 47 -269 -154 22 15 -61 87 267 19 -4 -224 124 137 -200 121 307 -17
4166a7Oj10L52q9j87l5Q7R7KN2l29K14nk07L50k97k3j33K09k3K9k41R3J82K8j68
4192a63J49Jp5K31P2k2k04k21K37N5o2L19k37j31m4o4L5n2L32j29j83m5R2j26
4216b35K87o8j03P7j16m4L60j17m5m3p5Q7r5J51j68j40L56J69n0j83j00M6j45
4239a94J41J46L1k42L90k01j41p2K05Q1k22J16K3k27J98j85J45j45N9R5p1K5p3
4262a18K32J30j44J5O6j28K36m17o1O5K99j74o1j40O4K06l90L60n0J76q4k4j51
4285i3k8o8K23L0L3k47J65m8k03M15j03r0j03K70j92K41k63J60p7j54L74j64K19
4308B97j58k09J68j56N6J15n0j80J52k13O1P9J31k77j22J40L24k24o2J84J06j08
4330E4o8k2J0j01p1QK70k63P1O5o0J46j05K60l09R6J15j32n6OJ12K39k84q0n0
$$ plain form
4166 -17 -11 -121 231 142 -45 -80 7 104 106 158 -171 43 38 -169 181 -116 -139 -272 -63 -86 -57 -298 -205 -23 5 -163
4192 -163 -14 -13 -88 143 215 193 -11 -232 5 60 -2 317 80 -51 -95 -159 -124 -176 156 27 -156 -201 -109 -235
4216 -235 52 -16 -119 -42 -158 -202 158 41 -4 -47 -122 -35 -130 21 -147 -287 69 238 188 5 -95 -49 -194
4239 -194 -53 93 124 -118 272 71 -70 -142 63 144 -78 38 61 -166 32 -153 -8 -153 -94 1 -70 -45 -118
4262 -118 114 244 100 115 181 53 289 -128 -189 -124 175 1 -60 -200 -136 70 -320 40 -10 166 82 58 -93
4285 -93 -121 -189 34 64 97 -150 15 -33 -236 179 76 -14 -117 153 -39 202 -61 99 22 -132 242 78 297
4308 297 139 -70 98 -58 -2 113 63 -117 35 -178 -117 -38 93 -184 -306 -166 158 -66 -128 56 162 54
4330 54 -14 -36 -26 -127 -198 -190 80 -183 -112 -47 -107 39 -66 194 -115 -19 96 -36 -92 -86 26 265 -19 -99 -149
4355a49L22J06l42Q5J14j10N0l38N31o9o4j10l9j28J0R8K98l56J10J74l20J31
4377Do0o4Q5O3L2k9k17M77k27K4MJ39k72K35j33n4K30j72j30J12j34l7o0J85p6
4402g5n3J63J29Oj25m5j05L2j13J75J87k95K06j60J43J32j86J40k73J23j5k11
4424b20RK65J42J0q3p0j56L45k59J17j1J54n22R2J62N0r0J60k48M3J15j24Q4R
4448b6p5k9J15j7O3k06L3L12j42O0r7K67k42N3K2J25m36K82O3k13L36l79O8n9
4472a22K2o7J88n7L9k85K19oK14k54kJ39oJ14j18J82k11P2k00J97QoM4j25J42
4497A21k88L9K24K0p7j67J62p7j36K54j60K36l97L09k00M6K6j86K00J3M4Q0k5
4520F1k44M13k34J28M4J41l26J13j51K96m55J72J79k16K20k87J16j55K54p2q0
$$ plain form
4355 -149 173 279 -63 22 136 26 76 -262 269 200 136 26 -13 -141 -131 -33 265 -91 19 193 -127 4
4377 4 -56 -120 -35 28 60 31 -186 291 64 88 92 231 -41 194 61 7 237 65 -65 47 -87 -124 -184 1 -75
4402 -75 -128 35 164 170 45 0 -105 -73 -186 -11 176 -119 87 -73 70 202 16 156 -117 6 -9 -220
4424 -220 -211 54 196 206 123 53 -103 242 -17 100 89 243 -279 -187 -25 25 -65 95 -153 -110 5 -119 -35 -26
4448 -26 -101 -130 -15 -32 31 -175 -142 170 28 88 -9 258 16 69 91 216 -220 62 125 -88 248 -131 -63 -122
4472 -122 -100 -167 21 -36 3 -282 -63 -69 145 -109 -111 28 22 136 18 200 -11 61 -139 58 66 60 104 -21 121
4497 121 -167 -128 96 116 39 -128 34 -43 -179 75 -85 151 -246 63 -137 -91 -65 -251 -51 -38 6 86 61
4520 61 -183 230 -4 124 168 309 -17 96 -55 241 -214 -42 137 -79 141 -146 -30 -185 69 -3 -83
4541h3L4o0l7K85k67k36M44j71J22j24j6K01p2k21J26J56j10J42q1J95k52l2L9
4564a8P0n9N1o7j65P6j77N22r9j85J59k81K33r4n8rK53l20K12j28NJ80m4L4j27
4589c6L2Q7j2k13J35NMJ85l51M3L8J3O9j53J16j22Q4M0J87r3L4N8k0k55j53L57
4615G9k10k1J95O3J46k86j66L34j07n9M2J01k75P6q9l5J92l25K77MN7m5J94j73
4639c1oQ7k06M5J27j26L73k87R0m2k4M7K11l05J4J79j35j2J56m29J84rJ08J32
4663A41Kj47j14P6r6R5M2J11j69J78j64p6n9J93J31l04R6J36k6L5k05K33L6p5
4687G0o4j27J36L4k68J50l9J0J95r1n5j16R5j2L5l6j7J2O8n0K57k82k86K51J46
4712A6O8O9j08N9k28K40k30J57on0L1J8P9L8l8l51LJ97k16R4j5P7J17k25L38p4
$$ plain form
4541 -83 -49 -109 -146 139 -128 -364 80 -91 31 -93 -109 92 20 -201 -75 81 -29 113 32 227 -25 -57 -18
4564 -18 52 -7 44 -23 -188 -112 -289 233 134 -51 108 -173 60 -34 -92 -101 152 -168 44 -84 -79 101 57 91 -36
4589 -36 -4 83 71 -142 -7 -2 2 187 -164 -121 -83 -70 -1 -154 -38 -160 -76 -36 151 58 92 150 130 -125 -278 79
4615 79 -131 -152 43 106 252 -34 -200 134 27 -32 10 111 -164 -88 -177 -212 -20 -345 -68 -64 -7 -52 142 -31
4639 -31 -37 50 -156 -111 16 -110 263 -24 66 24 0 47 258 -47 -33 146 11 -1 155 -274 -90 -99 9 141
4663 141 143 -4 -118 -42 -138 -43 -1 110 -59 119 -45 -121 -180 13 144 -160 -64 72 46 81 -124 109 145 70
4687 70 6 -121 15 49 -219 -69 -108 -98 97 6 -49 -165 -70 -82 -47 -83 -100 -88 -20 -70 187 -95 -381 -130 16
4712 16 84 153 45 104 -124 116 -114 43 37 -13 18 36 115 153 115 -236 -233 -36 -252 -158 -173 -96 21 -204 134 60
4738F0j51J42j04k32K97J64j51L1L3JJ1j08r5K17J21n0j0j00j65J54L8k39K1J65
4762E0l70K21L17l08M1R2N0r8R5J59j92J46j84r8N8M9rk80J94j1l5J41J76m20
4786b16K93p8k7j39L77j87o7j87l3K07pk13J80R0k6o1Qp4O3J99k55J13r8M2j57
4811b53L71j66k4R1J29k50K01m5j19J87j31J21j38o0k00M66j92K5k22K07k60Q6
4833a76J27o0K03j54K77l89J19J95j02K40j78r6J27J04k37J53p4q6K41J4k39k31
4855b22J74rm8l1o0K14k4J43l19O1J50j30r2J64mj28K74j81K49m04QJ72k17N31
4879B71m13K73j14J0j7L2j20k3J66k1O9k05j09j16L23j04K95j10Lq8J41k25K97
4902B15k41M6K0L2k82K38j32M97n98K7J80J08j13KJJ4L9k42L99j75j77K37L5k51
$$ plain form
4738 60 -91 51 -53 -285 12 176 25 56 89 90 101 -7 -102 115 236 186 176 76 -89 65 103 -136 -115 50
4762 50 -320 -99 218 -90 -49 43 93 -5 90 249 57 203 19 -79 -21 28 19 -261 -67 -78 -113 28 204 -216
4786 -216 77 -1 -28 -167 210 23 -44 -231 -264 -57 -64 -277 -97 -7 -33 -94 -86 -160 -97 102 -153 -40 -138 -96 -253
4811 -253 118 -48 -72 19 148 -102 99 54 -65 122 -9 112 -26 -86 -286 180 -12 13 -209 -2 -262 -176
4833 -176 -49 -109 94 -60 217 -172 -53 142 40 280 102 6 133 237 0 153 79 -7 234 248 9 -222
4855 -222 -48 -57 -105 -136 -196 18 -6 137 -182 -121 29 -101 -193 -29 -33 -161 113 -68 181 -223 -215 -43 -260 271
4879 271 -142 131 17 27 10 42 -78 -101 65 44 113 -92 -201 -317 6 -98 197 87 90 2 143 -82 215
4902 215 -26 20 40 72 -210 28 -104 393 -205 -178 2 110 -3 -1 0 14 53 -189 210 35 -142 95 130 -121
4926a21p4N4M74l57L12j66k4j87l1K40l47L38j35K74l16K7L6Q6j18J1N8R4l8m3
4950D7j58K3J93j19K2j44J65J21j33j25k8K3M08m00J9k41M63k80K85r0P6j41J52
4973A38j31j37R7m2J09j41J20j25J74j87K69j27m1J98k74J06k05Q9j23K00o7J69
4995F9n5J11n5M5j0k07j72L87k07J83j15k3oJ06M0M8k11R0j04L22K50l22j44o2
5019d2Qo5Q4J75m5J2k80J61n1m9M5j5K22r3r1J04J5J5m2J90%l11L8j12Q2K28j95
5046a2o5o1O4n8M9k0J47P5n3j53O4j83l5Q4N5L42m81L04N9k25M20l01K00j62J09
5071A63k6j12k43M50n4j39j76K59j78j50K05l06K94r5N6Qq0J89l1L7k36J54j05
5094a16J10j02P1O5M0n9j10J27K02l33K2k5K78l47L22k24J69j61LJ94j60J99k23
$$ plain form
4926 -121 -195 -141 333 -24 288 122 98 -89 -120 120 -227 111 -24 250 -66 -39 -3 83 -35 -24 34 128 90 47
4950 47 -111 -88 105 -14 8 -136 29 150 17 -108 -136 -113 295 -105 -86 -327 136 -144 141 51 127 -14 138
4973 138 7 -130 -33 -75 34 -107 13 -112 62 -125 144 17 -24 174 -100 6 -199 -110 -233 -33 -100 69
4995 69 14 125 70 115 105 -102 -274 113 -94 89 -26 -49 -55 51 91 139 -72 18 -86 236 486 164 20 -42
5019 -42 -34 -99 -15 160 115 127 -153 8 -43 -92 -47 -62 160 67 -24 80 95 110 68 258 258 -53 -15 -127 -45 183 -12
5046 -12 -77 -138 -74 -132 -83 -103 44 119 66 -87 -23 -206 -241 -157 -102 240 -241 63 122 -103 317 16 216 54 163
5071 163 137 25 -218 232 178 39 -137 122 -56 -206 -1 -307 -13 -108 -52 -44 -124 65 34 71 -165 -11 -116
5094 -116 -6 -108 -37 28 68 9 -101 26 228 -105 -83 -108 170 -177 145 -79 90 -71 -68 126 -34 165 -58
5117e8O4k15R3P3J65k07j14M8L47k93rM9J04j93J72N9l05L52r0L5K60l29J94q7
5141A15j01k6J32J81j86J5m7j7j3M3lq1n2l6k9L30J5k35R6j03q1J90R8l58M68
5166C15P7k56j79J89k0j64J63j75L70l99K9QQ4k2k27J8n0Q7l3J57M7Q1k05K7J25
5191D7k10L73j71O0k42N6n5J79j2nj47Q2K68j64j1J8M2L9q7J16j92j72J30O9l79
5216c68K80J96k85N6M2J29N5O4l3Q9j55O8p5j09J56j15Q8K03m76K85j80K61k09
5239c3L50k97O2k06K31Lj65j3ro0J72m5j88K78j84n2K2m7K47j40O7j59L05k12
5263g3K55j53p6p8r2K50l78K45K5J97K43m49M5j84K38JM2j03m7J77pm0m4j76K94
5288A12k42M30k18j87K17j76J8J57J12k56J81m6k35K41j76j71K53m5P6j18n2K13
$$ plain form
5117 -58 6 -209 -116 -43 122 -85 -199 -151 196 -97 -106 -57 47 -146 26 85 -220 132 42 77 337 8 202 115
5141 115 14 -12 120 301 115 130 83 66 53 96 93 12 -40 -76 -105 225 240 5 101 -2 -83 107 205 -153 315
5166 315 392 136 -43 146 126 -38 125 -50 320 -79 -50 -42 42 20 -207 -189 -239 -152 -185 -28 19 100 -105 -78 47
5191 47 -163 210 39 99 -143 -87 -142 37 25 20 -127 -45 223 59 48 66 108 147 60 176 -16 -188 -58 11 -368
5216 -368 -88 108 -177 -121 -79 50 105 169 136 225 70 138 63 -46 110 -5 83 286 -190 95 -85 176 -33
5239 -33 317 20 82 -124 107 110 -55 -68 -77 -137 35 -10 -198 80 -104 -156 -134 -181 66 -74 -7 -166 139 -73
5263 -73 182 29 -47 -125 -217 33 -345 -100 -75 122 365 -84 -39 -223 15 16 58 -45 -92 85 78 38 -6 -182 112
5288 112 -130 300 82 -105 112 -64 -46 111 223 -33 148 102 -133 108 -68 -239 14 -31 45 -73 -125 88
5310H8L8P5l84P3M53l14j38k1j31L89k14K9j03K55o5m6j74K64p3J54p0k06P5q6
5334a32J87k33J69ro5l7j59J78k2J37l6J4K1O7q1K30o91M19J34R5k83r0K62j71
5358i6K29j73k8j43K75l4J18j38j12J38J41j75p0K3p8j5P8K2K68k64Q3k77K66
5381C8k73J43j18L16n3j34K70j65j58j1K00N5J29k98P8L5K12k64L8j28J44Q6k01
5404e9J38m36L28Q4l02O8J99K19j00m2M2j54J65k56j5J92J48j52L2J28k21j40
5426a34J01M11n69RL53j94Mk1J76k04J48r8M3k17K54k73K38L31l73k58l7M30p8
5449D2J25k26j98L18k9O5r7R6J12k89L60k61K09j94R9l59L08p2l9J02q3J58k17
5472g0k7J40J00p3j47K6J43j45p8K01k16J43m6J8J91j98oj33K20l7j26J07M2Q3
$$ plain form
5310 88 126 201 -183 -110 343 29 -109 -130 -261 128 -86 -57 -160 95 30 -16 -190 74 1 155 85 -121 -46 -132
5334 -132 55 -178 -9 -18 -83 -120 -279 -101 -123 14 -22 -8 13 80 -1 229 -462 -43 91 186 -97 -187 75 -96
5358 -96 133 -40 -68 -211 64 30 148 10 -102 36 177 2 -68 -45 -123 -138 -60 -38 230 -34 49 -228 38
5381 38 -235 -92 -210 106 53 -81 189 24 -134 -145 55 110 239 -59 19 54 266 2 40 -88 56 142 -59
5404 -59 79 -357 -29 55 -247 -179 20 239 139 97 139 -15 150 -106 -121 71 219 67 99 227 6 -134
5426 -134 -33 378 -191 -182 171 -23 -19 -40 136 -68 80 -18 25 -192 62 -211 27 358 -15 -273 -310 120 42
5449 42 167 -59 -257 61 32 97 0 96 208 -81 279 18 227 33 132 -227 81 9 -30 72 -11 147 -70
5472 -70 -97 43 143 70 -77 -51 92 -53 -131 70 -146 -3 -49 -31 160 -38 -44 -177 43 6 -120 -13 29 112
5496A12QR1k71J34m23L23J44k50J56P1K24p06L18P2N5K53l87O2P0n7Q0o4qJ33
5520A40k85k01N43j54J96q9r7J85l95J07k74N16j36k16J56Q3j80J38k38O6K18
5541H3k17J59j67J22K16j51r5M5j26L64k12n4J39O9q9p1K8J58k33q7N3l6n3K44
5565H9k70j8K57O7j04k59L84j63j67L2l7L73k55r4R1k7L25k8k78P1K72k70O5r6
5589d0K07j44or7P0pJ30j82K84j18j21J13K74l92j64J93j04K11J15O1k77K6J73
5612B05j08j8m9q6L15n0k93J50m8J02k51K40L3k99J62p4J31k65K06J65l74L33
5634A27k19O6P4j93K05j12J26M6q7j0L8j40J15j8O8j35p4K30n6J40j65j28J01
5657aJ34j55l03L83J67l9m68J95K15j22k8j26Q8j82K69k49O5k00N53p8j42j19
$$ plain form
5496 112 120 211 -60 74 -349 -26 118 -132 24 95 319 -387 -69 3 58 311 -76 -14 56 -1 79 15 7 140
5520 140 -145 -346 197 43 239 150 53 238 -157 -50 -324 192 56 -160 -4 79 -101 37 -201 -135 83
5541 83 -134 25 -142 -20 196 45 -50 -5 -131 233 21 -33 106 175 86 15 43 201 -32 -119 -66 -102 -155 89
5565 89 -181 -199 58 125 21 -238 146 -17 -184 -152 -189 184 -71 -165 -74 -101 224 196 -82 -11 261 -9 56 -40
5589 -40 167 23 17 -80 -10 -17 113 -69 215 97 -24 89 363 -29 -193 0 -104 107 222 283 6 32 205
5612 205 97 79 30 -56 259 209 -84 66 18 120 -131 109 142 -157 5 -69 62 -203 3 168 -206 127
5634 127 -92 -26 48 -145 60 -52 74 120 33 23 61 -79 36 18 86 -49 -123 107 51 191 26 -102 -1
5657 -1 133 -22 -325 58 225 186 -282 -87 128 6 -22 -148 -60 -242 27 -222 -157 -357 196 118 -24 -143
5679a43M4M9PP3R8R7M1k04q2J9j14M5J17j48J34j94K01j53J63N0m2j18j73L17
5703H4r1M1l5J75j15n8Q1k71K20K56j85R9k0k78l2J56j33k5K82Q0j84o0K23j11
5727I9r3m5l8OJ48l15j93K39L06l6O6k87J75k3k3J16l54K84k65K10j98K98j19
5750d2k3Q3K0K6J5J6j13j78J47J09j24M9j44J73q3KQ9J42j14R4l10K63Qk32K34
5775A07R4j80n6K2J87j49L1P6l6J9r0k5K18J0j65j2k02L76l13L6m8o2J96K48m31
5800a49K48M2J2ok00j00K47J17j6n8j1j26J06Pj14k57J71J58p1J02K44l03N2j01
5824fJ09M9p3k31L68l0l21R4j6k8J14k3j73J26KM2J1k58L57k64J84j02M4Q1j57
5849a01K27j45l4o4l0K06J9j02P5k39L20nk23J7J47m1L0M8j04j66qO8J81L1j49
$$ plain form
5679 -143 -99 -50 -43 30 128 225 266 62 -20 -1 -115 -70 47 -101 33 -161 40 -113 50 100 58 -60 -233 84
5703 84 -7 34 -1 174 59 1 82 -189 31 287 102 201 181 -97 -129 27 -106 -131 151 231 47 -13 210 99
5727 99 6 -39 -77 -71 77 -238 -431 -192 114 78 144 -143 32 9 -14 102 -252 32 -233 -23 -221 77 -42
5750 -42 -65 18 38 64 79 95 -18 -196 -49 60 -64 -15 -159 14 -69 -67 22 164 50 144 -166 97 105 -127 107
5775 107 201 21 -35 -13 174 25 56 132 96 115 25 0 218 228 63 51 -151 225 -88 -52 -100 -162 34 282 -149
5800 -149 99 141 153 147 -53 -153 94 211 195 137 126 0 106 113 -1 -258 -87 71 0 102 346 43 95 -6
5824 -6 103 152 79 -152 216 186 -135 -41 -57 -85 29 6 -167 -41 -39 3 14 -244 113 -151 33 -69 -25 56 -101
5849 -101 126 -19 -53 -117 -147 59 78 -24 51 -188 132 127 -96 -79 68 27 57 105 1 -165 -173 -105 76 107 -42
5874d2Rj22L75k87k4K79m57L60l3j7k32J93J42J32k88K87k8q5j62j95j04L53q9
5897c5K9j53O1K87k25R9N0J9J53k90j02K36J5l7m5J32j62j71J09j59J25o7J77
5920D6O9k50J32J54l43J23Rj9K7J49p2K05j2k26j14L30k98J45k37L66j31p6P3
5943E0Kpk18K78k5j19J82n8n4l4j46J78J02k46Q6q1P0J43O0j32nj35K20o9o5K0
5969ck08K73k19K36J27k54N4m4J8j14N1J36j64J33o6J52R1j75k10K06J2o6j01
5992a35k1K57J0j69L1J3j72Q8o6M09k61J7kj70K47k52K01L1m9J1n0K0K49m52K48
$$ plain form
5874 -42 -33 -155 220 -67 -91 188 -269 91 58 41 -191 2 144 276 -12 275 247 162 0 -195 -299 54 -35
5897 -35 -6 -159 -98 189 -36 63 113 132 285 -5 -107 129 144 107 62 194 32 -139 -30 -189 -64 -131 46
5920 46 115 -135 -3 151 -192 -69 -60 -79 -52 97 25 230 218 -8 -122 208 -90 55 -182 184 53 -23 50
5943 50 52 45 -173 105 80 -39 143 85 31 -3 -149 29 131 -115 -29 -110 -40 103 163 31 26 -109 111 42 -23 -3
5969 -3 -211 62 -157 79 206 -48 6 -38 -20 -134 -83 53 -111 22 -44 108 199 24 -186 20 32 -34 -135
5992 -135 -156 101 111 -58 -27 -14 -186 -98 -164 245 -16 1 -1 -171 76 -176 25 56 7 18 -32 -12 237 -215 33
$$ [...]
8191H4
##END NTUPLES=NMR FID
##END=
