##TITLE=1H_Pr 37-2H
 CDCl3
 8 sc, 
 20.10.2022
##JCAMPDX= 6.0         $$ Bruker NMR JCAMP-DX V2.0
##DATA TYPE= NMR FID
##DATA CLASS= NTUPLES
##ORIGIN= UXNMR, Bruker Analytische Messtechnik GmbH
##OWNER= root
$$ XWIN-NMR		Version 3.5
$$ Thu Oct 20 16:27:39 2022 Russian Standard Time (UT+4h)  she@DPX200
##.OBSERVE FREQUENCY= 200.1313499994
##.OBSERVE NUCLEUS= ^1H
##.DELAY= (6, 6)
##.ACQUISITION MODE= SIMULTANEOUS
##.ACQUISITION SCHEME= undefined
##.AVERAGES= 8
##.DIGITISER RES= 18
##SPECTROMETER/DATA SYSTEM= spect
##.PULSE SEQUENCE= zg30
##.SOLVENT NAME= CDCl3
##.SHIFT REFERENCE= (INTERNAL, CDCl3, 0, 15.7039)
##AUDIT TRAIL= $$ (NUMBER, WHEN, WHO, WHERE, WHAT)
$$ ##TITLE= Audit trail, XWIN-NMR		Version 3.5
$$ ##JCAMPDX= 5.01
$$ ##ORIGIN= Bruker BioSpin GmbH
$$ ##OWNER= she
$$ F:/spectra/data/she/nmr/H-F/1/audita.txt
$$ ##AUDIT TRAIL=  $$ (NUMBER, WHEN, WHO, WHERE, WHAT)
(   1,<2022-10-20 16:26:45.42 +0400>,<she>,<DPX200>,
      <created by zg, POWCHK disabled, PULCHK disabled
       configuration hash MD5:
       00 E9 B6 7A A2 85 ED C7 34 08 36 98 17 FE 4E 26
       data hash MD5: 16K
       31 A7 5D CB F1 BE 2C 6C 05 1B 7C D9 9C 70 B3 10>)
$$ ##END=
$$ 
$$ hash MD5
$$ 3F E5 43 BC CB 68 AE B6 3F AB 18 41 FC 91 1F AC
##$RELAX= 
##$RELAX= 
##$RELAX= 
##$RELAX= 
##$RELAX= 
##$RELAX= 
$$ Bruker specific parameters
$$ --------------------------
##$DU= <F:/spectra>
##$EXPNO= 1
##$NAME= <H-F>
##$PROCNO= 1
##$TYPE= <nmr>
##$USER= <she>
##$AMP= (0..31)
100 100 100 100 100 100 100 100 100 100 100 100 100 100 100 100 100 100 
100 100 100 100 100 100 100 100 100 100 100 100 100 100 
##$AQSEQ= 0
##$AQ_mod= 1
##$AUNM= <au_zg>
##$AUTOPOS= <>
##$BF1= 200.13
##$BF2= 200.13
##$BF3= 200.13
##$BF4= 200.13
##$BF5= 200.13
##$BF6= 200.13
##$BF7= 200.13
##$BF8= 200.13
##$BYTORDA= 1
##$CFDGTYP= 0
##$CFRGTYP= 5
##$CHEMSTR= <none>
##$CNST= (0..31)
1 1 145 1 1 1 1 1 1 1 1 1 1 1 1 1 1 1 1 1 1 1 1 1 1 1 1 1 1 1 1 1 
##$CPDPRG= <>
##$CPDPRG1= <>
##$CPDPRG2= <>
##$CPDPRG3= <>
##$CPDPRG4= <mlev>
##$CPDPRG5= <mlev>
##$CPDPRG6= <mlev>
##$CPDPRG7= <mlev>
##$CPDPRG8= <mlev>
##$CPDPRGB= <>
##$CPDPRGT= <>
##$D= (0..31)
0 1.2 0 0 0 0 0 0 0 0.06 0 0.03 0 0 0 0 0.0002 0 0 0 0 0 0 0 0 0 0 0 0 
0 0 0 
##$DATE= 1666268804
##$DBL= (0..7)
120 120 120 120 120 120 120 120 
##$DBP= (0..7)
150 150 150 150 150 150 150 150 
##$DBP07= 0
##$DBPNAM0= <>
##$DBPNAM1= <>
##$DBPNAM2= <>
##$DBPNAM3= <>
##$DBPNAM4= <>
##$DBPNAM5= <>
##$DBPNAM6= <>
##$DBPNAM7= <>
##$DBPOAL= (0..7)
0.5 0.5 0.5 0.5 0.5 0.5 0.5 0.5 
##$DBPOFFS= (0..7)
0 0 0 0 0 0 0 0 
##$DE= 6
##$DECBNUC= <off>
##$DECIM= 32
##$DECNUC= <off>
##$DECSTAT= 4
##$DIGMOD= 1
##$DIGTYP= 9
##$DL= (0..7)
0 120 120 120 120 120 120 120 
##$DP= (0..7)
150 150 150 150 150 150 150 150 
##$DP07= 0
##$DPNAME0= <>
##$DPNAME1= <>
##$DPNAME2= <>
##$DPNAME3= <>
##$DPNAME4= <>
##$DPNAME5= <>
##$DPNAME6= <>
##$DPNAME7= <>
##$DPOAL= (0..7)
0.5 0.5 0.5 0.5 0.5 0.5 0.5 0.5 
##$DPOFFS= (0..7)
0 0 0 0 0 0 0 0 
##$DQDMODE= 0
##$DR= 18
##$DS= 0
##$DSLIST= <SSSSSSSSSSSSSSS>
$$ [...]
##$SUBNAM2= <"">
##$SUBNAM3= <"">
##$SUBNAM4= <"">
##$SUBNAM5= <"">
##$SUBNAM6= <"">
##$SUBNAM7= <"">
##$SUBNAM8= <"">
##$SUBNAM9= <"">
##$SW= 18.0517283424941
##$SWIBOX= (0..15)
0 0 2 0 0 0 0 0 0 0 0 0 0 0 0 0 
##$SW_h= 3612.71676300578
##$TD= 16384
##$TD0= 1
##$TE= 0
##$TE2= 300
##$TE3= 300
##$TEG= 300
##$TL= (0..7)
0 120 120 120 120 120 120 120 
##$TP= (0..7)
150 150 150 150 150 150 150 150 
##$TP07= 0
##$TPNAME0= <>
##$TPNAME1= <>
##$TPNAME2= <>
##$TPNAME3= <>
##$TPNAME4= <>
##$TPNAME5= <>
##$TPNAME6= <>
##$TPNAME7= <>
##$TPOAL= (0..7)
0.5 0.5 0.5 0.5 0.5 0.5 0.5 0.5 
##$TPOFFS= (0..7)
0 0 0 0 0 0 0 0 
##$TUNHIN= 0
##$TUNHOUT= 0
##$TUNXOUT= 0
##$USERA1= <user>
##$USERA2= <user>
##$USERA3= <user>
##$USERA4= <user>
##$USERA5= <user>
##$V9= 5
##$VALIST= <valist>
##$VCLIST= <CCCCCCCCCCCCCCC>
##$VD= 0
##$VDLIST= <DDDDDDDDDDDDDDD>
##$VPLIST= <PPPPPPPPPPPPPPP>
##$VTLIST= <TTTTTTTTTTTTTTT>
##$WBST= 1024
##$WBSW= 4
##$XGAIN= (0..3)
0 0 0 0 
##$XL= 0
##$YL= 0
##$YMAX_a= 215399
##$YMIN_a= -255384
##$ZGOPTNS= <>
##$ZL1= 120
##$ZL2= 120
##$ZL3= 120
##$ZL4= 120
##$ABSF1= 10
##$ABSF2= 0
##$ABSG= 5
##$ABSL= 3
##$ALPHA= 0
##$AQORDER= 0
##$ASSFAC= 0
##$ASSFACI= 0
##$ASSFACX= 0
##$ASSWID= 0
##$AUNMP= <proc_1d>
##$AZFE= 0.1
##$AZFW= 0.1
##$BCFW= 1
##$BC_mod= 2
##$BYTORDP= 1
##$COROFFS= 0
##$CY= 11.3945322036743
##$DATMOD= 1
##$DC= 2
##$DFILT= <>
##$DTYPP= 0
##$F1P= 2.36226072786647
##$F2P= -0.459571619588291
##$FCOR= 0.5
##$FTSIZE= 0
##$FT_mod= 4
##$GAMMA= 1
##$GB= 0.15
##$INTBC= 1
##$INTSCL= 1
##$ISEN= 128
##$LB= 0.24
##$LEV0= 0
##$LPBIN= 0
##$MAXI= 10000
##$MC2= 0
##$MEAN= 0
##$ME_mod= 0
##$MI= 1.114404
##$NCOEF= 0
##$NC_proc= 0
##$NLEV= 6
##$NOISF1= 3.799351
##$NOISF2= 2.8
##$NSP= 1
##$NTH_PI= 0
##$NZP= 0
##$OFFSET= 15.70392
##$PC= 1
##$PHC0= -18035.08
##$PHC1= 12.2007
##$PH_mod= 1
##$PKNL= yes
##$PPARMOD= 0
##$PSCAL= 0
##$PSIGN= 0
##$REVERSE= no
##$SF= 200.130013532006
##$SI= 16384
##$SIGF1= 3
##$SIGF2= 2
##$SINO= 400
##$SIOLD= 16384
##$SREGLST= <1H.CDCl3>
##$SSB= 0
##$STSI= 0
##$STSR= 0
##$SW_p= 3612.71676300578
##$SYMM= 0
##$S_DEV= 0
##$TDeff= 0
##$TDoff= 0
##$TI= <>
##$TILT= no
##$TM1= 0
##$TM2= 0
##$TOPLEV= 0
##$USERP1= <user>
##$USERP2= <user>
##$USERP3= <user>
##$USERP4= <user>
##$USERP5= <user>
##$WDW= 1
##$XDIM= 8192
##$YMAX_p= 0
##$YMIN_p= 0
$$ End of Bruker specific parameters
$$ ---------------------------------
##NTUPLES= NMR FID
##VAR_NAME=  TIME,          FID/REAL,        FID/IMAG
##SYMBOL=    X,             R,               I
##VAR_TYPE=  INDEPENDENT,   DEPENDENT,       DEPENDENT
##VAR_FORM=  AFFN,          ASDF,            ASDF
##VAR_DIM=   8192,          8192,            8192
##UNITS=     SECONDS,       ARBITRARY UNITS, ARBITRARY UNITS
##FACTOR=    0.0002768,     1,               1
##FIRST=     0,             0,               0
##LAST=      2.2672688,     0,               0
##MIN=       0,             -255384,         0
##MAX=       2.2672688,     215399,          0
$$ Real data points
##PAGE= N=1
##DATA TABLE= (X++(R..R)), XYDATA
0@%%%%%%%%%%%Qj6J6j6J6k4L2l3M1n6O4p2Q8j04J21j45J69j93K24k57K93l33L78
34B01m28M81n40O07o79P56q44R41j044J158j281J415j564J725j901K096k309K541
52A331k799L087l409L771m180M647n184N813o563P469q592J0030j1945J4635j8717
67a0606K5729m1010J36331j31476k21480K67153J43018j35355j42746P8321M8003
78A5882J5495J9669l8409j16934L1505J63500J1599j75713m2783J44874P4086
89A02771j05632o4845M3372M7952J510N70l0475m7128L9666P8120l5703q8485
101e8307K6510P7646k8453l9666L4210o17n8342L9973Q4544o6884j04066P6405
113a7047J17125p4129j13844O2114Q9082m8329n4807M5604J0915n0862K9757N8735
$$ y = [0, 0, 0, 0, 0, 0, 0, 0, 0, 0, 0, 0, 8, -8, 8, -8, 8, -16, 16, -17, 24, -32, 32, -40, 48, -56, 65, -80, 89, -104, 120, -137, 156, -177, 201, -227, 254, -286, 321, -358, 398, -446, 495, -549, 609, -672, 743, -821, 904, -997, 1099, -1210, 1331, -1468, 1619, -1790, 1981, -2199, 2448, -2736, 3077, -3486, 3983, -4609, 5421, -6524, 8111, -10606, 15123, -25887, 110444, -21032, -242512, 24641, 167659, 32304, -110442, -32121, 15882, 31377, 51046, 12637, -104297, -72792, 90708, 102307, -73406, -116189, 28685, 102771, -2861, -67706, -24334, 23618, 25128, 25698, -4777, -51905, -12239, 65881, 30178, -58307, -31797, 45849, 17396, -22270, 11940, 11323, -47019, -7046, 77498, 10614, -93452, -17047, 100078, 25949, -87895, -25781, 63301, 14972, -39835, 5769, 16684, -34178, -4421, 54314]
125E4314o2147p6223Q5239R2040r0188r7368Q2052R7728o7291q2843M7171O3580
137D6064k3174l4635N710k9P327K8866j4451n4328J3156P1077j0807p8641K29
150d3636P0051M549n4038m005L0185q44j900J3303k3605k9381M7018M8405n5341
163G61n9087N8290O3467n3565n5998M3385M1208l5430j8982K9360p180l1263K4711
176c23L4537l9247l9052M2934L9324l9717l4911L2253K2460k3650k933J9896j4707
189c136k0304L2268K5592m0764l0971M0397L5805l1903l2256J6784K0484j343
201A0653l466j0287j9166J5364L9715j2167n5140L772O0233N716n5748j2723M1315
214H071J4288k3135p931K826l832J2140J8487k1456l1702K4497L9718k0444m1519
$$ y = [54314, -7833, -84056, 1183, 93223, 3035, -94333, -12281, 85447, 18156, -64687, -17516, 46064, 22890, -11745, -6035, -6064, 1263, 30129, 15678, -38650, -25494, 45583, 34776, -43865, -43636, 26415, 30964, -23074, -27079, 3106, 2262, 362, 13665, -9940, -39321, 7697, 56102, 761, -58326, -36, 63431, 9866, -46132, -2747, 38461, 3031, -15951, 13409, 6229, -25034, -323, 34214, -5033, -44085, -1151, 38173, -1544, -36455, -4202, 18258, -5392, -8325, 11571, -3136, -23440, 8828, 34420, -6344, -37315, 3082, 38887, 6984, -25272, -8488, 11996, 10653, 7187, -3100, -22266, -6902, 32813, 20646, -34494, -30722, 29511, 35227, -20521, -33244, 8071, 22359, -776, -8707, -5881, -9713, 2427, 20914, -542, -32244, -7747, 31971, 11527, -29992]
227b9992J5142L6697q587k5089N993J3432n755m22Q628r567j1923J5239J5340
240A9136j8826j7192J7761J4250j8549j0317J6873L007j6755K939J6078q826j5770
253a6191J3487J4909j4154j0438J4102P632j0958p64R243m411o396J0382N302
266A1745j5797m912J8788M476k1307n810J9647M313j7393m372J1702J264p012
279d668K712J189o997M344J1802o557j4218Q708J6714p568j6073O747J4053m914
293E274r406L475M439l077O88L570n514n151Q177O076j0968o955J1538O043j1101
308b892n161R525K877q052l5N889k604m225N101K226n990o69O678r7o562J948
324b043O426l149m659M338M604n166l501O105L158o498k582O464Q37n534n16L509
$$ y = [-29992, -14850, 21847, 13260, -11829, -5836, 7596, 1841, 1419, 10047, 480, -11443, 3796, 19136, 310, -16882, 879, 15129, -3420, -13737, 3136, 6143, -10612, -7673, 8405, -421, -16191, -2704, 12205, -1949, -12387, 1715, 9347, -1611, -2375, 6868, 2457, -3939, 6443, 11745, -4052, -8964, 9824, 14300, -7007, -12817, 6830, 11143, -6250, -10622, 1080, 2344, -4668, -1956, -767, -7764, -3420, 8382, 1825, -12393, -3685, 13029, 5461, -10612, -3865, 10188, 5274, -4132, -657, 3782, 705, 1393, 4963, -551, -5702, 2475, 8551, -2417, -9372, 2166, 8209, -2892, -8053, 1472, 4349, -3703, -3738, 2151, -453, -4678, 423, 2649, -3341, -4010, 2668, 2571, -3991, -2043, 4383, 1234, -3425, 913, 5517, 351, -3150, 2955, 6113, -385, -2967, 3497, 4334, -1200, -1716, 1793]
340A793k479j623K977m70n597J732O303k191p373K253P386j551m825N49M104L42
356A330m00Q84q55j394L228L126l574m738L409M420l037m484J109K064j120l77
372d09L97k306k045L489K341l547l310K955L682p60k288j64J175J683K048m66
388B475l952p66N339L557n448n896L542O698r27n833k059K708L050M76l692m081
404d809J931N822J57n918k939L634M577J67n045l222M002N784j195o348j392N381
420E87L782k468l485K9K976J545m46j762j979M97L509J789m077m543K844N536
436D334j816o379L41M941m35l581L79J767j813j391L088K680l435k917L892M153
452C808k650l493J462L847j41j808Q13R35k448j596L635L108n499n672N384P559
$$ y = [1793, -686, -2309, 668, 198, -5399, -3667, 2636, 445, -6928, -4675, 2711, 1160, -3665, -3116, 988, 1330, 930, 1814, 959, -435, 2793, 5919, 2345, -2393, 1016, 5436, 2399, -2085, -976, 1088, -32, -409, -12, -2318, -4363, -874, 1467, -2080, -5390, -2435, 1247, 487, -1801, -1965, -790, 893, 2941, 2475, -1477, -2243, 3096, 6653, 1205, -4691, -1149, 5549, 4622, -1211, -3270, -562, 2488, 2964, -728, -4809, -2878, 2944, 3101, -2817, -5756, -2122, 2455, 2622, -2423, -5645, -1643, 4141, 2946, -3402, -4794, 587, 4369, 1901, -1584, -1555, 1421, 2966, 2520, 758, -1221, -724, 2785, 4574, 497, -4046, -1202, 4334, 2518, -3861, -3520, 1421, 986, -2595, -2216, -449, -2262, -3653, -565, 2115, -1320, -4237, -345, 3808, 1158, -2335, -873, 2974, 2833, 1025, 1838, 2773, 325, -1271, 2364, 5472, -27, -5699, -315, 7244]
468G244m698j0715J463R575J379o320l141K203K736J547k24l411l625L725R133
483F871J190j2112p449J2679J3831r234j6951M386J6987N36j2718n243N002M661
497B436K377p92p904n664Q534J1609n289j6567k316J7448J0700j3029j6530O459
511h528J7960O38j4693n321Q649O672J54k796o279l804P614J1255m131j5921k165
526a0696J7205R366j3983j6745P321J8896p7j7007n050J1113N435m552l035k470
540d279l233O530J1466n445j8155J267K1179M038j8909q228J4724J2607p395j2560
554f393k0R665L622m045l909RR35K803K523m929q460L679J2120j210j2847k469
570h926R955M128o917n116L997O345r31n136L65M354j609l385M664M225o355m766
$$ y = [7244, 2546, -8169, -6706, 2869, 4248, -2072, -5213, -3010, -274, 1273, 1049, -2362, -5987, -2262, 6871, 8061, -4051, -11500, 1179, 15010, 5776, -11175, -6789, 10198, 10734, -1984, -7227, -2225, 2436, 4813, 4021, -3883, -9547, -1013, 10596, 5307, -11260, -13576, 3872, 14572, 1543, -14987, -8528, 9432, 10070, -4623, -9944, -1295, 5377, 5531, 2735, -3544, -7348, 266, 11521, 7390, -8531, -10696, 6509, 15875, 1892, -14853, -7532, 11364, 11287, -5720, -10770, 343, 5778, 1226, -1809, -4279, -7512, -982, 10484, 5039, -13116, -11849, 9330, 13368, -5541, -13769, 955, 13562, 6167, -6393, -6413, 3252, 6874, 2829, -1080, -1071, -136, 2667, 5190, 261, -8199, -4520, 7600, 6390, -6457, -8926, 1029, 5157, -1760, -6876, -2879, 3466, 2535, -2601, -2236, 2118, 509, -2876, 1788, 6013, -342, -5108]
586e108Q912M841r955n245R334M636q428l495O949Q35o330l23M895r42m439J353
602b510N021p58n698L14N206J81m815L59N183o8m385L75M358o86m131J121M270
619C337M61l517j969J491K692K25m041j595M177K602l311l304P18R42O74K417
635A999j932n252J793Q108j037j0215o89J0535L427p916l767M670L642j495j821
650E0n71L43K381J877j657m277p29M391K880m401m399K411M194r96l642r57J495
667a607J257J118r08k700p4M029L62k282j090J344J056J253R08k527k274L172
683A037L800l316m299K154M218p12l590p69J007N70J022r64k321n65L369J182
699A823m062j822L437K576j792k403J176J678jr31O2K63M76Q54J38j184l64J208
$$ y = [-5108, 3804, 8645, -1310, -6555, 2779, 7415, -1013, -4508, 2441, 3276, -3054, -3377, 1518, 576, -3863, -2510, 2511, 1753, -3945, -3631, 1575, 1756, -3059, -2700, 2483, 2415, -1970, -1595, 2763, 2077, -2054, -933, 3337, 3798, 281, -1688, -197, 2495, 2720, -1321, -2916, 1261, 3863, 552, -2752, -2034, -1092, -418, 1999, 67, -5185, -3392, 4716, 3679, -6536, -7225, 3310, 6737, -1179, -4946, -276, 3366, 1871, 50, -521, -178, 2203, 4080, 2423, -1854, -2583, 1808, 4688, 287, -4112, -1701, 2493, 1497, -2145, -3102, -1607, -350, 768, -140, -2840, -2914, 1115, 1477, -805, -1895, -551, 505, 1758, 2666, 139, -2135, 1037, 4837, 1521, -2778, -624, 3594, 2882, -708, -1477, -470, 100, 1122, 158, -2163, -2728, 641, 1823, -2239, -4061, -624, 1952, 160, -2243, -1067, 611, 610, -321, -259, 4, 480, 1334, 1472, 288, -76, 1132]
717A132O37j579n49J437M49j799l11J625r32j641J204R27j163p88R45j21j280
734a807J006N92j177K6J785K14j766K67J844L99j366j74J187M89n62n69J88L61
752I37M36k80q41m90N46N08j129j396P89J442r45j561Q10J017o45q19R00M76q03
771a048O07P34n92J76O22L83n83J37R15l9p38k2P24k67j091l7P81l7j078O8K36
792a49l02j58P2l41o14O57M92p79l91J170Q32r28k19O99O23k86N1J34K53j31K83
813I68l00l00L71O99r02o44J49Q07m99j328L43J208p79j116L41N10l95P9J27j82
833h43k66Q96M38o68n70J490O51q43o73P66J247q10l25P2J31j01M72L10j597n32
853g55J181L86j587n78Q83M75n82l22j37j79K6J240P5j456R5J626O74j003n58
$$ y = [1132, 1769, 190, -359, 1078, 1527, -272, -583, 1042, 110, -1531, -327, 600, -563, -1351, -406, -527, -1807, -801, -209, -1386, -1360, 425, 639, -1127, -860, 984, 1383, 17, -157, 1030, 1519, 957, 388, 576, 937, 1373, 1093, 252, -238, 308, 816, -313, -1709, -920, 522, -423, -1984, -1174, -157, -802, -1621, -721, -245, -1048, -441, 293, -299, -123, 499, 882, 299, 436, 1351, 1312, 574, 552, 1276, 1009, -82, -119, 662, 625, -453, -385, -149, -451, -609, -537, -878, -1492, -835, -343, -1122, -1513, -343, 489, -439, -658, 41, 664, 378, 429, 563, 816, 685, 968, 668, 368, 739, 1438, 536, -108, 41, 848, 349, -979, -636, 572, -207, -1323, -982, -472, -867, -788, -661, -843, -1109, -213, 225, -443, -1013, 477, 1128, 285, -388, 378, 1625, 815, 490, 562, 693, 592, 1064, 1374, -223, -755, 426, 812, -775, -1353, -470, 5, -577, -899, -1036, -1215, -1189, 51, 126, -1330, -1235, 391, 1065, 62, -496]
872d96P89P94j72M6n56n92J001J147o41k095L93J526mj290n60N52j49J80J86j352
892a293m39J045J096j005j279J115J379q84p73R02L94n28J42J719J34k579O05
909b49K513n82k308N88J744q99j373J027L19j934K88K094l54k800k03K542M08
926H21j999q22J083J137k7m06p97K3J016J032n49j146P01O51P92j52r29j527J271
945A73K430l57l385q72L760Q98l678j674K286J542j746l87J044j023j769K835
961G7K441m110l044N151L709m077m332L813L707k304j637R78M23l92J361J57k662
978g41p49K551J762j593l090j78K850J195k565k829J661L172l22k789j172J683
994a154K264m95k117K47J788j90j98J427j375k663K728M342k979n550L488N855
$$ y = [-496, 293, 1087, 915, 961, 405, -187, 814, 1961, 1320, -775, -382, 1144, 1140, -150, -710, -158, -307, -127, 59, -1293, -1732, -687, 409, -596, -1875, -760, 619, -265, -1038, -136, 258, -270, -128, 1591, 1725, -854, -249, 2264, 1682, -626, -38, 1706, 807, -566, 461, 780, -1154, -866, 1228, 874, -1926, -2129, 413, 821, -1178, -2000, -917, 220, 193, -213, -1010, -987, 29, 1061, 512, -634, 67, 718, 1510, 1358, 429, -1098, 173, 2603, 2246, -1139, -2011, 1749, 2647, -1031, -2705, -419, 1123, -623, -1010, 34, -989, -2758, 77, 2518, -1592, -4636, 515, 4224, 147, -4185, -372, 3335, 1031, -606, 372, 795, 403, 1764, 1921, -741, -1490, 1061, 2823, 1230, -1860, -2038, 812, 2007, -558, -3387, -1726, 1446, 1124, -1665, -2837, -1154, 1110, 615, -1502, -1255, 533, 343, 145, 1572, 197, -2466, 262, 4604, 1625, -3925, -437, 5418]
1010E418l480n676K856L564k499j911K644j1l519J440L107j895l424J342M313
1025B269p74l929l20L174J059k406l70J953M74p67R2l56m88O04J416k02r96O6
1043D99k1n07M41J57j239l50K376j98l208n7L425j026l494J876L809k720l215
1060c452L381K617l783j838M411J474l758m78L642k80l393J021L516j847k866
1075a633J709K680j984k720J232J665r90j009J201L70j638O6J374r52j668J702
1091e95K293j593j440J155N87j150R40J229j913j74K965L06l949l60L945o2l221
1108a037P10K214j405j453J950j96l284O74L821r49l833R77L332j041k955Q62
1124a613K495p05r27J294J66j584K16K452j45k867O69L054p99k919P86K354r81
$$ y = [5418, 1938, -3738, -882, 2682, 183, -1728, 916, 905, -2614, -1174, 1933, 38, -3386, -2044, 2269, 1495, -2434, -2754, 420, 1479, -927, -1297, 656, 1130, 363, 455, 99, -389, 215, 1631, 1429, 433, 499, 478, -29, 412, 569, -670, -1020, 1356, 1158, -2050, -2107, 1318, 292, -3202, -1326, 2483, -237, -3452, -71, 2546, -1237, -3075, 1336, 2810, -948, -1426, 2216, 1936, -1457, -436, 3080, 1233, -1633, 76, 2756, 772, -1948, -716, 949, -41, -1050, 151, 521, -1117, -1051, 323, -629, -2297, -595, 1698, 105, -1335, -180, 407, -743, 197, 1426, -487, -661, 2304, 2610, -1339, -1699, 2246, 2184, -1037, -327, 1887, 482, -971, 979, 783, -2501, -1827, 1994, 1045, -2788, -1811, 1521, 480, -2475, -1613, 882, 177, -750, 544, 710, -874, -658, 1794, 1649, -1218, -549, 2505, 1706, -1213, -427, 1927, 946]
1141I46j792J663M02k393R9K583j456k876K235K134k191j737K555L75k310O44
1157a119K244j487j011J905J513k389p79K490L17k276J71K273n51j570N31J036
1173A298j290q37J285Q82k044o93K247O1k684j81K423j16k215Q57J568r36j247
1190a622J914Q73j987l63L012m45k581R57K379j346j784K003J018j914l47J508
1206A275o67k074J074J793j614j469J483R58j704m37J289M42j513L74J200m78
1222f8j073Q80J246j289n68J494P83j654n10K009j65j748R27J424j246j487J523
1239D78J082k083r71K308J2k111PK122j352j190J363Q34j566m27J824K41j693
1256a122K73K035o25j354R32J221p10j114J346N81j395k66J338k59j605N06J214
$$ y = [946, -846, 817, 1219, -1174, -1075, 1508, 52, -2824, -589, 1545, -646, -2383, 172, 547, -1763, -1119, 1125, -362, -1373, 532, 2045, -344, -1123, 1367, 1684, -592, -421, 1852, 1301, -269, 262, 1298, 8, -829, 456, 1338, -706, -1399, 848, 909, -1775, -1956, 467, 351, -1864, -1007, 561, -375, -1622, 292, 1165, -822, -1185, 1827, 1382, -1199, -242, 2137, 791, -993, 1010, 2028, 114, -233, 1275, 608, -1466, -392, 1401, -213, -1682, -199, 759, -945, -1382, -93, 349, -1164, -790, 410, -68, -1141, -261, 985, -304, -872, 622, 1405, -249, -759, 1250, 1085, -663, 264, 1688, 442, -1045, 478, 1560, -523, -1494, 814, 826, -1285, -1278, 844, -508, -1698, -335, 499, -1067, -1494, 330, 571, -1122, -849, 1186, 561, -793, 139, 1360, 650, -464, 882, 1463, 68, -198, 1140, 881, -724, -218, 996]
1273I96p36j246R91P28j519o25J713j00j582L95J371o50j075J035P97q42l63J349
1291F37L27j291R6J587o64j289J040R94j021j167J468N48j523l04J111j64j295
1308i10J48J311q96j307J242P85j050p04J119O00j165R7J164l54o67P09R13p02
1326C33m59J028L71j259n2J061m84n64J41P39p77n54P21Q4j026j78J222n27q27
1345a007J70R03n18q20Q82O86n80m18J197J95j235L78J147j97j012M77P12m24
1363E36o78P86J38p83q6Q07l08j204J88O82l24m24J02L99k20n23Q06o5o52K34
1383e89P18k38m56P23N05m76k52P83O0p37K89M90j34n60J49M96n02p95O21N1k25
1404g9m26J37p8N0j06K07j51K38K3k44K27k50J33L84j03J74O2l1K8M56l3n39l53
$$ y = [996, 260, -986, 5, 733, -786, -1411, 302, 202, -1380, -985, 386, -264, -1339, -304, 493, -349, -712, 637, 964, -327, -231, 1356, 692, -597, 443, 1437, 416, -751, 717, 1265, -258, -562, 549, 385, -910, -762, 549, -347, -1654, -412, 373, -677, -1381, -262, 338, -827, -730, 434, 80, -587, 122, 1035, 333, -126, 902, 1273, 14, -38, 1023, 539, -25, 116, 855, 78, -476, 245, 329, -697, -875, 347, -180, -1007, -837, 66, -452, -1272, -390, 296, -284, -702, 495, 690, -545, -167, 980, 783, -229, 248, 960, 536, -142, 644, 782, -1, -87, 720, 412, -792, -604, 78, -246, -670, -568, -169, -389, -912, -106, -171, -823, -589, 129, -109, -565, 158, 663, 187, -65, 718, 778, 41, 330, 820, 686, 126, 275, 771, 269, -526, 95, 146, -79, -505, -368, -446, -396, -502, -295, -446, -208, -185, -429, -202, -452, -319, 65, -38, 136, 198, 167, 195, 651, 618, 79, -274]
1427b74J105J47o87j40N09j47r57O61J16n12m54M41L15j111N2O72K46j96l88L67
1447b35M44q2o07K93O24j19l60N70K52n11m54Q85K10r58j55R97N2q31k36O09l21
1468F7k95j63j1Q1j46qm1L44k64m40N15P93m42q33J167L2p61k6R61M27q68j10
1490b1P56j95q6l99L19M18l93r8k76L48n30q51N99O03o13o63J008K92r53n6Q64
1511G3k09q42O23P90k09o16O51j9J77J46o66O80L47n97k17K44J48o48n3M92M64
1532G59q67m94N61k06o62J79O79q2j66j15J03K90j90j11M06K14J68n15J22O07
1552F80q24k17R06M10j138k6J217n37q74L85M09m30m61M18J55l66k58o0J50J95
1572b66l47M57O2R7o12M8M25K29n72N48N62q6k12oP7m88J54M38P2m32K1J97m48
$$ y = [-274, 831, 978, 291, 151, 660, 513, -444, 217, 333, -179, -633, -192, 123, -988, -936, -264, -18, -214, -602, -235, 209, 127, -480, -187, 437, 318, -42, 528, 780, 269, -185, 700, 910, -48, -203, 794, 846, 15, -221, 388, 67, -228, -391, -402, -321, -467, -475, -516, -172, -436, -876, -361, 432, -10, -843, 324, 356, -405, -431, 530, 957, 89, -21, 735, 540, 454, 55, 374, 792, 399, 301, 25, 373, -157, -1008, -409, 194, -419, -1082, -74, 218, -735, -791, 73, -136, -978, -355, 435, 226, -390, 261, 242, 419, 565, -101, 579, 926, 329, 112, 356, 504, -144, -197, 295, 759, -108, -602, -41, -247, -909, -730, -51, -133, -299, -414, -311, -21, -211, -322, 84, 298, 466, -49, 73, 680, -144, -361, 545, 955, -183, -209, 1008, 471, -403, -18, 391, -39, -500, -82, 73, -293, -551, -611, -461, -266, -613, -156, -94, 3, -609, -561, -136, 93, -479, 69, 631, 545, 333, 327, 404, -84, 70, 508, 580, 148, 169, 366, -82]
1595h2J19j98Q6j1K27l40k75nJ53k53k96Q40K56o50J34O63n05n96P20M66l88R5
1617A60N37k21j77j06K16J08k34J01j19Lk89k75M9M92l73k80K61K25n44k26N96
1638i6q6m71M03M06j93k38N52J40o66K51M13n38L45K77r8l36J03K40l77K80K53
1659E64k52l50J05m5k92j76M09k64j97L90k74KK66q9m32N95pNM1L98l07l18O61
1682D33K79n09J39M42l39o55L08K62m65k35O89k71m47J19K23m82n5L79k82K6P7
1703c64L90m85M7J73K49P1J83O0k52K10r2J32m18N19K6j25j48K8q6L2o9m43L28
1726c4L89n95j07K59k05j66K41O5p6k03K29K29m83J78K71K24k82K21M32k46j7
1747C24K38R1l59k06L84k27j35j16O1K05j76k14O5J40l95K49l58J03j57K51J05
$$ y = [-82, 37, -161, -75, -86, 141, -199, -474, -479, -326, -579, -875, -35, 221, -429, -295, 368, -137, -733, -13, 453, 65, 160, 697, 476, 299, 193, 409, 517, 283, 384, 265, 268, -21, -296, -247, 245, -128, -408, -147, 78, -466, -692, -96, -182, -653, -250, 156, -37, -275, 277, 417, -249, 2, 415, -123, 222, 499, 401, 65, 168, 408, 31, 311, 564, 312, -38, 67, 22, -270, -446, -37, -301, -498, -108, -382, -380, -114, -203, -635, -40, -47, -42, -1, 397, 90, -228, 433, 712, 203, 342, 784, 445, -210, 98, 360, -105, -340, 349, 78, -369, -250, -27, -509, -564, -185, -467, -441, -364, 26, -459, -412, -239, 10, 81, 264, 324, 72, 282, 190, 322, -96, 423, 449, 324, 176, 204, 118, 150, 81, -362, -34, 355, -240, -347, -88, -293, -459, -218, -153, -229, -432, -203, 26, -457, -279, -8, 216, -66, 155, 587, 341, 324, 562, 653, 294, 88, 472, 245, 110, -6, 55, 260, 84, -130, -65, 75, -320, -71, -429, -326, -483, -232, -127]
1768a27j66l1J99j22K57k26J77K95j80J89j58J22k0M29k48m49M67k50j96O1O2
1789H5K42l01j2m1j50l48M91r4l54Q4K36o6K19k88J77j26N3L49j78K12k15k7M14
1812C62K19k77L9j55J29k47KK08j00j19n8R3j19j99j89K62k23k21M46k53K11q0
1834b69M5J48k38J28M93r8j73P8N3L0J16L8j49N04l43J63l93j17N58o48l02N30
1856A54j94k53J87j2J47k93m0m1K95j84k39M82r6M3JL03o9P5k9K14m5k50p0K72
1880C58j91O1o2j26K33J16j91l33K70n68J38J23j37J92j90j41J15J58j8j12K70
1901c5J64k80R1M55j36k10j3L51J0l65J33N16k28o84M08K52k45k24k67J91j19
1922b35j38Q1K61j65Q2k01J18L9k77J51J23R3m46M57O31n23J26J28N5m7l63K99
$$ y = [-127, -293, -324, -125, -247, 10, -216, -39, 256, 76, 265, 107, 229, 209, 638, 390, -59, 408, 158, -38, 23, 85, 327, 26, 14, -27, -177, -525, -34, -128, -482, -398, -162, -228, -9, -297, -120, -246, -193, 156, -22, 190, -25, -52, 362, 581, 304, 343, 188, 317, 70, 72, 280, 180, 61, 3, 96, -23, -222, -411, -149, -372, -593, -147, -400, -189, -269, -224, -76, -314, -186, 307, 209, 36, 114, 167, 197, 313, 351, 202, 706, 363, 526, 133, 16, 574, -74, -376, 154, -40, -293, -106, -118, 29, -264, -304, -345, -50, -234, -473, 9, -87, -44, -43, 260, 191, 266, 237, 451, 406, 156, 86, 358, 167, 228, 166, 40, 273, 389, 198, -135, 135, -433, -295, -172, -309, -117, -307, -448, -333, -175, -193, -305, -35, 129, -151, -60, 395, 259, 49, 36, 387, 397, 32, 165, 681, 453, -231, 177, 429, 184, -40, -307, -116, -235, -373, -292, -31, -196, -114, -315, -197, -158, -435, -284, -161, -68, -514, -57, 574, 51, 177, 305, 360, 313, -50, 249]
1944B49O6l3k21k2J91J22m58R1P2j5m49J71J06l3k16O6O18m78m59N07Q8n6L18
1967B25j63J30N5m7Q4k7M6o4j02L04j90m62L94J97n29l1j94N48q7l78M17k05k76
1990c55j2J08M9oj20O6J50K70k89j91M95ok89M02K61k13j92J11K90m95j61N38
2012D11L03o21j35K05k04o9k69R8M42k35j7k40K52P9n80M89L32k30m10M94K23
2033C18m09j52N51nl80N81q9j35j74P8k20jK78j32j20J47k32q6k57K48l0k33J4
2056d40N13np62N65J39l65K62K54QM1l73J7K53r1J52j34O59k51m50O8L14l53n57
2079e36O79L07n12l47L35Lo42L20K42j34R9M54q5n71L8L28k14L56J01q0j53J77
2101A65R3p22N99Q1L20o17rN15n45k46L82l6J07k5j0o5k4j81j30L56k11K9j21
$$ y = [249, 315, 282, 61, 39, 230, 352, -106, -15, 57, 42, -407, -236, -130, -163, -379, -313, 305, -173, -632, -125, -37, -93, 225, 62, 192, 247, 200, 284, 257, 303, 239, 137, 441, 251, -211, 183, 380, -149, -180, -374, 174, 87, -291, 126, -79, -355, -367, -259, -210, -216, -336, -270, -120, 150, -139, -330, 165, 159, -130, 272, 533, 320, 128, 239, 529, 34, -127, 411, 714, 93, -42, 163, -41, -110, -379, -281, 161, -74, -91, -331, -79, 0, -580, -91, 241, 11, -399, 95, 318, -91, -243, 308, 303, -77, 504, 415, 280, 106, 184, -36, -37, 241, 109, -11, 136, -96, -182, -439, -191, -221, -454, -440, 73, 68, -694, -129, 10, -355, -93, 161, 169, 210, -163, -146, 107, 16, 168, 34, 693, 442, -8, 60, 374, 21, -536, 143, 450, -62, -409, -74, -71, -713, -393, -151, -285, -186, 268, 183, -388, -350, -22, -236, 120, 221, 141, -12, 165, 258, -464, 135, 216, 536, -81, -90, 425, -120, -366, 16, -20, 87, 62, 52, -13, -37, -218, -348, 8, -203, -174, -295]
2124b95N50l96j21J66L82n94j98Q83J18n82L50M66n84k23M49N2m57J26M78n62
2144Hn07L54l9n3J03L62m60j65Q9O8j94K66M10q3k90J18J18k15K57k91K58J56
2166B70k27J34K71j24n26J30N93l11k41J39M9l71j28L46j97j73J59M04m06m95
2186g04Q34N4o42K16M75j43k15K21l21K39j81L38M9k86L65pj79p6M4L58m23j48
2208a32J5J70k45J6ML9j22k45M61j24r1Q7K63k79l77N90J14q0o7K77J57o03L74
2231B02J85q9l18L49K24m73p1K47j90k27J87M9l55K81N3p2m28R9K90k64j5J18
2253b18K79j19j20k6J95l7R1J31J09k09k61M80O4m10K21j3P4j05k06L8P4k53K46
2276B5J79n42R5M78l49k67L49j03k56J37k8J61K95l10M73m37P1J82N5j11j61K70
$$ y = [-295, 255, -141, -262, -96, 286, -308, -506, 377, 495, -87, 263, 729, 145, -78, 371, 423, -34, 92, 570, 8, -499, -145, -184, -237, -134, 228, -232, -397, -308, -240, -434, -168, 242, 159, -131, -13, 105, -110, 147, -144, 114, 270, 43, 177, 448, 324, -202, -72, 521, 210, -31, 108, 157, -214, -342, 4, -193, -366, -207, 197, -209, -704, 130, 184, -458, -242, 233, 90, -125, 96, -225, 14, -167, 171, 220, -66, 299, 292, 113, 37, 81, 439, 16, -132, -117, 53, -192, -176, -172, -133, -255, -500, -39, -163, -254, -167, 96, -183, -560, 30, 144, 64, -3, 274, 431, -172, 202, 387, 298, -20, 329, 553, 80, 9, 256, 66, -161, 26, 75, -280, 1, 54, -18, -446, -347, -57, -321, -336, -218, 61, -58, -178, -204, -9, -46, 45, 176, 285, 76, -185, 295, 359, -51, 170, 157, 231, 126, -80, -42, 32, -221, 25, 204, -338, -243, 235, -114, -381, -32, -135, -391, -254, -282, -121, 174, -136, 337, -100, -29, 153, 208, 97, -64, 206]
2298B06N4N5o75P77n21j15J70K24k62j06J79o4k63M9J04L28k44L2J23j25j63M4
2320a93M41l32K7k3M57n03K12j9L39m19M57m6k72p2L76j94l60J31L9r5k50L63
2342F4R0L4n92K11J7m1k4K79j42j30J48K60J81k53q3P1P4k17L52j76J11k1N2J10
2366C75l36o6K34nk49L44m10l7Rj57M2P0J00j7j31J89j71L14k45o5K20q1K8r9
2390a44N37l67N8J95K11k94j48K75j12j17q4p2M8k43K36j42j23N0p1L24k1k66
2412b70j18L86n3r2K11j75l3K47j37P6K17J10l20j52L72o6P4L1q7r6j19P7J5O3
2436A61k27J8L1q6j58R4K02p1l63J88K42j34j85L58K5k93j1K77L37k50j43L55
2458C67j82n9N4p9J35j81J34k0j45K4j29n8k49M20k32MJ80p2P0m8K12k62r0R9
$$ y = [206, 260, 315, -360, 417, -104, -219, -49, 175, -87, -193, -14, -78, -341, -292, -188, 140, -104, -72, 51, -74, -237, -193, 248, -84, -57, -80, 377, -126, 86, 67, 406, -13, 444, 398, 126, 54, 430, 236, -124, 7, 46, -49, -299, 64, 154, 188, -404, -193, -176, -217, -241, 38, -104, -234, -86, 174, 355, 102, 19, 90, 164, -53, 299, 123, 234, 213, 265, 375, 39, -27, 207, 202, -47, 297, -113, -150, -141, -298, -256, -186, -86, -103, -234, -45, -216, 98, -147, -212, 8, -73, -45, -144, 393, 26, 84, 279, 490, 196, 48, 323, 211, 94, 10, -62, -14, -257, -21, -163, -286, -236, -307, 17, -4, -270, -388, -2, -55, -147, 64, -111, -144, 103, -34, 42, 259, 369, 49, -103, 269, 203, 277, 308, 221, 125, 6, 83, 98, 161, -66, -48, -17, -103, -261, -167, 35, -36, -399, -211, 31, -103, -288, 70, 95, -198, -209, 68, 405, 155, 12, 367, 185, 126, 180, 101, 236, 55, 189, 169, 24, 48, -81, -139, -388, 32, -200, -196, -16, -88, -18, -66, 146, -116, -206, -107]
2482a07M3q6k59M81L04j96l3M7K2p4r5k2J28j72Q4r1J74k34k25K80K3k20j10P1
2506b67K99n23K52J67j64N0K22O7o0j34j7K11r0O9K23m42K70O4M9l64N45l05j54
2529c2J75J08l10k41L17j2r1n8J59Lk48j23O5K45M9p5K13l13J87N8k55L99m90
2552b70L26J13P2j39j98Q1n4P9j00K33j42j05K97l44R4K38k06l8M5k91q9M80M9
2575A31q2n36L71L45l28L0J72j7k16L4J30l7P1R0Q2j90J92J27m14J93j50l45N48
2598B01k99J01k7j83K32k94J22j87K70Q7l93K24l3R9J97K2R0j85l9k51N13j4l67
2621a14K49K28l09m5J71L2k74j59L38mk81J62k06P7o8K5p5Q6J40k4j25J57j8k88
2645c25j36N19Q9p4J83m3k98Q5Q4l8J51R7J1l67O1P1J9k7j74J73j63p3J09o2J54
$$ y = [-107, -64, -150, -409, 72, 376, 180, 147, 194, 216, 142, 47, 25, 153, -19, 65, -26, 148, -86, -311, -31, -8, -228, -338, -267, 32, -491, -239, -72, -236, -186, 36, 103, 43, -91, -108, 103, 13, 82, 305, -137, 133, 197, 246, -118, 427, 122, -32, 143, 251, -59, -300, 17, 5, -86, -144, 15, 18, -230, -353, -288, -43, 6, -69, 144, -169, 18, 76, -179, 220, -270, 56, 169, 241, 102, -96, -15, -69, 10, -90, 143, 1, -104, 193, -151, -57, 181, -25, -63, -18, -309, -398, 82, 131, 49, -487, -116, 229, -99, -69, 103, 86, -130, -96, 34, -3, 68, 158, 240, 50, 242, 369, -45, 148, -2, -347, 201, -98, 3, -24, -207, 25, -269, -147, -334, -64, 23, -370, -146, -179, -80, 117, 139, 229, 44, 5, -246, 267, 253, -114, 135, 363, 54, 9, 180, 212, -62, -221, 117, 113, -168, -6, -212, -135, -203, -178, -253, -167, -27, -51, -176, -19, -37, -325, -461, 58, 147, 73, 256, 213, -85, 0, 84, 46, 197, 294, 305, -62, -1, 70, 89, 62, -112, 61, -102, -175, -66, -128, 26]
2670B6j68n3r4K76K31m50K71L6L0j68PK27r9P1O8k01P3J70j44j83K01M6Ml91J85
2695b9j15M3k18K59Lj18q1J62ko8J5O2J05J5m11K94J03J91o5pQ9j54k19K09p6
2720a3q7K41j06J08n0j21J58k43R1q2n5j95K64k39L45J00l06J36k02J38L78l32
2742g2J0Q7j12L11j50q9l1rK41l3j61K44n9j14J04j57k05K38J88m64K12O0k33
2765a94J13Lj38N7N2lnJ28K2k66L9L77K4j60p5o9K13O5j00k7m8K3R2M6m4n9j93
2792a27K22k53k09L83k06K5j40J60O5j77O5K05r2OJ43l3j92R7P9K36k41j7J97
2815A96l7j93P5o0L00j68m9j8p6k39L29k32J42l5q1j34L13N3j01r4l8R7K5q2j48
2840b55L84p9K2m5rq3L0J86j81J87j3L6J8l62K00j83K3m0K28j99q5M4J42N8j89
$$ y = [26, -142, -195, -289, -13, 218, -232, 39, 75, 105, -63, -56, 171, 72, 143, 211, 10, 83, 253, 109, -74, 127, 173, 177, -214, -29, -144, -101, -319, -60, -57, -175, -256, -94, -96, -164, -149, -87, 18, 33, -378, -84, 19, 210, 145, 138, 227, 73, -146, 63, -13, -100, 141, 35, 143, 93, -28, 130, -113, -22, -104, -159, -354, -90, -329, 16, 116, -190, -54, -256, -118, 260, -72, -62, 25, -87, 224, 74, -15, -46, -55, 186, 153, -8, 236, 177, 63, 167, 10, -195, 43, 231, -233, -21, 39, -194, -81, -78, -216, -159, -107, -110, -115, 13, 35, -231, -192, 185, 209, 49, -26, -95, 118, 183, 83, 56, 8, 31, 123, 169, 125, 66, -127, 95, -158, -367, 16, -190, -165, -305, -145, -80, -257, -192, 13, -79, -73, 70, 37, -155, -58, 21, 257, 16, -1, 196, 159, -34, 41, -19, 281, 113, 64, 46, -30, -269, 60, -172, -30, -65, -146, -280, 33, 86, -15, -109, -147, -50, -25, -107, -255, 129, 50, 72, 27, 18, -65, -35, 151, -30, 157, 144, 180, 198, -164, 36, -147, -124, -164, 64, -135, -220, -176, -34, 24, -165]
2865a65J11n7j72Q9J04K28k50J09p7J33j48K21j98L24j25J07l9j02K37l43J97
2886A84o4o0r3P8l46Q8L34r1k90r4L05M5l44K27O4R4k07K21M7k14J21J8M3P0j31
2911EL18j56k83K1J65j6J23k58L3l9r5q3J93J11r3J67j59J22k64K35pk4R0j17
2935a1j45J45p2j8K95J42l62j01P9K51l23L44L7M4k98M1L1j53L7m7J3M8k45L76
2959A08j68N2k29n4J35M2K72j87J25n3JN8o1J55j5Rj2n1O5n6j00mK1L4J29p9p4
2986F3r8k78K18K2j44k86L31n7J43K53j69J27j30j52K47j49Q9L33k65K27k99K90
3008C16k57L9n3r0K26j13J17k72K43J2k85n5J83J3k28J53Q4r9o6K41J0r4j86O5
3032i6Q9O6k43K30J13P9l81K44k79L22O8j80P0q8J59J96l98j74J16Q4O4j97Q3
$$ y = [-165, -54, -111, -283, -194, -90, 138, -112, -3, -80, 53, -95, 126, -72, 252, 127, 234, 195, 93, 330, -13, 184, 120, 60, -33, 45, -301, -213, 121, 30, -260, -354, -49, -4, -348, -121, -57, 37, -170, 51, 98, -116, 5, 23, 66, 136, 5, 323, 167, -116, -95, 70, 54, 177, -81, -48, -87, -182, -265, -72, 39, -54, 113, -46, 76, -188, 47, 40, 16, 106, -11, -156, -11, -83, -101, 194, 336, -26, -127, -48, 203, -120, 224, 261, 305, 7, 48, 79, -74, -37, -84, -71, -23, -268, 108, -60, -8, -237, -291, -156, -114, 158, -29, 96, 43, 44, 102, 41, 196, 181, 190, 178, 127, 192, 136, 36, 32, 53, 87, 216, 137, 63, -35, -313, -95, -73, -217, -503, -172, -229, -86, 167, -2, 125, -5, -157, 90, -59, 30, 363, 98, 325, 26, 316, 59, 98, 45, -45, 181, 68, 185, -87, 156, 168, -117, -172, 11, 24, -204, -51, 33, -66, -132, 109, 119, 25, -161, -96, -7, 59, -184, 46, 159, 238, -143, 101, -178, 144, 212, 32, 102, 14, 173, 369, -29, -203, -87, -3, 61, -136, -53]
3055e3J14Jj84K3P5j59J44K17k68N6J20j76L61j67j6o5R3M7p5j9J99k09k44L88
3079B03l00L69k32j88k2m7M98p4j38O0Nl64Q6P9k27M33k04J02O4N2k43L50k61
3102AJ76m5j45K36N8l08l7J65Q8k73K41K30n75K12p6O6j18j7K98j35l45K28K8
3125d7j8Q3%p3j8j0jM40l59j10Q2J02L28k71L5k26k3o6K74k20M06m23J94P7r5
3150F1k30L2l0j29J18k0J72J26k20N6K25j56N9m9J54j33k93K17N8m0O5Q0k2K9
3174A30O6P4j83j68R5j13J53k96L31k16M0J27j12m02O57j92j28k00N50k44M9Q
3196B6P2K5K07l32P7J8k7j71kJ54M8O1j91k7Q9j24L3N3n0j34L19j71j58J52K5
3221b8Oj03P4j80L41j09K69j96j72J54K9M4k7k21J53m1L2J57j67p5J99j68mj61
$$ y = [-53, 61, 62, -122, -99, -24, -183, -39, 178, -90, -34, 86, -90, 271, 104, 88, 23, 116, 163, 88, 69, 268, 59, -185, 203, -97, 272, 40, -148, -170, -217, 281, 207, 69, 129, 134, -230, -144, -65, -292, 141, -63, 39, 103, 155, -88, 262, 1, 177, 132, -13, 223, 281, -27, -64, 101, 189, -84, 157, 387, -188, 24, -52, 14, -104, -121, 177, 42, -303, -75, -47, -65, 18, 18, -55, -73, -83, -84, 356, -3, -113, -31, 71, 399, 128, 163, -63, -86, -152, 122, -98, 308, -115, 79, 156, 61, -169, -137, -167, -296, -178, -198, -26, 100, -120, -64, 161, 5, 64, 15, 169, 36, -257, -40, 18, -22, 43, 123, 101, 130, 196, 270, 87, -81, 14, -99, 54, -242, 89, -127, -87, 40, -72, -474, 183, -9, -137, -337, 213, -31, 18, 26, 98, 123, 330, -2, 75, 93, 66, -105, -107, 47, 95, 156, -35, -62, 27, -97, -64, -11, -61, -195, 124, -47, -205, -53, -28, -22, -125, -51, -231, 110, 1, 270, 74, -98, 56, 85, 129, 102, -119, 34, -7, 25, 182, 15, -60, 139, -29, -33, -194]
3245a94K35kK87m20R8J46l59J77k5q7k0P7O4J43j09n0J31j32K81l8m0j9O9j09
3269A04J13k41J63j47J3j5J4J8m5j99l1J63J55k1k08j28L11J43l68mK41l2k3r2
3293a16K05L6j28M2k12L89j32J24K3l63K18jk7J40k46N3n0qj08J60k18k1L57j15
3317Bl67J23K90j51K44k07P8P3j65N5l7J7O3J36L3M6j73K60k96L23j95l44j04
3340b96L93o8k55M3K52j05J01j66P8mj55Q0o9K65j55J93j99J40J44j91Q6j48n
3363d1K18j84N5j72J81j15p8J83K1p8k67K2J99q9J24l90L82R6kq4k0j43K21j18
3387g9J15j12J61Pk37L94m02K31k3n2P1O0m8ork7L47k98j61J01j22K91k80o3K53
3412A12l93L64m0j59J65k46K33K37k08r6R1k29L32p8r9J5J76m4j76J46P1j19l1
$$ y = [-194, 41, 39, 326, -94, 4, 150, -209, -32, -57, -144, -164, -87, -23, 120, 11, -39, 92, -40, 241, 203, 163, 144, 213, 104, 217, -24, 139, -8, 5, -10, 4, 22, -23, -222, -253, -90, 65, 44, -164, -292, 19, 162, -206, -210, 31, -1, -24, -116, 89, 125, -3, 39, -173, 216, 84, 208, 231, -132, 86, 85, 58, 198, -48, 5, -45, -53, -161, -1, -219, -240, 117, 2, -365, -242, 48, -103, 141, -66, 12, 85, -80, -25, -62, -45, 18, 154, 187, 233, 60, 320, 24, 347, 152, -192, -296, 97, 29, -226, -183, 69, -36, 65, -101, -23, -27, -182, -102, -171, 94, -61, 132, -67, 73, 217, 26, 112, -36, -41, 177, -7, 48, -124, 57, -58, -136, 47, 68, -10, -277, -255, -56, -145, -21, -411, -29, 67, 65, -19, -39, -182, 39, -79, 36, -76, 85, 92, -145, 249, -153, 78, 55, 3, 74, 134, 86, 80, 71, 44, 391, 93, -68, 33, -89, 202, -78, -141, 112, -281, 83, 43, -116, 49, -197, 36, 273, 65, -31, 60, -169, 163, 85, -14, 1, 177, 133, -43, 103, 174, 55, 24]
3435B4o1j76J50O3o4K64k61K24q8j30P2j33j8J91k02K23l3J9l19J74j58L29l46
3458b56K41J99k13K60j33J01k33P0p2K54k70L05k56J15k08K58j41j52n9N1K56
3479A17k56O7J73j20J03k04NK46o7k62J97p9M3J35j10K56l09J71k01n3L34l13
3501a27j25L96j53N7j05K81l82j3J16k0p1M9n8J74l9J4K42k73ol8N5QJ78j89J68
3526A39l8j96K87j09K5j51M6l18K2L99j34l3K46k00l85L25J31j98M19k29j02j9
3548g3k15L27P7j22Q7q9m4J01MK3K51k00Jj63K60J1j42j59J04P3l05J25J53R4
3572A79m94J45O8R5m04M55r4j06J74n5j40J54J54k5O2k79L41j12J09m6k78n7J80
3595B6j84L38q1j10%j14J94j16L9J0j29j5J44j24J13K15M5m39K60rR4m63L59j57
$$ y = [24, -37, -213, -63, 0, -64, 200, -61, 163, 75, -55, 17, -116, -134, 57, -145, 78, 45, 64, -255, -81, -239, 90, -256, -15, 184, -29, 231, 98, 199, -34, 36, -36, 218, -52, 253, -3, 112, -96, 162, 21, -131, -190, -139, 117, -139, -72, 101, -19, 84, -120, -115, 131, 64, -198, -1, -80, -37, 98, -12, 244, -65, 106, -95, -148, 186, -127, -252, 144, -9, 48, -57, 224, -158, -171, -55, -75, -146, -97, -155, 19, -20, -6, 236, -37, -43, -81, -26, -18, 160, -29, 139, 101, -95, 192, 83, 108, -43, 3, -315, -293, 106, -28, -61, 185, -15, -400, -75, 56, -142, 277, 48, -54, -73, -288, 39, 116, -6, 81, -8, -52, 49, 53, 76, 327, 127, 128, -35, 225, 236, 94, -65, 39, 112, -193, -68, 85, 179, -315, -170, -102, -7, -411, 44, -50, -156, 18, -37, -177, -23, 131, 106, 168, -111, 230, 118, 227, 181, -97, -154, 26, -158, 180, 99, -11, -11, -125, 69, -47, -8, 2, -127, -142, 2, -122, -9, 206, 251, -188, 72, 63, 157, -306, 53, -104]
3619a04Q8K38l42K96l9L6m39K22J21Ok25J62mj82QJ64k33m6L45j94O8J2j36K63
3643H5j16J42k26o7K42j76J13o7J3J61j94J45p5J99k33P5J75%J05l54J04k19J95
3666B7k86N6J12J39k39J82J37j18j13P0j34K33j52Q2L9k6Q5j48O5j0O3k2R0j95
3690f3K4O3K6j8j07L8r5J6l7K58k94K14J24n6j95r1K00o6O7r4J72l8r5K8J90K27
3716C98m45L55m05J98J07K01k60r1j66OJ05m6J60j81J59k46J88j16KJ22L8M0j98
3739g5K77p8o7j44mL47m93K73j21N9j3q1J02m4J24K6K51n29K01J23m08P5L0J62
3763gm5m5P9j3Jp6O2J2n0O7n7j10r9L09R5j23K33j46k98M23j05j5j26l8K74k21
3789a9p4l8K6J97k23n4J04j62N38k94k01K25j95J49K9n2j25J25j59K51O9j28J28
$$ y = [-104, -16, 222, -120, 176, 137, 173, -266, -44, 77, 83, -142, 20, 16, -166, -158, 6, -227, -273, 72, -122, -54, -42, -178, 85, -31, 111, -115, -182, 60, -116, -3, -70, -57, 104, -90, 55, -20, 179, -54, 21, 196, 196, 301, -53, 51, -168, 27, -259, -203, -91, 48, -191, -9, 128, 10, -103, -33, -167, 66, -86, -4, 35, 9, 94, -54, 11, 1, 64, 42, 132, -63, -39, 24, 50, 32, -75, -37, -132, -116, -153, 105, -189, 25, 149, 93, -102, -193, 7, -59, 8, -86, 86, 48, -47, -19, 171, 398, -47, 308, -97, 101, 208, 409, 149, 58, -108, -102, 3, -43, 117, -64, 95, -151, 37, -79, -77, 45, 83, 123, -75, 202, 124, 57, -87, -91, 256, -237, 36, -85, -26, -39, -120, -18, -62, 62, 88, 339, -190, 11, 134, -274, -199, -169, -7, -52, -97, -18, -31, -30, -106, -44, -32, -82, -15, -72, -182, -281, 28, 123, 0, 233, 87, -211, 212, 107, 92, -34, -72, 202, -19, -93, -131, -105, 92, -131, -185, -81, -243, 295, 1, -200, 25, -170, -21, 8, -44, -169, -44, -203, 48, 117, -11, 117]
3812A17r0j02P8p5L36m38J63J31l07M04k83n0N6J03M4j8k61J75K4j04M9j29J59
3835a8j61j3J19P0j70J86j29K14j50J61K12k87J5j9j44J80j35p4R3J47j42J54
3857A09l3j78K64j83j49Q5J31k07J87qk31L15O3k45J52J08j57j3o8P5j97Q0P0
3880c0J28J33m0k47P4Jp1n1M9o8K56j2l42K61l6J78k19P5J81l94j3l5K22N7j13
3905e6q5M13n40K18K90k72K64p9o9Q3J43l22J85OP6m20Q4M5p8o8K38k31n2J32
3929i5j03n9K60N7j80p5k1K15K00j37r9JO9K61k69N2J32q7J20k75j47K70l38L95
3953A47p4j4j2o6k19K96j14q6M01j40q0J2p0L4l20K19J02J17k09oK19k24L77k37
3977E3Kjr0m0Q8K22k70l1K99k63k9K00K1k95K0J94k62J33K3K9k51K40Q6o9j77
$$ y = [117, 27, -75, 3, -72, 264, -174, -11, 120, -187, 217, -66, -116, -60, 43, 87, 69, -192, -17, 7, -97, -48, -177, -18, -179, -192, -73, -3, -173, 13, -116, 98, -52, 109, 321, 34, 49, 30, -114, 66, -69, -143, -50, 97, -45, 109, 76, -102, 162, -21, -170, -85, 46, -161, 26, 18, -213, 102, 165, -80, 72, 180, 23, 10, -58, 17, -180, -100, -30, 98, 231, 191, -56, 18, 19, -52, -103, -54, -122, 134, 122, -220, 41, 5, 183, -36, 39, 220, -174, -187, -222, 0, 57, -56, -141, 272, -268, -50, 240, -32, 232, 153, 84, 167, 310, -12, 173, 179, 255, -165, -81, -36, -114, -182, 56, -175, -227, -95, -198, -257, 3, 60, -120, -195, -216, -1, 199, 62, -37, -36, 33, 294, 25, 77, 209, 122, 242, -33, -180, 90, -248, 147, 73, 59, 47, -19, -238, 58, -56, -142, 259, 119, 39, 51, -19, 15, -305, -86, 16, 133, -76, -82, 137, -87, 290, 53, 55, 54, -36, -76, 12, 234, -36, -67, 232, -31, -60, 140, 161, -134, -114, 80, -182, -49, -26, 3, -248, -8, 78, 9, -168]
4002a68m2J75j36K59J06j41n9Q6N3J07j69j25j46L43j00j10k05J35J59pJ46k84
4024a23Q4J53j50k4O6nl7J15j42N3J9j19K99k42Q4J32q2K0l6J0R7l3j08o3J23
4049I1K80j68k80m5J44r4j73N5J18J60j28R3k05p2J45J05k77K82lKK3l5Jk32K55
4074D2R3R7j41r7J69k01l5L7L5K75k7m72O5J92j16k2J59k60J47n6M2M9l7o6K35
4099A07N0K3l36J86k58R8K21j99J82r2J36m6k99J32P1J06j68J78j1Nj94l4K21
4122G9jq0o7N0N2j32K47l49L67k75J77j33M0P1L74o40K30k3m5R7K17q8j45Q4k50
4147a43J66P8k23o2K56k07N9o6k5K34k19Q7J74j60J18m8J87l71O5N2L84k76L2
4170I2M6p5k0m8J7j90M28m05K21L4r8O8k43K50l5p5L6L0j80O0J16m0p7J12j47
$$ y = [-168, -210, -35, -171, 88, 194, 53, -6, 80, 133, 240, 71, -54, -200, 143, 43, -67, -272, -137, 22, 15, 161, -123, -39, 114, -36, -60, 6, 1, -36, 79, -63, -10, 9, -110, 189, -53, 31, 163, 81, 101, 65, 75, 172, 139, 31, -32, 91, 371, 203, -77, -122, 22, -72, -245, -190, -72, 88, -40, 53, -152, -224, -79, 26, -251, 31, 28, 30, 53, 18, 19, -213, 42, 135, 232, 91, -6, 163, -38, -73, -36, -1, 274, 247, -225, -160, 32, -84, -106, 53, -207, -60, -116, -74, -25, -62, -128, 107, 157, 180, -156, 30, -228, -130, 91, -108, 74, -18, 118, 72, -227, -95, -24, 82, -86, 92, 81, 86, -108, -142, 79, 78, -2, -69, -19, 33, -99, 148, -201, 166, -109, 68, -65, -25, 46, 420, -220, 10, -13, -58, 39, 256, 168, 23, 107, -143, 23, 101, -122, -184, 72, -135, -76, -142, -167, 67, -152, -65, 109, -51, 67, 19, 206, -165, -100, -48, 336, 60, 92, 138, 63, 43, -5, 12, -178, 250, -155, 66, 100, 2, 70, -173, 77, 42, -33, 3, 33, -147, -87, 29, -11, -88, 24, -123]
4195a23K04j14k1j29K37JMM8j40N8P8j15k08J18O3r8L52q5j07J90p2K4k65O0j64
4220b04J89l4J19j26K80l06J24q3n2K30k37R7j13J45J50L3l79L29m4j23mQ4J20
4243A95l30J83O6o3J94j93k89O8r1L32j52p9J60j84P8M7J31l39L29p9J59l0o7
4266D6k71J31m6K56j07R2o4N2j89q7J28R3j50J65q7K77l35J37j93L41k03r9jK70
4290A56j64Q9J22o47M49j19K69k85L4K50j56j56K00j52L2M8KJ09K6J81j42j71
4312b5j0M9j78Q1jO3j55J40j38L91n84K99J97p9K7Qp5n3J19K4J05l85K18j36Q6
4337a2J6K47j99P1K1q7j73P3J30k96lK89lj4K47j97j60qJ2J36m3j39N5o8J73j13
4363d5K11q4K6j82Q7J24L9k77J36J32m84N71j99k01j08L66L1l27K92j43J07j84
$$ y = [-123, 81, -33, -54, -183, 54, 55, 59, 107, -33, 25, 103, -12, -220, -102, -39, -137, 215, 130, 23, 213, 141, 165, -100, -40, -204, -15, -49, 70, -56, 224, -82, 42, -41, -93, 137, -100, -3, -116, 29, 179, 212, -167, 162, 118, -5, -9, 75, 195, -135, 48, 114, 51, 245, 52, -237, -169, -260, 72, -80, -159, 1, -183, -105, -58, 73, -266, 63, -16, 143, 113, 46, -225, -94, -140, 116, 9, 101, 37, 89, -100, -187, -59, 34, -116, 49, -38, 239, -96, 41, -152, 189, -14, -113, -114, 156, -8, 81, 203, -444, 5, -114, 155, -130, -96, 154, -2, -158, 42, -110, -78, -30, -28, 81, 107, 288, 146, -25, -35, 14, -164, -83, -84, -21, -176, -36, -174, 217, -367, -68, 129, 50, 77, 85, 10, -43, 76, 100, 205, -180, 38, -98, -12, 4, 251, 52, 123, 144, 57, -116, -43, 87, -209, -212, 77, 74, 60, 307, 110, -50, -58, -46, 90, 47, -92, -37, -105, 68, -45, 166, 82, 108, -74, 13, 137, 176, -101, 35, 167, -317, 254, 55, -146, -254, 112, 143, -184, 108, -35, 72, -112]
4385a12j07L6n7L42l04j3K99lM0k8j79K50j41p1L4m2J41P3j73J08j83J1n0L9N1
4410c9j00K4j89K01K48r6J41k38j2K10q6L4j99J40k0l4j71J85o1L00j01q3j33
4433g9J52j05o9K3l2M7k8j71J72L01o9j89K43k87J70o3J66k01j29J00m6J6J52
4456G4J10k75J55j55Q2J28j74r2L42r5n6k2j39K95N8j67j41K29j59J4l39J34K51
4479E8r0P3k30J68J7j97J53P8j62K37Q2j88n2J60j10k4O5k32K08j09J45j90k44
4502c84J72K94l3J24Q1j35n1k94J84Q2j71J63j17K03o3k13O3q1n2J79K3m5K18
4525A47j69J0j58L8j68K51j06J36J76k12p3J40O1J30l26j6P1J05j55j25J3Q3j2
4548a59K7l8J45p6k2J31p9oo6K19O8k00O4Q3J4j11Q7j32J66j05l2J5o7N1n6k01
$$ y = [-112, -219, -183, -240, 102, -202, -215, 84, 81, 121, 93, -86, 164, 23, -48, -14, -56, 85, 158, -15, 93, -90, -79, -129, -90, -39, -139, -115, -304, -103, 145, 49, 190, -48, -60, 150, 64, 98, -101, 39, 19, -15, -186, -1, -62, 238, 137, 54, -79, 73, -32, -101, -78, -110, -63, -91, -262, -90, 211, 142, -47, 196, -91, 79, 16, 182, -19, -148, -48, -94, -78, 74, 184, -91, 64, -91, -9, 119, -55, -147, 195, 100, 44, 22, -117, 178, 236, 69, -72, 157, -2, 12, -327, -193, 58, -32, 41, -189, -21, -4, -201, -48, 30, -132, 105, 187, -1, -53, 107, -3, -27, 38, -194, 14, -95, 50, -140, -384, -212, 82, 49, 173, 254, 119, 68, -226, -42, 40, -131, 32, -85, 118, 55, -158, -95, -176, -228, -49, -26, -71, 147, -22, -12, -170, -132, -300, -49, -155, -19, 157, -55, -128, 12, 73, 203, -123, -139, -68, 37, -118, -243, -230, -147, -159, -132, -170, -25, -101, -123, 8, -71, -77, -143, 76, 144, -56, 8, 91, 105, -6, 81, -51, 115, 10, -22, -7, -74, -23, -79, -280]
4574b80L43l78K37P7l10L41j20lNP6O8j45K15K5k01L60l33N7m1m0L1J30l20K91
4598H5k43K50k0j31j44P5Q3k79L05jJ37l7k40q7K90J8Qn5j77L3M40n36K38j1j66
4623a65N25n34Q0K53j73N2Pk00N6J28m5j21J29J82k13j32M47l06o7J64L30n42
4645a45j91L86q8mL29j91j90K86L5k04K8k21M15l12O7J8j86K50k35K46P7l72K83
4668H1j47k41K20Q0K10j75j97M2K6j65N72k00k79M9J63j99L12r9j32L22k32j52
4690a41Q0N1K12n0j78j02J72k05O5J16M9O9k49j59J08J39j10q0K01J17k4j57N1
4713b5j4M7K0%P0M3j44p1N9j05J4K69p8m4n0km9o3R3J21k57J77Jp2k73L41L6J5
4741E9l5q2o1J57j35J63J41k24J29n9j83J32K61jl18N4j01K75k59k3P5J54l46
$$ y = [-280, 63, -315, -78, -1, -311, 30, -90, -93, -88, -12, 56, -89, 126, 151, -50, 310, -23, 34, -7, -47, -16, 114, -206, 85, -158, 92, 72, -59, -203, -128, -45, -324, -19, -20, 117, 80, -160, -247, 43, 61, 69, 14, -163, -130, 310, -226, 12, 1, -165, 360, -174, -94, 159, -14, 38, 45, -155, -99, 29, -16, -137, -8, 174, -39, -171, 276, -30, -97, 67, 397, -145, -336, 50, -38, -42, 287, 96, -94, 192, 227, 23, 51, -170, 245, -67, 0, 18, -168, 82, -153, 93, 170, -202, 81, -66, -307, -87, -7, 203, 28, -169, -127, -101, -266, 306, 106, -173, -124, 39, -160, 152, 53, -79, 243, 11, -141, -61, -10, 202, 152, -26, -128, 44, -161, -96, 20, 69, 138, -111, -270, -162, -23, -133, -213, -12, 105, 81, -76, -25, -39, 8, 28, 28, 98, 141, -3, -74, -15, -120, -106, 163, 85, 41, -9, -11, -60, -123, -30, 91, -166, 11, 12, -60, -333, 8, 44, 59, 24, -58, -119, 38, -97, 66, 207, -17, 112, 53, -130, 2, 263, 262, -56, -2, -103, 172, -87, -110, -35, 119, -227]
4764b27M46m84Q4n2J15K16k30J37q4K19k11j9P2J8j8q5J11n9j31L34r1r1m9P6
4788cj11J64J27k48k3K58R1k50J47j09j39J21j27LO6K8j7pj6p6J2N2k39L67ok87
4814b22j95M14J71k36J8q6j43K18K01k10M6m3q0L00j59J84k6ok18J52k95J97j33
4837a51K76k61J09N2j02O6K8m1J5J47k32Rk0K87r8p2p3K0K25n4k12Q2P3m9j25
4862a01N4j21K06L6K3j96J27l17K03K15k42J08K51k49R1r0q5K94k35o5J19l8J49
4885A37k00K24l67L33l06j2L77k42M7JL7J11j63J95j9j88K18r3k04K17k1j57O4
4908a1p2K34k78J66O2k71M4K60j88J75l30L51j46R4k02j56L76k04J6L5l1L1K12
4931A67j19p0q0J60r8n9O6m9J2K72k16O1M1L5o1q5j16K16j81Q4j54K71J74j38
$$ y = [-227, 219, -265, -181, -233, -118, 98, -132, 5, -79, 140, -71, -90, -18, 0, -18, -103, 8, -51, -182, 152, 61, -30, -79, -3, -114, 50, 177, -71, -94, 164, 255, 5, 152, 43, -96, 25, -102, -99, -33, -5, -22, -29, -45, -121, -109, -57, -296, 71, 65, -222, -417, -3, 168, -68, -50, -136, -279, -61, 140, -70, -24, -67, -147, 153, -6, 178, 152, 146, -72, 80, -215, -18, -151, 125, -136, -27, 25, -77, -11, 17, -24, -9, 138, -94, -85, -105, 182, 84, 12, -61, -41, 184, 130, -82, 0, 73, 24, -101, -47, -168, 38, 74, 97, -99, 28, -289, -86, 129, -113, -5, 246, -3, 88, -2, -87, 207, -28, -93, 26, -12, 137, -63, 161, -206, 127, -179, -191, 186, -56, -9, -8, 29, 140, -23, 172, 153, -35, 183, 90, -114, 103, 82, -75, -11, -83, 151, -127, 39, 101, -170, -126, 134, -54, 121, -209, 142, -4, 90, -112, -268, 108, -96, -80, -45, -76, -45, 167, 48, -22, -102, 58, -40, -99, -33, -82, -70, 202, -14, 47, 88, 123, 62, -23, -139, 77, -104, -20, -174, 97, 271, 133]
4955A33l95N1K37L3l1q4L11l63J11N9L4l48O3K10J56k74K20r4kp2j6J06k9l8N5
4980C3J87j75j01p1J64J8J55j89L7j17j7P8k22N15l61K17p4M5m11K23l4J9NJ55
5004G9lj92J88j44K25k26J13r1N6R2l1q3j12J61J97k94M6l8j23J63j08j23j1L03
5028D4k57K77m2n3j28j8K15k02J11J90l46K67m1Q3j76K36j25k9j89J51J00K33
5050C01l23K59l55l4Q5J07M4o2O6L6j94l8j29K69J6j81J40J1K04k16j42K4O8q6
5074a30lJ56J49k60J56j2n5K7j63K1L28n6j97l49N32r2q7J12m8O9NJ18k21K00
5098B00k69P4Lj22J77O6j27K5j0n1K24l21L92k77j17pL3J29l0l8L04k09j43J15
5122B1j33K9L8P7j47J63o7n3N7j58O5L39Jj62k83M09k2j52j6J75m19J37J92k33
$$ y = [133, -262, -211, 26, 59, 28, -56, 255, -108, 3, 62, 96, -252, -189, 21, 177, -97, 123, 29, 27, -45, -61, 45, 16, -22, 33, 220, 45, -56, -127, 37, 55, 210, 21, 58, -59, -76, 2, -220, 295, -66, 151, 77, 122, -289, -66, -100, -81, -76, 79, 76, -116, 72, -72, 153, -73, 40, -51, 5, 97, 66, -17, -129, 32, 229, -65, -19, -57, -180, -17, -125, -248, -259, 44, -213, 64, 22, -31, -159, -177, 38, -164, -53, 137, -209, 58, 17, 100, -76, 160, 35, 6, -183, -32, 68, 301, -22, 237, -118, -152, -67, 40, 84, 22, 88, 124, -70, -108, -237, 32, 48, -133, 7, 18, 222, 6, -136, -112, -44, -130, -133, 23, 172, -88, 68, 56, 1, 28, -135, -114, 214, 158, -39, -388, 144, 52, -35, 77, 29, 98, 103, 221, 0, 200, -69, 5, 8, -114, 63, 129, 2, 27, 17, -34, 190, -131, 261, -16, -133, -140, -107, 22, -8, -46, 258, 49, -94, 21, -112, -83, -45, 32, -115, 48, -19, -72, -15, -173, -108, 231, 232, 70, -213, 196, 174, 22, 6, 181, -238, -101, 91, -142]
5146a42M63m64J05O1l1J14q9Nj15p3L57l46J15p8J30q0J03j14o0K53Kk4j12N5
5170C5M0n5o0j1J91q7J70j34j33j02J33k03J60K43j31l03K3K28J13J13l00o9K05
5193F6l02L1L83k92J80j64j51L12P0k29R8J1K68k36M35m05j00k03J42l7m4J76
5215Ik54L06K2J3o1Q7J09m03J27J36k83J07K29k21J27J22j52J51j82OM91k99k59
5238g2K22l91N23k66j80p8L21j41j78L10p6m9K06j80L9O7n9P4p8P1k46J13J0q
5262d6Jj23R7J99k61J67o9K55j83J6j5LJ40j94P5L6j28J01n1K29n13K30J45l33
5286b22K16k9j2j02j6M9J60m9L0J29k53P8P5k3q8n6M23l6j74r5O1j59j42J43k9
5311a21k01M89J12m39M3J50P2q0j84j9K52r0K51j80j83O8K15k45O1NJ04j47JM2
$$ y = [-142, 321, -143, -38, 23, -8, 106, 17, 22, -93, -166, 191, -155, -40, -118, 12, -68, 35, -79, -139, 114, 116, 92, -20, 35, 75, 20, -40, -51, 140, 53, 223, 89, -44, -146, -13, -216, -56, 187, 56, -247, -224, 4, 117, 230, -70, -139, 66, -236, -205, 178, -114, 66, -98, -249, 63, 133, -96, 2, 13, 281, 45, 480, 75, -25, -228, -86, -123, -167, 9, -245, 61, 83, 96, 35, 122, 231, -172, -45, 91, -192, -85, 144, -77, 50, 172, 20, 171, -11, -5, 486, 187, -72, 150, -241, 282, 16, -164, -242, 79, -62, -240, 70, -6, -55, 151, -29, 10, 77, 18, 92, 14, 85, -161, -48, -38, -46, -45, -168, -71, 128, -133, 34, -35, 220, 37, 53, 38, 41, 181, -13, 62, 98, -30, 71, 20, 249, -264, -34, 111, -222, -6, -35, -47, -149, -165, -116, 44, -5, 25, 154, -99, -21, 54, 31, -57, -113, 310, 274, 100, 5, 66, -93, -235, -92, -121, -322, 167, 279, -160, -117, 33, 105, 25, -159, -178, 74, -16, 235, 55, -128, -60, 155, -90, -29, -24, 80, -67, -66, -24]
5335b4J49m1J0j74J32Qj76K4K62l56J19r4J00J7N0m9R3N9R3j06k62J24j41J87
5359DJ84o01N85k5k45J79J2k22K41%j92K03j58J47k96J60K09m35J76L43mk69k93
5382b97K98r6J52K7k9N0M9k29M4j45M04n01M44n4j42J95k66J39k8j4j81K60J12
5405A92l45L29l33J99J37k01L8O1o9n5J7L60n13q6L73k3k19J66K3q7K06j89R1
5428G2o6j99L54j43k66K09J27m3K9l14J26K47k32j22L10l28mK04N9j18j40J86
5450e2m3K28j18J31M6J66n07O0j2K14J44l36Q2j19J37P5J09o31M52%nj98K62k17
5474a32K25k97K17M0j40O9J79J58k29M7p9k48J53j23J49j3P0k27K58j06JK33j18
5497H7Qk36L92k07l23K14j9J81j8R4r7m9%n3M9l4J40k22O7L2K54m15L7P6J75m85
$$ y = [-24, 125, 84, 94, -80, 52, 60, -116, -92, 170, -186, -67, -161, -61, -44, 6, -43, 50, 109, 202, 96, -166, -42, -183, 4, 188, -413, 172, 147, -98, 81, 93, -129, 112, 112, -80, 123, -35, 112, -184, -24, 185, -250, -74, 269, 265, -4, -297, 1, -95, 57, 84, 55, 105, 154, -75, -31, -176, 228, -273, 171, 117, -25, 170, -96, 43, 15, 1, -180, 80, 192, -153, 176, -157, 42, 179, -22, 16, 77, 8, -47, -30, 330, -183, -269, 104, 81, -138, 28, 51, -36, 170, -19, 72, 6, -193, 161, 18, -248, -39, 88, 45, 74, -240, -114, 133, -99, -221, 89, -239, -243, -39, 20, -98, -238, -52, -95, 133, 15, 146, 192, 358, -149, -89, -101, 113, 257, -79, 3, -116, 21, 96, 205, -426, 26, 26, 21, -177, 85, -132, 93, -204, 13, 53, -87, -18, 161, 319, 90, 137, 58, -190, -37, -160, -11, -24, 46, -181, 77, -29, -28, 205, 87, 95, -141, 251, 44, -279, -65, -84, 97, 79, 173, 76, 27, 27, -26, 23, -11, 129, -93, -26, 6, 260, -155, -118, -42, 133, -352]
5523c52M48J30j12q5k46K84j66P3J43k03K55j96L8j44J89L7j70k9K6L6j45J64
5545b5N0j08j87L47j70n8L40o1j67m2qJ32M3J27j52m5j08P5J54l3l39L84j30K4
5569D3k10K35p4R9j07j45J11l4P4OO6k51K19Lm3j3J73Qj69J6J64j40J74l87L17
5594A35q0j50K45j81m8J71j25p9l8K2K96O2j16K0j28k26N76l55Rj05K04k94M1
5617a44L59k39j20l8K80j24N2j31J67O3j48J70m2j87L05m2k31M7R4q1N7k04J51
5640A4J65O3j71j89K52k64P3J28j69J04j6K7k61J63K14o7m2l0m1K14j75j00O2
5663d6jN0k5J73p9j59j34J99O4j6L3k3P6j36M26m71J91k16%J81q3j11K01N2j00
5688D6n0m5R8k63M00l63J96q4q7L30j38l2p2J15o1K90k13j60rJ28j62M94l62J1
$$ y = [-352, 96, 226, 114, 29, -217, 67, -99, -26, 117, -86, 169, -27, 11, -133, 56, 93, -77, -106, -80, -44, -189, -25, 25, -83, -270, 77, -93, -151, 189, 128, -39, -81, -89, 43, 86, 213, 61, 16, -92, -17, 137, 104, -235, 149, 19, 43, -167, 68, -6, 93, -14, -159, -48, -82, -8, -2, 64, -187, 32, 35, -8, -21, 152, 160, -9, 7, 171, 31, 205, -182, 135, 55, -95, 150, -31, -79, 92, -33, -112, -150, -128, 168, 230, 114, 134, 6, -220, 356, 1, 10, -95, 109, -185, -144, 215, -24, -144, -182, 98, -26, 26, -105, 62, 125, -23, 147, 105, -82, 223, 181, -50, -3, 91, 10, 67, -137, 14, 179, 242, 71, -118, 134, -130, -57, 71, -98, 6, -10, 17, -244, -81, 133, 66, 24, -6, -47, 167, -8, -108, -46, -47, 3, -22, 151, 72, -87, -221, -22, 42, 26, 59, 36, 112, -24, 402, -69, 122, -94, -94, 87, 4, -107, 94, 146, 46, -4, -49, 49, -214, 186, -177, 19, -65, -152, 178, 40, 8, -64, 51, -10, 280, 67, -93, -102, 26, -136, 358, -4, 7]
5712GJ07n1JJ1j39K1J00J8%j82L85k45j48K12j43L59m01qj09L08j17k08L57k39
5736a04J44Mq3j41J69M0K2j87k5R8m5O8jJ71J32m53L45k86K76j25O5j38q4L27
5760A89j0j22m4J27l23J3Q4l0K54k90K12P9n7k8J49j18j27J02j08k9J40k8K0j62
5784a07L9l2j36M17j57J5n1n8k37K31J82j74j16J72k44J18M8J65q5j65o4J59j33
5807b13J97O7k26j3J49Q5k01P8J18L0n1J67l87N0J02M8Q4k19L30m14K47p4R3j13
5831f6J04L6o6J07m59J61K75J93l44n3K23k34nL88k98J09q2J75j77K45l07N7M3
5854B5k5m4Mp8K53j30J49j83J19J29l29L28m20l4K19J00J02nj93m1J48k08J70
5877E6K1k99J69R8rrJ06k80l0J31J82k21J22r5r8J90K1j86j76K25K15L5J8n16
$$ y = [7, 114, 63, 64, 75, -64, -43, 57, 75, 75, -107, 278, 33, -115, 97, -46, 313, -88, -96, -205, 103, -14, -222, 135, -104, 40, 44, -39, -180, -11, 29, 51, -136, -161, -63, -108, -40, -41, 130, 262, -191, 154, -132, 144, 19, 84, -54, -138, 189, 179, 57, 13, 140, -183, -170, -86, -116, 138, -152, 60, 139, 82, 54, 203, 85, -42, 60, -48, -77, 63, 35, 55, -107, -68, -100, -236, 181, 24, 39, -12, -70, -307, -76, 106, -68, -184, -12, -256, -138, -90, 75, -10, -175, -239, -80, -213, -16, 51, -175, -188, -39, 46, -155, -77, 41, 71, 20, 187, -200, -150, -48, 0, 84, -135, 195, -219, 28, -46, 47, -66, 38, 74, 8, 115, -344, -183, 92, 285, -59, -112, 111, -123, -128, 260, -38, 71, -11, 164, -13, 232, -75, -18, 25, 0, -44, -40, -118, 135, 5, 154, -29, 90, 219, -110, 218, -202, -236, -17, 83, 185, 180, -13, -54, 94, -114, 56, 77, -222, -53, 45, 36, 27, 133, -147, -177, -46, 136, -85, 37, -58, -156, 34, 55, -131, -307, -82, 133, 168, 186, -330]
5901c30L81p3j51o4J39J48r7R7n3k42L3J17J81L6j69Q6Nk31J62j25M3K01j04N8
5925D8M4k79JK68k72K17L2q9J34k19L3q2L67j79j09J8J68o7O6j7J90m27l6L76
5949A86j48L4L6j52O9r1K47j12Nk53J77J35k6k2k58k6J35J72j25r5M15m75J23
5972d9K48l78O3K11l10P5j59L82J20p9o9j75K88l14K3Q9J32k09K39j44r2K13j36
5995c1j05J01J12o3J52K38l63l6J23l82L94k24O9J64p4J5k23K47p1J19j21J15
6017A56k43J22j75K48l59J29L65k53k00K10j39Q5Q1J05j96j4J08Q3j50j36P6K80
6039A83l31L7O0K4J58P5k87L0Rm1J69k19J22RN4l04L61O6K1m13J83J46k36J8J40
6064C4MN9J4Rk5o1l65L08p5K68k81J89j06k3j05J75L5q5J90rok56J10n0mKj75
$$ y = [-330, 51, -22, -173, -237, -98, 50, -47, 50, -3, -245, -212, -95, 86, 122, -47, 39, 44, -187, -25, -150, -107, 94, -10, 48, 92, -187, -186, 82, -190, 27, 59, -30, 104, -115, -82, -164, 203, 24, -85, -67, 101, 34, 100, 83, 273, -154, -190, 186, 38, 72, 108, -44, 25, -66, 181, 69, 74, -179, -2, 133, 107, 85, -173, -199, -64, 108, -17, -112, 303, -172, -49, 199, -179, -116, 95, -215, -140, -299, 83, 203, 124, 55, -120, 168, -146, -123, -34, 98, -111, 128, -16, -108, 105, -31, -136, -35, 77, 14, 166, 404, 41, 5, 128, -254, 140, -84, -15, 149, 75, 90, -133, 114, 43, 162, 41, 156, -87, 35, -140, 108, -251, -122, 243, -10, -210, 0, -139, -54, 27, 132, -64, -78, 30, 113, -37, -173, -97, 183, -148, -111, -51, -27, 131, 206, -81, -51, -42, -83, 86, -133, -11, -2, 52, -252, 109, 175, 196, -217, -34, 112, -124, -106, 34, 38, 97, 111, 120, 95, 34, -331, -23, -98, 170, -111, 78, -28, -51, -156, 19, 54, -31, 159, 150, 144, -112, -2, -52, -56, -54, -229]
6091b29L59k18K35k09l03M53k21q7NL48q3J18j74q5K57k37Q8J54j36J42j84M1
6113C4k3J0J08l05R7J38J38m9j68q8J40j42J06P5k24J00q6N7J42p1N4j09P4m3
6137c5K14ml74J79J40k26L4J89j97J14J38j98q3pK39j49P5L8m7Q5l45M74l36r0
6161a72K00k6N7j71j8j78L20j36O8J95r3j2P4M1Q7j79p5j47L53k8k57j1J6J72
6185H0k18J5J52J48O2k19k20L30j09K13m05l7K07M3M2o6P9M7k05j77l8M58K5m31
6209b24M08j64P9K3n7J1R4l15K44j88J94j01r6K76l0k48J91j13K02r2P0k4m60
6232c20L40KJ05q5Qj43N2k5R9J9M1M3l2p3k44J04n6p8L12J0K7L5j42p5J74q2q4
6259f8K7J26J12r7k23J63m6J3P7j17O1j89j41L04P0j82J11j01J85k9L5j37n3Q0
$$ y = [-229, 130, -88, 147, -62, -365, 88, -133, -220, -215, 133, 50, 168, -6, -91, 166, -71, 17, 171, 35, 177, -7, 34, 11, 21, 129, -176, -79, 59, 197, 148, -20, -108, 32, -110, -4, 71, -153, -53, -139, -82, 60, -11, 43, -66, 8, -35, 179, 175, -199, -20, 120, -106, -72, 117, -80, 34, 172, -26, -109, -116, 123, -26, 49, 87, 40, 125, -220, 254, -82, -172, 28, 2, 59, -112, -130, -308, 12, -124, -56, 139, 46, 34, 108, 149, 236, 57, -18, -165, 188, 160, -97, -108, -92, 80, -138, -123, 29, 177, 239, 20, -200, 130, 21, 234, -171, -208, -1, 42, 84, 18, 97, 144, -61, -238, -276, 182, 207, -224, 184, 20, 99, 122, 65, 76, 170, -145, 99, -89, 105, 4, -92, 184, 154, -94, 97, -16, 186, 94, 164, 140, -320, 20, 22, 127, 42, 50, -93, -41, -66, 33, 52, 93, 136, 104, 31, -213, -109, -165, -243, 69, 79, 106, 141, -1, -76, 98, 16, -68, -41, 85, 197, 100, -123, 40, -6, 7, 84, -33, 28, -161, -302, 2, 72, -110, 1, -100, 85, 56, 91, -46, -99, -19]
6283a9m0L73q3k26K4k4L0J31o6j54qJ65j2k23J03R0k2MJ84k06J95k07l3J29k08
6308a03oP2r6J40J26j99M5l1P2q5J67k79J49K45m41K81jo7R6j29J24j25J53j38
6332c0J06L3rj84J49P0k23J39J58j00p5j17N1n2K0j26P9K7Nj86K33l2J83k20j2
6357a13l1k9qM81l91K10k9l7r8KP7N3k1M8L8j0p3k52K1J55j79J47o8K7l8K08j58
6384f8j45J56k9Q3j27K97k49j4J95r0J4M3Q5j68n8m3M4k7J06j11m4L19K7k48K06
6409A54j11P8m2k4j22J38k7o2q9J46j2J80k18j39K24j20L37l14k23L88p0N3J65
6432B90j62r2k9j03k9J1K13j38J65j23J4P5j9J12l54%L37k36M5J27J46k69J62
6455A43k20jK18j21j8j61J71PJ10Q5k14OJ74m60L65l5J50m2k41L7M3No6J24j06
$$ y = [-19, -59, 314, 231, 5, 29, 5, 35, 166, 100, -54, -62, 103, 91, -132, -29, 61, 39, 43, 227, 21, 216, 9, -24, 105, -103, -109, -37, -133, 7, 133, -66, -21, -52, 20, -65, 102, -177, -28, 217, -224, 57, 56, -11, 85, -44, 80, -45, 108, -30, 76, 109, 100, -84, 65, 135, -88, 51, 209, 109, 34, -83, -32, -84, -64, -190, -111, -84, -79, -265, -32, -64, 119, -101, -113, -144, -173, -181, 300, -91, 119, 90, 53, -45, -43, 34, 87, 66, 114, 152, 142, 69, -183, -162, -7, -186, -39, -107, -80, -118, 90, -68, -213, -57, -86, -3, -130, 167, -82, -96, 99, 9, 23, 66, 151, -17, -75, -118, -74, -101, 5, -106, -150, 169, 196, -52, 154, 43, 121, 79, 55, -67, 71, 44, -18, -107, 39, 27, 207, -11, -150, 74, -46, 291, -23, -246, 142, 72, 125, 290, 128, 36, 7, -96, -125, -114, 99, -39, 126, 3, 17, 92, 73, 185, -169, -169, 168, -68, -23, 104, 250, -19, 143, -77, -78, 140, 19, 1, -160, 11, 18, 128, 213, -1, 5, 179, -281, 84, 49, 199, 157, -84, -47, -4, 1, -65, 59, -47]
6480d7j9J08M7j79L50m76L5K48l9L2j99k2rK69j71MJ67O2k85j9J78k21J85L2o9
6505c8K71l72j3M22k38j8j4L21m45O6R0l4k7K10j06R9k07N1Q9k05J34j34n9L66
6529B09J41m77J48P4p0J14k61J02J73l38K79K8j49K0n1M1k2M3L9j27J61j80J88
6552H5M3k2q5J05j17k50o6M24j04p5o1L0K24nj29nK19r7r9j1k32J61M9j5K5k07
6578b15o9L7K57J32j5q5k75M4M23l92J06J82j68Rp8Q6p6K8K09j56J03M7N6j44
6602D6R5j53QK4o2k8O2N5L7j0j8l46L59lJ0j11N8k43K79J86k01l3Q8m4q7J35q0
6629B3j53J49J25j41K36J4k06J7n7M1p0L23j96j06j12kJ01L1r7j24K41n7P6l5
6653B1j92MO4K12K4j09j18J82q5J06P1K2j67K29k29j39R5r6Q4L24m02%n7K83k12
$$ y = [-47, -66, 42, 89, -90, 260, -216, -181, 67, 28, 60, -139, -161, -170, 99, -72, -68, 99, 161, -124, -143, 35, -186, -1, 31, -38, 233, -139, -152, 270, 32, 14, 0, 321, -124, -58, 32, -2, -29, 181, 75, 174, -33, 18, 107, -98, 36, -98, -157, 209, 350, -127, 21, 95, 25, 139, -122, -20, 153, -185, 94, 122, -27, -7, -58, -17, -39, 4, 43, -84, 77, -103, 85, 128, 106, 21, 126, 9, -241, -307, 117, 13, -62, -123, -93, 131, 126, -3, -8, 211, 114, 15, 4, -228, -67, -18, -33, -8, -215, -284, -247, 10, 142, 127, 42, -233, -189, 234, -158, -52, 130, -38, -29, -107, -21, -97, -69, 140, -16, 87, 134, 190, 46, 141, -12, -4, 20, -42, -70, -8, 47, 84, 74, 56, -290, 69, 66, 76, -35, 23, -220, 59, 245, 44, 11, 99, 55, -32, 103, 23, -130, 19, 144, 3, 239, 253, 47, 64, 7, 48, -22, 301, 105, -1, -113, -115, -14, 17, -80, -204, 37, -20, 56, 21, -171, -167, -103, 109, 133, 24, -94, 88, 3, 109, 180, 202, 35, 264, 35, -104, -9, -105, -21, 303, -99, -99, -156, 127, -85]
6678h5J5q5j54K67M7J26N7k45O8M8j14j7j15K29R4j54j77J37p4k6K63j07J68j04
6702F2k3p5L31l79J48j16M7L0L3J19k44J07K4j55K21j76K41j04j45P1O5q2qL3
6726B5J06k87P1M11j68k86J33n4p0J61r8J84j18J11r0j72n5J85L1j93L48k06k41
6749b72K33K55k22k9J69N9j93L3Nj10l3J21o3J47k86K78k49J66O4k27j9j09J93
6772h9M1J43q3pM3o3R5k01O3Q7o9%P7pL3o5L8j02J02l9k38K24l3K2R5p5K17k49
6800d0L3K92k59o3J08j98L0O4k76L25M9j92j3J61L8j88j39K49K4l20L34%p6j79
6824b36N2J17o3J72j94k77L34J70o9j35K87j68j27R6j65J33K58m5l19K73r2j28
6846a26J87m5j41J23r8K12m8j01Q5J14K5Q6k38R3kp9M0R9l60O5K60q2J2k77K88
$$ y = [-85, -70, -155, -309, -42, 5, 131, 188, -57, 11, 59, -55, -72, -187, 42, 136, -18, -195, -58, -132, -158, 105, -2, 166, 62, 39, -36, 295, -84, 64, -52, -5, 25, 58, 177, -67, 40, 64, -91, 130, -46, 195, 91, -54, 17, 82, 0, -8, 25, 131, -156, -85, 326, 158, -128, 5, -49, -119, 42, -56, 128, 10, 121, 31, -141, -196, -11, 20, -173, 175, -31, -272, -39, 216, -6, -35, 134, 193, 0, 33, 38, -72, -105, 16, -47, 100, -186, 92, -157, 9, 73, -154, -173, -282, -89, -48, 95, 12, 5, 48, -15, 80, -121, -58, 29, -40, -40, 37, 30, 63, -2, 36, -66, 36, -3, -241, -17, -50, -28, 67, -8, 209, -40, -7, 285, 26, -37, 71, -127, -97, -33, -309, 16, 65, -127, -140, 21, 59, -129, -268, -19, 5, -315, 19, 19, -57, -236, -184, -67, -130, 42, -152, -429, -95, 75, 6, -129, 158, -10, -137, -41, -206, -73, 185, 140, -179, 94, 2, -126, 61, 16, -125, -2, -100, 112, 64, -37, 48, 162, 187, 273, 35, 128, 126, 47, 87, 186, -174, -109, 151, 69, 81, -196, 92]
6871I2R1j76m7j31J29j2m8J06kJ14j88PQ1k26L12Rpj22L52j57m7k64M3K12k24
6896a03J06q0O4k27L64k1J09o4q8j35j89N63k93j03o8QK22k00K20q2J69P6k79
6919c1K3K10j28Q8j05J39j42Q6J0k46M3J70j35Q6j92K09P6j15m0PP5q5j21j41
6943b59K41J14j35J41K5j67K87m02K76p1N6j89mK93k52J11j8O6R2k81K3N7l70
6966c66L35RR8q6J50j65m8J15l5N7j33L8N5j39j20L92p3J42k20M0J16l39P1PK05
6991A06j70k6j47K7K76j06M0L1j74J18j3J26k18P4K6RK42l48K87o2qJ1RK6j77
7016d1J31K8j8p0M6N1ok85J52k68q7N16k84K2KO1K30l00J36K47j35q8O1k10Q0
7041b9O2N6k6r6j42Q8K21k38J17k50N27n25J52N1J21O2j83J81n4k38J33n4J22
$$ y = [92, 183, 7, -40, -171, -42, -54, -102, 4, 2, 116, -72, -65, 16, -210, 102, 111, 104, -18, 334, 177, 130, -134, -91, 121, -103, 3, -77, -13, -240, 124, 103, 212, 148, 60, -75, -264, 299, 6, -97, -165, -157, 65, -135, 85, 3, 172, 248, -31, -8, 202, 74, 162, 57, 196, 54, 140, 150, -96, -53, 117, -18, 68, -124, 85, 161, 46, 6, 13, 88, 3, -118, -259, -18, 96, -39, 102, 127, -40, 247, -155, 121, 50, 106, -83, -87, 206, -46, 65, 47, 113, 205, -76, -53, 4, -366, -31, -22, 76, -10, 140, -25, -73, 42, 7, 64, -69, -31, 24, -115, -235, 157, 84, 226, 6, 46, 162, -177, -106, -99, 106, -64, -90, -237, -210, 66, -40, 0, 31, -143, -25, -38, 88, -130, -56, -30, -21, 221, -127, 160, 98, 90, 101, 110, 136, -41, 90, 118, 100, 30, 76, 127, 121, -164, -12, -280, -367, 149, -135, -113, -111, -50, 180, -120, 16, 263, 128, 40, 101, -109, -29, 33, 89, 63, -33, -175, -87, 134, -104, 13, -237, 290, -235, -83, -32, 89, 151, -32, 149, 95, -143, -10, -64, 58]
7064E8p8q1L31j27n2o4K04J3k21J21k58K78j52j57J94k67K55k22J90L4M0O5p9
7087B5K81l27R2j32O5j24J94J9j99J9J28K49k53J63j11JL2k03Q8R8j23N0o9q8
7111a25k8K27N1q8J25l0r8m4L00l90m4K21k05M7j64L02j03kl1K80j4m73K81N7
7135E2q7MJ16K13m69L12n1O2j02J50k27kJ73k53J37j65K86mk43k58J33P7J87k78
7159b37K89K4J10k51Ro8P6Q0k4l0L20m42J07K9J17j81J58k22K08M5m5J75m25R1
7183h7J57K34m18j3l3mJ31J69l16K67j45Q8J61l14L3K83l00J34r9J7k17L72N9
7206A59k24J6J71K5k51K07q9l8Q3k25J27o2J08J55j51K22j66j60J29J30j97N7
7228B6rp9lR9l0k04J61J01j50J18p3j77K29q2K4l8o9K18m9q7q2K5K37O4k94N2
$$ y = [58, -20, -101, 230, 103, 51, -13, 191, 204, -17, 104, -154, 124, -28, -185, 9, -258, -3, -225, -35, -1, 39, 104, 25, 306, -21, 71, -61, 4, -120, 74, 93, -106, -87, 41, 290, 37, 200, 89, 90, 122, -81, 7, 105, -18, 32, -37, -125, -153, 74, 125, 37, 162, 132, 34, -10, 290, -100, -144, 77, -128, -81, -245, 57, -46, -48, -79, 201, 187, -286, -5, 52, -35, -31, 85, 298, -171, 141, 90, 152, 50, 200, -27, -29, 144, -109, 28, -137, 149, 145, -98, -356, -223, -146, 41, -237, 52, 76, 186, -65, -56, -124, -48, 32, 8, -22, 298, -144, -37, -8, 109, -72, 86, -136, 72, 117, 72, 247, -178, -87, 70, 304, -114, -127, -160, -164, -33, 136, -180, 87, -58, 30, 191, -123, -90, 193, -107, 27, -72, -55, -272, 100, 159, -65, -49, 122, 147, -104, 103, 14, -24, 59, -166, -39, -101, 7, 162, 11, 233, 67, -93, 36, 166, -31, 26, 17, -62, -65, 34, 4, -200, -39, 62, -88, 30, -43, -220, 9, -73, -49, -87, -156, 62, 13, -74, -156, -131, 106, 170, -124, -72]
7254g2Q7J6k07J70pk45L31K9o6P8m4j81R3O3P7k75M8k3J40j1j17q3L43m14J2J95
7280f3J0J89j29j5j67J28Q5k3J6J02k56L36k73K2K50n7k03L05p1m7l23R7K4N6
7304gQ2p4J04PP7j66J04k50J28o7L05q6J02k53N7m6j69J86jl4j66K28M7k6l01
7329b19J69j55K37J08k27N3N0K30j81o8j59K06J86l26J11O5p8q2j38K35M0k2P
7352D2J27l17L53k89J7LM3K33R8j24k76J27J5P2Rk60J13K9P4j03L8l4nr2j31L82
7378A44j15j63K50j21j89L36k04P8k5j35J94l04K08j43O9J65j67K88M9j5k39m1
7400h0n3J21R5j46J42k34K62p1j71N8M7Q2o8k93K50m9J79j19nQ6r9K81k17j9p8
7425i9K1J12q6p1K47j0l1L0j3l2j91K89l41K22p4j54j43K96q7n2J45J04j29O9
$$ y = [-72, 15, 31, -176, -6, -13, -258, 73, 102, 36, 114, 70, -111, -18, 45, 122, -153, -105, -128, 12, 1, -116, -199, 144, -270, -258, -63, -53, 136, 7, -8, -175, -47, 38, 15, 31, 133, -123, 213, -60, -38, 212, 155, -48, 257, 186, 139, -184, -87, -63, -7, 75, 1, 105, 112, 189, 23, 127, -123, 5, -62, 243, 157, 259, 6, 63, 17, -152, 34, 33, -1, -167, 61, 108, 82, -219, -50, -205, 32, 140, -87, -34, 16, 246, 65, -3, -162, 44, 230, -96, 15, 80, 2, -80, -218, 17, 57, 35, 42, 169, -148, 205, -84, -67, -64, -21, 212, 310, 186, -90, 37, 52, 124, 133, -127, -14, 15, 89, -14, 24, -10, -15, -107, -238, 144, 29, -134, 116, -5, -194, 142, -62, 16, -9, -144, 50, -254, -46, -189, -120, 45, -122, 166, 215, 200, -39, -80, -133, -12, 83, -63, 79, -155, 107, 36, -135, -77, -30, 52, -16, -309, -59, -108, 71, -48, -53, 33, -66, 215, -2, -21, -99, -78, 34, -52, -123, 124, 114, 83, 113, 100, 68, -123, 166, -175, 47, -27, -181, -324, -28, -115, -167, -22, 82, -47, 22]
7449B2k06l2K04p3r3J94L53l91K6p7K60k02J33L7j60n6J88m21L16j34J70l9n0
7472c1J60l25r9M09p6r7K21j59q7L2J19J32m05L27P2j27j71J50J58j30j76j50
7494b53K06M9R2k03J02K1j69J92J09j20M2j08o9n1J63j88K3pJ69j15J36k09R7
7517i1J88J01k79l8l2K78l9l3k03P4ro1N58m50O3k98J34J72J55j63j62M53m17
7540i9P4L9m7L27k32j16o1j52J76q1J30p9j30K87j43L9nq4j46L90q5K27j94R1
7564A26R3l45L2k5J94p5n5J50j45J30j13L11l67rKR8k63J02J90l7j16J44Llp2
7589e0J02K28k59j15J97q4j11R3j51J56k7j80M22k69m6J59k36L62l37mK71k78
7611a57J43j21R9k6K64r9k25J79j55L20k35m1P0o1J83J6j25KQ0r0q5K79l34Q9
$$ y = [22, -184, -216, -12, -85, -178, 16, 369, -22, 4, -73, 187, -15, 118, 155, -5, -61, 127, -294, 22, -112, 58, 19, -31, 129, -196, -295, 114, 38, -59, 162, 3, -84, -52, 67, 199, -206, 121, 193, 66, -105, 45, 203, 73, -103, -253, -47, 2, 94, -109, -7, 14, -155, 37, 146, 26, 68, -40, -109, -160, 3, -185, -162, -169, 0, -115, 21, -188, -91, 97, 198, -81, -119, -151, 127, 88, 55, -148, -74, -83, -144, 414, -36, 27, -271, -137, 35, 190, 27, -135, 318, -99, -25, 14, -33, 294, 62, -54, -115, -267, -91, -172, -42, -121, -251, 36, -107, -68, -73, -157, -303, 87, 2, 229, 35, 126, 219, -126, -94, -119, 75, 0, -55, 95, -50, 80, -33, 278, -89, -98, -96, 2, -261, -159, 31, -6, -122, 22, 25, 22, -50, 52, 280, 21, -94, 103, 19, -92, 1, -150, 6, -21, -201, 221, -48, -94, 65, -171, 191, -146, -150, 121, -157, -14, -135, -36, -62, 202, 103, -122, 57, -98, 222, -13, -54, 16, -45, 138, 154, 29, 31, 111, 21, -64, 215, -119, -30]
7635c0J38RN9l71P4K08k19K34j02K18k84J62J7j19p5j17L52k46K96l42K12j91
7657a17R4M3j16K16l5lk00M6L1J67l76J60P8Q8j85J46J16l05j6L42k54K54j57
7680A7p9oJ19l5k4K67k22l6M2P6l45o9L15k60J17Q6N5J43j44j8m4Q8PM0j72n1
7706a33R4j17L04j58K44k63M0n1O8l6r8J11J73m83L98j29n4j63L57M8j57j10J60
7729D5l9j23J87k53K21Np1k40M05p3l4O9j96qJ90r1r1p3M19l90K34q5j9Q7j97
7754a21J99j35K24l30K75Qo8k12N2J10J15m0l28J31J05K33j98k00K72k09K22j2
7776I3r6n2j0J59l46K01j1J0o6J70K02m12J16J8J85O3k57J36jr0r3j5K58k57J13
7801A8j25J54L4k70l6J72pJ75j19j46J01K48K5m19N56m36J44l22L15K4j53j6J58
$$ y = [-30, 108, 117, 176, -195, -121, 87, -132, 102, 0, 218, -66, 96, 113, -6, -81, -198, 154, -92, 204, -138, 74, -117, -23, 20, -96, 120, 85, 82, -118, -72, -41, 126, -250, -90, -12, 76, -109, 37, 153, -152, -168, 174, -80, 174, 17, -62, -68, 51, 16, -8, 259, 37, 1, 43, 119, -226, -295, 20, -240, -123, -37, 18, 161, 17, -1, -45, 43, 50, 90, -82, -133, -39, -156, 148, -10, 234, -29, 11, -40, 28, -8, -106, 5, 178, -305, 93, -36, -90, -253, 104, 152, -5, -115, 45, 6, -117, 70, -183, 38, 43, -28, -268, 137, 64, 30, 99, -97, -105, 85, -6, -97, -170, 249, -141, 93, 8, -11, 76, -121, 78, -57, 167, -163, 112, 120, 52, -160, -108, 2, 117, 77, -251, -120, -15, 218, 20, -180, 92, -117, 105, 93, -3, -55, -65, 94, -252, -51, -62, -52, -118, 52, 254, -158, -42, -24, 161, 224, -33, 103, 102, 12, -81, -96, 162, -95, 18, -107, 47, 81, -189, -225, -53, -60, 115, -4, -150, -49, 199, 224, -195, 361, -75, 69, -253, 62, 86, -67, -83, 75]
7824G5P4L2l60m2K78k00K55j36j67J97J89k84K21j37OL4R1j98K73l44J8L12k5
7847A62j25Lj02J44j12k46j68L73N1J64Jj61PM6l0r0N7M3K62k99J17l65K89q5
7871f4n2oR5K48l84K50j11M3K22j96j27J98j33PK22l36J41L1N3m8j83J1J52j77
7895a44J3J04k5M4J26k16K20j29j41J85j65L13j13n1o8J49j62J69j63j34J07M
7917g7J99Q8l19n0j96L80m5R5k16K95o0l40K07K50J10m16J70k90K69k84J6J03
7939a11O4n6N1On6J08J19m0k08J50j53K07q1O2K70m04K39j60m6J3K21J19l84m2
7963a12J63n1k08J50J16p1K91k33J57j86L1L5J10k58J47j65J95l05J27p7jK32
7985H7J80k81L30j69o4mj58j73K49j12J17j26J30j89L10J7l03J91pJ8o6j28J5
$$ y = [75, 149, 181, -179, -221, 57, -143, 112, -24, -191, 6, 195, -89, 132, -5, 1, 35, 126, -72, 201, -143, -125, 187, 162, 37, 40, -62, 82, -30, -276, -444, -71, -20, 144, 145, -16, -9, 37, 7, -83, -26, 17, 279, -20, 97, -268, 21, -64, -116, -122, -27, 221, -163, 87, -24, 19, 241, 45, -82, 116, -17, -10, 212, -124, 17, 48, 101, 53, -130, -119, 33, -144, -131, -27, -52, -8, 118, -98, 122, -7, -148, 37, -128, 185, 72, 21, -47, 102, -60, 109, -54, -188, -81, -77, 122, 210, -109, -159, -355, 25, -20, 75, -141, 154, 94, -246, -39, 211, 321, -95, 75, -215, 54, -230, -214, -111, -47, -103, -52, -46, -102, 6, 125, 85, -123, 27, -126, 81, 0, 62, 332, -72, 167, 7, -39, -26, 195, 314, -70, -112, 51, 0, -208, -58, 58, -13, 278, 45, 202, 16, 47, 82, 192, -66, 81, -84, 111, -194, -67, -144, -145, 87, 267, -14, 316, 147, 83, 79, -79, -252, -3, -115, 2, -124, 6, -183, 127, 144, -159, 32, 25, 43, -23, -151, -136]
8008a36j36K62j43L2R1J78l16K58j8j90K67j07j54J67p9K07l24Q2J55l44J80J06
8030C8k52K89j66O6Q5q9j17J83j48P1J75pl6m6j78J99m6m6J23j60k28M67j83K6
8054B0q6lM59l19q1o6J96r9k8K8k26J68p5L2J99q7ON3j02j17K96j01m3l01M03
8079A26j7Jk38N8N5k62M00k9J31j32m8k27L08r1OO3j11J5O2Nj34L0J71k27L12
8104B27r6o7q3J89j46R0k52K04k99M8K76k01mN0M8K16j40M5j92L1O3P2q7O8O7
8129A27o6q0J25m4j05j10J86K9j5j13J03j29O0N5o7R0r4j28K87qn7oJ59j23j19
8154d3mJ16j24L6J08j03n3M4J95m3N5l00J40j28j92K82j05M28k34o0K5Rm3k9N4
8179C1MJ6j75J75m4J20k63j0N4P4J89j
$$ y = [-136, -272, -10, -153, -121, -30, 148, -168, 90, 72, -118, 149, 42, -112, 55, -24, 183, -141, -59, 96, -248, -68, 38, -214, 75, -91, -25, 60, -29, -146, 37, -111, -40, 135, 128, 92, 46, -132, 67, 21, -25, 98, -62, -290, 177, -6, 20, -66, -69, 390, 71, -10, -76, 120, 21, -7, 21, -205, -37, -112, -80, 119, 32, 38, 91, -11, -128, 168, 67, 24, -277, 126, 109, 110, -128, -70, -15, -277, 123, 94, 225, 93, 45, -182, 126, 35, 41, 104, -7, 8, 70, 75, -59, -29, 142, -85, 227, 131, 64, -19, 170, 24, 114, -138, 66, -233, -185, 91, -110, -114, -64, -16, 200, 60, 105, -87, -56, 7, 79, -8, 60, 127, 61, -19, 106, 62, -43, -153, 33, 62, 47, -66, 37, -92, -32, 23, -44, 46, -48, -176, 111, 103, 46, 40, 199, 76, -43, -47, 69, -55, -19, 89, -14, -67, -23, 172, 129, 184, -116, 24, -104, -296, -14, -119, 309, 75, 15, 40, 49, 6, -23, 31, 35, 51, -124, 51, 7, 127, -136, -146, -92, -18, 171, 170]
8191A70
$$ Imaginary data points
##PAGE= N=2
##DATA TABLE= (X++(I..I)), XYDATA
0@%%%%%%%%%%%%%%Qj6J6j6J6k4L2l2L6m4N0n8P2q1Q9j04J20j36J55j79K01k25
36a20K54k84L18l54L93m36M82n34N90o51P21p97Q77r66J065j172J291j427J578
55H28j747J941k163K422k730L101l557M134m894N941p480R964j4615K6202j06215
70h8868j66516L00154J70629j99292j62151J06824R1434j5601j6531j9993p5120
81g5031M2428J39044j3953j75574k9579J67613O0828j26588p3734P0266N9480
92D5200k4538k1972k2245k1980L6655O4762l7407q8416L3385Q5385k3675n9487
104c4333L0469K2588m6463K4441O9892n3186r5637P3677J13537p9294j16619O6236
116b4692J03865n6195p4337M6267L0189m6382P624N4329m7753o7449P6675Q3232
$$ y = [0, 0, 0, 0, 0, 0, 0, 0, 0, 0, 0, 0, 0, 0, 0, 8, -8, 8, -8, 8, -16, 16, -16, 20, -24, 26, -32, 40, -41, 48, -56, 64, -72, 83, -96, 105, -120, 134, -150, 168, -186, 207, -229, 253, -281, 309, -342, 379, -418, 459, -507, 558, -614, 677, -750, 828, -919, 1022, -1141, 1281, -1449, 1652, -1905, 2229, -2665, 3276, -4204, 5760, -8855, 17347, -88868, -255384, 44770, 215399, 16107, -146044, -39220, 52214, 36613, 20082, 89, -75031, -32603, 106441, 92488, -83086, -112665, 54948, 115776, -10812, -84546, -14280, 45200, 20662, -1310, -23555, -45535, -8880, 55882, 18475, -69941, -36556, 48829, 25154, -34333, -3864, 18724, -27739, -3298, 66594, 13408, -82229, -8552, 104985, 25691, -90928, -24692, 79173, 22978, -51359, -5092, 25097, -21285, -13661, 40668, -7085, -74534, 2141, 85373]
128H5373q7786r6415Q8956R9044p5022q9809N7319P6329l5552m8739J3586J7202
140D486K390J4398j0728m3584J4889O3072j3307p6324M400P6819J436o2773n383
153c0209M2164K351j6871O643j1994k0306L6424L8636n1784n5143N8101O2272
165F0284n5823o1074M8497N0744l9581k9763L1728O179k9535J6871L3677l3080
177h76l6269M2052M0308m2805l8344L6417K8313k7485j3868K0630o930k0195K3813
190D761K1745l7465k8972M2156L3595l6560l4664K4515K8361q732j1731m294o801
203a4086J4940K9868j4021m8306R032N8767J004n9115j0373M9446J3101l3266
215c009j2520J1797K078M798J0737j8428k5480K3297L6572k3231m1200J8867L9870
$$ y = [85373, -2413, -98828, -9872, 89172, 14150, -75659, -18340, 57989, 22437, -26302, -12716, 4486, 6876, 21274, 10546, -33038, -18149, 44923, 31616, -44708, -40308, 36511, 37947, -24826, -30209, 11955, 14306, -2565, 4078, -7916, -28222, 8202, 46838, -4946, -60089, -1988, 60284, 4461, -56613, -8116, 42628, 3047, -26716, 5012, 11191, -18344, -1473, 32204, -876, -37145, 4907, 45215, 2410, -35934, 483, 28796, 1311, -12557, 8073, 1143, -19052, 4761, 26506, -10959, -39931, 2225, 35820, -740, -35404, -10889, 17472, 8740, -2991, -7285, -14086, 854, 30722, 16701, -31605, -22573, 36194, 37198, -21917, -32290, 17156, 30257, -3009, -15529, -3732, -1654, 3144, 13881, -4547, -30027, -6730, 29842, 6611, -34589, -15722, 24148]
228B4148j1114l0687P429J9663m853o241P107m211j0028J2884J3743j7353j6418
241a5931J7856J6083j8336j2905J6958O297j6901o63J6443o573j5982J1338J5066
254A2750j3957j2682J4402R283j2954m240J0618j399q093P904N909j3030m955
267a0444J7902N289k0273m690K0554N218j8252m322J4676K514r513P95L424m991
281b113J114R238o070j3825P574J5535q640j6803P196J4869n649j1836M336P376
295B302k727j728L847k706l847P584O092r462n933J1447P065j1511n999J0060
309D484L774r391j898O471j876n755L349K920o042j964O834Q8o872J385O457j868
325I6n738M073N505m201l831O184L790o102k389O639J588n647j082M320j042k907
$$ y = [24148, 13034, -17653, -10224, 9439, 4586, -1655, 5452, 1241, -8787, 4097, 17840, 487, -15931, 1925, 18008, -328, -13233, 3725, 10022, -6879, -7542, 8901, 2328, -13654, -2316, 12750, -1207, -13889, 513, 9796, -3158, -7398, 3220, 1821, -6272, 1632, 7541, -5489, -10444, 7458, 12747, -7526, -12216, 8338, 13556, -4696, -9018, 5658, 8172, -1341, -546, 2878, -2113, -999, 8239, 2169, -11656, -4082, 11453, 2813, -13990, -6794, 8075, 2426, -9410, -5074, 2302, -425, -2153, 1694, -1012, -4859, 2725, 8817, -645, -6578, 4869, 11934, 423, -5576, 4484, 8258, -1133, -3031, 3440, 1564, -4191, -842, 2078, -3964, -5928, 906, 994, -5878, -4493, 1964, 96, -5642, -1569, 3936, -265, -4096, 2088, 5878, -224, -2613, 4026, 5614, -33, -1115, 3205, 2163, -744]
341g44K321M55m750P65N821k362p139K060P054j847o737J531M539k38k313O36
357i48j67o51K252K578l112l939M026M434k579m506K253L467q92j288N82j208
373C02j151K858K226m226l165L047L580k262l498k07J485R66O46j567l204k39
389d409N331K153n303m483N137O471j725o202JM636K870j044l248k488L127N295
405F119j149o641j803M503L800k482n283k144M271M230k730o607k71O169K665
420B647l390l993J689L747J279j597j795J14J943K556J089l692l398L658N260
435F117k746o021P40N350m33m744J5K305j105j948K139K021l704k535L662L581
451B694l450l909K259M203l73k711M08J747j247p78L251K419m535m436N695O803
$$ y = [-744, 1577, 2032, -2718, -1953, 3868, 1506, -5633, -3573, 3481, 1634, -5103, -3572, 967, 729, -1584, -948, -1115, -1766, 486, 3064, -48, -3987, 39, 4473, 1894, -2612, -359, 3108, 2216, 928, 1510, 302, -849, 2009, 4235, 9, -3156, -109, 3471, 1209, -2289, -2496, -1011, -45, 601, -966, -4170, -4409, 922, 3075, -2228, -6711, -1574, 4897, 3172, -3030, -3029, 1607, 4477, 3433, 185, -2303, 824, 6119, 4970, -1671, -3474, 1029, 4829, 2347, -2936, -5080, -809, 3421, 691, -5916, -6187, -18, 2647, -743, -4736, -3047, 700, 1979, 382, -1413, -1299, 644, 3200, 4289, 597, -2801, 857, 6117, 3371, -2650, -1910, 3440, 3007, -1737, -1722, 583, -522, -2470, -331, 1690, -2014, -4549, -887, 2694, -756, -4665, -2406, 1797, 1424, -1287, -879, 868, -379, -1157, 2094, 4513, -22, -4458, 1237, 8040]
467H040n720r388L849J0063j88q422k797M371K694o40j717l160j700L900O129
482E314j720j1273l391J2607J0461j0999j4936O980J7692j771j5126k670R489
495F57N487o04l127n793j937Q839Q447p471j4762J470J7217O212j5828j4622R722
510f093J7791k948j7292l210J1545O427l753n330l487k01P808Q297o118j3540
524a0104J597J7376N896j5976j3578J1397J8492l447j8953k895J4097N479p924
537A457n148M77K71M197P273o559j5606L658K0146J206k0302o244J7420J0962
551A3208j1250j2705L692J1433K824o730l900K214K561J546R91m089n344M481
565a068J0311k532j3025p80J1215L326q976m895N738N621k751o175K39M601r81
$$ y = [8040, 2320, -7068, -3219, 6844, 6656, -1766, -4563, -192, 2502, 1862, 145, -3015, -4715, -815, 5314, 3594, -7679, -11070, 1537, 11998, 999, -13937, -6957, 10735, 8964, -6162, -8832, 657, 6144, 5540, 2413, -3380, -5317, 3522, 11969, 4498, -10264, -8794, 8423, 14635, -1193, -15815, -6093, 11698, 8750, -8542, -11752, -207, 6220, 2467, -2863, -6350, -6551, 1257, 9554, 3436, -10104, -8507, 8869, 14765, -1211, -14789, -3392, 15100, 11653, -7300, -10195, 3902, 9381, 1457, -3691, -3214, -2943, 1254, 8527, 1968, -13638, -9980, 10166, 11372, -8930, -15174, 2246, 13208, 1958, -10747, -7055, 4378, 7202, 472, -3428, -1214, 1347, 2893, 3884, -205, -5549, -1068, 9243, 6711, -6314, -7094, 4121, 7447, -1529, -6424, -686, 4935, 2184, -3991, -3752, 849, -132]
580a32l265K685M432n750m581Q030M979r292m879J0265N333r015l603P612K265
595E084o603n22N614l86m876Q83M766j512n772K34N307J93n651n8M744j01n018
612c674qM582m07m228J598M321Q4l552j482K651L053m20l319m18M098K158m512
629E25k769J755K303j05M68j444m346J348O671j704r765M76J0704J876r434m024
645g465O680L926k918k480K59J528J699J347k114l245R17M912J961m692l581L621
661C55M348j896m402j26K147J126Rj716j788M45K744J27l503q12K165Q02N8j22
679c9j553j781L360K882k840l834K860M892j571l727J81K306R02J64r17k034J95
696e54L271J14l645k006L707K377k984k998J468J714p81j109m12N55P34K42Q4
$$ y = [-132, -3397, -712, 3720, -2030, -6611, 1419, 6398, -2894, -7773, 2492, 7825, -1190, -4793, 2819, 5084, -1519, -2041, 3573, 3187, -1689, -806, 3960, 2448, -3324, -3090, 2217, 2410, -3241, -3299, 1445, 1344, -3674, -3682, 900, 493, -3735, -2137, 2184, 2268, -1284, -2766, -115, 2938, 2518, -801, -1219, 2879, 5037, 525, -2244, -489, 1814, 1709, 2177, 733, -3613, -2265, 4406, 2702, -7063, -6587, 4117, 5993, -3441, -7465, -785, 3141, 223, -2257, -1998, -470, 1229, 2576, 462, -2783, -1866, 3046, 5007, 315, -3266, 355, 4703, 2807, -1595, -1721, 426, 1552, 1561, -155, -1943, -1498, 1246, 1373, -2130, -2942, -777, 25, 83, -39, -1592, -3373, -13, 2869, 29, -3805, -945, 3947, 2376, -1351, -1170, 1136, 2038, 2202, 1285, -749, -554, 2717, 2831, -814, -2820, 887, 3264, 280, -2718, -1250, 464, -317, -1426, -1838, -1283, -549, -307, -223]
713b23q08k64J199R72j058o47J766Q21j511j38J608k18j490J059R30j342q00P53
731F09l7j323N06M79j157l96J482j3k134j8K046k09j274j15J382N32o67J28o2
750b41P20M42j40k34j51P73M69p63j195N06J755j162j701P73J163r57j014P17
768b40J24o26N9L11n31k06O39L56q19k36J462J34r56L19O93o2o85L87J130m6q58
789C49L38L51j57l42M65p38j47J46J49j109j88Q53J62r67p72P47N81o43j86K19
809h89q7M14M32l84J83K96J130n57o39Q04J093m97j384P87J006p03r64M00M44
828H85m20n93j72j8l95L08R8r79n46J321N12q69q65J186J150n13j003O44M24L28
848D83J04Q7o71Q3J443L48j294j036J321N04j041m57K84l19r2Q23m39j486q8J387
$$ y = [-223, -1031, -1295, -96, 876, -182, -829, 937, 1758, 247, 109, 1717, 1499, 9, 1068, 1998, 656, -144, 609, 572, -751, -245, 234, -923, -1319, 163, 150, -1984, -2002, 44, -165, -1439, -1554, -172, 360, -307, -179, -241, 479, 921, 781, 547, 396, 1169, 1638, 875, -320, 186, 1941, 779, -922, -149, 1014, 57, -957, -240, -116, -742, -683, -372, -903, -1109, -470, -114, -933, -1169, 293, 427, -529, -210, 483, 421, -264, 123, 1253, 1207, 349, 687, 1038, 881, 539, 1004, 266, 119, 265, 414, -695, -883, -30, 132, -835, -1607, -860, -279, -922, -1108, -889, -976, -562, -130, -514, -331, -35, 1095, 538, -101, 703, 1796, 1299, -85, 702, 1708, 1005, 41, 441, 885, 465, -128, -300, -318, -713, -405, -307, -1286, -1832, -511, 1, -868, -1733, -547, 603, 90, -913, -269, 155, 483, 587, 674, 3, 86, 1529, 1877, 583, -453, 868, 1372, 331, -126, 158, -161, -253, 570, 131, -1355, -1443, -56]
868e6N11j692l64R28N74j61l7k68m70J268J064q55j443P89J810K2j661j55J162
887I66P5R7m17p68k14P59P22j282j401R63J074q10j548J012R76j021m56J603m69
906a39j748O28K575m46k310O43K267m96j638J367R99j900M29J930m44k525mK456
924A644n9j999j007J163J083o42q98q88K31Q93O77j189o97M41J053M99l49n30
942e74o73J390K147m44k988l66L766R59l498j634K867J943k274j208J185m67j594
959a463K090J749l758k853M424L591n189l783M182L741k573k750J646J185l40
974a01L94J91j481j86K464J579k007k140O88K806O90k853k330K332K881r97l050
991a120j371K325J661j125k018J88J371P2q48L73m30j731K320L679k731n206L408
$$ y = [-56, 455, -1237, -1601, -673, -99, -260, -297, -565, -1035, 233, 1297, 442, -1001, -212, 1598, 1620, -41, -196, 966, 1041, 1138, 721, -47, -261, 498, 1220, -62, -1463, -500, 574, -236, -1784, -772, 204, -817, -1273, 330, -139, -1887, -1259, 1316, 870, -1440, -797, 1470, 974, -664, 703, 1702, -198, 231, 2161, 1717, -808, -812, 1644, 1585, -414, -1421, -258, 825, 183, -715, -1603, -1372, -479, 198, -991, -1688, -1247, -194, 305, -44, -574, -1247, 143, 2290, 1846, -1142, -1508, 2258, 3217, -281, -1915, 952, 2895, 621, -587, 598, 131, -1463, 627, 2376, -1382, -4235, 189, 3780, -1409, -5192, -1010, 2731, 158, -2592, -946, 239, -101, 293, 484, -997, -1183, 1281, 2860, 853, -1287, -599, 2207, 2897, 44, -2286, 46, 2927, 1930, -1120, -2491, -166, 1495, 370, -1648, -1460, -89, -17, -865, -492, -922, -2653, -333, 3346, 615, -4591, -1183]
1008a183O229l585n554L203N051k502l248K764P80k771N54K822j167l785J387
1023a005L845j270m387J59L603Q23l355m41K003L67j382k81O47j64M47J414n20
1040E03r89L91O35k50J59O04o71l11J854k80k905J91L261p81l603J439L334j961
1058F20l956K785K725l483k210L834J928m013q88L823P8l691P07L668r06k896
1074a875J975K630j789k874J708K278j018j164Q76P83j815j99J209p00j540J107
1090d08K142j721j879J092J094j267L84J042j618m41K649M49l827j91M320N11
1106B331l498O12K515q07k004J814M57k436N59L271q76m068R51L469j353l140
1122b203Q62K443o66j766N19P78j593j37K262k5k041L95K912q91k381L77L041
$$ y = [-1183, 5046, 1461, -4093, -890, 4161, 1659, -1589, 1175, 1955, -816, -262, 2560, 1393, -2392, -1005, 2840, 1570, -2817, -2658, 945, 1768, -1587, -2028, -25, 342, -1040, -1321, -674, -838, -391, 1023, 503, -486, -95, 540, 290, 449, 1053, 382, 71, 1925, 1645, -1260, -1069, 2192, 1411, -2192, -753, 2581, 620, -3336, -551, 2174, -1309, -3519, 315, 2243, -1770, -2658, 1165, 1243, -2448, -1741, 1927, 1021, -1875, 100, 2730, 941, -1933, -225, 2053, 1035, -129, 747, 1530, -285, -484, 725, 25, -1515, -408, 1734, 13, -1866, -774, 320, -947, -563, 479, -1139, -1580, 1069, 1518, -2309, -2500, 1820, 2331, -1167, -555, 1960, 1153, -851, 963, 1420, -1016, -457, 2814, 1938, -2130, -1179, 2290, 937, -2203, -1341, 1102, 436, -1330, -811, -33, -1626, -1763, 499, 474, -1567, -1172, 1740, 849, -1532, -1155, 1886]
1139A886p80j746J466O70j756m5K413p65k868J700K290k293k087K113R83k270
1155a089m91K516r76j975J809J587k480j525K911J110k886L28K199k89j656M71
1171d36J356n40j002J387J254k225l75J913M82k616m79K791nk795M94J808j104
1188i2j839J793J043k286k57K485l72k683R38K592r91k031J528J891k125m25J813
1205I82M6j585N14J835j008j543J490R93j884q12J520N03j954J38J385o63j355
1222a398N55J308j110j146J567R69j577n65J875L53j429K77J722p37j571J471
1238E64J513j859j053K214K70k093o5K014j015j684J571Q77j681r39J670K84j971
1255a383O5J850m46j695R83J098o63p10Q98P98r91k87J385J22j504O31J453o21
$$ y = [1886, 1106, -640, 826, 1496, -260, -305, 2108, 1343, -1525, 175, 2465, 172, -1915, 198, 1181, -1089, -1580, 936, -40, -2015, -206, 1381, -1099, -2624, 287, 1397, -1489, -1161, 1038, 749, -907, -436, 920, 380, -622, 765, 2019, -206, -581, 1332, 1814, -802, -1281, 1510, 1505, -1290, -796, 1012, -92, -1931, -138, 905, -1381, -1638, 847, 475, -2208, -1270, 1322, 331, -1700, -172, 1719, -406, -831, 982, 1028, -557, -43, 1792, 784, -759, 731, 1724, -160, -972, 548, 1051, -903, -765, 620, -43, -1398, -843, 465, -645, -1791, -224, 745, -832, -1397, 478, 831, -598, -321, 1401, 664, -907, 564, 2077, 218, -835, 1379, 1649, -444, -509, 1505, 490, -1194, 377, 1254, -427, -1366, 304, 588, -1383, -1318, 532, 86, -1609, -626, 472, -191, -901, -3, 795, -196, -483, 902, 1024, -480, 151, 1604, 983]
1273I83j288R54R01j484n25J117L11j689q2J374l40j528P46Q70j049q12J583L23
1291C65j486j83J761l87j213Q25J355n80j104J004J188j600n60J452L61j489J5
1308b76J479q13r55P92Q17j226o77J090L28j360k14J148k46j271O84R63m99n94
1326h30Q93L02p11k65J168j71r10N72J035m75m61M19P24j201k71J197m61r66K29
1345a83P85m52r73O67L62p92l13P96R6q49k14J010J44o47K69Q07j37o04N48M66
1365G86o80j16P48O3p96K33Q18m20n79J81L47o42l09N10J62j009L84M70l85o67
1385i01N51M10k55p30P42L05m97p3O09L1n26M55N13j63l90K46O62j28p50L60k62
1406B09L3j73K61k38m8K8r0k72l65NL67n13J82K60o9p7K91J48m87K54Q04q3n78
$$ y = [983, -305, 649, 1550, 66, -459, 658, 969, -720, -802, 572, 232, -1296, -550, 320, -729, -1541, 42, 365, -1121, -1304, 457, 70, -1143, -318, 1037, 457, -647, 357, 1545, -55, -615, 837, 1198, -291, -276, 1203, 390, -565, 227, 1044, -182, -859, 231, 559, -801, -1015, 133, -113, -1384, -700, 263, -236, -830, 63, 365, -346, -611, 557, 386, -524, 48, 1083, 608, 147, 566, 1290, 89, -182, 1015, 554, -412, -183, 602, 150, -823, -156, 206, -586, -899, -103, -7, -856, -1070, -60, 84, -563, -294, 513, 376, -228, 320, 786, 106, -10, 738, 801, 5, 238, 1056, 636, 57, 238, 585, -57, -366, 144, 306, -703, -319, 151, -234, -901, -350, 60, -195, -925, -183, 122, -375, -448, 161, 192, -334, 121, 634, 471, 81, 327, 989, 861, 111, 471, 209, 242, 69, 330, 92, 44, 72, -18, -290, -655, -650, -283, -796, -614, -354, -423, -500, -209, -61, -548, -294, 510, 427, -151]
1429a51l9N75K49n95J20O75m45l94N06J80r82j01P37K06p61l05K46K89l15m47
1449g52K39L61Kl95Q3M34n86L4N78N67p04l0Q49J45r41l2R79J11n65l6o7J36K6
1472D36l75j32K51k92k10m0Q67q34m99J96Q35r33m18J332J35q29J3M05N3l27K39
1493a27M95P2r6l48K48O31k75q38P39O90r85m69Q67l9r21l51R54k7j045L20P16
1514B11n55o55K29O01j15N5l5J65L41m75l42L62R43n72l11J158O0j070j54O22
1534D63l5p44L38Q26m11p25k18K33j41p8p8Q4J74j98l4J66L23n95j64J054K41
1555D81p87l16J216j07p97Q8J115j32n23J60L23m43m36M58K8j74j34M6J25k36
1575d5n02j70M62L28n66M0N15j13o20K90J21m6R8L09K35k39J70L9k55j8M16O0
$$ y = [-151, -190, 385, 634, 39, 159, 834, 389, -5, 501, 681, -301, -402, 335, 541, -220, -525, -279, 10, -305, -752, -513, -152, -150, -545, -462, -28, -614, -580, -2, 565, -139, -169, 680, 825, -116, -148, 831, 942, 377, 341, 274, 410, 436, 61, -71, 180, -112, -322, -362, 505, -329, -828, -632, 203, -730, -1148, 184, 319, -510, -497, -92, -39, -366, -127, 368, 440, 344, -4, 244, 875, 600, -238, 501, 1191, 206, -263, 604, 565, -356, -707, 247, 220, -825, -505, 211, -344, -999, -770, -169, -284, -229, -264, -99, 242, -233, -575, -213, 730, 158, -153, 1005, 1065, -5, -159, 463, 428, -316, 22, 848, 437, -288, -506, -273, -414, -492, -570, -486, -312, -510, -544, -378, -55, -650, -814, 240, 481, -306, -622, 594, 487, -310, -222, 893, 761, 238, 398, 721, 278, -158, 300, 328, 154, 20, 66, 191, -45, -547, -717, -255, 73, -493, -453, 62, -51, -671, -381, -260, -306, -208, 101, 336, 97, 267, 306, 51, 33, 449, 509]
1597E09J35K8n30k52K88r8l28n2O83n1p25j81L33k90k12M88K33l39k45N17K55
1618A66n42M9L43R7J28O0m0L4Q1k11J81K00j39m66J90K53m52m85O28m0p17N47
1640a35L76n64l41L42l8l90K26L46q3p7N21J01o04K18N15k24l7M85l07l52M34
1661D12k8l14J21L85r5n35K14J11n43J1O9m61P19Qo45k3O21m21l14M09L58k05
1683a46m9Q95m67n32L73N52o11l1Q16j98m11k4R2k44J82J39k1m13P9o2j07l3P8
1706a43j8Rk49J81m47L87K81n06K78L75N2r2K05j59R7q7K03l07L57M88p28m5K39
1729C71m7l12J77JQ5p44M33L05p59j4L98m6p1RJ95l04p8J17K88k21k7M92Lr6r9
1754E6L87L1j52M8M8mj45k60j13J49k93J49n0L02m49O5Q7k49k7K70k89j77M28
$$ y = [509, 644, 672, 142, -110, 178, 80, -248, -300, 383, 332, -393, -574, -241, -531, -743, -255, -22, -361, -606, -89, 166, -376, -327, 16, 113, 241, 301, 261, 295, 376, 165, 346, 546, 407, -59, 131, 384, -68, -553, 75, 35, -682, -135, 241, -323, -664, -322, -360, -750, -524, -178, -261, -338, 183, 284, -320, -102, 413, 189, 152, 637, 330, -22, 412, 384, 70, 191, 576, 481, -54, 160, 271, -272, -261, -192, -653, 66, 74, -571, -594, 27, -394, -708, -299, 59, -146, -195, 700, 233, -299, 74, 626, 15, -16, 800, 602, 191, 167, 259, 15, 197, 336, 315, -98, -19, -81, -188, -221, -143, -161, -152, -401, -220, -667, -280, 1, -505, -227, 148, 200, 108, 313, 154, 251, 164, 367, 60, 417, 905, 177, 132, 371, 324, 12, 189, 190, 275, -469, -36, 269, -490, -504, -106, -152, -223, -214, -19, -323, -401, -284, 4, -217, -244, 248, 251, 155, 56, 443, 474, 322, 370, 418, 414, 269, 9, -104, 45, -248, -99, -149, 153, -296, -231, -144, -393, -420, -150, -439, -616, -188]
1777a88k81L19M7J74k32L47j03L9J12k6lQ4o9K35p8k43k53M02k55R3j49k77K46
1800e9l12JK16k01q8K90k90J60Q6j05K83M1m67O03j02j90J74j35L62Q5j93K83
1822D42m11L24k57J59M4J4l37K08j24k43J68k05L27k71j94K9O0M3O8j64O1J03
1844a56Q5Q5r3K57K9L0n6L7j8p6L23L0p7p1q8n9k9k40lK05l87j59K27K08o45K32
1870d09OK58k37J15K19J35k99K02k5J39m5P5L02r0q8K85k63R5Jq9l31K23o8j06
1894EP9k07p3p8O1J69j24k24j54L71J29j63j21K21K43l24K70M20l64m33L70L28
1916D01j99j6K83j7j26k77J73j45M8k11N2k09L51l55K3K95l23P8l23L35o2k99
1938e23J24L09%K1K02j55K68O0K3k01J48o5l8J90L6l70l8M30r0k87k06L55j79
$$ y = [-188, -469, -150, -103, 71, -161, 186, 83, 122, 234, 208, 205, 289, 220, 455, 377, 134, -119, 283, 28, 121, -28, -305, -59, -371, -370, -154, -355, -443, -153, -443, -283, -197, -302, -19, 22, -445, 158, 56, -134, 40, -95, 267, 352, 159, 442, 31, 355, 98, 257, 301, 315, -22, 186, 62, -181, -13, -218, 109, -162, -356, -327, -267, -224, -156, -320, -259, -156, -71, 14, -79, 178, 207, 237, 181, 218, 200, 124, 447, 477, 400, 329, 241, 182, 153, -87, -90, 115, -272, -431, -204, 4, -641, -409, -403, -145, -382, -267, -48, 87, -212, -10, -35, 104, 59, 134, 436, 346, 258, 543, 280, 375, 376, 287, -44, 179, 111, 5, 84, -123, -196, -274, -213, -44, -168, -392, -546, -175, -46, -209, -330, -109, 134, -190, 80, 500, 136, -297, 73, 401, 202, 186, 469, 452, 326, 49, 222, 77, 125, -86, -34, -243, 108, -247, -224, 71, -252, -174, -497, -162, -224, -523, -399, -90, -90, -69, 133, -22, 246, 306, 329, 128, 276, 211, 173, 363, 399, 29, -9, 421, 331, 44, -162, 193, 14]
1961A4k35k4L48k43j28J30N3K1l63K30Q4K23l14J06K48k1qr9K15j5m29N07K41
1984E41n85R6N26l63j29k09M2N18l93j21r7Q7K19m39l8O8K82l49K41N28k77l51
2006b03l5N16j10k95L15N01k58o44L38J14j37N3J22O5j5k44k00P3K19l84L7L02
2028A30k43m27L59J68o71K54M56J50n05J97L30j59k89L57O3j4J55O3k21J37J03
2049C93k18j25L59K3n31J97K96o86n29P10K7l94K20J28n9k07J06K55j7n9l26N35
2071I8J32o6k97J15N75m55k88Q19L5m03k42K54O8n54K26J37L6k47J35j16l59K32
2093a65J67m95L09J85L13q52M40L4k79M11J03j6j53N8J93k59R2P2P5J16l07J23
2115A65J60k32k51Q5P7K02m62R1J66k22l32M24K36p64K98K60J64n23P7O37j89
$$ y = [14, -221, -245, 103, -140, -268, -138, -85, -64, -427, -197, -113, 110, -204, -98, 150, 129, 121, 22, 237, 222, -207, 300, 541, -44, 52, 578, 215, 86, -123, -81, 437, 44, -77, -174, -87, 132, -307, -345, -277, 5, -344, -103, 425, 148, -203, -238, 278, 168, -127, 188, 689, 431, -213, 125, 239, 102, 155, 277, 342, 327, 83, -117, -44, 175, -209, -172, 130, -113, -540, -181, -13, -684, -430, 26, 176, -329, -132, 198, 39, -250, 107, 170, 156, 311, 374, 153, 290, 393, 175, 50, 409, 432, -99, 98, 394, -292, -821, -111, -84, -478, -258, -130, -189, -396, -290, -35, -52, -111, -437, 98, 230, 164, -133, -18, 557, 102, -186, 633, 668, 265, 23, 277, 345, -209, 17, 154, 190, -57, 78, -38, -397, -165, 2, -493, -184, 1, 314, -538, -98, -64, -343, 68, 171, 155, 2, 60, 253, -6, 86, 158, 233, 349, 42, 165, 325, 93, -158, -73, 4, 206, -256, -165, 1, -221, -553, -129, 107, -657, -359, -99, 65, -458, -381, 256, 67]
2136F7l42L24M90m92O7L23k86j80M77l9m55L42J14j94l92J7K89l58j5L59k48J0
2158a22Qj04r3J2LL21j23n9j43K49R5k15P4O07k42j54L92J81p48j47O24q5l64
2181c3K35R6l01l99O18q9l07l6K17k10oJ11n6k74M3M27l1l69M7N55j38j11L51
2204C40P5l68L5J68N0J18l48m2rJ9JM23m45k63O8j12L48l81L03L16l79k82K83
2227h2r7k28L55O6k24n8M29J9j22k38K15K56m53K96L01m28K33k46J86k51O8R2
2249H9j2k45l0J44j51j71J52L42k93j36jL74j13l29M90M1l46J97L01n2m55M78
2271B74N8j44j06o0N59m52m1K94m04J07k93L30j89m5K5J31m43L9J89L3k38K53
2293a23K01j09k57K50J66j76j15L61K1k90J23M10k65k31J37J77l08rK01J33k88
$$ y = [67, -275, 49, 539, 47, 114, 437, 151, -29, 448, 409, -46, 296, 410, 216, -176, -159, 130, -228, -243, 116, -132, -122, -114, -218, -311, -299, -296, 25, -98, -157, -300, -51, 44, -171, -97, 510, 268, 114, 506, 687, -61, -208, 416, 331, -33, 202, 298, -3, -402, 216, 127, -180, -216, 1, -209, -215, -104, -160, -434, -391, 36, 5, -364, -317, 238, 100, -11, 340, 415, 47, 82, 250, 300, 418, 70, 28, 19, 38, 39, 462, 17, -246, -178, -290, 58, -323, -20, 296, -83, -365, -82, -179, -407, -52, 14, -210, -268, 161, 180, 58, -180, 35, 291, -162, 134, 435, 7, 240, -6, 180, -71, -3, 89, 77, -168, -198, -54, -205, -376, -224, 118, -175, -311, -312, 62, -51, -380, 110, 151, -195, 2, 303, 251, -204, 274, 332, 188, 82, 22, 581, 129, 88, 382, -22, 85, -208, 122, -67, -112, -87, 44, -399, -360, -171, -138, -376, -123, 78, -31, -288, -38, 128, -48, -163, 198, 219, -71, 52, 462, 197, -34, 103, 280, -28, -37, 164, 297, 9]
2314Ij62K84j46k86M1K87k37N5K50j17l20K42j46J62N2L8R1p8QJ83J87o98J35
2337a66N25j10k66J41J7o9P0Q8k06m5j87K31J63o89K56L77Pm26O0O7j68PK47j5
2361i1j95J59J60J11J13k34K87j11J7r9mO1j8K09j68j44N7K4j98r9L61o7m40J89
2385a20j61L44l70K78Q9j48j52l2M24k14M7Q7J54l56M12k16j27J55N7j03j3p8
2407d3O6K55k29k86K26J32j02j25KJ74l23L50k47q0J48K6j75O0K38N1k82J98l6
2430bJ55k54J23L26l21O0n9K64k66J01k52J84J14n02M08p1L5l60L29n7j48k4K45
2453B8j12kJ25k92M06j84K69r4k21L13m3J8m6K68j67N9j26k54L30k86P5J00j81
2476a7J4R0J61l93Q8R7k39n4K03J02n68O89l36P3K26j74N5L3q0q4J19M5K49j75
$$ y = [9, -153, 131, -15, -301, -260, 27, -210, -155, 95, -22, -342, -100, -246, -84, -32, 6, 97, 19, 27, 210, 397, -301, -166, 359, 249, -17, 124, 141, 72, 142, 230, 24, -21, -208, 23, 186, -503, -247, 130, 137, -289, -229, -162, -330, -323, -76, -91, -286, -127, 33, 144, 257, 23, 310, 199, 216, 117, 113, 174, 156, 365, 197, 53, 110, 134, -64, -163, 198, 131, -309, -120, -281, 63, -307, -29, 60, -88, -240, -272, 152, -62, -15, 72, 226, -130, 282, 66, -61, 94, 151, 48, 35, -43, 23, 278, 49, -237, -11, 121, 19, -106, -104, 70, -253, 97, -150, -230, -82, -56, -231, -171, 67, 118, -164, 34, -2, 153, -101, 22, 348, 27, 87, 28, 292, 26, 127, -125, 59, 173, -329, 79, 8, 43, -317, 12, -45, -193, -217, 28, -84, -86, 39, -253, 153, -31, 238, 144, -77, 236, 193, 211, 165, 433, 266, 325, 199, -55, 275, -11, 64, 164, -17, -3, 87, 248, -145, -57, 40, -199, -253, -50, 52, -516, 173, -163, -90, 136, -38, 17, 50, -30, -114, 5, 50, 299, 124]
2500A24r9L42k18m2k4O1k02n4J80J71k08o8J6O1j45j26R0J17p5q8O7K63J71k23
2524I1l28L84N8k48L76k15J8j79R7K10k61p6K85J68n66J25o4j78M04k82P0K5q3
2547a69k80M20Rk71K50K8J63N8k43K31j81p7P0M35q4m31L09j8r9J16j45j58K00
2570A33j72o1J1K82j2l07k41M36j47j94L9J74l40K71m9o4N6N6L5k31J20K68j60
2593i7K06M79l01j81K24j79r2J16q2j24j68L30N6m26J39J13k32M2K32n4j89j0
2615a98L02k87R2K8j29M0M72k15k24J24m7l2J57J75Kj85m3R0j45NJ69k26N9J16
2639A00j37l33J09K27j94N0J34Q1k17N8J70k12K01O1k00N1J11J32j09R5j50l6
2661hK36j29q4J17J5j17j60K10l16K37l62M93K7o56J63K92P7n6j85K12j84J36
$$ y = [124, 25, 367, 149, 107, 83, 144, -58, -112, 68, 239, 31, -37, -21, 40, -105, -231, -141, -24, -99, -187, -120, 143, 314, 91, -237, 147, 205, -43, 333, 118, 136, -43, 54, 264, 3, -73, 212, 380, -186, -61, -125, -303, 101, -181, -111, -86, -169, -449, -29, -20, -291, -41, -13, 150, 208, -35, 196, 15, -62, 8, 443, 359, -72, 237, 219, 120, 236, 91, -67, 133, -39, -100, -89, 193, 181, -126, -367, 69, -78, -272, -233, -59, -399, -128, -177, -241, -185, -129, -94, -325, -205, 63, -97, 109, 588, 287, 106, 330, 151, 59, 175, 93, -31, -199, 131, 187, -239, -100, 13, -219, -177, 55, 1, -188, -198, 104, -183, -91, -63, -192, -152, 320, 105, -119, 5, -42, -74, 83, 258, 260, 75, 32, 122, -23, -18, 151, -75, -16, 100, -37, -370, -261, -34, -228, -178, -44, 37, -180, -122, 48, -164, 37, 98, -102, -51, 60, 192, 83, 178, 28, -8, 228, 99, 15, 132, 147, 30, -130, 80, -236, 1, -361, 132, 159, -497, -334, -42, 35, -21, -206, 6, -178, -42]
2683d2k23K83j47J45%p3J84K1J88q5j96J40q1n2m6J95j15j93K9L3k45J6J54j22
2707b32K09m2m2k24J65l6L36n2k35J67k6k0j34N07l30L39k87K61k12j06K18k84
2729f0K47q6Qr3j25N7J19j00j24J83l45M05j04J22k25N9k43L19o6k22J92O1J35
2752A14J2n%M8L7q7Mn6L9j62L66k11j11J17P9l79P6J7j73J70q9l2J02N1k9m4p2
2779b18J21J62k17n3L07j63J48O4J46j57j26J95j50k2M5L13k45r1j02J56K6k85
2801a46K22o3qJ01j62j07J80j04J8j10j0O8K21j84k0Q1J95k33K36k69M55m2l47
2824b8j7J40Q4q4L6p8j39J02O1j48J41j01j69J43K0J40j97J10J30l49R8j82K13
2847g4J52J93l15K58l2k06K43L4k85P3j59M28l33J06K22k44k19J96k80K21r1M8
$$ y = [-42, -265, 18, -129, 16, 16, -57, 127, 148, 336, 251, 55, 195, 114, 62, 16, 211, 96, -97, -68, -35, -280, -264, -110, -232, -23, -65, -107, -331, -166, -202, 134, 82, -153, 14, -12, -32, -166, 341, 11, 350, 63, 324, 112, 6, 224, -60, 187, 101, 109, 16, -109, -52, 67, -33, -157, 26, -319, 86, -18, 104, -121, -62, -305, 14, -52, -274, -82, -21, 114, 126, 121, 121, 169, 206, 119, 123, 67, 106, -56, 310, 99, -12, 105, 184, -195, -119, -102, -275, -105, -194, -226, -124, -73, -102, -146, -218, -97, 65, -152, -205, 102, -61, 87, 151, 297, 140, 14, 209, 59, 37, 82, 395, 150, 59, -43, 113, 139, -146, 76, 13, 5, 106, -56, -163, 17, -87, -69, -179, -189, -121, 100, -84, -104, -23, 172, -61, 175, -94, 361, 319, -28, -45, 95, 179, 95, 131, 53, -86, 16, 77, -71, 70, -31, -200, -57, -37, 103, -94, 16, 146, -203, -105, -287, -74, 78, 271, -44, 214, 182, -24, 219, 253, -32, 41, -118, 310, -23, 83, 305, 61, -158, 38, -242, -21, -112, -64]
2869f4P9k65J79R3j92L3N3r8R1j44K60O3j60R7J44r3J13j61K69l74J39K0J14k79
2893h3K1J88l41K54q4J82j44mq1J08p0j91J07J28J9J15r2L8K5j60J11j11J74J86
2917B95k21k08K80j09K0l6J41j97J76N9n5k44k07L02J22P8m53J35J77n9l34J58
2939a80j7L10K1q0J34m78K31J35J3J3k08L87R9j82m9j74q0K85j30J51k48j57N08
2962C04l36R4n3J17k73o0Q5k25K54m9K47j22r9P7nN3kn1J54J18N7l8J08k85K64
2987C34k45j33K42k80J75J63n47J95K73l5j80M4o2r2p4K00Qk0k13M84l75J48r9
3010h9J13J09L9j55m1J60J77j36j59J27k54K10k59M11l33J6K49l14j70P7J69j31
3032a84J13M0K54m80K87N4m7Q7j91m5O0J90l5J37k97J38j05J92p5N8k69l7L14
$$ y = [-64, 15, -250, -71, 22, -170, -137, -84, -182, -91, -235, 25, 88, -72, 25, 169, 76, 189, 28, 297, -77, 62, 82, 196, -83, -62, 126, -215, 39, -45, 137, -7, -11, -92, 16, -54, -245, -138, -10, 9, 124, 32, 70, 95, -65, 46, -65, 109, 295, 74, -134, 146, 37, 57, 21, 162, -35, 141, 200, 145, -99, -306, -4, 118, 196, -257, -122, 55, -4, -338, -180, -197, 113, 134, 54, 188, -290, -59, 76, 89, 102, -106, 281, 380, 198, 149, -25, -105, 180, 50, 201, -47, -204, 304, -32, 62, 9, 126, -147, -207, -122, -347, -93, -142, 105, -17, -116, -39, -44, 9, 7, -44, 110, 228, 285, 247, 355, 70, 334, 89, -44, 198, -82, 93, 256, -291, -96, 177, 142, -38, 6, -56, -148, -222, -22, -14, -34, -247, 237, -138, 10, -89, 24, 133, 172, 17, -24, 136, 313, 177, 18, 145, -109, 101, -158, 253, -80, -64, 185, -129, -299, -222, -53, -184, -71, -31, 223, -257, 30, 84, 37, 124, -67, -112, -52, 138, 103, 240, -57, 81, -24, 168, 93, 151, -118, -155, 159]
3055A59l07K01j8l17N09l95J82j04j03J88j81L11K7j75j31M7MM7j81L94J32k20
3077F9j9N8J21k05M39o21K98j12P8j11J8j24Qk0J64J56l42K7J7j28n9KQ4J52J78
3102A28k08J28k19J06k58J57K10q5J74j90K01j24p1K45P7n37K84K14k94q2J51
3123Gm9j13M4L07j50j58j73J33k38L17n2p9J22J93j86L3M76m29P3l53K71Q3R3
3146A72N1j21n1J87l8j07m27M17j92K43m06K52l08J91m4k08K80P8L5O9m5j25j4
3169a11j73M34j58j46K7J95L3k7k00r4L99j79J62L1m3n0O1r3m9J03k90M4J30K9
3193C5k6j66J66k24L10j14j00M5j37K13r6J44L4m5r8L3J45J0j70L27k66J34j21
3216C3j0J05N6m03K02L6N3J25k53n9j49K07o0PL23m68L59K2K7r6L6n9Nj9P0K7
$$ y = [159, -148, 53, 35, -282, 227, -168, 14, -90, -193, -5, -186, 125, 152, -23, -154, -107, -103, -56, -237, 157, 289, 69, 50, 108, 229, 24, 463, -158, 140, 28, 106, -5, 13, -111, -103, -123, 41, 197, -145, -118, -101, -229, -288, -286, -202, -50, 128, -80, 48, -171, -65, -323, -166, 44, -41, 133, -57, 144, 20, -51, 194, 271, -266, 18, 232, -62, -144, 7, -42, -155, -111, 196, 46, -112, -285, -152, -390, -73, -125, -204, -82, 111, -75, -42, 434, 5, 78, -275, -4, 79, 172, 223, 102, 51, 238, 200, 93, -334, 83, -109, 134, -272, -20, -328, -137, -181, -389, -109, -31, 4, 73, 28, -97, -111, -284, 150, -8, -154, -127, 68, 101, 74, -126, -220, 179, 0, 162, 193, 150, 100, 161, 68, 19, 122, -168, -124, 6, 35, 9, -157, 9, -215, 95, -19, -119, -74, -211, 2, -94, 50, 84, 39, -59, -26, 119, 129, -41, 286, 20, 154, 33, 23, 128, 184, -219, -17, 19, 72, 197, -56, -115, -264, -57, -117, -110, 213, -255, 104, 126, 153, 57, 93, 34, 39, 20, 90, 117]
3242A17n2J44k60j6J25p2j52L70l15J36j52J15o7j86N13n07K40k40J22J82j79
3263a34q9K9K74k67R5O5n6J28k6K4M4L25k70N4M4k98J70J14l94J62l9M0L5j29
3287i9j11L99l49J79m1k87N05k45L1k90L85lp0L1J30J0kj72m8P1j81M6J27O1R1
3312A68N7q0j45Mj11K0j9pl85N84m8k57K0J17j71O5K39l51M93k17Q7j55L09j65
3336E2N7j95J08l8J67l3k48J22J92j51j6J10p9l0j03M9J95j00j35k4j8lp2K85
3360I2l28J53J04Qk3J33o4m0O1O5p1k27L98o7k14O0j69J09R1k9j09L9Q3k63L76
3385A68l8j82j07J38o3L9J25m0j99L50k60L35l89L13l1lk57L9O4L11m55j49L27
3408C6m4j89L66j37j4m8K77k0k11K9rj15K0j7J00m4k51K24k07r1O39n15J96n1
$$ y = [117, 65, 209, -51, -67, 58, -14, -166, 204, -111, 25, -127, -12, -79, -265, 248, -259, -19, -259, -137, 45, -134, -223, -194, 80, -187, -92, -27, -83, 45, 19, 43, 87, 412, 142, 196, 240, -58, 112, 226, -168, -6, -45, -5, 30, -99, -210, 189, -160, 19, -22, -309, 196, -49, -18, -308, 77, 74, 4, 35, 165, 175, 173, 1, -47, 24, -157, -111, 16, 77, 168, 225, 145, 0, 4, -107, -87, -106, -113, -498, 86, 38, -219, -199, -82, -253, -188, 51, -300, 193, -24, 63, -92, 217, 52, 109, -86, 22, -16, 151, 118, -130, -8, 184, 33, 17, 127, 48, 18, -85, -36, 159, 59, -76, -100, -118, -121, -193, 92, -236, -83, 21, 29, 6, 139, 75, 35, 96, 161, 90, -137, 261, 194, -20, 40, -129, -20, 71, 42, -67, -28, 55, -208, 168, 130, -52, -159, -21, -84, -45, 80, 40, -159, 191, -69, 266, -123, 190, 159, 156, -101, -62, 2, 313, -142, -291, 36, -8, -197, 169, 32, 18, -30, 247, 227, 16, 45, 36, -79, -59, -76, 24, -20, -271, -47, -254, -345, 294, -221, -25, -76]
3432g6J28r2k4M4J54Q3k05n3K3o9L41l24J80J03k77M7k6n7p1j8P2p1J95j38R5
3457c6N9k57K09M4j53K93j40J36J7N6j57J56j83J19j62L07l44J02q3N9J81j77
3479D6K8l97J76K31k55J69j05m1J54l78M63J01k17mQ6l0o6O6J12m01K34q4m3K38
3503H3K15m20K32m0L8J55k23j17j95K98J2J00n1o7J02k25r7K29j01J20L7j93P1
3526c7l55L55Q4r4J54k20pNJ83M9j6Kp5Q8l44K77r1j40J56j50J99r7J67k01J29
3551B1o1m0k72K89J31j37Q3J31j26K14n20K38j17m2J16K0m1K15J43k04j46L9K57
3574A91k48J36K59o60M34j35k38M57m30J5J29m0J25R9j5m7Q9J5k92K72m7M8j85
3597f8o5K79J82k61l0R6Rk65j17L42j65j62L41J05m06L0K17k08O7k30J83K27J66
$$ y = [-76, 52, -40, -64, -20, 134, 217, 12, -41, -18, -87, 254, -70, 110, 213, -64, -17, -43, -100, -171, -189, -117, -188, 7, -131, -36, 23, -234, -25, 19, -134, 159, 19, 155, 172, 228, 71, 227, 44, 163, 1, 308, -36, 66, -17, 42, 223, 46, 74, -323, -147, 84, -171, -2, -107, -148, 6, -372, 91, 192, -25, -29, 57, 27, -39, 27, 139, -262, -28, -112, -155, 83, 298, -122, 110, 70, 108, 263, 40, -77, -272, 26, 38, 138, 87, 20, 122, -103, -200, 29, -72, 48, 85, -108, -37, -392, -37, 47, -47, 107, -113, -120, -115, 68, 117, 101, 103, 28, 116, -228, 49, -42, -182, -26, -176, 23, -74, 93, -108, 21, -40, -80, -352, -63, 68, -69, 14, 145, 19, 233, -287, -49, -166, -208, -92, -72, -113, 102, 245, 41, -105, -66, 191, -57, 79, 338, -322, 112, -23, -261, 196, -234, -219, -90, -130, -5, 94, 79, 32, 121, 136, -156, 116, 69, 117, -68, -133, 146, 328, 67, 37, 133, 142, -123, -240, 102, -63, -225, 116, 221, -185, -155, 62, -146, -79, -309, -126, 101, 267]
3620B67j86N0l55K10k0Q5N3K30l92o9K50M7j54l20L37j03p0K7M3J99j34N7j63
3643a11j04K8O6J21K30m1r4l3p9m7j05K54K3k10J86r5J0j17n8Q5L80l0l36J9L3
3668b5J38j81q2J25PJ3J85r2k72K21L2q7p5j61L08j80K5l4J44P0j73J84n6N4j61
3693g3K13Nj7k15L39k46N8K25k39q1J53j45J05l12J89j22J93m5j11P3m7l3R8o8
$$ y = [267, 81, 131, -224, -14, -34, 51, 104, 334, -58, -127, 123, 170, 16, -304, 33, -70, -140, -113, -70, 129, -5, 52, -111, -215, -187, -121, 0, 230, 189, 95, 62, -17, -64, -169, 85, 108, -102, 84, -11, -1, -118, -176, -91, 289, 259, -77, -58, -25, 113, -68, -150, -25, -18, -5, 180, 88, -184, 37, 69, -18, -93, -254, 54, -126, -101, -135, 9, 79, -94, 90, 34, 88, -73, 140, 145, 128, -87, 252, 6, 64, 289, 50, -31, 122, -23, 82, -230, -41, -163, 30, -15, -126, -53, -100, -133, -35, -103]
$$ [...]
8191G2
##END NTUPLES=NMR FID
##END=
